
##TITLE=AC1139_castillo_5906744_Dp2oC3caZU
##JCAMPDX= 6.0         $$ Bruker NMR JCAMP-DX V2.0
##DATA TYPE= NMR SPECTRUM
##DATA CLASS= NTUPLES
##ORIGIN= BRUKER
##OWNER= Administrator
$$ 1.72 TOPSPIN		Version 2.1
$$ 2012-04-10 10:14:09.578 -0500  Administrator@TOPSPIN
$$ Compression mode = diff/dup
##.OBSERVE FREQUENCY= 400.13188235
##.OBSERVE NUCLEUS= ^1H
##.ACQUISITION MODE= SIMULTANEOUS (DQD)
##.ACQUISITION SCHEME= undefined
##.AVERAGES= 64
##.DIGITISER RES= 22
##SPECTROMETER/DATA SYSTEM= spect
##.PULSE SEQUENCE= noesygpps1d.comp
##.SOLVENT NAME= COFFEE_meoh
##.SHIFT REFERENCE= INTERNAL, COFFEE_meoh, 1, 14.96829
##AUDIT TRAIL= $$ (NUMBER, WHEN, WHO, WHERE, PROCESS, VERSION, WHAT)
$$ ##TITLE= Audit trail, TOPSPIN		Version 2.1
$$ ##JCAMPDX= 5.01
$$ ##ORIGIN= Bruker BioSpin GmbH
$$ ##OWNER= Administrator
$$ $$ C:\Bruker\TOPSPIN/data/COFFEE/nmr/AC1139_castillo_5906744_Dp2oC3caZU/12/pdata/1/auditp.txt
$$ ##AUDIT TRAIL=  $$ (NUMBER, WHEN, WHO, WHERE, PROCESS, VERSION, WHAT)
(   1,<2012-04-04 16:38:48.750 -0500>,<Administrator>,<TOPSPIN>,<go>,<TOPSPIN 2.1>,
      <created by zg
	started at 2012-04-04 16:27:17.265 -0500,
	POWCHK enabled, PULCHK disabled,
       configuration hash MD5:
       1A 1E CE 29 27 FD 77 03 67 4E F0 E3 C4 B2 CB 90
       data hash MD5: 64K
       6E 6D 25 43 11 25 81 93 AA CA 16 DB C7 8E 1D 30>)
(   2,<2012-04-04 16:38:51.562 -0500>,<Administrator>,<TOPSPIN>,<proc1d>,<TOPSPIN 2.1>,
      <Start of raw data processing
       efp LB = 0.3 FT_mod = 6 PKNL = 1 PHC0 = 0 PHC1 = 0 SI = 128K 
       data hash MD5: 128K
       B5 1E C2 62 4E FA E9 17 51 BA AA BD 1B 20 69 D7>)
(   3,<2012-04-04 16:38:52.812 -0500>,<Administrator>,<TOPSPIN>,<proc1d>,<TOPSPIN 2.1>,
      <pk PHC0 = 37.57874 PHC1 = 0 
       data hash MD5: 128K
       52 AC C7 7E 94 B3 9D 71 A5 96 DC 28 62 7D 80 13>)
(   4,<2012-04-04 16:38:53.250 -0500>,<Administrator>,<TOPSPIN>,<proc1d>,<TOPSPIN 2.1>,
      <abs ABSG = 1 
       data hash MD5: 128K
       18 46 16 71 46 64 4D AF EC 77 7E 01 10 C4 71 71>)
(   5,<2012-04-04 16:38:53.328 -0500>,<Administrator>,<TOPSPIN>,<proc1d>,<TOPSPIN 2.1>,
      <abs ABSG = 2 
       data hash MD5: 128K
       DB DB 4F 62 C6 94 34 F1 1B 55 AE 94 40 E3 43 9F>)
(   6,<2012-04-04 16:38:53.375 -0500>,<Administrator>,<TOPSPIN>,<proc1d>,<TOPSPIN 2.1>,
      <abs ABSG = 3 
       data hash MD5: 128K
       38 E1 EC 5D 56 99 08 7C 55 AD 44 06 AB 9D 86 A2>)
(   7,<2012-04-04 16:38:53.421 -0500>,<Administrator>,<TOPSPIN>,<proc1d>,<TOPSPIN 2.1>,
      <abs ABSG = 4 
       data hash MD5: 128K
       00 3E A5 B2 E3 AB A4 1B BB B8 95 AA 15 BE 15 9F>)
(   8,<2012-04-04 16:38:53.468 -0500>,<Administrator>,<TOPSPIN>,<proc1d>,<TOPSPIN 2.1>,
      <abs ABSG = 5 
       data hash MD5: 128K
       8D 40 D2 B3 73 8B A6 EB 6D 5D 1D 1C 62 ED 4E 0F>)
(   9,<2012-04-04 16:38:53.703 -0500>,<Administrator>,<TOPSPIN>,<audit>,<TOPSPIN 2.1>,
      <user comment:
       ICON-NMR User ID: COFFEE
       data hash MD5: 128K
$$ [...]
##$TP07= 0
##$TPNAME0= <>
##$TPNAME1= <>
##$TPNAME2= <>
##$TPNAME3= <>
##$TPNAME4= <>
##$TPNAME5= <>
##$TPNAME6= <>
##$TPNAME7= <>
##$TPOAL= (0..7)
0.5 0.5 0.5 0.5 0.5 0.5 0.5 0.5
##$TPOFFS= (0..7)
0 0 0 0 0 0 0 0
##$TUNHIN= 0
##$TUNHOUT= 0
##$TUNXOUT= 0
##$USERA1= <user>
##$USERA2= <user>
##$USERA3= <user>
##$USERA4= <user>
##$USERA5= <user>
##$V9= 5
##$VALIST= <valist>
##$VCLIST= <CCCCCCCCCCCCCCC>
##$VD= 0
##$VDLIST= <DDDDDDDDDDDDDDD>
##$VPLIST= <PPPPPPPPPPPPPPP>
##$VTLIST= <TTTTTTTTTTTTTTT>
##$WBST= 2048
##$WBSW= 25
##$XGAIN= (0..3)
0 0 0 0
##$XL= 0
##$YL= 0
##$YMAX_a= 12802664
##$YMIN_a= -5717192
##$ZGOPTNS= <>
##$ZL1= 120
##$ZL2= 120
##$ZL3= 120
##$ZL4= 120
##$ABSF1= 14.96829
##$ABSF2= -5.58424
##$ABSG= 5
##$ABSL= 3
##$ALPHA= 0
##$AQORDER= 0
##$ASSFAC= 0
##$ASSFACI= 0
##$ASSFACX= 0
##$ASSWID= 0
##$AUNMP= <proc_prof1d_extract.lims>
##$AXLEFT= 0
##$AXNAME= <>
##$AXNUC= <1H>
##$AXRIGHT= 0
##$AXTYPE= 0
##$AXUNIT= <>
##$AZFE= 0.1
##$AZFW= 0.1
##$BCFW= 0
##$BC_mod= 0
##$BYTORDP= 0
##$COROFFS= 0
##$CY= 15
##$DATMOD= 1
##$DC= 0
##$DFILT= <>
##$DTYPP= 0
##$F1P= 0
##$F2P= 0
##$FCOR= 0.5
##$FTSIZE= 131072
##$FT_mod= 6
##$GAMMA= 0
##$GB= 0
##$INTBC= 1
##$INTSCL= 1
##$ISEN= 128
##$LB= 0.3
##$LEV0= 0
##$LPBIN= 0
##$MAXI= 10000
##$MC2= 0
##$MEAN= 0
##$ME_mod= 0
##$MI= 0
##$NCOEF= 0
##$NC_proc= -3
##$NLEV= 6
##$NOISF1= 0
##$NOISF2= 0
##$NSP= 0
##$NTH_PI= 0
##$NZP= 0
##$OFFSET= 14.96829
##$PC= 1
##$PHC0= 37.57874
##$PHC1= 0
##$PH_mod= 1
##$PKNL= yes
##$PPARMOD= 0
##$PPDIAG= 0
##$PPIPTYP= 0
##$PPMPNUM= 2147483647
##$PPRESOL= 1
##$PSCAL= 4
##$PSIGN= 0
##$PYNMP= <proc.py>
##$REVERSE= no
##$SF= 400.130004930738
##$SI= 131072
##$SIGF1= 0
##$SIGF2= 0
##$SINO= 400
##$SIOLD= 131072
##$SPECTYP= <>
##$SREGLST= <1H.CDCl3>
##$SSB= 0
##$STSI= 131072
##$STSR= 0
##$SW_p= 8223.68421052632
##$SYMM= 0
##$S_DEV= 0
##$TDeff= 65536
##$TDoff= 0
##$TI= <>
##$TILT= no
##$TM1= 0
##$TM2= 0
##$TOPLEV= 0
##$USERP1= <user>
##$USERP2= <user>
##$USERP3= <user>
##$USERP4= <user>
##$USERP5= <user>
##$WDW= 1
##$XDIM= 131072
##$YMAX_p= 486599927
##$YMIN_p= -314118469
##$CURPLOT= <Network HP LaserJet P1505>
##$CURPRIN= <$Network HP LaserJet P1505>
##$DFORMAT= <normdp>
##$LAYOUT= <+/1D_H.xwp>
##$LFORMAT= <normlp>
##$PFORMAT= <normpl>
##$SURQMSG= 1
$$ End of Bruker specific parameters
$$ ---------------------------------
##NTUPLES= NMR SPECTRUM
##VAR_NAME=  FREQUENCY,     SPECTRUM/REAL,   SPECTRUM/IMAG
##SYMBOL=    X,             R,               I
##VAR_TYPE=  INDEPENDENT,   DEPENDENT,       DEPENDENT
##VAR_FORM=  AFFN,          ASDF,            ASDF
##VAR_DIM=   131072,        131072,          131072
##UNITS=     HZ,            ARBITRARY UNITS, ARBITRARY UNITS
##FACTOR=    0.0627417313425165, 1,          1
##FIRST=     8223.62146879498, 222,          -92727
##LAST=      0,             3375,            -93862
##MIN=       0,             -314118469,      0
##MAX=       8223.62146879498, 486599927,    0
$$ Real data points
##PAGE= N=1
##DATA TABLE= (X++(R..R)), XYDATA
$$ [...]
$$ plain form
62953 3232697 3130075 3030183 2935529 2847917 2768365 2696774 2632364 2574591 2523328 2478608 2440945
62942 2440945 2411593 2391453 2379586 2373603 2371691 2373598 2379601 2389421 2402537 2418721 2437599 2458159
62930 2458159 2479313 2500737 2522683 2545162 2567660 2589473 2609902 2628113 2642952 2652871 2656088 2651290
62918 2651290 2638427 2618486 2591983 2557789 2513920 2459739 2397218 2329877 2260474 2189695 2116914
62907 2116914 2041984 1966142 1891326 1818986 1749706 1683704 1621271 1562717 1508214 1457847 1411715
62896 1411715 1369787 1331525 1295811 1261668 1229373 1200407 1175479 1152725 1128946 1103139 1077809
62885 1077809 1056045 1038165 1022256 1007197 993511 981432 969871 957744 945099 932431 920007
62874 920007 908376 898357 889752 881120 871664 862302 853806 844935 834014 821804 811068 803335 797612
$$ packed form
62953C232697j02622r9892r4654q7612p9552p1591o4410n7773n1263m4720l7663
62942B440945k9352k0140j1867n983j912J907O003R820J3116J6184J8878K0560
62930B458159K1154K1424K1946K2479K2498K1813K0429J8211J4839R919L217m798
62918B651290j2863j9941k6503l4194m3869n4181o2521o7341o9403p0779p2781
62907B116914p4930p5842p4816p2340o9280o6002o2433n8554n4503n0367m6132
62896A411715m1928l8262l5714l4143l2295k8966k4928k2754k3779k5807k5330
62885A077809k1764j7880j5909j5059j3686j2079j1561j2127j2645j2668j2424
62874I20007j1631j0019q605q632r456r362q496q871j0921j2210j0736p733n723
$$ plain form
62861 797612 792484 787801 783620 779026 773366 767945 765037 765168 766247 765614 762450 758167 755006 754458 756556
62846 756556 760208 764059 767210 769337 770457 770712 770248 769205 767921 767062 767125 767632 767287 765514 763552 763391
62830 763391 765620 768947 771863 774006 775606 776404 775897 774197 771767 768584 764460 760119 756876 754933 752927
62815 752927 749790 746277 743785 742203 740029 736571 733027 731062 730913 731204 730212 727012 721803 715580 709506
62800 709506 704456 700993 699360 699138 699223 698728 697836 697207 696667 695261 692596 689209 685351 680502 674826 670126
62784 670126 668172 668466 668845 668218 667610 668283 669877 670995 670953 670345 670214 671203 673304 675922 678216 679660 680302
62767 680302 680413 680112 679498 678899 678644 678766 679319 680876 684270 689732 696565 703768 710780 717598 724537 732047
62751 732047 740402 749285 757920 765947 774008 783136 793771 805820 819416 834830 851503 868031 883673
$$ packed form
62861G97612n128m683m181m594n660n421k908J31J079o33l164m283l161n48K098
62846G56556L652L851L151K127J120K55m64j043j284q59O3N07l45j773j962j61
62830G63391K229L327K916K143J600P98n07j700k430l183m124m341l243j943k006
62815G52927l137l513k492j582k174l458l544j965j49K91r92l200n209o223o074
62800G09506n050l463j633k22Q5m95q92o29n40j406k665l387l858m849n676m700
62784F70126j954K94L79o27o08O73J594J118m2o08j31R89K101K618K294J444O42
62767F80302J11l01o14n99k55J22N53J557L394N462O833P203P012O818O939P510
62751G32047Q355Q883Q635Q027Q061R128J0635J2049J3596J5414J6673J6528J5642
$$ plain form
62738 883673 899446 917138 937586 960462 985454 1012845 1042939 1075625 1110709 1148237 1188372
62727 1188372 1231330 1277539 1327464 1381227 1438839 1500778 1567819 1640304 1718201 1801956 1892438
62716 1892438 1989776 2093050 2201591 2315653 2435034 2557789 2681350 2804451 2926803 3046996
62706 3046996 3161735 3267189 3360181 3438041 3498330 3539191 3559480 3558489 3536330 3494674 3436131
62695 3436131 3362389 3273758 3171078 3057337 2936726 2812681 2687547 2563420 2442099 2324270
62685 2324270 2209725 2098678 1992368 1892298 1799312 1713327 1633410 1558196 1486931 1420346
62675 1420346 1359985 1306472 1258853 1215747 1176548 1141215 1109400 1080329 1053378 1028440 1005776
62664 1005776 985741 968594 954477 943557 935834 930431 925438 919397 913216 909751 910939 915901 922340
$$ packed form
62738H83673J5773J7692K0448K2876K4992K7391L0094L2686L5084L7528M0135
62727A188372M2958M6209M9925N3763N7612O1939O7041P2485P7897Q3755R0482
62716A892438R7338J03274J08541J14062J19381J22755J23561J23101J22352J20193
62706C046996J14739J05454R2992P7860O0289M0861K0289r91k2159m1656n8543
62695C436131p3742q8631j02680j13741j20611j24045j25134j24127j21321j17829
62685B324270j14545j11047j06310j00070r2986q5985p9917p5214p1265o6585
62675A420346o0361n3513m7619m3106l9199l5333l1815k9071k6951k4938k2664
62664A005776k0035j7147j4117j0920p723n403m993o041o181l465J188M962O439
$$ plain form
62651 922340 929134 936727 945613 955619 966769 979866 995954 1015681 1039288 1066630 1097233 1130938
62639 1130938 1168500 1210793 1257337 1306444 1357176 1410413 1467644 1529434 1595453 1665084 1737111
62628 1737111 1809311 1879320 1945714 2007686 2064008 2113118 2153961 2185837 2207383 2216589 2212157 2194415
62616 2194415 2164803 2124982 2076548 2020933 1959128 1891792 1819932 1745329 1670110 1596052 1524369
62605 1524369 1455840 1390840 1329302 1270820 1214899 1161252 1110033 1061863 1017590 977951 943212
62594 943212 912804 885333 859440 834822 812047 791299 771971 753742 737124 722234 707821
62583 707821 692714 677815 665279 655715 647418 638616 629252 620052 611039 601845 592719 584297 576850
62570 576850 570596 566260 564387 564212 564134 563508 563263 564492 566889 568999 569788 569694 570173 572427 576610 582098
$$ packed form
62651I22340O794P593Q886J0006J1150J3097J6088J9727K3607K7342L0603L3705
62639A130938L7562M2293M6544M9107N0732N3237N7231O1790O6019O9631P2027
62628A737111P2200P0009O6394O1972N6322M9110M0843L1876K1546R206m432j7742
62616B194415k9612l9821m8434n5615o1805o7336p1860p4603p5219p4058p1683
62605A524369o8529o5000o1538n8482n5921n3647n1219m8170m4273l9639l4739
62594I43212l0408k7471k5893k4618k2775k0748j9328j8229j6618j4890j4413
62583G07821j5107j4899j2536r564q297q802r364r200r013r194r126q422p447
62570E76850o254m336j873j75p8o26k45J229K397K110P89r4M79K254M183N488
$$ plain form
62554 582098 588259 594899 602205 610521 620159 631247 643759 657701 673074 689565 706638 724243
62542 724243 743125 764013 786825 811187 837425 866396 898471 933393 971132 1012178 1056970
62531 1056970 1105663 1158492 1215637 1276579 1340177 1405461 1471713 1537735 1601682 1661673 1715897
62520 1715897 1762290 1799061 1825644 1842179 1848040 1842071 1824519 1797417 1762568 1720414 1671588 1618184
62508 1618184 1562402 1504786 1444968 1383534 1322264 1263111 1207683 1157055 1111149 1068843 1029347
62497 1029347 992840 959311 927825 897780 869753 844154 820226 797624 777701 761531 747671
62486 747671 733737 719398 705789 692635 678385 663178 649386 638853 631479 626790 624750 624349
62474 624349 623438 621103 618739 617873 618302 619335 621495 625731 631912 639204 647191 655770 664838 675050 688022
$$ packed form
62554E82098O161O640P306Q316R638J1088J2512J3942J5373J6491J7073J7605
62542G24243J8882K0888K2812K4362K6238K8971L2075L4922L7739M1046M4792
62531A056970M8693N2829N7145O0942O3598O5284O6252O6022O3947N9991N4224
62520A715897M6393L6771K6583J6535N861n969j7552k7102l4849m2154m8826n3404
62508A618184n5782n7616n9818o1434o1270n9153n5428n0628m5906m2306l9496
62497A029347l6507l3529l1486l0045k8027k5599k3928k2602j9923j6170j3860
62486G47671j3934j4339j3609j3154j4250j5207j3792j0533p374m689k040m01
62474F24349r11k335k364q66M29J033K160M236O181P292P987Q579R068J0212J2972
$$ plain form
62459 688022 704600 723353 741733 758521 774601 791916 812335 836966 865647 897136 930198
62448 930198 964338 999474 1035564 1072745 1111006 1149334 1185865 1219259 1249134 1274991 1295834
62437 1295834 1311268 1321656 1326504 1324061 1313575 1296833 1276287 1252689 1225827 1196404 1165512 1133052
62425 1133052 1098577 1063324 1029633 998461 969128 941437 916264 893832 873148 853728 836376
62414 836376 821595 808591 796684 786461 778414 771372 763553 754705 746198 739291 734186 730608 728369
62401 728369 727295 727274 728527 731259 734936 738373 740817 742656 744896 748172 752496 757661 763451 769547 775657
62386 775657 781951 789026 797159 805724 813646 820257 825459 829201 831259 831475 829840 826338 821023 814037
62372 814037 805074 793183 778044 761406 746158 733656 722939 712848 703614 695492 687157 677050
$$ packed form
62459F88022J6578J8753J8380J6788J6080J7315K0419K4631K8681L1489L3062
62448I30198L4140L5136L6090L7181L8261L8328L6531L3394K9875K5857K0843
62437A295834J5434J0388M848k443j0486j6742k0546k3598k6862k9423l0892l2460
62425A133052l4475l5253l3691l1172k9333k7691k5173k2432k0684j9420j7352
62414H36376j4781j3004j1907j0223q047p042p819q848q507o907n105l578k239
62401G28369j074k1J253K732L677L437K444J839K240L276M324N165N790O096O110
62386G75657O294P075Q133Q565P922O611N202L742K058K16j635l502n315o986
62372H14037q963j1891j5139j6638j5248j2502j0717j0091r234q122q335j0107
$$ plain form
62360 677050 665758 655616 648030 642408 637624 633315 629555 626447 624481 624412 626331 629469 633272 637997
62346 637997 643882 650372 656719 662989 669972 678192 687258 696157 704180 711668 719750 729132 739367 749678
62332 749678 760052 770758 781052 789500 795870 801804 808978 817188 824888 831219 836787 842482 848167
62319 848167 852915 856515 860395 866631 875940 887081 898666 911130 926326 945559 968808 995720
62307 995720 1026217 1059992 1096586 1136612 1181929 1233719 1290875 1351236 1414068 1480555 1551955
62296 1551955 1628014 1707229 1787888 1868507 1947585 2023180 2092654 2152955 2201682 2238202 2263558
62285 2263558 2279143 2285573 2282932 2271658 2252581 2225984 2191232 2147907 2097113 2041095 1981544 1918993
62273 1918993 1854135 1788996 1726059 1666611 1610631 1558027 1509137 1464076 1422469 1384045 1348805
$$ packed form
62360F77050j1292j0142p586n622m784m309l760l108j966o9J919L138L803M725
62346F37997N885O490O347O270O983Q220R066Q899Q023P488Q082R382J0235J0311
62332G49678J0374J0706J0294Q448O370N934P174Q210P700O331N568N695N685
62319H48167M748L600L880O236R309J1141J1585J2464J5196J9233K3249K6912
62307I95720L0497L3775L6594M0026M5317N1790N7156O0361O2832O6487P1400
62296A551955P6059P9215Q0659Q0619P9078P5595O9474O0301M8727L6520K5356
62285B263558J5585O430k641j1274j9077k6597l4752m3325n0794n6018n9551o2551
62273A918993o4858o5139o2937n9448n5980n2604m8890m5061m1607l8424l5240
$$ plain form
62262 1348805 1316315 1285499 1255567 1226727 1199635 1174580 1151555 1130727 1112368 1096518 1083031
62251 1083031 1071732 1062225 1053765 1045714 1038097 1031546 1026783 1024243 1023943 1025371 1027447 1028789 1028304 1025830
62237 1025830 1022305 1018993 1016305 1013710 1011052 1009379 1009736 1011593 1013431 1014677 1016015 1017836 1019708 1021630
62223 1021630 1024493 1028733 1033788 1039629 1047541 1058268 1070510 1082677 1095349 1110452 1128597 1148872
62211 1148872 1170928 1195422 1222252 1250209 1278979 1309954 1344325 1381760 1422008 1466604 1517567
62200 1517567 1574841 1636276 1700004 1766058 1835801 1910379 1989488 2070926 2151444 2228554 2301299
62189 2301299 2368828 2428692 2477479 2513031 2535270 2545061 2543278 2531262 2511053 2484384 2451710 2412645
62177 2412645 2366965 2314944 2257303 2195536 2132100 2069656 2009944 1953582 1900783 1851970 1807778
$$ packed form
62262A348805l2490l0816k9932k8840k7092k5055k3025k0828j8359j5850j3487
62251A083031j1299r507q460q051p617o551m763k540l00J428K076J342m85k474
62237A025830l525l312k688k595k658j673L57J857J838J246J338J821J872J922
62223A021630K863M240N055N841P912J0727J2242J2167J2672J5103J8145K0275
62211A148872K2056K4494K6830K7957K8770L0975L4371L7435M0248M4596N0963
62200A517567N7274O1435O3728O6054O9743P4578P9109Q1438Q0518P7110P2745
62189B301299O7529N9864M8787L5552K2239R791j783j2016k0209k6669l2674l9065
62177B412645m5680n2021n7641o1767o3436o2444n9712n6362n2799m8813m4192
$$ plain form
62166 1807778 1768784 1735190 1706543 1681879 1660510 1642518 1628147 1616873 1607632 1600041 1594649 1591686
62154 1591686 1590116 1588583 1587033 1586757 1588873 1593285 1599229 1606286 1614519 1624022 1634749 1646606 1659383
62141 1659383 1672662 1686152 1700047 1714674 1729852 1745125 1760866 1778569 1799484 1823131 1847741
62130 1847741 1872179 1896961 1923358 1952049 1982847 2015182 2048430 2082036 2115668 2149057 2181550
62119 2181550 2212421 2242081 2272422 2305205 2340443 2377152 2415392 2456521 2501507 2550234 2602747
62108 2602747 2659972 2722547 2789917 2861370 2937055 3016885 3099111 3181167 3261480 3339137 3411959
62097 3411959 3476484 3530420 3574220 3609854 3638905 3662266 3680646 3694295 3702598 3704790 3701191 3693415
62085 3693415 3683572 3673619 3665154 3659124 3655515 3653657 3653115 3654235 3657882 3664851 3675522 3689830 3707271
$$ packed form
62166A807778l8994l3594k8647k4664k1369j7992j4371j1274r241p591n392k963
62154A591686j570j533j550k76K116M412N944P057Q233R503J0727J1857J2777
62141A659383J3279J3490J3895J4627J5178J5273J5741J7703K0915K3647K4610
62130A847741K4438K4782K6397K8691L0798L2335L3248L3606L3632L3389L2493
62119B181550L0871K9660L0341L2783L5238L6709L8240M1129M4986M8727N2513
62108B602747N7225O2575O7370P1453P5685P9830Q2226Q2056Q0313P7657P2822
62097C411959O4525N3936M3800L5634K9051K3361J8380J3649Q303K192l599p776
62085C693415r843r953q465o030l609j858n42J120L647O969J0671J4308J7441
$$ plain form
62072 3707271 3726844 3747285 3767679 3787978 3808768 3830533 3853393 3877480 3903050 3930005 3957976
62061 3957976 3987380 4019766 4056197 4095513 4135162 4173768 4212031 4251059 4290872 4331002 4371665
62050 4371665 4413601 4457225 4502527 4549451 4597887 4647639 4698792 4751631 4805756 4859832 4912975
62039 4912975 4966100 5021138 5079134 5139609 5201484 5263725 5325093 5384176 5440034 5492420 5541306
62028 5541306 5586849 5630050 5672816 5716729 5761809 5806571 5849053 5887741 5922071 5952582 5980514
62017 5980514 6007085 6033230 6059997 6088516 6119064 6150520 6181514 6212194 6244315 6279438 6317508
62006 6317508 6357385 6398297 6440342 6483893 6528920 6574592 6618949 6658994 6691724 6715329 6729319
61995 6729319 6733777 6729157 6716728 6698225 6674611 6645728 6611534 6572878 6530331 6482966 6429433 6370139
$$ packed form
62072C707271J9573K0441K0394K0299K0790K1765K2860K4087K5570K6955K7971
62061C957976K9404L2386L6431L9316L9649L8606L8263L9028L9813M0130M0663
62050D371665M1936M3624M5302M6924M8436M9752N1153N2839N4125N4076N3143
62039D912975N3125N5038N7996O0475O1875O2241O1368N9083N5858N2386M8886
62028E541306M5543M3201M2766M3913M5080M4762M2482L8688L4330L0511K7932
62017E980514K6571K6145K6767K8519L0548L1456L0994L0680L2121L5123L8070
62006F317508L9877M0912M2045M3551M5027M5672M4357M0045L2730K3605J3990
61995F729319M458m620j2429j8503k3614k8883l4194l8656m2547m7365n3533n9294
$$ plain form
61983 6370139 6307471 6243928 6180995 6119753 6061283 6005810 5952238 5899324 5847004 5796088 5747013
61972 5747013 5699390 5652582 5606313 5560749 5516179 5472445 5428683 5383942 5338133 5291949 5245742
61961 5245742 5199004 5151119 5102105 5052320 5001947 4951116 4900115 4849222 4798814 4749786 4703077
61950 4703077 4658269 4613529 4567742 4522137 4478855 4438246 4398578 4358241 4317304 4276848 4237679
61939 4237679 4200002 4163783 4129037 4095921 4064473 4034006 4002966 3969938 3934755 3898231 3860936
61928 3860936 3822733 3783342 3742776 3701220 3659011 3616628 3574276 3531695 3489039 3447539 3408389
61917 3408389 3371018 3333537 3295083 3256723 3219822 3184663 3151169 3119762 3090360 3061302 3030691
61906 3030691 2998821 2968310 2941525 2918364 2896629 2874058 2849995 2825559 2802478 2781577 2762383
$$ packed form
61983F370139o2668o3543o2933o1242n8470n5473n3572n2914n2320n0916m9075
61972E747013m7623m6808m6269m5564m4570m3734m3762m4741m5809m6184m6207
61961E245742m6738m7885m9014m9785n0373n0831n1001n0893n0408m9028m6709
61950D703077m4808m4740m5787m5605m3282m0609l9668m0337m0937m0456l9169
61939D237679l7677l6219l4746l3116l1448l0467l1040l3028l5183l6524l7295
61928C860936l8203l9391m0566m1556m2209m2383m2352m2581m2656m1500l9150
61917C408389l7371l7481l8454l8360l6901l5159l3494l1407k9402k9058l0611
61906C030691l1870l0511k6785k3161k1735k2571k4063k4436k3081k0901j9194
$$ plain form
61895 2762383 2744346 2728175 2715432 2706678 2700458 2694499 2687890 2682012 2679347 2681373 2687566 2696286 2706514
61882 2706514 2718557 2733270 2751107 2772161 2796615 2824473 2855037 2887475 2922353 2962035 3008832
61871 3008832 3062737 3121517 3183126 3247572 3316123 3389328 3466720 3548580 3637053 3734790 3842671
61860 3842671 3959614 4084789 4219527 4366629 4528033 4703760 4893363 5098074 5321039
61851 5321039 5565501 5833463 6126472 6447008 6798052 7181398 7597623 8048094 8535863
61842 8535863 9063577 9631245 10237148 10880301 11560315 12274441 13015541 13772522 14530432
61833 14530432 15268554 15959170 16569995 17068945 17428101 17626320 17651777 17503979 17193547
61824 17193547 16739834 16168135 15506938 14784627 14026535 13254134 12485843 11736951 11018210
$$ packed form
61895B762383j8037j6171j2743q754o220n959o609n878k665K026O193Q720J0228
61882B706514J2043J4713J7837K1054K4454K7858L0564L2438L4878L9682M6797
61871C008832N3905N8780O1609O4446O8551P3205P7392Q1860Q8473R7737J07881
61860C842671J16943J25175J34738J47102J61404J75727J89603K04711K22965
61851E321039K44462K67962K93009L20536L51044L83346M16225M50471M87769
61842H535863N27714N67668O05903O43153O80014P14126P41100P56981P57910
61833A4530432P38122O90616O10825M98950L59156J98219K5457j47798l10432
61824A7193547m53713n71699o61197p22311p58092p72401p68291p48892p18741
$$ plain form
61815 11018210 10335641 9692630 9091818 8534573 8019840 7545059 7108252 6708278 6343284
61806 6343284 6010250 5706423 5430094 5179358 4951151 4742500 4552144 4379846 4224400
61797 4224400 4083357 3954652 3837502 3731565 3636072 3550029 3472514 3402523 3339375 3283557
61787 3283557 3236191 3196957 3163357 3132760 3104461 3078815 3055153 3031937 3008682 2986197 2964882
61776 2964882 2944292 2924886 2908762 2897527 2890296 2885086 2881779 2882379 2888108 2897304 2906866 2915396 2924413
61763 2924413 2936535 2952821 2971917 2991461 3010006 3027632 3045203 3063533 3083346 3105591 3131393
61752 3131393 3161656 3196697 3236181 3279457 3326287 3377431 3434428 3498664 3570649 3650161 3736943
61741 3736943 3831269 3934007 4046117 4167936 4299000 4438823 4587867 4747535 4919270 5104090
$$ packed form
61815A1018210o82569o43011o00812n57245n14733m74781m36807l99974l64994
61806F343284l33034l03827k76329k50736k28207k08651j90356j72298j55446
61797D224400j41043j28705j17150j05937r5493q6043p7515o9991o3148n5818
61787C283557m7366l9234l3600l0597k8299k5646k3662k3216k3255k2485k1315
61776B964882k0590j9406j6124j1235p231n210l307O00N729R196R562Q530R017
61763B924413J2122J6286J9096J9544J8545J7626J7571J8330J9813K2245K5802
61752C131393L0263L5041L9484M3276M6830N1144N6997O4236P1985P9512Q6782
61741C736943R4326J02738J12110J21819J31064J39823J49044J59668J71735J84820
$$ plain form
61731 5104090 5302943 5517033 5747487 5995150 6261059 6546882 6854664 7186557 7545268
61722 7545268 7934480 8358173 8819564 9321324 9866928 10461188 11109109 11814628 12580835
61713 12580835 13411017 14308753 15276934 16317024 17428975 18610785 19857207 21158658
61705 21158658 22500930 23864347 25221306 26533799 27753824 28827162 29698614 30317613
61697 30317613 30644745 30658412 30358589 29765740 28916434 27858048 26642998 25322614 23942580
61688 23942580 22541531 21151345 19796860 18495661 17259612 16096979 15012598 14006866
61680 14006866 13076743 12218690 11429923 10706877 10044253 9436738 8880603 8372487 7907435
61671 7907435 7479698 7085330 6722800 6390883 6086822 5806929 5548381 5309956 5091050
$$ packed form
61731E104090J98853K14090K30454K47663K65909K85823L07782L31893L58711
61722G545268L89212M23693M61391N01760N45604N94260O47921P05519P66207
61713A2580835Q30182Q97736R68181J040090J111951J181810J246422J301451
61705B1158658J342272J363417J356959J312493J220025J073338Q71452O18999
61697C0317613L27132J3667k99823n92849q49306j058386j215050j320384j380034
61688B3942580j401049j390186j354485j301199j236049j162633j084381j005732
61680A4006866r30123q58053p88767p23046o62624o07515n56135n08116m65052
61671G907435m27737l94368l62530l31917l04061k79893k58548k38425k18906
$$ plain form
61662 5091050 4890090 4704052 4529807 4365888 4212522 4069809 3936503 3810889 3692153
61653 3692153 3580265 3474986 3375671 3281811 3193147 3109467 3030789 2957473 2889595 2826394 2766808
61642 2766808 2710154 2655824 2602870 2550709 2499786 2450651 2402741 2355197 2308584 2264387 2222647
61631 2222647 2181507 2139667 2098158 2058838 2021986 1986228 1950319 1914220 1878792 1845107 1813829
61620 1813829 1784733 1757031 1730514 1705955 1683972 1664016 1644961 1626227 1607747 1589457 1571814
61609 1571814 1556323 1544217 1534441 1524037 1510967 1495743 1479970 1464248 1448309 1432414 1417466
61598 1417466 1403926 1391633 1380821 1372307 1366094 1360444 1353156 1343714 1333552 1324168 1315584 1307034 1298602
61585 1298602 1291416 1286160 1282140 1278243 1274383 1271291 1269010 1266396 1262482 1257740 1253362 1249556 1245253 1239630
$$ packed form
61662E091050k00960j86038j74245j63919j53366j42713j33306j25614j18736
61653C692153j11888j05279r9315r3860q8664q3680p8678p3316o7878o3201n9586
61642B766808n6654n4330n2954n2161n0923m9135m7910m7544m6613m4197m1740
61631B222647m1140m1840m1509l9320l6852l5758l5909l6099l5428l3685l1278
61620A813829k9096k7702k6517k4559k1983j9956j9055j8734j8480j8290j7643
61609A571814j5491j2106r776j0404j3070j5224j5773j5722j5939j5895j4948
61598A417466j3540j2293j0812q514o213n650p288r442j0162r384q584q550q432
61585A298602p186n256m020l897l860l092k281k614l914m742m378l806m303n623
$$ plain form
61571 1239630 1233278 1227573 1223307 1220297 1218010 1215993 1213836 1211295 1208685 1206757 1205957 1205987 1206243 1206408 1206369 1205749
61555 1205749 1203893 1200407 1195573 1190213 1185250 1181358 1178715 1176936 1175267 1173117 1170483 1167737 1164933 1161562
61541 1161562 1157272 1152681 1148928 1146277 1143738 1140538 1137512 1136324 1137473 1139805 1142046 1144079 1146531 1149855
61527 1149855 1154292 1160174 1167650 1176375 1185961 1196552 1208689 1222880 1239621 1259255 1281273 1304259
61515 1304259 1327411 1351941 1380089 1412715 1448616 1486296 1525529 1566860 1610457 1656151 1704057
61504 1704057 1754252 1805871 1857156 1906687 1954353 2000965 2046952 2091550 2133465 2172445 2209862
61493 2209862 2247202 2283985 2317828 2346821 2371278 2392812 2412327 2429600 2444364 2456711 2466253
61482 2466253 2471782 2472442 2468954 2463226 2456782 2449840 2441877 2432852 2423807 2416373 2411722 2410081 2411182 2415032
$$ packed form
61571A239630o352n705m266l010k287k017k157k541k610j928q00L0K56J65l9o20
61555A205749j856l486m834n360m963l892k643j779j669k150k634k746k804l371
61541A161562m290m591l753k651k539l200l026j188J149K332K241K033K452L324
61527A149855M437N882P476Q725R586J0591J2137J4191J6741J9634K2018K2986
61515A304259K3152K4530K8148L2626L5901L7680L9233M1331M3597M5694M7906
61504A704057N0195N1619N1285M9531M7666M6612M5987M4598M1915L8980L7417
61493B209862L7340L6783L3843K8993K4457K1534J9515J7273J4764J2347R542
61482B466253N529O60l488n728o444o942p963r025r045p434m651j641J101L850
$$ plain form
61468 2415032 2422059 2432643 2446863 2464745 2486544 2512699 2543711 2580182 2622752 2671862 2727822
61457 2727822 2791187 2862767 2943043 3031950 3129709 3237751 3358261 3492797 3641699 3804821
61447 3804821 3982337 4174770 4382804 4607240 4848535 5105994 5377818 5662297 5958178
61438 5958178 6263020 6571505 6876229 7169829 7445142 7693248 7903103 8064704 8172746
61429 8172746 8226827 8228758 8180757 8086235 7951139 7783619 7592314 7385100 7169009 6950561
61419 6950561 6735511 6528092 6330735 6144829 5971915 5814064 5673162 5550084 5444601
61410 5444601 5355807 5282527 5223705 5178910 5148546 5133224 5132744 5145734 5170355 5205404 5250683 5306195
61398 5306195 5370972 5442912 5519957 5601243 5686666 5775371 5865170 5953684 6039704 6123294 6204880
$$ packed form
61468B415032P027J0584J4220J7882K1799K6155L1012L6471M2570M9110N5960
61457B727822O3365P1580Q0276Q8907R7759J08042J20510J34536J48902J63122
61447C804821J77516J92433K08034K24436K41295K57459K71824K84479K95881
61438E958178L04842L08485L04724K93600K75313K48106K09855J61601J08042
61429H172746N4081J931m8001r4522j35096j67520j91305k07214k16091k18448
61419F950561k15050k07419j97357j85906j72914j57851j40902j23078j05483
61410E444601q8794p3280n8822m4795l0364j5322m80J2990K4621L5049M5279N5512
61398E306195O4777P1940P7045Q1286Q5423Q8705Q9799Q8514Q6020Q3590Q1586
$$ plain form
61387 6204880 6284486 6361570 6435328 6505420 6572620 6638448 6703721 6767471 6827474 6881749 6929632
61376 6929632 6971816 7009685 7044222 7075088 7100813 7120092 7132885 7140287 7143648 7143866 7140926 7133801
61364 7133801 7121324 7103550 7081876 7057572 7030860 7001899 6971718 6941202 6909857 6876939 6843564
61353 6843564 6812351 6784830 6760331 6737582 6716171 6695937 6676039 6655502 6634032 6611642 6587964
61342 6587964 6562588 6535740 6508195 6480853 6454887 6431940 6413763 6401964 6398468 6405829 6426570 6462348
61330 6462348 6514010 6582121 6667229 6770122 6892386 7036399 7204208 7396402 7612176 7850035
61320 7850035 8108142 8384494 8677355 8985164 9305306 9632936 9961169 10281906 10585976
61311 10585976 10863138 11103291 11298231 11442142 11530968 11562495 11537441 11459659 11334492 11166819
$$ packed form
61387F204880P9606P7084P3758P0092O7200O5828O5273O3750O0003N4275M7883
61376F929632M2184L7869L4537L0866K5725J9279J2793P402L361K18k940p125
61364G133801j2477j7774k1674k4304k6712k8961l0181l0516l1345l2918l3375
61353F843564l1213k7521k4499k2749k1411k0234j9898k0537k1470k2390k3678
61342F587964k5376k6848k7545k7342k5966k2947j8177j1799l496P361K0741L5778
61330F462348N1662O8111Q5108J02893J22264J44013J67809J92194K15774K37859
61320G850035K58107K76352K92861L07809L20142L27630L28233L20737L04070
61311A0585976K77162K40153J94940J43911Q8826L1527k5054p7782j25167j67673
$$ plain form
61301 11166819 10960685 10720344 10451179 10159447 9851025 9530467 9201622 8869487 8540888
61292 8540888 8222494 7917980 7627713 7351137 7088638 6840913 6607732 6388551 6184092
61283 6184092 5996359 5826890 5675615 5541600 5424300 5323706 5239615 5171209 5117289 5076702
61273 5076702 5048645 5032804 5029093 5037044 5055616 5083856 5121447 5167963 5221631 5279664 5340102 5402614
61261 5402614 5466915 5531189 5593038 5651566 5707296 5759989 5807734 5848595 5882249 5909635 5931903
61250 5931903 5950264 5965817 5978460 5986548 5988628 5985163 5977539 5965703 5947880 5922591 5889783 5849847
61238 5849847 5802752 5748821 5689511 5626679 5561419 5494134 5425298 5355602 5285663 5216166 5148137
61227 5148137 5082550 5019791 4959891 4903238 4850577 4802246 4757790 4716532 4678369 4643772 4613012
$$ packed form
61301A1166819k06134k40341k69165k91732l08422l20558l28845l32135l28599
61292H540888l18394l04514k90267k76576k62499k47725k33181k19181k04459
61283F184092j87733j69469j51275j34015j17300j00594q4091o8406n3920m0587
61273E076702k8057j5841l711P951J8572K8240L7591M6516N3668N8033O0438O2512
61261E402614O4301O4274O1849N8528N5730N2693M7745M0861L3654K7386K2268
61250E931903J8361J5553J2643Q088K080l465p624j1836j7823k5289l2808l9936
61238E849847m7095n3931n9310o2832o5260o7285o8836o9696o9939o9497o8029
61227E148137o5587o2759n9900n6653n2661m8331m4456m1258l8163l4597l0760
$$ plain form
61216 4613012 4585459 4559736 4534502 4508961 4482623 4455046 4426328 4397743 4371215 4347936 4327829
61205 4327829 4310579 4296783 4287839 4285172 4289947 4303073 4324824 4354562 4391403 4435095 4485837 4543515
61193 4543515 4607963 4680059 4761612 4853639 4955385 5065662 5184480 5312168 5446826 5583489
61183 5583489 5716045 5839214 5948271 6037710 6101247 6133225 6129680 6088607 6010373 5898350 5758464
61172 5758464 5597346 5420764 5233753 5041590 4849808 4662933 4483287 4311117 4146035
61163 4146035 3988559 3840378 3703068 3576709 3460174 3352716 3254667 3166332 3086993 3015677
61153 3015677 2952481 2898164 2852464 2813605 2779668 2749896 2724442 2703491 2687006 2674909 2667037
61142 2667037 2663125 2663140 2667418 2676152 2688891 2704809 2723316 2744057 2766420 2789258 2811072 2830197
$$ packed form
61216D613012k7553k5723k5234k5541k6338k7577k8718k8585k6528k3279k0107
61205D327829j7250j3796q944k667M775J3126K1751K9738L6841M3692N0742N7678
61193D543515O4448P2096Q1553R2027J01746J10277J18818J27688J34658J36663
61183E583489J32556J23169J09057Q9439O3537L1978l545m1073p8234j12023j39886
61172E758464j61118j76582j87011j92163j91782j86875j79646j72170j65082
61163D146035j57476j48181j37310j26359j16535j07458r8049q8335p9339p1316
61153C015677o3196n4317m5700l8859l3937k9772k5454k0951j6485j2097p872
61142B667037l912J5M278Q734J2739J5918J8507K0741K2363K2838K1814J9125
$$ plain form
61130 2830197 2844859 2853449 2855117 2850287 2840558 2827770 2812754 2794901 2773152 2747500 2719242 2689717
61118 2689717 2659140 2626930 2592810 2557177 2520439 2482431 2442678 2401084 2358192 2314696 2270783
61107 2270783 2226196 2181003 2135970 2091763 2048033 2003939 1959581 1916238 1875098 1836458 1800391
61096 1800391 1767212 1736694 1707789 1680168 1655381 1635159 1618723 1603132 1586359 1568713 1550916
61085 1550916 1532158 1510976 1487125 1461533 1434952 1407743 1380726 1355222 1332135 1311609 1293644
61074 1293644 1278447 1266029 1255981 1247833 1241452 1237089 1235262 1236415 1240229 1245436 1250848 1256643 1264162
61061 1264162 1274344 1286871 1300937 1316180 1332394 1348696 1363629 1376240 1386946 1397378 1409330
61050 1409330 1423511 1439070 1454429 1468645 1481780 1493975 1504669 1512957 1518264 1520214 1518280 1512279
$$ packed form
61130B830197J4662Q590J668m830r729j2788j5016j7853k1749k5652k8258k9525
61118B689717l0577l2210l4120l5633l6738l8008l9753m1594m2892m3496m3913
61107B270783m4587m5193m5033m4207m3730m4094m4358m3343m1140l8640l6067
61096A800391l3179l0518k8905k7621k4787k0222j6436j5591j6773j7646j7797
61085A550916j8758k1182k3851k5592k6581k7209k7017k5504k3087k0526j7965
61074A293644j5197j2418j0048q148o381m363j827J153L814N207N412N795P519
61061A264162J0182J2527J4066J5243J6214J6302J4933J2611J0706J0432J1952
61050A409330J4181J5559J5359J4216J3135J2195J0694Q288N307J950j934o001
$$ plain form
61038 1512279 1503033 1491850 1479308 1465286 1450301 1435815 1422523 1409079 1393636 1376558 1360556
61027 1360556 1347784 1337642 1327860 1317020 1305245 1293013 1280531 1268341 1257554 1248950 1242329 1237109
61015 1237109 1232974 1229548 1226059 1222032 1218002 1214847 1212593 1210518 1208240 1205871 1203136 1199347 1194656 1190626
61001 1190626 1189007 1190301 1193855 1198703 1203775 1207864 1210347 1211889 1213777 1216484 1219400 1221889 1224049 1226492
60987 1226492 1230134 1236302 1246163 1259459 1274319 1289057 1303863 1320141 1338367 1357401 1376031 1394496
60975 1394496 1414119 1435973 1460419 1487629 1517724 1550270 1584227 1618929 1654933 1693474 1735115
60964 1735115 1779317 1825417 1873612 1924730 1979489 2038565 2103149 2174392 2251854 2333255 2416729
60953 2416729 2503161 2595469 2695615 2803341 2918065 3040776 3173107 3315300 3466245 3625264
$$ packed form
61038A512279r246j1183j2542j4022j4985j4486j3292j3444j5443j7078j6002
61027A360556j2772j0142r782j0840j1775j2232j2482j2190j0787q604o621n220
61015A237109m135l426l489m027m030l155k254k075k278k369k735l789m691m030
61001A190626j619J294L554M848N072M089K483J542J888K707K916K489K160K443
60987A226492L642O168R861J3296J4860J4738J4806J6278J8226J9034J8630J8465
60975A394496J9623K1854K4446K7210L0095L2546L3957L4702L6004L8541M1641
60964A735115M4202M6100M8195N1118N4759N9076O4584P1243P7462Q1401Q3474
60953B416729Q6432R2308J00146J07726J14724J22711J32331J42193J50945J59019
$$ plain form
60943 3625264 3792941 3970652 4160577 4366031 4590352 4835186 5101192 5390699 5708291
60934 5708291 6058338 6443712 6867931 7337163 7859239 8442622 9097997 9838978 10678644
60925 10678644 11626296 12689761 13879910 15211632 16704166 18385843 20297243 22484490
60917 22484490 24990444 27854045 31097321 34664634 38335519 41711169 44351481 45995822
60909 45995822 46692046 46732148 46476799 46227575 46195195 46478565 46994319 47431386 47344658 46371832
60899 46371832 44415665 41656704 38418034 35012170 31664910 28511928 25619924 23007492
60891 23007492 20666179 18578925 16727750 15092994 13653989 12392749 11294047 10341181
60883 10341181 9514312 8793738 8162683 7606494 7111690 6667319 6265862 5901749 5570081
$$ packed form
60943C625264J67677J77711J89925K05454K24321K44834K66006K89507L17592
60934E708291L50047L85374M24219M69232N22076N83383O55375P40981Q39666
60925A0678644R47652J063465J190149J331722J492534J681677J911400K187247
60917B2484490K505954K863601L243276L567313L670885L375650K640312J644341
60909D5995822O96224M0102k55349k49224l2380K83370N15754M37067q6728r72826
60899D6371832j956167k758961l238670l405864l347260l152982k892004k612432
60891B3007492k341313k087254j851175j634756j439005j261240j098702r52866
60883A0341181q26869p20574o31055n56189m94804m44371m01457l64113l31668
$$ plain form
60874 5570081 5267302 4991649 4741825 4515883 4311590 4126360 3956129 3795755 3641755
60865 3641755 3493788 3352615 3217732 3088117 2964225 2847584 2738658 2636296 2539222 2447103
60855 2447103 2360172 2278554 2202029 2129976 2061532 1996041 1933273 1873261 1816445 1763914 1716547
60844 1716547 1673531 1632708 1593034 1555807 1522615 1492946 1464879 1437546 1411650 1387769 1365399
60833 1365399 1343845 1323211 1304154 1287012 1271320 1256015 1240330 1224591 1209763 1196066 1182666
60822 1182666 1169036 1155728 1143202 1130751 1117437 1103409 1089335 1075186 1060644 1046212 1032799
60811 1032799 1020589 1009465 1000092 993275 988435 984065 979570 975306 970955 965635 960157 957570 960343
60798 960343 967797 977040 985771 993564 1001262 1010077 1020982 1034135 1048774 1063963 1079394 1095435 1112576
$$ packed form
60874E570081l02779k75653k49824k25942k04293j85230j70231j60374j54000
60865C641755j47967j41173j34883j29615j23892j16641j08926j02362r7074r2119
60855B447103q6931q1618p6525p2053o8444o5491o2768o0012n6816n2531m7367
60844A716547m3016m0823l9674l7227l3192k9669k8067k7333k5896k3881k2370
60833A365399k1554k0634j9057j7142j5692j5305j5685j5739j4828j3697j3400
60822A182666j3630j3308j2526j2451j3314j4028j4074j4149j4542j4432j3413
60811A032799j2210j1124r373o817m840m370m495m264m351n320n478k587K773
60798I60343P454R243Q731P793P698Q815J0905J3153J4639J5189J5431J6041J7141
$$ plain form
60785 1112576 1130849 1149519 1167498 1184441 1201173 1218416 1235283 1249806 1260876 1268828 1274233 1277236
60773 1277236 1278304 1278478 1278278 1277109 1274168 1269201 1262070 1252534 1241112 1229356 1218496 1208426 1198569
60760 1198569 1188980 1179808 1170432 1160250 1149947 1140869 1133190 1125537 1116559 1106289 1095980 1087190 1080903
60747 1080903 1076832 1073383 1068751 1062262 1054572 1046763 1039620 1033543 1028579 1024423 1020786 1017914 1016480 1016929
60733 1016929 1019123 1022709 1027679 1034458 1043332 1053731 1064308 1074191 1084127 1095713 1109296 1123349 1136399
60720 1136399 1148914 1162496 1177718 1193663 1209351 1224626 1239569 1254112 1268586 1283790 1299820
60709 1299820 1315388 1328976 1340440 1350843 1360812 1369753 1376846 1382195 1386544 1390079 1392090 1391865 1389544
60696 1389544 1385841 1381247 1375843 1369743 1363331 1356997 1350889 1344927 1338890 1332567 1326172 1320452 1315873 1311630
$$ packed form
60785A112576J8273J8670J7979J6943J6732J7243J6867J4523J1070P952N405L003
60773A277236J068J74k00j169k941m967p131r536j1422j1756j0860j0070r857
60760A198569r589r172r376j0182j0303r078p679p653q978j0270j0309q790o287
60747A080903m071l449m632o489p690p809p143o077m964m156l637k872j434M49
60733A016929K194L586M970O779Q874J0399J0577R883R936J1586J3583J4053J3050
60720A136399J2515J3582J5222J5945J5688J5275J4943J4543J4474J5204J6030
60709A299820J5568J3588J1464J0403R969Q941P093N349M349L535K011k25k321
60696A389544l703m594n404o100o412o334o108n962o037o323o395n720m579m243
$$ plain form
60682 1311630 1306100 1298546 1289823 1280934 1271435 1259969 1246152 1231158 1216415 1202497 1189662 1178815
60670 1178815 1171073 1166396 1163291 1160282 1157289 1155158 1154186 1153948 1154608 1157328 1162624 1169049 1174619 1179245 1184510
60655 1184510 1191000 1197240 1201859 1205611 1210163 1215629 1220480 1223572 1225076 1225360 1224048 1220650 1215518 1209583
60641 1209583 1203272 1195952 1186487 1174383 1160427 1146039 1131893 1117492 1102263 1086573 1071169 1056108
60629 1056108 1040989 1026133 1012590 1000711 989376 977089 963549 949837 937213 926060 915921
60618 915921 906409 897908 891217 886486 882862 879541 876836 875669 876155 877273 878036 878477 879427 881863 886519
60603 886519 893437 901532 909097 915203 920377 925698 931748 938808 947448 958138 970458 983383 996355
60590 996355 1009507 1022909 1036238 1049339 1062493 1075840 1089053 1101969 1115064 1128745 1142320
$$ packed form
60682A311630n530p554q723q889r499j1466j3817j4994j4743j3918j2835j0847
60670A178815p742m677l105l009k993k131r72k38O60K720N296O425N570M626N265
60655A184510O490O240M619L752M552N466M851L092J504K84j312l398n132n935
60641A209583o311p320r465j2104j3956j4388j4146j4401j5229j5690j5404j5061
60629A056108j5119j4856j3543j1879j1335j2287j3540j3712j2624j1153j0139
60618I15921r512q501o691m731l624l321k705j167M86J118P63M41R50K436M656
60603H86519O918Q095P565O106N174N321O050P060Q640J0690J2320J2925J2972
60590I96355J3152J3402J3329J3101J3154J3347J3213J2916J3095J3681J3575
$$ plain form
60579 1142320 1154254 1163470 1170127 1175190 1179706 1184576 1190501 1197606 1205216 1212318 1218491 1224358 1231015 1238868
60565 1238868 1247030 1254001 1259078 1262911 1266479 1269829 1272312 1273887 1275472 1277735 1280069 1281187 1280409 1278061
60551 1278061 1274984 1272053 1269755 1267712 1264899 1260965 1257105 1254915 1254493 1254379 1253322 1251171 1247797 1242137
60537 1242137 1233275 1222100 1211156 1202684 1197036 1192889 1188709 1184060 1179689 1176462 1174390 1173009 1172620 1174555
60523 1174555 1179813 1187783 1196645 1204843 1211849 1217826 1223104 1228049 1232978 1237948 1242760 1247286 1251766 1256702
60509 1256702 1262508 1269250 1276617 1284015 1290662 1295879 1299730 1303371 1308218 1314389 1320398 1324887 1328329 1332333
60495 1332333 1337386 1342082 1344730 1345212 1345073 1346164 1349274 1353670 1358043 1362299 1368159 1377333 1389425 1402704
60481 1402704 1416862 1433691 1454776 1479920 1508520 1541150 1578664 1620744 1666574 1716274 1770305
$$ packed form
60579A142320J1934R216O657N063M516M870N925P105P610P102O173N867O657P853
60565A238868Q162O971N077L833L568L350K483J575J585K263K334J118p78k348
60551A278061l077k931k298k043k813l934l860k190m22j14j057k151l374n660
60537A242137q862j1175j0944q472n648m147m180m649m371l227k072j381l89J935
60523A174555N258P970Q862Q198P006N977N278M945M929M970M812M526M480M936
60509A256702N806O742P367P398O647N217L851L641M847O171O009M489L442M004
60495A332333N053M696K648M82j39J091L110M396M373M256N860R174J2092J3279
60481A402704J4158J6829K1085K5144K8600L2630L7514M2080M5830M9700N4031
$$ plain form
60470 1770305 1827717 1885963 1941990 1992474 2033622 2062396 2078164 2082021 2074478 2055194 2025379 1989228
60458 1989228 1952139 1918038 1888621 1864166 1844110 1827376 1813185 1801868 1794624 1792411 1795180 1802111
60446 1802111 1812481 1826227 1843543 1864160 1887576 1914314 1946347 1985671 2032700 2086541 2146437
60435 2146437 2212331 2284503 2363500 2450054 2544016 2643425 2745607 2849124 2953747 3058905
60425 3058905 3163780 3269388 3379184 3496980 3625415 3767278 3927037 4109672 4318436
60416 4318436 4554849 4820496 5117452 5446436 5804738 6185549 6578134 6967781 7335343
60407 7335343 7657404 7908564 8066366 8116578 8055426 7888164 7626847 7289304 6897720 6475126
60397 6475126 6041415 5611650 5196594 4803537 4436875 4099090 3791584 3514400 3265656
$$ packed form
60470A770305N7412N8246N6027N0484M1148K8774J5768L857p543j9284k9815l6151
60458A989228l7089l4101k9417k4455k0056j6734j4191j1317p244k213K769O931
60446A802111J0370J3746J7316K0617K3416K6738L2033L9324M7029N3841N9896
60435B146437O5894P2172P8997Q6554R3962R9409J02182J03517J04623J05158
60425C058905J04875J05608J09796J17796J28435J41863J59759J82635K08764
60416D318436K36413K65647K96956L28984L58302L80811L92585L89647L67562
60407G335343L22061K51160J57802N0212o1152j67262k61317l37543l91584m22594
60397F475126m33711m29765m15056l93057l66662l37785l07506k77184k48744
$$ plain form
60388 3265656 3042362 2842166 2663954 2506742 2368478 2246082 2136467 2037636 1949036 1870731
60378 1870731 1802015 1741080 1686085 1635995 1590038 1547186 1506967 1470199 1437798 1409145 1382564
60367 1382564 1357130 1332943 1309859 1287324 1265563 1245467 1226820 1207974 1188120 1168900 1152726
60356 1152726 1140197 1130043 1121004 1112687 1104944 1097529 1090510 1084371 1079539 1076090 1073711 1071594 1068725
60343 1068725 1064833 1060814 1057800 1056081 1055341 1055373 1055831 1055867 1055076 1054547 1055920 1059472 1064149 1069338 1075299 1081724
60327 1081724 1087365 1091794 1096251 1101822 1107754 1112645 1116511 1120419 1124458 1127291 1127736 1125910 1122807 1119467
60313 1119467 1116549 1114032 1111271 1107806 1104013 1100468 1097002 1093071 1088868 1085284 1082842 1081437 1081058 1081897
60299 1081897 1083760 1086162 1089187 1093475 1099228 1105959 1113322 1121366 1129832 1138128 1146284 1155114 1165093 1175929
$$ packed form
60388C265656k23294k00196j78212j57212j38264j22396j09615r8831q8600p8305
60378A870731o8716o0935n4995n0090m5957m2852m0219l6768l2401k8653k6581
60367A382564k5434k4187k3084k2535k1761k0096j8647j8846j9854j9220j6174
60356A152726j2529j0154r039q317p743p415p019o139m832l449k379k117k869
60343A068725l892m019l014j719p40L2M58L6p91n29J373L552M677N189N961O425
60327A081724N641M429M457N571N932M891L866L908M039K833M45j826l103l340
60313A119467k918k517k761l465l793l545l466l931m203l584k442j405l79Q39
60299A081897J863K402L025M288N753O731P363Q044Q466Q296Q156Q830R979J0836
$$ plain form
60285 1175929 1187545 1200429 1214475 1228482 1241480 1253580 1264769 1274044 1281028 1287630 1296530 1308199
60273 1308199 1320678 1332159 1342581 1352648 1362498 1371696 1379642 1385766 1390024 1393379 1396920 1400178 1401061
60260 1401061 1397936 1391354 1383383 1375620 1368107 1359776 1349755 1338506 1327689 1318561 1310591 1302283 1293387
60247 1293387 1285496 1280142 1276993 1274397 1271147 1267110 1262608 1257985 1253677 1249974 1246585 1242870 1238722 1234746
60233 1234746 1231314 1227857 1223669 1219321 1216561 1216392 1217674 1218192 1217043 1215482 1215545 1218381 1223908 1231333 1239672
60218 1239672 1248275 1257297 1267411 1279077 1292455 1307862 1325378 1343886 1361627 1378194 1394934 1412849
60206 1412849 1431319 1449801 1469359 1490936 1513151 1533812 1553231 1574162 1598536 1626009 1655784
60195 1655784 1687920 1722331 1758258 1795575 1835387 1878647 1925467 1976435 2033156 2096487 2165493
$$ packed form
60285A175929J1616J2884J4046J4007J2998J2100J1189R275O984O602Q900J1669
60273A308199J2479J1481J0422J0067R850R198P946O124M258L355L541L258Q83
60260A401061l125o582p971p763p513q331j0021j1249j0817r128p970q308q896
60247A293387p891n354l149k596l250m037m502m623m308l703l389l715m148l976
60233A234746l432l457m188m348k760j69J282N18j149j561O3K836N527P425Q339
60218A239672Q603R022J0114J1666J3378J5407J7516J8508J7741J6567J6740J7915
60206A412849J8470J8482J9558K1577K2215K0661J9419K0931K4374K7473K9775
60195A655784L2136L4411L5927L7317L9812M3260M6820N0968N6721O3331O9006
$$ plain form
60184 2165493 2239361 2319276 2407020 2502439 2603796 2710354 2823407 2944910 3076116 3217399
60174 3217399 3368341 3527713 3693976 3865823 4041724 4219084 4394494 4564754 4727220
60165 4727220 4879408 5019093 5144861 5255960 5351387 5429557 5489010 5529194 5550514 5554034 5541400
60154 5541400 5515022 5478123 5434415 5387416 5339977 5294567 5253894 5220827 5197658 5185802 5186363 5200633
60142 5200633 5229835 5274793 5336004 5413708 5507708 5617421 5742142 5880841 6031631 6191986
60132 6191986 6359497 6531713 6704840 6873270 7030889 7172727 7295453 7397082 7476574 7532945
60122 7532945 7564337 7568599 7545325 7496812 7426634 7337917 7233488 7116936 6992677 6865294 6739222
60111 6739222 6618503 6506312 6405273 6318624 6250136 6202039 6173855 6164254 6173379 6202193 6250153
$$ packed form
60184B165493P3868P9915Q7744R5419J01357J06558J13053J21503J31206J41283
60174C217399J50942J59372J66263J71847J75901J77360J75410J70260J62466
60165D727220J52188J39685J25768J11099R5427P8170N9453M0184K1320L520j2634
60154E541400k6378l6899m3708m6999m7439m5410m0673l3067k3169j1856N61J4270
60142E200633K9202M4958O1211P7704R4000J09713J24721J38699J50790J60355
60132F191986J67511J72216J73127J68430J57619J41838J22726J01629P9492N6371
60122G532945L1392M262k3274m8513p0178q8717j04429j16552j24259j27383j26072
60111F739222j20719j12191j01039q6649o8488m8097k8184r601R125K8814M7960
$$ plain form
60100 6250153 6314962 6394311 6486441 6588884 6697911 6809514 6919868 7024619 7119016 7199713
60090 7199713 7266085 7319319 7360532 7390066 7408211 7416194 7416649 7413404 7410846 7413364 7425193 7450349
60078 7450349 7492465 7554854 7640639 7752066 7889373 8051300 8237636 8450880 8694575 8970492
60068 8970492 9278331 9617691 9988972 10392242 10826345 11289357 11778979 12291949 12823557
60059 12823557 13367821 13917496 14463795 14996944 15507542 15987121 16427395 16819710 17155613
60050 17155613 17427740 17630116 17758243 17809303 17782171 17677216 17496416 17243782 16925652 16550917
60040 16550917 16131246 15680344 15211837 14737543 14267953 13813559 13384288 12987446 12627240
60031 12627240 12306628 12028701 11795860 11608504 11465279 11364263 11303408 11280043 11290282 11328901
$$ packed form
60100F250153O4809P9349R2130J02443J09027J11603J10354J04751R4397Q0697
60090G199713O6372N3234M1213K9534J8145P983M55l245k558K518J1829K5156
60078G450349M2116O2389Q5785J11427J37307J61927J86336K13244K43695K75917
60068H970492L07839L39360L71281M03270M34103M63012M89622N12970N31608
60059A2823557N44264N49675N46299N33149N10598M79579M40274L92315L35903
60050A7155613K72127K02376J28127N1060k7132j04955j80800k52634l18130l74735
60040A6550917m19671m50902m68507m74294m69590m54394m29271l96842l60206
60031A2627240l20612k77927k32841j87356j43225j01016o0855k3365J0239L8619
$$ plain form
60021 11328901 11389811 11466859 11554000 11644513 11730719 11805597 11864721 11905886 11926893 11924738 11897151
60010 11897151 11843950 11766432 11666188 11544944 11404743 11247612 11075187 10888803 10689482 10477870
60000 10477870 10255100 10024078 9789351 9555529 9326525 9106286 8898943 8707486 8533186
59991 8533186 8377058 8241197 8128118 8039594 7976765 7940476 7930582 7945712 7984751 8047878 8135015
59980 8135015 8243860 8370830 8513566 8670884 8840041 9015360 9189988 9357926 9513912
59971 9513912 9652472 9768182 9856705 9915229 9942260 9937309 9900395 9831558 9731301 9601787 9447041
59960 9447041 9271585 9079449 8875210 8665422 8457819 8258745 8071838 7899358 7744077
59951 7744077 7609318 7497538 7409465 7344707 7302986 7284972 7292273 7326514 7387976 7475044 7585280
$$ packed form
60021A1328901O0910P7048Q7141R0513Q6206P4878N9124M1165K1007k155k7587
60010A1897151n3201p7518j00244j21244j40201j57131j72425j86384j99321k11612
60000A0477870k22770k31022k34727k33822k29004k20239k07343j91457j74300
59991H533186j56128j35861j13079q8524o2829l6289r894J5130L9039O3127Q7137
59980H135015J08845J26970J42736J57318J69157J75319J74628J67938J55986
59971I513912J38560J15710Q8523N8524K7031m951l6914o8837j00257j29514j54746
59960I447041j75456j92136k04239k09788k07603j99074j86907j72480j55281
59951G744077j34759j11780q8073o4758m1721j8014P301L4241O1462Q7068J10236
$$ plain form
59940 7585280 7717270 7871299 8048324 8248419 8469879 8709038 8960485 9217665 9473464
59931 9473464 9720279 9950133 10155736 10331878 10475385 10583756 10654745 10687427 10682405 10640155
59921 10640155 10560331 10444081 10296495 10125400 9938010 9739960 9537236 9337254 9147480
59912 9147480 8973944 8821231 8692666 8590041 8514163 8466086 8446855 8455752 8490035 8547108 8625979
59901 8625979 8725982 8845241 8981318 9132386 9296487 9470157 9648945 9829100 10007938
59892 10007938 10182883 10350976 10509269 10655214 10787202 10905487 11012261 11110147 11200986 11286628
59882 11286628 11370115 11454999 11544048 11640056 11747837 11874091 12025086 12205376 12418708 12668632
59872 12668632 12957598 13286388 13654919 14062488 14506324 14980554 15477312 15988097 16502908
$$ packed form
59940G585280J31990J54029J77025K00095K21460K39159K51447K57180K55799
59931I473464K46815K29854K05603J76142J43507J08371P0989L2682n022m2250
59921A0640155p9824j16250j47586j71095j87390j98050k02724j99982j89774
59912I147480j73536j52713j28565j02625p5878m8077j9231Q897L4283N7073P8871
59901H625979J00003J19259J36077J51068J64101J73670J78788J80155J78838
59892A0007938J74945J68093J58293J45945J31988J18285J06774R7886R0839Q5642
59882A1286628Q3487Q4884Q9049R6008J07781J26254J50995J80290K13332K49924
59872A2668632K88966L28790L68531M07569M43836M74230M96758N10785N14811
$$ plain form
59863 16502908 17008408 17488234 17925512 18304631 18610957 18830391 18950879 18965127 18872271 18677558
59853 18677558 18390843 18025072 17595327 17118328 16611796 16092913 15576072 15071543 14586497
59844 14586497 14127452 13701390 13314415 12970071 12669832 12414950 12206945 12046233 11931259
59835 11931259 11859606 11829440 11839348 11887224 11969862 12083282 12222653 12381879 12553804 12730965
59825 12730965 12905850 13070321 13215056 13329605 13403076 13425484 13389561 13292040 13133485 12917067
59815 12917067 12647622 12331467 11976360 11591119 11185108 10767779 10348148 9934187 9532324
59806 9532324 9147089 8781116 8435793 8112358 7812358 7536964 7286204 7059329 6855770
59797 6855770 6675210 6516791 6378869 6259768 6158219 6072666 6000489 5938525 5884341 5836646
$$ packed form
59863A6502908N05500M79826M37278L79119L06326K19434J20488J4248r2856j94713
59853A8677558k86715l65771m29745m76999n06532n18883n16841n04529m85046
59844A4586497m59045m26062l86975l44344l00239k54882k08005j60712j14974
59835A1931259p1653l0166R908M7876Q2638J13420J39371J59226J71925J77161
59825A2730965J74885J64471J44735J14549P3471K2408l5923r7521j58555k16418
59815A2917067k69445l16155l55107l85241m06011m17329m19631m13961m01863
59806I532324l85235l65973l45323l23435l00000k75394k50760k26875k03559
59797F855770j80560j58419j37922j19101j01549q5553p2177o1964n4184m7695
$$ plain form
59787 5836646 5794244 5754918 5715813 5675149 5633373 5592214 5552496 5513213 5473046 5432335 5392764
59776 5392764 5354937 5316978 5276018 5230624 5181157 5128146 5071491 5011611 4950424 4890235 4832024
59765 4832024 4775720 4721981 4672585 4628702 4589723 4554538 4523388 4497638 4478154 4464938 4458227
59754 4458227 4458838 4466966 4481431 4500755 4524551 4553349 4587506 4627129 4673136 4727499 4791760 4865390
59742 4865390 4945997 5031042 5118889 5208130 5296681 5382307 5463701 5540136 5610139 5671710 5724465
59731 5724465 5770647 5813346 5854485 5895373 5938357 5986472 6041780 6105478 6179622 6267376 6371292
59720 6371292 6492660 6632985 6794787 6980163 7189613 7423330 7683047 7971714 8291735
59711 8291735 8644271 9029762 9448082 9897981 10376502 10878100 11392643 11902877 12383248
$$ packed form
59787E836646m2402l9326l9105m0664m1776m1159l9718l9283m0167m0711l9571
59776E392764l7827l7959m0960m5394m9467n3011n6655n9880o1187o0189n8211
59765D832024n6304n3739m9396m3883l8979l5185l1150k5750j9484j3216o711
59754D458227O11Q128J4465J9324K3796K8798L4157L9623M6007N4363O4261P3630
59742D865390Q0607Q5045Q7847Q9241Q8551Q5626Q1394P6435P0003O1571N2755
59731E724465M6182M2699M1139M0888M2984M8115N5308O3698P4144Q7754J03916
59720F371292J21368J40325J61802J85376K09450K33717K59717K88667L20021
59711H291735L52536L85491M18320M49899M78521N01598N14543N10234M80371
$$ plain form
59702 12383248 12801757 13125481 13328699 13399906 13343518 13175976 12920421 12603148 12250772 11886418
59692 11886418 11526860 11183336 10864512 10577588 10326921 10113431 9936544 9796402 9693786
59683 9693786 9628495 9598710 9602135 9637450 9704449 9802936 9931859 10089795 10276302 10492577 10740773
59672 10740773 11022747 11339312 11690386 12075989 12497434 12957503 13459163 14004423 14594926
59663 14594926 15233117 15921694 16662042 17454419 18299793 19199824 20154223 21159201 22209195
59654 22209195 23298501 24419527 25560175 26704701 27837262 28943979 30012846 31034473
59646 31034473 32004541 32925134 33803180 34647591 35467231 36269731 37060371 37840779 38607920
59637 38607920 39354194 40069190 40741845 41360663 41912271 42381936 42757564 43033349 43209151
$$ packed form
59702A2383248M18509L23724K03218P1207n6388j67542k55555l17273l52376l64354
59692A1886418l59558l43524l18824k86924k50667k13490j76887j40142j02616
59683I693786o5291k9785L425L5315O6999R8487J28923J57936J86507K16275K48196
59672A0740773K81974L16565L51074L85603M21445M60069N01660N45260N90503
59663A4594926O38191O88577P40348P92377Q45374R00031R54399J004978J049994
59654B2209195J089306J121026J140648J144526J132561J106717J068867J021627
59646C1034473R70068R20593Q78046Q44411Q19640Q02500P90640P80408P67141
59637C8607920P46274P14996O72655O18818N51608M69665L75628K75785J75802
$$ plain form
59628 43209151 43287897 43275840 43185066 43033279 42839837 42622643 42398756 42186142 42003435 41868394
59618 41868394 41796784 41801581 41892247 42075195 42355501 42737780 43225107 43817752 44513377 45307506
59608 45307506 46192687 47157026 48183589 49250488 50330684 51391575 52394882 53296991
59600 53296991 54050430 54607748 54927387 54978814 54744831 54222174 53422277 52371693 51109902
59591 51109902 49684164 48143589 46534887 44900314 43276673 41694164 40175277 38734782
59583 38734782 37380902 36115881 34934493 33821790 32753152 31698054 30626216 29514105
59575 29514105 28350251 27137697 25892121 24636244 23393463 22183568 21021359 19917343
59567 19917343 18878992 17911160 17015516 16190366 15431934 14736141 14099271 13517649 12987526
$$ packed form
59628D3209151P8746j2057r0774j51787j93442k17194k23887k12614j82707j35041
59618D1868394p1610M797R0666J82948K80306L82279M87327N92645O95625P94129
59608D5307506Q85181R64339J026563J066899J080196J060891J003307R02109
59600E3296991P53439N57318L19639N1427k33983n22657p99897j050584j261791
59591E1109902j425738j540575j608702j634573j623641j582509j518887j440495
59583C8734782j353880j265021j181388j112703j068638j055098j071838j112111
59575B9514105j163854j212554j245576j255877j242781j209895j162209j104016
59567A9917343j038351r67832q95644q25150p58432o95793o36870n81622n30123
$$ plain form
59558 12987526 12505125 12066225 11666057 11300563 10967677 10666522 10395290 10150597 9928590
59549 9928590 9725569 9537741 9361922 9196833 9042162 8895651 8752473 8608481 8462828
59540 8462828 8316251 8168032 8016342 7860857 7703179 7544835 7386618 7230036 7077632
59531 7077632 6931215 6791076 6657767 6533567 6421160 6321560 6234305 6159096 6096044 6044450
59521 6044450 6002433 5968147 5940933 5921365 5910820 5910834 5921834 5941975 5968014 5997987 6032614 6073508
59509 6073508 6120646 6172505 6228350 6289270 6356800 6431387 6512501 6599561 6692544 6792445 6901519
59498 6901519 7022322 7155922 7301655 7459143 7629942 7816555 8020456 8241977 8481618
59489 8481618 8740326 9018467 9315420 9630347 9962645 10311408 10674837 11050264 11434268
$$ packed form
59558A2987526m82401m38900m00168l65494l32886l01155k71232k44693k22007
59549I928590k03021j87828j75819j65089j54671j46511j43178j43992j45653
59540H462828j46577j48219j51690j55485j57678j58344j58217j56582j52404
59531G077632j46417j40139j33309j24200j12407r9600q7255p5209o3052n1594
59521F044450m2017l4286k7214j9568j0545J4J1000K0141K6039K9973L4627M0894
59509F073508M7138N1859N5845O0920O7530P4587Q1114Q7060R2983R9901J09074
59498F901519J20803J33600J45733J57488J70799J86613K03901K21521K39641
59489H481618K58708K78141K96953L14927L32298L48763L63429L75427L84004
$$ plain form
59480 11434268 11822713 12211026 12594539 12968350 13327288 13666622 13982573 14271372 14528026
59471 14528026 14747123 14925414 15063194 15163058 15227989 15261026 15265971 15247444 15210088 15158276 15096954
59460 15096954 15032517 14972297 14922861 14889120 14875611 14888309 14934150 15018345 15142692 15306446 15507312
59449 15507312 15740538 15997835 16268269 16539735 16798694 17029542 17216175 17344605 17403576
59440 17403576 17383721 17278362 17085796 16809720 16457232 16037625 15563096 15048739 14510351
59431 14510351 13962354 13417590 12887532 12381613 11906739 11467834 11068119 10708560 10388038
59422 10388038 10104929 9858332 9647839 9473110 9334077 9230608 9161338 9123665 9115572 9136854
59412 9136854 9187949 9268284 9376462 9511460 9672676 9858913 10067858 10296486 10541475 10799128
$$ packed form
59480A1434268L88445L88313L83513L73811L58938L39334L15951K88799K56654
59471A4528026K19097J78291J37780R9864O4931L3037M945j8527l7356n1812o1322
59460A5096954o4437o0220m9436l3741j3509J2698M5841Q4195J24347J63754K00866
59449A5507312K33226K57297K70434K71466K58959K30848J86633J28430N8971
59440A7403576j9855j05359j92566k76076l52488m19607m74529n14357n38388
59431A4510351n47997n44764n30058n05919m74874m38905l99715l59559l20522
59422A0388038k83109k46597k10493j74729j39033j03469o9270l7673q093K1282
59412I136854N1095Q0335J08178J34998J61216J86237K08945K28628K44989K57653
$$ plain form
59402 10799128 11064762 11331991 11592793 11838785 12062315 12255930 12411431 12520765 12577980
59393 12577980 12579389 12522096 12404185 12227135 11996970 11722163 11411011 11071048 10709504 10333231
59383 10333231 9948850 9563365 9183432 8813241 8454246 8107890 7777523 7466535 7175656
59374 7175656 6903573 6649684 6414858 6199769 6003761 5825516 5663997 5518556 5388524
59365 5388524 5272749 5169563 5077699 4997269 4928986 4872270 4825246 4787019 4758567 4740512 4731276
59354 4731276 4728687 4732477 4744037 4764539 4794381 4833220 4878628 4925158 4966564 4999371 5023876 5042730
59342 5042730 5060001 5080705 5108946 5146142 5192278 5248639 5317602 5399412 5490569 5585887 5681470
59331 5681470 5776230 5872418 5975245 6090576 6221992 6370415 6536428 6721840 6928926 7159422
$$ packed form
59402A0799128K65634K67229K60802K45992K23530J93615J55501J09334N7215
59393A2577980J409n7293j17911j77050k30165k74807l11152l39963l61544l76273
59383A0333231l84381l85485l79933l70191l58995l46356l30367l10988k90879
59374G175656k72083k53889k34826k15089j96008j78245j61519j45441j30032
59365E388524j15775j03186r1864q0430o8283n6716m7024l8227k8452j8055r236
59354D731276k589L790J1560K0502K9842L8839M5408M6530M1406L2807K4505J8854
59342E042730J7271K0704K8241L7196M6136N6361O8963Q1810R1157R5318R5583
59331E681470R4760R6188J02827J15331J31416J48423J66013J85412K07086K30496
$$ plain form
59321 7159422 7414684 7695819 8003426 8338439 8703746 9103817 9542017 10019182 10535509
59312 10535509 11093007 11695280 12345524 13045346 13794573 14590822 15428912 16300987 17197009
59303 17197009 18104922 19011061 19901428 20763154 21585116 22358067 23075115 23732282 24328347
59294 24328347 24863930 25340560 25760109 26124403 26434469 26689323 26884966 27014756 27070964
59285 27070964 27045933 26932040 26721873 26410060 25995625 25482774 24879993 24198891 23453209
59276 23453209 22657656 21827099 20976799 20122374 19278066 18454610 17659390 16898547 16178162
59267 16178162 15503361 14877171 14300477 13772334 13290145 12850464 12450311 12087611 11760424
59258 11760424 11466346 11202704 10966557 10754213 10561460 10384754 10221876 10071037 9929654
$$ packed form
59321G159422K55262K81135L07607L35013L65307M00071M38200M77165N16327
59312A0535509N57498O02273O50244O99822P49227P96249Q38090Q72075Q96022
59303A7197009R07913R06139Q90367Q61726Q21962P72951P17048O57167N96065
59294B4328347N35583M76630M19549L64294L10066K54854J95643J29790N6208
59285B7070964k5031j13893k10167l11813m14435n12851o02781o81102p45682
59276B3453209p95553q30557q50300q54425q44308q23456p95220p60843p20385
59267A6178162o74801o26190n76694n28143m82189m39681m00153l62700l27187
59258A1760424k94078k63642k36147k12344j92753j76706j62878j50839j41383
$$ plain form
59249 9929654 9794296 9661700 9529828 9398204 9267394 9138051 9010510 8885279 8763332
59240 8763332 8645401 8531465 8421707 8317677 8221622 8134690 8056684 7987724 7929322 7883519
59230 7883519 7851562 7833585 7829093 7837655 7859750 7897117 7951714 8024123 8113370 8218300 8338582
59219 8338582 8474399 8625918 8793332 8976855 9176213 9389974 9614840 9845077 10073298
59210 10073298 10293026 10500647 10694164 10870375 11024439 11152184 11251345 11320047 11355336 11354148
59200 11354148 11315037 11238308 11125282 10978373 10801601 10600222 10379656 10144733 9899566 9647980
59190 9647980 9394334 9143683 8900282 8665828 8440112 8223734 8019390 7830097 7656978
59181 7656978 7499239 7355572 7225147 7108168 7006259 6921687 6855391 6806183 6772550 6754759
$$ packed form
59249I929654j35358j32596j31872j31624j30810j29343j27541j25231j21947
59240H763332j17931j13936j09758j04030r6055q6932p8006o8960n8402m5803
59230G883519l1957j7977m492Q562K2095L7367N4597P2409Q9247J04930J20282
59219H338582J35817J51519J67414J83523J99358K13761K24866K30237K28221
59210A0073298K19728K07621J93517J76211J54064J27745R9161O8702L5289j188
59200A1354148l9111p6729j13026j46909j76772k01379k20566k34923k45167k51586
59190I647980k53646k50651k43401k34454k25716k16378k04344j89293j73119
59181G656978j57739j43667j30425j16979j01909q4572o6296m9208l3633j7791
$$ plain form
59171 6754759 6754492 6772808 6809335 6863426 6935528 7027446 7141642 7280176 7444097 7634029 7851437
59160 7851437 8098827 8378426 8691186 9037432 9417841 9833001 10282161 10762729 11270485
59151 11270485 11799532 12342057 12888410 13427002 13943555 14420875 14840429 15185033 15440736
59142 15440736 15597303 15648145 15590331 15424871 15157294 14798126 14362151 13866211 13327158 12761292
59132 12761292 12184559 11611822 11055295 10523539 10021722 9552535 9117130 8715994 8349499
59123 8349499 8017814 7720344 7455334 7220063 7011552 6827340 6665781 6525758 6406205
59114 6406205 6305823 6222872 6155200 6100932 6059297 6030034 6011453 6000030 5993090 5991349 5997280 6011081
59102 6011081 6029803 6050671 6073424 6098432 6124035 6147244 6166235 6180748 6190429 6194188 6191205 6181547
$$ packed form
59171F754759k67J8316L6527N4091P2102R1918J14196J38534J63921J89932K17408
59160G851437K47390K79599L12760L46246L80409M15160M49160M80568N07756
59151A1270485N29047N42525N46353N38592N16553M77320M19554L44604K55703
59142A5440736J56567N0842n7814j65460k67577l59168m35975m95940n39053n65866
59132A2761292n76733n72737n56527n31756n01817m69187m35405m01136l66495
59123H349499l31685k97470k65010k35271k08511j84212j61559j40023j19553
59114F406205j00382q2951o7672n4268m1635k9263j8581j1423o940j741N931J3801
59102F011081J8722K0868K2753K5008K5603K3209J8991J4513R681L759k983r658
$$ plain form
59090 6181547 6165567 6143333 6114734 6079706 6038463 5991976 5942057 5890484 5838143 5785406 5732949
59079 5732949 5681687 5632312 5585672 5543364 5507066 5477272 5453478 5435732 5425222 5423018 5428926 5442045
59067 5442045 5461993 5489087 5523581 5565325 5614234 5670714 5735428 5808794 5890969 5982261 6083153
59056 6083153 6193612 6312558 6438463 6570507 6708735 6852976 7002060 7154512 7309780
59047 7309780 7468415 7631065 7797422 7966004 8134715 8301731 8466169 8628161 8788380
59038 8788380 8947434 9105283 9260741 9411402 9554221 9685988 9802916 9899935 9971081 10010754
59028 10010754 10014246 9977188 9895586 9767250 9593040 9376439 9122422 8837239 8528693 8205327
59018 8205327 7874669 7542396 7213079 6891072 6580065 6282008 5997206 5725918 5469618
$$ packed form
59090F181547j5980k2234k8599l5028m1243m6487m9919n1573n2341n2737n2457
59079E732949n1262m9375m6640m2308l6298k9794k3794j7746j0510k204N908J3119
59067E442045J9948K7094L4494M1744M8909N6480O4714P3366Q2175R1292J00892
59056F083153J10459J18946J25905J32044J38228J44241J49084J52452J55268
59047G309780J58635J62650J66357J68582J68711J67016J64438J61992J60219
59038H788380J59054J57849J55458J50661J42819J31767J16928R7019P1146L9673
59028A0010754L492l7058q1602j28336j74210k16601k54017k85183l08546l23366
59018H205327l30658l32273l29317l22007l11007k98057k84802k71288k56300
$$ plain form
59009 5469618 5230296 5008577 4802999 4611250 4431702 4263637 4106617 3960228 3824216
59000 3824216 3698386 3582402 3475786 3377809 3287184 3202494 3123336 3050431 2984041 2922904 2865561
58989 2865561 2812037 2763177 2718731 2677362 2638397 2602306 2569386 2539052 2510679 2484184 2459544
58978 2459544 2436462 2414478 2392672 2369485 2343954 2316947 2290140 2263992 2238134 2213435 2191781
58967 2191781 2173575 2157404 2142722 2130856 2122381 2115361 2107624 2099391 2092318 2087203 2084000 2082825 2083247
58954 2083247 2083427 2081673 2078390 2075272 2073228 2072383 2073229 2076069 2079843 2083262 2086897 2092599 2100949 2110698 2120562
58939 2120562 2130060 2138580 2145333 2150644 2155873 2161478 2166323 2169564 2172247 2176333 2182759 2191054 2200254 2209581
58925 2209581 2218610 2227383 2236451 2246596 2258445 2272106 2286935 2301950 2316901 2332804 2350957 2371512
$$ packed form
59009E469618k39322k21719k05578j91749j79548j68065j57020j46389j36012
59000C824216j25830j15984j06616r7977r0625q4690p9158p2905o6390o1137n7343
58989B865561n3524m8860m4446m1369l8965l6091l2920l0334k8373k6495k4640
58978B459544k3082k1984k1806k3187k5531k7007k6807k6148k5858k4699k1654
58967B191781j8206j6171j4682j1866q475p020p737q233p073n115l203j175M22
58954B083247J80j754l283l118k044q45Q46K840L774L419L635N702Q350R749R864
58939B120562R498Q520O753N311N229N605M845L241K683M086O426Q295R200R327
58925B209581R029Q773R068J0145J1849J3661J4829J5015J4951J5903J8153K0555
$$ plain form
58913 2371512 2393455 2415830 2438550 2462127 2487164 2514182 2543475 2574923 2607981 2641875 2675975
58902 2675975 2710394 2746228 2784657 2825666 2868306 2912317 2958496 3007069 3056864 3107082 3159025
58891 3159025 3214896 3275493 3340299 3409364 3483611 3563186 3646723 3732715 3820992 3912686 4009165
58880 4009165 4111063 4218046 4329725 4447019 4571997 4705874 4847987 4997625 5156079
58871 5156079 5325539 5506479 5697719 5899069 6112508 6340426 6583921 6843353 7119576
58862 7119576 7414021 7728125 8063173 8420395 8801127 9207229 9641228 10105430 10600890
58853 10600890 11127922 11687664 12282432 12914430 13584692 14293325 15039938 15823425 16641690
58844 16641690 17491771 18369729 19269967 20184530 21102829 22011836 22896715 23741434 24528460
$$ packed form
58913B371512K1943K2375K2720K3577K5037K7018K9293L1448L3058L3894L4100
58902B675975L4419L5834L8429M1009M2640M4011M6179M8573M9795N0218N1943
58891C159025N5871O0597O4806O9065P4247P9575Q3537Q5992Q8277R1694R6479
58880D009165J01898J06983J11679J17294J24978J33877J42113J49638J58454
58871E156079J69460J80940J91240K01350K13439K27918K43495K59432K76223
58862G119576K94445L14104L35048L57222L80732M06102M33999M64202M95460
58853A0600890N27032N59742N94768O31998O70262P08633P46613P83487Q18265
58844A6641690Q50081Q77958R00238R14563R18299R09007Q84879Q44719P87026
$$ plain form
58835 24528460 25237854 25847793 26337421 26689898 26893580 26942192 26835444 26579039 26182898
58826 26182898 25659601 25025224 24300432 23508202 22669509 21801671 20920153 20039682 19172676
58817 19172676 18327799 17511006 16727147 15979814 15270483 14599033 13965090 13368384 12807985
58808 12807985 12281832 11787243 11321745 10883455 10470794 10082152 9716133 9372049 9049667
58799 9049667 8748364 8466978 8204544 7960457 7733727 7523056 7328057 7149288 6986398
58790 6986398 6837493 6701368 6579104 6471896 6378351 6295876 6224211 6165581 6121418 6090773
58780 6090773 6072044 6064530 6068028 6082483 6108415 6146308 6195360 6254316 6323703 6405585 6500706 6607675
58768 6607675 6725674 6856292 7001598 7161826 7336192 7525038 7729918 7952308 8193272
$$ packed form
58835B4528460P09394O09939M89628L52477K03682M8612j06748k56405l96141
58826B6182898n23297o34377p24792p92230q38693q67838q81518q80471q67006
58817A9172676q44877q16793p83859p47333p09331o71450o33943n96706n60399
58808A2807985n26153m94589m65498m38290m12661l88642l66019l44084l22382
58799I049667l01303k81386k62434k44087k26730k10671j94999j78769j62890
58790F986398j48905j36125j22264j07208r3545q2475p1665n8630m4163l0645
58780F090773j8729p514L498J4455K5932L7893M9052N8956O9387Q1882R5121J06969
58768F607675J17999J30618J45306J60228J74366J88846K04880K22390K40964
$$ plain form
58759 8193272 8453911 8735282 9038267 9364157 9714975 10092818 10499333 10936102 11404802
58750 11404802 11906603 12442074 13012005 13617716 14260383 14940911 15660426 16419375 17215369
58741 17215369 18042832 18895170 19765878 20646623 21525484 22388156 23219659 24003233 24718277
58732 24718277 25341402 25850222 26226196 26455358 26528891 26444239 26205252 25820945 25304321 24671956
58722 24671956 23943182 23138270 22276734 21376917 20456412 19531907 18617680 17723816 16856134
58713 16856134 16018342 15214213 14447389 13719585 13030147 12377756 11762017 11183160 10640849
58704 10640849 10133726 9659718 9216378 8801163 8411743 8046182 7703053 7381630 7081580
58695 7081580 6801940 6540604 6295336 6064952 5848948 5646491 5456630 5279027 5113380
$$ packed form
58759H193272K60639K81371L02985L25890L50818L77843M06515M36769M68700
58750A1404802N01801N35471N69931O05711O42667O80528P19515P58949P95994
58741A7215369Q27463Q52338Q70708Q80745Q78861Q62672Q31503P83574P15044
58732B4718277O23125N08820L75974K29162P3533q4652k38987l84307n16624o32365
58722B4671956p28774q04912q61536q99817r20505r24505r14227q93864q67682
58713A6856134q37792q04129p66824p27804o89438o52391o15739n78857n42311
58704A0640849n07123m74008m43340m15215l89420l65561l43129l21423l00050
58695G081580k79640k61336k45268k30384k16004k02457j89861j77603j65647
$$ plain form
58686 5113380 4958555 4813490 4678583 4554550 4440029 4332136 4229697 4134141 4046680 3966371
58676 3966371 3891815 3822971 3759965 3701501 3646082 3593953 3546317 3503115 3462814 3424018 3386110
58665 3386110 3348487 3310215 3270549 3229239 3186313 3141838 3095655 3047141 2995679 2941456 2885172
58654 2885172 2826820 2765692 2701911 2636933 2571965 2506936 2441740 2377510 2315722 2256874 2200975
58643 2200975 2148468 2099494 2052949 2007663 1964183 1924174 1888084 1854510 1821861 1789648 1757939
58632 1757939 1726481 1694958 1663786 1634170 1607242 1583134 1561051 1540389 1521483 1504749 1489389
58621 1489389 1473954 1458312 1444024 1432348 1422849 1414687 1408414 1405561 1406909 1411834 1418904 1426441 1433010
58608 1433010 1438183 1442726 1447512 1452455 1456856 1460377 1463123 1465018 1465575 1464090 1459853 1452506 1442509 1430989
$$ packed form
58686E113380j54825j45065j34907j24033j14521j07893j02439r5556q7461q0309
58676C966371p4556o8844o3006n8464n5419n2129m7636m3202m0301l8796l7908
58665C386110l7623l8272l9666m1310m2926m4475m6183m8514n1462n4223n6284
58654B885172n8352o1128o3781o4978o4968o5029o5196o4230o1788n8848n5899
58643B200975n2507m8974m6545m5286m3480m0009l6090l3574l2649l2213l1709
58632A757939l1458l1523l1172k9616k6928k4108k2083k0662j8906j6734j5360
58621A489389j5435j5642j4288j1676r499q162o273k853J348M925P070P537O569
58608A433010N173M543M786M943M401L521K746J895N57j485m237p347r997j1520
$$ plain form
58594 1430989 1419000 1407304 1396749 1388038 1381024 1375086 1370625 1369255 1371967 1377871 1385444 1394348 1405313
58581 1405313 1418791 1434564 1452363 1472109 1493586 1516466 1540819 1567382 1597191 1630657 1666867
58570 1666867 1704227 1742283 1782546 1826984 1876291 1930443 1990102 2055929 2127003 2201804 2280779
58559 2280779 2366150 2459010 2558588 2664746 2779087 2902769 3035400 3177371 3331319 3499490
58549 3499490 3680958 3873198 4075369 4288381 4512598 4747134 4990793 5241961 5497536
58540 5497536 5752885 6002511 6239895 6457401 6647466 6803581 6919508 6988747 7006514 6972316
58530 6972316 6889746 6764160 6601427 6408413 6193175 5963941 5727770 5489809 5253644 5022778
58520 5022778 4801625 4594083 4401127 4221097 4052803 3897014 3754476 3624154 3504479
$$ packed form
58594A430989j1989j1696j0555q711p014n938m461j370K712N904P573Q904J0965
58581A405313J3478J5773J7799J9746K1477K2880K4353K6563K9809L3466L6210
58570A666867L7360L8056M0263M4438M9307N4152N9659O5827P1074P4801P8975
58559B280779Q5371R2860R9578J06158J14341J23682J32631J41971J53948J68171
58549C499490J81468J92240K02171K13012K24217K34536K43659K51168K55575
58540E497536K55349K49626K37384K17506J90065J56115J15927O9239J7767l4198
58530F972316q2570j25586j62733j93014k15238k29234k36171k37961k36165k30866
58520E022778k21153k07542j92956j80030j68294j55789j42538j30322j19675
$$ plain form
58511 3504479 3394927 3295100 3203476 3118340 3039024 2965008 2894713 2826416 2759630 2694720 2632089
58500 2632089 2572681 2518048 2468637 2422824 2378667 2335607 2293476 2251239 2208252 2165674 2124975
58489 2124975 2085698 2046133 2005595 1964804 1924699 1886028 1849388 1814497 1780101 1745595 1712020
58478 1712020 1680605 1651439 1624475 1600490 1579798 1561198 1543399 1526293 1509780 1492864 1475244
58467 1475244 1458151 1442095 1425461 1407046 1388170 1370261 1352138 1332032 1310746 1290296 1270899
58456 1270899 1251981 1234796 1220933 1209103 1196468 1182704 1169986 1159375 1149895 1140775 1131952 1122837
58444 1122837 1113299 1105472 1101652 1100550 1098434 1093869 1088538 1083611 1078591 1074011 1071958 1072952 1075073 1077047
58430 1077047 1079694 1083482 1087174 1089918 1092401 1094873 1096186 1095842 1094998 1094399 1093097 1090233 1086434 1082505 1078266
$$ packed form
58511C504479j09552r9827r1624q5136p9316p4016p0295o8297o6786o4910o2631
58500B632089n9408n4633m9411m5813m4157m3060m2131m2237m2987m2578m0699
58489B124975l9277l9565m0538m0791m0105l8671l6640l4891l4396l4506l3575
58478A712020l1415k9166k6964k3985k0692j8600j7799j7106j6513j6916j7620
58467A475244j7093j6056j6634j8415j8876j7909j8123k0106k1286k0450j9397
58456A270899j8918j7185j3863j1830j2635j3764j2718j0611r480r120q823r115
58444A122837r538p827l820j102k116m565n331m927n020m580k053R94K121J974
58430A077047K647L788L692K744K483K472J313l44q44n99j302k864l799l929m239
$$ plain form
58415 1078266 1073587 1069207 1065756 1063154 1061397 1060635 1060279 1059417 1058177 1057113 1055337 1051275 1045327 1039527 1034274
58400 1034274 1027786 1019492 1011550 1005852 1001621 997226 992612 988451 984311 979138 972805 966228 960601 956969
58386 956969 955714 956093 957038 958464 960871 963979 967027 970054 973297 975641 975648 974095 973532 975118 977719 980282
58370 980282 983079 986303 989379 992151 995156 998438 1001644 1005219 1009693 1013954 1016438 1017991 1021193 1026570
58356 1026570 1031863 1035425 1038010 1040721 1043558 1046619 1050485 1054763 1058463 1062279 1068125 1075773 1082491 1086933
58342 1086933 1090936 1096478 1103225 1110277 1118064 1126936 1135671 1142825 1148313 1152800 1156832 1161113 1166127 1171091
58328 1171091 1174838 1177841 1181636 1186314 1190688 1194740 1199371 1203836 1206363 1207567 1210104 1214438 1218132 1220056
58314 1220056 1222075 1225644 1230040 1235121 1242402 1251850 1260874 1268299 1276293 1286448 1296972 1305903 1314370
$$ packed form
58415A078266m679m380l451k602j757p62l56q62j240j064j776m062n948n800n253
58400A034274o488q294p942n698m231m395m614m161m140n173o333o577n627l632
58386I56969j255L79R45J426K407L108L048L027L243K344Pj553n63J586K601K563
58370I80282K797L224L076K772L005L282L206L575M474M261K484J553L202N377
58356A026570N293L562K585K711K837L061L866M278L700L816N846P648O718M442
58342A086933M003N542O747P052P787Q872Q735P154N488M487M032M281N014M964
58328A171091L747L003L795M678M374M052M631M465K527J204K537M334L694J924
58314A220056K019L569M396N081P281R448R024P425P994J0155J0524Q931Q467
$$ plain form
58301 1314370 1324357 1335593 1346846 1358179 1369917 1381381 1392454 1404377 1417371 1429673 1440519
58290 1440519 1451794 1464987 1478849 1491801 1504345 1517251 1529670 1540921 1551949 1563271 1573727
58279 1573727 1583018 1593035 1604844 1616783 1627531 1638602 1651693 1665940 1680067 1695028 1712180
58268 1712180 1730773 1749443 1768463 1788573 1809333 1830304 1852002 1874255 1895830 1917073 1940459
58257 1940459 1966928 1994189 2020208 2045729 2071805 2097711 2123161 2149633 2177578 2205249 2232232
58246 2232232 2261026 2292965 2325763 2357338 2388891 2421816 2454877 2487074 2520118 2555298 2590997
58235 2590997 2626032 2662353 2701626 2742376 2783409 2826801 2874354 2924147 2973750 3023979 3076577
58224 3076577 3131302 3188149 3248995 3313790 3378532 3440394 3501630 3565377 3631327 3698879 3770337
$$ packed form
58301A314370R987J1236J1253J1333J1738J1464J1073J1923J2994J2302J0846
58290A440519J1275J3193J3862J2952J2544J2906J2419J1251J1028J1322J0456
58279A573727R291J0017J1809J1939J0748J1071J3091J4247J4127J4961J7152
58268A712180J8593J8670J9020K0110K0760K0971K1698K2253K1575K1243K3386
58257A940459K6469K7261K6019K5521K6076K5906K5450K6472K7945K7671K6983
58246B232232K8794L1939L2798L1575L1553L2925L3061L2197L3044L5180L5699
58235B590997L5035L6321L9273M0750M1033M3392M7553M9793M9603N0229N2598
58224C076577N4725N6847O0846O4795O4742O1862O1236O3747O5950O7552P1458
$$ plain form
58213 3770337 3846785 3924625 4000715 4077625 4159490 4246069 4335439 4429292 4530732 4639489 4753680
58202 4753680 4873546 4999462 5129345 5262215 5401180 5548818 5702932 5860959 6025031
58193 6025031 6198465 6380959 6571502 6772036 6983840 7204525 7433325 7675136 7934742
58184 7934742 8211644 8505241 8819692 9158211 9518071 9897383 10301293 10734945 11195768
58175 11195768 11679894 12191294 12737695 13322936 13950751 14630566 15371322 16174018 17037636
58166 17037636 17967254 18969264 20044906 21196240 22431643 23756847 25167821 26661795
58158 26661795 28248026 29938748 31739004 33657176 35716774 37944846 40356684 42964698
58150 42964698 45793492 48872340 52222633 55869246 59857149 64243525 69086269 74459228
$$ packed form
58213C770337P6448P7840P6090P6910Q1865Q6579Q9370R3853J01440J08757J14191
58202D753680J19866J25916J29883J32870J38965J47638J54114J58027J64072
58193F025031J73434J82494J90543K00534K11804K20685K28800K41811K59606
58184G934742K76902K93597L14451L38519L59860L79312M03910M33652M60823
58175A1195768M84126N11400N46401N85241O27815O79815P40756Q02696Q63618
58166A7037636R29618J002010J075642J151334J235403J325204J410974J493974
58158B6661795J586231J690722J800256J918172K059598K228072K411838K608014
58150D2964698K828794L078848L350293L646613L987903M386376M842744N372959
$$ plain form
58142 74459228 80468202 87232182 94859022 103457817 113159437 124100220 136399970 150181676
58134 150181676 165595398 182795628 201925718 223179116 246875787 273449163 303347264
58127 303347264 336826611 373442170 411214764 446118359 472804544 486599927 485508780
58120 485508780 470783935 445876545 414816558 381082541 347194584 314729743 284512751
58113 284512751 256883353 231931651 209618049 189818355 172369117 157106315 143866649
58106 143866649 132480708 122790173 114661094 107966693 102569190 98328658 95121506 92851285
58098 92851285 91446275 90803177 90652443 90458767 89536651 87366159 83842406 79242923 73999232
58089 73999232 68509396 63080664 57924188 53149212 48784444 44826807 41266517 38077987
$$ packed form
58142G4459228O008974O763980P626840Q598795R701620J0940783J2299750J3781706
58134A50181676J5413722J7200230J9130090K1253398K3696671K6573376K9898101
58127C03347264L3479347L6615559L7772594L4903595K6686185J3795383j091147
58120D85508780j4724845k4907390l1059987l3734017l3887957l2464841l0216992
58113B84512751k7629398k4951702k2313602j9799694j7449238j5262802j3239666
58106A43866649j1385941r690535q129079o694401n397503m240532l207152k270221
58098I2851285j405010o43098j50734j93676r22116k170492l523753m599483n243691
58089G3999232n489836n428732n156476m774976m364768l957637l560290l188530
$$ plain form
58081 38077987 35219890 32656410 30364641 28319718 26489955 24849777 23382206 22065321
58073 22065321 20869782 19772733 18762320 17826758 16950701 16124510 15346478 14613994 13921973
58064 13921973 13270445 12663442 12098771 11567681 11065278 10592618 10148479 9728224 9331045
58055 9331045 8958918 8607451 8266688 7932287 7607799 7295171 6991566 6696837 6415623
58046 6415623 6149736 5895595 5650965 5417353 5194163 4977320 4765585 4562069 4368002
58037 4368002 4181081 4001463 3833220 3677986 3532600 3394719 3265570 3145738 3033275
58028 3033275 2927447 2829705 2739777 2655251 2575609 2502131 2433469 2366387 2301286 2241684 2187459
58017 2187459 2133953 2078847 2024694 1973436 1923586 1874479 1828458 1786889 1748127 1710918 1675844
$$ packed form
58081C8077987k858097k563480k291769k044923j829763j640178j467571j316885
58073B2065321j195539j097049j010413r35562q76057q26191p78032p32484o92021
58064A3921973o51528o07003n64671n31090n02403m72660m44139m20255l97179
58055I331045l72127l51467l40763l34401l24488l12628l03605k94729k81214
58046F415623k65887k54141k44630k33612k23190k16843k11735k03516j94067
58037D368002j86921j79618j68243j55234j45386j37881j29149j19832j12463
58028C033275j05828r7742q9928q4526p9642p3478o8662o7082o5101n9602n4225
58017B187459n3506n5106n4153n1258m9850m9107m6021m1569l8762l7209l5074
$$ plain form
58006 1675844 1642242 1607908 1573314 1542098 1516013 1493029 1471373 1451518 1433270 1414971 1396737
57995 1396737 1380582 1366351 1351478 1335558 1320828 1307232 1291775 1274247 1258761 1247545 1237655
57984 1237655 1226180 1214482 1204578 1195232 1184717 1174244 1165591 1157950 1149789 1141509 1133883 1126179 1118171
57971 1118171 1111767 1108188 1105466 1101000 1095062 1089684 1085446 1081167 1075782 1069230 1062412 1056920 1053480 1050396
57957 1050396 1045289 1038611 1033308 1030660 1028845 1026035 1022325 1017966 1012435 1006226 1000967 996736 991736 985555
57943 985555 979989 975599 970231 962338 953125 944078 935089 926670 921163 919630 919726 918669 916334 913594 909755
57928 909755 903798 896485 889053 881053 871345 860182 848870 838359 829293 822242 816835 811933 807511
57915 807511 804946 804618 804867 804129 802498 800477 798135 796222 796005 797063 797402 796712 797038 799052 800300 798903
$$ packed form
58006A675844l3602l4334l4594l1216k6085k2984k1656j9855j8248j8299j8234
57995A396737j6155j4231j4873j5920j4730j3596j5457j7528j5486j1216r890
57984A237655j1475j1698r904r346j0515j0473q653p641q161q280p626p704q008
57971A118171o404l579k722m466n938n378m238m279n385o552o818n492l440l084
57957A050396n107o678n303k648j815k810l710m359n531o209n259m231n000o181
57943I85555n566m390n368p893r213r047q989q419n507j533R6j057k335k740l839
57928I09755n957p313p432q000r708j1163j1312j0511r066p051n407m902m422
57915H07511k565l28K49p38j631k021k342j913k17J058L39o90L26K014J248j397
$$ plain form
57899 798903 796465 795167 794174 791262 786257 780543 774595 768216 762034 756711 751649 746173 740862 736231
57885 736231 731530 726576 723306 723544 726434 729924 733561 737945 742764 747564 753404 761423 770395 777683
57871 777683 782018 783589 782242 777719 771182 764395 757520 749331 739294 727856 715164 701206 687058
57858 687058 674460 664177 655875 649067 642867 635469 625685 614933 606332 601847 601324 603691 607631 611462
57844 611462 614106 616425 620351 626590 634048 641369 647910 653413 657952 662361 667775 674531 682065 689638
57830 689638 696563 702143 706224 709516 712591 714890 715500 714430 712175 708525 702916 695725 688082 680410
57816 680410 672119 662868 653418 645070 638706 634327 631225 628700 626761 625797 625554 625234 624828 625453 627947
57801 627947 632111 637721 645003 653315 660756 666343 671547 678272 686177 693355 698857 702929 705458 705999
$$ packed form
57899G98903k438j298r93k912n005n714n948o379o182n323n062n476n311m631
57885G36231m701m954l270K38K890L490L637M384M819M800N840Q019Q972P288
57871G77683M335J571j347m523o537o787o875q189j0037j1438j2692j3958j4148
57858F87058j2598j0283q302o808o200p398r784j0752q601m485n23K367L940L831
57844F11462K644K319L926O239P458P321O541N503M539M409N414O756P534P573
57830F89638O925N580M081L292L075K299O10j070k255l650n609p191p643p672
57816F80410q291r251r450q348o364m379l102k525j939r64k43l20m06O25K494
57801F27947M164N610P282Q312P441N587N204O725P905P178N502M072K529N41
$$ plain form
57787 705999 705158 704177 703024 700427 696004 690926 686002 680388 672955 664173 655904 649633 645256 641346 636517
57772 636517 630579 624376 618456 612456 606046 599839 594589 589961 584871 578881 572530 566433 560598 554532
57758 554532 547538 539092 529413 519438 509835 500284 490093 479251 468538 458976 451429 446165 442430
57745 442430 438997 435517 432709 430889 429245 427177 425446 425102 426083 427807 430437 434321 438608 441707 443109
57730 443109 443810 444931 446686 448828 451560 455796 462589 471987 482450 492095 500747 509869 520025 529475
57716 529475 536064 539492 540698 539963 537028 532514 527633 522484 515814 506796 496387 486767 479649 474875
57702 474875 470395 464165 456467 449686 445426 442827 440331 437884 436342 435758 435698 436490 438594 441228 443158
57687 443158 444684 447454 452369 458834 465991 473486 481031 488303 495408 502549 509234 514580 518362 521106
$$ packed form
57787G05999q41r81j153k597m423n078m924n614p433q782q269o271m377l910m829
57772F36517n938o203n920o000o410o207n250m628n090n990o351o097n835o066
57758E54532o994q446r679r975r603r551j0191j0842j0713r562p547n264l735
57745D42430l433l480k808j820j644k068j731l44R81J724K630L884M287L099J402
57730D43109P01J121J755K142K732M236O793R398J0463R645Q652R122J0156R450
57716E29475O589L428J206p35k935m514m881n149o670r018j0409r620p118m774
57702D74875m480o230p698o781m260k599k496k447j542n84o0P92K104K634J930
57687D43158J526K770M915O465P157P495P545P272P105P141O685N346L782K744
$$ plain form
57673 521106 523381 525670 528491 531878 535208 538365 542415 548069 554214 559336 563917 569906 578077 587397
57659 587397 596869 606463 616177 625671 635051 644764 654546 663772 673034 684022 697368 711768 725838
57646 725838 739973 755842 774560 795678 817558 838893 860422 884858 914346 948359 984913
57635 984913 1023155 1063430 1105427 1148245 1192402 1239943 1292137 1348579 1408967 1474210 1545126
57624 1545126 1621628 1704117 1794478 1894772 2005949 2128597 2263719 2411702 2571471 2742003
57614 2742003 2924227 3120364 3331642 3557499 3796718 4048352 4311186 4582385 4856145
57605 4856145 5122910 5369788 5582322 5746787 5852347 5893021 5869071 5786813 5656641 5490267
57595 5490267 5298423 5089745 4871080 4648500 4427524 4212284 4005274 3808555 3624471
$$ packed form
57673E21106K275K289K821L387L330L157M050N654O145N122M581N989Q171R320
57659E87397R472R594R714R494R380R713R782R226R262J0988J3346J4400J4070
57646G25838J4135J5869J8718K1118K1880K1335K1529K4436K9488L4013L6554
57635I84913L8242M0275M1997M2818M4157M7541N2194N6442O0388O5243P0916
57624A545126P6502Q2489R0361J00294J11177J22648J35122J47983J59769J70532
57614B742003J82224J96137K11278K25857K39219K51634K62834K71199K73760
57605D856145K66765K46878K12534J64465J05560M0674k3950q2258j30172j66374
57595E490267j91844k08678k18665k22580k20976k15240k07010j96719j84084
$$ plain form
57586 3624471 3454438 3297858 3153561 3021950 2904462 2801221 2710630 2631223 2562561 2504169
57576 2504169 2454830 2413187 2378053 2348216 2323174 2304142 2293044 2290308 2294808 2305877 2323826 2348381
57564 2348381 2378540 2414632 2458757 2512205 2573841 2642124 2717496 2801668 2895577 2999223 3112769
57553 3112769 3236680 3371224 3516380 3671435 3833966 4000051 4166254 4330539 4490424
57544 4490424 4640936 4775146 4885952 4966758 5011810 5017587 4983893 4913050 4808590 4675285
57534 4675285 4519348 4347291 4164725 3976585 3787383 3600066 3415507 3234510 3059810
57525 3059810 2894827 2740909 2597226 2463125 2339054 2225038 2119720 2021585 1930340 1846505
57515 1846505 1770128 1700306 1635747 1575601 1519902 1469171 1423483 1382104 1344237 1309732 1278738
$$ packed form
57586C624471j70033j56580j44297j31611j17488j03241r0591p9407o8662n8392
57576B504169m9339m1643l5134k9837k5042j9032j1098k736M500J1069J7949K4555
57564B348381L0159L6092M4125N3448O1636O8283P5372Q4172R3909J03646J13546
57553C112769J23911J34544J45156J55055J62531J66085J66203J64285J59885
57544D490424J50512J34210J10806Q0806M5052N777l3694p0843j04460j33305
57534D675285j55937j72057j82566j88140j89202j87317j84559j80997j74700
57525C059810j64983j53918j43683j34101j24071j14016j05318r8135r1245q3835
57515A846505p6377o9822o4559o0146n5699n0731m5688m1379l7867l4505l0994
$$ plain form
57504 1278738 1250958 1225676 1202274 1180385 1159795 1140658 1123634 1109475 1098539 1090671 1085179 1080893
57492 1080893 1076921 1073605 1072204 1073362 1076583 1081459 1088518 1098303 1110448 1124398 1140280 1158222 1177420
57479 1177420 1196935 1217093 1239270 1264507 1293000 1324625 1359211 1396490 1436531 1480062 1527869
57468 1527869 1580144 1636899 1698648 1766031 1839085 1917433 2000918 2089592 2183616 2283711 2391068
57457 2391068 2505945 2626842 2751843 2880190 3011473 3143682 3273117 3395747 3507357
57448 3507357 3602577 3675554 3722343 3741898 3734489 3700155 3639318 3554211 3449020 3328885 3198914
57437 3198914 3063558 2926275 2789747 2656425 2528505 2407270 2292938 2185553 2085926 1995447
57427 1995447 1914943 1843911 1781008 1725310 1676851 1635765 1601274 1572053 1547401 1527414 1512165
$$ packed form
57504A278738k7780k5282k3402k1889k0590j9137j7024j4159j0936p868n492m286
57492A080893l972l316j401J158L221M876P059R785J2145J3950J5882J7942J9198
57479A177420J9515K0158K2177K5237K8493L1625L4586L7279M0041M3531M7807
57468A527869N2275N6755O1749O7383P3054P8348Q3485Q8674R4024J00095J07357
57457B391068J14877J20897J25001J28347J31283J32209J29435J22630J11610
57448C507357R5220P2977M6789J9555p409l4334o0837q5107j05191j20135j29971
57437C198914j35356j37283j36528j33322j27920j21235j14332j07385r9627r0479
57427A995447q0504p1032o2903n5698m8459m1086l4491k9221k4652j9987j5249
$$ plain form
57416 1512165 1501672 1496675 1498252 1506177 1518819 1535330 1556815 1584434 1617528 1654882 1696905 1744918
57404 1744918 1798879 1857644 1921382 1991994 2070652 2156305 2247140 2342587 2443333 2550112 2662865
57393 2662865 2780346 2900052 3018863 3133724 3241188 3336521 3414333 3470404 3502235 3507811
57383 3507811 3485046 3433118 3353762 3250873 3129294 2994160 2850391 2701934 2551647 2402251
57373 2402251 2256871 2118121 1986992 1863276 1746999 1638940 1539594 1448036 1362322 1281302
57363 1281302 1205751 1137158 1075422 1018554 964937 914967 869714 828798 790773 755087 722240
57352 722240 692155 663885 637229 613306 592879 575055 558262 541781 525777 510491 495949
57341 495949 481977 468117 454104 440688 429226 419978 411534 402404 392534 382722 373381 364631 356840
$$ packed form
57416A512165j0493m997J577P925J2642J6511K1485K7619L3094L7354M2023M8013
57404A744918N3961N8765O3738P0612P8658Q5653R0835R5447J00746J06779J12753
57393B662865J17481J19706J18811J14861J07464R5333P7812N6071L1831N576
57383C507811k2765n1928p9356j02889j21579j35134j43769j48457j50287j49396
57373B402251j45380j38750j31129j23716j16277j08059r9346r1558q5714q1020
57363A281302p5551o8593o1736n6868n3617m9970m5253m0916l8025l5686l2847
57352G22240l0085k8270k6656k3923k0427j7824j6793j6481j6004j5286j4542
57341D95949j3972j3860j4013j3416j1462r248q444r130r870r812r341q750p791
$$ plain form
57328 356840 349997 342964 334517 325119 316725 310753 306872 303845 300829 297718 294864 292670 291004 288935
57314 288935 285652 281714 278676 277177 276108 274194 271752 270091 269619 269579 269642 270708 273702 278289 283231
57299 283231 287401 289997 290484 289154 287391 286523 286630 287177 288448 291308 295688 300435 304782 308851 312474
57284 312474 314808 315708 316404 318075 320592 323354 326438 330141 334418 339770 347678 358740 371015 381593
57270 381593 389450 395537 400619 404760 408826 414718 423452 434099 445058 455532 465527 475318 485358
57257 485358 496046 507434 519615 533070 547690 561737 573255 582621 592388 604267 617629 631445
57245 631445 646103 662342 679639 696964 714367 732644 751977 772118 793523 817050 842415
57234 842415 868001 892663 917256 943974 974305 1007799 1042865 1078638 1115794 1155350 1197116
$$ packed form
57328C56840o843p033q447r398q394n972l881l027l016l111k854k194j666k069
57314B88935l283l938l038j499j069j914k442j661m72m0O3J066K994M587M942
57299B83231M170K596M87j330j763q68J07N47J271K860M380M747M347M069L623
57284C12474K334R00O96J671K517K762L084L703M277N352P908J1062J2275J0578
57270C81593P857O087N082M141M066N892Q734J0647J0959J0474R995R791J0040
57257D85358J0688J1388J2181J3455J4620J4047J1518R366R767J1879J3362J3816
57245F31445J4658J6239J7297J7325J7403J8277J9333K0141K1405K3527K5365
57234H42415K5586K4662K4593K6718L0331L3494L5066L5773L7156L9556M1766
$$ plain form
57223 1197116 1240039 1283931 1329918 1378897 1430328 1483063 1536849 1592399 1650219 1709828 1770003
57212 1770003 1829490 1887492 1943427 1996047 2042947 2081609 2111159 2132754 2148124 2158059 2162360 2160714
57200 2160714 2153354 2141150 2125350 2107227 2088018 2069120 2051837 2036717 2023809 2014087 2009742 2012200
57188 2012200 2020637 2033738 2052076 2077027 2107672 2140845 2174289 2207714 2240339 2269691 2293950
57177 2293950 2313528 2328942 2338779 2341532 2338160 2330950 2320664 2306774 2290221 2274266 2262612 2257902
57165 2257902 2261861 2275515 2299021 2332053 2374335 2425078 2482279 2543645 2608137 2675605 2744992
57154 2744992 2813948 2880388 2943646 3003954 3061415 3115593 3165493 3209886 3248261 3281458 3310807
57143 3310807 3336653 3358387 3375993 3390935 3405328 3420631 3437305 3455212 3474023 3493342 3512745
$$ packed form
57223A197116M2923M3892M5987M8979N1431N2735N3786N5550N7820N9609O0175
57212A770003N9487N8002N5935N2620M6900L8662K9550K1595J5370R935M301j646
57200B160714p360j2204j5800j8123j9209j8898j7283j5120j2908r722m345K458
57188B012200Q437J3101J8338K4951L0645L3173L3444L3425L2625K9352K4259
57177B293950J9578J5414R837K753l372p210j0286j3890j6553j5955j1654m710
57165B257902L959J3654K3506L3032M2282N0743N7201O1366O4492O7468O9387
57154B744992O8956O6440O3258O0308N7461N4178M9900M4393L8375L3197K9349
57143C310807K5846K1734J7606J4942J4393J5303J6674J7907J8811J9319J9403
$$ plain form
57132 3512745 3532011 3551503 3572195 3594817 3618902 3643252 3667517 3692615 3719101 3745632 3769542
57121 3769542 3788619 3801940 3809449 3811322 3807642 3798366 3783760 3764835 3742792 3717896 3689661 3658414
57109 3658414 3625862 3593653 3562160 3531258 3501453 3473506 3447611 3423668 3401708 3381204 3360515
57098 3360515 3337771 3311838 3281788 3246155 3203669 3154371 3099274 3039392 2975670 2909147 2840365
57087 2840365 2769207 2695958 2621745 2547062 2470858 2392252 2312433 2233537 2156264 2080028 2004981
57076 2004981 1932264 1862168 1793112 1722534 1647950 1567375 1479787 1385343 1284666 1178023 1065416
57065 1065416 946559 819885 682062 529164 357620 163414 -58756 -315004 -612106 -958655
57055 -958655 -1364690 -1839028 -2388416 -3020434 -3745121 -4571927 -5507278 -6557906 -7735258
$$ packed form
57132C512745J9266J9492K0692K2622K4085K4350K4265K5098K6486K6531K3910
57121C769542J9077J3321P509J873l680r276j4606j8925k2043k4896k8235l1247
57109C658414l2552l2209l1493l0902k9805k7947k5895k3943k1960k0504k0689
57098C360515k2744k5933l0050l5633m2486m9298n5097n9882o3722o6523o8782
57087B840365p1158p3249p4213p4683p6204p8606p9819p8896p7273p6236p5047
57076B004981p2717p0096o9056p0578p4584q0575q7588r4444j00677j06643j12607
57065A065416j18857j26674j37823j52898j71544A63414e8756k56248k97102l46549
57055i58655m06035m74338n49388o32018p24687q26806r35351j050628j177352
$$ plain form
57046 -7735258 -9054303 -10529936 -12177908 -14018393 -16076234 -18380393 -20968704 -23894517
57038 -23894517 -27227379 -31050252 -35460787 -40572702 -46507198 -53378089 -61283952 -70306538
57030 -70306538 -80502432 -91888978 -104441469 -118105858 -132813764 -148498223 -165121636
57023 -165121636 -182695888 -201234023 -220606739 -240376877 -259736301 -277603252 -292826947
57016 -292826947 -304399792 -311610308 -314118469 -311961032 -305504142 -295361237 -282287165
57009 -282287165 -267060302 -250381507 -232825448 -214850557 -196834351 -179097203 -161907823
57002 -161907823 -145483995 -129995098 -115563471 -102265819 -90139316 -79189953 -69396668
56995 -69396668 -60711977 -53065148 -46368919 -40526024 -35435145 -30998292 -27127260 -23744905
$$ packed form
57046g735258j319045j475633j647972j840485k057841k304159k588311k925813
57038b3894517l332862l822873m410535n111915n934496o870891p905863r022586
57030g0306538j0195894j1386546j2552491j3664389j4707906j5684459j6623413
57023a65121636j7574252j8538135j9372716j9770138j9359424j7866951j5223695
57016b92826947j1572845p210516k508161K157437O456890J0142905J3074072
57009b82287165J5226863J6678795J7556059J7974891J8016206J7737148J7189380
57002a61907823J6423828J5488897J4431627J3297652J2126503J0949363R793285
56995f9396668Q684691P646829O696229N842895N090879M436853L871032L382355
$$ plain form
56987 -23744905 -20782777 -18180171 -15885026 -13853341 -12047297 -10435133 -8991870 -7697420
56979 -7697420 -6533254 -5482126 -4530646 -3669686 -2891460 -2187621 -1550435 -973706 -451221
56969 24690 462111 867645 1246118 1601063 1934845 2248889 2544372 2822092 3081450 3320385
56959 3320385 3536793 3729478 3897712 4041099 4160531 4258412 4337301 4399042 4445587 4479621
56949 4479621 4503612 4519221 4528450 4534472 4540598 4549870 4566572 4594903 4630704 4652815 4626364 4519756
56937 4519756 4321616 4043772 3711110 3349933 2982348 2625001 2288551 1977929 1694515
56928 1694515 1438675 1210440 1008576 830158 671710 530876 406910 299299 205741 121888
56918 121888 43634 -30371 -99091 -161768 -219411 -273303 -323107 -367364 -405324 -437264 -463234
$$ packed form
56987b3744905K962128K602606K295145K031685J806044J612164J443263J294450
56979g697420J164166J051128R51480Q60960P78226P03839O37186N76729d51221
56969B4690M37421M05534L78473L54945L33782L14044K95483K77720K59358K38935
56959C320385K16408J92685J68234J43387J19432R7881P8889O1741M6545L4034
56949D479621K3991J5609R229O022O126R272J6702K8331L5801K2111k6451j06608
56937D519756j98140k77844l32662l61177l67585l57347l36450l10622k83414
56928A694515k55840k28235k01864j78418j58448j40834j23966j07611r3558q3853
56918A21888D3634c0371o8720o2677n7643n3892m9804m4257l7960l1940k5970
$$ plain form
56907 -463234 -482700 -495770 -503892 -508684 -510481 -508457 -501762 -489908 -472351 -448557 -418909 -385343
56895 -385343 -350947 -319013 -292247 -272188 -258734 -250239 -244417 -239486 -234616 -229560 -224192 -218396 -212092
56882 -212092 -205115 -197115 -187731 -176807 -164344 -150277 -134390 -116439 -96297 -73994 -49718 -23771
56869 3407 30925 56931 78672 93348 99208 96045 85059 68540 49424 30580 14004 478 -10303
56855 -19347 -27684 -35572 -42233 -46680 -48822 -49444 -49120 -47554 -44213 -39355 -34090 -29397 -25199 -20478 -14350
56840 -14350 -7039 434 7487 14573 22418 31113 40467 50842 62808 76013 89181 101424 112878
56827 112878 123859 134172 143714 153012 162299 170301 174784 174463 170071 163546 156602 150126 144473 139799
56813 139799 136055 132973 130533 129616 131900 138689 149893 164510 181997 202739 227199 255129 285866
$$ packed form
56907d63234j9466j3070q122m792j797K024O695J1854J7557K3794K9648L3566
56895c85343L4396L1934K6766K0059J3454Q495N822M931M870N056N368N796O304
56882b12092O977Q000R384J0924J2463J4067J5887J7951K0142K2303K4276b3771
56869C407K7518K6006K1741J4676N860l163j0986j6519j9116j8844A4004D78a0303
56855a9347q337p888o661m447k142o22L24J566L341M858N265M693M198M721O128
56840a4350g039D34P053P086P845Q695R354J0375J1966J3205J3168J2243J1454
56827A12878J0981J0313R542R298R287Q002M483l21m392o525o944o476n653m674
56813A39799l744l082k440r17K284O789J1204J4617J7487K0742K4460K7930L0737
$$ plain form
56800 285866 318970 354177 390695 426436 457750 480308 491147 490341 480600 465395 447712 430066
56788 430066 414435 401760 392223 386287 384787 387791 394392 404167 418135 437746 463679 496155 535427
56775 535427 581038 631227 683941 737659 790011 836107 869764 886788 886616 871285 844027 808753
56763 808753 769504 729585 691426 657002 627552 602922 582181 565247 553260 547264 547249 552743
56751 552743 563598 579824 601225 627554 658412 692418 726563 756689 778687 789566 788094 774840
56739 774840 751628 721059 686446 651287 617751 585796 554656 525115 499379 478700 462226
56728 462226 448599 437687 430232 426679 427113 431667 440175 451682 464897 478730 491762 501564 505361
56715 505361 501586 490528 473713 453026 430208 406564 383023 360619 340696 324230 311031 299961
$$ packed form
56800B85866L3104L5207L6518L5741L1314K2558J0839q06r741j5205j7683j7646
56788D30066j5631j2675r537n936j500L004O601R775J3968J9611K5933L2476L9272
56775E35427M5611N0189N2714N3718N2352M6096L3657J7024j72j5331k7258l5274
56763H08753l9249l9919l8159l4424k9450k4630k0741j6934j1987n996j5N494
56751E52743J0855J6226K1401K6329L0858L4006L4145L0126K1998J0879j472j3254
56739G74840k3212l0569l4613l5159l3536l1955l1140k9541k5736k0679j6474
56728D62226j3627j0912p455l553M34M554Q508J1507J3215J3833J3032R802L797
56715E05361l775j1058j6815k0687k2818k3644k3541k2404j9923j6466j3199j1070
$$ plain form
56703 299961 290002 280872 272662 265127 257520 249087 239814 230766 223623 219617 218650 219138 218700 215571 209966
56688 209966 204010 199803 197537 195911 194094 192362 190783 188573 185486 182886 182361 183765 185688 187434
56674 187434 189287 190918 191057 189364 187501 187372 188856 190155 190049 188929 187745 186935 186614 187031 188236 189641
56658 189641 190453 190488 190183 189831 189107 187487 184909 181836 178709 175511 172084 168757 166276 164868 163710 161865
56642 161865 159617 158184 157967 157832 156584 154532 152930 152299 152023 151357 150065 148275 146489 145638 146269 147626
56626 147626 148261 147594 146210 144813 143938 144598 147684 152236 155644 156545 156516 157890 160742 163195 164120 164350
56610 164350 165327 167506 170088 171894 172679 173843 177135 182288 186853 189066 189834 190909 192321 193119 193588
56595 193588 194705 195966 195887 194677 194281 195438 196685 196878 196818 197401 197868 197287 196484 197026 198925 200630 200917
$$ packed form
56703B99961r959r130q210p535p607q433r273r048p143m006r67M88m38l129n605
56688B09966n956m207k266j626j817j732j579k210l087k600n25J404J923J746
56674A87434J853J631J39j693j863j29J484J299j06j120j184q10l21M17J205J405
56658A89641Q12L5l05l52p24j620k578l073l127l198l427l327k481j408j158j845
56642A61865k248j433k17j35j248k052j602o31k76o66j292j790j786q51O31J357
56626A47626O35o67j384j397q75O60L086M552L408R01k9J374K852K453R25K30
56610A64350R77K179K582J806P85J164L292N153M565K213P68J075J412P98M69
56595A93588J117J261p9j210l96J157J247J93o0N83M67n81q03N42J899J705K87
$$ plain form
56578 200917 199803 197960 196081 194627 193565 192507 191437 190904 191219 192016 192867 193638 193961 193353 192421 192869
56562 192869 195406 198495 200210 200621 201141 202143 202696 202467 202473 203635 205687 207857 209789 211437 212717 213666
56546 213666 214498 215252 215850 216594 218103 220448 222836 224551 225905 227848 230732 233823 236000 236733 236318 235471
56530 235471 234962 235593 237986 241984 246396 249823 251787 252720 252956 252365 251153 250380 251193 253865 257868 262400
56514 262400 266407 268602 268342 266489 264759 264170 264616 265941 268613 272859 277633 281243 283138 284631 287623
56499 287623 292839 299452 306049 311477 314979 316398 316626 317391 319996 324457 330026 336086 342061 346998 350146
56484 350146 351769 352616 352723 351565 349366 347242 345724 343923 340636 335748 330274 325589 322860 322497 323579
56469 323579 324316 323586 321802 319969 318346 316422 313773 310516 307181 304559 303355 303530 304039 303575 301626
$$ packed form
56578B00917j114j843j879j454j062j058j070n33L15P97Q51P71L23o08r32M48
56562A92869K537L089J715M11N20J002N53k29OJ162K052K170J932J648J280R49
56546B13666Q32P54N98P44J509K345K388J715J354J943K884L091K177P33m15q47
56530B35471n09O31K393L998M412L427J964R33K36n91j212p73Q13K672M003M532
56514B62400M007K195k60j853j730n89M46J325K672M246M774L610J895J493K992
56499B87623N216O613O597N428L502J419K28P65K605M461N569O060N975M937L148
56484C50146J623Q47J07j158k199k124j518j801l287m888n474m685k729l63J082
56469C23579P37p30j784j833j623j924k649l257l335k622j204J75N09m64j949
$$ plain form
56454 301626 298864 296644 296042 296949 297958 297544 295464 292772 290626 289615 290055 291941 294251 295211 294014
56439 294014 291874 290785 291401 292508 292386 290412 287521 285365 284804 285100 284711 282827 279936 277097 275217
56424 275217 274836 275915 277741 279707 282212 286169 291574 297312 302407 306654 309989 312330 314330 317272
56410 317272 321756 327215 333052 339261 345529 350833 354699 358109 362438 368064 374434 380789 386330 390526
56396 390526 393893 397814 403085 409296 415856 422542 428590 432612 434344 435330 436860 438192 437904 436088 433981
56381 433981 432183 430528 429086 428113 427427 426840 426598 426406 424808 420820 415552 410884 407039 402769 397454
56366 397454 391535 385210 378279 371223 365047 360019 355720 352230 350064 349021 348402 348287 349254 350816 351592
56351 351592 351344 351427 352730 354318 354692 353392 350832 347529 344139 341544 340177 339654 339441 339481 339784 339847 338870
$$ packed form
56454C01626k762k220o02R07J009m14k080k692k146j011M40J886K310R60j197
56439B94014k140j089O16J107j22j974k891k156n61K96l89j884k891k839j880
56424B75217l81J079J826J966K505L957N405N738N095M247L335K341K000K942
56410C17272M484N459N837O209O268N304L866L410M329N626O370O355N541M196
56396C90526L367L921N271O211O560O686O048M022J732R86J530J332k88j816k107
56381D33981j798j655j442r73o86n87k42j92j598l988n268m668l845m270n315
56366C97454n919o325o931p056o176n028m299l490k166j043o19j15R67J562P76
56351C51592k48Q3J303J588L74j300k560l303l390k595j367n23k13M0L03O3r77
$$ plain form
56334 338870 336489 333226 330355 329108 329608 330732 331383 331758 332970 335790 340192 345615 350958 354740 356245
56319 356245 356401 356782 357940 359384 360841 362603 364809 367319 370150 373232 375913 377638 378958 380875 383302
56304 383302 385233 386366 387371 388425 388719 387905 387127 388032 391263 396123 401170 405034 407367 409256 412205
56289 412205 416540 421269 425507 429426 433711 438569 443377 447033 448827 449325 450102 452175 455080 457939 460658
56274 460658 463348 465416 466565 468173 472121 478310 484709 489925 494395 498940 503606 508518 514614 522673
56260 522673 532265 542280 551982 561142 569585 577118 583766 590067 597183 606252 617086 627929 637288
56247 637288 645680 654796 665275 676237 686746 696594 705723 714011 721778 729627 737630 745418 752981
56234 752981 760530 767608 773323 777634 781602 786202 791574 797536 804215 812035 821391 832294 844203 856763
$$ packed form
56334C38870k381l263k871j247N00J124O51L75J212K820M402N423N343L782J505
56319C56245J56L81J158J444J457J762K206K510K831L082K681J725J320J917K427
56304C83302J931J133J005J054K94q14p78R05L231M860N047L864K333J889K949
56289D12205M335M729M238L919M285M858M808L656J794M98P77K073K905K859K719
56274D60658K690K068J149J608L948O189O399N216M470M545M666M912O096Q059
56260E22673R592J0015R702R160Q443P533O648O301P116R069J0834J0843R359
56247F37288Q392R116J0479J0962J0509R848R129Q288P767P849Q003P788P563
56234G52981P549P078N715M311L968M600N372N962O679P820R356J0903J1909J2560
$$ plain form
56220 856763 870922 888298 908842 930314 951224 973161 998781 1028406 1060262 1093385 1128581
56209 1128581 1166990 1209451 1256868 1309411 1365602 1423877 1484937 1551085 1623638 1702701 1788946
56198 1788946 1883597 1986819 2098057 2217723 2346570 2483592 2626605 2774662 2927736 3084358
56188 3084358 3242098 3400166 3558514 3714031 3860587 3993669 4112259 4215404 4299976 4363207
56178 4363207 4404748 4424687 4422200 4398180 4356972 4303208 4238507 4163178 4079472 3990843 3899073
56167 3899073 3804299 3707226 3609549 3512464 3416103 3320076 3223709 3126241 3027592 2928535 2829798
56156 2829798 2731715 2634754 2539198 2444305 2349438 2256126 2167060 2082581 2000449 1919919 1843721
56145 1843721 1774705 1712527 1655164 1601808 1552580 1506963 1464313 1424814 1388446 1354160 1321366
$$ packed form
56220H56763J4159J7376K0544K1472K0910K1937K5620K9625L1856L3123L5196
56209A128581L8409M2461M7417N2543N6191N8275O1060O6148P2553P9063Q6245
56198A788946R4651J03222J11238J19666J28847J37022J43013J48057J53074J56622
56188C084358J57740J58068J58348J55517J46556J33082J18590J03145Q4572O3231
56178D363207M1541J9939k487k4020m1208n3764o4701p5329q3706q8629r1770
56167C899073r4774r7073r7677r7085r6361r6027r6367r7468r8649r9057r8737
56156B829798r8083r6961r5556r4893r4867r3312q9066q4479q2132q0530p6198
56145A843721o9016o2178n7363n3356m9228m5617m2650l9499l6368l4286l2794
$$ plain form
56134 1321366 1291176 1264978 1242856 1224284 1209032 1196393 1184941 1174040 1164213 1155295 1146064 1136580
56122 1136580 1128736 1123341 1118822 1114224 1111141 1110879 1111968 1112618 1113607 1116464 1120699 1125367 1131666 1141242 1153140
56107 1153140 1165089 1176806 1189652 1204016 1219566 1237136 1257717 1280134 1302225 1324049 1347755
56096 1347755 1374507 1403419 1433212 1463069 1492374 1521471 1552314 1586605 1623659 1661645 1700307
56085 1700307 1740803 1783659 1828882 1877618 1931741 1991989 2058234 2131480 2214226 2309060 2418065
56074 2418065 2543080 2685193 2844301 3019807 3210595 3412976 3619631 3822037 4013445
56065 4013445 4189259 4346843 4486942 4613666 4730667 4837959 4933508 5015722 5081966 5126539
56055 5126539 5143741 5132986 5098964 5047567 4983487 4910107 4828098 4733862 4621854 4489140 4336718
$$ packed form
56134A321366l0190k6198k2122j8572j5252j2639j1452j0901r827q918r231r484
56122A136580p844n395m519m598l083k62J089O50R89K857M235M668O299R576J1898
56107A153140J1949J1717J2846J4364J5550J7570K0581K2417K2091K1824K3706
56096A347755K6752K8912K9793K9857K9305K9097L0843L4291L7054L7986L8662
56085A700307M0496M2856M5223M8736N4123O0248O6245P3246Q2746R4834J09005
56074B418065J25015J42113J59108J75506J90788K02381K06655K02406J91408
56065D013445J75814J57584J40099J26724J17001J07292R5549Q2214O6244M4573
56055E126539J7202j0755l4022n1397o4080p3380q2009r4236j12008j32714j52422
$$ plain form
56044 4336718 4167634 3986146 3798278 3610687 3428571 3255821 3096421 2953691 2828414
56035 2828414 2719144 2623936 2540591 2466500 2400246 2342678 2294828 2255615 2223125 2196927 2177341
56024 2177341 2163566 2154280 2148805 2145967 2143314 2139493 2135944 2134220 2133421 2132540 2133309 2137772 2144611 2151002
56010 2151002 2156797 2163874 2172638 2182321 2193705 2208349 2225832 2244583 2264442 2285660 2306742 2326616
55998 2326616 2347805 2373905 2404610 2436450 2467670 2499170 2531562 2564909 2600794 2641158 2685284
55987 2685284 2730902 2777718 2826897 2878013 2929683 2982368 3037235 3093178 3148330 3203637 3261495
55976 3261495 3321798 3382844 3445002 3509668 3575618 3640473 3705099 3772759 3844778 3920903 4002807
55965 4002807 4092912 4190429 4292809 4400346 4515118 4636334 4761360 4890769 5027823 5173444
$$ packed form
56044D336718j69084j81488j87868j87591j82116j72750j59400j42730j25277
56035B828414j09270r5208q3345p4091o6254n7568m7850l9213l2490k6198j9586
56024B177341j3775r286n475k838k653l821l549j724p99q81P69M463O839O391
56010B151002N795P077Q764R683J1384J4644J7483J8751J9859K1218K1082J9874
55998B326616K1189K6100L0705L1840L1220L1500L2392L3347L5885M0364M4126
55987B685284M5618M6816M9179N1116N1670N2685N4867N5943N5152N5307N7858
55976C261495O0303O1046O2158O4666O5950O4855O4626O7660P2019P6125Q1904
55965D002807R0105R7517J02380J07537J14772J21216J25026J29409J37054J45621
$$ plain form
55955 5173444 5326038 5485687 5654038 5830690 6014157 6205722 6408038 6621012 6843664
55946 6843664 7078628 7329754 7596592 7876559 8171240 8485073 8819235 9172685 9547704
55937 9547704 9948128 10373484 10821508 11295341 11801788 12343990 12922918 13544617 14218218
55928 14218218 14947595 15732294 16575416 17482889 18456618 19496782 20609424 21802983 23078878
55919 23078878 24434632 25874496 27407695 29039500 30776196 32637171 34649634 36832387
55911 36832387 39197086 41763323 44558333 47603851 50920158 54544449 58531468 62939069
55903 62939069 67832687 73304898 79471713 86448223 94345276 103285985 113399650 124799337
55895 124799337 137594597 151934069 168018586 186084872 206413266 229337260 255177832
$$ packed form
55955E173444J52594J59649J68351J76652J83467J91565K02316K12974K22652
55946F843664K34964K51126K66838K79967K94681L13833L34162L53450L75019
55937I547704M00424M25356M48024M73833N06447N42202N78928O21699O73601
55928A4218218P29377P84699Q43122R07473R73729J040164J112642J193559J275895
55919B3078878J355754J439864J533199J631805J736696J860975K012463K182753
55911C6832387K364699K566237K795010L045518L316307L624291L987019M407601
55903F2939069M893618N472211O166815O976510P897053Q940709J0113665J1399687
55895A24799337J2795260J4339472J6084517J8066286K0328394K2923994K5840572
$$ plain form
55888 255177832 284127902 316153792 350780148 386552495 420440671 447989030 464683071
55881 464683071 467837172 457631349 436629369 408399746 376316183 343016548 310324988
55874 310324988 279351128 250672935 224546168 201040766 180088266 161522146 145143097
55867 145143097 130756244 118161246 107145704 97505225 89055356 81621513 75038710
55860 75038710 69170601 63916584 59196748 54941978 51098777 47627119 44487138 41636707
55852 41636707 39042158 36679207 34521402 32538548 30708005 29017118 27453011 25999670
55844 25999670 24645783 23385400 22209476 21105904 20068662 19097474 18187500 17328626
55836 17328626 16516061 15752292 15036893 14363269 13727213 13129862 12569732 12039920 11535890
$$ packed form
55888B55177832K8950070L2025890L4626356L5772347L3888176K7548359J6694041
55881D64683071L154101j0205823k1001980k8229623l2083563l3299635l2691560
55874C10324988l0973860k8678193k6126767k3505402k0952500j8566120j6379049
55867A45143097j4386853j2594998j1015542r640479q449869p433843o582803
55860G5038710n868109n254017m719836m254770l843201l471658l139981k850431
55852D1636707k594549k362951k157805j982854j830543j690887j564107j453341
55844B5999670j353887j260383j175924j103572j037242r71188r09974q58874
55836A7328626q12565p63769p15399o73624o36056n97351n60130n29812n04030
$$ plain form
55827 11535890 11058671 10607873 10178571 9767816 9377595 9008562 8656605 8318043 7992816
55818 7992816 7680514 7378713 7087189 6808591 6543206 6288113 6043025 5811597 5595164
55809 5595164 5390281 5194297 5008394 4833096 4665437 4502622 4344420 4190441 4039329
55800 4039329 3892113 3751966 3618948 3488913 3358850 3229274 3100439 2971006 2842195
55791 2842195 2718767 2603782 2496116 2394650 2300850 2215438 2136517 2063065 1996637 1937645
55781 1937645 1883462 1832267 1785549 1744845 1708996 1676410 1647119 1620835 1595711 1570790 1547272
55770 1547272 1526166 1507188 1490886 1478840 1470686 1463790 1456987 1451661 1448093 1443837 1436909 1427416 1414802
55757 1414802 1396819 1372943 1345841 1317730 1288048 1256226 1223861 1192379 1161292 1130561 1102089
$$ packed form
55827A1535890m77219m50798m29302m10755l90221l69033l51957l38562l25227
55818G992816l12302l01801k91524k78598k65385k55093k45088k31428k16433
55809E595164k04883j95984j85903j75298j67659j62815j58202j53979j51112
55800D039329j47216j40147j33018j30035j30063j29576j28835j29433j28811
55791B842195j23428j14985j07666j01466r3800q5412p8921p3452o6428n8992
55781A937645n4183n1195m6718m0704l5849l2586k9291k6284k5124k4921k3518
55770A547272k1106j8978j6302j2046q154o896o803n326l568m256o928r493j2614
55757A414802j7983k3876k7102k8111k9682l1822l2365l1482l1087l0731k8472
$$ plain form
55746 1102089 1076942 1053453 1029923 1007049 986044 966584 948378 932611 919998 909179 898728
55735 898728 889025 880688 872798 864265 855641 848372 843309 840461 838752 835784 829880 822708 817646 815157
55721 815157 812308 807381 802139 798568 796127 793509 790430 786213 778998 767980 754429 739340 722296
55708 722296 703758 686059 670630 656441 642441 629276 617387 605975 595291 587269 582020 576162
55696 576162 566732 554711 542785 531714 520965 510812 501412 491430 479863 467962 457386 447769
55684 447769 437978 428406 420043 412391 404235 395620 387493 380196 373630 368030 363526 359935 357760 357862
55670 357862 359282 359180 356233 352347 349722 347904 345103 340559 334171 325763 316466 308928 304163 299852
55656 299852 293712 286886 281855 278646 275566 272350 269942 267948 264885 260750 257368 256382 258271 262687
$$ packed form
55746A102089k5147k3489k3530k2874k1005j9460j8206j5767j2613j0819j0451
55735H98728r703q337p890q533q624p269n063k848j709k968n904p172n062k489
55721H15157k849m927n242l571k441k618l079m217p215j1018j3551j5089j7044
55708G22296j8538j7699j5429j4189j4000j3165j1889j1412j0684q022n249n858
55696E76162r430j2021j1926j1071j0749j0153r400r982j1567j1901j0576r617
55684D47769r791r572q363p652q156q615q127p297o566n600m504l591k175J02
55670C57862J420j02k947l886k625j818k801m544o388q408r297p538m765m311
55656B99852o140o826n031l209l080l216k408j994l063m135l382r86J889M416
$$ plain form
55642 262687 268210 272443 273940 273495 272351 270158 266175 261311 257091 253426 249312 245095 242228 241200
55628 241200 241344 242275 244089 246687 250259 255728 263196 270760 276630 281871 289285 299846 311812 323016
55614 323016 332380 339341 343397 344537 343245 340145 336136 332140 327871 321770 313250 304099 296418 290191
55600 290191 284286 278740 274269 270390 266196 262522 261266 262618 264786 266433 267585 268100 267086 264354
55586 264354 261000 258028 255481 253286 251839 251249 250766 249327 246219 241249 235020 229019 224678 222093 220012
55571 220012 217034 212576 207085 201714 197415 193886 189886 184857 179479 174261 168655 162295 156070 150926
55557 150926 146492 142027 137853 134674 132104 129181 125844 122788 120367 118689 118176 118817 119459 119052 118041
55542 118041 117265 116112 113315 109239 105842 104423 104699 105956 107667 108889 108475 106385 103933 102343 101643
$$ packed form
55642B62687N523M233J497m45j144k193l983m864m220l665m114m217k867j028
55628B41200J44R31J814K598L572N469P468P564N870N241P414J0561J1966J1204
55614C23016R364O961M056J140j292l100m009l996m269o101q520r151p681o227
55600B90191n905n546m471l879m194l674j256J352K168J647J152N15j014k732
55586B64354l354k972k547k195j447n90m83j439l108m970o229o001m341k585k081
55571B20012k978m458n491n371m299l529m000n029n378n218n606o360o225n144
55557A50926m434m465m174l179k570k923l337l056k421j678n13O41O42m07j011
55542A18041p76j153k797m076l397j419K76J257J711J222m14k090k452j590p00
$$ plain form
55527 101643 100992 99496 96779 93437 90900 90201 90800 90986 89463 86416 83417 82391 84001 86798 88650
55512 88650 89135 89502 90127 89663 87465 85188 84624 85286 85613 85383 85309 85210 84450 83578 83739 84749 85201 84222 81892
55493 81892 78509 74751 72011 71091 71058 70730 70616 71812 73628 74164 72868 70795 68593 66001 63181 60791
55477 60791 58752 56500 54385 53280 52960 52463 51870 52037 52767 53195 53999 57053 62466 67881 71334 73118
55461 73118 74205 74634 74378 74345 75359 77014 78237 78261 76725 73938 71421 70983 72644 74494 75121 75123 75656
55444 75656 76646 77229 77175 76951 76855 76674 75893 73922 70544 66304 62119 58536 55785 54181 53706 53455 52535
55427 52535 51375 51089 51583 51426 49702 47016 44521 42850 42086 41846 41351 40162 38682 37190 34936 31442
55411 31442 28121 26940 27669 28196 27518 26554 25808 24347 21718 19080 17512 16726 16284 16531 17349 17467 16310
$$ packed form
55527A01643o51j496k717l342k537o99N99J86j523l047k999j026J610K797J852
55512H8650M85L67O25m64k198k277n64O62L27k30p4r9p60q72J61J010M52r79k330
55493H1892l383l758k740r20l3l28j14J196J816N36j296k073k202k592k820k390
55477F0791k039k252k115j105l20m97n93J67P30M28Q04L054N413N415L453J784
55461G3118J087M29k56l3J014J655J223K4j536k787k517m38J661J850O27KN33
55444G5656R90N83n4k24r6j81p81j971l378m240m185l583k751j604m75k51r20
55427E2535j160k86M94j57j724k686k495j671p64k40m95j189j480j492k254l494
55411C1442l321j181P29N27o78r64p46j461k629k638j568p86m42K47Q18J18j157
$$ plain form
55394 16310 15369 16353 18719 20249 19633 17582 15778 15390 16233 16968 16590 15887 16606 18916 20787 20385 18097
55377 18097 15609 13958 13299 13720 15333 17844 20554 22475 22566 20741 18740 18777 20936 23042 23502 23011
55361 23011 22907 23335 23927 24898 26172 26495 24829 22061 20196 20276 21919 24197 25985 26183 24812 23503
55345 23503 23884 25824 28053 29974 31780 33195 33317 31727 28948 25939 23830 23832 26409 30448 34006 36056
55329 36056 37041 37753 38258 38086 37034 35494 33989 32401 29866 25731 20560 15786 12488 10964 11254 13152
55313 13152 15667 17497 18386 19207 20459 21571 22023 22068 21780 20487 17977 15395 14009 13637 13096 11627
55297 11627 9292 6562 4310 3649 5103 8258 12477 17107 20634 21003 17843 13420 10251 8613 7509
55282 7509 7060 8194 10500 12236 12543 12231 12231 12543 12844 12886 11958 9139 4761 857 -473 1221 4790 8655
$$ packed form
55394A6310r41R84K366J530o16k051j804l88Q43P35l78p03P19K310J871m02k288
55377A8097k488j651o59M21J613K511K710J921R1j825k001L7K159K106M60m91
55361B3011j04M28N92R71J274L23j666k768j865Q0J643K278J788J98j371j309
55345B3503L81J940K229J921J806J415J22j590k779l009k109KK577M039L558K050
55329C6056R85P12N05j72j052j540j505j588k535m135n171m774l298j524K90J898
55313A3152K515J830Q89Q21J252J112M52M5k88j293k510k582j386l72n41j469
55297A1627k335k730k252o61J454L155M219M630L527L69l160m423l169j638j104
55282G509m49J134K306J736L07l12%L12L01M2r28k819m378H57d73A221L569L865
$$ plain form
55264 8655 11681 13419 13904 13209 11304 8623 6372 5551 5745 5579 4433 3095 2666 3465 5146 7278
55248 7278 9504 11574 13566 15723 17861 19244 19322 18398 17406 17128 17715 18791 19873 20736 21368 21580 20853
55231 20853 18919 16469 14939 15303 17223 19641 22184 25468 29662 33237 34068 31986 29272 28142 28592
55216 28592 29447 30486 32118 33601 33457 31708 29976 28936 27319 24158 20504 17988 16880 16635 17177
55201 17177 18433 19535 19782 19629 19537 18727 16567 14458 14540 16794 19156 20497 21788 23927 25985 26406
55185 26406 24928 22567 20492 19526 20142 22206 24953 27527 29277 29515 27728 24467 21475 20331 21118
55170 21118 22824 24776 27072 29624 31571 32198 32067 32337 32794 31568 27633 22978 21047 23079 27116
55155 27116 30645 32860 33906 33449 31196 28012 25361 24002 23910 24877 26400 27567 27865 27596 26836 24828
$$ packed form
55264H655L026J738M85o95j905k681k251q21J94j66j146j338m29P99J681K132
55248G278K226K070J992K157K138J383P8r24r92k78N87J076J082Q63O32K12p27
55231B0853j934k450j530L64J920K418K543L284M194L575Q31k082k714j130M50
55216B8592Q55J039J632J483j44j749j732j040j617l161l654k516j108k45N42
55201A7177J256J102K47j53r2q10k160k109Q2K254K362J341J291K139K058M21
55185B6406j478k361k075r66O16K064K747K574J750K38j787l261k992j144P87
55170B1118J706J952K296K552J947O27j31K70M57j226l935m655j931K032M037
55155B7116L529K215J046m57k253l184k651j359r2R67J523J167K98k69p60k008
$$ plain form
55139 24828 21369 17921 16126 15918 16368 17687 20684 24597 27289 27843 27463 27604 28484 29646 30643 30884
55123 30884 30085 29238 29846 31686 32547 30808 27249 23713 21118 19535 19155 19974 21075 21237 20203 18732
55107 18732 17659 17344 17780 18771 19973 20892 20782 18910 15532 12387 11345 12573 14801 17247 20056 22781
55091 22781 24067 23575 22872 23382 24446 24471 23127 21192 19049 16758 15227 15794 18458 21535 23280 23211
55075 23211 21943 20458 19541 19260 18980 18414 18419 20047 23057 26205 28847 31306 33783 35973 37914 40096
55059 40096 42354 43670 43616 43265 44068 46465 50071 54385 58581 61337 61924 61171 60505 60288 59933 59346 59161
55042 59161 59542 59809 59556 59184 58986 58503 57370 56087 55258 54608 53449 51827 50478 49892 50096 51255 53731
55025 53731 57380 61222 64046 65176 64790 63832 63527 64524 66437 68325 69400 69129 67208 64114 61299 60041
$$ packed form
55139B4828l459l448j795k08M50J319K997L913K692N54l80J41Q80J162R97K41
55123C0884p99q47O08J840Q61j739l559l536k595j583l80Q19J101J62j034j471
55107A8732j073l15M36R91J202R19j10j872l378l145j042J228K228K446K809K725
55091B2781J286m92p03N10J064K5j344j935k143k291j531N67K664L077J745o9
55075B3211j268j485r17k81k80n66NJ628L010L148K642K459K477K190J941K182
55059D0096K258J316n4l51Q03K397L606M314M196K756N87p53o66k17l55n87j85
55042E9161L81K67k53l72j98m83j133j283q29o50j159j622j349n86K04J159K476
55025E3731L649L842K824J130l86r58l05R97J913J888J075k71j921l094k815j258
$$ plain form
55009 60041 60239 61038 62324 64519 67028 68208 67336 65534 64171 63327 62530 62003 62139 62334 61490 59595 57986
54992 57986 57931 59445 61442 62774 63182 63451 64404 65747 66434 66164 65698 65466 64927 63860 63092 63008 62484 60675
54974 60675 59079 60105 63831 67775 69869 70253 70093 70194 71170 73459 76336 78026 77671 76400 75689 75493
54958 75493 74862 73691 72733 72219 71639 70938 70956 72143 73450 73173 70969 68544 68087 70193 73638 76975 79706
54941 79706 81803 83009 83328 83643 84875 86778 88371 89387 90331 91193 91183 90005 88429 87190 86148 84968
54925 84968 83778 82600 80907 78564 76643 76345 77267 77586 76114 73552 71497 70624 70273 69717 69371 70292
54909 70292 72577 74977 76513 77968 80941 85624 90345 93285 93840 92340 89562 86900 86010 87446 90199
54894 90199 93193 96682 101563 107756 114056 119296 123126 125936 128666 132381 137308 142370 146282 149100
$$ packed form
55009F0041J98P99J286K195K509J180q72j802j363q44p97n27J36J95q44j895j609
54992E7986n5J514J997J332M08K69R53J343O87k70m66k32n39j067p68q4n24j809
54974F0675j596J026L726L944K094L84j60J01R76K289K877J690l55j271p11j96
54958G5493o31j171r58n14n80p01J8J187J307k77k204k425m57K106L445L337K731
54941G9706K097J206L19L15J232J903J593J016R44Q62j0j178j576j239j042j180
54925H4968j190j178j693k343j921k98R22L19j472k562k055q73l51n56l46R21
54909G0292K285K400J536J455K973M683M721K940N55j500k778k662q90J436K753
54894I0199K994L489M881O193O300N240L830K810K730L715M927N062L912K818
$$ plain form
54880 149100 152259 157163 164139 172580 181513 190071 197887 205115 211806 217372 221000 222318 221243 217573
54866 217573 211473 204089 196687 189154 180354 170290 160869 153828 148660 143489 137492 131498 126506 122654
54852 122654 119664 117261 114828 111563 107595 104312 102922 103077 103479 103454 103280 103384 104118 106196 110287 116004
54836 116004 122168 128455 135920 145345 155852 165941 175315 184650 193759 200972 204504 203865 199874 193965
54822 193965 187574 181430 175007 167151 157718 148253 140560 134785 129363 122875 115524 108719 103562 100052
54808 100052 97511 95261 92780 89685 86137 83098 81651 81877 82707 82935 82168 80891 80042 80493 82349 84639
54792 84639 86293 87496 89289 91660 93081 92519 90811 89130 87105 83896 80468 78952 79700 80634 80034
54777 80034 78622 78035 78332 78080 76434 74053 72076 70927 70300 69858 69611 69630 69632 69173 68418 68257 69244 70688
$$ packed form
54880A49100L159M904O976Q441Q933Q558P816P228O691N566L628J318j075l670
54866B17573o100p384p402p533q800j0064r421p041n168n171n997n994m992l852
54852A22654k990k403k433l265l968l283j390J55M02k5j74J04P34K078M091N717
54836A16004O164O287P465R425J0507J0089R374R335R109P213L532o39l991n909
54822A93965o391o144o423p856r433r465p693n775n422o488p351o805n157l510
54808A00052k541k250k481l095l548l039j447K26Q30K28p67j277q49M51J856K290
54792H4639J654J203J793K371J421n62j708j681k025l209l428j516P48R34o00
54777H0034j412n87K97k52j646k381j977j149o27m42k47J9Km59p55j61R87J444
$$ plain form
54759 70688 71382 71093 70684 70865 71625 72991 75374 78649 81480 82419 81585 80747 81586 84040 86533 87851 88555
54742 88555 90255 93597 97604 101087 103893 106270 107956 108804 109724 111816 114934 118223 121730 126242 131683
54727 131683 137190 142841 149792 158299 167038 175068 183148 192311 202213 211859 221076 230210 239023 246788
54713 246788 252948 256898 257739 255208 250457 245077 239613 233729 227465 221539 216667 213202 211229 210437 210133
54698 210133 209844 209640 209539 209204 208827 209669 212834 217823 223152 228191 233685 240641 249395 259562 270216
54683 270216 280277 289398 298346 307935 317855 327219 335960 344696 353230 360195 364479 366205 365936 363581
54669 363581 358578 350827 340908 329480 316712 302382 286531 270099 254753 241799 231286 222335
54657 222335 214220 206935 200844 196151 192722 190085 187546 184503 180793 176809 173274 170803 169394 168317
$$ packed form
54759G0688O94k89m09J81P60J366K383L275K831R39q34q38Q39K454K493J318P04
54742H8555J700L342M007L483K806K377J686Q48R20K092L118L289L507M512N441
54727A31683N507N651O951Q507Q739Q030Q080R163R902R646R217R134Q813P765
54713B46788O160L950Q41k531m751n380n464n884o264n926m872l465j973p92l04
54698B10133k89k04j01l35l77Q42L165M989N329N039N494O956Q754J0167J0654
54683B70216J0061R121Q948R589R920R364Q741Q736Q534O965M284J726k69k355
54669C63581n003p751r919j1428j2768j4330j5851j6432j5346j2954j0513q951
54657B22335q115p285o091m693l429k637k539l043l710l984l535k471j409j077
$$ plain form
54643 168317 166791 164842 163158 162080 161131 159730 157897 156001 154237 152710 151649 151119 150799 150489 150718
54628 150718 152445 156113 161007 165447 167771 167618 166243 165186 164717 164233 163942 164912 167102 168696 168369 167417
54612 167417 168500 172688 178582 184025 187830 190156 192024 194392 197145 199227 200229 201239 203391 206064
54598 206064 207514 207052 205767 205318 206773 210230 214611 218008 219304 219401 220138 222291 225621 230384 237216
54583 237216 245425 253019 259166 265469 273998 284941 296930 309018 321497 335243 350976 368864
54571 368864 388114 406908 423113 435104 442016 443817 441481 436560 429958 421260 409703 395627 380417
54558 380417 365024 349174 332506 316154 302453 292643 285355 278061 269872 262028 255516 249335 241932
54545 241932 233459 225453 218778 213130 208342 204651 201409 197035 191114 185543 182490 181714 180847 178075 173541
$$ packed form
54643A68317j526j949j684j078r49j401j833j896j764j527j061n30l20l10K29
54628A50718J727L668M894M440K324j53j375j057m69m84k91R70K190J594l27r52
54612A67417J083M188N894N443L805K326J868K368K753K082J002J010K152K673
54598B06064J450m62j285m49J455L457M381L397J296R7P37K153L330M763O832
54583B37216Q209P594O147O303Q529J0943J1989J2088J2479J3746J5733J7888
54571C68864J9250J8794J6205J1991O912J801k336m921o602q698j1557j4076j5210
54558C80417j5393j5850j6668j6352j3701r810p288p294q189p844o512o181p403
54545B41932q473q006o675n648m788l691l242m374n921n571l053p76q67k772m534
$$ plain form
54530 173541 168191 162313 155764 149054 143386 139639 137737 137057 136932 136573 135086 132315 129399 127693 127017
54515 127017 125733 122786 118918 115478 112840 110727 109445 109766 111650 113793 114571 113122 109810 106044 103390
54500 103390 102415 102561 103293 104705 106620 108024 108289 108261 109091 110586 111843 112917 114491 116324 117634 118933
54484 118933 121750 126254 130670 133541 135198 136535 137770 139094 141103 143687 145746 147128 149664 154969
54470 154969 162090 168804 174635 181022 188755 196785 203772 209637 215234 221401 228583 236464 243453 247318
54456 247318 247018 243695 239410 235156 230443 224536 217408 209395 200473 190359 179298 168409 159143 152465
54442 152465 148414 146096 144068 141251 137779 134771 133012 132196 131632 131114 130670 130010 129070 128661 129534 130956
54426 130956 131354 130561 130240 131474 132856 131917 128079 123353 120218 119476 120340 122038 124708 128652 133299 137570
$$ packed form
54530A73541n350n878o549o710n668l747j902o80j25l59j487k771k916j706o76
54515A27017j284k947l868l440k638k113j282L21J884K143P78j449l312l766k654
54500A03390r75J46P32J412J915J404K65k8Q30J495J257J074J574J833J310J299
54484A18933K817M504M416K871J657J337J235J324K009K584K059J382K536N305
54470A54969P121O714N831O387P733Q030O987N865N597O167P182P881O989L865
54456B47318l00l323m285m254m713n907p128q013q922j0114j1061j0889r266o678
54442A52465m051k318k028k817l472l008j759q16n64n18m44o60r40m09Q73J422
54426A30956L98p93l21J234J382r39l838m726l135p42Q64J698K670L944M647M271
$$ plain form
54410 137570 141143 144523 147640 149351 149020 147758 147051 146815 145988 144532 143359 142610 141698 141080 142119 144661
54394 144661 146530 146391 145580 145888 146844 146669 144976 142865 140905 138667 136249 134730 134641 134986 134358 132559
54378 132559 130689 129852 129969 129857 128508 126252 124509 124491 126420 129698 133033 134503 132705 128457 124501
54363 124501 122828 122848 122724 121684 120290 119193 118622 118645 119017 119105 118663 118389 119054 120607 122826 126193 131080
54346 131080 136598 141409 145396 149383 153430 156623 158505 159600 160492 161488 163224 166373 170405 173795 175945
54331 175945 177930 180785 184009 186425 187768 188519 188646 187416 184425 180241 175949 172281 169115 165735 161768
54316 161768 157819 154807 152656 150280 147096 144001 142333 142296 142956 143441 143513 143117 142160 141001 140661 141992
54300 141992 144712 147584 149636 150968 152169 153227 153464 152639 151572 151278 151817 152550 153349 154779 156987 159135
$$ packed form
54410A37570L573L380L117J711l31j262p07k36q27j456j173p49r12o18J039K542
54394A44661J869j39q11L08R56j75j693k111j960k238k418j519q9L45o28j799
54378A32559j870q37J17j12j349k256j743j8J929L278L335J470j798m248l956
54363A24501j673K0j24j040j394j097n71K3L72Q8m42k74O65J553K219L367M887
54346A31080N518M811L987L987M047L193J882J095Q92R96J736L149M032L390K150
54331A75945J985K855L224K416J343P51J27j230k991m184m292l668l166l380l967
54316A61768l949l012k151k376l184l095j668l7O60M85P2l96r57j159l40J331
54300A41992K720K872K052J332J201J058K37q25j067k94N39P33P99J430K208K148
$$ plain form
54284 159135 160467 161351 162573 163925 164447 164155 164497 166449 168782 169291 167506 165087 163288 161209 157451
54269 157451 152574 148526 145836 142842 138182 132802 128678 126339 124760 123290 122431 122469 122362 120782 118013
54254 118013 116097 116820 119725 122310 122190 118964 114156 109762 106979 105827 105375 104422 102437 99960 97936
54239 97936 96867 96846 97977 100163 102805 105319 107662 109552 109655 106862 102253 98330 96015 93835 90598
54224 90598 87312 85456 84729 83831 82490 81252 80025 78367 76821 76417 76965 77222 76758 76432 76950 78130
54208 78130 79753 81936 84328 85963 86393 86197 85988 85752 85553 86063 87708 89782 90962 90490 88619 86264
54192 86264 84553 84285 85384 86920 87864 87831 87192 86692 86901 87733 88606 89272 90172 91589 92822 92949 92149 91388
54174 91388 90821 89546 87287 85462 85791 88226 90845 91772 90961 90094 90856 93249 95696 96819 96813 96821 97444 98477
$$ packed form
54284A59135J332Q84J222J352N22k92L42J952K333N09j785k419j799k079l758
54269A57451m877m048k690k994m660n380m124k339j579j470q59L8j07j580k769
54254A18013j916P23K905K585j20l226m808m394k783j152m52r53j985k477k024
54239I7936j069k1J131K186K642K514K343J890J03k793m609l923k315k180l237
54224I0598l286j856p27q98j341j238j227j658j546m04N48K57m64l26N18J180
54208G8130J623K183K392J635M30j96k09k36j99N10J645K074J180m72j871k355
54192H6264j711k68J099J536R44l3o39n00K09Q32Q73O66R00J417J233J27q00p61
54174I1388n67j275k259j825L29K435K619R27q11q67P62K393K447J123oQO23J033
$$ plain form
54156 98477 99711 101047 101823 101068 98809 96454 95469 96097 97592 99081 99826 99241 97301 94702 92190 89836
54140 89836 87315 84754 82945 82636 83780 85560 87084 87963 88142 87470 85917 84180 83317 83441 83504 82932 82734
54123 82734 84011 85934 86415 84674 81966 79702 78063 76833 76470 77624 80145 83123 85511 86576 86347
54108 86347 85847 86323 87885 89423 89993 89692 89088 88599 88681 89686 91092 91636 90793 89392 88200 86654 83700
54091 83700 79403 74932 71361 69098 68135 68156 68628 69334 70665 72963 75781 78189 79479 79324 77757 75494
54075 75494 73805 73483 74225 75405 76854 78313 78874 77984 76613 76354 77476 78811 79496 79768 79981 79941 79634
54058 79634 79638 80148 80310 79291 77645 76809 77452 78905 80168 80827 80911 80487 79744 79036 78369 77091 74610 71355
54040 71355 68583 67256 67597 69719 73840 79438 84846 88431 89837 89610 88095 85564 82956 81314 80529
$$ packed form
54156I8477J234J336P76p55k259k355r85O28J495J489P45n85j940k599k512k354
54140H9836k521k561j809l09J144J780J524Q79J79o72j553j737q63J24O3n72j98
54123H2734J277J923M81j741k708k264j639j230l63J154K521K978K388J065k29
54108H6347n00M76J562J538N70l01o04m89Q2J005J406N44q43j401j192j546k954
54091H3700m297m471l571k263r63K1M72P06J331K298K818K408J290j55j567k263
54075G5494j689l22P42J180J449J459N61q90j371k59J122J335O85K72K13m0l07
54058G9634MN10J62j019j646q36O43J453J263O59Q4m24p43p08o67j278k481l255
54040G1355k772j327L41K122M121N598N408L585J406k27j515k531k608j642p85
$$ plain form
54025 80529 79752 79137 79933 82510 85521 87730 89606 92077 94534 95338 94081 92316 91957 93574 96175 98150
54009 98150 98506 97646 96884 96901 97010 96323 95230 95120 96929 100546 105317 110373 114615 117234 118431 119187 120287
53992 120287 121847 123561 124931 125531 125723 126905 130209 134920 138949 141008 141759 142796 145277 149631 155700
53977 155700 162648 169361 175442 181443 187810 194192 200237 206426 213405 220917 228202 235214 242534 250077
53963 250077 256853 262378 267529 273317 279333 284189 287315 289510 291677 293848 295706 297346 298868 299788
53949 299788 299646 298894 298193 296864 293090 286233 278228 271957 268505 266617 264572 261866 258956 256072 252863
53934 252863 249004 244620 239844 234320 227744 220954 215777 213280 212593 212092 211326 210849 210481 209093 206453
53919 206453 203881 202316 200789 197899 193980 190457 187610 184436 180719 177769 176665 176868 177218 177542 178541
$$ packed form
54025H0529p77o15P96K577L011K209J876K471K457Q04j257j765l59J617K601J975
54009I8150L56q60p62J7J09o87j093j10J809L617M771N056M242K619J197P56J100
53992A20287J560J714J370O00J92J182L304M711M029K059P51J037K481M354O069
53977A55700O948O713O081O001O367O382O045O189O979P512P285P012P320P543
53963B50077O776N525N151N788O016M856L126K195K167K171J858J640J522R20
53949B99788j42p52p01j329l774o857q005o271l452j888k045k706k910k884l209
53934B52863l859m384m776n524o576o790n177k497o87n01p66m77l68j388k640
53919B06453k572j565j527k890l919l523k847l174l717k950j104K03L50L24R99
$$ plain form
53904 178541 180564 183169 185705 187717 188782 188409 186432 183453 180697 179097 178402 177430 175494 173322 172225
53889 172225 172581 173652 174796 176260 178651 182146 186407 190951 195439 199892 204676 209963 215165 219440
53875 219440 222930 227022 232970 240509 248030 253882 257374 259034 260372 263062 267745 273606 279448 285011
53861 285011 290856 297107 303016 307982 312457 317413 323196 329282 334987 339976 344253 348278 353223 360540
53847 360540 370704 382524 394037 404020 412356 419145 424027 426587 427161 426930 427189 428435 430081 431072
53833 431072 430837 429484 427006 422762 416281 408313 400427 393476 386927 379731 371346 361983 352534 344316
53819 344316 338039 332714 326297 317884 308650 300314 293417 287676 282968 278948 274340 267984 260488 253700
53805 253700 248403 243484 237647 231041 224757 219356 214448 209424 204149 199059 194748 191345 188240 184687
$$ packed form
53904A78541K023K605K536K012J065l73j977k979k756j600o95r72j936k172j097
53889A72225L56J071J144J464K391L495M261M544M488M453M784N287N202M275
53875B19440L490M092N948P539P521N852L492J660J338K690M683N861N842N563
53861B85011N845O251N909M966M475M956N783O086N705M989M277M025M945P317
53847C60540J0164J1820J1513R983Q336O789M882K560N74k31K59J246J646R91
53833D31072k35j353k478m244o481p968p886o951o549p196q385r363r449q218
53819C44316o277n325o417q413r234q336o897n741m708m020m608o356p496o788
53805B53700n297m919n837o606o284n401m908n024n275n090m311l403l105l553
$$ plain form
53791 184687 180682 176997 174313 172573 171208 169784 168360 167349 166904 166344 164519 161124 157394 155020 154535
53776 154535 155256 156532 158270 160214 161621 162075 162087 162459 163306 164114 164499 164606 164723 164736 164048 162242 159906
53759 159906 158477 158906 160686 162620 164359 166573 169695 173198 176229 178410 179871 181109 183059 186689
53745 186689 192114 198421 204654 210562 216190 221339 225918 230459 235647 241456 247224 252563 257815 263580
53731 263580 270100 277198 284588 291963 298736 303913 306725 307690 308707 311518 315962 320187 322626 323302 323119
53716 323119 322563 321462 319481 316245 311371 305074 298695 293856 290826 288161 284255 278912 273069 267350
53702 267350 261565 255672 250403 246364 242929 238787 233553 228158 223632 220259 218024 216928 216340 215018
53688 215018 212652 210666 210381 210843 209744 206266 201738 197469 193365 189116 185480 183559 183592 185090 187548
$$ packed form
53791A84687m005l685k684j740j365j424j424j011m45n60j825l395l730k374m85
53776A54535P21J276J738J944J407M54J2L72Q47Q08L85J07J17J3o88j806k336
53759A59906j429M29J780J934J739K214L122L503L031K181J461J238J950L630
53745A86689N425O307O233N908N628N149M579M541N188N809N768N339N252N765
53731B63580O520P098P390P375O773N177K812R65J017K811M444M225K439O76j83
53716C23119n56j101j981l236m874o297o379m839l030k665l906n343n843n719
53702B67350n785n893n269m039l435m142n234n395m526l373k235j096n88j322
53688B15018k366j986k85M62j099l478m528m269m104m249l636j921L3J498K458
$$ plain form
53673 187548 190371 192780 194456 195823 197209 198311 199070 200329 202757 205553 207103 206773 205284 203579 202091
53658 202091 201133 201252 202985 206520 211499 216752 220566 221898 221295 220172 219300 218538 217762 217271 217252 217637 218677
53641 218677 220911 224214 227402 229237 229549 229128 228940 229761 232093 235761 239599 242059 242505 241905 242137 244468
53625 244468 248510 252567 255108 256026 256521 257829 260179 262839 264834 265518 264781 263183 261955 262475 265272
53610 265272 269378 272880 274413 274116 273051 271822 270155 267833 265602 264742 265837 268251 270763 272499 273294
53595 273294 273391 272941 271851 270153 268390 267306 267080 267153 266985 266590 266052 264945 262921 260764 260112 261862 265252
53578 265252 268793 271740 274377 277167 280111 282863 285151 287060 289058 291693 295021 298397 301058 302874
53564 302874 304259 305462 306453 307643 310183 315037 321816 328911 334789 338974 341935 344434 347075 350241
$$ packed form
53673A87548K823K409J676J367J386J102P59J259K428K796J550l30j489j705j488
53658B02091r58J19J733L535M979N253L814J332o03j123q72p62p76m91j9L85J040
53641B18677K234L303L188J835L12m21j88Q21K332L668L838K460M46o00K32K331
53625B44468M042M057K541R18M95J308K350K660J995O84p37j598j228N20K797
53610B65272M106L502J533k97j065j229j667k322k231q60J095K414K512J736P95
53595B73294R7m50j090j698j763j084k26P3j68l95n38j107k024k157o52J750L390
53578B65252L541K947K637K790K944K752K288J909J998K635L328L376K661J816
53564C02874J385J203R91J190K540M854O779P095N878M185K961K499K641L166
$$ plain form
53550 350241 354297 359745 366872 374988 382333 387283 389701 390823 392092 394609 399240 406067 413604 419738
53536 419738 424006 427966 432863 438105 442854 447781 453724 459592 463503 465615 467875 471008 473702 475174
53522 475174 476511 478539 480122 480007 479002 478699 478898 478059 475913 473972 473397 473774 474313 475036 476171 477314
53506 477314 477967 478467 479733 482172 485214 487871 489484 489916 489310 487925 486222 484838 484161 483985 483834 483571
53490 483571 483476 483918 485402 488642 493802 499697 504665 508468 512346 516863 520878 523415 525509 528974 534053
53475 534053 539579 545120 551519 559251 567594 575795 584137 593328 603466 614090 624888 636047 648166
53462 648166 661844 677064 693006 708833 724586 740940 758340 776929 797063 819001 842144
53451 842144 865435 888732 913023 939046 966361 994088 1021902 1049950 1078406 1107510 1137658
$$ packed form
53550C50241M056N448P127Q116P345M950K418J122J269K517M631O827P537O134
53536D19738M268L960M897N242M749M927N943N868L911K112K260L133K694J472
53522D75174J337K028J583j15j005l03J99q39k146j941n75L77N39P23J135J143
53506D77314O53N00J266K439L042K657J613M32o06j385j703j384o77j76j51k63
53490D83571r5M42J484L240N160N895M968L803L878M517M015K537K094L465N079
53475E34053N526N541O399P732Q343Q201Q342R191J0138J0624J0798J1159J2119
53462F48166J3678J5220J5942J5827J5753J6354J7400J8589K0134K1938K3143
53451H42144K3291K3297K4291K6023K7315K7727K7814K8048K8456K9104L0148
$$ plain form
53440 1137658 1169119 1201949 1236276 1272071 1308539 1344440 1379351 1413976 1448821 1483271 1516549
53429 1516549 1548929 1581232 1613580 1645468 1676795 1707997 1739167 1769745 1799175 1827388 1854748
53418 1854748 1882055 1910481 1940694 1971771 2001592 2028760 2053792 2078105 2102195 2125251 2146262
53407 2146262 2164897 2181305 2195642 2208141 2219226 2229081 2237190 2242729 2245487 2245972 2244417 2240035 2231636
53394 2231636 2218945 2203049 2185640 2167960 2150275 2132011 2112334 2090831 2067743 2043585 2018657
53383 2018657 1992962 1966296 1938341 1909025 1879091 1849897 1822199 1795456 1768784 1742266 1716679
53372 1716679 1692396 1669498 1648749 1631328 1617386 1605900 1596272 1589073 1584744 1582590 1581804 1582622 1585494
53359 1585494 1589709 1593921 1597785 1602177 1608005 1615553 1624837 1635851 1648595 1663566 1681994 1704666 1730593
$$ packed form
53440A137658L1461L2830L4327L5795L6468L5901L4911L4625L4845L4450L3278
53429A516549L2380L2303L2348L1888L1327L1202L1170L0578K9430K8213K7360
53418A854748K7307K8426L0213L1077K9821K7168K5032K4313K4090K3056K1011
53407B146262J8635J6408J4337J2499J1085R855Q109N539K758M85j555m382q399
53394B231636j2691j5896j7409j7680j7685j8264j9677k1503k3088k4158k4928
53383B018657k5695k6666k7955k9316k9934k9194k7698k6743k6672k6518k5587
53372A716679k4283k2898k0749j7421j3942j1486r628p199m329k154p86Q18K872
53359A585494M215M212L864M392N828P548R284J1014J2744J4971J8428K2672K5927
$$ plain form
53346 1730593 1757749 1785224 1813813 1844476 1877269 1912025 1948991 1988228 2029318 2072301 2118082
53335 2118082 2167205 2218980 2272722 2329022 2388634 2450603 2512958 2575248 2639082 2705895 2775309
53324 2775309 2846069 2917432 2988915 3059711 3129417 3198759 3268537 3338069 3405624 3470270 3532397
53313 3532397 3592391 3649647 3703102 3751861 3795017 3831693 3861989 3887330 3909063 3926834 3938945
53302 3938945 3944260 3943208 3936830 3925373 3908141 3884525 3854889 3820388 3781913 3739249 3691466 3638300
53290 3638300 3580972 3521364 3460451 3397984 3333756 3268701 3204352 3141443 3079509 3017818 2956289
53279 2956289 2895385 2835537 2777082 2720452 2665818 2612472 2559175 2505571 2453023 2403664 2358698
53268 2358698 2317785 2279740 2243331 2207617 2172284 2137892 2105417 2075399 2047873 2023117 2001693
$$ packed form
53346A730593K7156K7475K8589L0663L2793L4756L6966L9237M1090M2983M5781
53335B118082M9123N1775N3742N6300N9612O1969O2355O2290O3834O6813O9414
53324B775309P0760P1363P1483P0796O9706O9342O9778O9532O7555O4646O2127
53313C532397N9994N7256N3455M8759M3156L6676L0296K5341K1733J7771J2111
53302C938945N315j052o378j1457j7232k3616k9636l4501l8475m2664m7783n3166
53290C638300n7328n9608o0913o2467o4228o5055o4349o2909o1934o1691o1529
53279B956289o0904n9848n8455n6630n4634n3346n3297n3604n2548m9359m4966
53268B358698m0913l8045l6409l5714l5333l4392l2475l0018k7526k4756k1424
$$ plain form
53257 2001693 1983315 1966281 1948740 1930432 1912661 1896610 1882169 1868401 1854702 1841251 1828583
53246 1828583 1817023 1806634 1797629 1790615 1786183 1784334 1784572 1786496 1789937 1794547 1799927 1806432 1815259 1827121
53232 1827121 1841169 1855819 1870474 1885923 1903156 1922413 1943514 1966632 1992369 2021042 2051888
53221 2051888 2083061 2112784 2140781 2168328 2196603 2225161 2252232 2276161 2296310 2312993 2327145
53210 2327145 2339814 2351363 2361108 2368048 2371752 2372270 2369571 2363663 2354985 2344057 2330851 2315065 2296850
53197 2296850 2276760 2255162 2232241 2208276 2183184 2156108 2126247 2094039 2060656 2026500 1991083
53186 1991083 1954347 1917090 1880025 1843315 1807135 1771745 1736903 1702364 1669104 1638802 1611554
53175 1611554 1585257 1557947 1529862 1502666 1477609 1455051 1434591 1414728 1393445 1370297 1347198
$$ packed form
53257B001693j8378j7034j7541j8308j7771j6051j4441j3768j3699j3451j2668
53246A828583j1560j0389r005p014m432j849K38J924L441M610N380O505Q827J1862
53232A827121J4048J4650J4655J5449J7233J9257K1101K3118K5737K8673L0846
53221B051888L1173K9723K7997K7547K8275K8558K7071K3929K0149J6683J4152
53210B327145J2669J1549R745O940L704N18k699n908q678j0928j3206j5786j8215
53197B296850k0090k1598k2921k3965k5092k7076k9861l2208l3383l4156l5417
53186A991083l6736l7257l7065l6710l6180l5390l4842l4539l3260l0302k7248
53175A611554k6297k7310k8085k7196k5057k2558k0460j9863k1283k3148k3099
$$ plain form
53164 1347198 1326150 1307024 1288766 1271810 1257508 1245598 1234174 1222301 1210989 1201091 1191715 1181518
53152 1181518 1170405 1158940 1146853 1133218 1117823 1101498 1085112 1068887 1052795 1037036 1021717
53141 1021717 1006336 990081 972891 955823 939969 925192 910536 895800 881807 868879 856050
53130 856050 842478 828700 815438 801883 786609 769911 753657 738641 723590 707390 690993
53119 690993 676130 663071 650795 638788 627459 616968 606786 596645 587019 578241 569811 561177
53107 561177 552751 545386 538832 531465 522019 511232 501250 493484 487530 482078 476189 469488 461959 454180
53093 454180 447339 442292 438731 435683 432415 428332 422534 414618 405792 398043 391975 386460 380736 375753
53079 375753 372750 371406 370279 368504 366126 363238 359876 356610 354158 352226 349699 346347 343547 342657
$$ packed form
53164A347198k1048j9126j8258j6956j4302j1910j1424j1873j1312r898r376j0197
53152A181518j1113j1465j2087j3635j5395j6325j6386j6225j6092j5759j5319
53141A021717j5381j6255j7190j7068j5854j4777j4656j4736j3993j2928j2829
53130H56050j3572j3778j3262j3555j5274j6698j6254j5016j5051j6200j6397
53119F90993j4863j3059j2276j2007j1329j0491j0182j0141r626q778q430q634
53107E61177q426p365o554p367r446j0787r982p766n954n452n889o701p529p779
53093D54180o841n047l561l048l268m083n798p916q826p749o068n515n724m983
53079C75753l003j344j127j775k378k888l362l266k452j932k527l352k800q90
$$ plain form
53065 342657 343199 343319 341841 339294 337015 335818 335513 335152 333498 329761 324278 318355 313207 309151 305855
53050 305855 302940 300105 297159 294447 292844 292599 292466 290886 288015 285564 284318 282873 279513 274549 269936
53035 269936 267061 265742 264992 263843 261627 258369 254996 252451 250604 248659 246515 244914 244306 244464 245403
53020 245403 247722 251581 256019 259816 262551 264440 265641 266199 266329 266382 266722 267802 269927 272621 274711
53005 274711 275415 275078 274534 274092 273488 272510 271213 269707 268021 266082 263646 260531 257013 253610 250326 246678
52989 246678 242729 239376 237013 234466 230164 224194 218344 214040 210902 207539 203203 198337 193906 190597
52975 190597 188554 187455 186620 185236 182804 179589 176397 173694 171205 168790 167359 168070 170559 172913 173755
52960 173755 173537 173208 172547 170803 168315 166239 164781 162807 159443 155263 151660 149652 149498 150777 152550
$$ packed form
53065C42657N42J20j478k547k279j197l05l61j654l737n483n923n148m056l296
53050C05855k915k835k946k712j603k45j33j580k871k451j246j445l360m964m613
53035B69936k875j319p50j149k216l258l373k545j847j945k144j601o08J58R39
53020B45403K319L859M438L797K735J889J201N58J30N3L40J080K125K694K090
53005B74711P04l37n44m42o04r78j297j506j686j939k436l115l518l403l284l648
52989B46678l949l353k363k547m302n970n850m304l138l363m336m866m431l309
52975A90597k043j099q35j384k432l215l192k703k489k415j431P11K489K354Q42
52960A73755k18l29o61j744k488k076j458j974l364m180l603k008j54J279J773
$$ plain form
52945 152550 153862 154420 154580 154746 155220 156534 159195 162869 166351 168609 169501 169492 169254 169546 170647 171571 170652
52928 170652 167534 163933 161796 161264 161201 161148 161621 162635 163188 162666 161876 162062 163375 164925 165957 166317 165928
52911 165928 164593 162549 160727 160039 160607 161952 163720 165869 168262 170512 172293 173518 174206 174492 174788
52896 174788 175519 176596 177584 178520 180023 182345 184977 187591 190597 193991 196465 196933 196591 197925 201586
52881 201586 205690 208681 211311 214786 218276 219881 219478 219027 220081 222338 224850 227509 230762 234731 239298
52866 239298 244603 250852 257823 264945 271733 277924 283358 288004 292042 295782 299510 303314 306801 309026
52852 309026 309124 307301 304972 303628 303576 303942 303830 303242 302730 302331 301230 298676 294949 290941 286930 282483
52836 282483 277812 274419 273633 274884 276171 276068 274613 272477 270223 268439 267634 267581 267450 266975 266911 267921
$$ packed form
52945A52550J312N58J60J66M74J314K661L674L482K258Q92rk38K92J101R24r19
52928A70652l118l601k137n32o3n3M73J014N53n22p90J86J313J550J032L60l89
52911A65928j335k044j822o88N68J345J768K149K393K250J781J225O88K86K96
52896A74788P31J077R88R36J503K322K632K614L006L394K474M68l42J334L661
52881B01586M104K991K630L475L490J605m03m51J054K257K512K659L253L969M567
52866B39298N305O249O971P122O788O191N434M646M038L740L728L804L487K225
52852C09026R8j823k329j344n2L66j12n88n12l99j101k554l727m008m011m447
52836B82483m671l393p86J251J287j03j455k136k254j784q05n3j31m75o4J010
$$ plain form
52820 267921 269543 270706 270852 270089 268667 266899 265385 264770 265244 266475 267971 269465 271251 274042 277854
52805 277854 280982 281085 277908 274121 272614 273513 274770 275103 275085 275583 276564 277777 279365 281124 282040 281414
52789 281414 280019 279403 280258 282030 284009 286176 288802 291561 293485 293932 293426 293175 293658 294080 293509 292170
52773 292170 291113 290919 291401 292341 293623 294531 293792 290860 286766 283341 281834 282245 283482 283994 282856 280552
52757 280552 278346 276794 275485 274296 273970 274931 276346 277096 277120 276987 276639 275492 273632 272000 271391 271962
52741 271962 273665 276300 278906 279943 278830 277068 277160 280177 284589 287710 288220 286977 285388 283656 281028
52726 281028 277182 272372 266532 259561 252613 247670 245178 243345 240692 238033 236607 235446 232563 228234
52712 228234 225003 224222 224383 223359 220684 216824 211681 205058 197825 191604 187601 186261 187315 189437 190585
$$ packed form
52820B67921J622J163J46p63j422j768j514o15M74J231J496J494J786K791L812
52805B77854L128J03l177l787j507Q99J257L33j8M98R81J213J588J759R16o26
52789B81414j395o16Q55J772J979K167K626K759J924M47n06k51M83M22n71j339
52773B92170j057j94M82R40J282R08p39k932m094l425j507M11J237N12j138k304
52757B80552k206j552j309j189l26R61J415P50K4j33l48j147j860j632o09N71
52741B71962J703K635K606J037j113j762R2L017M412L121N10j243j589j732k628
52726B81028l846m810n840o971o948m943k492j833k653k659j426j161k883m329
52712B28234l231p81J61j024k675l860n143o623p233o221m003j340J054K122J148
$$ plain form
52697 190585 189685 187752 186553 186367 185732 183278 179214 175058 172264 171097 170527 169303 167177 164854 162833
52682 162833 160988 159415 158796 159357 160151 160066 159034 157666 156240 154696 153006 150744 147001 141857 137466
52667 137466 136268 138128 140474 141427 141629 142685 144932 147405 149218 150264 150963 151815 152848 153277 152090
52652 152090 149230 145808 143014 141295 140604 140739 141137 141123 140783 140988 142063 143088 142969 141662 139781 137738
52636 137738 135965 135333 136320 138017 138844 138155 136503 134605 132842 131542 130835 130254 129383 128831 129621 131499
52620 131499 132881 132814 132109 132058 132794 133466 133433 132766 132125 132611 135134 139288 143283 145605 146332 146401 146176 145527
52602 145527 144852 144980 146258 148476 151508 155143 158490 160626 162016 164265 168094 172402 175769 178133 180341
52587 180341 182638 184364 184928 184465 183540 182513 181182 179031 176039 173216 171850 172108 172928 173430 173701 173877
$$ packed form
52697A90585r00j933j199j86o35k454m064m156k794j167n70j224k126k323k021
52682A62833j845j573o19N61P94q5j032j368j426j544j690k262l743n144m391
52667A37466j198J860K346R53K02J056K247K473J813J046O99Q52J033M29j187
52652A52090k860l422k794j719o91J35L98j4l40K05J075J025j19j307j881k043
52636A37738j773o32R87J697Q27o89j652j898j763j300p07n81q71n52P90J878
52620A31499J382o7p05n1P36O72l3o67o41M86K523M154L995K322P27O9k25o49
52602A45527o75J28J278K218L032L635L347K136J390K249L829M308L367K364K208
52587A80341K297J726N64m63r25j027j331k151k992k823j366K58Q20N02K71J76
$$ plain form
52571 173877 173384 171865 170179 169484 169670 169740 169500 169764 170797 171676 171520 170401 168460 165001 159403 152638
52555 152638 147054 144552 145316 148156 151559 154330 155865 156310 156430 156924 157689 157932 157210 156183 156007 157045
52539 157045 158668 160349 162230 164278 165720 166156 166667 168653 171715 173851 173972 173137 172897 173529 174557 176020
52523 176020 178154 180409 182009 183314 185505 188787 191802 193192 193097 192645 192452 192166 191365 190420 190292 191608
52507 191608 194094 196961 199751 202570 205502 208218 210411 212296 214209 215892 216716 216707 216834 218059 220385
52492 220385 223043 225368 227138 228121 227727 225487 221889 218475 216817 217347 219297 221634 223733 225196 225708
52477 225708 225458 225321 226059 227558 229260 231096 233377 235875 237827 238991 239989 241208 241984 241469 239931 238572
52461 238572 238211 238655 239253 239446 238816 237302 235677 235246 236515 238387 239256 238834 238476 239548 241881 244054
$$ packed form
52571A73877m93j519j686o95J86P0k40K64J033Q79j56j119j941l459n598o765
52555A52638n584k502P64K840L403K771J535M45J20M94P65K43p22j027j76J038
52539A57045J623J681J881K048J442M36N11J986L062K136J21q35k40O32J028J463
52523A76020K134K255J600J305K191L282L015J390r5m52j93k86q01r45j28J316
52507A91608K486K867K790K819K932K716K193J885J913J683Q24rJ27J225K326
52492B20385K658K325J770R83l94k240l598l414j658N30J950K337K099J463N12
52477B25708k50j37P38J499J702J836K281K498J952J164R98J219P76n15j538j359
52461B38572l61M44N98J93o30j514j625m31J269J872Q69m22l58J072K333K173
$$ plain form
52445 244054 244904 244495 243761 243563 244131 245119 245999 246430 246447 246319 246235 246075 245567 244623 243473 242330 241062 239482
52427 239482 238079 237962 239601 241865 243040 242867 242917 244677 247975 251633 254946 257766 259758 260620 260851 261257
52411 261257 261663 261036 259078 256865 255552 255225 255398 255877 256603 257164 257049 256110 254529 252838 252169 253630 256825
52394 256825 259598 260024 258263 255848 253742 251961 250617 250114 250364 250815 251356 252305 253353 253509 252515 251597
52378 251597 252202 254470 257423 260276 262942 265413 267251 267990 267823 267580 267967 268898 269805 270501 271382 272677
52362 272677 273970 274696 274716 274154 273242 272737 273780 276498 279204 279997 278938 277713 277329 277348 277358 277757 278516 278334
52344 278334 275970 271775 267249 263651 261709 261988 264544 268364 271860 273933 274291 273219 271621 270881 271773
52329 271773 273509 274507 274162 273395 273487 274821 276780 278357 278739 277749 276038 274680 274350 274917 275801 276602 277347
$$ packed form
52445B44054Q50m09p34j98N68R88Q80M31J7j28q4j60n08r44j150j143j268j580
52427B39482j403j17J639K264J175j73N0J760L298L658L313K820J992Q62K31M06
52411B61257M06o27j958k213j313l27J73M79P26N61j15r39j581j691o69J461L195
52394B56825K773M26j761k415k106j781j344n03K50M51N41R49J048J56r94r18
52378B51597O05K268K953K853K666K471J838P39j67k43L87R31R07O96Q81J295
52362B72677J293P26K0n62r12n05J043K718K706P93j059j225l84J9J0L99P59j82
52344B78334k364m195m526l598j942K79K556L820L496K073L58j072j598p40Q92
52329B71773J736R98l45p67R2J334J959J577L82r90j711j358l30N67Q84Q01P45
$$ plain form
52312 277347 278299 279740 281998 285454 290086 294826 297970 298906 299169 300982 304751 308721 311207 312198 312593
52297 312593 312900 313353 314304 315688 316797 317518 319048 322285 326105 328572 329511 330545 332719 335542 338452
52282 338452 341691 345145 347729 348899 349847 352216 356229 360808 364935 368099 370020 371043 372579 376116
52268 376116 381557 387159 391320 394080 396916 401433 408202 416474 424853 432417 439263 446115 453761 462940
52254 462940 474031 486393 498551 509800 521343 535119 551690 570015 589088 608878 629535
52243 629535 650600 671374 691480 710861 729949 750131 773242 799967 829185 859289 889571
52232 889571 919844 949539 978116 1005909 1033517 1060579 1086192 1110475 1134635 1159234 1183427
$$ packed form
52312B77347R52J441K258L456M632M740L144R36K63J813L769L970K486R91L95
52297C12593L07M53R51J384J109P21J530L237L820K467R39J034K174K823K910
52282C38452L239L454K584J170R48K369M013M579M127L164J921J023J536L537
52268C76116N441N602M161K760K836M517O769Q272Q379P564O846O852P646R179
52254D62940J1091J2362J2158J1249J1543J3776J6571J8325J9073J9790K0657
52243F29535K1065K0774K0106J9381J9088K0182K3111K6725K9218L0104L0282
52232H89571L0273K9695K8577K7793K7608K7062K5613K4283K4160K4599K4193
$$ [...]
##END NTUPLES=NMR SPECTRUM
##END=
