
##TITLE=AC1140_caturra_5906454_nBuGbDpnWz
##JCAMPDX= 6.0         $$ Bruker NMR JCAMP-DX V2.0
##DATA TYPE= NMR SPECTRUM
##DATA CLASS= NTUPLES
##ORIGIN= BRUKER
##OWNER= Administrator
$$ 1.72 TOPSPIN		Version 2.1
$$ 2012-04-10 10:15:41.125 -0500  Administrator@TOPSPIN
$$ Compression mode = diff/dup
##.OBSERVE FREQUENCY= 400.13188235
##.OBSERVE NUCLEUS= ^1H
##.ACQUISITION MODE= SIMULTANEOUS (DQD)
##.ACQUISITION SCHEME= undefined
##.AVERAGES= 64
##.DIGITISER RES= 22
##SPECTROMETER/DATA SYSTEM= spect
##.PULSE SEQUENCE= noesygpps1d.comp
##.SOLVENT NAME= COFFEE_meoh
##.SHIFT REFERENCE= INTERNAL, COFFEE_meoh, 1, 14.96838
##AUDIT TRAIL= $$ (NUMBER, WHEN, WHO, WHERE, PROCESS, VERSION, WHAT)
$$ ##TITLE= Audit trail, TOPSPIN		Version 2.1
$$ ##JCAMPDX= 5.01
$$ ##ORIGIN= Bruker BioSpin GmbH
$$ ##OWNER= Administrator
$$ $$ C:\Bruker\TOPSPIN/data/COFFEE/nmr/AC1140_caturra_5906454_nBuGbDpnWz/12/pdata/1/auditp.txt
$$ ##AUDIT TRAIL=  $$ (NUMBER, WHEN, WHO, WHERE, PROCESS, VERSION, WHAT)
(   1,<2012-04-04 14:02:22.390 -0500>,<Administrator>,<TOPSPIN>,<go>,<TOPSPIN 2.1>,
      <created by zg
	started at 2012-04-04 13:50:50.718 -0500,
	POWCHK enabled, PULCHK disabled,
       configuration hash MD5:
       1A 1E CE 29 27 FD 77 03 67 4E F0 E3 C4 B2 CB 90
       data hash MD5: 64K
       FE E7 CB 39 8B 73 76 B2 0E 52 95 0A 8F 4E 72 74>)
(   2,<2012-04-04 14:02:25.171 -0500>,<Administrator>,<TOPSPIN>,<proc1d>,<TOPSPIN 2.1>,
      <Start of raw data processing
       efp LB = 0.3 FT_mod = 6 PKNL = 1 PHC0 = 0 PHC1 = 0 SI = 128K 
       data hash MD5: 128K
       A8 22 C2 69 F8 CF A4 3D 69 4C B5 21 62 3E 1D 13>)
(   3,<2012-04-04 14:02:26.406 -0500>,<Administrator>,<TOPSPIN>,<proc1d>,<TOPSPIN 2.1>,
      <pk PHC0 = 34.04663 PHC1 = 0 
       data hash MD5: 128K
       29 03 AC B4 8C B5 37 5F 4C 0D A8 36 13 69 A0 E9>)
(   4,<2012-04-04 14:02:26.859 -0500>,<Administrator>,<TOPSPIN>,<proc1d>,<TOPSPIN 2.1>,
      <abs ABSG = 1 
       data hash MD5: 128K
       D1 E0 19 DB 70 AB DE C6 8B 7A 5C CD 4F 3E 22 66>)
(   5,<2012-04-04 14:02:26.937 -0500>,<Administrator>,<TOPSPIN>,<proc1d>,<TOPSPIN 2.1>,
      <abs ABSG = 2 
       data hash MD5: 128K
       5B 48 65 42 19 0B D7 AE 5A 13 A6 80 4B 07 76 79>)
(   6,<2012-04-04 14:02:26.984 -0500>,<Administrator>,<TOPSPIN>,<proc1d>,<TOPSPIN 2.1>,
      <abs ABSG = 3 
       data hash MD5: 128K
       4F 8F E4 C7 76 9C 0F AB AD 58 F3 95 98 6D 92 8E>)
(   7,<2012-04-04 14:02:27.046 -0500>,<Administrator>,<TOPSPIN>,<proc1d>,<TOPSPIN 2.1>,
      <abs ABSG = 4 
       data hash MD5: 128K
       4F 46 9B 6D D0 25 18 90 5C 10 5C E5 49 42 78 25>)
(   8,<2012-04-04 14:02:27.093 -0500>,<Administrator>,<TOPSPIN>,<proc1d>,<TOPSPIN 2.1>,
      <abs ABSG = 5 
       data hash MD5: 128K
       13 36 DB 80 D8 24 CF 99 15 5B 83 0A 52 1D 47 61>)
(   9,<2012-04-04 14:02:27.328 -0500>,<Administrator>,<TOPSPIN>,<audit>,<TOPSPIN 2.1>,
      <user comment:
       ICON-NMR User ID: COFFEE
       data hash MD5: 128K
$$ [...]
##$TP07= 0
##$TPNAME0= <>
##$TPNAME1= <>
##$TPNAME2= <>
##$TPNAME3= <>
##$TPNAME4= <>
##$TPNAME5= <>
##$TPNAME6= <>
##$TPNAME7= <>
##$TPOAL= (0..7)
0.5 0.5 0.5 0.5 0.5 0.5 0.5 0.5
##$TPOFFS= (0..7)
0 0 0 0 0 0 0 0
##$TUNHIN= 0
##$TUNHOUT= 0
##$TUNXOUT= 0
##$USERA1= <user>
##$USERA2= <user>
##$USERA3= <user>
##$USERA4= <user>
##$USERA5= <user>
##$V9= 5
##$VALIST= <valist>
##$VCLIST= <CCCCCCCCCCCCCCC>
##$VD= 0
##$VDLIST= <DDDDDDDDDDDDDDD>
##$VPLIST= <PPPPPPPPPPPPPPP>
##$VTLIST= <TTTTTTTTTTTTTTT>
##$WBST= 2048
##$WBSW= 25
##$XGAIN= (0..3)
0 0 0 0
##$XL= 0
##$YL= 0
##$YMAX_a= 13706167
##$YMIN_a= -6066131
##$ZGOPTNS= <>
##$ZL1= 120
##$ZL2= 120
##$ZL3= 120
##$ZL4= 120
##$ABSF1= 14.96838
##$ABSF2= -5.58415
##$ABSG= 5
##$ABSL= 3
##$ALPHA= 0
##$AQORDER= 0
##$ASSFAC= 0
##$ASSFACI= 0
##$ASSFACX= 0
##$ASSWID= 0
##$AUNMP= <proc_prof1d_extract.lims>
##$AXLEFT= 0
##$AXNAME= <>
##$AXNUC= <1H>
##$AXRIGHT= 0
##$AXTYPE= 0
##$AXUNIT= <>
##$AZFE= 0.1
##$AZFW= 0.1
##$BCFW= 0
##$BC_mod= 0
##$BYTORDP= 0
##$COROFFS= 0
##$CY= 15
##$DATMOD= 1
##$DC= 0
##$DFILT= <>
##$DTYPP= 0
##$F1P= 0
##$F2P= 0
##$FCOR= 0.5
##$FTSIZE= 131072
##$FT_mod= 6
##$GAMMA= 0
##$GB= 0
##$INTBC= 1
##$INTSCL= 1
##$ISEN= 128
##$LB= 0.3
##$LEV0= 0
##$LPBIN= 0
##$MAXI= 10000
##$MC2= 0
##$MEAN= 0
##$ME_mod= 0
##$MI= 0
##$NCOEF= 0
##$NC_proc= -3
##$NLEV= 6
##$NOISF1= 0
##$NOISF2= 0
##$NSP= 0
##$NTH_PI= 0
##$NZP= 0
##$OFFSET= 14.96838
##$PC= 1
##$PHC0= 34.04663
##$PHC1= 0
##$PH_mod= 1
##$PKNL= yes
##$PPARMOD= 0
##$PPDIAG= 0
##$PPIPTYP= 0
##$PPMPNUM= 2147483647
##$PPRESOL= 1
##$PSCAL= 4
##$PSIGN= 0
##$PYNMP= <proc.py>
##$REVERSE= no
##$SF= 400.130004894466
##$SI= 131072
##$SIGF1= 0
##$SIGF2= 0
##$SINO= 400
##$SIOLD= 131072
##$SPECTYP= <>
##$SREGLST= <1H.CDCl3>
##$SSB= 0
##$STSI= 131072
##$STSR= 0
##$SW_p= 8223.68421052632
##$SYMM= 0
##$S_DEV= 0
##$TDeff= 65536
##$TDoff= 0
##$TI= <>
##$TILT= no
##$TM1= 0
##$TM2= 0
##$TOPLEV= 0
##$USERP1= <user>
##$USERP2= <user>
##$USERP3= <user>
##$USERP4= <user>
##$USERP5= <user>
##$WDW= 1
##$XDIM= 131072
##$YMAX_p= 492584433
##$YMIN_p= -264333905
##$CURPLOT= <Network HP LaserJet P1505>
##$CURPRIN= <$Network HP LaserJet P1505>
##$DFORMAT= <normdp>
##$LAYOUT= <+/1D_H.xwp>
##$LFORMAT= <normlp>
##$PFORMAT= <normpl>
##$SURQMSG= 1
$$ End of Bruker specific parameters
$$ ---------------------------------
##NTUPLES= NMR SPECTRUM
##VAR_NAME=  FREQUENCY,     SPECTRUM/REAL,   SPECTRUM/IMAG
##SYMBOL=    X,             R,               I
##VAR_TYPE=  INDEPENDENT,   DEPENDENT,       DEPENDENT
##VAR_FORM=  AFFN,          ASDF,            ASDF
##VAR_DIM=   131072,        131072,          131072
##UNITS=     HZ,            ARBITRARY UNITS, ARBITRARY UNITS
##FACTOR=    0.0627417313425165, 1,          1
##FIRST=     8223.62146879498, 7591,         -92464
##LAST=      0,             10755,           -91659
##MIN=       0,             -264333905,      0
##MAX=       8223.62146879498, 492584433,    0
$$ Real data points
##PAGE= N=1
##DATA TABLE= (X++(R..R)), XYDATA
$$ [...]
66852 4007333 4052436 4096448 4139903 4184057 4228854 4272369 4313155 4352322 4392300 4433984 4476124
66841 4476124 4517332 4557555 4597272 4636096 4672874 4706963 4738907 4769737 4799756 4828111 4853606
66830 4853606 4876015 4896564 4916997 4938138 4959325 4979130 4996499 5011279 5023865 5034547 5043290
66819 5043290 5050083 5055307 5059535 5063030 5065580 5066758 5065975 5062245 5054513 5042723 5028296 5012923 4996827
66806 4996827 4978716 4957475 4933352 4907219 4879335 4849484 4818017 4786028 4754473 4723606 4693215
66795 4693215 4662689 4630645 4595346 4556268 4515032 4474084 4434403 4394897 4354050 4311677 4268875
66784 4268875 4226567 4184400 4141030 4095404 4047754 3999385 3951566 3904720 3858554 3812441 3765546
66773 3765546 3717269 3668292 3620788 3576584 3534971 3493162 3449138 3403366 3357480 3312220 3267350
66762 3267350 3222957 3179801 3138453 3098687 3059678 3020383 2979909 2938105 2895709 2853457 2811247
66751 2811247 2768696 2726367 2685644 2647282 2610798 2575437 2541011 2507362 2473722 2439323 2404359
66740 2404359 2369642 2335370 2300780 2265227 2229195 2194022 2160814 2129889 2101185 2074762 2050467
66729 2050467 2027147 2002849 1976371 1948514 1921249 1895679 1871296 1847237 1823378 1799771 1775743
66718 1775743 1750464 1724151 1697865 1672237 1647247 1623237 1601110 1581119 1562333 1543966 1526364
66707 1526364 1509740 1492620 1473012 1451154 1429718 1410815 1393842 1376965 1359590 1342338 1325358
66696 1325358 1308159 1290925 1274491 1258767 1242445 1224933 1207610 1192355 1179484 1167947 1156957
66685 1156957 1146421 1136043 1125116 1113338 1100999 1088183 1074545 1060246 1046434 1034213 1023485
66674 1023485 1013279 1003001 992878 983273 974045 964715 954936 944710 934352 924407 915419 907489 899962
66661 899962 891646 881573 869803 857581 846564 837600 830072 822466 813714 804052 794526 785684 777018
66648 777018 767916 758910 751447 746174 741915 736866 730666 724616 719760 715384 709910 702882 695350 688445
66634 688445 682323 676724 671769 667575 663510 658576 652458 645612 638453 631164 624285 618633 614248 610119
66620 610119 605384 600184 594870 589183 583006 577283 573007 569622 565594 560582 555874 552458 549791 546860
66606 546860 543426 539585 535012 529475 523553 518033 513069 508592 505042 502789 501103 498579 494572 489592
66592 489592 484348 479151 474263 470105 466856 464294 462302 461183 461274 462339 463392 463118 460691 456445 451616
66577 451616 447165 443015 438542 433424 427756 421882 416712 413684 413360 414073 412911 408419 401899 395940 392140
66562 392140 390320 389200 387463 384687 381712 379885 379634 379969 379541 377922 375636 373250 370765 367800 364125
66547 364125 360085 356504 353964 352141 350198 347963 346335 346077 346520 346054 343933 341090 338884 337548 336438
66532 336438 335570 335924 337809 339649 339267 336155 331672 327116 322493 317458 312522 308745 306834 306952 308758
66517 308758 311054 312080 310979 308606 306229 303907 300907 297267 293902 291374 289478 287966 286733 285371
66503 285371 283445 281286 279645 278486 276951 274652 272102 269721 267334 264980 263272 262486 261999 261230 260519
66488 260519 260514 261092 261401 260739 259032 256649 253966 250963 247253 242825 238603 235788 234702 234814 235649 236869
66472 236869 237622 236976 235269 233974 233797 233806 232892 231195 229561 228482 228205 229021 230616 231758 231439 229882 227911
66455 227911 225978 224399 223639 223391 222118 218706 214213 210841 209400 208881 208441 208581 210125 212907 215855
66440 215855 217714 217451 214654 210133 205864 203807 204540 206908 208973 209511 208782 207897 207555 207723 208340 209496
66424 209496 210564 209999 206833 202106 198123 196314 196212 196351 195718 194415 193263 192769 192501 191729 190568 189881
66408 189881 189988 190255 190245 190323 190628 190343 188811 186632 184867 183738 182899 182248 181538 179841 176524 172386 168894
66391 168894 166758 166142 167448 170526 173701 175148 174996 174634 174316 173248 171978 172548 175617 179193 181155
66376 181155 181574 181550 181137 179848 178355 178046 178990 179457 177692 173661 168976 165435 163575 162505 161163 159552
66360 159552 158452 158209 158526 159274 160614 162190 163129 163122 162710 162239 161409 160182 159168 158542 157506 155547 153453
66343 153453 152250 151731 150927 149640 148687 148827 150131 152216 154484 156147 156529 155474 153443 151389 150433 151036
66327 151036 152351 153022 152867 153012 154024 154789 153945 151671 149206 147160 145324 143807 143331 144259 146037 147759
66311 147759 148852 149225 149098 148732 148247 147860 148197 149639 151151 150667 147391 143069 140137 139149 138953 138803 138968
66294 138968 139359 139010 137415 135449 134332 134209 134223 133542 131958 129765 127456 125396 123661 122301 121715 122443
66278 122443 124552 127495 130570 133162 134575 134212 132316 130243 129548 130633 132399 133376 133172 132734 133088 134099
66262 134099 134856 135111 135568 136450 136494 134157 129610 124915 122145 121777 122875 124392 126068 128211 130789 132959
66246 132959 133825 133614 133584 134504 135677 135793 134304 131649 128649 126177 124920 124789 124887 124602 124287 124292 123968 122618
66228 122618 120965 120449 121173 121713 121034 119434 117451 115174 113190 112930 114988 117771 118941 117994 116737 117279
66212 117279 120105 123929 126881 127855 127166 126114 125813 126431 127380 127913 127435 125820 123771 122469 122374 122587 121878
66195 121878 120279 119125 119404 120407 120345 118260 115100 112805 112520 113923 116096 118395 120221 120775 119920 118919
66179 118919 119263 120663 121131 119362 116267 113828 113199 114269 116154 117324 116065 112022 107177 104392 104918
66164 104918 107794 111392 114657 116992 118024 117935 117340 116459 114922 112795 111192 111226 112646 114134 114903 115409
66148 115409 116341 117439 117732 116792 115260 113997 113013 111672 109867 108434 108057 108179 107598 106071 104688 104519
66132 104519 105489 106955 108793 111160 113506 114706 114407 113595 113494 114307 115374 116151 116591 116869 117310 118403
66116 118403 120256 122089 122829 122389 121851 122128 122840 122878 121801 120353 119631 119938 120466 120143 118946 118137 118766
66099 118766 120075 120111 118042 115083 112815 111430 110285 109369 109179 109566 109808 109738 109806 109993 109613 108398 107031
66082 107031 106407 106977 108749 111068 112351 111255 108567 106858 107600 109532 110597 110448 110040 109720 109274 109286
66066 109286 110594 112302 112065 109071 105420 103560 103375 102926 101404 99942 99675 100286 100809 100858 100544 99949 99363
66049 99363 99558 100970 102809 103718 103325 102497 102003 101692 101229 100866 100903 100955 100497 99760 99280 98818 97612 95746
66031 95746 94320 93966 93966 93332 92134 91199 90898 90843 90635 90367 90385 90865 91741 92967 94795 97515 100526 102022
66013 102022 100521 96864 93738 92701 92630 91942 91421 93382 98289 103679 106829 107397 106903 106533 106341 106132
65997 106132 106155 106758 107802 108695 108976 108749 108473 108310 107896 106900 105506 104087 102703 101374 100515 100393 100318 99288
65979 99288 97560 96733 97893 100398 102908 104858 106288 106964 106637 105915 105893 106832 107871 108224 108067 108066 108475 109058
65961 109058 109663 110541 112056 114202 116466 118245 119318 119773 119571 118613 117333 116602 116653 116586 115547 114006 113116
65944 113116 112966 112384 110597 108279 106656 106215 106679 107604 108517 108895 108597 108068 107706 107358 106881 106804 107668 108852
65926 108852 108889 107200 104953 103792 104045 104550 104085 102635 101219 100751 101315 102472 103884 105232 105697 104293
65910 104293 101239 98544 98434 101106 104523 106450 106227 104596 102605 101063 100462 100752 101375 101927 102592 103566
65894 103566 104451 104797 105076 106343 108820 111459 113147 113782 113821 113307 111976 110084 108459 107689 107759 108569 110202
65877 110202 112336 113872 113832 112668 112138 113553 116341 118587 118891 117532 115898 115061 114931 114705 113971 113304
65861 113304 113580 114703 115419 114709 113103 111933 111429 110408 108238 106220 106122 107791 109340 109743 110126 111995
65845 111995 115034 117536 118557 118760 119203 120158 121288 122291 122881 122555 120891 118045 114710 111681 109625
65830 109625 109073 110164 112326 114468 115740 116115 116182 116386 116451 115605 113450 110586 108168 106823 106251 106002 106208
65813 106208 107074 108031 108118 107229 106241 105688 105046 103813 102581 102286 102921 103863 105216 107619 110621 112381 111630
65796 111630 109164 106739 105145 104180 103934 104856 106486 107289 106408 104934 104720 106114 107623 107846 107163 107070 108163
65779 108163 109403 109587 109043 109316 111276 114048 115998 116422 116077 116341 118053 120892 123539 124664 124037 122667
65763 122667 121685 121270 120820 119819 118307 116800 116155 117166 119738 122583 124273 124613 124564 124981 125943 127130
65747 127130 128161 128516 127916 127001 126940 128053 129452 130414 131368 132897 134400 134739 133956 133374 133804 134364 133542
65730 133542 131080 128471 127637 129196 131921 133785 133645 131972 130105 129069 129131 129936 130641 130317 128915 127695
65714 127695 127979 129359 129939 128647 126561 125312 124742 123154 119734 115739 112891 111410 110262 108855 107617
65699 107617 107003 106795 106690 106895 107538 107916 106997 104640 101805 99530 98211 97879 98520 99756 100748 100973 100803
65682 100803 100837 100864 100109 98461 96738 95544 94500 93091 91869 92057 93929 96146 97098 96666 96280 97229 99204
65665 99204 100648 100391 98695 96769 95520 94926 94478 93934 93516 93515 93867 94198 94211 93950 93666 93493 93312 92899 92111
65646 92111 90994 89826 89019 88780 88836 88775 88869 90245 93738 98569 102703 104773 105244 105340 105295 104368 102418 100591
65628 100591 100082 100849 101970 102802 103321 103764 104562 106313 109051 111750 113260 113628 113666 113404 112153 110257 109388
65611 109388 110348 111779 112124 111948 112885 114837 115836 114633 112029 109411 107337 106038 106056 107448 109071 109570
65595 109570 108644 106808 104419 101682 99187 97634 97048 96870 96804 97091 97858 98552 98220 96396 93804 92117
65579 92117 92593 94732 96586 96619 95043 93276 92510 93017 94305 95459 95688 95067 94543 94866 95708 96184 96009
65562 96009 95716 95919 96758 97978 99185 100023 100296 99960 99130 98418 99018 101608 104926 106403 104857 101816 99411
65545 99411 97742 95437 92314 90040 90062 92024 94473 96251 96861 96308 95069 93747 92447 90910 89263
65530 89263 88083 87564 87191 86472 85413 84174 82762 81295 80061 79238 79037 80040 82606 85787 87741 87576
65514 87576 86029 84058 81762 79226 77435 77331 78558 80091 81643 83478 85197 85806 85009 83552 82271
65499 82271 81641 82238 84564 87897 90081 89335 86164 83032 82156 83818 86676 89333 91391 93157 94743
65484 94743 95837 96309 96632 97463 99034 101011 102607 102735 100728 97416 94988 94911 96180 96415 94657 92210
65468 92210 90605 89693 88281 85867 82962 80125 77594 75814 75475 76708 78763 80837 82939 85527 88434
65453 88434 90608 91103 90183 89214 89458 91069 93261 95179 96331 96353 94982 92679 90926 91205 93465 96056
65437 96056 97477 97891 98569 100165 102110 103578 104379 104703 104596 104085 103442 102840 101985 100423 98095 95365 92814
65420 92814 91228 91258 92514 93445 92927 91675 91251 91884 92370 92096 91843 92169 92324 91695 91286 92502 94979 96862
65402 96862 97034 96059 95099 94980 96277 99018 101864 102644 100524 97050 94450 93416 93118 92867 92816 93149 93512
65385 93512 93598 93758 94512 95671 96376 96096 95313 95006 95531 96323 96779 97195 98536 101205 104333 106340 106166 103956
65367 103956 100821 98106 96785 97158 98814 100861 102426 103118 103006 102178 100604 98665 97516 98330 101031
65352 101031 104168 106230 106811 106475 105937 105622 105564 105391 104709 103755 103341 103893 105023 106360 108165 110579 112821
65335 112821 113905 113698 112607 110775 108617 107561 108792 111369 113115 113618 114854 118273 122707 126064 127926
65320 127926 129403 131363 133973 137286 141052 144416 146914 149388 152845 156874 160358 163346 166746 170358
65306 170358 172894 174260 176342 180894 187905 196620 206851 218242 229382 239041 247710 256580 265180
65293 265180 271206 272847 270415 265546 259552 252780 244934 235600 224768 213148 201836 191573 182363
65280 182363 173774 165530 158029 152371 149469 148754 148168 145976 142371 138766 135940 133648 131622 129742 127208
65265 127208 122949 117436 112816 110382 108810 106044 102121 98781 96750 95123 93538 93289 95481 99226
65251 99226 102677 105114 106965 108285 108446 107376 106065 105368 104793 102965 99192 94402 90557 89126 90015
65236 90015 91948 93756 95012 95489 94721 92573 89696 86772 83672 80137 76963 75543 76286 78462 81619
65221 81619 85872 90459 93452 93990 93816 95249 98060 99643 98168 94424 90528 87888 86731 86685 87213 87953
65205 87953 88962 90352 91653 92094 91611 90957 90655 90508 90333 90483 91197 92037 92530 93019 94403 97163 100829
65188 100829 104121 105633 104934 103148 101909 101639 101534 101179 100988 100736 99183 96140 93592 93344 94536 95135
65172 95135 95073 95822 97198 97027 94550 91999 91571 92382 91897 89407 86637 85452 86197 88049 89832 90450 89435
65155 89435 87472 86049 86438 88886 92288 94529 93885 90836 87981 87511 88936 89898 88878 86459 84234
65140 84234 83303 83876 85587 87791 89701 90425 89220 86275 83224 81995 82605 82951 81564 79791 80195 83294
65124 83294 87128 89678 90388 89463 87299 85006 84143 85084 86520 87105 86837 86376 85931 85507 85328 85158 83956
65107 83956 81270 78458 77490 78773 81032 83081 84681 85795 86185 86076 86286 87246 88502 89518 90375 91289
65091 91289 92080 92672 93598 95301 97204 98266 98389 98517 99237 100005 100123 99879 100099 100906 101603 101700 101526 101741
65073 101741 102772 104764 107523 110191 111464 110665 108504 106497 105678 105946 106413 106257 105523 105219 106312 108443
65057 108443 110126 110487 110249 110629 111894 113645 115802 118315 120330 120828 120078 119360 119180 118817 117821 116849 116646
65040 116646 117237 118624 121244 125013 128829 131896 134798 138314 141933 144744 147362 151565 157930 165008
65026 165008 171111 176024 180512 184988 189285 193316 197336 201602 206021 210090 213099 214622 214898 214522 213706
65011 213706 212113 209493 206147 202526 198627 194027 188378 181596 173751 165188 156803 149752 144516 140369
64997 140369 136046 130905 125266 119865 115495 113079 113171 114901 116129 115424 113505 111981 111095 109755 107569
64982 107569 105507 104287 103352 102040 100769 100283 100476 100750 100879 100766 99962 98362 96947 96914 98203 99591
64966 99591 100009 99180 97421 95661 95286 96945 99614 101657 102608 103038 103032 102032 100154 98280 96534 93925
64950 93925 90103 86378 84128 83016 81747 80128 79389 80533 83067 85465 86504 86129 85329 85238 86262 87967
64934 87967 89627 90669 90865 90566 90621 91519 92616 92874 92376 92275 93050 93759 93532 92993 93293 94244 94344 92565
64916 92565 89474 86585 85088 85109 85735 85810 85072 84442 84958 86620 88573 90057 90697 90282 89056 88054 88279
64899 88279 89461 90403 90658 90955 91656 91834 90780 89696 90608 93645 96452 96687 94356 91272 88911 87450
64883 87450 86471 85707 85002 84219 83514 83375 84062 85099 85502 84554 82447 80306 79426 80211 81835 83120 83593
64866 83593 83490 83113 82844 83578 86112 89753 92360 92387 90467 88562 88026 88954 90786 92864 94650 96050
64850 96050 97314 98298 98352 97377 96309 95730 94709 92154 88882 87092 87869 90308 92981 94997 95633 94373
64834 94373 91779 89237 87417 85939 84715 84274 84362 83748 82235 81444 82412 83694 83338 81860 81487 82891
64818 82891 84437 84728 84298 84405 85379 86794 88291 89614 90424 90718 91063 92000 93462 95038 96474 97660
64802 97660 98391 98518 98206 97792 97450 97132 96848 96814 97222 97853 98124 97720 97133 97239 98276 99475 99834 99027 97540
64783 97540 96199 95677 96041 96639 96681 96031 95124 94221 93286 92589 92578 92909 92431 90728 88933 88397 89104 90012 90405
64764 90405 90256 89826 89627 90239 91415 91955 91341 90863 91981 94040 94877 93493 90873 88262 86064 84656
64748 84656 84896 87165 90724 94466 97599 99333 98850 96184 92590 89657 88462 89482 92431 95968 98558
64733 98558 100074 101729 104083 106043 106358 105213 103784 103042 103535 105344 107449 108101 106793 105129 104661 104735
64717 104735 103758 101888 100805 101090 101610 101711 102326 104226 106499 107686 107511 106614 105341 103857 102999 103866
64701 103866 106478 109589 111922 113186 113908 114723 115822 116630 116083 113802 110996 109536 109813 110172 109046 107151
64685 107151 106719 108634 111183 111934 110257 107609 105785 105394 105765 105802 105059 104329 105046 107691 110944 112911
64669 112911 113032 112286 111657 111193 110675 110332 110370 110375 109761 108534 107234 106423 106573 107903 109758 110583 109315 106690
64651 106690 104397 103056 101846 100180 98721 98221 98162 97406 95885 94771 94987 96252 97787 99311 100921
64636 100921 102413 103326 103558 103510 103536 103664 103945 104674 105911 107006 107047 105866 104408 104014 105340 107837 110104
64619 110104 110861 109838 107805 105721 104014 102820 102551 103642 105760 107834 109075 109602 109901 110132 110268 110410
64603 110410 110415 109568 107425 104923 103875 104938 106662 107138 106310 105939 107287 109609 111371 112280 113203 114186 113749
64586 113749 110798 106580 103834 104083 106464 109169 111244 112805 114254 115885 117765 119477 120205 119534 117944
64571 117944 116078 113867 111042 108349 107304 108391 110162 110721 109603 107608 105193 102168 99107 97846
64557 97846 99542 102769 104695 104163 102630 101898 102030 102182 102432 103633 105861 108212 110068 111491 112307 111882
64541 111882 110188 108180 106690 105743 105339 106031 107989 110291 111940 112973 113680 113367 111216 108180 106699
64526 106699 108136 111383 114362 116124 117052 117649 117873 117463 116464 115377 114880 115197 115735 115716 115196 115005 115513
64509 115513 115972 115492 114298 113549 114067 115573 117096 117824 117658 117195 117100 117395 117553 117410 117597 118709 120435
64492 120435 121997 123217 124448 125585 125958 125431 124851 125005 125718 126502 127454 128761 129694 129109 126947 124343
64476 124343 122074 119772 117112 114968 114588 115979 117774 118524 117602 115201 112216 110021 109511 110155 110619 110490
64460 110490 110763 112319 114625 116568 118078 120108 122980 125450 125739 123277 119260 115587 113378 112447 112016
64445 112016 111732 111810 112296 112597 111990 110495 108978 108284 108367 108357 107510 106020 104702 103882 102981 101506 100124 100148
64427 100148 101962 104511 106442 107233 107001 105958 104645 104294 105985 109286 112250 113187 112307 111422 112097 114286
64411 114286 116706 118209 118478 117552 115363 112190 109178 107767 108550 111000 114121 116873 118307 118185 117585
64396 117585 118010 119597 120955 121134 120881 121392 122573 123342 123176 122559 122231 122734 124306 126441 127703 126812 124001
64379 124001 120847 118846 118552 119718 121570 123113 123865 124232 124670 124816 124140 123081 122516 122313 121495 119895
64363 119895 118505 117900 117450 116561 115676 115369 115384 115494 116585 119647 123879 126936 127444 126562 126553 128168 129961
64346 129961 130127 128408 125854 123221 120540 118287 117803 119662 122301 123451 122705 121617 121359 121456 121101 120545
64330 120545 120602 121500 122833 124116 125023 125596 126485 128353 130705 131974 131219 129211 127564 127331 128613 130614
64314 130614 131715 130522 127576 125214 125050 126412 127946 129728 132613 136272 139302 140927 141430 141068 139725
64299 139725 137503 134740 131559 128304 126120 125987 127291 128448 128895 129387 130439 131709 133118 135280 138363
64284 138363 141442 143468 144216 144132 144049 145053 147481 149849 149984 147651 144904 143337 142309 140738 139361 139854
64268 139854 142393 145455 147760 149318 150636 151761 152224 151497 149613 147618 147045 148512 151247 154241 157215
64253 157215 160020 161985 162769 163172 164145 165522 166718 168144 170694 174126 177198 179302 180774 181664 181485
64238 181485 180384 179313 178644 177699 176163 174958 175195 177086 180409 185051 190314 194523 196403 196594 197036
64223 197036 199108 203020 208684 216187 225125 234031 240978 244894 246343 246967 247929 248964 249139 248339 247393
64208 247393 246734 245686 243360 239647 234994 229818 224575 219770 215362 210739 205868 201944 200166 200303 201234
64193 201234 202496 204340 206553 208289 209155 209521 209512 208570 206491 204304 203545 204845 207489 210153 211929 212858
64177 212858 213656 214898 216628 218921 222386 227404 233027 237505 240266 242741 246717 252233 257561 261090
64163 261090 262791 263823 264967 265741 265200 263457 261930 261712 262135 261510 259116 255827 252888 250726 248963
64148 248963 246961 244305 241376 239393 239079 239401 238772 237686 238759 243328 249214 253060 254117 254504 256323
64133 256323 259882 264445 269157 273012 275188 275985 276667 277981 279557 280999 282649 284755 286682 287684 287952
64118 287952 288167 288298 287624 285891 283887 282693 282704 283470 284273 284728 284974 285410 286299 287629 289231 290944 292884
64101 292884 295797 300944 309070 319333 329718 338816 346967 355537 365474 376854 389384 402732 416368
64088 416368 429670 442475 455383 469318 484791 501678 519670 538771 559050 579828 599559
64077 599559 617014 632489 647201 661250 672750 679406 680664 677853 672451 664787 654418 641239
64065 641239 625881 609209 591777 573830 555720 538187 522122 508127 496384 486736 478586 470830
64053 470830 462487 453650 445503 439199 435064 433028 433171 435351 438829 443035 448387 455519 463813 471622
64039 471622 478052 483691 489425 495468 501990 509753 519203 529453 539056 547648 556149 565521 575925 586840
64025 586840 597247 605824 611879 616243 620397 624412 626480 624884 619689 612011 602430 591120 579152
64012 579152 568382 559669 551900 543316 533488 523635 515179 508380 502453 496815 491941 488834 487800 488027
63998 488027 488510 489092 490419 493180 497650 503676 510669 517831 524940 532862 542779 554813 567856 580863
63984 580863 593996 608402 625110 644100 664047 683073 700387 717300 735994 757009 778510
63973 778510 798355 816258 833266 849608 863990 875063 882926 888878 894099 899010 903908 909793 918063
63960 918063 929277 942689 957456 973923 992980 1014386 1036765 1059415 1083011 1107970 1133072
63949 1133072 1156470 1177377 1195936 1212123 1225758 1237137 1246722 1254581 1261075 1267615 1275615 1285020
63937 1285020 1295146 1306740 1321758 1341020 1363634 1389141 1418742 1453536 1492754 1534749 1578958
63926 1578958 1626038 1676885 1732538 1794483 1863850 1940399 2023073 2111494 2206245 2307773 2415716
63915 2415716 2529614 2650082 2779197 2919523 3072240 3236117 3409001 3590761 3784359
63906 3784359 3993941 4222711 4473168 4748352 5051716 5386237 5754834 6161614 6611927
63897 6611927 7111324 7665305 8279906 8961453 9715089 10543460 11446099 12418955 13454420
63888 13454420 14542786 15674319 16839698 18028424 19226993 20418015 21579937 22687317
63880 22687317 23712406 24627952 25409983 26039800 26505119 26799684 26920931 26867253 26637364
63871 26637364 26231871 25655193 24916967 24033359 23027375 21926437 20758163 19547628 18317150
63862 18317150 17086347 15871407 14685454 13540737 12449835 11423918 10470388 9592919
63854 9592919 8792895 8069607 7419515 6836796 6315069 5848334 5430777 5056836 4721651
63845 4721651 4420863 4150185 3905931 3685744 3487719 3308652 3144194 2991057 2848184
63836 2848184 2715335 2591438 2474978 2365198 2261936 2164546 2071734 1982330 1895699 1811655
63826 1811655 1730582 1653457 1580973 1512499 1446503 1382159 1320145 1261756 1207716 1157946 1111912
63815 1111912 1068838 1028007 989284 953225 920361 890517 863021 837292 812931 789558 767097
63804 767097 746174 727713 711999 698361 685746 673315 660645 648012 636655 628176 623100 620164
63792 620164 617357 613508 608656 603329 598134 593987 591852 591621 591581 589727 585779 581374 577837 574137 567784
63777 567784 557814 546048 534886 524585 513650 501524 489504 478672 468179 456498 443630 431087
63765 431087 420046 410455 401708 393178 384078 373714 362285 350827 340184 330492 321717 313994 307224
63752 307224 301096 295813 292054 289686 287209 283228 278006 272818 268186 263695 259333 255807 253256 250692
63738 250692 247411 244254 242609 242472 242348 241067 238885 236585 234306 231787 229193 226928 224840 222398 219601
63723 219601 216939 214345 211057 206988 203471 201901 202088 202678 202827 202591 201956 200607 198846 197782 198087 199200
63707 199200 200162 200672 200870 200635 199724 198354 197033 195884 194551 192738 190578 188512 187064 186703 187644 189683
63691 189683 192158 194107 194790 194418 194204 195130 196737 197814 198274 199423 201960 204635 205775 205604 206077 208568
63675 208568 212430 215895 217851 218661 219560 221273 223168 224233 224991 227586 233219 240145 245368 248031 250083
63660 250083 253624 258674 263715 267365 269155 269480 269320 269523 270162 270955 272143 274100 276134 276902 276355 276051
63644 276051 276972 278163 278359 277833 277434 276716 274541 271193 268378 267114 266800 266398 265346 263092 259007 253450
63628 253450 248118 244670 243406 243551 244196 244534 243892 242226 240289 238833 237902 237277 237166 237983 239802 242587
63612 242587 246605 251857 257253 261259 263651 265987 269909 275286 280514 284411 287253 289684 291117 289979
63598 289979 285749 280263 276262 274759 274474 273931 273215 273103 273356 273035 272260 272408 274208 276723 278858 281043
63582 281043 284452 289093 293881 298595 304509 312465 321241 328813 334960 341686 350977 362851 375782 388446
63568 388446 400648 413022 426391 441300 457756 475418 494233 514637 536968 561016 586541
63557 586541 613822 643063 673535 704263 735583 769041 805359 843278 880963 917790 954016
63546 954016 989199 1021764 1049900 1072205 1087832 1096864 1100429 1099701 1094991 1086631 1076524 1067467 1060560
63533 1060560 1054270 1046464 1036326 1023698 1007745 987556 963533 937041 908898 879339 849400 821171
63521 821171 796264 774749 755940 739508 725337 712842 701147 689926 679651 670995 664157 658760
63509 658760 654289 650557 647747 646032 645460 646431 650001 657154 667767 680773 695526 712473 732230
63496 732230 754440 778090 802809 829367 858813 891381 926322 962573 999430 1036524 1073153
63485 1073153 1107667 1137695 1161227 1177574 1187366 1191822 1192156 1189514 1185086 1179936 1174714 1169567 1164254
63472 1164254 1158170 1150203 1138850 1122821 1101639 1075569 1045089 1010730 973367 934105 893603 852060
63460 852060 810334 770601 735025 703717 674743 646267 618077 590921 565305 541631 520779
63449 520779 503449 488998 475764 462796 450577 439770 429882 419820 409522 400341 393616 389258
63437 389258 385990 382712 379223 375754 372335 368931 365881 363786 363002 363495 365112 367622 370484 373005 374956
63422 374956 376824 379254 382367 385665 388436 390246 391324 392512 394487 396810 398147 397724 396251 395026
63408 395026 394411 393710 392329 390425 388379 386304 384427 383469 384157 386463 389609 392819 395870 399066 402923
63393 402923 407847 413765 420011 425830 431250 437331 445314 455477 466933 478525 489688 500453 510979
63380 510979 521420 532161 543972 557904 575053 596043 620305 646192 672524 700172 731384
63369 731384 767212 806158 845926 885988 927771 972590 1020301 1070017 1121301 1174194 1228528
63358 1228528 1283589 1338145 1390452 1438474 1480507 1515493 1542641 1561130 1570700 1572407 1568298 1560285
63346 1560285 1549644 1537425 1524589 1511274 1496347 1478231 1456082 1429808 1399222 1363860 1323771
63335 1323771 1279980 1233943 1187014 1140638 1096384 1055143 1016637 980435 947190 918087 893158
63324 893158 871045 850680 832439 817345 805936 798433 795193 796107 800006 805502 812196 820432 830429
63311 830429 842674 858786 880431 907043 935896 965058 995253 1028094 1063544 1100303 1138024
63300 1138024 1177679 1219752 1263295 1307045 1350390 1392582 1431620 1464640 1489430 1505464 1513695
63289 1513695 1515442 1511264 1501058 1485639 1467863 1451116 1436439 1422048 1406046 1388464 1369796 1348625
63277 1348625 1322294 1289689 1252023 1210920 1167146 1121621 1076361 1033549 994256 958517 925903
63266 925903 895442 865863 836809 809427 785059 763788 744849 727865 712840 699411 687095
63255 687095 675969 666193 657178 648233 639810 632920 627427 622225 617330 614384 614420 616164 617327 616816 614965
63240 614965 612316 609087 605471 601761 598285 595493 593582 591767 588664 584087 579794 577626 577321 577025 575624
63225 575624 573684 572301 571940 572536 573938 575902 578069 580162 582072 583778 585351 586855 588095 588836 589546
63210 589546 591435 595305 600727 606784 613123 619682 625918 631195 635759 640536 646075 652207 658497 664448
63196 664448 669690 674724 681054 689592 699237 708038 715582 723108 731501 740523 750112 761021 773760 788036
63182 788036 803659 820937 839741 859340 879753 902128 927126 953911 981520 1010200 1040524
63171 1040524 1072117 1104320 1137336 1171674 1207071 1242949 1279262 1315785 1351269 1384785 1417507
63160 1417507 1451586 1487219 1522260 1555036 1586196 1617243 1648332 1678201 1705377 1728590 1746624
63149 1746624 1758721 1765055 1766114 1761717 1751206 1734719 1713687 1689741 1663441 1634656 1604183 1574286
63137 1574286 1546945 1521906 1497396 1472999 1450999 1434338 1423924 1418677 1417737 1421599 1431096 1446192
63125 1446192 1466117 1490219 1518403 1550972 1588104 1629218 1672837 1717363 1762084 1807253 1853243
63114 1853243 1899780 1945849 1990157 2031938 2071600 2110291 2148536 2185560 2220138 2251382 2278088
63103 2278088 2297981 2308840 2310225 2303087 2287699 2263153 2229162 2187232 2139400 2086591 2028925 1967117
63091 1967117 1902832 1837919 1773833 1711685 1652347 1596434 1544297 1495993 1451419 1410799 1374853
63080 1374853 1343869 1316608 1291001 1266354 1244229 1226637 1213735 1203715 1194491 1185055 1175622 1167098
63068 1167098 1160244 1154858 1149869 1144558 1139472 1135805 1134121 1134077 1135065 1136631 1138382 1140051 1141658 1143352 1145247
63053 1145247 1147686 1151414 1156923 1163644 1170192 1175462 1179302 1182273 1185124 1188394 1192119 1195858 1199176 1202026
63039 1202026 1204515 1206597 1208364 1210399 1213347 1217322 1222153 1228014 1235174 1243177 1250866 1257404 1262858 1267789
63025 1267789 1272742 1278195 1284423 1291250 1298369 1306020 1314806 1324687 1334807 1344694 1355075 1367088 1381180
63012 1381180 1397355 1415943 1437261 1460577 1484275 1507410 1530724 1555911 1584180 1615648 1649787
63001 1649787 1685994 1723716 1762376 1801543 1841416 1882986 1927362 1974696 2024078 2074698 2126895
62990 2126895 2181662 2239362 2299456 2361414 2425203 2490589 2556626 2622424 2688112 2754359 2821044
62979 2821044 2886994 2951308 3014402 3077379 3140638 3203504 3265165 3325570 3385274 3444358 3501410
62968 3501410 3553524 3597653 3632386 3658310 3676190 3684919 3681855 3665364 3636419 3597303 3549444 3493385
62956 3493385 3430639 3364401 3298020 3233483 3171895 3114878 3064622 3022676 2989360 2964557 2948661
62945 2948661 2942609 2947231 2962649 2987972 3021549 3061972 3109085 3163638 3225671 3293586 3365219 3439450
62933 3439450 3516039 3594106 3671747 3747617 3822151 3896439 3970111 4040974 4106598 4165490 4216612
62922 4216612 4258513 4289531 4308469 4314516 4306509 4282700 4241330 4181350 4102909 4007651 3898441
62911 3898441 3778192 3648692 3511038 3367413 3221831 3078399 2939054 2803773 2673032
62902 2673032 2549064 2434086 2327965 2228690 2135081 2048014 1968652 1896483 1829990 1768671 1713236
62891 1713236 1663762 1618733 1576378 1536225 1498755 1464056 1431622 1401192 1373017 1347214 1323432
62880 1323432 1301249 1280365 1260326 1240620 1221368 1203437 1187410 1172657 1157776 1141797 1124684
62869 1124684 1106996 1089482 1072816 1057079 1041445 1024995 1008200 993168 981856 974081 967699 960743
62857 960743 953026 945559 938922 932614 925799 918184 910137 902391 895789 890959 887910 886006 884457 882723
62843 882723 880497 877730 874970 873172 872652 872444 871266 869000 866691 865178 864400 864050 864021 863937 862898 860291
62827 860291 856410 851944 847350 843092 839862 837819 836030 833469 830337 827609 825473 823009 819442 814935
62813 814935 810138 805736 802512 800892 800003 797987 793799 788204 782571 777262 771742 765653 759064 752041
62799 752041 744772 737986 732519 728377 724742 720901 716771 712626 708857 705931 703942 702039 698897 694137
62785 694137 688998 685291 683811 683823 683886 683073 681587 680388 680139 680589 681138 681828 683328 685983 689370 692970
62769 692970 696702 700525 703990 706703 708881 710910 712585 713400 713570 714120 715841 718645 722174 726563 732165
62754 732165 738733 745306 750949 755475 759577 764370 770614 778073 785744 792999 800456 809501 821001 834675
62740 834675 849535 864547 878907 892406 905870 920927 938901 960016 983862 1010241 1039148
62729 1039148 1070245 1103082 1137982 1176200 1218855 1265914 1316392 1369399 1424882 1483510 1546108
62718 1546108 1613301 1685642 1763819 1848283 1938461 2032665 2129273 2227861 2328760 2431535 2534334
62707 2534334 2634623 2729954 2817837 2895510 2960332 3010291 3044015 3060635 3059792 3041533 3006173
62696 3006173 2954679 2889183 2812463 2726610 2632802 2532673 2429140 2325163 2222260 2121033
62686 2121033 2022749 1929347 1841753 1759065 1679865 1604030 1532943 1468044 1409375 1355722 1306216
62675 1306216 1261431 1222266 1187908 1156082 1125888 1099300 1078671 1063368 1050255 1037305 1025387
62664 1025387 1016353 1010698 1007738 1007029 1008713 1012882 1019321 1027763 1038077 1050418 1065336 1083458 1104881
62651 1104881 1129200 1156156 1185846 1218308 1253521 1292036 1335048 1383506 1437502 1496761 1561408
62640 1561408 1632088 1709688 1794971 1887937 1987459 2092206 2202317 2319586 2445516 2579349
62630 2579349 2718168 2858586 2998249 3136211 3271984 3403657 3526733 3635345 3724846 3792714
62620 3792714 3837171 3856250 3848974 3816528 3761346 3685522 3590855 3479821 3355469 3220616 3077949
62609 3077949 2930773 2782862 2637420 2496504 2361117 2231335 2106744 1987504 1874900
62600 1874900 1770304 1673826 1584594 1502130 1426701 1358394 1296552 1240215 1188551 1140844 1096583
62589 1096583 1055590 1017625 981972 947964 915889 886738 860905 837577 815521 794152 773718
62578 773718 754864 738160 723688 710782 698267 685212 671676 658829 648087 639700 632202 623765
62566 623765 614242 605370 598829 594705 592099 590359 589176 588118 586922 585923 585667 586479 588734 592817 598246
62551 598246 603704 608753 614677 622570 631501 640031 648920 660516 675516 692038 708236 724437 742248
62538 742248 762787 786323 812704 841599 873013 907798 946876 989856 1035398 1083058 1133643
62527 1133643 1187402 1242990 1298755 1353995 1408275 1460371 1508540 1551152 1586543 1613110 1630192
62516 1630192 1638284 1637797 1628243 1609118 1580977 1545202 1503418 1457584 1409797 1361388 1312788 1264774
62504 1264774 1219001 1176547 1136596 1097357 1057872 1018540 980589 945744 915655 890710 869628
62493 869628 850729 833199 816803 801221 786401 772832 760637 748971 737157 725835 716115 708118
62481 708118 701239 695319 690531 686481 682508 678721 675877 674345 674064 675389 679146 685736 694743 705433
62467 705433 717341 730585 745920 764000 784325 805569 827437 851287 878239 907730 939039
62456 939039 973191 1011937 1055529 1103147 1154974 1212002 1273910 1338938 1406129 1476028 1548865
62445 1548865 1623536 1698786 1773761 1846586 1913747 1971981 2020152 2058596 2087416 2105908 2112786
62434 2112786 2106440 2085862 2052052 2007887 1956060 1897748 1833591 1764960 1693635 1621180 1549392
62423 1549392 1480476 1415836 1355333 1298567 1246157 1198783 1155687 1115426 1077812 1043926 1014321
62412 1014321 988309 965038 944179 925325 907692 890981 875939 863463 853455 844922 837037 829784
62400 829784 823622 818805 815192 812747 811953 813287 816246 819423 822044 825113 830495 838949 849543 860939
62386 860939 872571 884313 895577 905391 913354 920008 925962 930861 933535 933134 929733 923650 914606 902084
62372 902084 886449 869202 851942 835263 818690 801463 783348 764963 747379 731214 716262
62361 716262 702296 689909 679926 672089 665219 658935 654333 652384 652384 652828 653444 655394 659509 665222 671505
62346 671505 678096 685193 692417 698990 705093 712320 722125 734095 746476 758438 770859 784388 797648
62333 797648 808519 816874 824772 833719 842870 850401 855766 859856 863595 867234 870684 873787 876303 878177
62319 878177 879821 881807 884391 887651 891994 898283 907568 920698 937870 958415 981482 1007103 1036135
62306 1036135 1069043 1105503 1145510 1189937 1239272 1292740 1349854 1412177 1482000 1559217 1640829
62295 1640829 1723776 1806994 1890220 1971977 2049669 2120930 2183940 2236856 2277983 2306625 2323168
62284 2323168 2328347 2322831 2307468 2283275 2250885 2210341 2161781 2106218 2045331 1980454 1912086 1840771
62272 1840771 1768373 1698006 1632230 1571519 1514806 1461313 1411258 1364837 1321407 1280158 1240997
62261 1240997 1204090 1169017 1135290 1103558 1075242 1050642 1028388 1007414 988790 974545 964975
62250 964975 958199 952413 947586 944574 943605 944274 946166 948491 949702 948715 946515 945433 946572 948727 949994
62235 949994 949593 947844 945397 943243 942762 944812 948902 953842 958894 963734 967681 969985 971172 973464 979303
62220 979303 989363 1002022 1014840 1026673 1038450 1051892 1067683 1085278 1104231 1124846 1147312
62209 1147312 1171112 1195875 1222151 1250650 1281381 1314435 1351012 1392442 1438411 1487472 1539483
62198 1539483 1596375 1659953 1729724 1803433 1879066 1955780 2033313 2110969 2186714 2256789 2316673
62187 2316673 2363201 2395923 2416183 2425084 2422579 2408270 2382510 2346549 2301759 2248960 2188663 2122045
62175 2122045 2051477 1979758 1908888 1839857 1773457 1710778 1652792 1599983 1552428 1509793 1471161
62164 1471161 1435575 1403106 1374891 1351713 1333020 1317765 1305620 1296680 1290378 1285609 1281857 1279432
62152 1279432 1278439 1278213 1278095 1278230 1279248 1281445 1284661 1288677 1293344 1298368 1303321 1307980 1312449 1316927 1321586
62137 1321586 1326865 1333651 1342793 1354260 1367075 1380296 1393892 1408397 1423939 1440093 1456680 1474204
62125 1474204 1493277 1514016 1536199 1559594 1583934 1609015 1635174 1663152 1692934 1723190 1752745
62114 1752745 1782455 1814711 1850958 1890639 1932934 1978592 2029073 2084360 2142726 2202765 2264808
62103 2264808 2329878 2397738 2466346 2532907 2594938 2650445 2697703 2735373 2762904 2780768 2790178
62092 2790178 2792443 2788474 2778808 2764003 2744738 2721446 2694136 2662967 2628991 2593985 2559423 2525832
62080 2525832 2493361 2462769 2435586 2413286 2396398 2384316 2375725 2369171 2363507 2358206 2353590 2350795
62068 2350795 2351098 2354784 2360689 2367311 2374486 2383554 2395716 2410800 2427944 2446761 2467111 2488394 2510266
62055 2510266 2533895 2561109 2591897 2623976 2655503 2687230 2721060 2757378 2795153 2834097 2875140
62044 2875140 2918645 2963677 3009616 3057391 3108413 3163132 3221342 3282948 3347136 3411318 3472371
62033 3472371 3529213 3583287 3636391 3689084 3741583 3795030 3850699 3908242 3965528 4020238 4071285
62022 4071285 4119082 4165175 4211463 4259103 4308141 4358659 4411941 4469442 4530654 4593236 4655806
62011 4655806 4719557 4786347 4856256 4928204 5002184 5079273 5159637 5242181 5326430 5413197 5502577
62000 5502577 5592526 5680354 5764593 5844282 5917329 5981306 6035714 6082112 6121789 6154467 6179491
61989 6179491 6197071 6207651 6211044 6207172 6197200 6183050 6165940 6146061 6123688 6100031 6076806 6055262
61977 6055262 6035650 6017383 5999674 5982145 5964851 5947768 5930543 5912974 5895405 5878301 5861620
61966 5861620 5845115 5829204 5814928 5802706 5791412 5779076 5764499 5748131 5731450 5715739 5701412
61955 5701412 5688233 5675865 5664080 5652735 5641868 5631901 5623417 5616583 5610988 5606173 5602029 5598402 5594602
61942 5594602 5589867 5584254 5578612 5573494 5568505 5562942 5556771 5550564 5544548 5537966 5529488 5518127 5503722
61929 5503722 5486578 5466790 5444056 5418187 5389556 5358909 5326817 5293464 5258860 5223090 5186390
61918 5186390 5149084 5111274 5072538 5032285 4990736 4949114 4908381 4868205 4827994 4788616 4751861
61907 4751861 4717937 4684650 4649798 4613544 4577670 4543202 4509902 4477679 4447219 4418960 4392289
61896 4392289 4366156 4340090 4314384 4289705 4266739 4245977 4227582 4211392 4196936 4183543 4170950
61885 4170950 4160031 4152397 4148754 4148119 4149211 4151979 4157007 4164135 4173019 4184659 4200656 4220731 4242665
61872 4242665 4265458 4291112 4322230 4358993 4399909 4444814 4495603 4554090 4620423 4693777 4773719
61861 4773719 4860651 4955619 5059965 5174779 5300708 5438706 5590891 5760055 5948261 6156332
61851 6156332 6384737 6634681 6908506 7209620 7542011 7909312 8314148 8758532 9244507
61842 9244507 9773881 10347629 10966292 11630647 12340697 13093316 13880958 14692044 15510881
61833 15510881 16316146 17080018 17769836 18351194 18790711 19059005 19135070 19010895 18693643
61824 18693643 18204216 17573241 16835919 16026925 15176837 14310964 13449851 12609929 11803753
61815 11803753 11040303 10325468 9662290 9051079 8489939 7975709 7504783 7073663 6679468
61806 6679468 6320132 5993751 5697515 5427594 5180382 4953695 4746436 4557193 4383724
61797 4383724 4224000 4077333 3943918 3823349 3714091 3614525 3523882 3441755 3367136 3298692
61787 3298692 3235907 3179264 3129091 3084698 3044806 3008397 2974909 2944138 2916363 2892153 2871513
61776 2871513 2853421 2836774 2821700 2809451 2801032 2796390 2794969 2796488 2800904 2808040 2817610 2829366 2842886
61763 2842886 2857417 2872334 2887733 2904344 2922866 2943739 2967482 2994742 3025668 3059538 3095500
61752 3095500 3133674 3175206 3221226 3272247 3328656 3391258 3460743 3536881 3618844 3706427 3800447
61741 3800447 3901883 4011139 4128427 4254415 4390085 4536213 4693462 4862744 5044915
61732 5044915 5240190 5448551 5671062 5910248 6168713 6447589 6746824 7067019 7410651
61723 7410651 7781537 8183542 8619962 9093798 9608234 10166967 10774406 11435720 12156430
61714 12156430 12941694 13795791 14722191 15723989 16804148 17964965 19206606 20525279
61706 20525279 21912040 23352621 24827256 26309099 27761368 29135414 30372118 31407139
61698 31407139 32178678 32635877 32746276 32500887 31915457 31027385 29889284 28561336 27104338
61689 27104338 25574284 24018677 22474998 20971607 19529930 18165820 16889263 15704116
61681 15704116 14609670 13603180 12681037 11838438 11069669 10369620 9734244 9158712 8635788
61672 8635788 8157442 7718152 7315574 6947659 6610228 6298287 6009071 5742527 5498523
61663 5498523 5274398 5065867 4870023 4686860 4517739 4362805 4220190 4087419 3963076
61654 3963076 3846886 3738570 3637004 3540590 3448226 3359827 3275932 3196978 3123026 3054123 2990454
61643 2990454 2931878 2877534 2826338 2777716 2731360 2686475 2642042 2597956 2555113 2514055 2474359
61632 2474359 2435824 2399282 2365198 2332160 2298035 2262526 2227461 2194620 2164359 2136432 2110870
61621 2110870 2087373 2064743 2041694 2017903 1993936 1970692 1949236 1930364 1913743 1897976 1882112
61610 1882112 1866615 1852388 1839452 1827239 1815400 1803318 1789378 1772190 1752689 1733793 1717542
61599 1717542 1703429 1689922 1676672 1664437 1653573 1643653 1634336 1625740 1617991 1611129 1605501 1601417 1598223
61586 1598223 1594492 1589671 1584981 1582190 1581997 1584096 1588059 1593155 1597859 1600973 1603245 1606505 1610920 1614528
61572 1614528 1616058 1616726 1618203 1620189 1621411 1621923 1622538 1622832 1621871 1620612 1621169 1623352 1624263 1622183 1618756 1616012
61556 1616012 1613116 1607791 1599662 1590252 1580568 1570608 1560693 1551330 1541800 1530627 1517754 1504935 1493732
61543 1493732 1484202 1475644 1467406 1458801 1449550 1440732 1434183 1430410 1428058 1425842 1423996 1423279 1423659 1424846
61529 1424846 1427271 1431552 1437515 1444692 1453396 1464377 1477528 1491741 1506131 1520860 1536712 1554328
61517 1554328 1573918 1595377 1618543 1643437 1670259 1699219 1730596 1764831 1802056 1841475 1881941
61506 1881941 1923515 1967767 2015867 2066807 2118172 2168251 2216654 2263275 2307818 2350417 2391666
61495 2391666 2431534 2469048 2503675 2536476 2569094 2601701 2632538 2659529 2681923 2700267 2715261
61484 2715261 2727008 2735263 2739964 2741343 2739645 2735014 2727713 2718334 2707618 2696121 2684136 2671910 2659888
61471 2659888 2648779 2639550 2633363 2631358 2634333 2642510 2655672 2673574 2696263 2723943 2756592 2794056
61459 2794056 2836775 2886128 2943636 3009835 3084515 3168163 3262541 3369367 3488917 3620489 3763907
61448 3763907 3919914 4089392 4273214 4472983 4690823 4927681 5182362 5452936 5738725
61439 5738725 6040012 6355620 6681310 7010545 7335989 7649609 7941689 8200726 8415255
61430 8415255 8576397 8679226 8722413 8707324 8637821 8520386 8363293 8174872 7962603 7733862
61420 7733862 7496654 7258582 7025132 6799772 6585753 6386802 6205575 6042347 5896172
61411 5896172 5767086 5656392 5564966 5492203 5436823 5398027 5375440 5368364 5375485 5395193 5426021
61400 5426021 5467078 5518273 5579808 5651007 5729627 5812569 5897433 5983443 6071030 6160574 6251325
61389 6251325 6341310 6428368 6511572 6591637 6669754 6745977 6819061 6888067 6953795 7018120 7081831
61378 7081831 7143573 7201206 7253741 7301412 7344165 7381025 7411210 7435150 7453977 7468451 7478693
61367 7478693 7484324 7484283 7477192 7462753 7442492 7418327 7390809 7359681 7325756 7290778 7255492 7219466
61355 7219466 7183351 7149781 7120933 7096190 7073334 7051270 7030378 7010916 6992566 6975292 6959161
61344 6959161 6943068 6924829 6902975 6877660 6849749 6820119 6790303 6762836 6740175 6723718 6714333
61333 6714333 6713274 6722198 6742963 6778012 6830249 6901654 6992508 7102828 7234254 7389437 7569721
61322 7569721 7774515 8003023 8255275 8530759 8827118 9141261 9471076 9814696 10167886
61313 10167886 10522897 10869765 11197738 11495293 11750392 11952539 12095225 12176338 12196531 12157607
61303 12157607 12062182 11914039 11718434 11481968 11211896 10915000 10596899 10262335 9915848
61294 9915848 9562059 9205887 8852934 8509053 8178536 7862817 7561766 7276192 7008147
61285 7008147 6758877 6527842 6314410 6119438 5944267 5788927 5652478 5534700 5436258 5357112
61275 5357112 5295589 5249266 5216213 5195331 5186120 5188419 5202028 5226331 5260388 5303342 5354449 5412641
61263 5412641 5476292 5543440 5612174 5681011 5749120 5816012 5880735 5941558 5996803 6045865 6089092
61252 6089092 6126907 6159555 6187646 6212139 6233377 6250370 6261371 6265126 6261415 6250439 6231922 6205116
61240 6205116 6169786 6126853 6077704 6023006 5962772 5897588 5829055 5758709 5687113 5614355 5540844
61229 5540844 5467136 5393599 5320934 5250501 5183400 5119758 5059825 5005300 4958244 4918604 4883884
61218 4883884 4851554 4820947 4792518 4766158 4740877 4715525 4689180 4661076 4630728 4598273 4564668
61207 4564668 4531605 4500986 4474125 4451478 4433410 4420956 4415302 4416765 4424953 4439838 4461983 4491823
61195 4491823 4529653 4576440 4633767 4702602 4782863 4874467 4977936 5093504 5220236 5356468
61185 5356468 5500272 5648776 5797621 5941830 6076658 6196780 6295149 6363933 6396874 6390340
61175 6390340 6342558 6253294 6125110 5964338 5779857 5580436 5372937 5162387 4952870 4747906
61165 4747906 4550206 4361628 4183714 4017995 3865420 3725655 3597492 3480141 3373754
61156 3373754 3278514 3193584 3117324 3048377 2986320 2931367 2883719 2843069 2808483 2778704 2752813
61145 2752813 2730828 2713781 2703129 2699771 2703352 2712560 2726193 2743760 2764812 2788000 2811326 2833275
61133 2833275 2853190 2870507 2884267 2893681 2898695 2899512 2895880 2887386 2874443 2858426 2840470 2820314
61121 2820314 2796756 2769335 2739260 2708394 2677584 2646518 2615017 2583579 2552316 2520174 2485931
61110 2485931 2449574 2412003 2373666 2334074 2292515 2248765 2203404 2157878 2113704 2070956 2028069
61099 2028069 1984047 1940265 1898984 1860590 1823801 1788393 1755970 1727712 1702799 1679557 1656681
61088 1656681 1632782 1606265 1576869 1546281 1516064 1485780 1454175 1421486 1389447 1359529 1332323
61077 1332323 1308296 1287939 1271125 1257163 1245625 1236670 1230609 1227494 1226838 1227412 1227806 1227805 1228923 1233068
61063 1233068 1240928 1251943 1265243 1280013 1295381 1310718 1325796 1340298 1353689 1366211 1379429
61052 1379429 1395023 1413317 1433527 1454860 1476574 1497477 1516355 1532711 1546285 1556228 1561664 1562904
61040 1562904 1561289 1557970 1553449 1547771 1540310 1529949 1516753 1503053 1491314 1481004 1469147 1454319
61028 1454319 1438556 1424761 1413698 1404394 1396102 1388382 1380145 1370334 1359649 1350371 1344027 1339782 1335412
61015 1335412 1329458 1322246 1315099 1308889 1303396 1298006 1292679 1287878 1283680 1279581 1275429 1271952 1269892 1269040
61001 1269040 1268771 1269200 1270988 1273962 1276785 1278514 1280015 1283152 1288685 1295459 1301698 1306652 1310843 1315154
60987 1315154 1320118 1326031 1333380 1342948 1355390 1370632 1387724 1405636 1424313 1444837 1468399 1495254
60975 1495254 1524625 1555273 1586142 1616968 1648573 1682318 1719122 1759327 1803382 1851808 1904255
60964 1904255 1959595 2017568 2079452 2146478 2218585 2295533 2377955 2465936 2557795 2652190 2750653
60953 2750653 2855915 2968229 3085686 3208010 3337557 3476248 3623852 3779851 3944797
60944 3944797 4119280 4303888 4500976 4714080 4944781 5192863 5460898 5755866 6084422
60935 6084422 6449084 6851196 7295279 7788375 8338071 8954332 9651138 10442954 11341373
60926 11341373 12358032 13508344 14809028 16275757 17929233 19801733 21932518 24360211
60918 24360211 27123024 30243957 33666129 37166804 40353182 42806002 44291200 44869782
60910 44869782 44824690 44496493 44172986 44062457 44264560 44693298 45036490 44859220 43821310
60901 43821310 41846725 39121200 35954552 32639809 29391013 26343011 23566282 21081576
60893 21081576 18879536 16940008 15240594 13757056 12464894 11342338 10369777 9527152
60885 9527152 8794293 8153230 7588665 7087477 6639566 6238107 5877201 5550126 5250971
60876 5250971 4976341 4723788 4490078 4272800 4072138 3888615 3719832 3561357 3410073
60867 3410073 3264933 3125521 2992020 2865910 2748375 2638296 2533629 2434325 2341893 2256326
60857 2256326 2175594 2098273 2024779 1955744 1890789 1829313 1771180 1716277 1664513 1616409 1572511
60846 1572511 1532072 1493437 1455973 1420645 1388530 1359691 1333692 1310281 1289223 1269989 1251842
60835 1251842 1234063 1216481 1200147 1186844 1177277 1170357 1164886 1160935 1158548 1156310 1152913 1149461 1148330
60822 1148330 1150033 1152940 1155954 1159516 1163813 1167806 1170688 1172932 1175319 1178012 1180899 1183654 1185135 1183923
60808 1183923 1179940 1174464 1168211 1160569 1151168 1141003 1131291 1122238 1113689 1106184 1100516 1096620 1093488 1090063
60794 1090063 1086235 1083391 1083777 1088492 1096194 1104664 1113459 1123907 1136721 1151282 1167504 1186486 1208355
60781 1208355 1230987 1252215 1272260 1292707 1313890 1334698 1354448 1373537 1392277 1410139 1426285
60770 1426285 1440179 1451678 1461082 1469029 1475921 1481612 1486082 1490050 1494289 1498551 1501870 1503953 1505621
60757 1505621 1507738 1510139 1511869 1512131 1510713 1507591 1502419 1494793 1485108 1474781 1465074 1455670 1444804 1430900
60743 1430900 1413825 1394665 1374896 1355863 1338364 1322252 1306789 1291585 1276886 1262815 1249098
60732 1249098 1236099 1225491 1218973 1216329 1215444 1214416 1213209 1213044 1214618 1217403 1220688 1224865 1231332 1241134
60718 1241134 1253973 1268631 1284081 1299963 1316340 1333528 1352083 1372512 1394807 1418443 1442674
60707 1442674 1466628 1489393 1510576 1530822 1551291 1572468 1593775 1614229 1633077 1649829 1664393
60696 1664393 1677316 1689405 1700742 1710472 1717860 1723274 1727915 1732794 1738134 1743433 1747766 1750127 1749891
60683 1749891 1747267 1743487 1740270 1738490 1737069 1733690 1727075 1718092 1708078 1696756 1682989 1667245 1651840
60670 1651840 1638328 1625921 1613174 1600090 1587467 1574913 1560988 1545316 1529442 1515190 1502965
60659 1502965 1492156 1482720 1475569 1471435 1469850 1469477 1469116 1468163 1466503 1464439 1462590 1461301 1460151 1458566
60645 1458566 1456879 1456024 1455990 1455501 1453695 1451295 1449444 1448209 1447121 1446445 1446753 1447740 1448635 1449394 1450181 1449910 1446774
60628 1446774 1440335 1431801 1422130 1411189 1398953 1386004 1372214 1356340 1337706 1317347 1296718 1276262
60616 1276262 1255947 1236268 1217832 1200740 1185080 1171219 1158785 1146324 1133037 1120135 1109439
60605 1109439 1101322 1095147 1091080 1090010 1091923 1095636 1100130 1105031 1109872 1114110 1118142 1123242 1130131 1138355
60591 1138355 1147269 1156802 1166921 1177150 1187084 1196751 1206042 1214427 1221817 1229078 1236908 1244521 1250369
60578 1250369 1254194 1257488 1261589 1266027 1269491 1272043 1275507 1281644 1290760 1302334 1316140 1332010 1349098
60565 1349098 1366334 1383499 1401157 1419698 1439271 1460433 1483768 1508559 1532809 1555081 1575672
60554 1575672 1595633 1615284 1634141 1651626 1667286 1680692 1691597 1699949 1705616 1708475 1708683 1706082
60542 1706082 1699341 1686878 1669004 1648058 1625841 1602138 1576535 1550386 1525646 1502712 1480855
60531 1480855 1460117 1441264 1424338 1408891 1395397 1384851 1377014 1370632 1365507 1362781 1362857 1364588 1367075
60518 1367075 1370676 1375416 1379846 1382698 1384585 1386723 1388789 1389566 1389398 1390411 1394111 1399828 1405866 1411328
60504 1411328 1416475 1422043 1428664 1436469 1444820 1452822 1460441 1468689 1478286 1488588 1498575 1508481 1519417
60491 1519417 1531196 1541720 1549366 1555349 1562771 1573637 1587782 1604466 1623640 1645301 1668994 1695064
60479 1695064 1725624 1763023 1807425 1856680 1908322 1960731 2012328 2060583 2102360 2134828 2155918
60468 2155918 2164483 2160513 2145092 2120024 2087597 2050544 2011797 1974078 1939889 1911681 1891391 1879425
60456 1879425 1874422 1874400 1878256 1886130 1898385 1914402 1932643 1952169 1974011 2000498 2033044 2071106
60444 2071106 2113625 2160932 2214569 2275745 2344917 2422831 2511026 2611126 2724265 2851414 2993563
60433 2993563 3151223 3324153 3511789 3713554 3928705 4156682 4398134 4655333 4931273
60424 4931273 5228621 5549556 5895767 6267448 6661378 7068687 7472895 7849682 8170208
60415 8170208 8407189 8539938 8555811 8450119 8227498 7903654 7503636 7055943 6586307 6114728
60405 6114728 5655555 5218556 4809996 4433625 4091076 3781742 3503232 3252893 3028909
60396 3028909 2829661 2652576 2494506 2353205 2227566 2116230 2016915 1927638 1847831 1777455
60386 1777455 1715425 1659765 1609079 1562945 1520787 1481239 1443015 1405941 1370836 1338725 1310229
60375 1310229 1285184 1262630 1241583 1221934 1204118 1187904 1172357 1157223 1143385 1131361 1120208
60364 1120208 1108776 1097283 1086585 1076467 1066018 1055514 1046532 1040026 1035421 1031942 1029635 1028530
60352 1028530 1027859 1027076 1026952 1028783 1032797 1038042 1043491 1048604 1053159 1057425 1062405 1069045 1077016 1084823 1091332
60337 1091332 1096765 1102100 1108003 1114581 1121764 1129482 1137574 1145735 1153497 1160361 1166226 1171725 1177769 1184536
60323 1184536 1191207 1196870 1201298 1204514 1206022 1205070 1201603 1196499 1190958 1186075 1182747 1181221 1180576 1179383
60309 1179383 1177194 1174781 1172603 1169849 1165751 1161269 1158524 1158774 1161739 1166628 1172780 1179241 1184889 1189539
60295 1189539 1194229 1199973 1206786 1214255 1222295 1230767 1239080 1247016 1255511 1265737 1277529 1289425 1300136
60282 1300136 1309414 1317689 1325664 1334196 1343682 1353179 1360741 1364935 1365769 1364190 1361377 1358750 1357817 1359214
60268 1359214 1362194 1365642 1369362 1373790 1378641 1382633 1384715 1384890 1383561 1380725 1376385 1371295 1366469 1362028
60254 1362028 1357229 1351678 1345850 1340288 1334989 1329978 1325746 1322493 1319479 1315889 1311997 1308747 1306502 1305037
60240 1305037 1304538 1305505 1307624 1309777 1311442 1313145 1315093 1316314 1315879 1314289 1312892 1312325 1312216 1312061 1311709 1311186
60224 1311186 1310796 1311411 1314167 1319656 1327520 1336813 1346719 1357161 1368789 1382231 1397404 1413895 1431786
60211 1431786 1451484 1472708 1494444 1516015 1537372 1558128 1577368 1594955 1612169 1630324 1649531
60200 1649531 1669503 1690795 1714409 1740853 1770424 1803744 1841119 1882024 1926117 1974077 2026475
60189 2026475 2082685 2142310 2206926 2278696 2357635 2441975 2531201 2626946 2730652 2842125 2961011
60178 2961011 3088252 3225261 3372602 3530045 3696857 3871500 4051955 4236659 4423987
60169 4423987 4610495 4791314 4963241 5126160 5280181 5422521 5548654 5655738 5743420 5811836
60159 5811836 5860594 5889713 5900100 5892861 5869526 5833380 5789365 5741750 5692571 5643066 5596084
60148 5596084 5556141 5527194 5511018 5507856 5517994 5542383 5582173 5638338 5711816 5803532 5913788
60137 5913788 6041632 6184981 6341329 6508260 6683368 6863811 7045755 7224141 7393282
60128 7393282 7548227 7685635 7803221 7898567 7968850 8011703 8026054 8012255 7971770 7906862 7820322
60117 7820322 7715532 7596831 7469394 7338230 7207434 7080769 6962510 6856790 6766026 6690867
60107 6690867 6632092 6592015 6573585 6578441 6606110 6654827 6722717 6808171 6909196 7022417 7142904
60096 7142904 7265221 7384732 7497970 7602224 7695185 7774684 7838503 7884999 7914714 7930986
60086 7930986 7937973 7938053 7932037 7921962 7912763 7910952 7922343 7951142 8000235 8071654 8167186 8288906
60074 8288906 8438906 8618580 8828704 9070231 9344339 9651628 9992039 10365625 10772495
60065 10772495 11211706 11681092 12178526 12702339 13249705 13815016 14390331 14966872 15535596
60056 15535596 16086931 16610795 17097036 17535884 17918555 18237745 18487325 18661815 18756943
60047 18756943 18770712 18702970 18553989 18324927 18020432 17649844 17225146 16758676 16263375 15753629
60037 15753629 15243902 14746423 14270800 13825109 13416105 13048593 12725577 12448949 12219409
60028 12219409 12036176 11897761 11802879 11749850 11735370 11754627 11802346 11872920 11959668 12054836 12150434
60017 12150434 12238932 12313852 12370663 12406856 12420433 12408726 12369545 12303003 12211057 12095444 11957135
60006 11957135 11797561 11618943 11423188 11211674 10986552 10751282 10509393 10263619 10016874
59997 10016874 9773419 9538281 9315694 9108406 8918212 8746857 8596617 8470115 8369323
59988 8369323 8294733 8245823 8222326 8224717 8253577 8308927 8390040 8495312 8622325 8768474 8931249
59977 8931249 9107155 9290543 9474515 9653147 9821934 9975935 10108741 10213965 10287114 10325636
59967 10325636 10328279 10295442 10229409 10132908 10007422 9853856 9674963 9476427 9265393 9048481
59957 9048481 8831246 8618807 8416288 8228576 8059665 7912100 7787067 7685264 7607723 7555655
59947 7555655 7529750 7530165 7557315 7612122 7695071 7805317 7941267 8101917 8287058 8495979 8726375
59936 8726375 8974608 9236353 9506286 9777300 10040792 10288215 10512409 10707791 10869942
59927 10869942 10995310 11081055 11125027 11126237 11085479 11005085 10887747 10736006 10553432 10346315
59917 10346315 10123794 9896084 9672310 9459396 9262280 9084893 8930929 8803683 8705237
59908 8705237 8636213 8596536 8586163 8604806 8651256 8723472 8819375 8937321 9075866 9233283 9407127
59897 9407127 9593813 9788543 9986035 10181737 10372553 10556523 10731905 10896449 11047564
59888 11047564 11183377 11303933 11411350 11508698 11598702 11683472 11765311 11847652 11935379 12034401
59878 12034401 12150812 12290224 12457681 12657885 12895054 13172335 13491379 13852554 14255405
59869 14255405 14698651 15179531 15692820 16230237 16780641 17330634 17864811 18365756 18814758
59860 18814758 19193340 19484483 19673481 19749805 19709784 19557178 19300362 18949617 18517966 18023110
59850 18023110 17485755 16925177 16357234 15795868 15253846 14741059 14263820 13826903 13434868
59841 13434868 13090599 12794288 12545457 12344982 12193948 12091589 12035691 12024049 12054173 12122489
59831 12122489 12225283 12359531 12521165 12703117 12896544 13093147 13284428 13459271 13604661
59822 13604661 13709188 13764479 13763630 13700706 13572739 13380910 13129222 12823312 12470927 12081914
59812 12081914 11666528 11234226 10794205 10355626 9926229 9511339 9114721 8739653 8388630
59803 8388630 8062916 7763198 7490300 7244798 7026431 6834228 6666702 6521651 6396412
59794 6396412 6288837 6197605 6121267 6057345 6002544 5953534 5907540 5862868 5819054 5776035 5733153
59783 5733153 5689505 5645199 5601473 5559423 5519212 5480512 5442803 5405024 5365657 5323458 5277642
59772 5277642 5227530 5172902 5114725 5054674 4993994 4933717 4875756 4822181 4773137 4727022 4683318
59761 4683318 4643852 4610487 4583206 4561719 4547712 4543633 4549637 4563157 4581468 4603713 4630627 4663392
59749 4663392 4703000 4750101 4805218 4869198 4942999 5026575 5118282 5215761 5316966 5419858 5521725
59738 5521725 5619573 5711032 5794389 5868263 5932105 5986918 6034896 6078385 6119521 6160419 6203082
59727 6203082 6249328 6301355 6362055 6434180 6519458 6619245 6735799 6872163 7030809 7213094
59717 7213094 7420155 7653744 7916102 8209459 8535749 8896370 9292025 9722891 10188510
59708 10188510 10686435 11210151 11747692 12281104 12785800 13230431 13580154 13804604 13887130
59699 13887130 13829339 13648376 13370159 13023537 12636989 12236189 11841613 11467764 11124694
59690 11124694 10819607 10556642 10336412 10157530 10018937 9920227 9860336 9837388 9849987 9897432
59680 9897432 9978486 10091206 10234522 10408853 10614600 10851201 11118486 11417988 11751867 12121234
59670 12121234 12526531 12968971 13450565 13973248 14539143 15151440 15813873 16529060 17298029
59661 17298029 18121325 18999753 19933745 20922436 21963368 23052339 24182792 25345071 26526282
59652 26526282 27711348 28885013 30033611 31145550 32211370 33225135 34186717 35102159
59644 35102159 35981141 36833965 37670200 38497820 39321321 40140009 40948232 41736605 42492500
59635 42492500 43200405 43843514 44405688 44872399 45231812 45477413 45610265 45637950 45571451 45424067
59625 45424067 45213069 44960429 44690447 44426517 44189713 43998757 43869752 43815831 43847672 43974563
59615 43974563 44204928 44546023 45003238 45579305 46273621 47081923 47996245 49004876 50092132
59606 50092132 51237672 52415022 53589887 54719922 55756905 56650014 57348655 57805342
59598 57805342 57980053 57845466 57390775 56623026 55566563 54260797 52755826 51106665 49368091
59589 49368091 47591018 45819681 44089565 42427068 40850844 39372660 37996272 36715512
59581 36715512 35513805 34365705 33239950 32104119 30931114 29705686 28427747 27110690
59573 27110690 25776256 24449047 23152509 21906276 20724595 19616019 18584324 17629796
59565 17629796 16750228 15941948 15200945 14523321 13904796 13340520 12826080 12358325 11934445
59556 11934445 11550602 11202527 10887331 10603396 10348188 10117421 9907047 9714948 9539634
59547 9539634 9378094 9226112 9080223 8938177 8797680 8655884 8510405 8360100 8204789
59538 8204789 8044877 7881524 7716741 7553080 7393303 7239932 7094408 6956689 6826229
59529 6826229 6703406 6589634 6486336 6394435 6314731 6247809 6193227 6149420 6114983 6089806 6074727
59518 6074727 6070378 6076626 6092769 6117714 6150015 6188192 6231371 6279627 6333560 6393384 6458407 6527452
59506 6527452 6599764 6675489 6755403 6840505 6931890 7030753 7138333 7255980 7385340 7528261
59496 7528261 7686370 7860705 8051593 8258719 8481690 8721195 8979585 9259660 9562570
59487 9562570 9887239 10231805 10594899 10975242 11370603 11777632 12192318 12610286 13027025
59478 13027025 13438183 13839389 14225633 14591292 14930901 15239355 15511328 15741660 15927388
59469 15927388 16069373 16171539 16238760 16275533 16285964 16274270 16245257 16204414 16157263 16108896 16065024
59458 16065024 16033364 16022620 16039515 16087800 16170513 16291489 16453151 16653524 16886302 17142554
59448 17142554 17410652 17675301 17918887 18124506 18277260 18363527 18371065 18290657 18117401 17851082
59438 17851082 17496709 17064495 16567763 16020307 15436321 14832025 14224994 13630544 13059284
59429 13059284 12518313 12013496 11549725 11129751 10753807 10420521 10128230 9875954 9663389
59420 9663389 9489771 9352966 9250323 9180318 9142697 9137058 9162150 9216703 9300058 9411734 9551068
59409 9551068 9717530 9910672 10129296 10371033 10632771 10910925 11200999 11497353 11793449
59400 11793449 12081784 12353619 12599613 12811133 12980502 13099925 13161202 13157483 13085650 12947200
59390 12947200 12747210 12492386 12189549 11845527 11468285 11067496 10653336 10234621 9818268
59381 9818268 9409833 9013618 8632403 8268009 7922323 7597251 7293838 7012226 6752454
59372 6752454 6514543 6297696 6100193 5920325 5757048 5609850 5478532 5362904 5262057
59363 5262057 5174139 5097504 5031825 4977292 4933169 4898180 4872030 4855338 4848103 4849440 4858842 4876626
59351 4876626 4903172 4938694 4983248 5034995 5088289 5135579 5172509 5200502 5224334 5248823 5278244
59340 5278244 5316589 5366494 5428698 5503636 5592280 5693883 5803937 5916444 6028574 6142345
59330 6142345 6262236 6392412 6536015 6695636 6873675 7072507 7294347 7540728 7812388
59321 7812388 8110235 8436418 8794208 9186945 9617194 10086558 10596150 11147672 11744171
59312 11744171 12389133 13084516 13830038 14624175 15464479 16345965 17259610 18192814 19130755
59303 19130755 20057268 20956149 21813468 22618992 23365379 24047123 24661231 25208081 25690154
59294 25690154 26109829 26468908 26769351 27012606 27197560 27319713 27372519 27348974 27242076 27044925
59284 27044925 26751707 26359377 25868985 25285666 24617281 23873237 23064950 22206899 21315576
59275 21315576 20406343 19491713 18582841 17691137 16826865 15996757 15204569 14453981 13749547
59266 13749547 13094549 12489147 11931407 11419521 10952460 10528914 10146377 9801457 9490918
59257 9490918 9212388 8964236 8745074 8553627 8388778 8248957 8131271 8032015 7948690 7881134
59247 7881134 7830093 7795097 7774443 7766817 7771878 7789165 7817430 7855524 7903151 7959971 8024207 8092881
59235 8092881 8163592 8235534 8308438 8380973 8450858 8516524 8577945 8635591 8689367 8739276 8786566
59224 8786566 8833291 8881052 8931182 8986088 9049246 9123452 9209802 9308520 9419741 9542777 9675187
59213 9675187 9813175 9952816 10090932 10225413 10354870 10477465 10590096 10689270 10772501 10837637
59203 10837637 10880909 10897328 10883871 10841388 10772913 10681417 10569957 10442561 10303603 10157058
59193 10157058 10007401 9860244 9720593 9590784 9471162 9362111 9264291 9177654 9101944 9037948
59183 9037948 8986517 8946065 8912408 8881710 8852893 8826839 8804012 8783460 8763910 8745501 8730302
59172 8730302 8720971 8719067 8725415 8742189 8773386 8822555 8891150 8980289 9093155 9234070 9405801
59161 9405801 9609501 9847038 10121452 10434731 10786718 11176638 11604153 12067823 12563274
59152 12563274 13083261 13618115 14154866 14676657 15164513 15600127 15966866 16249069 16432199
59143 16432199 16504933 16461362 16301219 16028435 15650149 15177414 14626275 14016864 13370231 12705317
59133 12705317 12038052 11381927 10748167 10145201 9578366 9050297 8561746 8112534 7702083
59124 7702083 7328957 6990251 6682368 6402872 6150805 5924845 5722196 5540057 5377159
59115 5377159 5232726 5104637 4989964 4886860 4794677 4712719 4640310 4577772 4525684 4483100
59105 4483100 4448013 4419778 4399542 4387842 4383238 4383979 4389848 4401627 4419907 4445140 4477754 4517214
59093 4517214 4561928 4611118 4666070 4728373 4797518 4871418 4948938 5030717 5117593 5209305 5304797
59082 5304797 5402755 5501479 5599042 5694043 5785789 5873514 5955881 6031506 6099500 6159156 6209560
59071 6209560 6250023 6280708 6302444 6316104 6322583 6323189 6319534 6313085 6305374 6298791 6296517 6301292 6314498
59058 6314498 6336612 6367999 6408936 6459584 6520724 6594114 6681063 6780729 6890895 7010758 7142299
59047 7142299 7288531 7450951 7628857 7820480 8024306 8239832 8467564 8708167 8961405
59038 8961405 9225925 9499557 9778939 10058708 10331977 10591871 10831779 11043832 11218317
59029 11218317 11345733 11419336 11435594 11393219 11292975 11138339 10935586 10692684 10417572 10116708
59019 10116708 9795027 9457672 9111369 8763033 8416990 8074801 7738093 7410125 7094017
59010 7094017 6790926 6500929 6224504 5962088 5713365 5478131 5256828 5049103 4853077
59001 4853077 4667448 4493168 4331387 4180714 4038489 3904007 3778418 3661758 3552184
58992 3552184 3448184 3349623 3256413 3167981 3084414 3006500 2934003 2865267 2799031 2735485 2675098
58981 2675098 2617617 2562785 2511026 2462855 2418333 2377379 2339809 2304862 2271625 2240194 2211577
58970 2211577 2186234 2163501 2142624 2123490 2106235 2091014 2078334 2068775 2062247 2058211 2056462 2056739
58958 2056739 2057856 2058579 2059381 2061799 2065815 2069441 2071486 2073283 2076771 2082021 2087642 2092781 2097658 2102685
58944 2102685 2108013 2113791 2120253 2127590 2135819 2144490 2152544 2159120 2164679 2170881 2179276 2190473 2204235
58931 2204235 2219532 2234697 2248674 2262258 2277230 2294220 2312463 2331659 2352699 2376068 2400646
58920 2400646 2424817 2448046 2470956 2494533 2519572 2546208 2573698 2601392 2629999 2661005 2694673
58909 2694673 2729703 2765195 2801754 2840065 2879375 2918223 2956058 2993446 3031191 3069902 3110193
58898 3110193 3152812 3198497 3247595 3299640 3353628 3409119 3466715 3527131 3590611 3658012 3731307
58887 3731307 3811518 3896933 3985133 4076328 4172922 4276304 4386329 4503640 4629916 4765341
58877 4765341 4908368 5058808 5218805 5389693 5570095 5758537 5956128 6165329 6387738
58868 6387738 6624454 6876997 7146291 7432122 7734993 8057282 8401371 8768217 9159176
58859 9159176 9577541 10026472 10506792 11018717 11564528 12147444 12768827 13428523 14127181
58850 14127181 14866204 15645943 16465812 17325456 18223585 19155795 20115235 21094870 22086775
58841 22086775 23078882 24054016 24992138 25871984 26670810 27365062 27932727 28354822 28615671
58832 28615671 28704534 28618446 28362634 27947738 27387708 26700519 25908824 25037592 24110439 23147974
58822 23147974 22168460 21188643 20223350 19284277 18379319 17513331 16689740 15911167 15178606
58813 15178606 14491038 13846718 13244386 12682472 12157701 11665710 11203038 10767825 10358865
58804 10358865 9974993 9615499 9280216 8968847 8680503 8413848 8167276 7939171 7728489
58795 7728489 7534887 7357796 7195629 7046530 6909760 6785916 6675978 6580524 6499449 6431874
58785 6431874 6376640 6333356 6302646 6284936 6279541 6285506 6302800 6331999 6373298 6426562 6491893 6569366
58773 6569366 6658555 6759043 6871035 6994872 7130455 7277992 7438929 7615322 7808463 8018676
58763 8018676 8246068 8490892 8753736 9036091 9340304 9668283 10020805 10398725 10804214
58754 10804214 11239921 11707544 12208161 12743491 13315935 13927935 14582024 15280605 16024395
58745 16024395 16811484 17638823 18503849 19403247 20330549 21276039 22228243 23173827 24096145
58736 24096145 24975278 25789370 26515096 27127878 27604383 27926211 28081256 28062772 27869439
58727 27869439 27506890 26987811 26329972 25554597 24685637 23747928 22764362 21754754 20736666
58718 20736666 19725453 18732971 17767696 16836921 15947843 15105769 14312052 13564670 12860766
58709 12860766 12198607 11577616 10996875 10453639 9944032 9465831 9019821 8607129 8225622
58700 8225622 7870349 7537264 7224913 6932416 6657757 6398858 6154899 5925606 5710278
58691 5710278 5508410 5320418 5146820 4987132 4840110 4704466 4578793 4461424 4351117
58682 4351117 4247625 4151103 4061261 3977387 3898807 3824914 3755106 3689161 3627508 3570748 3518756
58671 3518756 3470294 3423611 3377782 3333581 3292648 3255488 3220723 3186625 3152553 3118138 3081848
58660 3081848 3041730 2997481 2950572 2902214 2852197 2799929 2745619 2689958 2633369 2576072 2518561
58649 2518561 2461559 2405538 2350447 2296059 2242831 2192193 2145231 2101124 2058152 2016658 1979504
58638 1979504 1948395 1921076 1893814 1865669 1838425 1812948 1787832 1761589 1734138 1705784 1676581
58627 1676581 1647381 1619995 1595575 1573889 1554464 1537212 1521578 1506526 1492048 1479515 1469802
58616 1469802 1462133 1455400 1449528 1444784 1440830 1437547 1436099 1438036 1443459 1450791 1458296 1465391 1472489 1479802
58602 1479802 1486408 1490682 1491706 1489849 1485781 1479729 1472322 1465215 1459719 1455448 1451644 1449240 1449877 1453221
58588 1453221 1457181 1461038 1466471 1475012 1486257 1499357 1514607 1532495 1552672 1575168 1601487 1632820
58576 1632820 1667696 1702913 1737049 1772087 1811273 1855831 1904094 1953663 2004045 2056958 2114422
58565 2114422 2177364 2246213 2321586 2403502 2490933 2583516 2683054 2791926 2910480 3037585 3173399
58554 3173399 3319818 3478254 3648776 3831626 4027734 4237340 4459838 4695371 4944732
58545 4944732 5206788 5477546 5752621 6029067 6303566 6569939 6819513 7042936 7230880
58536 7230880 7374523 7467313 7506333 7491386 7423434 7304875 7140812 6939162 6709479 6461585
58526 6461585 6204095 5943121 5682530 5425769 5177057 4940590 4719297 4514687 4327175
58517 4327175 4156203 4000682 3859752 3732707 3618162 3514083 3418739 3330816 3248533 3169803
58507 3169803 3093615 3020394 2950600 2883687 2818610 2754556 2691073 2628389 2567616 2509671 2454006
58496 2454006 2399500 2346394 2295956 2248318 2202361 2157926 2116197 2077338 2039634 2001861 1964796
58485 1964796 1929237 1894168 1858324 1822496 1788773 1758215 1730378 1704587 1680660 1658753 1639105
58474 1639105 1621557 1605149 1588990 1573636 1560374 1548832 1536748 1522837 1508550 1496112 1485941
58463 1485941 1476896 1467913 1458400 1447986 1436899 1425876 1414911 1402969 1389596 1375825 1362688 1349776
58451 1349776 1336093 1321417 1305959 1289622 1272567 1255850 1240591 1227007 1214795 1203886 1194374
58440 1194374 1186340 1179979 1175119 1170723 1165971 1161813 1159840 1159506 1158338 1155392 1152459 1151015 1150025 1147984
58426 1147984 1145338 1143415 1142432 1141990 1142079 1142197 1140845 1137446 1133527 1130528 1127770 1124257 1121184 1120595 1122311
58411 1122311 1124104 1124523 1124005 1123669 1124454 1126988 1130841 1134202 1135516 1135159 1134583 1134337 1134005 1133492 1133187 1133160 1133196
58394 1133196 1133382 1133862 1134364 1134450 1133679 1131136 1125813 1118159 1110370 1104374 1100236 1096929 1093489 1088840 1081966
58379 1081966 1073424 1065720 1061154 1059933 1060679 1061499 1060336 1056251 1051299 1049145 1050567 1052172 1050959 1048251
58365 1048251 1047255 1048464 1049673 1049229 1047133 1043943 1040727 1039409 1041218 1045243 1049976 1055484 1062549 1070618
58351 1070618 1078457 1086152 1094742 1104400 1114549 1125189 1136512 1147739 1157894 1167497 1178256 1191452
58339 1191452 1207360 1225374 1243625 1259548 1272122 1282692 1292544 1300939 1306897 1311530 1316709 1322335
58327 1322335 1326713 1329058 1330099 1330853 1332146 1334579 1337586 1339260 1338501 1336742 1336391 1338336 1341926 1346375 1351093
58312 1351093 1355682 1360720 1367494 1376085 1384996 1393492 1402607 1412897 1423101 1432355 1441688 1451905 1461997
58299 1461997 1471356 1481394 1493146 1505424 1517372 1530529 1545971 1561610 1575026 1587069 1599888
58288 1599888 1613205 1625473 1636952 1648499 1658863 1666469 1672835 1680976 1691268 1701864 1712339 1723970
58276 1723970 1737021 1750608 1764852 1780551 1797171 1813356 1828890 1844247 1859293 1874384 1891264
58265 1891264 1910617 1930315 1948591 1967262 1989050 2013324 2037580 2061672 2087383 2114907 2142827
58254 2142827 2170621 2198445 2225612 2251926 2279170 2308688 2339250 2369909 2402581 2438461 2474331
58243 2474331 2506424 2535970 2566705 2598846 2630172 2661457 2695750 2733048 2770485 2807457 2846256
58232 2846256 2887957 2931706 2977646 3026638 3077602 3128899 3181706 3238397 3298594 3360525 3424854
58221 3424854 3492899 3562355 3629436 3694436 3760876 3830154 3901477 3975906 4055597 4139828 4226210
58210 4226210 4314939 4407666 4503688 4601871 4704596 4814836 4931261 5051494 5178032 5314979
58200 5314979 5460905 5611450 5767161 5931836 6104802 6282496 6466903 6664770 6878755
58191 6878755 7106536 7348192 7606753 7881467 8168249 8467361 8783658 9119199 9472721
58182 9472721 9846164 10243995 10666057 11108729 11573286 12065744 12588961 13142886 13731857
58173 13731857 14362835 15036668 15749806 16504039 17305336 18153857 19045064 19980121 20965002
58164 20965002 22000333 23083678 24221596 25427860 26710361 28072599 29528008 31099156
58156 31099156 32802118 34645150 36642818 38816234 41178163 43733253 46494416 49484220
58148 49484220 52721180 56223817 60030392 64197286 68778757 73829956 79431139 85686959
58140 85686959 92702608 100587084 109480830 119551519 130962077 143873426 158472181
58133 158472181 174947569 193435257 214034712 236899459 262284422 290533347 322049252
58126 322049252 357038772 394709066 432223108 464540511 485955371 492584433 483972108
58119 483972108 462741644 432952767 398574338 362768532 327759908 294911112 264903222
58112 264903222 237982226 214147383 193236698 174996470 159170853 145543017 133914148
58105 133914148 124099621 115962310 109408829 104332322 100582024 97980657 96300752 95170923
58097 95170923 94037395 92295462 89519306 85608726 80762000 75333468 69685249 64100615
58089 64100615 58766742 53794354 49236926 45101551 41366366 38004016 34991549 32303717
58081 32303717 29909476 27778631 25884073 24195968 22682634 21319766 20091396 18980608
58073 18980608 17967574 17037768 16182748 15390709 14645497 13937836 13268815 12639169 12043475
58064 12043475 11478088 10945934 10448687 9981565 9540398 9127081 8743141 8383595 8041520
58055 8041520 7713585 7397384 7088685 6785698 6491922 6211255 5944012 5690051 5451096
58046 5451096 5227055 5014452 4811361 4619626 4439557 4266791 4097487 3932781 3775380
58037 3775380 3625453 3482479 3347407 3220203 3098512 2981270 2870649 2768441 2673640 2585355
58027 2585355 2504682 2431678 2363723 2298870 2237784 2180754 2125983 2072511 2021609 1973564 1926159
58016 1926159 1877944 1830071 1783608 1738126 1694101 1653321 1615731 1579326 1544246 1513037 1485518
58005 1485518 1457726 1428096 1400552 1378853 1361486 1344925 1328741 1314404 1301648 1288925 1275664
57994 1275664 1261851 1247173 1232210 1218521 1206167 1193334 1179512 1166499 1155088 1143636 1131317
57983 1131317 1119844 1110361 1101451 1091935 1082877 1075177 1067935 1060826 1055216 1051248 1046845 1041520 1038050 1038130
57969 1038130 1039303 1038640 1036763 1035639 1034951 1033465 1031847 1031325 1031304 1030860 1030962 1032822 1035418 1036829 1036601 1034944
57953 1034944 1031254 1025442 1019244 1014107 1008965 1001832 992407 981658 970190 958321 946332 933507 918711
57940 918711 902989 889486 879545 871113 862362 854348 848291 842828 836275 829426 823795 819137 815059 812991
57926 812991 813892 815707 815956 815514 817207 821748 827399 832635 836872 839683 841589 844639 849986 855848 859994
57911 859994 863174 867681 873421 877920 879726 879467 877790 874446 869512 863818 858037 852472 847436 842813
57897 842813 837751 831742 825247 818460 810732 802354 795389 791194 788423 785227 782123 780707 780652 780214 779021
57882 779021 778208 778246 778637 779452 781335 784107 786904 789516 792114 793888 793464 790644 786551 782102 777235 771396
57866 771396 763988 754674 743986 733066 722238 710674 698186 686354 676917 669928 664332 659399 654847
57853 654847 650787 648393 649160 652484 655578 657049 658880 663396 670029 676912 683882 691567 698976 704729
57839 704729 709790 716402 724810 733401 741550 749830 757674 763441 766980 769882 772831 774755 774980 774330 773440
57824 773440 771605 768019 762893 756720 749492 741191 732191 722779 712993 703256 694593 687930 683434 680428
57810 680428 677818 675124 673473 674864 679871 686801 693635 699932 706241 712874 720202 728961 739025 748819
57796 748819 757214 764976 773121 780970 787253 791949 795223 795703 791989 785220 778031 771322 764068 755946
57782 755946 747970 740439 732314 723065 713562 704807 697087 690490 684962 679774 674228 668926 665053 662420
57768 662420 659481 655215 649594 642217 632207 619958 607622 597075 588075 578848 567895 555077 541524
57755 541524 528665 517074 506402 496612 488587 482897 478750 474965 471248 467638 463572 458695 454072
57742 454072 451386 451303 453455 457364 462433 467794 473173 479126 485526 491010 495046 499117 504302 509126 511770
57727 511770 513128 515430 518906 522318 525927 531028 536998 541699 544820 548047 551602 553438 552570 550666
57713 550666 549216 547217 542874 535977 527582 518706 510246 503041 497207 492279 488314 485858 484706 483853
57699 483853 482837 482049 481791 482171 483594 485931 487667 487633 487207 488843 492778 497389 502461 509361 517809 525442
57683 525442 531366 537403 544682 551576 556448 560204 564487 569300 574090 579516 586352 593850 600727 606740
57669 606740 612214 617258 622544 629499 638538 648327 657912 668112 679667 691596 702932 714639 728019
57656 728019 742406 756277 769861 784832 801936 820485 839835 859952 880802 902384 925128
57645 925128 949294 974279 999388 1024868 1051496 1079664 1109570 1141752 1176743 1214770 1256347
57634 1256347 1302286 1352498 1405812 1461807 1521961 1588132 1660771 1739412 1823909 1914328 2010798
57623 2010798 2114578 2228264 2353822 2491434 2641311 2805372 2985666 3182227 3394148
57614 3394148 3621776 3866066 4126478 4401338 4689501 4989483 5296931 5604424 5902958
57605 5902958 6180958 6421641 6604323 6711023 6732707 6670711 6534779 6340395 6105293 5845204
57595 5845204 5571565 5292708 5016055 4748329 4494376 4256817 4036834 3834748 3650084
57586 3650084 3481915 3329600 3193030 3072009 2965563 2872152 2790595 2720438 2661233 2611870
57576 2611870 2571076 2538194 2512839 2494159 2481392 2475013 2476283 2485526 2501934 2525126 2555614 2593330
57564 2593330 2637208 2687108 2744947 2812922 2891466 2979855 3077899 3186024 3304601 3434246 3575980
57553 3575980 3729787 3893564 4064454 4240641 4420806 4602430 4781425 4952434 5108316
57544 5108316 5240311 5340446 5403552 5426232 5405478 5340512 5235278 5096801 4931243 4743578
57534 4743578 4540604 4331078 4121656 3914703 3711123 3513419 3324598 3145749 2976650
57525 2976650 2817900 2670776 2535397 2410545 2295286 2189589 2093240 2005139 1924012 1849209
57515 1849209 1780464 1717232 1658697 1604329 1554143 1508281 1466539 1428622 1394727 1365322 1340057
57504 1340057 1317463 1296210 1276277 1258302 1242277 1227759 1215073 1205218 1198377 1193417 1189214 1185812
57492 1185812 1183993 1184344 1187057 1192081 1199014 1207353 1217351 1230339 1247693 1269454 1294187 1320193 1346818
57479 1346818 1374760 1405289 1439137 1476080 1515458 1556963 1600824 1647475 1697275 1750494 1807436
57468 1807436 1868695 1935275 2008179 2087793 2174097 2267559 2369181 2479265 2596683 2719941
57458 2719941 2848607 2983103 3123475 3268766 3417079 3565258 3708547 3841128 3957085
57449 3957085 4050772 4117085 4152493 4155867 4127852 4069738 3983578 3873015 3743071 3599175 3446854
57438 3446854 3291734 3138464 2989550 2846175 2710148 2583938 2468607 2362996 2265673 2176981
57428 2176981 2098409 2030368 1971327 1919171 1873113 1834124 1803401 1780354 1762541 1747950 1736951
57417 1736951 1731412 1732259 1738647 1749273 1763527 1781449 1803544 1830828 1864141 1903101 1946491 1993974
57405 1993974 2046869 2107002 2175426 2252284 2337012 2428424 2525514 2628724 2739694 2859099 2985146
57394 2985146 3114583 3244521 3372566 3495422 3607968 3703756 3776411 3821054 3835000 3817357
57384 3817357 3768327 3689284 3583329 3455001 3309293 3151385 2987022 2821847 2659707 2502183
57374 2502183 2350176 2205317 2069407 1943242 1826679 1719375 1620892 1530480 1447383 1371085
57364 1371085 1300950 1236045 1175805 1120371 1069767 1023213 979912 940106 904525 872921 843875
57353 843875 816016 788847 762414 736849 712464 689865 669732 652583 638576 627150 616850
57342 616850 605991 593788 580702 567683 555278 543578 532764 523353 515820 510006 504995 499679
57330 499679 493521 486906 480848 476284 473356 471187 468682 465817 463888 464107 466086 468133 468906 468344 467226
57315 467226 466550 467255 469742 473251 476350 478389 480063 482328 485303 488512 491594 494285 496256 497593 499114
57300 499114 501561 504594 507141 508686 509730 510930 512262 513298 514098 515458 518130 521945 526132 530531
57286 530531 535956 542901 550529 557766 565045 573768 584046 594243 603230 611866 621587 632642 644702
57273 644702 658217 673780 690587 706839 721654 735605 749475 763493 777786 792570 807708
57262 807708 822842 838131 854046 870370 886253 901637 917792 935935 955811 976051 995456
57251 995456 1013579 1030614 1047301 1064651 1083197 1102583 1122175 1141925 1162329 1183655 1205466
57240 1205466 1226917 1247555 1268054 1290212 1315713 1344533 1374781 1404404 1432981 1461666 1491712
57229 1491712 1523496 1556878 1591998 1629320 1668899 1709839 1750807 1791300 1832138 1874254 1917088
57218 1917088 1958895 1999060 2039555 2083423 2131926 2183628 2236126 2287906 2338209 2385685 2427980
57207 2427980 2462995 2490370 2511507 2528023 2540289 2547609 2549655 2547362 2542444 2536570 2531310 2528228 2528239
57194 2528239 2530912 2535050 2540165 2546886 2555838 2566654 2578401 2590553 2603234 2616819 2631618 2647719
57182 2647719 2664731 2681860 2698602 2715395 2733445 2754015 2778007 2806001 2838415 2875734 2918598
57171 2918598 2967246 3020664 3076888 3134732 3194844 3258288 3324315 3390366 3454271 3515667 3575194
57160 3575194 3633306 3690236 3746279 3801382 3855004 3907057 3958583 4010825 4063837 4116728 4169033
57149 4169033 4221044 4272712 4323001 4370793 4416100 4460043 4503870 4548249 4593399 4639401 4686246
57138 4686246 4733731 4781740 4830774 4881891 4935730 4991658 5048312 5105047 5162361 5220617 5278748
57127 5278748 5334709 5387014 5435366 5479859 5520112 5555580 5586543 5614391 5640663 5665820 5689185
57116 5689185 5710227 5729635 5748928 5769360 5791678 5816679 5845161 5877132 5911670 5947771 5984770
57105 5984770 6021701 6056964 6089176 6117880 6142906 6163490 6178603 6187933 6191997 6191508 6186982 6178783
57093 6178783 6167089 6152012 6134073 6114356 6094033 6074057 6055433 6038915 6023685 6006820 5984905
57082 5984905 5956011 5919556 5874793 5820468 5755763 5680599 5594975 5499075 5394139 5282113 5163666
57071 5163666 5037086 4899639 4749550 4586080 4407960 4212448 3995700 3753236 3479663
57062 3479663 3168694 2814374 2412378 1959494 1451676 883242 248224 -458499 -1242499
57053 -1242499 -2111889 -3077490 -4151293 -5345927 -6675562 -8156436 -9806651 -11646540
57045 -11646540 -13699186 -15989742 -18544922 -21395289 -24578920 -28142728 -32141722 -36639600
57037 -36639600 -41709822 -47433334 -53894188 -61177601 -69367199 -78533389 -88716997 -99924866
57029 -99924866 -112141779 -125337597 -139446642 -154324135 -169709543 -185227076 -200434976
57022 -200434976 -214904435 -228273147 -240216259 -250344731 -258131184 -262966038 -264333905
57015 -264333905 -261988191 -256013618 -246773374 -234811297 -220763634 -205289694 -189016581
57008 -189016581 -172499640 -156198759 -140467233 -125554745 -111625462 -98780367 -87069973
57001 -87069973 -76498701 -67032440 -58611228 -51158909 -44588027 -38806562 -33726928 -29269932
56993 -29269932 -25362514 -21936566 -18931452 -16294682 -13978878 -11940560 -10142748 -8556065
56985 -8556065 -7155801 -5919425 -4827074 -3861572 -3006572 -2246617 -1569951 -969049 -437119
56975 34265 453393 826368 1158092 1453444 1716376 1949796 2157765 2346361 2521172 2685365
56965 2685365 2841096 2990769 3135136 3271626 3396452 3507686 3605307 3689812 3762538 3826059
56955 3826059 3882048 3929013 3963573 3983526 3988723 3980410 3961936 3939469 3919435 3905059 3897463 3899896
56943 3899896 3916843 3945275 3967297 3954681 3883376 3745272 3548144 3307321 3038562 2756116
56933 2756116 2472438 2196625 1933476 1685357 1454568 1243068 1050935 876823 719838
56924 719838 579783 455914 346855 251471 168266 94096 25316 -39517 -99686 -154990 -206446
56913 -206446 -253867 -295250 -329809 -359619 -386538 -409077 -424161 -430939 -431033 -425919 -415996 -401806 -384127
56900 -384127 -362739 -336541 -305239 -269960 -232267 -193692 -156366 -123086 -96268 -77094 -65421
56889 -65421 -59935 -58627 -59913 -63202 -67818 -71885 -73290 -71687 -68492 -64684 -59513 -51783 -41640 -30376
56875 -30376 -18691 -5703 10129 29383 51145 73993 96904 118781 137494 150241 155094 151808
56863 151808 141286 125064 105355 84537 63927 43518 23183 3509 -14777 -31405 -46173 -58819
56851 -58819 -69697 -79743 -89190 -97091 -102710 -106617 -109773 -112441 -114730 -117345 -120740 -124189 -126726 -128388
56837 -128388 -129579 -129850 -128508 -126038 -123671 -121745 -119513 -116377 -112318 -107325 -101418 -95031 -88427 -80904
56823 -80904 -71700 -61646 -52875 -46783 -43124 -40959 -39389 -37262 -33380 -27480 -20220 -11881 -1757 10833
56808 25698 42282 60460 80480 102657 127426 155244 186147 219845 256475 296718 340549 385826
56796 385826 428273 462972 486271 496943 496015 485715 468716 448123 427426 409785 397337 391102
56784 391102 390939 395402 402570 411887 424761 442795 466057 493999 527339 567707 615572 669620
56772 669620 727844 787601 844142 890619 920800 931772 923980 899643 861908 814974 763873 713397
56760 713397 666895 625841 590543 561426 539398 524805 516507 512828 513453 519786 533400 554579
56748 554579 582389 615507 652508 691399 728880 760077 779576 783555 771351 745270 709380 668344
56736 668344 626163 584970 545384 508581 477101 452584 433521 416807 401316 388580 380194 376238
56724 376238 376394 380836 389245 400278 412942 427380 443230 457816 467040 467948 460072 444886 424761
56711 424761 402312 379980 359620 342034 326614 311753 296173 279945 263992 249066 235692
56700 235692 224415 215111 206558 198002 190740 186652 185220 183840 181252 178780 177501 176175 173293 169689
56686 169689 167521 167553 168725 169614 169130 166639 162816 159782 159030 159741 160305 160777 162165 163822 163636 161041
56670 161041 157993 156351 155726 154714 152926 150790 148271 145112 141934 139969 139677 140346 141055 141328 140697 138453
56654 138453 134487 130125 127442 127410 129010 130399 130697 130366 130209 130592 131492 132476 132470 130418 126700 123323 122007
56637 122007 122443 123107 123302 123461 123703 123437 122810 123490 126983 132538 137592 140308 141048 141310 141940 142756 143373
56620 143373 143722 143911 144141 144812 146179 147773 148654 148540 148279 148868 150349 152009 153340 154324 155143 156136 157859
56603 157859 160465 163034 164068 162895 160313 157860 156689 156995 158099 159136 159973 161336 163746 166657 169074
56588 169074 170686 171754 172226 171833 170869 170010 169331 168335 166992 165882 165150 164191 162616 160743 158920 157169
56572 157169 155813 155618 156724 158078 158426 157503 155983 154792 154652 155684 157113 157822 157426 156405 155239 154149
56556 154149 153609 154062 154823 154293 151753 148166 144908 142659 141903 143272 146553 150238 152925 154524 155483 155769
56540 155769 155432 155385 156616 159136 162416 166147 169832 172495 173809 174770 176242 177577 177874 177840 178905 180940
56524 180940 182479 183029 183600 184802 185955 186548 187379 189544 193114 197253 200944 203277 203840 203384 203497 205078
56508 205078 207528 209857 212144 215417 220358 226659 233552 240450 246982 252893 258409 264581 272666 282809
56494 282809 293641 303581 312275 320332 328015 334945 340855 345763 349471 351890 353835 356256 358493 358592
56480 358592 355893 352017 348600 345305 341002 335708 330231 324913 319894 315644 311917 307046 299778 291215
56466 291215 283598 277826 273515 270684 269601 269429 268961 268464 268935 269635 268437 264959 261380 259483 258547 257009
56450 257009 254700 252438 250555 248927 247681 246982 246653 246670 247457 249119 250953 252145 252449 251908 250581 248934
56434 248934 247806 247525 247631 247762 248174 249057 250067 250977 252148 253939 256234 258983 262563 267074 271813 275934
56418 275934 279216 281777 283588 284810 286184 288439 291515 294819 298259 302701 309289 318251 328375 337939
56404 337939 346434 355080 365245 376814 388798 400998 413895 427023 438816 448484 456909 465078
56392 465078 472506 477926 480960 482433 483399 484329 484925 484282 481551 476733 470681 464350 458405 453357 449247
56377 449247 445039 439163 431073 421673 412020 402361 392816 384074 376717 370416 364449 358600 353026 347662
56363 347662 342413 337672 334016 331495 329588 327790 325934 324067 322229 320317 318066 315425 312987 311640
56349 311640 311613 312151 312395 312282 312314 312652 312719 311740 309613 307218 305732 305618 306411 307440 308272 308443 307547 306053
56331 306053 305251 305651 306095 305258 303418 301785 300794 300335 301022 303569 307055 309535 310603 311841 314364 317414
56315 317414 319861 321719 323478 325150 326681 328294 329696 329888 328447 326265 324616 324355 326269 330854 337069
56300 337069 342576 346187 349065 352660 356492 359100 360307 361363 363370 366530 370402 374080 376697 378646
56286 378646 381656 386678 392290 396226 398040 399246 401304 404566 408897 414094 419566 424498 428554 431970
56272 431970 435087 438299 442245 447512 454303 462734 472928 484191 494747 503311 510643 518574 527580
56259 527580 536340 543739 550283 557262 565381 574715 585270 596838 608618 619712 630074 640532 651760
56246 651760 663603 675543 687428 699438 711670 724279 737691 751878 765508 776912 786220 795480
56234 795480 806066 816997 826686 835293 844063 853148 861637 869355 877155 885666 895192 906645 921023
56221 921023 937915 955958 974831 995439 1018187 1042706 1069481 1100094 1135519 1175615 1220495
56210 1220495 1270551 1324737 1380831 1438334 1499527 1566787 1640374 1719710 1805231 1897890 1998292
56199 1998292 2107502 2227361 2358724 2500477 2651451 2812237 2983959 3166296 3357850
56190 3357850 3557500 3764133 3975674 4189311 4401980 4609967 4808968 4995327 5166297
56181 5166297 5318585 5447949 5551209 5627549 5677198 5700285 5698022 5673558 5630316 5570449 5495885
56170 5495885 5409601 5314632 5212676 5104541 4990871 4871678 4746541 4616121 4482036 4344575
56160 4344575 4202459 4055888 3907671 3759823 3611105 3459758 3306834 3154902 3005332
56151 3005332 2858987 2717828 2583426 2455368 2333411 2219565 2115366 2018640 1926097 1838137
56141 1838137 1757986 1686674 1621989 1562156 1507519 1458402 1413940 1373520 1337255 1304756 1275261
56130 1275261 1248964 1226346 1206327 1186916 1167633 1149587 1133441 1119034 1106568 1096249 1087180
56119 1087180 1078612 1071855 1068778 1068753 1069367 1069899 1071851 1076113 1081944 1088908 1097745 1109032 1122697 1138734
56105 1138734 1156673 1174706 1191387 1207939 1226897 1248892 1272924 1299245 1329215 1362335 1396084
56094 1396084 1428927 1461177 1492905 1523662 1554579 1588066 1624711 1662746 1701209 1741641 1786198
56083 1786198 1836132 1892537 1956476 2027832 2105888 2191419 2286589 2392882 2511044 2642595 2788634
56072 2788634 2946855 3112044 3279510 3445440 3604135 3748546 3875005 3985322 4083608 4173079
56062 4173079 4255743 4331555 4396423 4443573 4468379 4470346 4450673 4411135 4356135 4292204 4223201
56051 4223201 4147797 4062601 3965314 3853972 3726531 3583603 3429771 3270649 3110548 2954035
56041 2954035 2806837 2672880 2552243 2443869 2348499 2267171 2198750 2141108 2093394 2055182
56031 2055182 2024574 1999077 1977673 1960563 1947542 1937708 1930139 1924036 1918890 1914961 1912683 1911399 1909836
56018 1909836 1907965 1906870 1906631 1906081 1905058 1905163 1907807 1912943 1919980 1928451 1937785 1948026 1960696 1977263
56004 1977263 1997085 2018671 2042173 2068268 2095507 2121859 2148304 2177562 2209637 2242284 2275604
55993 2275604 2312043 2351487 2390643 2428217 2466696 2507938 2550979 2595474 2643274 2694853 2747805
55982 2747805 2800622 2854711 2911282 2969642 3029750 3092814 3158063 3222859 3287445 3355507 3428261
55971 3428261 3502228 3574996 3649226 3728625 3813772 3904283 4001322 4105367 4214775 4328982 4450147
55960 4450147 4579820 4717202 4862166 5016233 5179077 5348160 5523565 5709015 5906585
55951 5906585 6114897 6334094 6567436 6815950 7076689 7348618 7634971 7937548 8254406
55942 8254406 8585944 8937351 9311708 9706386 10119733 10555811 11019124 11510333 12030663
55933 12030663 12584730 13175375 13801432 14463817 15167589 15914775 16702031 17528785 18400312
55924 18400312 19319363 20283222 21293560 22360773 23494251 24697950 25981159 27363616
55916 27363616 28863178 30487723 32245672 34154026 36228344 38475232 40903151 43531120
55908 43531120 46379933 49467388 52821547 56487550 60514194 64949311 69859151 75337522
55900 75337522 81485964 88403183 96205807 105038058 115045625 126363162 139145475 153587118
55892 153587118 169896081 188284050 209004524 232350902 258570135 287787695 319926401
55885 319926401 354336895 389058137 420347508 443378663 454090490 450943113 435296416
55878 435296416 410369502 379813097 346790594 313666253 281993872 252631489 225944326
55871 225944326 202007284 180722253 161882696 145246217 130590278 117711005 106403301
55864 106403301 96472848 87757165 80115843 73410795 67511376 62306546 57695979 53579467
55856 53579467 49869797 46507207 43448188 40648589 38068995 35686440 33486472 31449543
55848 31449543 29555894 27796451 26167088 24657346 23254506 21952808 20748580 19631317
55840 19631317 18588974 17617327 16715235 15875269 15087752 14349872 13662263 13020399 12417642
55831 12417642 11853419 11330125 10844267 10387844 9956162 9547900 9160092 8789515 8436718
55822 8436718 8102674 7783718 7475367 7178642 6897022 6629561 6372374 6124388 5886363
55813 5886363 5656955 5435317 5225058 5029846 4847206 4672279 4505617 4351289 4208719
55804 4208719 4072331 3938681 3808739 3683623 3562926 3446843 3335455 3225896 3114102
55795 3114102 2999279 2883655 2768877 2656091 2548409 2449313 2359015 2275482 2198203 2127774
55785 2127774 2062850 2001190 1943300 1891833 1847537 1808361 1772082 1737475 1703719 1671028 1641129
55774 1641129 1615188 1592320 1571859 1555202 1543196 1533647 1524009 1514760 1507468 1501518 1495541 1490144 1485971
55761 1485971 1480754 1471450 1457890 1441318 1421153 1396474 1369014 1341047 1311709 1279071 1244564 1211461
55749 1211461 1180032 1148151 1116029 1086322 1059787 1034680 1010562 989196 971398 956202 943469
55738 943469 934314 928486 923915 919195 914363 909469 904759 901883 902197 904079 904602 903684 903753 905479 906816
55723 906816 906377 904748 902091 897431 891083 885173 880812 876973 872839 868914 864786 857861 845608 827865
55709 827865 806317 783065 760202 739341 720788 703876 688185 673589 659529 645555 632273
55698 632273 620379 609128 597142 584275 571246 558063 544584 531988 521681 513113 504681 496410
55686 496410 489622 484258 478848 473077 468067 463896 459122 453147 446981 441197 435098 428506 422543 418005
55672 418005 414490 411574 409301 407161 404298 401224 399652 399900 399877 397311 391867 384669 377064 370335 365239
55657 365239 361079 356122 349551 342291 335786 330792 327413 325273 323580 322043 321749 324099 328888 334452
55643 334452 339548 343819 346657 347244 345943 344300 343265 342593 342158 342500 343645 344519 344176 342873 341681 341765
55627 341765 344136 349239 356428 364392 372164 379396 386152 393210 402045 413379 425935 437524 447158
55614 447158 455199 461838 466552 468880 468798 466510 462585 457978 453262 448383 443644 439834 436717 432899 428450
55599 428450 425985 427334 430648 433048 434793 438148 443136 447540 450816 454869 460609 466492 471042 474312
55585 474312 476104 475075 470707 464431 457911 451599 445401 439267 432743 425379 417807 410927 404190 396423
55571 396423 388167 380997 374521 366475 356041 344580 332672 319256 304641 291631 282221 275366 269338
55558 269338 263902 258659 251671 242056 232298 225714 222594 220622 217988 214296 209374 203269 197084 192233
55544 192233 188976 186679 185027 184009 183172 181967 180563 179613 179566 180578 182367 183694 182894 179607 175269
55529 175269 171426 168358 165683 163158 160272 156183 150857 145357 140401 135756 131576 128973 128330 128230 127016
55514 127016 124394 120631 115529 109387 103826 100224 98096 96220 94597 94012 94373 94856 95367 96582 98679
55499 98679 100933 102474 102934 102588 102236 102551 103273 103672 103837 104505 105496 105808 105744 107239 111027 115070 117158
55482 117158 117732 118461 119206 118423 116115 114325 114665 116790 119488 122064 124406 126582 128783 131244 134127
55467 134127 137524 141184 144232 146046 147673 151213 157067 162981 166770 168901 171133 173589 174794 174102
55453 174102 172527 171388 171365 172707 174994 176661 175950 172637 168089 163489 158716 153013 146191 139061 132880
55438 132880 128168 123929 118635 112305 106801 103514 101595 99228 95797 91848 87708 83299 78857 74707
55424 74707 70690 66759 63748 62529 62628 62555 61211 58378 54475 50743 48911 49539 51247 52653 54287 57151
55408 57151 60093 60534 57650 53089 48432 43788 39284 36223 35693 37057 38615 39160 38501 37217 36324 36432
55392 36432 36807 35935 33334 30223 28143 27610 28360 30031 32035 33355 33148 31417 28889 26554 25371 25866
55376 25866 27670 29790 31499 32651 33216 33080 32371 31278 29386 25950 21300 17373 16183 18035 21657
55361 21657 25709 29588 32935 35240 36299 36785 37866 40190 43298 46059 47555 47583 46574 45261 44252
55346 44252 43641 43058 42356 42028 42478 43054 42545 40789 39034 38313 38084 37037 34783 32143 30069 28845 28228
55329 28228 27808 27202 26254 25132 24204 23895 24591 26312 28371 29794 30165 29729 28699 27099 25411 24538 24720
55312 24720 25166 25134 24783 24590 24595 24642 24597 23909 21940 19391 18295 19542 21260 21009 18976 17566 18117 19520
55294 19520 20164 19808 19069 18257 17473 17136 17570 18238 18025 16504 14658 14024 14955 16138 16332 16263 17736 20756
55276 20756 22879 22212 19966 18923 20084 22038 23190 23337 23205 23458 24127 24256 22410 18451 14414 12526
55260 12526 12571 12502 11454 10691 11357 12816 13883 14492 15222 15996 16330 16475 17461 19928 23391 26656 28729
55243 28729 29369 28929 27777 25999 23811 22028 21690 23071 25259 26848 27099 26573 26584 27773 29269 29694
55227 29694 28935 28190 28174 28244 27744 27116 26885 26437 24978 23000 21704 21453 21923 23217 25426 27501 28207 28147
55209 28147 29179 31468 32767 31416 28790 27684 29054 31344 32621 32457 31811 31751 32501 33486 34066 34001 33221
55192 33221 31658 29783 28902 30126 33043 35950 37458 37449 36681 36041 36031 36366 36162 35038 33850 33749 34773
55175 34773 36088 37341 38842 40573 41979 42726 42773 41714 39189 36063 34041 33695 33872 33539 33255 34075
55159 34075 35759 37036 37335 37477 38538 40463 42014 42087 40917 39722 39134 38563 37458 36576 37163 39208
55143 39208 41362 42453 42336 41436 40277 39354 38671 37601 36034 35317 36824 39694 41445 41131 40496 41430
55127 41430 43451 44509 43375 40455 36935 34024 32549 32509 33120 33703 34296 35202 36326 37282 37858 38113 38171
55110 38171 37960 36989 34652 31205 28155 26946 27414 28262 28873 29698 30901 31712 31371 29986 28204 26748
55094 26748 26234 26655 27052 26584 25820 25946 26933 27784 28559 30492 33745 36720 38155 38400 37821 35622 31483
55077 31483 27155 24947 25323 26995 28646 29566 29403 28491 27855 27932 27791 26559 25047 25023 27300 31265 35710
55060 35710 39342 41239 41796 42549 44187 45473 45208 44418 45167 47800 50882 53485 55969 58553 60706 62270
55044 62270 63864 65757 67282 67786 67364 66453 65456 64924 65381 66715 68314 69780 70819 70684 68840 66293
55028 66293 65081 65943 67379 67526 66141 64206 62483 61308 61215 62624 64977 67004 67984 68275 68453 68467 67959
55011 67959 67171 67088 68441 70744 72548 72811 71860 70832 70274 69621 68137 66109 64837 65425 67709 70404
54995 70404 72230 72794 72498 71910 71453 71415 71852 72418 72619 72350 71886 71296 70218 68503 66900 66709 68594 71708
54977 71708 74125 74428 72957 71308 70441 69734 68255 66446 65697 66363 67166 66858 65733 64971 64901 64541 62847
54960 62847 60094 57836 57343 58174 58667 57990 57061 57052 57828 58810 60618 64351 69474 73983 76853 78766 80088
54943 80088 79909 78037 76335 76624 78326 79711 80746 82937 86636 90164 91885 91813 90675 88558 85382
54928 85382 82071 80093 79725 79533 78082 75848 74781 75958 78383 80430 81695 82775 83978 85285 87018
54913 87018 89214 90661 90129 88558 88375 90276 92339 92934 92800 93205 93645 92896 91329 90604 91616 94010
54897 94010 97181 100543 103235 104882 106571 110023 115684 122232 127789 131256 132927 134396 137461 142670
54883 142670 149347 157101 166229 176184 185207 192666 200557 211179 224125 237027 248496 258634 267130
54870 267130 272722 274637 273121 268358 260075 248460 234642 220192 206694 195339 186024 177206 167600
54857 167600 157623 148427 140317 133307 128375 126450 126535 126424 125069 122864 120282 118017 117921 121356 126551
54842 126551 130013 131120 133096 138503 145920 152402 157472 163036 170569 180119 191410 204344 218326
54829 218326 231932 243250 250486 252881 251396 247697 242116 233409 220991 206379 191797 178243 165748
54816 165748 154624 145322 137458 130065 122775 116135 110816 106855 103553 99822 94896 89046 83471 79379
54802 79379 77276 76898 77300 77208 76055 74751 74711 76075 77656 78649 79417 80377 81187 81449 81356 81198 80984 80875
54784 80875 81134 81239 80077 77594 75375 74823 75487 75876 75164 73326 70360 66474 62710 60443 60240 61739
54768 61739 64466 68156 72431 76646 80044 81852 81470 79034 75690 73105 72547 74263 77344 80304 82183
54753 82183 83162 83830 84229 84195 84248 85171 86792 88204 89178 90261 91445 92054 92331 93802 97391 102188 106780
54736 106780 110890 115073 119769 125358 132185 139705 146457 151749 156667 162661 170006 178478 188519 200464
54722 200464 213295 225596 237412 249785 262495 273547 281266 286065 289651 292894 294772 293368 287858
54709 287858 279430 270095 260849 251647 242988 236367 232695 231168 230258 229093 227414 225105 222517 220641
54695 220641 220215 221136 223162 226384 230597 235145 240056 246351 254518 263747 273539 284907 298753 314101
54681 314101 329387 344695 361210 378979 396731 413398 428244 439756 446045 446522 442090 433750
54669 433750 422054 407622 390910 371774 350472 328825 308895 290758 273187 256358 241952
54658 241952 230295 219381 207595 195839 185940 178213 171746 166136 161786 158974 157535 157193 157523 157904
54644 157904 157977 157879 157766 157514 157138 156961 157021 156757 155681 153993 152226 150636 149172 147747 146383 145317 144971
54627 144971 145465 146297 146990 147952 150040 153342 156986 159984 161568 160953 157982 154164 151961 152562 155109 158369
54611 158369 162203 166887 172006 176761 180808 184199 186986 189456 192173 195288 198226 200495 202227 203496
54597 203496 203853 203293 203146 205021 208988 213543 217329 220279 223020 225715 227798 228786 229244 230837 235094
54582 235094 241973 249989 257992 266538 277166 290487 305372 320141 334404 349497 366920 386418
54570 386418 406011 423966 440180 455205 468552 478660 484002 483410 476001 462229 444873 427426
54558 427426 411049 394306 376116 357443 339423 321449 302602 284030 268398 257138 249339 243115
54546 243115 237212 231379 225981 221295 216823 211621 205664 200287 196555 193805 190701 187298 184832 183570
54532 183570 182036 178733 173835 168759 164604 161339 158148 154199 149241 143732 138528 134508 132286 131749
54518 131749 131765 130923 128885 126485 124228 121538 118112 115091 113729 113442 112437 110164 107919 106906 106791
54503 106791 106463 105256 103146 100634 98860 99035 101200 104106 106639 108696 110351 111054 110444 109336 108995
54488 108995 109595 110137 109807 108823 107961 107705 107987 108458 109003 110164 112888 117576 123422 129038 133755 138120
54472 138120 143059 148785 154640 159949 164797 169840 175378 181016 186496 192497 199962 208763 217756 226332
54458 226332 235030 244015 251555 254958 252974 246700 238251 229204 220300 211754 203247 194053 183839 173485
54444 173485 164762 158960 155783 153513 150353 145795 140896 137186 135255 134313 133090 131013 128487 126158
54430 126158 124126 122017 119654 117275 114988 112422 109334 106433 104935 105205 106322 107210 107689 108079 108309
54415 108309 108162 108174 109477 112561 116530 119722 120878 119998 118587 118876 122031 126902 131052 133172 133952 134571
54399 134571 135139 135055 134153 132885 131840 131697 133108 135792 138005 137868 135375 132586 131731 133462 136706 139553
54383 139553 140351 138688 135613 132514 129718 126636 123203 120435 119263 119339 119352 118249 115963 113247 110965
54368 110965 109371 108161 107394 107878 109900 111930 111928 110160 109381 111493 115100 117358 117393 116761 117171 119051 122003
54351 122003 125244 127596 128360 128570 130294 134184 138569 141423 142459 142778 143331 144541 146895 150851 156111
54336 156111 161604 166314 169924 172888 176237 180897 186581 191489 193869 193967 193726 194335 194809 193491 190378
54321 190378 187108 184872 183126 180474 176083 170093 163357 157235 152939 150402 148220 145326 142283 140137
54307 140137 138447 135704 131682 128148 126719 126989 127354 126910 125919 125098 125208 126796 129484 131856 132762 132543
54291 132543 132499 133531 135798 139153 143064 146499 148733 150011 150796 150916 150358 150349 152270 155623 158425 159762
54275 159762 160703 162463 164891 167144 168697 169099 167802 164952 161616 158631 155951 153502 151668 150313 148289
54260 148289 144794 140448 136190 132000 127673 123961 121648 119998 117584 114372 111672 110069 108696 106621
54246 106621 103717 99990 95272 90056 85560 82528 80818 80458 81822 84113 85019 83163 80143 78784 79786
54231 79786 81391 82112 82261 82607 82978 82917 82680 82775 83124 83435 83788 84153 83875 82527 80815 79691 78965 77913
54213 77913 76995 77565 79678 81627 82203 82177 82774 83937 85152 86867 89568 92209 93189 92621 92027 91847 90964
54196 90964 89012 87460 87551 88419 88271 86583 84236 82262 81445 82520 85616 89605 92772 94141 93796 92340
54180 92340 90643 89710 90040 91206 92513 93758 94913 95482 94916 93407 91593 89703 87738 86251 86070 87157
54164 87157 88477 89157 89318 89668 90806 92916 95633 98094 99585 100224 100629 101010 101054 100639 100083 99685 99566
54147 99566 99961 101047 102404 103295 103586 103753 103871 103407 102311 101471 101462 101487 100290 97764 94984 92902 91756
54130 91756 91575 92454 94062 95399 95565 94609 93384 92526 91806 90662 89279 88741 89762 91476 92137 91177 89950
54113 89950 90024 91122 91357 89347 85596 81800 79307 78427 78837 80203 82361 85077 87849 90115 91671 92670
54097 92670 93154 92803 91368 89213 87250 86407 87223 89550 92286 93673 92492 89120 85074 81497 78466
54082 78466 75772 73852 73525 75016 77426 79118 78790 76591 74185 73146 73156 72444 70289 68291 68458 70737
54066 70737 73403 75400 77044 78458 78824 77739 76181 75257 74730 73667 72003 70471 69256 67730 65617
54051 65617 63675 62926 63621 65080 66327 66934 67446 68757 70840 72544 73173 73704 75520 78183 79597 78545
54035 78545 76110 74268 73969 74972 76656 78274 79114 79294 80101 82829 87335 92112 95517 96636 95574
54020 95574 93647 92825 93975 95580 95128 91990 88233 86303 86634 88066 89926 92676 96514 100319 102649
54005 102649 103458 104145 105860 108256 110100 110737 110591 110519 111198 113048 116186 120237 124441 128188 131330 133942
53989 133942 135963 137229 137822 138452 140388 144653 150927 157634 163519 168799 174177 179180 182634 184893 188381
53974 188381 195286 205336 216399 226571 235041 241599 246477 250773 256217 264040 274061 284802 294451
53961 294451 302005 307748 312624 317199 321494 325553 329468 332689 334126 333425 331606 329985 328866 327710
53947 327710 325977 323273 319152 313581 307462 302103 298157 295232 292234 287891 281510 273734 266181 259932
53933 259932 254675 249482 243797 237445 230614 224423 220495 219031 218113 215888 212791 210567 209919 210447 212102
53918 212102 214888 217358 217292 214220 209835 205659 201701 197779 194668 193163 193088 193903 195397 197167 198328
53903 198328 198346 197449 195725 192760 188725 184883 182307 180946 180646 182074 185496 189355 191402 191169 190323 190570
53887 190570 192041 193847 195508 197507 200746 205614 211513 217340 222533 227493 233010 239667 247826 257596
53873 257596 268463 279356 289382 298225 305694 311584 316354 321286 327217 333382 338072 340412 341126 341840
53859 341840 343947 347885 353090 358739 364670 371397 379145 387427 395787 404380 413462 422853 432403 442437
53845 442437 453111 463677 473026 480691 486745 491096 493576 494560 494722 494158 492294 488699 483593 477520
53831 477520 470949 464180 457351 450545 444078 438428 433488 428022 420334 409574 396303 381986 368194
53818 368194 355976 345541 336490 328526 321701 315823 310035 303487 296227 288980 282170 275535 268509 260660
53804 260660 251900 242750 234324 227617 222692 218662 214385 209191 203306 197826 193944 191882 190752 189519
53790 189519 187536 184097 178504 171354 165062 162004 162237 163787 164892 165162 164780 163710 161981 160066 158566
53775 158566 157799 157659 157549 156663 154855 153032 152173 152191 152460 153105 154807 157368 159586 160834 161844 163483
53759 163483 165515 167164 168374 169827 171930 174260 176025 176946 177689 179314 182153 185413 188248 190879 194031
53744 194031 197629 201008 204451 209428 216763 225324 233130 239379 245015 251725 260660 271601 282866 292348
53730 292348 299147 304164 308963 314346 320122 325768 330885 335174 338333 340132 340733 341059 342391 344975 347258
53715 347258 347327 345121 342451 340768 339772 338292 335423 330466 322966 313705 304825 298090 293467 289962 286963
53700 286963 283957 279916 274334 268395 263761 260400 256810 252265 247513 243100 238312 232342 225604 219235
53686 219235 213911 209719 206746 205253 205274 206150 206385 204332 199699 194273 190367 188414 186836 184348 181497
53671 181497 179528 178706 178461 178515 179046 180099 181677 184094 187464 190885 192982 193393 193174 193549 194762 196380
53655 196380 198212 200434 203008 205438 207290 208779 210673 213581 217417 221623 225794 229899 233883 237352
53641 237352 239879 241492 242663 243923 245653 248124 251343 254746 257314 258350 258233 258219 259378 261750 264629
53626 264629 267501 270387 273209 275314 276045 275674 275321 275912 277468 279455 281456 283357 285052 286108 285756
53611 285756 283506 280014 276977 275571 275151 274240 272673 271732 271978 272286 271750 271359 272436 274212 274602 273253
53595 273253 272104 272507 273232 272208 269223 265892 263537 262102 260960 259895 259168 259052 259441 259841 259907 260099
53579 260099 261331 263663 265792 266426 265926 266039 268083 271800 275879 279166 281352 282853 284156 285262 285881
53564 285881 286230 287175 289360 292570 296273 300349 304791 309269 313667 318664 324951 332047 338708 344378 349411
53549 349411 353973 357727 360728 363635 366815 370074 373563 378025 383710 389944 396309 403343 411331 419292
53535 419292 426164 432415 439390 447340 455068 461434 466342 470284 473751 477197 480835 484224 486662 488155
53521 488155 489577 491696 494406 496968 498693 499366 499353 499295 499454 499536 499481 499983 501512 503158 503571 503150 504126 507857
53503 507857 512871 516317 516903 515713 514543 514243 514623 515182 515662 516122 516677 517185 517414 517667 518868 521633 525419
53486 525419 528975 531606 533710 536239 539958 545090 551123 556956 561733 565785 570434 576597 583819 590921
53472 590921 597384 603697 610454 617594 624867 632785 642560 654822 668739 682798 696479 710731 726647
53459 726647 744088 761985 779702 797623 816506 836746 858327 880976 904164 927378 950757
53448 950757 975132 1001068 1028160 1055792 1084501 1115891 1150891 1188479 1226588 1264204 1302205
53437 1302205 1341958 1383278 1424158 1462811 1499759 1537343 1576999 1617634 1657221 1695369 1733304
53426 1733304 1771560 1809106 1845202 1880907 1917712 1955380 1992224 2027148 2060407 2092611 2124123
53415 2124123 2155499 2187409 2219736 2251453 2281714 2310502 2338117 2364770 2390784 2416239 2440010
53404 2440010 2460080 2475508 2487408 2497280 2504965 2509085 2509153 2506472 2502866 2498851 2492893 2482393 2465963
53391 2465963 2445067 2422857 2401097 2378981 2355286 2330409 2305234 2279072 2250398 2219230 2187250
53380 2187250 2155707 2124636 2094112 2064694 2036235 2007685 1978710 1950378 1923644 1898301 1874174
53369 1874174 1852258 1833552 1817468 1802512 1788134 1774925 1763308 1753005 1743757 1735786 1729435 1724990
53357 1724990 1722979 1724131 1728832 1736784 1747173 1759003 1771481 1784508 1798861 1815654 1835578 1858686
53345 1858686 1884714 1913362 1944341 1977442 2012616 2050003 2089885 2132518 2177862 2225576 2275518
53334 2275518 2328011 2383219 2440511 2499152 2559553 2623043 2690226 2760359 2832596 2906894 2983103
53323 2983103 3060036 3136366 3212069 3288144 3365106 3442278 3518315 3591963 3662664 3730877 3797443
53312 3797443 3862154 3923555 3980659 4034077 4084528 4130914 4171100 4204167 4230586 4250568 4263823
53301 4263823 4270958 4273332 4271036 4262471 4246579 4224099 4195820 4161167 4119843 4073605 4024538 3972149
53289 3972149 3914075 3849720 3781663 3713203 3645818 3579419 3513704 3448453 3383352 3318512 3254800
53278 3254800 3193097 3133620 3076293 3021064 2967283 2913455 2858504 2802849 2747455 2692371 2637277
53267 2637277 2583064 2531406 2482666 2435608 2389594 2345804 2305573 2268820 2235060 2204830 2178616
53256 2178616 2155045 2131733 2107785 2084062 2061041 2037951 2014329 1991131 1969726 1950791 1934564
53245 1934564 1921000 1909097 1897341 1885755 1876559 1871754 1870872 1872189 1875283 1881011 1889537 1899969 1911800
53232 1911800 1925162 1939587 1953995 1968428 1984582 2004060 2027031 2053083 2082231 2114266 2148053
53221 2148053 2182569 2218071 2255080 2292474 2327763 2359512 2388593 2416602 2443646 2468331 2489656
53210 2489656 2508110 2524626 2538984 2549916 2556671 2559662 2559326 2555267 2547327 2536848 2525633 2513780
53198 2513780 2499744 2482740 2463765 2443721 2421771 2396621 2368612 2339337 2309584 2278867 2246884
53187 2246884 2214299 2181925 2149929 2118039 2085738 2052145 2016634 1979999 1944263 1910736 1878833
53176 1878833 1847297 1815896 1785074 1754475 1723169 1691515 1661645 1635338 1611926 1589110 1565601
53165 1565601 1542218 1520320 1499869 1479476 1458046 1435967 1414756 1395816 1379458 1364852 1350834
53154 1350834 1336778 1322673 1308496 1293901 1278731 1263405 1248373 1233393 1217772 1201116 1183347
53143 1183347 1164265 1143914 1123347 1104028 1086154 1068488 1050417 1033211 1018277 1004840 990648
53132 990648 974689 957951 941443 924826 907447 889659 872343 855928 840484 825965 811494
53121 811494 795240 776218 755867 736754 720005 705182 692241 681708 672573 662072 648894 635211
53109 635211 623778 613991 602831 589388 576163 565380 556071 546029 535123 525061 516691 509174
53097 509174 501490 493265 484113 473617 462369 451939 443249 435730 428441 421311 414861 409436 405187
53084 405187 402173 399882 397220 393595 389524 385647 381715 377321 373082 370005 367900 365536 362454 359620
53070 359620 357910 356778 354975 351998 348305 344503 340955 338016 336059 335048 334283 332736 329836 326107
53056 326107 322874 320975 319729 317536 313605 308764 304366 300776 297216 292889 287971 283501 280330 278120
53042 278120 275539 271804 267878 265593 265500 266189 265974 264623 263079 262102 261875 262463 263834 265489 266722 267346
53026 267346 267772 268369 269032 269282 268630 267099 265680 265785 267805 270708 273584 276905 281247 285410 287377 287143
53010 287143 287018 288647 291067 292385 292099 290831 288948 286750 285222 285062 285208 283751 280327 276451 273372
52995 273372 270760 267810 264484 261011 257045 252210 247030 242457 238557 234346 229089 223320 218223 214171
52981 214171 210294 205811 201604 199839 201660 205657 209092 210308 209434 207085 203481 199101 195206 192906
52967 192906 191996 191261 189803 187704 185559 183801 182521 181638 181064 180651 180090 179044 177644 176638 176624 177227
52951 177227 177565 177580 178177 179715 181116 181147 180114 179434 179790 180635 181660 183692 187544 192593 197281 200711
52935 200711 202983 204066 203363 200878 198088 196763 196999 197118 195643 192849 190152 188572 188177 188670 189892
52920 189892 191793 194221 196769 198718 199385 198712 197322 195816 194428 193674 194696 198112 202666 205951 206639
52905 206639 205477 204053 203289 203310 203985 205044 206087 207016 208243 210127 212382 214325 215602 216468 217487 219075
52889 219075 221198 223542 226125 229591 234551 240699 247036 252904 258249 262875 266235 268294 269944 272063
52875 272063 274552 276746 278505 280485 283544 288097 293851 299915 305361 309753 313022 315074 316121 317141
52861 317141 319113 321653 323411 324125 325173 327488 329953 330855 330136 329120 328567 328146 327507 326697 325635 324192
52845 324192 322804 322026 321435 319894 317144 314409 313108 313559 315048 316568 317236 316637 315203 313910 313274 312818
52829 312818 311711 309823 308079 307786 309485 312395 315129 316919 317730 317305 315143 311915 309825 310364 312281
52814 312281 313050 312081 311180 311928 313945 315939 317150 317227 315902 313690 312118 312338 313882 315474 316767 318645
52798 318645 321955 326445 330863 333745 334169 332113 328342 324036 320489 318753 319016 320294 321057 320271 317860
52783 317860 314591 311954 311606 314028 317705 320433 321429 321471 321049 319521 316490 313048 310845 310291 310347 309912
52767 309912 308970 308339 308516 308837 307982 305493 302510 300562 299920 299717 299376 299088 299010 298918 298730 298518 297895 296315
52749 296315 294170 292687 292484 293034 293784 294788 295995 296945 297685 298920 300640 301599 300931 299386 298066 296672
52733 296672 293983 289544 284084 278697 274306 271320 269006 265677 260337 253721 247130 240951 235140 230340
52719 230340 227199 225009 222332 218849 215440 212541 209650 206670 204531 203947 204244 203878 201759 197976 193654
52704 193654 190135 187826 185872 183380 180777 179240 178899 178471 176861 174255 171267 167795 163449 158747 155024
52689 155024 153058 152268 151504 150301 148906 147239 144606 140875 137317 135298 134385 132855 130215 128001 127537
52674 127537 128068 128019 127103 126009 124695 122398 119166 116102 113950 112415 111039 109985 109776 110885 113592
52659 113592 117581 121689 124659 126198 126783 126586 125373 123373 121429 120120 119362 118852 118255 116875 113995
52644 113995 109874 105855 103273 102601 103652 105991 108903 111499 113163 113757 113441 112578 111689 111198 111311 112321
52628 112321 114489 117201 118965 119138 119087 120591 123491 126109 127644 128720 129667 129906 129433 129448 130788 132791
52612 132791 134366 135169 135154 134051 132180 131000 132001 135448 140618 146474 151617 154606 155371 155799 157975
52597 157975 162157 167071 171650 175608 178749 180691 181317 180893 179754 178293 177032 176287 175841 175207 173977
52582 173977 171804 168564 164830 161745 160003 159312 158909 158024 155813 152083 148595 148314 152285 158172 163043
52567 163043 166583 170027 172842 172809 169479 165347 162767 161420 159900 158335 157802 157978 157198 154920 152683
52552 152683 152068 152678 152847 151828 150443 149754 149868 150305 150869 151598 152110 151697 150203 148282 146493 144575 142021
52535 142021 139187 137358 137619 139877 143079 146247 149171 152170 155388 158641 161923 165599 169737 173685
52521 173685 176858 179608 182519 184994 185631 184255 182512 181986 182655 183903 186002 189431 193373 196371 198371
52506 198371 200813 204457 208293 211053 212777 214144 215007 214666 213413 212911 214774 219113 224464 228801 230674
52491 230674 230115 228869 229278 232264 236424 239542 240910 241630 242795 244215 245186 245581 245650 245546 245766 247244
52475 247244 249996 252465 253510 254391 257079 260990 263472 263774 264289 267024 270898 273902 276119 278744 281403
52460 281403 282591 282071 280848 279203 276694 273942 272414 272219 271908 270886 270366 271263 272608 272920 272013 270592
52444 270592 269038 267537 266491 265754 264043 260254 255196 251071 249258 249290 250014 250984 252290 253507 253601 252214
52428 252214 250667 250967 253527 256482 257739 257355 257234 258783 261587 264205 265504 265269 264389 264499 266598 269695
52412 269695 271484 270599 267794 264903 263317 263433 264651 265672 265633 265308 266361 269080 271818 273176 273823 275287
52396 275287 277571 278943 277862 274563 270956 269298 270529 273373 275426 275564 274853 274861 275817 277041 278443 280501
52380 280501 283021 284865 285057 283587 281154 278539 276213 274203 272378 270934 270179 269743 268656 266616 264512
52365 264512 263220 262645 262569 263479 265442 266929 266147 263242 259891 256996 254210 251672 250594 251755 254638
52350 254638 258432 262692 266654 269328 270936 272944 275774 277713 277250 275504 275032 276942 280515 285047 290366
52335 290366 295570 298878 299393 298117 296886 296964 298697 301456 303519 303045 299991 296566 295183 296350 298942
52320 298942 301831 304470 306311 306740 305823 304597 304362 305920 309353 314090 319109 323487 326904 329496 331339
52305 331339 332492 333467 335055 337484 340180 342664 345281 348675 352866 357331 361876 366926 372922 379824
52291 379824 387268 394839 402088 408552 414017 418635 422696 426420 430087 434155 439007 444589 450416 455929
52277 455929 460856 465363 469884 474718 479672 484188 487904 491068 494407 498643 504111 510729 518325 526976
52263 526976 536826 547373 557324 565796 573696 583168 595358 609324 623495 637460 651605 665697
52251 665697 679175 692764 708449 727291 748176 769326 790360 812200 835502 860015 885182
52240 885182 910566 935849 961152 987287 1014987 1043841 1072642 1100861 1129186 1158409 1188400
52229 1188400 1218361 1247546 1275528 1302356 1328841 1356039 1383888 1410671 1434304 1453947 1470150
52218 1470150 1484069 1497005 1510016 1522893 1533842 1541193 1545406 1548541 1551822 1554810 1557031 1558985 1560840
52205 1560840 1561383 1559545 1556384 1554261 1554205 1555157 1555838 1556316 1557565 1560452 1565629 1573629 1584309 1596500 1608775
52190 1608775 1620488 1631877 1643527 1656195 1670906 1688601 1709431 1732496 1756335 1779682 1802012
52179 1802012 1823524 1844519 1864809 1883989 1902288 1920531 1938929 1956453 1972024 1985837 1998687
52168 1998687 2010208 2018964 2024468 2028055 2031145 2033469 2033819 2031992 2029012 2025634 2021537 2016084 2009128 2000964
52154 2000964 1992054 1983068 1974720 1967344 1960819 1954824 1948750 1941690 1933345 1924976 1918484 1914191 1910345 1905302
52140 1905302 1899429 1894326 1891062 1889955 1891223 1894564 1898470 1901225 1902588 1903656 1905230 1907408 1910554 1915246
52126 1915246 1920942 1925966 1929497 1932516 1936116 1939699 1941664 1941233 1938830 1935288 1931516 1928479 1926525 1924907
52112 1924907 1922735 1920220 1918202 1916583 1914031 1909339 1902458 1894097 1884976 1875744 1867126 1859575 1852801 1845932
52098 1845932 1838375 1830603 1823883 1818877 1814549 1808984 1801364 1792659 1784219 1776404 1768934 1761875 1755526 1749765
52084 1749765 1744120 1738205 1731645 1724115 1716101 1708987 1703536 1698765 1693275 1687257 1682079 1678250 1675075 1672139
52070 1672139 1669636 1667034 1662914 1656785 1649855 1643330 1636968 1630160 1623538 1618416 1615099 1612687 1610342 1608020
52056 1608020 1606131 1605123 1605542 1608061 1613263 1621213 1630982 1640878 1649963 1659570 1672566 1690633 1712756
52043 1712756 1736663 1761071 1786079 1812184 1839762 1869103 1900132 1932250 1964947 1998386 2032853
52032 2032853 2067950 2102750 2136504 2168783 2199354 2228385 2256368 2283233 2307857 2328977 2346271
52021 2346271 2360079 2370688 2378727 2385660 2392677 2399113 2402978 2403178 2400469 2396248 2391361 2386271 2381340 2376394
52007 2376394 2370649 2363628 2355809 2348021 2340580 2333292 2325979 2318764 2312126 2306862 2303713 2302798 2303598 2305520
51993 2305520 2308291 2311926 2316743 2323261 2331541 2340612 2349202 2357131 2365388 2374679 2384532 2394072 2402883 2410629
51979 2410629 2416604 2420389 2422529 2423742 2423679 2421331 2416597 2410568 2403963 2396001 2385468 2372539 2358744 2344931
51965 2344931 2329935 2311903 2290791 2268773 2247931 2228126 2207735 2185972 2163641 2141652 2119711
51954 2119711 2096768 2072096 2045521 2017110 1987212 1956657 1926521 1897606 1869991 1842773 1814298
51943 1814298 1783284 1750023 1716048 1682410 1648758 1614348 1579297 1544276 1509365 1473851 1436948
51932 1436948 1398409 1358765 1319362 1281663 1245855 1210466 1174015 1136732 1100022 1064655 1030350
51921 1030350 996886 964564 933499 903402 874244 846272 819175 792104 764889 738462 713778
51910 713778 691058 670394 652106 635931 620815 606234 592854 580955 569093 555688 541525
51899 541525 529184 519987 512722 505626 498419 491784 485819 479817 473236 466272 459594 453726 448483 442967
51885 442967 436433 429261 422709 417677 414007 410856 407252 402469 396693 391268 387389 384420 380533 375265
51871 375265 370171 366302 362368 356615 349607 343663 339936 337415 334652 331225 327578 324543 323109 323488
51857 323488 324261 323503 321032 318476 316875 315389 312851 309445 306090 303181 300882 299815 300288 301274 301300 300036
51841 300036 298128 295661 291943 286943 281935 278280 276094 274340 271718 267308 261126 254577 249819 247862
51827 247862 247316 245589 241516 236486 232818 231422 231356 231329 230943 230413 229842 229350 229507 230861 233095 235282 237081
51810 237081 239056 241602 244038 245148 244366 242292 240381 240167 242147 245079 246860 246636 245735 246153 248435
51795 248435 251508 254195 256264 258057 259764 261242 262260 262711 262668 262239 261375 260041 258620 257872 258348 260092
51779 260092 262886 266365 269771 272255 273678 274566 274983 274258 272413 271004 271583 273786 276002 277650 279693
51764 279693 283054 287568 292512 297118 300326 301238 300358 299583 300259 301759 302431 301352 298679 294860 290424
51749 290424 286403 284122 284223 286004 287810 288130 286596 284183 282328 281736 282080 282746 283495 284270 284891 285374
51733 285374 286307 288353 291239 293639 294353 293520 292463 292246 292780 293566 294929 297766 301976 306014 308553 310009
51717 310009 311747 314305 317246 320360 323839 327310 329877 331519 333415 336370 339680 342246 344119 346180
51703 346180 348765 351440 353937 356478 359179 361773 364130 366631 369925 374536 380658 387899 395168 401342
51689 401342 406402 411655 418385 426208 433150 437466 439185 439596 439681 439648 439766 440620 442063 442828 442045 440656
51673 440656 440285 441016 441500 441362 442136 445122 449334 452576 454074 454941 456145 457068 456574 454931 453921 454926
51657 454926 457418 459704 460931 461688 462604 463220 462860 461901 461165 460423 458727 456299 454888 455830 458570 461497
51641 461497 463386 463681 462370 460363 459180 459366 459712 458897 457390 456813 457848 459752 461806 464184 467289
51626 467289 471166 475904 481879 489117 496816 503957 510263 516298 522575 528557 532508 532615 528628 522372
51612 522372 516244 511154 506142 499970 492700 485423 478755 472047 464253 455285 446117 437569 429543 421749
51598 421749 414631 408774 403616 397777 390938 384539 380120 377565 375521 373053 370169 367069 363641 359831
51584 359831 355963 352529 349810 347735 345998 344342 342687 340913 338739 336183 333900 332492 331582 330294
51570 330294 328663 327679 327811 328390 328666 328439 327367 324974 321985 320290 320453 320477 318442 315376 313889 314640
51554 314640 315947 316482 316463 316179 315283 314011 313425 313772 314052 314062 315534 320028 326425 331724 334106 334425 334801
51537 334801 336350 338391 339655 340128 341435 345040 350426 355819 360535 365662 372239 379728 386619 391760
51523 391760 394683 395478 394891 393901 392722 390858 388477 386836 386578 386400 384432 380633 376925 375072 375195 376275
51507 376275 377316 377820 377743 377470 377758 379448 382995 388027 393426 398100 401833 405167 408514 411746 414631
51492 414631 417144 419156 420298 420404 419712 418472 416748 414774 413014 411582 410019 407930 405516 403335 401919
51477 401919 401735 402987 405285 408058 411355 415544 420117 423838 426497 429436 433573 437797 440310 440857 440503
51462 440503 439731 438053 435345 432350 429697 427323 425037 422876 420757 418470 416161 414192 412321 409649
51448 409649 405657 400885 396459 393255 391540 390960 390822 390699 390667 390662 390005 388277 386454 386122 387463 388927 389157
51431 389157 388360 387480 387028 387337 389041 392191 395441 397281 397983 399320 402314 406164 409665 412856 416753
51416 416753 422136 429183 437772 447323 456527 464105 470004 475275 480714 486291 492118 499073 507681 516860
51402 516860 524644 530015 533277 534797 534385 532241 529661 528158 528174 528951 529429 529109 528527 529104 532058 537035
51386 537035 542152 545607 546863 546195 543894 540415 536613 533067 529549 525701 521668 517394 511997 504940
51372 504940 497457 491621 488070 485584 482783 479089 474200 468121 462157 458470 457707 457965 456927 454256 451050
51357 451050 447875 444663 442126 441713 443826 447057 449641 451062 451904 452796 454065 455930 458293 460328 460908
51342 460908 459728 457772 456225 454972 452534 447734 441144 434500 428741 423168 416648 409087 401298 393813
51328 393813 386450 378962 371422 363843 355963 347776 339919 333163 327769 323654 320841 319197 317879 315804
51314 315804 312841 309934 307712 305531 302384 298300 294218 290693 287382 283670 279147 273589 267328 261779
51300 261779 258715 258500 259559 260085 259745 259246 258761 257587 255222 252101 249208 247300 246463 246110 245425 244042
51284 244042 242278 240740 240087 241168 244611 249754 254620 257736 259584 261597 264153 266515 268363 270137
51270 270137 271775 272372 271631 270770 271375 273918 277919 282961 288764 294611 299464 302805 305005 306676 307810
51255 307810 307730 306030 303481 301556 300664 299231 295256 288697 281585 275740 271154 266900 262703 258835 254979
51240 254979 250151 243916 237127 231140 226470 222521 218695 215410 213450 212319 210243 206517 203061 202353
51226 202353 204101 205395 204347 202109 200662 200096 199305 198383 198687 200674 202995 204043 203599 202618 201985 201806
51210 201806 201680 201436 201545 202709 204978 207542 209477 210435 210588 210421 210671 211783 213094 213331 212303 211220
51194 211220 210681 209352 205751 200612 196113 193203 191204 189843 189983 191956 194654 196982 199072 201310 203189
51179 203189 203993 203872 203324 202248 200425 198453 197250 196852 196533 195887 195025 193991 192898 192538 193802 196249
51163 196249 198220 198826 199075 200439 202842 204768 204978 203515 201237 199105 197953 198237 199690 201486 202995
51148 202995 204211 205517 207374 210219 214074 217993 220409 220642 219829 219891 221603 223988 225451 225140 223452
51133 223452 221720 221358 222659 224359 224848 223921 222819 222604 223102 223595 223771 223726 223760 224583 226871 229920 231555
51116 231555 230522 228516 228556 231279 234039 234021 231298 228223 226499 225639 224011 220678 216191 211971 209061
51101 209061 207383 206240 205367 205076 205239 204728 202518 199138 196328 195095 194661 193631 191749 189987 189154 189106
51085 189106 189384 189940 190965 192485 194582 197555 201261 204590 206262 206011 204434 201952 198753 195643 193828
51070 193828 193487 193421 192589 191255 190207 189649 189521 190173 191921 194275 196184 196674 195056 191393 187330 185367
51054 185367 186258 187971 188336 187875 188611 190912 193337 195277 197639 200746 203429 204767 205145 205026 204191 202927
51038 202927 202392 202889 203138 202394 201976 203345 205713 207142 207326 207767 209513 212193 215208 218510 221991 225114
51022 225114 227509 229335 230906 232424 233991 235401 236053 235651 234853 234782 236062 238700 242441 246607 250045
51007 250045 252070 253163 254063 254698 254962 256014 259348 264569 269429 272300 273460 273787 273592 273298 273877 275447
50991 275447 276402 275142 272318 270241 270167 271022 270852 268788 265483 262206 259857 258536 257757 257017 256271 255920
50975 255920 256444 257967 260069 262036 263515 264810 266312 267788 268736 269366 270601 272896 275611 277858 279523
50960 279523 281119 283104 285756 289295 293520 297562 300617 302805 304823 306832 308346 309300 310629 313394
50946 313394 317636 322502 327475 333075 340141 348464 356522 362909 368038 373977 382384 392841 403606 413756
50932 413756 424060 435618 448121 459894 469649 478055 487533 500490 517535 537234 557582 577794
50920 577794 598715 621551 646453 672494 698886 725858 754281 784898 818268 855092 895888
50909 895888 940314 987565 1037810 1092564 1152951 1217994 1285556 1354899 1427406 1504572 1586209
50898 1586209 1671184 1759148 1850574 1945312 2041967 2138764 2234333 2327429 2416526 2500142 2577431
50887 2577431 2648193 2712512 2770574 2822630 2868874 2909419 2944559 2975028 3001904 3026323 3049352
50876 3049352 3071795 3093896 3115335 3135720 3154855 3172056 3185442 3192528 3191713 3182686 3165265 3138451
50864 3138451 3101077 3052828 2993988 2924620 2844767 2755257 2657573 2553171 2443790 2332276 2221776
50853 2221776 2113696 2007588 1903648 1804261 1712076 1627397 1548687 1475086 1407131 1345277 1289201
50842 1289201 1238763 1194308 1155476 1120789 1089163 1061045 1037272 1017305 999413 982340 966172
50831 966172 951691 939469 929572 921704 915469 910657 907334 905626 905626 907468 911174 916247 921813 927521
50817 927521 934094 942695 953860 967254 982250 998506 1016238 1036274 1059531 1085993 1114264 1142658
50805 1142658 1170893 1200393 1232970 1269546 1310259 1355207 1404483 1457651 1513919 1573243 1636964
50794 1636964 1706890 1783911 1867961 1959276 2058933 2167929 2286443 2414505 2552780 2701873
50784 2701873 2861316 3030134 3208152 3395606 3591411 3792923 3997755 4204831 4413037
50775 4413037 4619663 4820902 5013316 5194118 5360512 5509760 5640067 5751256 5844847 5923597
50765 5923597 5990266 6046373 6092641 6131073 6165791 6201093 6239309 6281339 6328332 6381087 6437664
50754 6437664 6492938 6540966 6576963 6596776 6595610 6568425 6511539 6423534 6304900 6157167 5982270
50743 5982270 5782547 5561271 5322861 5072205 4813856 4552188 4291959 4037829 3793257
50734 3793257 3560435 3341314 3137916 2951368 2781225 2626080 2484490 2355294 2237834
50725 2237834 2132253 2038936 1957188 1884947 1820215 1762320 1711241 1666213 1625747 1588837 1555506
50714 1555506 1526092 1500415 1477672 1456758 1436641 1416698 1396831 1377384 1359083 1342918 1329518
50703 1329518 1318349 1308058 1298091 1289601 1284157 1281728 1280648 1279657 1279463 1282078 1288985 1300168 1314593
50690 1314593 1331302 1349980 1370722 1393493 1418117 1444737 1473865 1505655 1539418 1574318 1610420
50679 1610420 1648501 1688939 1731439 1775986 1823369 1874322 1928819 1986945 2050108 2120369 2198444
50668 2198444 2283198 2373445 2469496 2572200 2680954 2793511 2907669 3022332 3136704 3249119
50658 3249119 3357095 3458286 3551205 3635200 3709777 3773490 3823662 3858070 3877399 3885426 3886318
50647 3886318 3882354 3874763 3865830 3858881 3856485 3859686 3868778 3883522 3902469 3923252 3943957 3963330 3979321
50634 3979321 3988453 3987093 3972285 3940769 3888586 3813239 3716039 3601285 3473411 3335824 3191934
50623 3191934 3045647 2900271 2757844 2620019 2488932 2366739 2254819 2153807 2063903 1984589
50613 1984589 1914441 1851943 1796602 1748890 1709092 1676465 1649622 1627537 1609956 1597033 1588909
50602 1588909 1585666 1587296 1593207 1601897 1611697 1622182 1634639 1650981 1672331 1698570 1728644 1761054
50590 1761054 1794775 1830447 1870389 1916716 1969548 2027569 2090050 2157445 2230117 2307553 2389122
50579 2389122 2474558 2563017 2652441 2740891 2828253 2915761 3003799 3090825 3174528 3253504 3327588
50568 3327588 3396902 3460770 3517348 3564391 3600742 3627024 3644443 3652953 3651362 3639559 3619829 3595133
50556 3595133 3566486 3533082 3495092 3455382 3417956 3385404 3358421 3337167 3321964 3312610 3307945 3306639
50544 3306639 3308055 3312000 3317911 3324566 3330315 3333232 3331232 3322415 3305224 3278030 3238814 3185953 3119586
50531 3119586 3041994 2956402 2865595 2771675 2676569 2582049 2489088 2397627 2307391 2218921 2133717
50520 2133717 2053452 1979224 1911419 1849915 1794287 1744025 1698888 1659063 1624804 1595929 1571762
50509 1571762 1551638 1535422 1523514 1516422 1514280 1516703 1522984 1532397 1544383 1558716 1575672 1595813
50497 1595813 1619210 1644946 1671908 1700185 1731112 1765613 1803005 1841924 1881918 1923451 1966720
50486 1966720 2011443 2057827 2106929 2159676 2215954 2274762 2334750 2394639 2453927 2513716 2576312
50475 2576312 2643523 2715575 2791931 2872748 2959162 3052352 3152758 3260102 3374097 3495274
50465 3495274 3625031 3764417 3912704 4067678 4227595 4392431 4562929 4738822 4918158
50456 4918158 5097842 5274444 5444821 5606381 5756571 5892161 6009544 6105889 6179334 6227999
50446 6227999 6249966 6244780 6214020 6159488 6081819 5982073 5863997 5733196 5594213 5449743 5302799
50435 5302799 5158289 5021843 4897837 4788860 4696381 4621527 4565533 4529555 4513540 4515230 4530786
50424 4530786 4556290 4587954 4620981 4649227 4666425 4667249 4647248 4602813 4532019 4435334 4315372
50413 4315372 4176312 4023356 3861780 3695845 3528762 3363483 3202737 3048134 2900046
50404 2900046 2758748 2625180 2500508 2385727 2281770 2189092 2106761 2033000 1967127 1909972
50394 1909972 1861830 1821101 1785928 1756257 1733006 1715888 1703394 1694644 1689923 1689481 1693012 1700401
50382 1700401 1711757 1726396 1742884 1760713 1781118 1805550 1833827 1864265 1895215 1925981 1956719
50371 1956719 1988154 2021225 2056326 2092697 2128927 2164143 2198406 2231944 2264480 2295708 2326050
50360 2326050 2356262 2386213 2414757 2441304 2467049 2494042 2523243 2554194 2586483 2620746 2658083
50349 2658083 2699396 2745773 2798688 2859015 2926163 2998809 3076195 3157894 3242446 3327029 3408825
50338 3408825 3486401 3559590 3628250 3691225 3746293 3790988 3823442 3842387 3846545 3834512 3805395
50327 3805395 3759243 3696808 3619457 3529652 3430849 3326386 3218792 3110593 3005080 2905438
50317 2905438 2813464 2729960 2656033 2593093 2541813 2502162 2474418 2458955 2454755 2459110 2469226 2483214
50305 2483214 2499092 2513761 2523797 2526773 2521183 2505656 2479142 2441666 2394276 2338380 2275595 2207951
50293 2207951 2137570 2066099 1994886 1925517 1859537 1797511 1738846 1682775 1629314 1579164 1532889
50282 1532889 1490435 1451362 1415428 1382861 1354044 1329002 1307380 1288840 1273177 1260051 1249018
50271 1249018 1239993 1233304 1229076 1226971 1226892 1229526 1235651 1245163 1257338 1271873 1289019 1308636 1329673
50258 1329673 1350777 1371123 1390787 1410849 1433079 1458729 1487255 1516700 1545637 1574240 1603223
50247 1603223 1632387 1660795 1687739 1712703 1734761 1753120 1768368 1782232 1795689 1808002 1818059
50236 1818059 1825998 1832803 1838604 1842167 1842067 1837788 1829649 1818288 1804644 1789953 1775088 1759796 1743071
50223 1743071 1724598 1705583 1687744 1671485 1655539 1638655 1621220 1604755 1589977 1575928 1561144
50212 1561144 1545269 1529444 1515535 1505009 1497968 1492884 1487697 1481638 1475728 1471287 1468426 1466407 1464983
50199 1464983 1464666 1465970 1469008 1473525 1478645 1482907 1485548 1487658 1490999 1495534 1499124 1500056 1498796 1496632
50185 1496632 1493474 1488016 1479671 1469495 1459282 1450267 1442491 1434851 1425882 1414968 1402925 1391271 1381117
50172 1381117 1372782 1365916 1359598 1352744 1344914 1336553 1328348 1320946 1315548 1313858 1316499 1321963 1327931 1333315
50158 1333315 1338351 1343323 1348271 1353478 1358949 1363556 1366037 1366910 1368179 1370847 1373858 1375598 1375165 1371809
50144 1371809 1364734 1354384 1342714 1331038 1318471 1303512 1286207 1267581 1247811 1226525 1204402
50133 1204402 1182824 1162049 1141362 1121110 1102947 1087437 1072922 1057720 1042399 1028784 1017408
50122 1017408 1007068 996529 985740 975551 967065 961127 957606 955067 951816 947410 942695 938328 933813
50109 933813 928087 920545 911377 901483 892282 884993 879679 875222 870476 865035 858668 850718 840764 829524
50095 829524 818327 807702 797126 786050 774490 762521 750106 737882 727487 720380 716497 714543
50083 714543 713409 712663 711831 710041 706989 703804 702174 702482 703318 703178 702258 702003 703102 704757 706235 708344
50067 708344 712706 719951 729394 740125 751533 762761 772713 781110 789012 797946 808917 822323 837984
50054 837984 854791 871000 885601 899104 912593 926396 940139 953467 966024 977177 986619 995142
50042 995142 1004108 1014232 1025422 1037474 1050132 1062442 1073012 1081376 1088741 1097140 1107852 1120514
50030 1120514 1133374 1144497 1153121 1159922 1165940 1171615 1177132 1183104 1190246 1198689 1208203 1218688 1229789
50017 1229789 1240572 1250634 1261232 1274076 1289100 1304602 1319781 1335955 1354981 1377552 1403432
50006 1403432 1432152 1462746 1493693 1523960 1553717 1583702 1614495 1646626 1680384 1715086 1749498
49995 1749498 1783425 1817717 1851937 1883300 1909223 1930130 1948390 1965146 1979580 1990874 1999355
49984 1999355 2005648 2009958 2012366 2012902 2011333 2007806 2003598 2000043 1996678 1991840 1985531 1980473 1979465 1982415
49970 1982415 1986684 1989765 1990927 1990714 1989793 1988444 1986834 1985638 1986244 1989915 1996583 2004746 2012699 2019539 2025032
49955 2025032 2029012 2031160 2030904 2027289 2019393 2007101 1991035 1971415 1947519 1918727 1885738 1850257
49943 1850257 1813739 1776836 1739755 1702521 1664940 1626848 1588562 1550780 1514013 1478354 1443814
49932 1443814 1410587 1378855 1348517 1319184 1290380 1261823 1233735 1206862 1181950 1159158 1138189
49921 1138189 1118966 1101882 1087178 1074339 1062401 1050821 1039739 1029412 1019698 1010341 1001503 993652
49909 993652 986856 980440 973457 965401 956522 947658 939672 932693 925729 917448 907626 897562 888728 881284
49895 881284 874251 866747 858420 848952 838121 826677 816397 808722 803664 800296 797812 795609 792893
49882 792893 789076 784547 780416 777383 775369 774289 774537 776475 779899 784371 789690 795822 802759 810809
49868 810809 820585 832266 845274 859233 874851 893108 913891 936334 960389 986894 1015957 1046488
49856 1046488 1077833 1110594 1144918 1179073 1210980 1240430 1268362 1294459 1317282 1336845 1355398
49845 1355398 1375121 1396255 1417962 1439578 1460087 1477553 1490320 1498275 1501963 1500987 1494167 1480832
49833 1480832 1461126 1435520 1404994 1371373 1336472 1300941 1264609 1227635 1190530 1153320 1115831
49822 1115831 1078718 1043229 1009831 977944 947222 918257 891782 867884 846272 826677 808771
49811 808771 792301 777516 764917 754464 745642 738329 732707 728059 722631 715297 706718 698283 690556
49798 690556 683406 677065 672151 668745 666144 663465 660180 656323 652633 650211 649409 649166 648083 646168 644921
49783 644921 645389 646609 646403 643650 639430 635815 633797 632684 631401 629892 628977 629250 630637 632791 635313
49768 635313 637606 639138 639933 640393 640571 640191 639460 639225 640125 642051 644583 647391 650139 652773 656096 661263
49752 661263 668252 675652 682471 689366 697412 706516 715957 725701 736181 747365 759322 773134 789792
49739 789792 808314 826521 843924 862422 883689 907152 931212 955193 979062 1002100 1023144
49728 1023144 1041776 1058255 1072435 1083780 1092521 1100081 1108057 1117028 1126339 1134754 1141365 1146196 1149677
49715 1149677 1151278 1148991 1140748 1126253 1106893 1084029 1058106 1029467 999229 968937 939795 912525
49703 912525 887580 865065 844596 825475 806960 788530 770468 754288 741900 733765 728239 723205
49691 723205 718042 713481 709950 706956 704084 701785 700798 701182 702203 702930 702907 702539 702846 704587 707683 711755
49675 711755 716816 722624 727645 730017 729932 729994 732505 737255 742626 747809 752824 757173 760126 762149 764601
49660 764601 767855 770975 773458 776023 779134 781845 782892 782255 780974 780002 779745 780124 780556 780454 780291 781514
49644 781514 784694 788324 790333 790445 790242 791108 792894 794502 795048 794481 793711 794140 796504 800159 803894 807238
49628 807238 810494 813863 817463 822034 828403 835852 842066 845491 847118 849213 852632 856167 858341 859081
49614 859081 859452 860378 862057 864314 866952 869579 871549 872605 873590 875860 879613 883175 884590 883714 882137
49599 882137 881192 880904 881016 882050 884655 888438 892148 894719 895618 894663 892359 890167 889459 890020 890373 889804
49583 889804 889157 889174 888929 886903 883233 879874 878493 878986 880206 881339 882083 882043 880657 877841 874436 871871
49567 871871 871164 871905 872319 870879 868039 865844 865632 866782 868060 869400 871520 874422 877513 881023 886010
49552 886010 892641 899434 904895 909330 914513 921899 931548 942430 953287 963394 972824 982097 991692
49539 991692 1002131 1014238 1028548 1044463 1060745 1077071 1094308 1113008 1132426 1151547 1170309
49528 1170309 1189258 1208764 1229279 1251658 1276297 1302496 1329398 1356999 1385437 1414199 1443322
49517 1443322 1474701 1510517 1550474 1592212 1634480 1678264 1724371 1771784 1819393 1867891 1918605
49506 1918605 1971407 2025241 2080163 2137444 2197796 2260640 2325174 2391075 2457950 2524966 2591444
49495 2591444 2657313 2722773 2787986 2853308 2919251 2985843 3052286 3117544 3180911 3241756 3299093
49484 3299093 3351929 3400038 3443859 3483435 3517791 3545576 3566129 3579696 3586910 3588545 3585687 3579537
49472 3579537 3570763 3559436 3545756 3530456 3514238 3497320 3479991 3463211 3448079 3435019 3424146
49461 3424146 3416131 3411893 3411462 3413976 3418905 3426596 3437447 3451335 3468160 3488345 3512373 3540214 3571431
49448 3571431 3605315 3640688 3676130 3710671 3743945 3775664 3805582 3833914 3860711 3884534 3902916
49437 3902916 3914829 3921716 3925247 3924990 3919222 3907012 3888188 3862088 3828138 3787377 3741591 3690756
49425 3690756 3633043 3567894 3497647 3425339 3352041 3277265 3200866 3123359 3044971 2965731 2886440
49414 2886440 2808607 2733250 2660214 2588742 2518344 2449174 2381920 2317343 2255740 2196978 2141117
49403 2141117 2088634 2039752 1993942 1950489 1909273 1870594 1834443 1800486 1768650 1739354 1713113
49392 1713113 1690128 1670048 1651959 1634947 1618930 1604491 1591546 1578858 1565659 1553102 1542912
49381 1542912 1534869 1527062 1518739 1511323 1505973 1501641 1496802 1491998 1489009 1488099 1487861 1487753 1489032 1492611 1497537
49366 1497537 1502492 1507684 1514174 1522154 1531117 1541198 1553106 1566917 1582242 1599618 1620432 1644826
49354 1644826 1670485 1694160 1714057 1730516 1745057 1759263 1774061 1789360 1804524 1819584 1835703
49343 1835703 1854094 1874770 1896886 1920050 1944666 1971068 1998853 2027251 2055837 2084740 2114180
49332 2114180 2143752 2172215 2198399 2222455 2245867 2269935 2294668 2319419 2343943 2368119 2391154
49321 2391154 2412074 2430917 2448702 2466222 2483693 2501475 2520280 2540393 2561359 2582525 2603360
49310 2603360 2623420 2643003 2663748 2687233 2712621 2737079 2759318 2781449 2806305 2833976 2862363
49299 2862363 2890349 2918814 2948828 2980427 3013341 3047621 3083173 3119634 3157076 3196044 3236749
49288 3236749 3279011 3323149 3369992 3419685 3471300 3524070 3578318 3634909 3694552 3758019 3826008
49277 3826008 3898020 3972128 4046925 4123463 4204365 4291071 4382478 4476173 4570385 4664831 4760349
49266 4760349 4857958 4957942 5059578 5161821 5264337 5367826 5473314 5580946 5689254 5795739
49256 5795739 5898635 5998108 6095270 6190051 6280652 6365115 6442422 6511753 6571887 6622361 6664443
49245 6664443 6699618 6727400 6745856 6754332 6754477 6748270 6736062 6717259 6692223 6662738 6630789 6597549
49233 6597549 6563607 6529725 6496999 6466255 6437632 6411171 6387744 6368818 6355031 6345535 6339219 6336145
49221 6336145 6337242 6343118 6353886 6369748 6390606 6415133 6441332 6468400 6497352 6529442 6564460 6600805
49209 6600805 6636668 6670747 6702233 6730435 6754317 6772469 6783857 6788412 6786334 6776923 6758942 6732132
49197 6732132 6697521 6655910 6606865 6549603 6484228 6411634 6332798 6248739 6160810 6070556 5979412
49186 5979412 5888501 5798258 5708233 5617970 5528212 5440550 5355731 5273223 5192710 5115028 5041109
49175 5041109 4970872 4903618 4838604 4774689 4710609 4646540 4584481 4526140 4471264 4418921 4369239
49164 4369239 4322513 4277700 4233677 4191399 4152785 4117622 4083633 4049897 4018375 3991388 3969078
49153 3969078 3950023 3933005 3917215 3901841 3886611 3872260 3859761 3849319 3840502 3832871 3826296 3821277
49141 3821277 3819046 3820483 3824717 3829752 3834835 3841067 3849196 3858149 3866802 3876171 3888455 3904340 3922447
49128 3922447 3941335 3961010 3982412 4006242 4032524 4060886 4091126 4123489 4157962 4193278 4227443
49117 4227443 4259824 4291958 4325562 4360567 4396235 4433454 4474275 4519102 4565883 4612529 4658907
49106 4658907 4705849 4753338 4800738 4848176 4896500 4945961 4995774 5045205 5094544 5144708 5196098
49095 5196098 5248035 5299231 5348863 5397333 5446016 5496030 5547056 5597501 5646015 5692885 5739729
49084 5739729 5787811 5836831 5885412 5932383 5977237 6019566 6058747 6094457 6127220 6158153 6188302
49073 6188302 6218337 6248666 6279626 6311516 6344401 6377721 6410315 6441295 6470920 6500190 6529510
49062 6529510 6558408 6586723 6615319 6644920 6674738 6703108 6729392 6754498 6779475 6804354 6828575
49051 6828575 6851895 6874324 6895577 6915212 6933271 6950284 6966569 6981990 6996639 7011240 7026305
49040 7026305 7041057 7053980 7064690 7074687 7085765 7098105 7110408 7121539 7131344 7140052 7147710 7154260
49028 7154260 7159659 7163854 7167162 7170567 7174942 7180008 7184903 7189886 7196474 7205559 7216249 7227163 7238007
49015 7238007 7249225 7260822 7272363 7283743 7295125 7306413 7317386 7327977 7337901 7346345 7352495 7355887
49003 7355887 7355774 7350989 7341384 7328672 7314698 7299291 7281088 7260137 7238064 7215361 7189984 7159450
48991 7159450 7123557 7084411 7044410 7004723 6965139 6924758 6882990 6840258 6797530 6755165 6712733
48980 6712733 6670145 6628411 6588838 6551821 6516749 6482887 6449996 6418217 6387588 6357791 6328540
48969 6328540 6300328 6274448 6251842 6232125 6214259 6198017 6184100 6172826 6163461 6155074 6147448 6140932
48957 6140932 6135902 6132619 6131135 6131115 6132042 6133483 6134683 6134132 6130585 6124699 6118686 6113880 6109479 6104102 6097625
48942 6097625 6090638 6082945 6073670 6062356 6049000 6033355 6015282 5995565 5975129 5953265 5927725 5897173
48930 5897173 5862830 5827140 5791312 5754797 5716803 5677477 5637440 5596758 5554879 5511463 5466908
48919 5466908 5422024 5377376 5332930 5288010 5241607 5193335 5144444 5097328 5053265 5010953 4968194
48908 4968194 4924967 4883769 4846727 4813487 4782512 4753428 4727018 4703591 4682588 4663767 4647874
48897 4647874 4636061 4629248 4628006 4632302 4641227 4653422 4667880 4684117 4701919 4721644 4744501 4771536
48885 4771536 4802129 4834354 4867069 4900927 4937026 4975367 5015127 5055638 5096441 5137025 5177467
48874 5177467 5218985 5262954 5309429 5357354 5406162 5456312 5508206 5561551 5616256 5673107 5732790
48863 5732790 5794639 5857108 5919394 5982072 6046230 6112621 6181626 6253392 6327668 6403923 6481955
48852 6481955 6562206 6645278 6731366 6820290 6911797 7005586 7101316 7198891 7298449 7399749 7501826
48841 7501826 7603687 7705156 7806536 7907526 8007076 8104261 8198735 8290104 8377480 8460061
$$ [...]
##END NTUPLES=NMR SPECTRUM
##END=
