
##TITLE=AC1140_caturra_5906454_nBuGbDpnWz
##JCAMPDX= 6.0         $$ Bruker NMR JCAMP-DX V2.0
##DATA TYPE= NMR SPECTRUM
##DATA CLASS= NTUPLES
##ORIGIN= BRUKER
##OWNER= Administrator
$$ 1.72 TOPSPIN		Version 2.1
$$ 2012-04-10 10:15:33.796 -0500  Administrator@TOPSPIN
$$ Compression mode = diff/dup
##.OBSERVE FREQUENCY= 400.13188235
##.OBSERVE NUCLEUS= ^1H
##.ACQUISITION MODE= SIMULTANEOUS (DQD)
##.ACQUISITION SCHEME= undefined
##.AVERAGES= 8
##.DIGITISER RES= 22
##SPECTROMETER/DATA SYSTEM= spect
##.PULSE SEQUENCE= zg30
##.SOLVENT NAME= COFFEE_meoh
##.SHIFT REFERENCE= INTERNAL, COFFEE_meoh, 1, 14.98061
##AUDIT TRAIL= $$ (NUMBER, WHEN, WHO, WHERE, PROCESS, VERSION, WHAT)
$$ ##TITLE= Audit trail, TOPSPIN		Version 2.1
$$ ##JCAMPDX= 5.01
$$ ##ORIGIN= Bruker BioSpin GmbH
$$ ##OWNER= Administrator
$$ $$ C:\Bruker\TOPSPIN/data/COFFEE/nmr/AC1140_caturra_5906454_nBuGbDpnWz/10/pdata/1/auditp.txt
$$ ##AUDIT TRAIL=  $$ (NUMBER, WHEN, WHO, WHERE, PROCESS, VERSION, WHAT)
(   1,<2012-04-04 13:48:45.078 -0500>,<Administrator>,<TOPSPIN>,<go>,<TOPSPIN 2.1>,
      <created by zg
	started at 2012-04-04 13:47:38.546 -0500,
	POWCHK enabled, PULCHK disabled,
       configuration hash MD5:
       1A 1E CE 29 27 FD 77 03 67 4E F0 E3 C4 B2 CB 90
       data hash MD5: 64K
       2F 5B 67 14 0F C0 86 0A 5F 44 A4 E3 CA A1 6E A3>)
(   2,<2012-04-04 13:48:48.484 -0500>,<Administrator>,<TOPSPIN>,<proc1d>,<TOPSPIN 2.1>,
      <Start of raw data processing
       efp LB = 0 FT_mod = 6 PKNL = 1 PHC0 = 0 PHC1 = 0 SI = 32K 
       data hash MD5: 32K
       76 55 C3 C8 69 48 13 4B 08 A8 CD 63 58 7A B3 A2>)
(   3,<2012-04-04 13:48:48.906 -0500>,<Administrator>,<TOPSPIN>,<proc1d>,<TOPSPIN 2.1>,
      <pk PHC0 = 213.4808 PHC1 = 0 
       data hash MD5: 32K
       2D 45 0D AA FC 0C 30 B0 7E DF 04 6E 61 CE 5F 6D>)
(   4,<2012-04-04 13:48:48.984 -0500>,<Administrator>,<TOPSPIN>,<proc1d>,<TOPSPIN 2.1>,
      <abs ABSG = 1 
       data hash MD5: 32K
       2C A6 3E DC B8 CE 15 1E D3 8E E4 77 5B 36 C6 2E>)
(   5,<2012-04-04 13:48:49.031 -0500>,<Administrator>,<TOPSPIN>,<proc1d>,<TOPSPIN 2.1>,
      <abs ABSG = 2 
       data hash MD5: 32K
       2C A9 AE 92 2D B3 CB EF AD A6 2C 40 E1 94 ED A4>)
(   6,<2012-04-04 13:48:49.062 -0500>,<Administrator>,<TOPSPIN>,<proc1d>,<TOPSPIN 2.1>,
      <abs ABSG = 3 
       data hash MD5: 32K
       DD 84 69 A2 B4 9D BA 6A 23 4A 6D B9 1C 68 E1 5E>)
(   7,<2012-04-04 13:48:49.093 -0500>,<Administrator>,<TOPSPIN>,<proc1d>,<TOPSPIN 2.1>,
      <abs ABSG = 4 
       data hash MD5: 32K
       A6 89 90 4F 15 A0 83 47 38 A4 67 C1 96 27 CF E3>)
(   8,<2012-04-04 13:48:49.125 -0500>,<Administrator>,<TOPSPIN>,<proc1d>,<TOPSPIN 2.1>,
      <abs ABSG = 5 
       data hash MD5: 32K
       46 79 6D B2 3E 2C 26 F1 18 30 BE B9 F4 7A 56 47>)
(   9,<2012-04-04 13:48:53.328 -0500>,<Administrator>,<TOPSPIN>,<audit>,<TOPSPIN 2.1>,
      <user comment:
       ICON-NMR User ID: COFFEE
       data hash MD5: 32K
       46 79 6D B2 3E 2C 26 F1 18 30 BE B9 F4 7A 56 47>)
$$ ##END=
$$ 
$$ [...]
150 150 150 150 150 150 150 150
##$TP07= 0
##$TPNAME0= <>
##$TPNAME1= <>
##$TPNAME2= <>
##$TPNAME3= <>
##$TPNAME4= <>
##$TPNAME5= <>
##$TPNAME6= <>
##$TPNAME7= <>
##$TPOAL= (0..7)
0.5 0.5 0.5 0.5 0.5 0.5 0.5 0.5
##$TPOFFS= (0..7)
0 0 0 0 0 0 0 0
##$TUNHIN= 0
##$TUNHOUT= 0
##$TUNXOUT= 0
##$USERA1= <user>
##$USERA2= <user>
##$USERA3= <user>
##$USERA4= <user>
##$USERA5= <user>
##$V9= 5
##$VALIST= <valist>
##$VCLIST= <CCCCCCCCCCCCCCC>
##$VD= 0
##$VDLIST= <DDDDDDDDDDDDDDD>
##$VPLIST= <PPPPPPPPPPPPPPP>
##$VTLIST= <TTTTTTTTTTTTTTT>
##$WBST= 2048
##$WBSW= 25
##$XGAIN= (0..3)
0 0 0 0
##$XL= 0
##$YL= 0
##$YMAX_a= 510393
##$YMIN_a= -618710
##$ZGOPTNS= <>
##$ZL1= 120
##$ZL2= 120
##$ZL3= 120
##$ZL4= 120
##$ABSF1= 14.98061
##$ABSF2= -5.57192
##$ABSG= 5
##$ABSL= 3
##$ALPHA= 0
##$AQORDER= 0
##$ASSFAC= 0
##$ASSFACI= 0
##$ASSFACX= 0
##$ASSWID= 0
##$AUNMP= <proc_prof1d_extract_pilot.lims>
##$AXLEFT= 0
##$AXNAME= <>
##$AXNUC= <1H>
##$AXRIGHT= 0
##$AXTYPE= 0
##$AXUNIT= <>
##$AZFE= 0.1
##$AZFW= 0.1
##$BCFW= 0
##$BC_mod= 0
##$BYTORDP= 0
##$COROFFS= 0
##$CY= 15
##$DATMOD= 1
##$DC= 0
##$DFILT= <>
##$DTYPP= 0
##$F1P= 0
##$F2P= 0
##$FCOR= 0.5
##$FTSIZE= 32768
##$FT_mod= 6
##$GAMMA= 0
##$GB= 0
##$INTBC= 1
##$INTSCL= 1
##$ISEN= 128
##$LB= 0
##$LEV0= 0
##$LPBIN= 0
##$MAXI= 10000
##$MC2= 0
##$MEAN= 0
##$ME_mod= 0
##$MI= 0
##$NCOEF= 0
##$NC_proc= -8
##$NLEV= 6
##$NOISF1= 0
##$NOISF2= 0
##$NSP= 0
##$NTH_PI= 0
##$NZP= 0
##$OFFSET= 14.98061
##$PC= 1
##$PHC0= 213.4808
##$PHC1= 0
##$PH_mod= 1
##$PKNL= yes
##$PPARMOD= 0
##$PPDIAG= 0
##$PPIPTYP= 0
##$PPMPNUM= 2147483647
##$PPRESOL= 1
##$PSCAL= 4
##$PSIGN= 0
##$PYNMP= <proc.py>
##$REVERSE= no
##$SF= 400.13
##$SI= 32768
##$SIGF1= 0
##$SIGF2= 0
##$SINO= 400
##$SIOLD= 32768
##$SPECTYP= <>
##$SREGLST= <1H.CDCl3>
##$SSB= 0
##$STSI= 32768
##$STSR= 0
##$SW_p= 8223.68421052632
##$SYMM= 0
##$S_DEV= 0
##$TDeff= 65536
##$TDoff= 0
##$TI= <>
##$TILT= no
##$TM1= 0
##$TM2= 0
##$TOPLEV= 0
##$USERP1= <user>
##$USERP2= <user>
##$USERP3= <user>
##$USERP4= <user>
##$USERP5= <user>
##$WDW= 1
##$XDIM= 32768
##$YMAX_p= 444464375
##$YMIN_p= -660884
##$CURPLOT= <Network HP LaserJet P1505>
##$CURPRIN= <$Network HP LaserJet P1505>
##$DFORMAT= <normdp>
##$LAYOUT= <+/1D_H.xwp>
##$LFORMAT= <normlp>
##$PFORMAT= <normpl>
##$SURQMSG= 1
$$ End of Bruker specific parameters
$$ ---------------------------------
##NTUPLES= NMR SPECTRUM
##VAR_NAME=  FREQUENCY,     SPECTRUM/REAL,   SPECTRUM/IMAG
##SYMBOL=    X,             R,               I
##VAR_TYPE=  INDEPENDENT,   DEPENDENT,       DEPENDENT
##VAR_FORM=  AFFN,          ASDF,            ASDF
##VAR_DIM=   32768,         32768,           32768
##UNITS=     HZ,            ARBITRARY UNITS, ARBITRARY UNITS
##FACTOR=    0.250966925370066, 1,           1
##FIRST=     8223.43324360095, -164190,      -113624
##LAST=      0,             57397,           -292071
##MIN=       0,             -660884,         0
##MAX=       8223.43324360095, 444464375,    0
$$ Real data points
##PAGE= N=1
##DATA TABLE= (X++(R..R)), XYDATA
$$ [...]
23768 -84583 -94875 -139255 -66602 -168908 -263125 -128133 -226961 134154 -116082 70008 57016
23757 57016 -8895 -193641 46658 96789 -69101 -174350 -508 -64537 -44730 25870 -18722 -142855
23745 -142855 -68189 -125491 -30588 -445697 -278750 -233175 33106 -300621 29075 28890 41627
23734 41627 195887 -231090 -375420 -136771 -63208 -332855 -16201 -175928 -173385 -289694
23724 -289694 -329497 231904 193607 239451 -132700 -207278 -321629 91527 210174 -153461
23713 104340 254022 49335 -56490 -62937 -153024 -196457 -356690 -6372 33284 -177703 -86110
23701 -182019 -40326 294836 -70607 -176205 -110956 12271 -232803 -104543 -9226 223589 -144661
23689 -35636 -197513 -209569 201207 -191170 -167455 -195242 85423 202715 -65840 57822 77542
23678 77542 -67560 73975 137928 -50692 -6870 -195212 14523 -43919 224322 -321501 -489675
23667 -489675 90778 -243609 71560 -81154 -115839 -29129 461626 142013 -144583 221125
23656 61732 -125934 25977 -137040 -98047 -68731 -161185 -162362 32406 -216797 193082 128170
23645 128170 -92146 -67390 -158618 -88576 59284 266107 -88084 214592 101705 138232 190813
23634 190813 -312412 -329957 110151 -214399 78504 -51024 -148449 -73141 -49915 75956 -38893
23622 -227926 148879 103029 -525009 263013 -487310 -30395 113325 80383 -197775 251308
23611 164292 -121129 -69244 433190 52436 -128104 -154554 55319 146381 263104 -45664 235736
23599 -61309 217778 166076 -70539 143109 243442 26281 -280727 41520 -34404 -197309 -47974
23587 -226027 76416 168035 136902 74822 306082 -158184 -35164 201692 492317 4409 -86965
23575 -64480 71120 -35520 306609 46329 -72000 150271 42534 118036 -154850 35319 134876
23564 134876 -240643 148343 62889 323411 107062 20621 -19988 -182251 -80870 46534
23553 -196911 -308171 20061 -51391 80778 -90331 201078 -187213 65288 -73227 -13982 -500813
23542 -500813 7234 -131080 -12010 173139 -224394 -192251 -242238 128725 209937 -251736 60120
23530 -38301 6392 199152 -450327 98826 -3513 -289410 -218884 -288709 -304158 -42033 163442
23518 203968 4551 6673 302042 26762 -112590 9786 47691 112167 -71101 367541 -22287
23506 161864 -85187 -187414 -180689 260337 -244654 -40225 167566 -119451 -619 41040 136824
23495 136824 -199571 81428 -39853 -32825 16813 -75348 -183300 -5872 -75504 310174 70869
23483 170124 162855 -144785 235928 -407994 27801 65474 -56860 50586 -65721 8394 -182104
23471 -339965 -266192 -8566 104917 56014 211473 -127188 20007 29230 93586 -47305 171966
23459 -8737 87606 -342291 -179378 -188944 -165452 360624 -147888 102031 -43363 -330411 195191
23447 -523665 175315 73972 -95429 147534 -58953 73546 -142685 -263459 -135362 -104621
23437 -104621 323669 -115225 90231 -444017 -158096 179219 -235587 -86669 10514 139953
23427 139953 -24315 -110842 69214 -352052 -130639 -92754 176786 45246 110375 -140277 -8911
23415 -195534 192361 19370 174287 225728 -78609 30260 112135 149672 24317 -10061 124896
23403 -88488 189200 -112076 101027 -24785 88975 -204095 -7059 -117348 -73172 -58226 -11372
23391 -482150 61764 -2140 -64709 -331137 53145 -327440 192343 50409 -205030 162547 310936
23380 310936 178933 33515 108426 -283655 -304506 80955 189586 -305955 -21721 1402 -66269
23368 26894 -79058 -231596 -223822 377992 -90796 -4574 -46757 -3131 -41839 -15081 -219084 6888
23355 -102616 -51597 196099 254280 -177345 91635 339694 280377 -134541 44900 444058
23345 444058 59649 -152797 102616 -173675 -19491 89848 90705 -280439 -202438 -243305 -153156
23334 -153156 -275703 -29067 72066 215119 73583 386723 -25091 -8197 -210516 -72996 -290506
23323 -290506 147039 197674 140111 -94527 -65842 137800 206935 -215457 -71145 -221569 289178
23311 -273921 -61162 -190771 -324762 -4247 -191025 184353 148915 144245 -231742 2118 -73750
23299 -36336 51201 165155 -213925 21794 -35617 137352 -244035 83760 -380341 -6611 22793
23287 58448 98628 -129888 -36830 170468 -85434 -240562 -50375 -124458 -62527 -218155 103879
23275 246841 103748 -397452 -28341 96780 -46859 -142554 -185435 -20103 -51520 17017 -70383
23263 -128376 135939 -210921 237565 -47357 -87708 -42076 107863 -240525 -62898 268020
23252 4849 -329318 -84853 64472 59488 -32792 -205954 -120120 -324057 -114580 -98140 -37075
23240 -151198 -59270 154723 -375952 73690 -37340 -37434 115638 -289078 6770 129629 -70166
23228 -84347 -230946 -326651 171250 241606 294797 -35463 219496 -227504 32398 -334885 -50671
23216 -48941 26302 -119391 -170569 -52529 46797 -250069 165757 119468 -131482 17178 54577
23205 54577 -90167 -134202 -50502 217430 -13441 48884 -226627 -405954 -5916 -27399 -410849
23194 -410849 23178 214064 50936 26273 -175345 28904 -367629 -89062 -475813 143159
23183 128281 150179 127158 6128 117050 176473 -110213 20567 -150029 -334404 222510 -277463
23171 221335 142834 -75890 -31830 122231 -174673 70041 294766 9985 -48712 -171391 -3403
23159 33796 -302413 -49873 -256620 -206092 -6761 -101776 70629 200759 37037 -261040 -231549
23148 -231549 12147 -30669 -119753 -56148 -114200 21758 -262663 78409 -127883 -95455 -60099
23137 -60099 -98277 64988 -293168 78623 12641 175486 40974 41316 -56836 185251 -23625
23125 -20495 -22614 -105466 864 6309 384291 -252719 -169764 -101232 371669 8226 273382 347824
23113 347824 396382 14369 -76899 -122567 -319597 -267160 -30325 -198167 110480 191215 39709
23101 6947 -8248 -102247 336255 284819 17377 101106 -246263 326780 -386254 182193 -3565
23089 35363 160780 -6738 -245392 -85206 192374 -4601 349461 -68375 81404 208868 85499
23077 -94025 85296 -52856 29977 -17097 186887 78050 -48176 28678 178800 -114858 25037
23065 -233406 26736 38268 302296 -171731 9246 -66712 94538 34526 -29083 68171 157365
23054 157365 -179156 114274 133823 -154824 -172839 -13126 27684 -143174 -451266 -52933
23043 -67260 29903 -334902 39113 66740 55811 -62260 79189 -192638 -190080 362451 45422
23031 331312 -243409 -46424 211328 -177141 173761 81674 -199857 28500 -269466 -67471
23020 267659 -117716 -12704 -344890 -221162 -315605 -192332 55997 71120 357379 -205886
23009 62460 -135683 118182 79552 -151011 -191868 -185807 72756 -14190 -141834 176409 -116534
22997 36495 3538 -23007 120489 -7623 -68428 -120700 -299978 143271 -176087 249505 -246611
22985 -97816 -103377 -246567 -297878 -127703 -60412 -13843 148913 87084 -85652 157036 -63428
22973 -40030 53028 -67867 -73713 246132 -303193 136312 -24125 307267 47127 45331 -90525
22961 -256742 -46870 -114824 19268 -314374 -11048 -59614 -323156 103795 -128360 -100860 11583
22949 -61163 130395 9467 -25697 -60030 137303 -37318 -71531 157093 -142653 -64544 -245615
22938 -245615 -162871 -21818 -197747 244905 -142795 -429817 60311 -244399 -191199 -15392
22927 -183074 -101871 -168778 86440 153891 -197006 5342 -69955 149734 126076 52632 94808
22916 94808 -92556 -67584 -46877 264534 -99681 -239245 -56786 371888 -69777 -258531 -130582
22905 -130582 -314055 -25728 -140212 -458151 52078 -56951 141601 -140228 -324309 96186
22894 164740 -201214 -74971 -198332 -53994 -43432 57254 46738 -181107 -14420 -124180 -134151
22883 -134151 109953 23882 164129 40164 33437 56424 -154495 43529 -337827 385583 -119049
22871 -154541 53650 -86727 -125953 76161 -146248 -171185 179385 57714 -304317 -70411 -115030
22860 -115030 26161 33830 217698 -31218 -43192 144268 -160079 -200118 37749 -91870 167472
22848 257450 40964 6865 -8249 665 -79458 288509 58563 -335397 160993 -551 61745 57825
22836 57825 108347 79204 -288260 -262920 -173954 -30122 -253418 -19052 -151430 -185875 44927
22824 -169278 1329 -164244 176583 342634 -149709 -45390 209703 -259891 10964 190825
22814 190825 83607 -29052 -69391 -383766 -31586 -217265 -158647 193004 -344531 -211482
22804 -211482 15201 30110 36526 -76181 -152019 -74330 -232643 189592 -7994 -199739 -56781
22792 -9678 -385110 1406 -532385 -125080 -193609 96177 -151022 18869 77870 -41794 -11892
22780 -316618 20807 207531 -52416 -288878 235669 -257375 140491 -18651 -7592 -188694
22770 -188694 -407229 -274695 -178811 -17420 -54274 -333991 -99632 -247361 83667 -4539 -330427
22759 -330427 -141478 -280578 238542 -12434 149313 225578 69006 10523 178412 -324138
22748 18938 -144736 -125974 -113399 -146200 -247304 -175081 -17534 -1988 165519 -36972 -58637
22737 -58637 295446 -399942 -120914 -181454 33037 -62062 -190691 239596 90494 -47564 -2924
22725 -75383 142346 -1929 84434 35596 170014 275170 69670 76673 -189551 -186578 -30346
22713 -10693 68504 118490 -197057 -131369 -169171 109761 -155087 20598 -263453 77465 -210322
22701 189092 -187994 263037 -57194 276021 161669 -169724 -167353 -166118 197114 -48606 -135175
22690 -135175 -95628 211793 99207 -145712 158693 -301299 -110849 -86102 35344 -58867
22679 336828 -129996 -144960 105817 -164785 -13130 103893 -84785 52003 154056 -265281
22668 -165709 -47791 -33209 209454 57090 -44429 -13151 67456 -129657 -5975 -209064 -230660
22657 -230660 -121099 93394 239771 -72199 -112718 -77887 238158 63100 154333 -89748 211357
22645 -139637 -84 -294640 -160934 249445 107815 -174268 6217 354165 277591 165604 -286446
22633 55241 36058 -274184 -55304 -336610 -107597 -63070 217403 42332 -373793 -47452 392690
22621 47022 -233798 -195527 -115889 91892 33703 -87323 -336500 -188299 -57425 -77796 -52171
22610 -52171 -267871 -104100 28717 30415 52597 -211620 75685 5771 -482478 81690 -245882
22598 -235409 222534 -205271 77628 -210840 72743 -137477 57910 58690 -291416 -183796 -264653
22587 -264653 -121570 29560 -178663 -326433 -387685 194520 -220135 307292 146643 -237077
22576 63589 -241471 -139637 -4783 -448378 74333 204017 108597 -112888 113506 -197693
22565 -113906 -200369 -168412 -84307 -31927 92887 -185649 81177 189689 -180340 -109830 35763
22553 11361 135014 97121 337682 120000 41106 -85885 -314637 160155 -92400 -5655 -131211
22542 -131211 -146754 -6738 148451 221229 14794 -35182 -173308 -53689 25946 18077 -42194
22530 -85975 -209249 -64454 -198487 283418 -173466 63159 -225217 -110531 -201679 -23658
22519 84889 -19444 37525 -160539 -12760 6496 -185003 -363507 -230697 -172501 -280419 -58737
22507 -192331 71869 336439 -328467 -187539 -116546 -136544 88560 102041 178260 -143390 11566
22495 -142422 -307254 50261 -256916 -184076 33153 -360602 -18137 247341 37704 233303
22485 233303 -131166 -129722 -324240 -160861 -261383 -363307 -179755 184112 13070 -81806
22474 236033 137611 43177 245919 -298814 96448 -75316 -52705 -46192 -259876 156991 106950
22463 106950 -92603 55739 68321 -204233 212083 -211103 -90044 -35435 125505 -244557
22452 -296545 -3710 -48559 -27850 -93452 -185803 -74149 -36160 51444 203467 11693 -124225
22440 -55221 -23819 -145921 -155800 177573 -73058 -70815 -10966 -10137 -106584 35935 -35550 -52552
22428 -52552 -154365 -128135 32128 -299277 91673 -267365 178124 -165575 -72523 -225163
22418 -225163 -85474 -240411 94981 79581 -116821 -256974 -127915 -292721 -34931 -22308
22408 -22308 322294 -267111 75764 -225415 -17634 8227 22391 -222795 129881 91141 94501
22397 94501 -43001 -84544 33237 49467 -111415 44304 -111661 -77079 145964 79502 158963
22386 158963 -7281 141850 -84031 25536 -8280 118537 -208243 -23004 -212950 51615 -311708
22374 47726 11235 208349 -3923 121079 -103725 134459 476386 -201962 77098 -86275 -92750
22363 -92750 437883 -28804 -9415 73748 -106600 -172719 28460 -38661 253032 25566 68532
22352 68532 244603 -130648 -59556 35945 250299 34454 -159671 -290542 52142 -136703
22341 -125191 -463537 2640 -341896 125562 -61032 -114547 -295141 306089 -116028 -295280
22331 -295280 -66934 -56807 -197285 155265 -252221 171534 129526 -250421 -180521 53206
22320 -293840 -14512 11642 -48149 -109443 97775 41952 -335995 -49720 118079 -42019 -128896
22309 -128896 -178704 -354599 6320 28596 -182560 -350268 160106 -33593 -259925 -256700 34710
22297 -228240 67478 -80276 24588 289235 11342 149243 214051 -138758 216171 46320 2646
22285 -138777 -193241 -6624 -26309 -182457 -12994 73935 184231 -317896 -278500 -69705 240052
22273 -84168 292836 398146 186189 -11988 176863 -290521 -340740 -554457 -254724 145371
22262 -55816 170166 -184052 -131561 -145674 -11809 482966 -290866 -92046 -12134 210031 -490310
22250 -242197 85439 -195837 100430 56604 -80491 -14375 -45613 -156865 -59158 201585 -114678
22238 185968 54483 -320734 120086 81809 -9213 -162732 27134 -265553 59120 -467322 -145362
22226 -301813 -205489 -128407 189461 -14432 -92905 -116418 151833 140982 -263572 1886 65876
22215 65876 23988 -236797 -15566 -98427 160936 225907 28506 -153672 -166346 30283 -207280
22203 70281 -72747 75367 13000 -277038 125161 88322 -70028 -1775 -72265 32272 -256225
22191 -207577 -106035 -120891 -101783 158409 -188841 93206 -182942 76779 86031 -43280 -120445
22180 -120445 -143702 49410 -166104 369688 -194543 41920 -203850 -31795 279608 110616
22169 -193528 48414 45252 148934 -293731 -302776 -373076 254945 -160830 -233435 -150362 -191371
22158 -191371 -118335 -24875 -208 -70581 -197875 -172321 -95773 -131695 -75448 61380 20081 -27339
22145 -47961 38234 58693 -198763 -407725 157376 69690 190723 -261434 -146786 23530
22134 173283 -242280 -282443 183619 -9513 -65837 320400 90976 149672 235495 -80243 151285
22122 -251672 -55928 -102916 73412 1091 -186712 121052 -30405 -61748 -147473 -361570 -319353
22111 -319353 -122996 -31163 165873 163542 -19258 -209564 -74104 -203885 -77145 -295499 37637
22099 -204643 -29764 246160 118806 -9283 -149504 103641 20789 -131539 -102444 87453 -31577
22087 315941 157435 -175005 321007 163238 -255263 -151654 83811 -183479 -54628 -213607
22077 -213607 -107736 -54898 37920 -192632 111995 125456 156464 65536 -228393 99365 -205160
22065 35083 -304063 -480082 661 266245 90721 -82372 179296 72054 -105617 -2460 20423
22053 -29553 172758 -24341 -300231 495214 189649 13610 -77150 -98674 -193118 139678 -27265
22041 151223 263724 25004 84439 -66319 -92459 230345 -288556 -24036 16999 -257301 -152470
22030 -152470 7171 -293575 -161736 -81056 -202746 -388803 49323 -34998 -161744 114259
22019 -119783 38298 28255 -129067 -92086 137915 384461 -337831 -77928 164407 -284777
22008 -62151 -469104 -129757 -88961 -165137 -20130 -232042 78941 -265381 -170915 -30820 202854
21996 -44802 106591 -295170 -177871 -204399 -81018 85920 36814 103205 165026 -154499 10831
21984 224130 -73024 -15641 -322967 163738 -260045 -138756 17334 -7731 -338193 -188594
21974 -188594 -259147 -218198 21336 72773 73690 -78528 -25472 31695 -82820 -374248 -63984 -190982
21962 -190982 -28614 -246003 -181227 34370 262105 -488379 144195 -27968 17928 -83873 154187
21950 -362583 -120288 -322924 -71526 275021 60338 129187 -200248 144055 -340423 -238145
21940 -238145 116381 158742 68243 -127516 -64412 -13643 -20139 -23755 428833 14773 -379071
21928 -211928 -383273 1706 -88447 -55688 -35550 481915 -212835 155933 -167744 -2865 4453
21916 -112569 -132657 -97337 -204967 -146994 -232065 -40332 41611 -306157 -63619 -184946 451894
21904 -2525 149129 -231691 -153344 80296 209045 -298034 555567 298939 100619 84046
21894 84046 89834 44625 -29792 -101496 -174009 -175263 -244325 -63415 -208832 16580 19947 -150415
21881 164204 -218521 -5526 -199599 -83893 -62475 128495 -25548 -15099 69031 -300237 215013
21869 -186204 128968 -453064 71397 44335 311125 -527368 183760 -323008 52996 -116643
21858 -56733 99723 -163955 -41589 -211258 -42758 212186 -70129 -27483 -88257 51722 -242145
21846 94749 205680 -68423 -7754 114277 -151738 78902 148470 -40301 -111159 -391692 -288772
21835 -288772 35814 -123236 -35640 -168185 102268 162306 -515084 80791 -281397 -72853
21824 57347 49781 27476 -324768 -6475 -254235 -291251 -137004 -177327 31158 -24053 179152
21812 165679 316652 -167727 69823 -306483 -3565 226989 -24482 -38280 -298568 168608
21801 -83939 -396482 -213288 116086 -211772 -157062 216136 87073 -139760 164423 162725
21791 162725 100484 37869 -176579 -20187 28743 -193868 -125690 -5201 -262920 -79215 -165886
21780 -165886 300512 -71229 -125112 -50811 -132775 92158 -133946 191883 55287 -79508 -137463
21769 -137463 -95899 -147255 246784 100439 -42870 259464 -256532 -143953 -159513 -147699
21759 -147699 55131 -131560 -119411 137164 -14910 -252253 75368 -121443 -232285 -72099
21748 -149092 5392 8312 -5286 -71018 -88312 60557 118413 -353925 14747 -24703 -160848 -257859
21736 -257859 76942 174326 15330 -282773 -16520 -149759 -168620 -61992 -308301 -502107 141883
21724 -67086 -198553 -64732 -222779 58729 103294 29457 -167186 -150351 302762 -200187 -78753
21712 -212755 -4920 231623 -30586 -23350 -179305 -47198 -219314 -77918 -132238 30412 -5885
21700 -19268 -111726 -204161 -99267 -185239 121600 -143739 -137376 202671 -49910 -159659 -11410
21688 188119 122642 74665 -280077 -397128 -253314 26117 72602 -125727 -142731 175874
21677 -91835 -124400 14267 119874 138457 -146619 26177 -175186 -224398 125950 259031 -508485
21665 -82065 14235 -181824 -22623 -1581 -53667 257630 -46046 -137272 -126943 170758 -188539
21653 -331153 -318800 -32295 -173139 210628 -18506 40225 56454 -243991 133625 -31940 -127967
21642 -127967 -112553 -70856 -126367 -6746 90490 -94695 -357694 157692 -334547 18116 36396
21631 36396 -126413 -95521 -81013 85885 22079 -462543 205451 56337 132797 46250 -233183
21619 -472459 -234390 -64680 8257 -17929 -214652 -243020 106627 -151958 -501936 -292718
21609 -292718 95814 -48779 79407 309145 146787 12550 166370 -192174 161467 18181
21598 201298 -236172 -243191 -11101 -189594 -182621 -133156 -135185 24776 224524 244 -32269 27071
21585 36481 33347 -2800 110447 275994 93633 -105444 -444997 106591 69861 87387 -255126
21573 150712 -50480 -46054 145253 -264537 24190 -341667 82553 -59659 -169341 -281501 -37345
21561 -10901 -179328 -51100 108780 -399478 -182059 -44090 38000 5602 7108 67720 -118844
21549 -81789 101558 -142937 -129638 -205315 -71429 -127132 111936 -301264 -202722 -86738 294542
21537 -116696 -98421 198898 -104372 64205 20614 49143 -101930 10107 157956 -272264
21526 -24564 -64956 -39942 243737 -267402 -123012 94288 36051 -397836 -117360 -37606 79046
21514 -292936 -112405 92279 -131125 132840 -84379 -39734 -90792 -29913 -54909 24628 -73998
21502 52125 -344069 -241865 -15456 -177069 34663 228215 -302229 196991 -124866 66619
21491 -94844 -114376 -63807 -411034 -170754 -202007 91067 188857 -228704 -30870 169464 -183954
21479 -173739 205252 -296628 -10174 110331 152698 -159800 169482 -217856 55385 -107957
21468 159608 -58552 -160825 -197382 267919 -253562 -295125 -341455 234390 -58989 105034
21457 -18607 -211477 -55091 -101187 237224 253525 -51059 -1285 32974 21475 -378910 -39322
21445 -128921 -111086 -496206 100837 62673 -82406 -303178 -224441 -4767 13485 103948 -9549
21433 68273 103493 -20770 -228317 -189240 70122 102550 255153 39355 167101 441166 308031
21422 308031 215847 -60784 502832 360692 116525 31745 89074 41038 -78433 -27996 14118
21410 -9620 -228389 -130738 -110883 -76252 -240079 -125354 -152631 15596 228277 -191912 39885
21398 -179009 261506 189205 38096 -329446 263644 -108807 212958 -176563 36197 -204833
21387 -93169 80496 -144739 -73150 -58469 15367 -194915 -224746 107429 -46388 -125229 138340
21375 -112052 -259381 -167058 -410217 -405057 -235041 -2011 -68862 -114920 39494 -126582 40729
21363 -62800 -311240 -298914 50794 -224658 -181699 -76420 336532 -311329 -82490 -39017 -75011
21352 -75011 126868 -15861 8364 -136817 -429103 88570 40480 -52511 269789 -150177 -43594
21340 -89816 86636 -320234 194432 -197463 -74429 -32163 -107482 60898 -202028 -4528 -197414
21329 -197414 -123329 -29600 -181181 142828 81759 -99986 -116631 -166557 136349 -177639 177779
21317 -365922 -62939 141950 -239063 -47779 -423476 149038 -196459 -375691 -31822 -176149
21307 -176149 184436 147872 194030 176654 -118954 -160932 -259686 58497 -289407 202169 -127700
21295 -63586 -47826 57931 -68351 -243070 -183701 -180252 -57900 -58651 194939 -23861 -228032 -336592
21283 -336592 43948 15840 -75047 69659 199680 -121909 -76444 155603 -191908 6008 -254658
21271 -69650 -119329 -276370 74661 81908 -37695 -28529 69548 73587 -209284 104512 -103105
21259 38926 -236068 196417 -280103 120442 317281 59815 -47667 -227306 -233801 -254559 84234
21247 33162 107630 24100 -399092 392840 -184773 60178 67501 98869 195913 44045 -28577
21235 16346 250798 -4662 -128654 308467 -188312 -396503 -142938 -179379 167443 -90047
21224 -54804 83892 135906 -31138 -300644 -8659 -204370 -221707 85007 -139105 -111062 -33013
21212 106926 -80369 274182 -263859 179559 -100324 -136430 -175481 -42644 -387995 53850
21201 -124586 -204255 -178898 258946 -199810 -177214 91777 -160281 31531 213927 -94719 -171851
21190 -171851 11678 -104966 -155756 13333 -138335 150415 -311107 -126747 9074 -79174 -192055
21179 -192055 17314 43008 -282209 61698 -279621 -159909 -198853 -153705 230646 40240 -297755
21167 360145 -169193 274306 -228220 -204335 -94681 -116471 116890 -67707 179477 192032
21157 192032 148973 -176347 -82431 110339 -274903 -1748 -101286 -48514 179670 -427494 -55604
21145 49199 -338433 -227900 27625 -289166 117232 80046 -96959 185525 -25142 52603 279164
21134 279164 -125190 -11009 -199311 -186913 -85750 72296 57937 -32168 -265375 -89284 -322303
21123 -322303 -124946 -110462 -282965 -167750 -262994 -5717 391927 -394714 -76677 -65359 8090
21111 -141037 -269951 -56417 97119 -93294 -273938 -80789 -14705 -225433 -379110 -98112 9513
21099 -541916 -257965 -166350 -74717 -208426 277595 66983 -278910 -8100 -97964 -327762 41011
21087 -127619 5789 1637 -336832 -39353 -103643 136454 21157 -99628 -55177 156612 -161322
21075 -92581 78161 -83774 -184783 -141692 128273 -36020 -55343 44184 174065 -298737 119614
21063 189367 158734 -178126 -240156 191245 46982 55739 -189039 133924 92245 -228547 123973
21051 -264378 241213 -99136 133607 259334 -50275 1286 26483 -28973 -23759 -36359 116198
21039 144315 -236846 32739 -4368 213250 -175190 222552 -235820 83021 -217667 49736
21028 -315174 194723 -220708 208083 227230 242372 107086 -21274 -57525 -376404 -134840
21017 86511 -48877 55379 -6378 272369 -479568 -84521 -22095 164621 106374 -29104 176143
21005 66832 215919 138395 -99577 107147 -87146 143798 73225 -363415 32868 110088 16365
20993 196980 60737 546795 527732 211506 -96742 -154339 -100769 78672 172228 -36918 110907
20981 57508 -63590 111839 202217 -99199 -558435 -342757 47030 -332329 -63794 -130498 -92646
20970 -92646 -102063 -107282 161879 293471 -214479 67985 403463 265696 -262025 100985 164571
20959 164571 -41462 -491934 -300073 -281581 74515 35572 -15620 74708 -139920 -180116 -316263
20948 -316263 -187564 -300629 -114175 -181793 -138590 -369576 -267156 -58187 34949 -314780
20937 -135475 95764 -333218 -137722 -136815 54421 -95557 -1590 477776 91948 307021 289607
20926 289607 -111825 254315 -191499 399396 -300810 375284 21370 51728 163364 429226
20916 429226 -58749 -46762 145005 135651 -124129 -271846 -135419 -177834 -58147 209770 27317
20904 133458 91315 -109921 -267916 -165226 54459 176672 -127691 37292 210133 -25904
20893 56597 -155840 55567 238946 -48064 67741 -483639 -51980 -217090 -143908 -16041 89664
20881 -244876 -58028 -234916 209389 -351590 -166841 -38898 -121099 -32443 54399 -192975
20870 50907 178069 186012 -239893 -25080 -271891 -340745 106753 -219093 -128736 -289901 150177
20858 28658 -49882 51718 -303428 -219744 -1191 -312935 8720 80528 -152020 -86062 145275
20846 -177556 -26798 -184149 -65629 -60563 -120062 -163354 -91002 47282 -155 -266496 142354
20834 -353487 153004 18233 69886 233975 272018 -241754 -181708 -139005 188288 52771 -106470
20822 -377399 369025 -54640 -296584 46197 -257792 -77078 -74611 -110701 -372132 -105488 -292917
20811 -292917 -47395 -47342 -65573 41243 -296739 -102107 -386249 -24756 -320932 -155100 -5886
20799 20809 -110821 -133628 -74111 -70109 182114 -189065 102319 -286367 128980 81533 103829
20788 103829 230653 -91886 -93255 88071 90092 -278062 -16663 -6987 -239035 -84497 -11285
20776 388579 -52198 -83395 -263044 144498 -285760 11102 10188 -161650 -45489 -66420 -135543
20765 -135543 -244435 136817 -229459 -213008 -197365 -25432 -148645 -82425 15255 -182321
20754 82518 -46248 -312277 79374 -281051 -55115 -256132 32444 -1690 200256 63674 -185971
20742 -112494 1142 113846 -69434 -164287 68646 179131 91310 467897 -14138 3730 -80151
20730 -389989 17776 174347 -99652 -203954 -327019 -40920 45829 80785 32596 104994 -162469
20718 -80883 -328773 61989 -281921 73244 -32559 9521 -85981 -235227 -164405 -126664 269754
20706 -275418 249285 113286 252217 -202486 -121504 -62197 -271467 66992 -160983 -32604
20695 -15245 -22846 -167368 251235 196698 11899 -182234 -125683 -31839 -117748 -1798 -163448
20684 -163448 321399 53906 78856 169322 116459 -75368 64036 112497 -196472 -91610 -26561
20672 21426 -209084 10955 -120405 -163701 106936 -81937 -320253 -250417 -335075 -107741 -12748
20660 -82033 -163383 -217204 -120400 -343423 -95303 -234946 42765 -86690 36560 -211980 -75459
20648 -51030 -273297 -164615 -305546 22883 -116553 -45674 42665 101332 -46643 -159418 -369285
20637 -369285 -170354 -169489 -213211 -96487 228059 41516 -1275 237518 -33084 -283116 -111163
20625 -70548 -80050 -53183 -242613 61962 -33846 -54315 -302202 39408 -80619 114032 8891
20613 -394548 -153829 20509 -151582 -82786 -229679 -283640 252759 186145 -111640 -223193
20603 -223193 -98337 -110754 -19387 280668 -48603 6616 -223361 -188584 -83629 -114916 19085
20591 -131002 -121546 -165362 -88877 293729 -222672 -91073 25354 10550 -273770 -27918 218566
20579 249604 203427 -61147 -18997 -233310 18354 -191991 170836 185322 -443711 -246009
20569 -246009 202694 -151488 350016 -145665 126140 73599 -162825 233091 -10900 -139323
20559 -139323 215682 89101 -368516 20345 22419 -69518 -12441 -196067 -66266 -170394 29980
20547 317547 -130557 57563 109702 14073 44157 -35451 -49318 -80736 28749 -305081 -185798
20536 -185798 -76069 241305 -382297 -450691 -112543 122141 89888 -202312 63770 35130
20526 35130 61599 -172888 128227 198150 -74886 -115855 -178372 82809 196744 22985 -193584
20514 -179417 114843 -75021 -250148 -491451 134388 169988 -320642 -249955 -39558 -223161
20504 -223161 -124687 102196 -75286 268877 -33301 -189435 -69720 469144 154384 -39196
20493 -120819 27911 -164747 -154823 -162770 -220769 142796 -171049 -82217 -50509 307240 -125322
20481 -65257 -359502 -254487 122167 110823 -197571 16277 -225086 -97961 -107305 -117965 -84090
20470 -84090 111926 -362163 96375 124121 -125655 -62743 49161 128053 43979 -323165 -97001
20458 33775 -187370 -81560 -7615 184960 -85855 -223864 2778 -255192 149846 88555 243388
20447 243388 168825 1258 -198178 104508 150733 32461 -119032 216991 144682 -56457 136507
20435 -417835 145507 252096 55904 1809 -290070 -86089 -184433 53109 -236197 -158474 -361505
20424 -361505 -87841 79481 -78148 191324 162690 -74319 -915 -17996 -195082 208814 96334
20412 -13208 15569 -257151 13467 -126400 239568 -254769 -105734 -336157 -112732 87622
20401 -79316 122593 182166 227106 -34221 148755 -111341 -231792 -238317 -193216 -278910 50186
20389 -178164 -76068 -98673 -86702 197018 -64080 24851 -292860 -108006 -4499 334729 -280879
20377 -234360 -168189 189031 -645186 -141648 -75885 -305826 5918 24374 -168669 -147512 -264262
20366 -264262 -17014 127911 -519941 -51167 -278271 -119610 17095 88885 -478458 63368
20355 -37668 -830 249618 271340 -102685 -153426 -106908 109533 -85543 -178024 -172057 41570 354033
20343 354033 -85813 -182151 -25115 -176838 -212666 -5275 -107356 22870 243194 146570 115388
20332 115388 -59907 120230 -79530 219500 110051 182755 -93315 -187106 -266278 131148 -86406
20320 -118515 -233710 360755 11667 117143 199807 -125064 -9789 -136096 17490 -247080
20309 15065 -370901 99881 -40583 166374 -61431 -70872 -17761 -7873 142097 -424275 -169729
20297 -69322 -237482 -14344 -140103 136526 -95056 153077 -126314 128703 -65625 -134070
20287 -134070 21378 -124566 105054 -235800 -286459 -236210 293963 -81598 -66216 132548
20276 4463 -168199 -18440 -108979 -178530 81903 -118442 -81694 -87790 101317 -82029 134264
20264 -13535 -224669 -162457 -159725 251707 -118138 -58490 -125855 -161555 -360192 -94208 49556
20252 -275987 -315046 -83489 -24772 -242706 -143743 49168 14728 171954 113833 -4081 122416
20240 -1902 -162534 103346 -121399 -57494 208247 -154800 -141096 -209396 -360892 -17730 -69548
20229 -69548 -14811 -280192 -134699 -384732 -167669 269432 -46963 -77288 -92838 -230869
20219 -230869 -95364 -65390 -53714 -75432 127810 -253803 -12745 111923 248382 -256785
20208 -35914 -81442 116574 -41093 -282738 -294742 -266882 -54522 -79213 -107359 -89652 154512
20196 -70124 5899 -111931 -41539 -419195 -123703 39716 -60215 -194873 -107438 44132 4102
20184 40991 200700 226863 213493 -168805 270398 -50672 130798 -165451 -133183 -293433
20174 -293433 163309 31339 -88930 357581 -241493 -130311 -261878 -150898 50133 -253717
20163 -8300 47340 116871 -121513 304253 10053 131071 369134 223620 76064 23905 91226
20152 91226 4151 126573 163524 218006 141893 60991 197768 -391410 -139085 271653 -240223
20140 16317 185674 55270 -82188 230215 324573 56992 -2525 269516 268544 55591 189922
20129 189922 480364 -112016 200006 172686 350036 193785 237904 427650 365262 36350
20118 -62913 90265 94339 -45367 -67355 -414843 -226270 221107 309578 -257178 -244614 218189
20106 131053 -187427 -202419 -67483 -248293 292740 -215825 -57181 -204963 -49208 -187985
20096 -187985 -187809 -51006 -27494 135952 -41278 -189283 -144634 -242837 58431 4630 -25291 -15119
20084 -15119 128886 92733 138939 -183447 -66773 -96919 -59145 112343 -99748 -9569 92765
20072 -246336 -24277 -214437 105662 -259821 -6599 -25367 89262 -166496 -89739 36288 -55408
20060 497180 184168 -188071 -126681 -189076 -533380 -16776 42027 -187906 58995 -99379 -297018
20049 -297018 4801 -183379 88517 -182575 -71323 -63953 -161479 -315713 -404679 302164 -263611
20037 -182927 -100522 -201930 139186 -241647 -51548 -85987 -114284 117360 20243 295460
20027 295460 -234203 -341431 77100 105031 53453 82249 -88470 -282077 -242310 -276076 -113305
20015 -16422 -116565 -80170 -231720 -127515 20373 158782 -81451 -41463 281642 163857
20005 163857 -83812 71212 49574 -35389 -124416 36803 -59732 33562 342480 47433 -242987
19993 -59157 -94470 165040 102857 -386603 115162 -17832 49427 -195951 47112 109240 113280
19982 113280 435710 -35293 171206 442742 -9941 -380 -38002 160522 -16607 20140 148525
19971 148525 150556 -71003 -104624 -188010 134346 -99139 -242919 -15870 -28644 -111481 -183772
19960 -183772 229734 -214494 -156342 -34570 -384501 361276 358953 -111089 -128468 -250208
19950 -250208 199045 27239 90385 88582 117450 113154 4158 -168937 -176952 -126163 -33492 266974
19937 33648 -120685 138160 -200658 -58969 175547 -309311 -275346 -75537 -18968 166069
19926 -114756 -258245 -275485 -124042 71480 -70440 26670 -21530 -94827 -172992 25777 39347
19915 39347 -116382 -234545 -310041 -169938 5438 -393576 -268170 -164205 371146 143947
19904 -14365 -477975 -319070 59281 -55537 150651 -238779 138028 89734 -58653 -219774
19894 -219774 -87792 -49337 -41625 46810 -406012 -174212 78269 245274 -73223 -50479 216272
19882 3967 -231323 41785 -169011 -99162 27589 43246 -51448 -31460 110879 -48950 -106122
19871 -106122 -90204 -1579 -217784 -25794 -194398 266910 -21375 -27162 124288 -83998 -113570
19860 -113570 -266699 110582 84648 -78384 185942 -89707 -171513 -278036 97817 140813 -85834
19848 100321 -220361 -85746 -253050 166414 -250231 -117647 -91212 330298 171280 113778
19838 113778 -126422 215288 40276 -273013 57258 -234602 142991 73771 80436 21096 -19957
19826 52334 152836 8024 167391 -88279 50195 93511 -2200 -157933 170354 52423 -227207
19814 15832 34804 67516 -289086 168149 -358887 -267115 164024 103782 -15221 -320164 -320581
19803 -320581 -236356 73219 53237 -49824 -151154 82136 -35760 -306622 -103484 -95257 116055
19791 -101905 86619 48669 -226470 -15280 -54089 124031 22219 -331143 -224801 382729
19780 82973 5131 -231051 -120396 -132491 182170 -221698 52016 -60928 127117 -92376 -91014
19769 -91014 11806 -225714 -160835 -111009 -57892 -101129 100797 122101 137681 -38334 -10262
19757 300739 67704 -420814 248468 -344310 -178644 74329 -57215 -391654 124778 -106328
19746 -265237 59380 -61458 200814 230040 73637 -93988 -71214 -54377 192722 10616 5096
19734 133292 -177995 -243548 -120159 -43744 -96913 -49218 -13634 -213971 -19642 -151548 271826
19722 -128500 -119387 37307 -16263 -64669 -186726 176498 226767 113433 376597 484020 300508
19711 300508 -154119 79934 -344703 76976 76656 104938 -44273 -187944 -114926 315709 -54812
19699 104345 -246535 137380 -149786 -86033 -115041 -36715 -28822 172171 -20847 194645 210731
19688 210731 -1328 54111 -77498 207149 218868 87049 187297 276609 459987 235946 59990
19676 -337975 -136911 -280862 -398120 182090 -336403 158712 158923 -162028 -450298 -48485
19665 2024 -67671 -233809 -78024 -50067 35888 -168716 282055 128532 24093 -324305 85156
19653 -45074 132285 104919 -434852 -54145 255812 -295213 -289722 -52541 -157233 -198585 17270
19641 -158119 -159238 25025 -230796 -134517 -308095 73349 -14756 -342189 247436 -106151 20717
19629 -82058 -125431 148324 -283317 -166449 -20710 363414 337044 -352726 98093 25349 -300756
19617 36456 222861 -194345 -25168 -208231 -218598 -24661 135131 -120200 167750 96814
19607 96814 71344 -110725 -60158 -161385 -270004 81966 -181553 154470 -65507 -124920 209678
19595 10837 -188730 34302 -3909 24433 -123288 128793 20437 -165128 -73537 104163 -191325
19583 117080 141559 -44011 -147074 -413652 305692 90894 -275166 423966 -441912 -65460
19572 98057 -246843 -62190 -145308 -81620 -361077 70252 37774 38144 -97190 -362166 -177236
19560 333693 -227728 133155 125533 -3529 55690 -367050 -37570 21691 -113230 -130721 -199512
19549 -199512 4154 -33731 -242165 61568 -141627 70868 -69213 -128774 -184771 -331940 -30652
19537 -167897 -228572 39430 59502 -159864 -123161 -123475 -327627 -119722 14654 -160979 -264076
19526 -264076 159576 -79531 -170918 -45891 60932 -260782 9791 -210069 -103001 323533 -121085
19514 51068 -47690 -145368 -120057 58353 -120565 -107781 54022 -33377 -180825 147837 -71996
19502 -322395 88817 -73730 -33258 -204713 -276227 152753 -109593 12709 134753 166141 521712
19491 521712 109541 -259108 -375209 -153613 -417434 224431 -332708 -209589 -8281 -216634
19481 -216634 -16914 16632 -86656 -143705 -262992 -230696 -34018 -413654 -112421 280894 -421060
19469 321881 45644 61462 -170284 -164523 153335 71599 -50065 222489 -151508 142019 99716
19458 99716 -201851 -400285 8232 -214150 -62523 -201131 114348 -80127 -324405 -282046 -174937
19447 -174937 -166133 -143131 44198 55121 24890 -349877 -3041 93444 77754 -118199 -383202
19436 -383202 -34505 281285 34688 -159411 -12978 -171029 -179399 230791 -136601 -120451 -413312
19425 -413312 253673 145084 -165399 -217881 -97485 146961 190286 38039 -109502 -201420
19415 -201420 -206472 -42790 66882 184984 204997 -186672 -132422 57964 -428697 -56418 -9601
19403 -283891 -166597 -35112 55087 265013 155651 -98456 -147286 -249912 27654 -396721
19392 92000 -37525 -114123 -27206 188144 60361 47010 -7030 -129090 147829 -46252 50410
19380 11325 96565 478743 -13821 -274689 237701 -343705 -241582 -11295 -193608 -458578
19370 -458578 -221275 154961 -159559 108079 -298398 -68174 -89277 146909 -81543 -211374
19360 -211374 300647 -385188 126850 -150861 16452 -219229 -260273 -31450 70594 -71949
19349 -115018 -160156 192700 17360 -26077 90876 204137 -146963 311863 -221703 -184696
19339 -184696 247094 154546 -86420 34309 -262873 -57618 -53944 -176656 -44092 -100796 85691
19327 -70530 -86968 -138904 -106217 137165 112007 -309708 -125939 10251 -516386 362421 -248209
19315 -349742 314415 -172844 -21675 -167588 -33901 -234789 27475 -122147 145434 -54650
19304 64514 -243918 27588 -32362 -55773 51522 -115385 104664 100274 -366275 11249 -115679
19292 -86969 -113695 -7 -173432 -106952 -294979 72568 78637 -253131 -437989 -31760 -187794 -111176
19280 -111176 -310296 -58970 -88607 63080 229445 -189588 -270181 113155 16376 -110598
19269 73612 -157246 -248550 97458 42068 22082 -222738 75230 53642 -61365 -1791 -382433
19258 -382433 -388715 -207712 43012 -189369 -147051 -124534 -356354 -273842 -333509 -182992 74218
19246 -73965 -295702 -290716 -190849 15542 -176945 -55400 -296611 -153310 422213 -156362 -428473
19235 -428473 -181580 178442 -99900 -103366 -27758 -142242 105706 -227907 158991 -270336
19224 44690 -117018 -150130 40478 -145642 169893 -286876 -156555 -33582 -98364 -525533
19214 -525533 85274 -15195 -51790 -151393 81082 -54011 340104 -184208 -60240 242096 144965
19203 144965 -66676 3106 144485 -343177 -273746 6137 -41569 -273456 -77826 -36617 -259567
19192 -259567 159156 146520 -120639 -412130 -116011 -62388 -54187 173041 133781 -447590
19181 -227429 -236985 -45333 -85210 177053 -110865 -60027 94798 -15386 103977 74633 -172000
19169 145417 -228418 -134820 -343733 -23007 -159187 146792 -185915 19008 -381264 -39014
19158 -93148 -150525 19624 -85742 -215498 -188559 123491 -352031 -184417 -230622 -222804 -239467
19147 -239467 -96098 -210383 957 84978 153080 -73310 -297651 -80453 -209602 183102 183113 250526
19135 250526 -58083 -209903 -35124 17664 175815 -97326 -28108 -86279 -109566 71215 -108620
19123 198172 -33337 15888 -142504 -192692 -278466 95315 30190 -282998 188291 -346019 -175203
19112 -175203 -150759 90476 167976 -352236 120933 107943 -132124 106184 215112 -512073
19101 -78056 42465 -176706 -323098 10607 -240434 -71690 -25982 91295 -70086 -234842 169328
19089 -245703 117720 31975 -305938 -75130 -20174 -173037 -58146 -61504 -261210 117996 -279307
19077 -10002 -87713 -329153 82814 -24482 174763 68408 32049 -1255 -87866 -114314 176851
19065 162111 -419268 -96957 205956 -45207 157368 -69674 -150654 -163459 160161 75686 42032
19054 42032 -142593 -37673 -45956 -240513 302930 185211 -199794 -451779 -3301 296064 134804
19042 21017 -282795 -266140 80314 60702 -103162 104058 127450 -124359 -215423 -16069 -152149
19031 -152149 -197794 178601 -23585 -12753 70391 -224197 220671 277988 324008 252769 281285
19020 281285 -45491 181345 -199510 -47735 -58079 136716 155267 -132631 101580 187747
19010 187747 8399 17647 -124272 2174 -79972 95444 -25011 65622 -126268 112180 156869
18999 156869 -167928 -188695 -132910 -317583 28088 -253370 133549 67292 12892 203757
18989 203757 138582 -250298 -26908 -156020 -135402 114167 -337137 -99325 159759 -224386
18978 -202317 -76409 75312 -169145 -315923 -285936 -211965 352946 -177212 105076 -293514
18967 -11287 -33336 31901 -477918 119911 -160927 69721 -513482 -37441 264940 296583 20398
18955 292490 392899 141345 -237395 -370746 -56022 -110007 -96534 -295973 239706 -89252
18944 6628 98545 -62371 -135349 -15128 -1129 -9224 197123 288267 -140189 -169041 -130517 -54573
18931 -62737 36571 -13679 280660 -179475 85316 75311 -269428 -206804 102946 -183606 -7655
18919 73424 -240945 395144 -328883 -50388 44939 -392058 226864 164450 49847 258278
18909 258278 -150288 -326414 131123 167735 25140 -225572 -60462 154314 -221834 113546
18898 -24127 -496597 -13130 180746 -55245 148034 342953 63411 80560 328631 -152150
18887 -388080 -262694 350304 -158873 116309 48030 123684 53210 -111379 -170659 -98008
18877 -98008 -171058 -244647 -61915 -211144 219552 -54887 86229 113009 -258082 -238295 -128798
18866 -128798 23673 -11030 -79843 -159766 14469 32255 174317 87566 94125 -194113 -218621
18855 -218621 -197708 -308196 -223506 -195529 -276192 -264979 50534 -59162 98083 237021 22556
18843 287163 3781 923 85498 3766 -163885 -126873 286319 -151198 146888 -263487 80361
18831 -149069 -30056 13882 -62795 -359142 -127491 -60663 79713 -529529 122061 103745 44214
18819 -12521 -24795 -160719 -215341 78505 90352 -91460 70284 60934 13255 -151853 247140
18807 69824 -184200 -79187 -415270 211302 -226833 -75590 -103843 155342 -10414 191606
18796 -115760 346810 -118140 259087 282917 -39509 -103143 367611 182194 -261106 25674
18785 5435 47081 64893 -222144 -139122 -12073 222963 -128838 -10445 28595 -177118 41403
18773 -50314 -29435 -219934 249492 -188682 -171920 -517955 -318748 41725 -37427 -66655 221443
18761 132746 -281079 149392 -141181 -236173 92269 158309 -200567 -340332 -308492 -157605
18751 -157605 -135166 -83851 -127849 -180604 -124416 -133329 287759 -61363 30898 86248 -23332
18739 98927 -330987 -202682 -171461 -353232 -130508 -15996 92363 -24984 -7369 -117861 -195222
18728 -195222 82642 -160977 128074 171864 -118183 -136165 -79796 39977 -47315 7732 77007
18717 77007 -149754 -204082 -457396 -364790 312614 -300084 -86969 47296 207779 -80364 -191881
18706 -191881 -42196 -122422 150749 102019 77530 -114440 -56931 -49782 -5184 112959 -375289
18694 -146094 -255795 -523984 -13269 134158 -137502 -81944 -203241 133926 -281121 -29769
18683 113923 -118438 -325372 -32000 -90545 -200074 241346 40846 95814 4678 -45556 -135174
18672 -135174 -71656 -184082 -145654 -191512 201920 54597 -260793 40847 -90029 -10979 70097
18660 -230391 105394 247267 10783 115332 -329231 179531 -188597 -59032 -36193 -230745
18650 -230745 -17947 -23865 -43093 -173583 -77713 -45497 190559 44895 30442 -314110 -95412
18638 -63902 37379 -218467 57096 -268704 -246575 -9054 -151143 238732 -269241 -199852 -27885
18626 22309 -80229 -93829 -192999 49167 -59264 -172850 -264718 71798 -660884 -312110 159177
18614 73894 24834 12541 134904 88883 -515556 -94664 -15811 -123189 -308196 -499441 -62234
18602 -417473 -20394 144147 -82891 -201346 -7653 -82098 171414 142506 -41446 -62220 -284540
18591 -284540 30251 -48258 -90634 117883 226570 -14017 -299125 -310993 -153579 -98233 -136918
18580 -136918 -76397 -208939 103708 -360953 -39544 -29539 38166 147393 111842 -115082
18569 -244698 -262736 52513 149807 -56346 -155462 1014 -138447 -98169 83949 53425 -79431
18557 -255077 -132560 132073 39065 240471 -20928 78006 18503 -38487 -216805 -43528 268870
18545 -214134 -95272 -211101 205172 74041 49270 -360472 10543 -166006 60781 99520 -22434
18533 -373199 100304 62068 -192579 -62801 77364 174405 29654 -74550 -128763 66602 -12540
18521 -358692 89818 -297052 -113976 -94510 -109702 -194251 196019 70706 -250326 108647
18510 118356 21504 -54042 -8937 -97019 -186533 250089 -17233 46441 -36991 -86533 -394880
18499 -394880 20605 45301 -403579 -154782 -120643 201289 349508 -37237 -160192 -156112 -116850
18488 -116850 -261613 -20424 -207180 18931 28202 -35973 133525 -266571 -77607 86559 283086
18477 283086 160070 -249385 239760 177339 74338 -151448 -303842 20742 -138082 143586
18466 134434 -137607 450623 55510 -71795 264839 36439 276604 -36216 -328988 84547
18455 -97638 39254 129582 -168191 -219664 102325 74542 -183270 -144617 152267 -140215 -288522
18444 -288522 -48290 23401 41325 8763 -150392 33003 29163 -128117 -13605 -38511 -110457
18433 -110457 -30354 -46168 103541 -388675 -132935 -31724 -114402 177064 -430515 338317
18422 31914 103329 210984 -190103 -215884 -262470 -354291 -251944 -359879 -237840 -106833
18411 -387778 -254282 58596 -16535 -260379 -122729 -124225 -32296 -95043 -477257 79659 165558
18400 165558 -128648 -325869 293824 115938 -144043 -113759 121443 188162 164835 -252372
18389 -268896 239894 202923 368520 157589 -314418 78839 -136100 -5558 48464 78115 -13801
18377 -305110 105970 -141676 -85628 -163888 67223 -203299 170376 -267576 351652 -247434
18366 -95578 113863 94353 -213286 -23746 -23344 -384214 -167502 345726 -132793 -4491 7571
18354 177899 7445 77804 197068 102514 199624 -109370 99478 -53499 98839 172064 44516
18342 169461 49964 -198075 -87410 232264 155547 -146731 159947 33479 -321260 -92975
18331 -90298 -91354 -14667 49278 -352673 -49691 40196 -123317 43960 -117910 52966 -92647
18319 248504 60135 -5909 -187618 -25795 32117 -201758 -86790 -188672 -119979 66981 16959
18307 -168074 86820 10041 42771 -24891 38419 40838 -36607 8686 205938 -40571 93584 -150035
18294 -316869 -278901 -139457 175068 -110328 -102018 -28652 52819 224395 -320640 -41864 -83651
18283 -83651 100397 -9511 62593 -330128 74016 -149167 21814 -128842 -122978 -53860 -87421
18272 -87421 178319 7622 -92606 -267672 25881 -116926 -102698 -183789 270793 -190040 -134737
18261 -134737 262797 -45006 -51306 26971 143176 -54833 235315 266209 -58166 -122291 230741
18249 -176417 -142796 -8837 -172366 140336 -140839 47907 -102367 -33213 47617 138246 -229192
18237 -26700 -33983 -212282 -73994 169965 245372 -94313 -144618 185235 -84434 333630 -549346
18225 -126428 -197437 -244937 -391822 35300 -281185 -61979 -64683 -42398 15029 -95132 54876
18213 1118 314431 -255656 -123673 -94660 68581 -22031 -24639 -24471 -399151 80857 -22829 -224906
18201 -224906 -186246 197432 259755 47231 -324097 -46623 -40703 135776 -163975 -100410 -86198
18190 -86198 -157007 33647 -78911 -183971 -162340 -5775 150321 36190 -212301 153918 -19791
18178 5993 90585 -53476 -178586 214311 -247781 -191974 -95396 -7819 -80449 -69272 201175
18166 261625 -12157 -18390 136527 829 -272600 124822 102581 -227680 -6195 64906 -309070
18154 -22192 -9904 27580 -178462 -374567 -172198 -32125 94160 140971 -131640 -105433 -21164
18142 297570 -121885 -97762 -221751 -126358 -42885 -175164 -275949 -182117 44922 -165719
18131 -194339 -149415 -371473 -139409 108876 -187989 127255 104075 54414 -403696 31708
18120 139965 10350 31751 27189 29176 15577 -48002 -429388 -46638 -290974 -143400 51869
18108 254155 202085 -17824 -96107 99985 146283 -11189 -250434 231543 -235167 -32781 11527
18096 67427 -107818 22032 250355 -52604 -176335 -224570 45192 -448045 -39062 -185272 -374537
18085 -374537 113759 -67234 -5929 -35618 285409 -6040 -103322 -52573 -28828 -105611 153170
18073 -443676 83501 -301992 -260996 -212150 -116563 -89766 -246760 52007 -169796 -124688 64829
18061 -278449 -245749 -3494 257610 -277070 -279515 -266475 -81932 84247 221061 -85950 76136
18049 -350561 -13450 -214987 37432 -219604 -236245 -134387 56149 199329 -14838 64944 -223893
18037 3111 30029 -246618 132106 -59537 2631 67026 -18429 107155 -23266 -322347 206722
18025 299849 -64214 -235157 -36984 -242069 -57496 41992 -117510 -113952 -153372 -288029 193694
18013 250942 187350 -209584 -359984 402713 52732 -146404 119741 186188 100598 7510 88478
18002 88478 216264 -143687 -98067 -21016 124411 296655 -3651 190499 -90513 408994 1193
17990 -78405 -167203 392276 138563 -23112 -182285 3942 -138838 224341 315296 263696 170575
17979 170575 -21116 -209028 350364 11520 -38746 -164076 -82683 182414 -64439 -298658
17969 -298658 374444 -298252 -255858 -154771 48736 165670 156855 -48167 154118 -87644 -31896
17957 154515 164337 40150 -28414 -27472 -153700 161380 -36921 152382 -33592 -101037 221102
17945 18473 31297 -192491 15955 -186115 140628 170783 32914 200021 116102 90672 -148509
17933 -237893 218431 168709 -76593 125276 -54785 308854 -220076 -91350 -22339 -38784 185049
17921 -29433 -165601 464396 78734 328989 2367 -42184 -90007 -3410 300369 277372 -107970
17909 -144762 297061 -15069 174865 312335 36191 -146710 -22017 -7651 114630 131131 -11497
17897 1962 110067 -107447 198370 189595 203965 60791 109271 -424624 -285098 -40954 -119941
17886 -119941 -56580 -167912 28505 -105512 -155257 166783 126814 83516 184602 -47901 173909
17874 -212672 -12475 70212 105151 -73615 43320 -61099 98370 -11931 10489 72874 12135
17862 -166428 197201 -167105 45545 34941 -68614 3731 -36374 -192467 -194632 -11952 161610
17850 -460227 -376952 -9898 -54603 -30769 -154411 -59658 220258 -138746 292947 -325451 -12094
17838 -198600 137935 88502 -451 -71587 -149011 226089 18763 -216923 -89520 4846 -7352 32394
17825 -27903 295647 -252186 248173 21537 94969 -163374 -276555 -33647 237860 -1657 -460863
17814 -460863 50786 149057 -38156 -271833 14336 -218233 108638 -1201 -265163 74228 92104
17803 92104 -30796 41699 -140946 107403 -396003 -6098 -199182 25103 281016 195060 -99778
17791 -305634 -35332 374062 -353003 281659 109524 301087 -18505 -119104 258034 13521
17780 220444 186347 135934 -194851 76801 592624 -45423 160910 155385 114039 -81416 162768
17768 237962 348194 -158464 -62178 -18501 146802 170017 208750 -145989 -283410 100981
17757 -25844 317435 154553 -22143 464339 57364 32012 13778 -171489 185785 116177 26851
17745 18983 -298256 -84925 -32534 -147505 -27051 -270072 24311 84726 171169 -51613 -105563
17734 -105563 237365 238159 182134 -142798 -13014 65705 57806 323601 159495 222335 -216849
17722 400820 -19931 -40732 7330 66839 -82553 236043 85462 324547 -455 -208206 245769
17710 -65081 98832 -253918 179585 115814 120399 -19455 106676 -146387 21570 75752 65170
17699 65170 540 -2512 28310 19007 115439 208584 95956 -317648 207303 172171 90470 -31773
17686 -142200 -116855 273683 96985 92499 -2881 -224447 -71855 -329453 -32863 38838 32512
17675 32512 72825 -30435 -190665 88533 168799 23724 151752 75780 -123107 -17118 -151124
17664 -151124 179505 -140779 17469 -213648 85272 -167659 69061 328463 351267 273740
17654 273740 214566 146257 104395 102491 28418 236911 12323 200494 56089 50644 -66427
17642 158450 246719 197032 65861 215549 84398 100823 238527 -102763 66034 -78095 69311
17630 202060 -66737 -47506 109855 192136 -124689 -80903 259920 -82571 113672 -72852 -87449
17619 -87449 95664 102266 170786 49749 -109577 -146383 145240 46365 4023 64885 -222004
17607 111828 270172 189231 262993 235038 92439 67881 -341701 65078 80496 45137 108034
17596 108034 245951 -214855 3053 -14295 68820 148628 81007 178444 318711 -55605 372490
17584 140411 -258448 -173774 149574 130311 -43635 467239 427450 163979 36260 13713 -238335
17572 262279 265850 227042 320437 334320 216498 225306 145386 376924 -28584 252852 410069
17561 410069 126893 -287493 -21560 346731 -244787 391056 89177 50168 275719 189878
17551 189878 179993 481095 375635 -76315 -172314 194554 -5690 94425 278711 159165 67770
17539 89911 367456 15596 -87331 215376 -52749 117840 170786 161406 -60033 166587 373957
17528 373957 361882 334462 166331 394141 345854 223555 479761 74238 127781 277111
17518 277111 243056 89001 324318 -11079 516704 182563 52233 252840 436655 664697
17508 664697 993065 922619 806628 634687 910551 371986 383380 383849 458572 211965 516419
17497 516419 693117 512002 569610 684003 617832 1023052 704703 489513 424692 472556
17487 472556 311323 502477 319829 295599 -173378 351891 435324 336015 106316 470413
17477 470413 345060 327299 246877 230938 301273 157016 207326 -360301 313354 18161 421967
17466 421967 133090 156256 499559 252646 -142321 281364 45761 322622 350396 -143922
17455 202049 129027 73872 217992 143376 181244 215385 391336 289223 15064 375327 192037
17444 192037 168533 121659 -98565 433802 313427 130665 166159 181822 241974 513478 172113
17432 48930 4602 390756 356641 357473 205397 212563 141324 239415 154938 597647 436779 310610
17420 310610 336579 141049 141510 -97929 367012 9711 7320 403169 207076 413981 395324
17409 395324 460688 330461 506470 412514 359778 358721 26240 253717 474707 187334 -105578
17397 186600 120164 244268 -50160 457894 359013 6317 428160 287651 -31024 140052 65285
17385 -163772 59755 -11705 116262 478590 150540 209802 461130 694523 -66475 292933
17374 119329 120992 173676 39784 174274 -32956 105575 71834 135951 -64798 66389 66043 178656
17362 178656 118699 618534 466495 265815 247352 63085 44505 85472 -2892 422504 374610
17351 374610 112447 189623 -2222 71892 145715 33253 260920 123376 215102 258828 17888
17339 -185680 -74399 188925 308979 -76878 117792 401272 -52435 70062 275822 141807
17329 141807 226577 221712 259192 93570 -7552 2879 -357277 167953 248899 488194 339777
17318 339777 206606 108809 113024 322702 447279 311889 335115 70000 145636 102888 83920
17307 83920 145149 294325 536609 311001 271878 113796 -42904 143145 176344 236875 158096
17296 158096 290869 75916 334794 198162 295886 216743 284176 16986 171595 289336
17286 289336 22759 36039 -23883 80529 325195 131750 216805 229203 340700 417435 207928
17274 107915 -47650 398046 185553 247774 -14799 230434 83209 66092 115380 252240 19600
17262 447574 150481 422221 342339 162353 493556 123388 365381 134905 262886 363098
17252 363098 395150 235085 294340 219880 122508 231637 133347 241527 84699 140169 -153050
17240 252054 288263 147509 205960 464764 447365 306624 369878 682056 356699 396197
17230 396197 252275 368246 539148 344791 415700 230901 138887 229712 330292 150586
17219 236451 373875 40792 537923 193595 248437 501758 292970 337109 412836 301018
17209 301018 91553 341745 414654 490000 507989 442431 187724 232817 130457 146131 168950
17198 168950 324771 186325 206599 152841 62928 326322 322424 201189 339103 298865 392183
17187 392183 150235 323881 285792 208742 321689 336548 599524 508257 177460 350382
17177 350382 428449 525275 200686 13054 385474 415703 55855 466661 303244 66142 261023
17166 261023 210597 671862 409265 289418 404044 645246 424083 280314 278823 317296
17156 317296 3704 600939 353111 500067 770429 674503 739500 117771 614295 336507
17146 336507 253911 303421 514975 399083 418328 563544 151338 587500 440083 229589
17136 229589 353705 516511 243844 306235 402421 504347 323036 -143080 230898 131176
17126 131176 533882 491717 498281 49155 276564 674775 427229 645769 474278 541507
17116 541507 354900 604120 249951 513964 256503 513788 484593 515691 -14821 358878
17105 496537 401783 397780 542530 637350 564021 238357 207183 696065 334486 402205 253232
17094 253232 711888 549488 760309 166166 161901 524460 310599 246224 654377 523216
17084 523216 354823 328120 648069 663442 751852 662856 502156 630885 748915 525497
17074 525497 858897 659986 842461 488576 728964 420510 697903 723922 417064 714600
17064 714600 732764 226023 445343 1013825 376560 417804 562865 802343 710576 507056
17054 507056 585301 463350 669168 1050885 467767 920566 678903 840364 620490 510898
17044 510898 781069 617048 547787 415558 801956 794048 651444 1019829 432877 605769
17034 605769 568595 578487 785096 876330 875851 850703 947785 591619 750080 788493 744102
17023 744102 773071 957120 737236 752961 657627 649269 624963 1110910 487221 790043 847282
17012 847282 699728 965465 1087863 803898 870352 500572 561864 943041 960808 598011
17002 598011 871308 916511 363284 879159 631049 1000598 958255 1049653 950866 834167
16992 834167 805335 1039336 990009 1063300 839365 1081826 1110747 1057727 1067819 984718 1297262
16981 1297262 1011809 1135141 968513 878394 1143796 1080389 1132915 1255418 1005496 1078278
16971 1078278 1221060 1251323 1350299 940136 967029 1086737 1326494 1169592 854642 1403065
16961 1403065 1029990 1208875 1164123 1138307 1106843 1308185 1123016 1167207 1573291 1224966
16951 1224966 1165551 1123631 1754366 1098464 1313246 1384204 1343334 995655 1289545 1225841
16941 1225841 1414012 1345780 1398708 1391584 1154284 1296070 1288042 1552296 1373025 1353790 1128375
16930 1128375 1521616 1325968 1614675 1493042 1381900 1639435 1302307 1376765 1642606 1868298
16920 1868298 1606703 1739931 1735902 1661048 2070325 1681114 1939067 1994248 1700891 1578521
16910 1578521 1554018 1743217 1992604 1781809 1652154 1519798 1904200 1920708 1974374 2143395
16900 2143395 2003555 2210517 2032818 1920712 2217473 1990553 2015049 1914975 1964605 2205332
16890 2205332 2165384 2028088 2225428 2254692 1748962 2189528 2614017 2289928 2479993 2423904
16880 2423904 2435938 2318125 2443949 2469299 2468165 2308791 3009204 2538782 2797193 2522595
16870 2522595 2769201 2929288 2951576 2774559 3099159 2531763 3056531 3185582 2848757 2836489
16860 2836489 2749747 3348877 2881594 3463536 3348685 3554952 3267951 3726678 3189962 3368656
16850 3368656 3718684 3621074 3534181 3508841 3312059 3970554 3704357 4029933 3806543 3902239
16840 3902239 4115406 3969444 3746389 4252766 4005216 4167546 4628041 4734555 4545257
16831 4545257 4402762 4554560 4794516 4848180 5181316 5040700 5094782 5109063 5332481 5132958
16821 5132958 5436222 5488506 5723528 5679611 5415067 5858629 6133819 6127920 6424312 6176061
16811 6176061 6582115 6332314 6876813 7088817 6855868 7172404 7124630 7205219 7500786 7298881
16801 7298881 7391007 7895723 8044739 8445334 8559980 8453951 8811063 9030687 9299451 9404947
16791 9404947 9486657 10107032 10032114 10000471 10559122 10877887 10934718 11107003 11355254 11568983
16781 11568983 12102558 11881552 12844887 12745694 13012458 13458414 14015261 14408817 14553601
16772 14553601 15242667 15543448 15837634 16623721 17115635 17574448 18003540 18888281 19081210
16763 19081210 19851684 20210004 21009663 21573115 22056456 22671120 23338980 24082401 25373667
16754 25373667 25769573 26981417 27659943 28819718 30108320 30964859 32020405 33092167
16746 33092167 34129119 35700206 36827753 38471381 40000645 41827048 43165408 45199950
16738 45199950 47109227 49104335 51100733 53264117 55750349 58250133 60571992 62859700
16730 62859700 65852989 68515216 71731140 75132760 78178239 81919091 85486068 88946132
16722 88946132 92605767 96168755 100145754 103952433 107923193 111966801 115806255 119314721
16714 119314721 122721570 126339357 129464157 132612810 134839458 136707866 138843651 139916850
16706 139916850 140918680 140889977 140633801 140020220 139006886 137061120 135212472 132253215
16698 132253215 129700127 126517388 123153287 119539435 115807033 111968976 108133048 103968315
16690 103968315 100323893 96372150 92338434 88717245 84995118 81598398 78035068 74610392
16682 74610392 71416586 68055647 65267857 62390862 60131674 57409688 54696408 52357976
16674 52357976 50213142 48320436 46159138 44374940 42463166 40811199 39044769 37522021
16666 37522021 36300279 34635642 33582449 32494204 31226663 29860053 28881351 27667123
16658 27667123 27152134 25847870 25304833 24007205 23233991 22211959 21995070 21531697 20328808
16649 20328808 20119731 19022859 18661992 18200777 17292963 17180322 16555507 16457520 15759616
16640 15759616 14981980 14529247 14317693 14155705 13763300 13457247 12969846 12481072 12258678
16631 12258678 12162817 11706331 11375348 10952107 11094933 10504196 10417292 10058295 10041419 9564289
16621 9564289 9515361 9187221 9110814 8739400 8725564 8327140 8003335 8152973 7733351 7702734
16611 7702734 7505825 7239107 7147607 7386021 7004781 6728632 7054531 6868055 6161115 6425382
16601 6425382 6314963 6419642 6399561 5959430 5713350 6008346 5383603 5357795 5208737 5031903
16591 5031903 5325684 5299824 5018053 4852249 4897214 4756893 4630255 4589142 4803841 4444502
16581 4444502 4498194 3946860 4529539 4293820 4215907 3730956 3916671 3877051 3844579 3792998
16571 3792998 3698651 3948631 3431277 3794057 3638476 3741571 3471653 3573237 3323375 3341142
16561 3341142 3351666 3475123 3143385 2851005 3097643 3212478 2913750 3097282 2742333 2984469
16551 2984469 3134090 2765696 2913191 2772331 2841729 2443777 2835540 2621133 2931524 2437417
16541 2437417 2367506 2786096 2332718 2629888 2448333 2730474 2158540 2347685 2384083 2303400
16531 2303400 2141918 2211069 2287870 1962034 2169501 2346417 1971265 2355637 1873523 1837272
16521 1837272 2219868 1946886 2025546 1805848 2163174 1876137 1940901 1954959 2240218 2009022
16511 2009022 1783179 1765235 1679505 1582714 1839203 1819819 1680850 1452410 1523788 1856291
16501 1856291 1439866 2003819 1542361 1784338 1472738 1753643 1510512 1620040 1703987 1630048
16491 1630048 1477880 1812755 1615867 1483729 1252715 1312813 1491317 1227427 1397547 1457890
16481 1457890 1311084 1447454 1227670 1347130 1774272 1253555 1251727 1458999 1069240 1161394
16471 1161394 1423270 1601471 1461260 1248071 1380812 1176928 1304571 1020866 1393265
16462 1393265 1099267 1437241 993710 1261106 1342877 1405779 1054743 929353 943443 967795
16452 967795 1039853 1152691 841105 1313100 1076631 939426 1007972 1364993 863355 804560
16442 804560 852486 1099494 868593 1066645 897757 890410 985490 947433 1034458 811316 807476
16431 807476 759463 830924 753780 691443 987733 959629 804505 705911 697687 897435 526911
16420 526911 1027247 929269 540894 840896 1299051 982682 1014530 698725 1055901 732406
16410 732406 654202 791098 927481 797254 718005 745754 586832 779286 485829 429583
16400 429583 849246 664727 778292 828058 1033077 887336 710960 589196 704310 980182
16390 980182 488345 876482 626254 804696 953129 878211 743744 684397 844578 915316
16380 915316 742278 495395 816450 829322 782880 558062 815212 1043777 464910 649758
16370 649758 557406 557924 785159 582763 908744 582733 766555 523941 710121 910088
16360 910088 430380 438600 916228 1149848 807475 771918 670360 501177 861898 817248
16350 817248 551219 623675 608616 455644 374684 411928 579751 619126 541142 584983 567027
16339 567027 387252 410239 574506 535549 624033 571620 825822 429239 279949 815425
16329 815425 442933 696684 189339 605611 600861 540690 877939 495324 764250 806295
16319 806295 917664 568788 575695 327086 383567 521488 512469 405635 284238 517538
16309 517538 380971 629365 626944 384673 228264 571654 498563 488654 260326 368211
16299 368211 416216 195978 145319 233921 437884 371292 394984 411478 328812 469287 404020
16288 404020 394755 522581 243918 402539 541663 250761 249130 430515 442306 161636
16277 438403 572812 537640 318241 499975 224721 510243 350800 617824 495994 620084
16267 620084 431593 502337 333149 464574 259148 94634 247466 468389 415060 -120538
16256 665592 464742 338821 580030 306305 584633 283638 297319 550847 -13073 48218
16245 238040 608011 465442 303319 327014 178094 473822 660995 443548 347724 252193
16235 252193 368518 482453 60081 429631 333429 577562 356872 161756 216346 348602
16225 348602 -63403 368547 575803 676457 335845 -20968 458093 333440 202948 211659
16215 211659 426185 375387 220077 190387 277352 284953 404882 160381 294526 228174 461369
16204 461369 -24149 353667 302004 191941 580151 -137867 241694 526885 54975 450219
16194 450219 87432 348669 191635 89607 128734 173399 456579 330645 436781 -12882
16183 249947 248979 131150 372568 282986 299954 -19735 175925 259744 277483 408031 114378
16171 -132237 199747 200317 283520 478889 376177 260684 365912 508413 307580 389515
16161 389515 200998 163085 -6730 265891 252597 102684 140099 229186 397931 96321 -64368
16149 501711 203045 -134609 534737 312162 299981 208054 8296 -11235 116609 -4175 263685
16137 -148771 277723 232869 10246 199394 -35955 217994 -99040 212591 85484 355540
16127 355540 23787 187438 300742 -120318 210241 116993 -156375 83220 305623 154973
16117 154973 -56746 -38289 202386 63157 293776 -76178 77502 56980 -137484 171068 171587
16106 171587 193595 -133981 228365 -44 -226159 300822 32710 698504 262229 130891 122995
16095 122995 -198482 38455 -165890 2579 135665 -120127 63329 94525 53120 122096 -41031
16083 359479 68152 -80233 -174954 486825 194101 -120314 -222050 163400 218253 299875
16073 299875 196980 39978 57265 174015 37009 105470 226832 102577 102849 -192546 79590
16061 301 128096 -79459 277761 251308 208191 -78654 17778 -148792 161223 222468 288842
16050 288842 112260 54689 -102353 180041 61469 -147192 98932 221449 -97323 91603
16039 -4810 -253837 12764 29586 -64669 163680 100475 63344 152543 11179 -60300 -44421
16028 -44421 60696 -48808 107470 274755 -218827 246978 124705 153100 -109503 -165651
16018 -165651 264444 -145411 215736 -126616 237304 -144314 -164736 -43730 34553 -58702
16007 200614 273023 -142131 -16784 38206 -14949 -78366 111018 130130 -205299 -361774 78779
15995 -91423 46510 -241125 -9740 146203 -203289 186116 181370 9159 -276224 -123080 -69415
15984 -69415 -106374 133410 73133 -171414 88372 -14634 -185189 135625 346129 -75960 208850
15972 85450 504306 650145 755087 817870 814827 697746 236398 360047 712392 -45816
15961 9112 460372 17178 295 -356884 -158500 70229 -19761 78392 144673 135748 -293653 137430
15948 91694 -167794 306888 -424394 61354 59204 10760 -64162 103058 -65978 44126 204785
15937 204785 -7922 -107450 10922 119474 230280 387526 -513838 -11681 132322 -106971
15926 -403489 144131 216769 141904 -223864 156333 42824 -27074 -210242 121676 -345659
15915 74199 -224222 253820 57801 220137 38148 -170600 -48086 -110947 -95624 -212097 -111338
15904 -111338 -241216 140688 -12143 -356018 -111702 -338157 155243 -84841 -467342 -43534
15893 -171759 -175734 48201 240636 540 203131 32655 313293 136387 -224312 323138 -19811
15881 119905 -259569 -219268 145366 13636 -37175 -161917 132991 -100730 -261030 -146055
15871 -146055 -331851 333268 -148067 -213730 -152183 2783 -252217 -115745 26152 24507 -30161
15859 81254 -309325 -230746 58084 -494866 31357 -34180 -102309 -156134 -200658 -272054 -129103
15847 -116780 329430 -76109 -212705 208679 -238939 -99519 104880 -357793 -138555 -319092
15837 -319092 -102998 90625 -155691 186704 -309080 -134681 -266604 -19038 -335493 -342792
15827 -342792 -207614 -96158 -91767 -1495 185540 -81438 189157 -235899 -9641 -332061 241126
15815 -8694 -70878 -281321 214006 -247429 -99014 -268242 -258453 -210337 25450 150189 295365
15804 295365 55074 -73209 12218 96520 264688 -28842 216915 25158 -177534 55759 190326
15793 190326 281904 128850 -87604 179182 -308039 96953 -244247 27671 72372 181028
15783 181028 -97491 -90609 -37619 156789 -60783 -65142 -176055 -210314 -262240 191014 -197567
15771 46949 81328 267588 -155317 -61843 -56594 -319953 89710 -167705 172323 -216788 132225
15759 143923 58485 -48740 46720 8441 -230199 -231268 -36333 -163314 -220980 26475 -404822
15747 315864 -1996 -66263 153822 -57909 -231 137338 191564 118837 -105536 41817 -542838
15735 61413 274742 32730 -41841 -145614 -170398 245335 -324525 281649 -59187 121332
15724 141436 -196585 -130181 261933 173700 -98346 77591 -176066 -140488 464621 -175381
15713 -210319 -40422 236510 -54941 20826 -184853 -29032 159582 163534 -536644 -186110 -108586
15702 -108586 -200141 -244252 101323 119573 -77821 -31048 -401481 -67032 -51040 -167059 -45716
15690 -105683 -445189 -474018 -373152 -11930 119989 -52763 45419 -99108 -50194 167974 57884
15678 91031 130815 -199311 -19544 167962 48818 124165 177401 138107 229010 -115090 -334247
15667 -334247 -1730 -71492 161487 190188 199949 -106837 -95660 -223625 21977 -474769 -180924
15655 -140376 49846 171216 425584 198593 -3265 244 -105577 31624 -337566 -35601 -264667
15644 -264667 -181474 -30895 -116225 -236894 51592 11641 -136986 103749 -285693 -76820 61621
15632 -79617 180724 -19397 6459 -142782 92314 45453 132887 -174993 101260 209438 41257
15620 -348261 -153921 192194 -232415 -319848 -119973 218107 -57604 -252797 68309 227508
15610 227508 155136 83920 356638 58518 146081 129238 169202 -125887 58589 103249 -257301
15598 -57944 -1213 120593 -373847 136228 -173269 -8220 203216 -26245 -252199 9176 -61697
15586 -99350 108056 -302449 -314167 -328896 44304 132854 71955 -396688 -191867 -189509 202559
15574 -105090 -71397 -309613 -52437 8158 -187946 149501 117864 -136248 -242287 -92450 41662
15562 -45466 -210400 -51039 -112353 186454 130982 -52370 381259 47625 -252215 37355 -233648
15550 261509 87651 145467 -178071 -44069 19236 18015 -435459 34427 -67451 -18275 -75834
15539 -75834 -12738 24006 -319620 -133746 -269127 -138183 173235 122312 45776 -26223 168265
15527 -198527 -54887 274907 -239326 -91788 84646 -123333 -13309 -159660 -25198 134937
15516 196920 -57920 -70667 -29810 -588632 -27042 93532 54647 206920 -290943 -9362 -58938
15505 -58938 -112242 338910 -36372 277024 86973 195563 330230 332615 568781 -45384 560481
15493 56845 299644 -13917 154077 -159408 -103375 -26039 321843 178722 -120417 523433
15482 98057 -50898 319964 458237 -2053 35467 -145516 -62129 161174 214290 -67176 -69018
15471 -69018 6901 -89145 151746 -312017 218494 43201 -158952 -157221 49590 44962 196973
15460 196973 239324 392574 446687 297258 565440 461353 430970 316802 305612 109551
15449 -72934 -31722 165364 179014 38600 190706 -165057 98351 -207424 -160446 199485 78436
15437 96608 -48626 86454 346469 -190186 121423 -82690 -242679 397708 -48092 194340
15426 415385 282638 1038190 741859 607977 793972 357894 261588 445575 75942 164674
15416 164674 158372 11186 414737 -109302 44208 -135937 -354151 -53299 67880 -32153 -33907
15405 -33907 220592 -140042 45714 17593 -32106 -261313 -78485 -223135 -232961 116801 -215908
15393 795 -203311 137335 222037 -10193 163212 -133737 -125274 -99593 2975 38954 194857
15382 194857 -501483 95740 -379192 -175167 -275426 212117 -138748 -231022 205176 26534
15371 360440 -76224 -113686 -264672 -122012 -42706 94142 -111894 135235 -28837 228140
15360 -93601 336525 -66901 20120 169027 -248719 33597 -2338 360728 -51742 192616 105804
15349 105804 -356278 -22285 234173 175046 250034 224952 60417 125485 72891 179352 124783
15338 124783 -15856 122930 257972 23963 -249008 -62666 -12201 -146298 146853 170938
15328 170938 50841 268902 38036 256131 68350 476868 112341 -218469 72737 -201796
15317 242446 99808 -175197 59312 36714 392293 66949 -113061 321702 346995 -195049
15306 56292 -59315 159307 -92762 65904 25582 328513 33591 162358 105072 211324 73868
15294 78084 -6228 291761 228799 51925 128355 391159 -107563 -122741 229128 99113 60151
15283 60151 102480 354394 -23770 151511 -137577 216149 157457 326251 -147170 181493
15272 -183369 -39020 -17142 131201 226966 90595 -203155 24889 176789 219628 55353 146845
15261 146845 -103165 -131337 -124116 -156240 -134101 16764 -198055 -185144 150435 -10611 -29773
15250 -29773 -208035 150088 128136 108711 224549 118068 65054 28987 -207908 169468
15239 -53549 54535 201932 -116929 224603 446658 151796 57424 114626 101270 720053
15229 720053 839509 1538875 812482 1108029 1001234 563100 142484 166310 175434 5272
15218 120300 122332 28505 201587 277215 210010 -70206 79463 -69758 -236406 185454 -210597
15206 58373 -75514 85755 53788 -298957 220593 7772 -16274 -346313 189244 -30381 -106996
15195 -106996 48355 317397 -249313 170080 309910 79680 77896 -22772 104594 135618 110143
15184 110143 -272663 317248 157570 -17446 199386 -29373 -66966 131487 -162279 268217
15173 -81149 -38689 264649 46893 -344453 118390 486275 129165 491078 -224868 -59972
15162 268358 -463370 170053 42858 -57149 -15907 381572 294107 -286613 -14182 101489
15151 -204344 43869 76901 81198 44277 177438 50088 326280 -49355 76380 -141639 -76427
15140 -76427 -159013 101137 -123064 -21009 -7054 197614 178232 -227710 -33545 -8998 4393
15128 66147 -186031 -136376 -27532 -29623 37179 8914 -126392 -19560 -156052 -67978 -134715
15117 -134715 111352 -37239 209008 150688 88503 166672 41711 70254 101794 69278 190765
15106 190765 334058 66454 217927 367344 217100 -212724 222931 467031 400897 -68376
15095 245097 250352 508593 37350 157802 256162 33487 168912 199211 370682 65470 479537
15084 479537 119113 263666 159966 521078 -159071 376503 334263 99557 87601 232430
15074 232430 -183131 -18932 -26055 466014 -125899 -25008 381290 -9407 113102 -45169 331541
15062 -1664 272517 79652 339441 118657 35962 152083 -255680 -69425 -123250 136240 256364
15051 256364 267265 -21532 188745 338190 -161945 287180 45680 348884 255287 591289
15041 591289 320911 213789 303833 179768 118552 120462 28107 325518 157177 143733 314589
15030 314589 510229 215511 465141 81225 116207 309407 306730 403657 328802 217050 261215
15019 261215 418531 365093 356544 254520 573983 831261 450107 764805 571616 232659
15008 734732 535939 337031 541801 469202 193110 602623 312485 395503 426672 534702
14998 534702 58646 325344 109263 201470 179886 263531 577467 434626 207206 430755
14988 430755 601605 367032 212033 392119 353774 356750 600123 702821 268351 467170
14978 467170 257072 216649 412491 296771 345980 171018 379665 704817 50675 378607
14968 378607 435966 126319 611381 768229 935014 496942 515938 460216 408543 326924
14958 326924 621062 346657 386527 781013 235117 680331 485345 445263 147076 275227
14948 275227 444143 549214 460760 354727 13492 293912 170987 53021 29435 375202
14938 375202 346209 827483 353400 789617 341109 214235 398110 359205 188773 233043
14928 233043 143537 291929 575318 636975 593350 558522 466047 332272 345853 419149 300226
14917 300226 431655 609393 659189 872953 1046501 1255868 1048467 1067188 1345829 1387226
14907 1387226 1131941 1474825 1349832 1138057 1485761 1515510 1522765 1704756 1647905 1715620
14897 1715620 1387287 1201201 737623 555838 890695 655847 808785 452034 665971
14888 665971 607122 293335 311862 366157 377980 192292 422893 594358 88572 512304
14878 512304 393836 487062 409170 228949 685990 531346 427984 254081 558067 619725
14868 619725 614040 1123148 781552 859965 586000 461915 701955 747130 609691 698057
14858 698057 732965 210028 317411 368662 375196 556053 481912 341086 764075 462849
14848 462849 481672 359265 553154 513791 251045 141806 379999 355225 314013 549688
14838 549688 460550 160476 811079 161326 300324 535330 232187 282888 411767 510193
14828 510193 658975 828049 554901 834603 909969 1076711 1055639 1148084 1056790 792743
14818 792743 608730 998396 661617 560405 780186 371459 435307 282144 408630 276363
14808 276363 565337 475043 647168 520591 573521 364722 678113 620025 810183 785295
14798 785295 720558 872108 799862 752001 700408 639777 576686 577737 773496 385427 648959
14787 648959 939431 882288 837298 726610 774184 722940 604289 731623 791867 426822
14777 426822 511248 633854 646631 818380 576409 829549 563474 705334 369929 163533
14766 519107 706255 478400 620613 676712 494219 693006 583035 457379 662645 542007
14756 542007 990770 531883 807406 520895 716692 618039 495843 736196 571469 634065
14746 634065 590661 465377 696160 563366 583562 557993 572355 716606 833255 775106
14736 775106 822064 375398 511456 505779 685706 642116 766631 719293 561034 637499 486454
14725 486454 924853 824449 656922 647193 636675 742476 761952 753359 614677 650850 1099910
14714 1099910 965822 993107 1182381 1137348 1302490 1415461 1676544 1399457 1182736 1273558
14704 1273558 1008396 941753 1326823 735823 837383 1006219 939729 561108 1195300 762670
14694 762670 910232 1298683 710919 782543 680430 1239950 1209213 1070942 1218031 1570546
14684 1570546 1246256 1691062 1608035 1346741 1480378 1295706 1060161 1087672 713697 1025421
14674 1025421 713938 732384 929418 805856 592437 914632 880800 1051892 912045 690073
14664 690073 844523 783230 772135 598509 779264 1081527 767061 1081403 994430 996368
14654 996368 924532 851464 1210625 734447 1006850 835208 1158780 900090 981716 1098407
14644 1098407 882542 1192163 998716 1352242 1191370 1095679 1234317 1141712 949523 1007371
14634 1007371 1495186 1123071 1233380 1118832 1168424 1039285 1070033 1164825 1234424 1080681
14624 1080681 1191761 1355435 1300029 1053592 1243727 963163 1245798 1358546 1214595 1208799
14614 1208799 1051062 1191840 1212756 1094042 1252921 1519736 1436170 1501885 1090988 1410781
14604 1410781 1441983 1359749 1462577 1415389 1340486 1332643 1130976 1352411 1600468 1653141 1205015
14593 1205015 1188118 1796970 1356869 1523053 1675274 1316075 1243131 1671913 1508000 1725052
14583 1725052 1611860 1492209 1756539 1333330 1822945 1583767 1365309 1644167 1603138 1589270
14573 1589270 1527419 1747375 1950503 1695705 1407749 1975786 1678141 2152094 1914475 1635479
14563 1635479 1991723 2007347 1806154 2058620 2107726 1956406 1827247 1903833 2297535 2258545
14553 2258545 2402396 2398549 2534496 2254279 2394939 2388522 2714736 2620228 2599989 2726492
14543 2726492 2785149 3147709 3373089 3651703 3691474 4187493 5016890 5911424 7264839 8962724
14533 8962724 13137493 18823369 27396175 32313192 19236006 11057142 6653297 5288655
14525 5288655 4528430 4972786 4348142 3494739 2886245 2895106 2510664 2164107 2241717 2457370
14515 2457370 2325011 2214258 2353322 2129260 2262602 2214757 2524314 2356850 2362351 2501169
14505 2501169 2289514 2479337 2618404 2296733 2522327 2272862 2204067 2164471 2599425 2722144
14495 2722144 2607881 2337838 2913488 2510976 2958903 2910275 2886047 2724030 2993855 3202376
14485 3202376 3141955 3315913 2954593 3092664 3166776 2992074 3382544 3380035 3433214 3451189
14475 3451189 3275835 3359729 3356330 3791183 3514782 3609503 3801143 3781492 3566732 3788310
14465 3788310 3606310 3745423 3843058 3727849 4130455 3864103 3891942 4160576 4246343 4130437
14455 4130437 4162946 4293398 4112898 4264871 4643685 4332744 4395187 4527665 4636293 4396463
14445 4396463 4472140 4768314 4866760 4916905 4974836 5094405 4774359 5007579 5152108 5184419
14435 5184419 5405066 5321179 5172642 5241120 5422424 5709398 5476074 5812530 5904649 6064145
14425 6064145 5993043 5650719 6240933 6370997 6379820 6784685 6230482 6497109 6310311 6792686
14415 6792686 7002844 6765672 6941384 7032537 7063965 6901102 7021665 7382506 7659663 7560724
14405 7560724 7599514 8468392 8220319 8582569 8653768 8794329 8683249 8662324 8713658 8651439
14395 8651439 8926259 9226286 9117374 9326807 9459201 9651596 10175690 10053555 9836140
14386 9836140 10315910 10929818 10876963 11102355 11240475 10960159 11283809 11492404 11571398 12008832
14376 12008832 12088719 12053266 12624474 12628050 12979828 13186602 13572489 13442037 14155239 14410275
14366 14410275 14662799 15006167 15229864 15467141 15683650 16409103 16059863 16692028 16486443
14357 16486443 17319535 17455238 17917640 18258154 18310679 19167111 19273669 19648542 20787328
14348 20787328 20708789 21463267 21741811 21879345 22631668 22948213 23914094 23905812 24638009 25323570
14338 25323570 25911955 26856316 27131383 27569903 28667985 29172468 29929921 30836617 31727604
14329 31727604 32836236 32953297 34374028 35136306 35926140 37233632 38308257 39324175
14321 39324175 40605642 41684298 43095091 44297372 45655676 47380049 48927314 49930647
14313 49930647 51511237 53692514 55355700 57276244 59200664 61556149 63266975 65855204
14305 65855204 68200203 70783547 73174322 76013829 78979034 81855737 84850497 88267144
14297 88267144 92111331 95361906 99730906 103867849 108685382 113385232 117946895 123733801
14289 123733801 129365850 135189720 141553835 148293488 155224309 162697615 170640882 179268224
14281 179268224 187868711 197583470 207302727 217498175 228719228 240275093 252362878
14274 252362878 265075468 278294660 291975706 305912765 319802199 333493789 347323284
14267 347323284 360715408 373369880 385034930 396509495 406936216 416480778 424733032
14260 424733032 431650550 437672330 441644321 443183454 443573396 444464375 444116167 438548152
14252 438548152 431571917 424145510 413826523 401687455 389068615 376677412 364069985
14245 364069985 351347520 338179970 324844619 311337128 298030343 284906856 272459445
14238 272459445 260447240 248717887 237070066 225718082 215631484 205285633 194658432
14231 194658432 184532590 175144994 166749180 158535287 150951751 143860322 136961743 130899708
14223 130899708 124981806 119562589 114533820 109440159 104898143 100144765 96097383 92647100
14215 92647100 88946992 85351978 81822177 78823355 75685177 72992371 70181452 67805739
14207 67805739 65442981 63018085 60923295 58938848 57554475 55277034 53392646 51801174
14199 51801174 50092541 48863984 47164708 45890886 44623868 42977468 42046652 41210636
14191 41210636 39825695 38959034 37440948 36595074 35570516 34291182 33749527 32940358 32234947
14182 32234947 31216924 30353524 29334158 29110970 28443982 27746328 27145309 26163736 26012902
14173 26012902 24895926 24366109 24057713 23384056 22893571 22851940 21932913 21450654 20989408
14164 20989408 20767470 20475772 20143243 19300101 19076104 18365775 18327579 18080973 17854085
14155 17854085 17456358 17014545 16863997 16319705 15974494 16078684 15265640 15175784 14859474
14146 14859474 14756142 14799465 14203675 13487880 13863421 13320059 13029341 12791497 12676212
14137 12676212 12519295 12553005 12002812 12129450 11706890 11852665 11374001 11366409 11091690 11091366
14127 11091366 10619739 10131545 10507111 10443479 9861119 9911541 9712480 9558885 9561738 9592518
14117 9592518 9168389 9106850 9132328 8855329 8903179 8743271 8473765 8291598 8260258 8438685
14107 8438685 8077811 7876412 7965988 7989876 7646168 7599648 7519625 7269888 7428795 7453613
14097 7453613 7041157 7154790 6748772 7140974 6929132 6368151 6608160 6316746 6235631 6082944
14087 6082944 6235951 6012641 6045427 5988089 5714786 5938916 6007486 6131409 5707445 5694449
14077 5694449 5324500 5503531 5375933 5733284 5118655 5483204 5239174 5241147 5023448 5268645
14067 5268645 4966076 5134404 4944806 4966733 4756973 4897692 4738520 4996546 4706714 4536559
14057 4536559 4331594 4533007 4183028 4268971 4190384 4485398 4280963 4227421 4305043 4117960
14047 4117960 4022730 4243074 4331755 3975448 4241877 4102075 3802893 4121963 3815782 3951516
14037 3951516 3640595 3850065 3564481 3756149 3224359 3711248 3644920 3740834 3247152 3624227
14027 3624227 3151245 3282488 3133943 3349217 3049454 3150651 2992374 3376552 3390101 3405026
14017 3405026 3269227 3220969 3359973 2928948 2862674 3035509 3040170 2810293 3190826 2586355
14007 2586355 3103362 3107946 2554506 2740211 2685523 2633638 2703542 2463130 2745765 2461974
13997 2461974 2429623 2440514 2193276 2687531 2304594 2774197 2719382 2490862 2295278 2400631
13987 2400631 2284657 2244097 2207598 2270548 2417327 2528048 2389318 2609921 2614567 3040498
13977 3040498 3212284 3687141 4551348 5967562 9102664 13914664 23124816 32809060 23623841
13968 23623841 15097822 10338510 7587459 5986516 4952000 4321090 4236536 3569575 3827909
13959 3827909 3057331 3202756 3070749 3110929 2689820 2590944 2590878 2201096 2259946 2402897 2069355
13948 2069355 2204671 1982276 2452873 2329413 2307228 1829528 2167691 2189134 2451413 2031006
13938 2031006 1976995 1995320 1923861 1990051 1832781 1934757 1655155 1782828 1531994 1876245
13928 1876245 1889265 1562196 1750690 1568490 1918024 1771077 1684378 1892472 1840707 1893515
13918 1893515 1610098 1461969 1528159 1748897 1498153 1787443 1906737 1591330 1715118 1733332
13908 1733332 1704274 1615521 1631256 1677754 1565779 1633726 1434374 1436994 1797695 1234293 1673516
13897 1673516 1617011 1516159 1513201 1315778 1525505 1674097 1105539 1477579 1329451 1722211
13887 1722211 1415189 1151093 1313043 1475372 1250501 1549027 1223880 1529107 955613
13878 955613 1429164 1357387 1440051 1353010 972803 1348341 1268963 1341463 1525951 1165761
13868 1165761 1193056 1162829 956188 1189484 1101626 1355483 1446936 1064613 1470556 1050411
13858 1050411 1450921 1086713 1140164 1351756 1283126 1072976 1109102 1522604 1147482 1106817
13848 1106817 998441 1080412 738690 1244826 1299996 1022066 980675 1338727 1039241 1248011
13838 1248011 842001 1287889 1022522 1008839 974608 1012602 1135610 1106108 1220063 952684
13828 952684 767541 1315000 1037153 1065251 908741 962385 899601 782447 1033970 884470
13818 884470 779028 953250 1071710 933918 1374557 1258025 794019 883822 953702 1118874
13808 1118874 790725 741270 797993 722509 922391 1027724 534258 988924 828203 799229
13798 799229 1021824 1091344 807177 817718 942562 656721 787045 950196 1195735 969463
13788 969463 966175 778826 516537 816754 934185 866839 1062548 713002 857124 414733
13777 585761 1077228 687066 728042 548720 814752 726732 886679 813007 851760 497434
13767 497434 647796 569620 802595 1040352 646238 847191 653548 842793 629631 550760
13757 550760 845091 876987 955268 967080 856821 890660 1265898 719932 841895 463278
13747 463278 1133391 689198 883669 530071 828792 729824 316211 53907 710465 607523
13737 607523 738045 775193 828236 606899 817499 731366 576599 838377 538581 874063
13727 874063 882950 722753 521529 599040 859212 758522 545124 378162 839458 588462
13717 588462 696998 718881 393622 880174 828454 503612 416118 269720 93469 426909
13707 426909 644498 233803 366630 1013174 473568 448170 731478 758765 628481 908545
13697 908545 474543 728399 552755 433213 555204 537152 836186 585553 403433 692763
13687 692763 521643 652943 717289 370379 717919 402861 374532 533413 687597 691674
13677 691674 479952 535255 751083 628162 599087 679675 275688 586811 266683 158523
13667 158523 634635 408767 750608 672868 430043 484845 350814 329141 606992 565564
13657 565564 784871 540595 636632 473948 501353 556902 924067 400047 471029 394877
13647 394877 480576 363132 333135 771688 676884 447958 763776 410937 306612 459993
13637 459993 757920 732051 268871 436362 455948 415285 364872 96281 376342 123685
13626 371898 270300 353734 563757 692297 360837 646870 87224 237323 561057 365276
13616 365276 544556 728489 758010 167035 270187 463818 282866 388722 572197 570473
13606 570473 496061 385136 411501 279399 219711 394102 354858 156420 371961 286056
13596 286056 334361 257292 400514 417656 281303 383157 260636 175365 161346 500965
13586 500965 165685 351269 449326 475160 504926 509070 567066 327117 28692 163091 208501
13575 208501 207525 132521 633275 256536 769503 612442 331257 477619 446100 238445
13565 238445 322198 200068 176874 386794 203907 344638 250279 324409 314224 370574 458123
13554 458123 821298 609679 173784 349500 251865 468661 432764 337118 297936 270940
13544 270940 348778 534831 150834 468920 211786 683267 405397 371034 524496 240218
13533 459592 340669 132364 570744 173633 25017 433605 78335 282651 -34149 249979
13522 222824 343411 363916 228177 307682 98236 490123 50537 211688 424330 340814
13512 340814 162368 147626 184970 112678 285082 194335 265319 264454 397093 200519 245415
13501 245415 295960 15962 93035 10621 297735 427337 122530 210397 427404 598654
13491 598654 374808 87284 412936 238017 240923 186865 453787 580988 15078 663482
13481 663482 146343 281481 186622 149464 243521 504104 238173 437500 400090 387269
13471 387269 117850 338009 256769 229077 234129 203947 274744 436440 265663 173192 113083
13460 113083 -47276 515321 18888 245738 100862 573456 131110 450425 288014 430416
13450 430416 394235 41945 478530 165939 161889 426284 211692 241856 -2212 285834 205043
13439 205043 166771 464217 396804 568673 120256 114639 384750 -12196 166789 359619
13429 359619 -190707 1543 36862 237635 265656 259507 165623 188118 -3912 136247 379805
13418 379805 413236 229477 -50844 344884 435477 165489 194884 230501 242380 304098 253948
13407 253948 346304 190631 115313 323133 286140 98730 321736 111820 103651 236258 465476
13396 465476 297719 -370590 5806 -87129 378446 370303 302864 305135 177497 287313 43156
13384 109433 -82909 268412 62306 444517 447462 265230 275947 340950 264522 391011 103837
13372 269991 267934 295972 -2813 271000 157234 284289 -16344 -262786 85582 -177875 113274
13360 84855 -44652 307480 117133 -106593 563812 337611 -119179 315619 262635 570247
13350 570247 456702 148283 122237 -18332 593349 173027 358489 318883 47772 -77880
13339 36485 264176 -29400 -164593 134986 276900 173038 673632 149433 90287 356457
13329 356457 -74721 194784 458618 394435 362563 121994 134049 495160 246003 515905
13319 515905 184586 168340 347676 169791 412813 246186 224936 183078 215804 428111
13309 428111 329521 -1993 18500 243553 -121257 -60678 28344 248210 87268 298999 147094
13297 34016 88839 300719 20884 345291 -45194 211631 80562 335409 548464 176036
13286 17321 231496 251678 269967 338046 257328 183215 -26016 116057 383644 -120311 178604
13274 258851 94690 -147404 89625 -70847 323552 258075 203510 -221235 33527 9321 536442
13263 536442 -48585 44443 321322 217524 284573 319117 244982 143032 232217 48570 297624
13252 297624 -115571 211318 315030 237556 302746 115117 157069 32856 171774 404082
13242 404082 404904 330749 -36630 440301 -113399 193873 203497 384205 -42300 158167 -31915
13230 108794 -87286 130978 143253 43669 261056 90296 -74673 181152 46516 336992 296348
13219 296348 65419 74186 104058 71108 -261396 222566 341116 248379 442928 152338 64379
13207 252148 248142 404250 99347 -113875 52913 49558 257443 -28447 205225 -53238 318577
13195 110608 -140184 -65080 -152596 -89227 142148 448396 -24973 20043 19303 13042 9004 -95702
13182 137720 -28373 -52820 480687 68757 340797 270516 21511 -141395 211993 10778 99266
13171 99266 274297 304686 75166 270222 61511 -91101 68568 60959 140955 205344 353035
13160 353035 62578 -150017 -170007 -20680 279366 42934 298536 304236 -308478 292183 142525
13148 -27779 -257738 260606 153313 158036 -67407 287861 -188601 250782 58777 341299
13138 341299 150558 167699 -132260 -20896 472871 -133089 355160 215555 151452 203696
13128 203696 382006 166235 69470 344231 212280 269894 -64780 -95639 87098 114115 -55615
13116 -101501 334429 100492 19462 -133646 16589 113633 244077 167986 189579 5611 256565
13105 256565 -148958 -116376 208355 394599 -93897 305786 -271441 308668 167698 388884
13095 388884 108292 80113 -131539 41223 -169735 271352 -26854 185974 -214602 194679
13084 -138903 121926 57699 -43191 384413 -17594 -221021 75609 -35574 -21537 116299 -25817
13072 488256 304585 19728 -75434 214366 -9363 34263 -38870 239228 250258 113801 264680
13061 264680 211839 -130474 441148 101662 28790 -141748 56657 -220430 165462 303618
13051 303618 238209 193103 275584 143611 50286 -163829 -19103 160338 -51380 126104 62198
13039 -88596 589289 -117764 -65114 -233901 163735 -319560 230001 20451 21638 -75707 183224
13027 336188 207516 -46092 287289 234510 -43235 -271977 227482 92410 -166184 -122088
13017 -122088 201203 -34415 509090 -185187 -16873 -49166 176881 -350308 -14842 -4576 -31394
13006 -31394 468818 -266606 232149 33048 99940 -89270 -281437 356543 -114726 15047
12995 119955 122082 -297878 247251 284526 79836 -73169 286796 -35847 209102 52273 270546
12984 270546 446549 228690 189824 231656 149733 108055 226179 34643 -234769 118292
12973 -13719 175668 -92651 290418 -47164 -71010 41337 -151677 346205 100717 131557 -130383
12961 75883 18879 -257968 -58786 452427 -96649 -29105 -392763 275623 151128 -304276
12950 -211376 -205014 -54057 380147 193989 213410 -257657 59080 128221 143121 22875 202650
12939 202650 98029 207557 374860 -99699 -51368 -55658 185698 -97519 -98713 -60286 -12825
12927 -124252 139510 -43275 -20435 -113442 -144891 105152 168499 -147690 -22654 102396 261440
12916 261440 -88371 196879 71199 -26411 -1931 210958 -64578 -103150 -23645 209544 223474
12905 223474 72353 106769 -180229 212463 430035 369041 -86829 89173 -37958 62185 -275842
12893 343653 -215412 81134 -54204 148836 -55282 -209764 134966 154960 -88323 151844
12882 -57742 -68465 129134 80454 -41764 36618 96326 -103605 194552 -47561 99451 18490
12870 -184935 292321 5073 95913 -273650 161357 -58807 -118513 157099 307238 -94987 138833
12858 281583 271015 -28308 -265427 134980 79601 89459 80851 -120655 91104 82811 130689
12847 130689 -19972 279881 57873 45617 -14903 -240419 -263189 -238685 176270 251262 82876
12835 49943 32964 195001 277973 -2826 204979 38475 -54628 9674 25240 -76646 162103
12823 24000 -90195 90769 -16906 -262718 -203592 -82322 45995 187751 -174851 72815 265138
12812 265138 33406 117650 107668 131358 -31873 -43119 85471 -248695 -94443 298717 204459
12801 204459 -124812 -220046 -120467 -218401 127429 212412 67525 -215701 140017 77685 20885
12789 190237 -67938 -14986 4710 142182 185280 -22016 157431 40594 144720 -132394 -78843
12778 -78843 -56663 -129128 -30506 147610 -155805 97991 87484 91796 121555 79976 -250555
12766 74001 -176960 109703 -246350 324630 205214 225936 170565 231186 -113255 -126452
12756 -126452 202896 4744 283219 -16540 269665 115030 266320 -218203 -42412 66005
12745 274434 92129 5428 -18702 -141333 -465473 -159184 165017 159136 254557 9012 72965
12734 72965 -167884 581972 94517 -223715 -8089 129455 46763 425266 -196997 115926
12723 20480 117481 -74969 -71172 380259 90200 76773 149522 257481 -123928 -32526 -182042
12712 -182042 -125467 -54935 386358 16474 -237207 -73861 95757 181825 40108 417735 -90990
12700 10117 7097 108701 116602 -208086 180115 144356 119826 358396 45086 333717 132538
12688 93678 -21365 136244 198412 -108321 43016 -106166 261714 -15108 -150258 37442 -43228
12676 -123067 -43864 209844 -379116 153339 -68729 -152610 -31869 -189559 -123785 70035 -76858
12664 228862 -233414 369859 181038 196029 -109712 148152 106199 -94853 -87167 -54905 -162872
12653 -162872 199920 -149762 -339336 104026 -13493 74587 -20630 -15679 -62489 144867 336451
12642 336451 58854 37418 -108055 -56081 47837 72353 244487 -174215 245458 -133532
12631 -57509 239594 174812 109822 134054 3740 274032 -13521 168556 -19800 -156439 -30731
12619 18154 212138 -18274 25847 261413 102266 203503 124225 283517 93507 125280 458451
12608 458451 106193 -161609 42686 394172 168832 -77459 90112 -9966 -29661 253841 -145920
12596 -94534 -137144 -104718 84984 23166 -56254 141098 -166349 -186996 137450 115781 165996
12585 165996 165936 328029 50708 249294 119302 116995 -100497 -4661 46459 210650 -148303
12573 -142517 -115014 -130405 -55286 -48582 -298012 161846 418715 -110757 -156142 318836 -290929
12561 55722 341929 -155361 -344673 -177457 14937 127126 -110901 -38751 120487 -102057
12550 95106 -67328 -179186 40922 -283945 -89729 -189497 -90813 67708 -55461 -112224 295431
12538 -101050 -52315 -164278 91645 67448 307086 -171422 -5179 225558 -1505 54995 115288
12527 115288 71964 223086 103542 -47182 -86469 -77694 -126201 131206 122607 -30971 -7095
12515 -150631 -175701 -76210 16493 -27976 -98836 -56944 -24064 -451394 38104 178569 -118418
12503 -120949 66950 292959 -68305 188421 9771 10278 96190 -74188 -217997 -185231 -106424
12492 -106424 -459987 -249736 -100552 415058 134311 52816 149107 -275920 87143 216650
12482 216650 -360360 105886 4976 262751 70438 197512 115445 -46683 117573 -346576
12471 125425 -136709 179046 -2501 303425 -98869 -138419 103522 -243796 -150148 -318954
12461 -318954 137274 142204 213903 -13417 72345 284034 -26805 -27859 -24254 122131 140300
12450 140300 -104583 290704 117115 152003 -159337 -5892 -203116 -198156 -53306 57553 93516
12439 93516 71281 54648 34349 -146908 64263 50200 58784 -121104 -280877 -16802 35695
12427 -58650 156974 -46333 -14369 13610 -51669 -97568 -435053 19455 -110433 126584 -18807
12415 -55903 -198316 -190044 79658 219534 -8819 -218689 258463 -276113 -110757 6978 -30471
12403 -197628 -17707 69284 -128898 98287 -231588 122454 -87194 -13926 144018 30787 92880
12392 92880 160527 191312 41836 -12076 -71416 79719 306619 -92625 -25848 254306 212908
12381 212908 -14224 -28308 95843 -143355 138846 -38339 -29684 -243365 191141 67641 78034
12370 78034 -110090 -30603 387616 -95310 -233378 178693 246257 -76027 141431 -103931
12359 258596 411381 34099 -28506 129280 -49796 -113075 140002 251981 7982 265805 -110108
12347 49646 98920 -41839 507831 -274467 -216479 -170593 91947 -124300 116504 -290216 338642
12335 47857 23217 -21344 109723 -45182 99258 112889 -215148 97741 14182 -76413 330205
12323 40288 317403 243079 143535 316063 35239 -78801 -79210 362933 -67114 413775 232485
12312 232485 208839 263248 279988 188238 -171437 352839 -35666 114841 -107604 141221
12301 181277 -50517 69851 189633 134042 27218 150270 244023 -393133 -184764 20985 125610
12290 125610 215979 -195315 143089 -210365 -225608 44576 161165 78533 178944 82359
12279 -200834 -4373 202480 203770 -123211 249769 258375 -5784 480673 -57923 -36464 -130041
12268 -130041 140365 24504 125144 -140480 168050 90220 200778 337826 187718 -11812
12257 62570 426860 323899 99210 162466 40207 98186 340397 271638 396424 246923 110251
12245 -68245 -143730 -232588 243832 96798 -8211 293476 153907 301766 198687 178599 42786
12233 278484 219484 -50926 106486 93749 -279237 24147 108931 -102983 -218107 175200
12222 107409 -24166 163487 322720 376574 15809 115877 90380 66012 13932 159835 6305
12210 -313 76668 354027 203856 116325 -33476 -85205 300026 323332 -53023 184995 -120727
12198 399712 -108708 502553 92447 -159742 142000 48071 -8875 167508 287212 -193195
12187 83510 52023 225323 146650 -335081 -16194 172011 236603 306421 36146 154428 172727
12176 172727 372564 -166947 139734 45459 209855 -23058 89466 266199 43869 85999
12166 85999 161376 -14991 94481 -22019 -22753 464568 -72485 99171 -82916 73295 179950 -29946
12153 140943 311360 229164 342827 172253 557169 152279 578004 37186 109796 142827
12143 142827 179521 230530 71657 -27629 326647 366886 200442 347466 67464 23692 -873
12131 270959 -399345 -248003 7791 229305 -227350 -81373 116162 317720 -53991 -87076
12121 -87076 2089 -106516 107983 104899 -82422 164787 108246 -125921 -29940 265309 -21137
12109 58291 182623 59404 341963 394638 304896 -39903 133747 356073 108368 -86767 748807
12097 -96693 106554 186825 114123 -112755 225523 48763 163765 105326 265320 40584 -86556
12085 -73911 -117595 -59144 -123821 83815 41124 603940 203905 125400 343915 18551 -96823
12073 141909 55069 -65035 258580 -80025 65685 372820 78532 8610 -29088 245139 -55408
12061 107905 141433 124086 146498 215478 462276 520136 -57869 411946 350947 276530 179626
12050 179626 38415 266917 118525 344322 172237 58856 223308 193536 122126 -152314
12039 10596 14150 -201539 29932 95167 168407 -415154 -70783 -43593 -63856 -268441 298323
12027 -141718 121902 137361 -307118 278927 257697 83381 -173468 140689 181964 -162171
12016 39007 104985 43284 -296166 130565 275761 -103159 -156303 -36107 174477 -282390
12005 -270 209909 471262 131724 31948 116840 -198790 34646 73109 152162 110916 159259
11994 159259 -144202 -134485 161884 -38121 80196 302247 -155437 267201 302780 85909 60928
11983 60928 34693 -233927 114846 288091 84840 26750 160422 8185 137243 -264569 26992
11971 -81019 155671 64682 -111610 280129 -259715 157954 -199244 63693 -102384 197286
11960 48845 73919 77018 -106111 -146627 38610 -66955 242340 16510 52139 -182729 -14751
11948 105169 42506 389751 -28004 -10511 -480601 152874 90853 166733 -303376 -11705 47213
11936 -26381 218415 21941 -140449 146042 -48738 -177455 -72068 79015 -236872 263438
11925 152046 -69726 102700 99740 -18321 167117 -8179 55126 -116325 158189 -293618 31742
11913 -5560 -106036 -355651 28977 -267240 -213918 17008 -86667 36245 -152164 -75365 76576
11901 161805 341490 -74565 11034 -205250 105293 94065 -252900 288386 95786 -113726
11890 -233740 -249841 -240131 -98921 -191111 -96781 -247053 96309 19885 -39667 -226659 -184676
11879 -184676 -225006 146676 83661 28137 -338133 -11732 -50673 352776 -205400 122181
11868 -267156 58362 -249437 69732 257593 158916 -244786 -336936 -85864 86835 -80652 156680
11856 -376 -75058 -184402 142768 -353233 -87495 -89546 53155 -124440 64656 13003 -27814
11844 176060 349118 -89933 -229818 43062 4612 166575 -129904 18378 -90616 -352304 136870
11832 -187585 39775 -28981 137244 -16733 164121 223930 42438 6862 132213 85047 -46492
11820 -371057 -81164 -153426 21445 14847 -107839 96359 -80605 -29116 -324989 -82711 -90868
11809 -90868 -101709 -417790 -245049 -253976 -273614 98205 -31028 -143975 -207170 -200958 -176559
11798 -176559 221323 -18150 -84002 -257064 -382800 -39058 7780 188768 -108481 73770 -148034
11786 53770 349175 50897 177277 345816 36156 -176224 -208945 -258553 48124 -98232 76677
11774 68119 172027 -221287 -202261 232559 299736 -17805 -249961 -19547 -339897 -61263 -142231
11763 -142231 -372888 426551 -222363 -116997 -103871 -71555 96952 -307707 -189098 71291
11752 -206952 -125766 145135 75577 -148587 -463019 203821 128362 -187378 167259 -84319
11741 -100053 -123139 -13726 293247 155473 -48873 115476 223084 181139 -37644 73702 -152281
11729 -95479 159747 -84533 110868 216361 229249 44548 -40806 123377 303349 -155093
11718 -28109 -241910 -209616 -207352 82120 81661 -134528 269232 -331165 369754 276596 -137179
11706 -97193 -312007 -94872 152302 4463 122991 368027 50684 -121483 -405092 189640
11695 -54886 -208503 -160334 22872 105729 155677 -25652 -281756 -57158 -408281 -17345 -195834
11684 -195834 -143879 6858 57284 181581 -14695 -6909 276579 121399 112098 305675 -73733
11672 41666 150371 13289 -183831 121968 -1482 -11294 84599 -134552 172969 55748 162504
11661 162504 83449 63538 -5176 183863 189099 -71533 208696 -9202 351425 278375 -70383
11649 -38959 330237 216896 35041 -37162 -98727 29086 -133963 -280396 -160905 -127530 76681
11637 248129 183967 -350802 135685 96868 254089 153673 -104874 -142868 -85488 244206
11626 -4811 -83295 -73268 215063 294967 -165247 109322 51537 150320 91021 -257661 -44253
11614 233280 69604 -215942 -121147 -98110 281186 101885 85387 -153810 -183446 52160 -46178
11602 -214707 -212532 66816 111429 170657 245722 -32545 -127338 240352 99641 -229240 -9638
11590 -243235 -22693 40553 186077 -44724 -206116 -9377 218022 -75652 258424 56562 -195343
11578 -14712 10088 -76062 -41582 -2117 100128 385316 -47027 61990 18452 22686 -80116 13398
11565 -8546 312565 419937 266291 35140 -289942 -184269 -6019 189576 -187081 54187 -27703
11553 -169770 -282744 428153 -238510 212681 31388 59052 307043 188314 -63820 174593
11542 -58544 -21330 -212886 95107 -193434 108273 33478 320880 344108 -127972 25408 43765
11531 43765 125612 -141375 -203469 -25583 416703 257068 -120012 -19443 -4800 58377 121304
11520 121304 -52743 -24434 333456 -283518 205436 376203 -37035 -75659 137665 111708
11510 111708 34919 -223676 -55531 82633 154110 -156492 54515 -64020 -57815 47565 473857
11499 473857 -54274 132819 133531 52047 335439 -297599 234769 482002 133994 402299
11489 402299 -178 94294 167219 186928 155109 326302 -30830 410792 150078 -88340 -37878
11477 43767 -58283 136188 -51361 -62126 -153129 318325 133851 171869 355088 187014 41169
11465 -221998 19445 20100 -8662 -230660 328438 79350 371036 251535 122651 -23760 186521
11453 -10299 63659 -44631 86068 84626 209597 -12544 -199659 70536 73020 278346 65784
11441 -113468 18810 -134205 171470 -157819 328209 -150562 48834 145479 61939 -104348
11430 -140328 366568 -132480 -42747 -30145 -185839 89369 238057 123194 -23761 -85017
11420 -85017 320600 44956 -51360 39317 4048 15235 323130 -163104 58636 -13227 -175713
11409 -175713 120465 134040 51307 -15088 24195 12275 -37920 91238 21207 194784 -235373
11397 -11609 75629 -9725 -190724 126634 160817 283082 146291 42823 -22799 235066 -76645
11385 -129747 36916 69627 -58999 -211192 88621 -64150 194249 -200900 89543 -91114 -156090
11374 -156090 21922 59743 316932 -58706 -214577 19269 45313 176176 -67453 264424 104775
11362 -112871 -57520 370601 130341 -129209 -230684 213402 -186227 -186550 18035 -46790 -147864
11351 -147864 58938 787 14948 161633 201008 87716 137734 -270431 -88511 58610 -208742
11339 -35845 86714 172182 -25398 25561 -120752 -56882 -108843 25007 233501 -141996 262416
11327 202030 10549 122508 10856 295328 102155 212306 -52260 -254334 -25863 -98602
11317 -98602 191727 -274297 9302 69426 93493 82331 101675 1047 88934 -211193 344869
11305 84264 -207923 56938 -68465 -304199 -88128 214757 85625 -309874 226099 -4017 -19612
11294 -19612 -51578 -317096 269827 -132446 31634 168078 -140388 278565 -16041 159180
11283 -458586 -84754 -442684 -243693 -222790 -82159 95577 -142206 -101260 -410049 52109 -106791
11271 -189543 -34060 135055 27244 -217939 150379 -63595 51194 -330606 66632 31146 71554
11260 71554 169319 -31804 -9067 -94372 -224950 107451 4420 -35233 202371 5146 286835
11249 286835 -123657 9886 -98337 11869 -64425 -136977 -241330 -144686 107509 -23199 57762
11237 -340287 154398 -35098 -46537 -446903 56144 -151484 -69561 -372958 -206290 -296295
11227 -296295 33078 301313 205734 -69243 -41478 14400 159123 14771 -578176 114474 -126280
11215 -36486 250130 -80193 -33681 89996 -328730 247545 -47811 -234300 -104246 -285810
11205 -285810 -11740 113465 56973 -33336 -136732 -51396 93078 162467 234996 2664 206816
11194 206816 -55907 179880 84444 318787 127434 6184 100968 -230829 -230816 44279 -424864
11182 -14247 -87991 158950 -133854 -125779 109240 -403984 -157081 -345122 140973 11563
11171 -39482 91531 40213 -431543 -8612 -187147 -187198 69806 19297 -87 171091 -32249 -54951
11159 -54951 240069 51394 -274921 -153701 -179162 -171423 276984 -257114 -301476 -32530 91630
11147 6227 -309653 -11272 -84244 -170815 -187087 195651 184710 -45142 230961 86956 -124569
11135 74401 35977 -23193 39833 -2530 -374272 8485 529643 50956 -160566 -191604 11488
11123 -14282 114403 158876 6668 -5896 114557 91988 -198885 67657 -34483 -352846 -197122
11112 -197122 -19699 87391 -19343 208619 91396 131555 -31468 -121307 197374 40050 39036
11101 39036 62803 143063 -269678 58075 -155021 -13239 149874 -98867 116580 -217661 196412
11089 -62808 126651 20752 146012 99716 245434 -209449 -272288 84121 121016 323825 99834
11077 11209 -29795 -173257 -35271 93139 -27770 115973 105937 -15559 444403 143839 -1574
11065 -55894 418325 371241 345972 62818 -34006 -92433 364215 109307 19044 -13756 -1896
11053 70536 200685 -209240 23983 621513 438922 -62546 39989 190521 276783 287636 388229
11042 388229 352604 379834 283038 504962 608239 371826 374299 549457 866108 382080
11031 650838 230006 426221 536959 610225 505473 657749 706598 357803 781902 263419
11020 444032 386829 731723 747500 625057 593149 372430 475005 363747 375312 820157
11010 820157 513966 856397 581691 511367 827852 586630 590371 408374 804375 404033
11000 404033 606658 378926 595086 588138 524823 294025 782890 752320 653169 299237
10989 253579 698672 583770 290893 427543 702364 498744 294615 403437 668456 769553
10979 769553 581049 771051 552201 365513 880263 870443 546133 504601 662340 651965
10969 651965 578389 576778 968751 971416 677326 840204 821062 1362414 836027 1246742 1135268
10958 1135268 1533003 1740611 1609539 1969592 1942416 1815019 1747966 1872023 1475287 1682457
10948 1682457 1801666 1968962 1394653 1948141 1568316 1418396 1786543 1193325 1452326
10939 1452326 1844525 1426013 1736919 1496307 1347749 1158247 978606 835524 695860
10930 695860 777636 565441 342074 473851 346448 263989 580385 -8650 -144986 313366
10919 289821 -119755 -84936 53126 -165810 316095 530256 144008 118424 62704 86191
10909 86191 2402 -29733 -74789 1212 -204799 -19398 -48826 -343586 -13318 -143335 57685
10897 -19109 61372 207105 -214751 50743 194533 158398 -238921 58869 19666 -70376 -33619
10885 187133 192400 -136252 -76971 -261419 177867 3992 40018 -21753 -246868 -159956 -14492
10873 -175064 134512 21716 93466 -90510 114191 32583 -345673 -106405 124329 -61471
10862 -227881 -44129 -140940 -12321 -32369 -40382 146614 31548 227556 -313337 129745 -262512
10850 67103 -278104 323961 -57842 -246967 10624 -45963 -150986 -74117 306405 -30296 -304132
10839 -304132 92320 -76189 67588 8846 206857 209192 22621 -124330 119120 -229436 -109277
10827 -224897 406758 -288092 -17804 63447 -19373 40624 40113 -220900 -155382 187561 -68575
10815 -77337 19962 268874 -216175 -192694 130211 280604 -79555 209623 -111842 64164
10804 -212986 68415 -96184 -311111 239605 -189532 194770 -108215 -314227 -232071 -258915
10794 -258915 -128059 -228141 -233150 -432004 -296191 -86443 -111497 289379 -171141 -63990
10783 19202 -106656 143759 -99400 65393 -72649 130640 -72324 301103 -183898 69722 -129776
10771 236498 -115826 -113089 -279467 -25427 269769 -76339 -320314 166331 180519 -217374
10760 -319007 -204015 -300448 29130 -18580 60039 -415434 -230303 -118536 99746 -269742
10749 -238308 204917 -239508 -139717 -231690 104718 -146519 119229 119292 185417 24103 -126254
10737 -133295 167315 -104272 -56869 75680 -100174 -310041 177218 -30978 78280 -221731
10726 52254 185229 143731 11315 31308 -134244 97275 -359212 90602 227813 -90898 40394
10714 107104 -354967 -215610 -204762 36922 250171 -215070 25665 -296052 55044 -414541
10703 3655 110726 -154443 55118 -185871 7924 -60479 -5265 50424 330481 318203 -148187
10691 -79293 106101 -100675 -127745 -375985 97496 -82737 53592 17341 -257108 46001 -18196
10679 178905 121006 69388 -17002 49701 109659 -201451 59828 -87212 175008 -395143 50718
10667 62234 -297607 -258301 -28176 -310739 236481 -39050 87183 267489 5742 2610 -356505
10655 514483 -240039 43527 -84912 304292 -49485 -149058 43630 -160067 -197109 94910 -34729
10643 -56076 229371 -92968 -353435 -68269 62590 -272446 -4671 -75620 257802 162342 23058
10631 -149876 -219754 28614 -152374 52901 -112595 -51867 -24935 207780 -82132 -473965 -193636
10619 -143967 -181565 -210434 -62945 -86013 148702 -45402 -1822 11049 40999 -169274 -50845
10607 25985 29810 150097 -129925 -256998 -164661 -61460 -11418 -137243 -269673 -483411 228439
10595 -87209 8293 -372255 -168816 -167006 196307 -41622 168111 -33318 -189636 14822 -622252
10583 229566 95677 179660 -8410 -160259 -98750 -27708 -27113 114996 -4337 -92904 199031 208977
10571 208977 -143223 -277096 321917 255581 -15364 -16392 -271821 74577 -109901 -310972
10561 -310972 -31502 123294 233023 73061 -177609 39809 -21465 -399946 61806 -99982 -24933
10549 -200055 -7939 79054 -125756 -261102 42395 178858 -179686 -78029 -261211 -152187
10539 -152187 212799 121624 -125230 15421 41348 -1955 -193075 167898 -129525 -39024 -225847
10528 -225847 263932 114154 -170078 -60560 8310 166279 314452 -106083 -97913 -30738 139004
10516 -5738 247995 26430 147185 -77004 -46232 -200751 -98434 62853 94368 -263228 -287305
10505 -287305 193647 -27736 -163258 -23477 -180252 -155233 21527 -201432 11705 -325000
10494 96077 -245524 -215375 -172026 -226213 106903 -4449 -178862 163879 -19560 -76333 -102397
10483 -102397 -26568 -26530 15934 -12691 30578 -200309 151015 128102 133347 235407 -215518
10471 -100737 318646 171630 -94600 -102044 239407 -10830 42534 284099 128402 109651 348315
10460 348315 227058 372764 -110148 263399 -71405 236641 -76587 140432 -53096 42350
10449 -185069 -33594 -2487 -155431 40284 -60152 92030 -332590 -42118 32429 61988 -144303
10437 -47911 57094 -280124 -94709 -149043 155796 -48522 -157649 -205230 -283681 -172619 -25386
10425 -53044 82560 49348 76650 -216927 29904 -217334 -111826 6422 -99417 12883 -30852
10413 139032 -62687 -78154 -350963 -116772 -66272 -31741 -107062 285015 -337792 218532
10402 -393357 365902 101219 -19816 -66386 45780 17558 16128 36178 -87785 -278679 317409
10390 111884 -182669 258545 384021 59308 -128057 -71474 -162153 201118 -33591 -105416
10380 -105416 75252 -303330 55031 197257 -228646 154123 -35159 -69515 58504 -92809 122830
10368 165206 152669 122098 129650 77853 20823 220037 153503 -37417 73966 83852 151376 272688
10356 272688 237534 266443 297063 232337 266245 12053 140259 291038 398520 365661 204816
10345 204816 200418 355872 272835 273238 13977 324444 226070 163487 344884 266172 34223
10333 154399 465768 365696 231222 129483 286837 162795 141308 399400 527653 152382
10322 201349 262893 8709 -53396 106407 -98242 6234 80950 -123931 -171181 48309 222074
10311 222074 105704 -102048 -108664 -404862 85084 -110587 193414 20341 33213 267717
10301 267717 -24681 314942 100128 82329 272670 -19946 38884 50865 86930 62488 166662
10290 166662 -377752 55094 165823 74550 -120808 -477626 -141041 -102273 -80358 237558
10279 246018 -276174 -87175 81828 294265 -34041 -61300 -80267 -87924 -268477 -112357 -334367
10268 -334367 17827 -55436 -33774 185312 -240466 137882 -342070 189455 -479856 14417
10257 109035 -139542 -191397 247696 -284716 127953 -134174 -118138 -33302 62191 -245217
10246 -198343 -84778 34660 -145353 388317 -4640 -86001 260591 389468 78636 362869 397815
10235 397815 516546 52227 -28166 -163626 -212262 75080 -232192 -293515 -128962 -234350
10225 -234350 32703 -43682 -112755 105348 -205215 -130021 -192906 282503 565353 230345
10214 -53133 -48171 -26389 42684 68767 -83561 126574 77310 -50377 -52879 118271 -743 -115418
10202 -115418 82905 -62913 7440 68468 13091 -222299 -32105 -175475 -84579 77585 -163648
10190 32069 -13321 59114 260346 -119394 -271339 -194454 -117774 -251044 160423 -382136
10179 -159372 49724 53036 -80060 -96440 -14379 -71600 40777 -285593 204426 32561 -121362
10167 -430777 -95155 -85405 52313 112367 99788 -215661 41034 -169851 -216965 -138756 -89322
10156 -89322 7824 -237999 62928 66692 22975 -54009 111697 -2339 15934 179411 -127605
10144 196034 -200999 -336523 -63363 -142989 -147668 57009 -183823 -142541 -213350 77884 -33719
10132 99430 19145 -393517 -96388 -314844 -15252 -147324 -36911 -38353 213812 60577 -132103
10120 206331 -36591 -69746 -3458 268017 324246 216930 -305090 -9840 -279313 24591 -145267
10108 56454 126396 59155 -844 280434 41983 -5606 -240661 35699 -167254 -24460 11010 82387
10096 82387 -56183 -362256 -155861 -38668 133800 -215709 -324855 178721 -168758 115580
10085 -211394 -276853 -31428 179034 -25286 -117421 189954 598766 -100947 118892 188807
10075 188807 29357 -36757 20254 -50382 -128251 -37833 -270165 -14662 -19462 100205 -321772
10063 242102 -166812 178010 64008 -65108 83315 -201037 -255184 -329009 408486 -214422
10052 201787 -192754 -57446 208063 -212751 -292518 -50906 -183336 -102113 -311845 148845
10041 -250778 -35927 -67928 133999 98755 -377301 393459 -272449 -16929 9361 211183 -211595
10029 -177491 -140073 -238142 218089 -5042 -136317 -218132 133868 -149579 -46801 68066 -139397
10017 63646 -71152 -377105 88627 -160396 -74478 -44881 -171817 -218086 -436305 -20185 -268516
10006 -268516 -263499 -410128 253061 24407 9569 -136873 113377 -167688 -119519 -226492 -299850
9995 -299850 168936 -9945 32363 -169505 7659 -230542 -263937 -375105 -194032 52472 105115
9984 105115 180465 97619 -315427 -158807 -127605 52358 20793 -75576 -37956 -164415 -229088
9973 -229088 -184996 -69752 -180559 128176 -154267 -95456 -48754 -161171 -40729 -203810 -236779
9962 -236779 -28693 -232395 59939 -68589 102073 -58359 201178 -71270 201896 -20843 72080
9950 -53148 -189873 -273856 -19774 280753 -62837 106681 -210849 -147701 220959 -323913 37020
9938 -37983 -496932 -29610 60350 185356 -71854 -219972 -370019 12458 129944 196931 -8229
9926 -88366 -105690 89547 -158428 131431 40356 -167068 -179318 247257 249557 33945 -282958
9914 -41945 -189329 -73954 -106766 -264778 -20975 -50751 -30397 223122 -154771 -111217 -342512
9903 -342512 -186760 -60030 46527 224263 -274580 -198230 76969 334678 -156289 -26104 -185184
9892 -185184 -249747 -387064 200369 -178737 -51120 -192275 -150733 6325 162327 -250569 -135397
9881 -135397 135251 -106250 -133170 -328756 -39166 -18997 -294881 -212930 144292 -25978 -54598
9870 -54598 -9743 63258 64763 -251095 -195195 -56811 -202148 -311208 -176535 -359230 272507
9858 -60627 -211150 -27601 -104171 6212 -8922 248185 -128298 -183593 111582 -459903 -239782
9847 -239782 -70096 -170196 79656 -61326 -187068 -160013 250591 -249780 -141974 341429
9836 -281690 -359642 -352584 35606 54528 35334 -82653 -214185 94710 178697 -454550 197271
9824 -105481 175800 -131001 -74502 18371 67375 -354207 299206 -246510 -397056 -195478
9813 242519 96213 -8941 158976 238323 63231 25020 108637 -101089 14727 -82178 -151421
9802 -151421 -284027 -96264 -157282 -138979 137837 -38844 -143103 -239341 -111734 98151 -268336
9790 -47956 -106847 61727 16220 254270 -285450 -332438 -138495 150352 225740 -96224 205824
9778 48872 -46562 3885 19350 6982 -153115 -194479 -240155 81544 -56774 262204 72738 -328202
9765 72104 -474549 -9610 -253067 -135353 -133851 -125571 154781 -196358 150193 -385120 114917
9753 -244514 -17091 105339 -39084 -258278 -288761 -96723 -53543 -243182 -141032 187663 -201030
9741 -495327 66887 -101705 -28934 55310 -133303 -46016 177923 -255275 164018 17143 -113275
9729 -135266 -186 -66608 171686 -38313 166267 -71933 -45608 146740 -14730 -34890 -242282
9718 -242282 -27178 248283 203047 -98812 20010 -287006 -380143 67830 -154374 -224424 -331266
9707 -331266 -88781 41602 29289 -417615 185728 65538 -228651 -137809 -126189 -64855 105748
9695 -8383 39532 -185328 -122677 59762 137626 -319050 -134233 -42098 85351 146984 -85115
9683 310952 -284588 -352847 -10926 33721 -97411 -137685 -277625 -350182 149413 -141425 -437417
9672 -437417 -358747 -174074 -77438 267187 -49775 -158680 -438426 6615 -197256 -158830 -230162
9661 -230162 -237707 -180056 -331656 -286339 -80588 -19001 -110313 78369 -536271 -26896 52121
9649 -3636 -50552 -76012 263368 64630 46893 27937 84584 -253865 -334591 -304966 -118643
9637 -157669 -189122 -28235 -104259 51560 22235 -137667 32751 -255985 -11481 -180402 23997
9625 -235530 5124 51539 121098 -345518 -118010 -125768 -79997 -27320 2528 43773 70463 -250683
9612 -194381 -64535 -118463 204537 72456 192894 -42332 17343 -65466 83791 -60217 -42449
9601 -42449 -161338 -125240 -381429 -404867 -77638 -141782 -20647 98652 -49572 -68035 -108234
9590 -108234 -214272 215685 -96835 -13571 -7124 -11045 -114180 -216967 -325130 -135492 34024
9578 -122333 -261544 237284 7220 -240062 205743 -236347 77170 -42254 -142113 20703 46214
9567 46214 209770 6626 89832 -356043 -216113 -183648 -122294 -97858 -180608 -312736 -134787
9555 -215396 58666 -191143 -249300 -65247 -398446 57308 251889 85825 121002 -118783 -33073
9543 3070 4045 -24946 -320362 16538 -179765 -54482 -29499 -49822 165927 270940 -59659 143783
9530 -178425 9312 -43702 -89511 77385 -13259 -48095 -25856 -214127 -440965 -38066 -161008
9519 -161008 -68617 -147009 122505 178267 323011 114961 -84984 -199593 -202046 -139164 251598
9507 24805 -179436 140241 -27394 4916 55092 155476 -250823 88385 240270 -38234 -35541
9496 -35541 -148658 -80100 109279 -3301 -80184 -324940 -14141 -39909 229600 -97241 -34172
9484 -62507 -245067 10465 25806 -82669 -274457 -439641 -93368 -37213 -2515 4970 386756
9473 386756 252885 -142636 -307708 -373255 -192873 -118131 -366505 -230601 25933 60387
9463 60387 -710 57958 -59038 -353201 -21234 -187265 -200407 77738 -132866 200653 -69610
9451 -164618 -249109 -228850 55176 -125467 -119799 -425699 -69161 -8920 11372 -238378 -79091
9439 -172229 -117276 23831 -4332 11702 -279648 -1963 45644 -243376 207112 -114934 173823
9427 270726 -83992 107388 45152 -143596 84332 114905 217767 56679 21828 143542 59290
9415 -312379 -89198 -145098 63548 -24644 163531 -137697 -354610 -118105 -413757 248446
9404 125703 18108 85747 -69984 72735 123572 -140923 -83335 416960 148576 -369154 -230744
9393 -230744 -32563 -187503 -82960 68097 -84755 149443 179898 -161091 23984 -146249 79141
9381 113264 -302161 68569 -355459 -4129 -251342 15019 -178838 108617 -168129 -180733 -347400
9370 -347400 -125121 -189543 -30846 -60130 160927 22651 -66260 323637 121426 -233049 38315
9358 -59434 -30387 13341 18860 -241357 29262 146191 135549 14436 104416 -139490 220800
9346 -171474 56329 -100295 105379 -256412 -136596 80850 -37676 7072 -125983 110319 -384326
9334 -15489 -287222 -201298 -450985 29121 4147 218557 -42682 -132643 113701 13664 85669
9323 85669 -185588 -86319 -171796 -26376 -2001 208989 20389 -163037 -25167 -7306 -89092 -426502
9311 -426502 77861 -254749 -5036 -160311 45216 -228024 63572 -19403 109172 148600 -301336
9299 40828 -275236 -25282 100257 -15491 -38756 -41399 -305087 55282 -263683 -103414 39681
9287 -65832 128081 202675 -13273 -24405 -87671 -75068 18474 21374 -48906 26227 -134881 -78960
9275 -78960 -134041 60247 3120 -266467 -46934 -173946 -97019 -4073 299957 -48634 -118175 16269
9262 166842 -480063 -61537 -574170 129356 -243839 -145014 384719 93287 30995 170472
9252 170472 -222448 -133917 32096 24432 -179961 107925 -117886 -37269 -40114 -103748 -288278
9241 -288278 -391002 94551 -425186 -199231 -40944 -262930 -126888 -14315 -121724 -71550
9231 -71550 468141 -162628 -278146 247951 124893 -114413 -245130 -227068 -127169 -339984
9221 -339984 -208227 -80980 -116749 295969 -139086 -83035 330697 -31029 -255536 68909 -30898
9209 29461 -204760 -69149 -167034 -306715 108064 -371056 -51658 -14577 -26000 -83698 29348
9197 19086 -44278 -292673 368838 -198902 -85723 -253789 349720 -161008 -105263 9783 -168737
9185 116638 25782 -247191 206516 47469 209838 -28455 -290684 -12296 52810 142188 321235
9174 321235 1277 86451 -133345 -89447 -212003 -214023 67880 -274576 -201526 -72823 166656
9162 75275 -83773 -206599 -284984 47823 -22587 6545 34015 73036 -51193 -54820 -26800 351228
9149 -249284 -325216 -128324 -62132 -328985 -204336 -73244 -353560 -306858 -102796 -206425
9139 -206425 402399 -28478 -165463 92081 -176036 -12295 -2069 -309009 -91808 -252152 -49178
9127 251354 78664 19135 -52627 183812 -199454 62254 33159 -743 -122260 -225938 18083
9115 -105063 236377 217906 -165929 -276892 -80582 -96421 1064 -186338 -271017 141410 211019
9104 211019 315816 -147260 -32689 51292 -170777 158078 -148506 -118092 -431791 -191704
9093 16035 -102507 -182820 -174429 -101551 -200025 89723 -149754 -92909 99585 145551 319573
9082 319573 -106970 96004 -37889 357277 93178 70867 81243 -113434 -72720 -227011 252383
9070 -255894 887 -137459 -36049 -330313 233159 -270238 -527037 149371 44688 222659 52029
9058 -73870 -256710 -113763 348655 124774 10418 -283024 216663 260319 160127 -305671
9047 -147485 -176478 -424423 149527 -89707 -227867 -301569 -63289 -299596 210299 -232726
9036 -222018 140174 94111 24641 -501384 -235657 319251 -263038 -110145 73924 286506
9026 286506 -129727 -131478 73795 270743 -380409 -248414 -1496 30285 -205408 -149709 42550
9014 128075 -49218 -41708 -41179 149771 195381 298973 -60931 -151123 -120510 -117388 -12294 167386
9001 -196615 83021 -43825 -44741 -140429 161980 -132837 128257 -202596 51110 -152087 45337
8989 187173 15875 -193947 -382674 287275 -153682 -10815 -206307 -152446 -261638 -506786
8979 -506786 31932 -42442 -298870 -45274 127380 51605 -228496 -502448 -138365 128267
8968 -218465 -48036 -185732 171017 -62944 158174 -45714 115943 182469 -135738 -354585
8958 -354585 -351892 49152 -198952 101292 -24558 88749 -278191 -351339 -56112 -47952 43565
8946 -97637 -121991 172414 -172541 81632 -66828 -278153 51324 -647648 -137463 70137 -218111
8934 -2795 -363260 -157245 -546755 172809 144175 -179035 -381208 119555 -232549 44358
8923 -206400 158739 -32075 204830 -69753 36446 118112 -63761 275187 383073 -206598 98816
8911 -130750 20446 58460 652830 502444 612860 1185624 1818379 3372260 6982778 3284812
8900 1758262 906671 286639 421506 588754 259003 88072 -83137 -288946 452158 -35309
8889 140998 437397 52471 21116 -117689 197060 -188029 -35218 149741 -128407 -51782
8878 107200 -949 54586 42074 83664 -17544 120026 -304590 326783 -9018 -191592 -109178
8867 -109178 -194524 -307983 -10017 -287363 -11278 93536 -175452 145124 50283 246412 217916
8856 217916 -250905 -172743 -230370 116280 -103309 66971 149615 111522 -171921 63197 116716
8845 116716 -131130 -14892 -143425 -304671 -130672 -212002 98882 -209963 36367 -22141 -363903
8834 -363903 166816 51730 -83051 -211029 -13453 -235601 -168724 -247967 -156881 70501 -217463
8822 -116726 62502 -50334 244938 -230090 -8111 84522 -116519 48161 150996 7754 113873
8811 113873 -490021 159489 -55546 71727 95492 108899 -5253 -42279 -13410 -101603 177430
8799 -27919 115762 -40761 -240182 -84212 -141025 -214661 17741 -14319 18548 96101 -212809
8787 -80995 138544 52848 -218382 -20777 87121 -281279 20334 203167 59019 -62769 -151043
8776 -151043 71326 29113 -330316 -152712 -124954 227748 51192 -174593 -246564 35895 194159
8765 194159 -246403 -171614 57848 -150571 96691 39471 31584 -64463 -170308 -57371 -8387
8753 -69322 -380287 -264424 -296240 406870 18951 -6307 -62095 -78552 120470 126879 -17700
8741 -209469 -355274 -49833 -166991 -148093 109310 -36453 80211 82035 162572 -344929 -153852
8729 -82996 195687 -202326 -147351 -1321 -148004 -126436 -294715 -25453 -65148 287953 -132764
8717 -18636 28973 -95998 74856 175938 -91841 452173 130296 -89567 -52345 132402 50382
8705 162188 -156527 -243675 187219 -156378 -60695 -33488 -108250 170465 17982 204735 116067
8694 116067 264327 -200735 -330578 72247 -226427 186583 -242269 -195648 -338071 -146252
8683 -75377 121909 -311837 -263515 -211279 -133552 173971 -82981 305220 -84401 166228 121494
8672 121494 127045 -163712 -150719 -345562 -176765 -64598 -66645 65857 171138 135676 167476
8661 167476 712 46740 -319682 56539 37812 87726 -32817 450782 79032 5323 9619 -106656
8648 -41897 417904 64606 -336469 -115452 -118027 77362 167636 -63297 -76243 -228703 318113
8636 -54043 -43520 -66106 21479 253973 -4810 22454 186120 -106293 23819 104133 25498
8624 258015 -50228 -208106 50872 297595 -11430 -233742 81329 -107287 -96706 -172330 107354
8612 280851 -150978 -85525 123644 51070 -284423 -39410 -102679 -50768 -191905 -165339 -23879
8600 25887 -183138 -212580 145092 -156161 -126467 128784 -99218 -63976 -133427 -325468 -14509
8588 214746 -340960 63762 -30333 -232145 -316969 -132401 217865 162770 405684 -14201 167041
8576 -115223 -62606 88377 -48627 36322 6792 38700 -247661 -295418 -50036 -167514 -137410
8565 -137410 -175965 -156094 -246306 48061 90857 29124 -116539 143810 -28154 -41504 -15155
8553 -272001 -43095 148123 -32714 -254486 69712 -261864 -232412 -465034 61500 -43199 -113786
8542 -113786 91471 -117875 330649 -96243 52552 49850 -312687 -148895 -69355 -11652 -173954
8531 -173954 -103814 58768 -137477 -16621 55131 232335 -130979 -119370 -479083 233454 -82970
8519 -20925 -305073 56298 -160661 103008 143572 195197 -131082 -95694 200827 21652 111682
8508 111682 95144 244161 -69352 -66086 102089 304372 133215 263651 39347 -329672 -319549
8497 -319549 101428 -47365 134910 48481 -39984 -139202 -23516 -381290 33322 36357 -5917
8485 209025 70883 -46624 89403 -236428 -321673 -166941 -207630 -370359 5653 100239 -387792
8473 -99288 145878 -390578 50906 188879 -10071 196948 -26938 -166936 118280 50956 -72505
8461 -44844 61107 113223 -199487 -13834 -94819 -47678 73280 101381 -126905 -330563 -111215
8449 50036 -306312 58410 -269478 242982 -235257 -329242 -106406 -189222 48756 -65302 -94353
8438 -94353 -208809 -215572 106086 -81132 52529 76907 -214194 -49965 38815 -171867 34281
8426 -128703 -18297 -9109 -236753 -124546 381629 137207 -291826 -32578 -153944 -107694 -156264
8415 -156264 148167 107829 -63298 -116125 -389244 -326192 -189567 -148095 -332847 -47217 1268
8403 -74231 -19711 153597 110194 181716 235157 -87864 -116819 72933 227150 108587 -10725
8391 -216896 180196 -23255 61218 -165083 -203000 -481372 71299 291187 -52840 -99770 -115289
8380 -115289 75293 -176616 -87965 -71955 59181 58405 -100259 -257227 80783 -63287 -2265 -127855
8368 -127855 35406 120423 47653 -153570 106777 238987 -68393 -251539 177433 88197 -237373
8356 76844 -101399 167287 -194800 164548 199763 -9564 28377 -8170 -31554 -2983 289140
8344 -140925 -31370 55115 -58675 -326073 -151288 -156453 122330 -190897 -71036 112047 6758
8332 -204059 -45725 -23585 -157672 -24874 20307 -243121 -272500 -111313 -283021 -169773 -139719
8321 -139719 -155487 -268490 15960 248885 -193919 -235923 -9846 -258241 -147625 78805 -66193
8309 85716 99098 -35576 189747 43046 -174605 41216 -105821 -128385 219974 -212077 -8842
8297 -121656 -167620 -241632 58961 111914 -13975 289336 295536 -40284 -189747 -63767 26866
8285 -241126 41592 73886 -172931 206937 99077 -24454 44153 -77886 129621 -42180 325224
8273 -121806 -286964 140429 -172011 -54617 -296432 -80317 -71778 -130549 191319 190087 88910
8261 -62474 1253 393302 311563 48833 313218 242986 -130127 -85166 -71410 23256 95399
8250 95399 -7815 -277581 -508771 401142 -6039 -30990 -35924 -129027 209617 -94049 -46146 -162094
8238 -162094 96639 135147 -461154 -120651 -87514 -92591 -203552 -273345 -111162 -310574 90774
8226 174422 -152867 -229080 -402386 -174152 378995 53757 9742 -152576 -108224 204431 153375
8215 153375 -129533 -202351 199404 -91255 -39418 105880 -51703 -7512 -71290 64646 179257
8204 179257 -118684 140241 -80033 71211 42270 -21795 83980 -347071 165168 -261804 -130367
8192 219036 -73585 181748 44333 -96083 76156 191072 128982 -98227 125173 48434 -107955
8180 -34054 -12596 -60153 -54047 49646 -257560 -9641 92961 -178209 -527692 -31549 10625 -105672
8167 -163880 -235797 -221594 70618 89665 -104748 38209 37648 -102870 -15477 -72024 -237822
8156 -237822 -78009 -169694 -172505 112295 18570 -127849 -157443 -10596 25921 -292179 -117172
8144 43877 -147137 206568 -149713 47829 114703 35437 -138625 -48806 -151163 -236692 138698
8132 -55389 -4715 -207879 175589 -88798 -123219 37761 77234 -208584 -277071 -17830 -226054
8121 -226054 -165272 65295 -38454 -89101 5104 -292311 -119049 -16355 10769 -41702 231640
8109 -197233 315007 -158250 -171552 -99646 68908 147773 -204783 28622 -380392 -39715 -121746
8098 -121746 -149617 293383 -474795 -136230 -1940 67987 108533 80098 398528 -638833 45785
8086 -167630 -95541 81727 99993 -243259 -113874 46641 172433 -98916 1623 -36592 -463525
8075 -463525 211462 174923 -252783 370571 29306 -110399 38910 76328 -28274 194142 -170998
8063 5518 -17246 -324373 70295 -96037 1234 -24484 54855 -155631 -4230 132553 162253 -69778
8050 -382707 -605373 -121525 -152554 -48735 -119965 341090 -10521 -17145 -118075 -298634 -73010
8038 165442 -118265 -36874 11381 255351 -336288 -62265 -223721 -103827 -248584 207018
8027 -55267 -335723 349856 -59864 -248848 347078 14906 14382 34309 13362 -212988 -33640
8015 -422046 -205733 79986 220771 40033 243589 12772 -97295 419688 -13197 -64140 -144430
8004 -144430 -250013 203347 -426338 78265 18753 272234 -38134 88777 -273478 -84012 -215000
7993 -215000 82885 -328816 -67094 -340463 -79509 227155 24991 -305487 132029 -66831 -188369
7982 -188369 12725 25811 -198865 -264011 -135693 119868 -1741 -77493 75696 203493 -243594
7970 -222649 -59592 -137362 -222989 -83964 -134416 -151591 -124927 366484 -167142 -147113 22590
7958 -91210 154295 -204213 116037 -59666 -185908 -79034 -180757 -270837 200163 -17229 -56332
7947 -56332 -130902 60127 77392 -87669 133714 116600 -73082 17801 -424310 -232737 96390
7935 -199327 34939 -151446 82386 -133780 165735 127902 -160592 63910 -305698 303726
7924 -203292 33045 396220 -17301 22194 125374 -180434 186795 2748 -268843 -89904 -408166
7913 -408166 58666 -212233 105874 198949 94191 -258802 -1506 -67087 -113820 -3176 94877
7901 -212815 -58804 -59092 12121 -150174 -347673 139079 266336 26277 47159 9939 135766
7890 135766 -147190 -113878 -75854 166464 -135549 192100 -124279 -187582 -254712 -104324
7879 158608 90838 33606 -184929 -41067 -49424 163793 -141630 -100484 -115128 412819 262727
7868 262727 -29514 78538 -140128 -170136 -283 119911 -126174 230904 -25739 -321943 260098
7856 -342178 -53083 -61499 -229050 -233761 -139228 -22806 -244776 -131209 75093 129050 -142125
7844 -431709 51186 33216 38991 140106 105551 183527 -25898 197649 -267222 -104662 216839
7832 -354415 6822 -40280 -213482 -127730 -176152 -56493 182894 -163678 -137140 -186216 -249169
7821 -249169 71795 -9098 -447862 14398 66632 -144048 -104458 -103419 -168420 48137 66106 -61592
7808 15761 -3192 -141993 200980 -120704 275074 -179371 10192 390002 -157695 -290425
7798 -290425 247557 -144984 317 -218135 -66003 170647 -190007 10515 151864 179222 -191674
7786 -18142 -69062 -23492 -85400 17266 -126419 328498 348198 -55193 -246219 2302 -55893
7774 -97080 162738 -138923 266631 208872 15605 153081 182458 -223942 34410 -18532 -45847
7763 -45847 139330 189857 268972 62063 13119 -3122 -29553 -121058 224335 -148057 -48745
7751 -296 -116559 132597 -187263 311416 89315 -141190 145044 -346061 -33629 33255 74463
7740 74463 84747 -4955 -300584 160810 31966 16269 290087 -151879 -91172 -318583 -158025
7728 -45062 274854 131497 -10600 67058 -233056 -253865 -284904 41679 -168463 -323688 4158
7716 265544 -141919 98169 17944 -68012 -64442 106822 -141116 -34149 -159628 -34862 -207037
7705 -207037 -149445 240203 -203488 107160 -98565 -456377 375575 33001 -193443 -113375
7695 -113375 -58127 12067 -156462 -107778 177022 -245228 74609 -302335 33195 -212722 -506931
7684 -506931 -154209 15402 212048 -192340 88067 -105783 -295279 -35682 216585 17198
7673 126308 -72960 -4134 -31049 -215982 -34857 -364125 43015 -43451 -40579 -74767 109073
7661 101233 10395 -52605 139920 200803 -22254 26384 31682 -143627 -265486 26516 87266
7650 87266 -111886 -35578 -118717 11875 -91362 -261782 42016 -35370 -60506 62194 -60519
7638 62350 -317339 -195058 -172249 36871 253531 -30559 -71880 22250 -96155 -145426 -278407
7627 -278407 -69921 171309 177184 195933 -181678 -39749 -280189 -142054 -253592 81241 -23988
7615 -304345 -383167 -23981 -182524 127851 -265226 -298179 -239708 115589 -247254 -277831 115039
7603 141461 19887 -19065 -280288 -42096 86804 -149640 -20452 -128850 323216 -60424 -199916
7592 -199916 -345334 68331 38581 -76571 -61269 200462 -128662 -46624 -225845 -162151 -60417
7580 -279501 74417 -288908 -238231 49957 -163395 -87044 22367 63663 -55911 72466 -4896
7568 66244 -328068 -53372 -162604 179010 345066 -30685 -64822 -112217 -154735 37589 -134293
7556 27921 -155321 16575 -37864 -223952 206625 -31099 271703 159093 -100184 146142
7545 10565 -232803 -104428 -359211 112817 58700 -301454 134704 28200 36703 185129 66927
7533 5489 271137 59056 98907 41810 -183906 213873 -31955 185294 24156 -420570 270741
7521 197454 -59132 50159 -208599 45087 118010 303512 -273482 145090 -82274 121332 -350986
7509 8453 -203787 123213 88969 295037 -51917 -372894 -110581 -263428 46288 -220026 38774
7497 -188553 52709 -205383 -25718 300108 127158 41084 89125 -52866 -6691 500114 -12962
7485 -108449 96590 -188383 -236092 -125113 -439850 270695 273673 55028 134881 133350 88875
7474 88875 56787 -170068 -212156 160718 -159120 -237394 118671 -52473 187442 -174046 365200
7462 -178534 189312 -16214 -165191 34579 -198273 -212624 -386373 84551 -151557 -91237 56111
7450 -113703 125265 -26929 -5590 -16262 -186723 -68517 111169 239511 -5461 -184141 150720
7438 -184457 -67492 -86508 19982 128798 -202941 208424 231639 199878 -349368 108313 105633
7427 105633 -356967 21731 -12761 106705 295598 41191 -63274 -148359 226829 -251857 -54595
7415 -57697 -226557 3248 273485 -136821 -107917 -148844 61434 -209053 383678 -20619 139095
7403 -326955 86436 106288 -239431 -23200 29629 151140 65574 -128219 -295932 -161986 -53883
7391 202784 27901 -283020 -136338 30143 -97495 -32988 -25312 100221 37434 -190665 -74703
7379 -97826 63052 129541 -208195 -3439 -90134 -2613 205795 346399 -55129 131783 -382230
7367 144048 97415 124905 68745 -149805 -30608 91403 -34499 -97012 -92493 82545 -43752 -257760
7355 -257760 -179022 -20292 -286862 318815 -53899 196776 -255025 161624 -141243 -205379
7345 -205379 240045 -47846 -188882 230683 -54245 -96823 -258434 -37380 -449790 50400 35566
7334 35566 -155455 -179804 7825 7928 -515845 -102068 199253 -61006 -447039 111475 142680
7323 142680 68134 -481411 -46608 -312820 -51011 -48270 104232 -110556 227179 -174702 249837
7311 -381341 -23059 -222272 -98049 -9079 -65148 -69047 36687 -36448 564 212654 147118 173439
7299 173439 -177795 146641 201696 -86403 38677 -167489 -60741 161171 104528 -246079 -202800
7288 -202800 60641 -303850 -377880 -61481 122998 -136221 145615 59061 82452 -103927 -173918
7277 -173918 -192414 -66276 -1474 -293119 338696 243083 103168 -144086 19410 60914 3008
7265 -213338 142082 -45645 -134006 216009 312889 -158831 193324 -315212 5574 -44262 85305
7253 214852 109418 -124776 42755 83963 -82304 -193862 186207 -157580 -194314 -85749 -387671
7242 -387671 4739 -45055 -88997 157498 -35383 -59066 140087 203713 -70951 15265 256176
7231 256176 91813 -134180 -307648 141620 -90728 -266931 -129933 -72998 -187876 -165814
7221 -165814 129777 28002 -247741 -385984 2504 -78435 -206087 -102910 -63095 -152082 115836
7209 2246 -225685 -137605 -100424 -121426 138500 -218368 285524 -110166 -111773 -41923 -228069
7198 -228069 -146172 202519 -123815 140360 -222971 -171262 288979 -296167 51945 23310
7187 -107007 186385 184131 16693 282969 70212 119278 120208 -132137 -315568 279085 -123471
7175 127671 26744 -203153 257012 -212348 -181164 -97472 -264487 352323 30984 185766
7165 185766 -37782 19928 -319660 79425 -269019 -71997 -78657 -120834 -123664 155905 -221166
7153 45051 72023 -220857 -312992 -61919 -188734 -28320 -277127 -14224 383705 -5810 33029
7141 -219877 62851 -412282 -74479 121779 -44870 32772 -273468 59653 262138 20339 -155999
7129 -216464 112310 -111147 -72827 -14454 -13717 -247424 -4921 -77865 83135 -80446 165913
7117 -96436 -94678 -40827 93074 -238867 -36972 -163046 229811 -278468 -54914 265633 90947
7105 -125939 -56613 -238561 93219 7863 2676 -51383 -196400 161503 -75724 52698 -460 146741
7092 -90026 213011 -128580 12483 -155734 57424 -29191 -86936 -47043 -37366 8800 190004
7081 190004 194680 -218489 -379037 -145168 -227881 241406 -240526 -6730 179587 80439 -13146
7069 79157 59892 -155051 -92283 -126094 -95029 -50114 369934 289714 121125 -87494 -30458
7057 146192 127363 123856 179489 145765 262998 -125395 -40780 -13999 -157645 4930 -36106
7045 -149438 78673 35783 29537 -96239 243959 38065 162827 20505 297210 27414 117006
7034 117006 -143508 17250 114176 11801 563 -154969 -274456 -161113 21224 -9358 86008
7022 -45388 -126683 56780 214010 -40068 -76751 10404 88138 -15980 139983 -102804 -15231
7010 -56928 41419 84554 86216 -107535 195542 -20928 -52161 -215854 -135653 -195241 205667
6998 -265193 -235569 -243327 -52844 -52276 -40257 -11161 95533 -81004 104673 -17447 -436829 148320
6985 165006 88690 -380289 227255 -300868 -14631 -57887 -250136 -174305 379205 9811 105321
6974 105321 231667 -49802 99212 -317519 -239378 56610 -504011 -302370 264082 -189025
6963 29529 48885 -182410 -216255 48527 -131186 197624 135467 -151356 109483 58537 -270579
6951 -405291 138156 -364110 215001 -1456 -354019 84694 -222927 94294 28159 -12352 -11456
6940 -11456 -16193 49104 -230245 195221 93789 -102516 -188644 380143 -111572 -28578 139999
6928 -503108 20810 -199334 267372 -63544 73764 -27457 161225 -40084 -62385 195699 167714
6917 167714 30895 85325 60682 102598 -8159 -53514 -420265 9378 133715 -20554 -100761 -126911
6905 -126911 251240 -282915 -102141 -103675 153577 260628 139155 152974 -105978 361332
6894 -11084 94731 -33743 -2876 368072 -188694 -157437 -205923 -57703 -86458 -61100 -58208 -41876
6882 -41876 326313 -265561 98281 194588 55245 -50352 144989 -54442 -288661 72533 134939
6871 134939 -162392 -211365 105428 -185684 27416 56717 -78468 8849 4281 -87749 152470
6859 77733 -123543 -84280 231769 71171 -296747 -178237 34589 66472 -60261 -58456 -275839
6848 -275839 124046 86564 139682 48355 -78910 126240 -61678 -195624 150225 38875 -57930
6836 285443 89227 -251562 -131129 -105454 -238496 -38451 158852 171582 -250923 -77792 -306303
6825 -306303 174950 35942 8871 -65485 29804 -77439 -375541 -46472 38182 142250 197955
6814 197955 -195965 90895 -112577 -108302 133622 174103 303509 -112446 -186826 -173796 125108
6802 -194136 -63304 -13404 3843 -102475 58152 -202894 165958 -390153 19012 153764 -296447
6790 65233 34418 -55321 -15854 -42844 -67180 186963 -119340 20842 -46960 -263562 -134101
6779 -134101 33542 -102674 32251 -133076 -180553 -248161 -131344 142921 39360 154717 -32157
6767 207075 72178 -289998 -151384 136659 -327135 9953 -850 130836 -28657 149608 -114701
6755 -221973 -20618 -67000 116479 80313 -422933 8474 -66959 66987 -127101 93478 160517
6744 160517 120269 -74156 -95198 33451 -122897 -28673 44513 202541 -39771 -76856 103741
6732 468 118454 48531 100119 186003 -147459 -109691 -271995 -73037 129348 -52325 -30305
6721 -30305 54314 -89364 -130738 -66376 -38888 -54612 -137368 -246136 40891 446012 -228248
6709 180794 -24519 186887 -140772 -290722 389193 209797 -220093 -32480 -36755 33459 20920
6698 20920 59055 250244 -53587 -33244 -1068 -182292 114215 180051 -337631 -86078 247368
6686 -19582 -67866 -341919 56318 126014 -381172 -292627 196307 281149 -74126 -240265 77857
6674 66348 182353 -123495 -117878 -35162 40214 23151 -22414 190617 -91476 12797 305151
6663 305151 412129 -126324 -226478 -198971 347993 -154648 141789 -66101 253679 -50176
6652 -100677 65787 -122155 -13470 61506 323 -59050 -117370 57197 -262323 -151452 291941
6640 -243076 -394701 -116519 11012 272837 116546 -114489 261235 8661 -76809 -65717 -61139
6629 -61139 -114770 -296965 101047 250133 74819 -271601 63131 -50742 -228403 -130491 -67293
6618 -67293 238762 -167810 241896 303334 281157 14100 -76470 113843 -90202 -220214 -127841
6607 -127841 -9105 146323 677518 -360614 -8344 52995 -127138 -278701 248603 -23326 165815
6595 -332262 26338 101896 111102 22384 165908 -185397 44608 -71685 120695 -95032 -118631
6584 -118631 275287 104803 -30250 172564 -72509 122468 152147 -84048 299139 28951 -141987
6572 -6224 104205 -69928 -305491 -120229 -184132 -80392 -182341 -60817 16059 -323585 93501
6560 353011 182118 -35842 -109348 4053 -124300 64581 -217382 95070 17454 263611 179093
6549 179093 -178176 -101965 -137794 92047 174958 -267204 -173546 196721 -102421 -154535 -350237
6538 -350237 95825 -105270 -42305 -265603 126507 84391 -163753 183997 -68893 -358046
6528 -358046 155306 -208212 -21944 -264552 200482 -28097 146102 3239 -181739 150030
6517 24038 -94794 13826 -2197 40673 80783 60787 -70608 -20218 117983 -191167 173587
6505 -294538 127523 -184324 -96903 19537 -50453 -67327 -105708 -21791 43574 305634 -212605
6493 -41772 60438 -116016 -110571 294513 45697 261253 270704 78872 119047 283865 -246560
6481 50354 -53138 -17170 399205 -6178 149075 -1186 -314780 124675 -131185 -25676 -76658
6470 -76658 97447 -267917 -111754 -67021 -243690 -77980 -57231 275806 54390 -130892 -149432
6459 -149432 -119361 -171577 -2571 31907 -180455 123429 -205515 -323768 29765 252752 323121
6448 323121 -135514 -20290 -26871 -298744 56548 100056 129710 182125 -44878 -421597 216581
6436 157670 -153054 84448 159262 19113 -113784 -179502 -175714 -15732 -33297 44334 16998
6424 -45715 42660 -16332 -343806 56107 -32316 440307 -41310 -295360 262621 169910 -297862
6412 -170441 61945 -221658 87596 -298820 83177 36 -142921 109406 337229 -239483 225874
6400 92814 -205994 -164827 -57658 -266920 51605 -7349 -96734 -336897 -87917 -170329 64500
6388 -368660 -69431 -127505 -192121 -120871 -186985 -148006 7756 241516 21074 -180063 -275641
6377 -275641 145611 -134307 165657 -55161 -114558 381299 105952 91915 -452185 69261
6366 127871 -107143 -73544 85247 39298 -130057 50473 -189031 239326 -21724 -62213 172542
6354 30320 -42103 96872 -227802 -137855 -7928 -162085 62040 133534 126425 115749 32159 -158054
6341 39818 -297855 251835 46071 32190 -220728 29541 -152998 -72082 -194786 6022 -143554
6329 -206321 142902 -49382 -101644 418737 108316 131398 131526 110489 273993 199216 -78482
6317 -334575 -175035 -42247 39074 178657 -35506 -92116 -256610 -827 -69621 17184 -79491
6305 49631 185194 -55816 97377 -26445 221561 -41111 -168958 70997 -104982 79289 -100031
6293 179776 -65794 -159883 -39845 183136 130987 -115861 115555 3961 -2077 -211886 -69336
6281 -102009 -301315 50600 14473 223673 -6099 2509 -42036 -265406 83915 -227750 110196
6269 -108881 -57519 -147794 140872 43923 -72614 -126528 122929 -147671 -304214 -228488 87954
6257 -11120 133445 -142535 -137618 137403 207417 -64070 30413 313904 -37903 -298368 351855
6245 -102667 281929 35119 78458 18797 -4917 58428 -43124 -82094 55895 -113411 -124584
6234 -124584 -217239 -237395 324937 -120157 261550 -183017 -30655 223086 168751 -22796 -69501
6223 -69501 -183860 41191 -26284 32264 -101269 102024 230156 2341 138946 -84813 -301468
6212 -301468 -304241 126525 -122619 124169 -87646 -268692 115907 404287 -118567 -151754
6202 -151754 159570 -142380 -157108 -165455 -63173 -80483 -218521 168234 -299281 -108370 -26374
6190 158735 78087 -126859 192425 -59911 -192817 -90883 -55671 -145929 197811 -209956 -212156
6179 -212156 35756 105654 -355765 25539 142303 23674 97800 56160 127702 117723 126977 -218314
6166 117858 159957 105711 -220861 -72319 64460 159488 -140348 -258477 -83505 38437 330159
6155 330159 23666 -70517 2020 -209094 28867 -10329 -201280 -106921 -341225 255650 -61058
6143 231357 -30188 -3365 154544 75775 -91263 -419005 -197808 -230624 50223 -181973 102504
6131 -159870 -301478 49683 27300 168406 -190290 -79660 193959 300165 15469 -162209
6120 -190868 -6068 246326 38656 -284146 -41012 -289745 79299 176322 21329 245543 49678
6108 51543 -267039 14070 86378 16081 -162317 -221996 -92867 -111655 -51979 120766 -51040
6096 2415 309995 8142 209094 -103203 165899 -110524 -284824 -237049 104559 -14571 121994
6084 8505 332630 100683 106552 167199 -13844 -120700 -68406 8226 35606 -325613 -14248 33188
6071 -181243 -100011 -126276 -53758 -85129 180659 -254658 -74796 -33414 -149557 -183895 167107
6059 11571 18764 -160178 -177952 38541 10038 137674 -181325 -172369 16517 49432 -154243
6047 -120405 68537 -320549 -37213 -127183 -173221 78442 -93358 -34244 -131068 60987 -129026
6035 -6356 6387 44947 99063 51606 16487 -195232 -73577 -87003 319383 156975 75097 154320
6023 154320 -59112 133407 -186869 108016 28862 113344 52479 -77775 64748 53203 -186250
6011 -170532 -34905 136389 -254479 -55103 -37859 -297975 -33436 125598 59055 200060 -19607
5999 -259188 307128 63141 -242913 62159 109972 457325 17160 -111440 -20295 -157501 -154779
5988 -154779 36144 43774 -67949 76836 -68036 69664 18260 -235514 8923 -38130 46692 45700
5976 45700 44689 112792 137263 89766 -69042 -115944 162947 69967 -217282 -38733 -283085
5965 -283085 353336 -263054 -183751 154569 -33782 96772 -292052 -154157 -111884 43877 -217620
5953 -172375 141960 -447575 -45405 158188 -263539 31998 23563 -106467 -95685 -104837 -62321
5942 -62321 -297358 -204739 117857 128984 -209630 -27851 -138113 -84578 116340 300649 26748
5930 193379 131070 131864 -160318 11591 124478 161972 -85734 185760 -29737 205781 -99018
5918 -62385 79599 -361597 -98907 -46219 -134703 -121200 -402926 214181 41805 165031 -168490
5906 172470 -163861 944 81177 27471 -160793 496458 216820 -147074 -141127 162299 162059
5895 162059 182444 -13695 -2416 165622 136240 -142070 207053 122345 -91958 7942 -182304
5883 39889 -199169 474643 111662 -112279 357257 -326330 -19890 126720 124120 126647 23723
5871 48534 -57954 13105 190005 -96878 -194120 -47643 60040 43284 152590 -33388 -98781
5860 -98781 272010 15882 112389 -161908 68612 -286273 7681 83637 8213 -205521 299623
5848 32087 178531 -156592 1491 -143473 30675 -122658 274240 17019 234579 -231815 -95638
5836 -202112 313306 -290327 134782 -60616 -41881 -125524 381057 -182221 -72288 62958 87841
5825 87841 24972 256730 -34988 -119517 -99892 115302 -38391 -10536 -346823 -184469 -428813
5814 -428813 -128707 -7851 -218267 42341 -429317 -81649 83252 -14309 159203 277974 23731
5802 34391 -146516 -411 -172792 123189 132591 -104501 -256894 121716 -345078 5002 -192544
5790 229140 -75400 137676 -390139 170751 25284 54061 -69434 -42897 131259 116920 -115561
5778 -90579 -54935 145982 70706 208115 -285642 -170585 172210 27357 -379353 -272553
5768 -272553 -76446 158127 -93093 -43065 -148064 -40 159828 55123 20496 452490 -371847
5756 -9985 -234391 -17647 352803 188045 -44978 -28009 124428 63772 269851 155324 136282
5745 136282 -24368 -20523 -165595 -107281 -150245 118011 -194670 125113 15708 -42311 257668
5733 128389 175262 181064 225330 -207297 -193021 235241 -161310 -80875 -462790 -114752 109279
5721 -174911 155610 -125359 51903 -27652 -409703 -78987 -23593 61161 181978 67211 -452652
5709 -177732 108577 -235225 -55718 -257356 -166263 99956 41102 393221 167515 -306415
5698 333276 -63182 -184652 -23337 -326715 -265555 40551 20169 497084 324328 -12981 6035
5686 150070 -75189 232911 68164 -94928 125468 -29638 -80189 18761 11260 -95984 84590
5674 -9863 510923 -102420 -78584 95241 -62371 47426 -69836 421863 -72487 -277649 168067
5662 32070 -160727 -5992 -224232 -206675 54320 113591 351645 85684 194895 28882 -99176
5650 -244830 -19392 -53653 26189 -106052 195278 -110020 -242721 -111048 -236136 128456
5639 -14988 98434 -294252 -126402 259994 142841 46955 283560 18620 392553 -109740
5628 -247213 -253716 -202738 9891 63432 224559 -73169 -208721 5159 194505 -201345 -25958
5616 232552 133119 -73984 65623 -105891 -108420 137836 70561 -343642 156882 -451942 15736
5604 -194575 497020 154729 -5706 209463 -30222 -193809 222597 -242535 151987 211021
5594 211021 -129861 31509 -95468 223038 127481 123708 83853 -71860 171230 10131 -257233
5582 -317685 -36165 293083 25850 88974 -293519 -339084 -224726 -176284 -93106 -116409 -165041
5571 -165041 81308 343629 77227 -80868 -109484 -94149 176093 8219 250168 -39300 -381564
5560 -381564 3672 -347768 -102856 37843 197856 -39421 79333 -277973 201808 -40705 94050
5548 -203685 -154257 250004 141347 -71696 85794 -103649 -43964 161770 216882 161928 118388
5537 118388 -212336 -6909 27096 -163007 -48227 -39696 220762 -364863 -372599 169183 -319731
5525 305305 -399832 -68849 288942 -118997 -282220 -9957 40785 -188353 -237123 161733 -131906
5513 224916 -72084 -238533 219617 -72541 -59028 97 475434 -30840 -249970 208464 -248696
5501 -134768 135919 218111 92283 -7810 -128654 -75418 180678 -127322 281354 -72051 80114
5489 35276 -167193 134125 196611 364111 75250 -67052 13098 -49378 385079 -75156 223199
5477 112932 -386253 -124932 -94589 -30301 19060 19077 93149 9400 -141343 -254158 -108977
5465 293109 279311 44674 101682 -3711 -12287 -155078 -216901 -5690 94133 400716 -76296 -16067
5452 -48186 28105 -65302 49593 -307247 -356293 -395729 175321 12454 24263 -15835 -173330
5441 -173330 39512 -34327 -423843 -36987 -13710 164100 -9395 -143226 -115185 -115246 -377091 177020
5428 -134232 110265 243322 -13894 -360738 -3023 -71660 -185718 -170983 -16345 200447 139375
5417 139375 -7910 -114814 -170727 93653 -94253 -102774 201737 -86481 -75497 -283160 -27191
5405 28831 167918 -57205 65800 -182166 -139738 53138 -102934 -353843 -71252 -3031 -121936
5394 -121936 -11264 -170958 260653 142966 69977 18054 76751 -40270 156853 -233324 -296236
5383 -296236 -117371 -195247 149754 250127 -219729 31006 -395762 138178 -320123 113441
5372 -105516 123494 38684 -65618 -177907 -175280 -143422 152957 -17598 184343 228341 115106
5361 115106 -43279 -13909 -383007 209952 178092 210868 -50335 -50716 75422 -121078 191348
5349 13581 226323 171428 19171 -349095 -234520 -125309 1412 -265021 131533 -236369 201566
5337 62387 285677 -122270 -83385 205443 10503 41952 -1899 130306 190863 -92700 -207146
5326 -207146 131814 383739 202271 -85609 -145251 -68471 -209624 313006 -66085 56358 -123669
5314 -189804 -131393 -4188 -429428 -164547 -101612 67390 -161469 371207 -91397 -19060 -139199
5303 -139199 -152061 -167242 172401 179634 255403 419563 -232471 259068 102738 152728 -271254
5291 11713 -39615 302193 56981 39766 -148673 216138 181906 160806 318095 183476 -54244
5279 46630 202718 -122317 117099 391172 302282 201897 20520 -10515 -130998 -124345 111139
5267 43618 68616 318800 -8193 244038 -298602 -223787 -193653 -332375 253028 352721 100882
5255 -22826 50821 -125834 438876 161541 -36584 75258 124487 187884 26420 20849 -98691
5243 -258951 318023 -147624 -252 417325 -164843 71742 263984 -257266 -195129 75291 -69752
5231 225716 -42293 142602 -94265 -221447 -187966 -124489 -125743 86485 28970 416880 -225466
5219 -35690 224179 -28603 32170 193748 21483 51817 70059 -52005 -46971 -327861 -239685
5208 -239685 -32157 166499 145478 -279333 31016 -153458 51335 -289218 -144187 -17475 270339
5196 36716 -174501 18553 -73010 -3379 113876 -383042 -150927 70092 -63827 92853 -30204
5184 -98267 242673 275450 266570 -49592 -105767 -55601 74810 48064 -119194 -200538 -354151
5173 -354151 -44090 -130400 248313 -86583 -4506 80554 -44191 -129746 79107 28930 -176007
5161 -117259 -89281 259251 133709 -30052 -243630 -9818 -200326 158715 -210504 328882
5150 -19324 -37134 -134367 -26931 267851 5398 120391 -81743 104391 -135297 -265975 165869
5138 235686 149588 -33618 5345 -92538 -94900 9372 333755 64482 114655 61553 6316 127510
5126 127510 -21814 -177946 -51000 221100 -155095 -73392 172604 131593 -255363 38281 38130
5115 38130 217300 20124 15843 167885 170118 117013 -181478 -325796 -84175 -994 -231134 -160159
5103 -160159 -108129 -197748 81713 -185906 18935 79593 -223788 359294 288464 43682 72728
5092 72728 8003 239909 122152 -34836 61634 47020 151178 -153963 60662 -53616 61002
5080 -63713 222665 -30707 -70567 -136561 -53517 -97152 -368086 -48549 -3721 -305817 -112365
5068 -167709 32694 -133087 -317682 -150181 80834 56868 226995 131580 3873 35109 69520
5057 69520 124142 -146884 -78824 -4051 101174 -206094 -298455 -149202 -216393 29811 164960
5046 164960 -245994 274991 -440976 97226 -41019 264047 104023 130284 277503 -167345
5035 161790 352040 -27639 96211 160932 49943 17427 72950 327724 -283927 -91995 94311
5023 41442 -250359 14585 60768 11122 352246 44322 125774 217356 -75084 -133597 -66626
5011 -96345 -203482 -120679 -142340 47464 -338061 126316 209749 -24102 -5997 -9665 226163
4999 -282812 -275948 269769 78280 -28216 127619 126028 -53534 118761 174534 133632 132082 207012
4987 207012 78444 7984 96091 -84945 -46182 406409 -87710 210268 173362 75166 -30149
4975 -32856 -222429 111321 -110288 50211 234754 42733 157616 -158865 20034 -124903
4964 200713 -303837 135851 -141266 -12327 217395 -203344 -2137 -48261 85108 1276 21940
4953 21940 -63460 84621 94145 261433 -73249 233538 22638 247001 -248549 -114040 -180402
4942 -180402 -76658 -118018 -498832 -158976 -46650 -132998 -59875 150139 325743 258687 -187673
4930 -12355 156654 -6860 -254734 213051 151133 -148091 215107 237301 123361 29658 -52196
4918 -261086 20817 32079 -10769 181597 -48554 299973 139950 72991 54698 122754 -89376
4906 -26724 -155880 -87189 137019 -235753 124347 278802 -197690 -196420 32939 -37458 -108780
4895 -108780 -285190 -103536 -144973 48249 279259 130082 -16131 -50898 152087 15997 -419771
4883 -15756 -7955 309497 -44151 200156 -330597 175954 -443948 264866 -120889 69162 93928
4872 93928 -94477 225653 95856 -165935 15642 229706 -199883 41840 259021 -99455 -28980
4860 -19831 190200 94859 -76865 300174 -22732 -109009 98532 72987 -53057 203618 6997
4848 -412584 162337 59876 154537 7897 156601 -61891 -309663 -368961 -109111 -164627 246392
4836 218036 -234065 -104881 -357506 55210 108182 -61838 -45057 41964 233921 78180 -293434
4824 205345 -23560 95870 10111 -148498 -94880 -62660 243992 -43491 -80997 329626 -24194
4812 -21385 66551 171783 -45806 18206 333965 -217350 387334 -111744 -364444 322484
4801 -135205 111914 -162812 -12905 56081 430327 -131325 -81983 -70746 -79696 -278535 -12305
4789 191772 -136955 187712 184523 -17894 -204102 -100646 -219574 10681 -87122 -170767 -9888
4777 229382 94795 -192452 160267 383184 13019 -1850 -206331 88868 287123 -121952 110747
4765 180796 -113523 33426 85143 -236961 -9562 -91286 158118 139184 61887 -139107 29517
4753 -73695 -24922 -148514 -262757 5578 -92452 -44297 -14831 250456 5682 97183 220265
4742 220265 18105 302215 -32816 -15225 48399 139279 -228793 -132633 -80397 -96797 138497
4730 -240896 -160325 62056 -166214 -87239 12956 -390 321478 -210491 -202758 -25045 76850 490295
4718 490295 -175132 -36564 110795 289751 -168973 -281283 68391 -17612 45991 59351 -52544
4706 119720 -21179 188096 -164057 64009 289585 34295 -304845 -66986 -27153 51870 5241
4694 -42815 -95515 -344758 16742 213973 217454 81490 109590 -252401 -352286 34031 93992
4683 93992 -45972 -151303 -25212 98681 126323 -28040 -196563 -195986 22380 175584 -61386 110531
4670 -86247 -67042 -3205 23166 114834 39820 -67482 9578 100001 286988 -127235 -269551 78338
4657 18334 167070 228217 -46343 169836 203628 -63502 196663 -121147 -35201 166740 -426041
4645 166502 208465 -84292 -58413 459809 -132262 -1265 -1041 -217299 93091 -46510 -84464 87261
4632 -50494 -99712 199717 42630 375792 -196875 -85319 -190552 42571 -137660 286659 -201192
4620 66178 -93591 110154 236325 510139 190456 -78513 209391 188251 196703 156330 261279
4609 261279 111640 -200348 -147779 -57063 -158164 -63722 39259 -214228 70403 43331 -256304
4597 -163397 15576 316229 -106967 281279 226242 144241 52909 -89881 11361 94108 252946
4586 252946 392965 -172525 -150108 -155873 190568 50605 -12542 68884 -70688 29884 89940
4575 89940 -236085 -203314 -156580 184387 -79228 136148 -205045 -123917 16091 -116586 110509
4563 -73314 199888 97050 270612 -283490 3128 -150592 135155 373885 -72672 -27722 54209
4551 -106562 -114529 -217212 312884 105244 225365 72220 -80823 272479 -101801 231084
4540 -282862 -273704 -217381 -308405 209901 86865 214414 -25407 -279832 309558 145096 235896
4529 235896 -200086 -221612 36647 63792 125525 -188955 216612 76177 -190880 14133 -304468
4517 497494 -206969 -52967 196538 99641 79226 -80887 60827 -72376 21012 -223367 138403
4505 428094 241458 9822 -66147 -120104 86762 -106278 -61060 -74488 81039 -73766 8276 304682
4493 304682 91877 -206810 -164916 19557 -294769 -74014 373243 -139305 256252 -5816 578
4481 333001 28478 208168 -230024 -298256 286425 271554 105720 21963 78751 -114127 124798
$$ [...]
##END NTUPLES=NMR SPECTRUM
##END=
