
##TITLE=AC1143_Valledupar_5874666_tQ3Y5EkvwF
##JCAMPDX= 6.0         $$ Bruker NMR JCAMP-DX V2.0
##DATA TYPE= NMR SPECTRUM
##DATA CLASS= NTUPLES
##ORIGIN= BRUKER
##OWNER= Administrator
$$ 1.72 TOPSPIN		Version 2.1
$$ 2012-03-31 16:54:09.343 -0500  Administrator@TOPSPIN
$$ Compression mode = diff/dup
##.OBSERVE FREQUENCY= 400.13188235
##.OBSERVE NUCLEUS= ^1H
##.ACQUISITION MODE= SIMULTANEOUS (DQD)
##.ACQUISITION SCHEME= undefined
##.AVERAGES= 8
##.DIGITISER RES= 22
##SPECTROMETER/DATA SYSTEM= spect
##.PULSE SEQUENCE= zg30
##.SOLVENT NAME= COFFEE_meoh
##.SHIFT REFERENCE= INTERNAL, COFFEE_meoh, 1, 14.98061
##AUDIT TRAIL= $$ (NUMBER, WHEN, WHO, WHERE, PROCESS, VERSION, WHAT)
$$ ##TITLE= Audit trail, TOPSPIN		Version 2.1
$$ ##JCAMPDX= 5.01
$$ ##ORIGIN= Bruker BioSpin GmbH
$$ ##OWNER= Administrator
$$ $$ C:\Bruker\TOPSPIN/data/COFFEE/nmr/AC1143_Valledupar_5874666_tQ3Y5EkvwF/10/pdata/1/auditp.txt
$$ ##AUDIT TRAIL=  $$ (NUMBER, WHEN, WHO, WHERE, PROCESS, VERSION, WHAT)
(   1,<2012-03-31 16:54:01.921 -0500>,<Administrator>,<TOPSPIN>,<go>,<TOPSPIN 2.1>,
      <created by zg
	started at 2012-03-31 16:52:54.781 -0500,
	POWCHK enabled, PULCHK disabled,
       configuration hash MD5:
       1A 1E CE 29 27 FD 77 03 67 4E F0 E3 C4 B2 CB 90
       data hash MD5: 64K
       4A C6 D3 E7 02 D0 D1 B2 7A B5 E0 6A 35 23 CD 6F>)
(   2,<2012-03-31 16:54:04.812 -0500>,<Administrator>,<TOPSPIN>,<proc1d>,<TOPSPIN 2.1>,
      <Start of raw data processing
       efp LB = 0 FT_mod = 6 PKNL = 1 PHC0 = 0 PHC1 = 0 SI = 32K 
       data hash MD5: 32K
       C2 6F 84 C7 F8 04 D1 D7 82 52 80 92 DA 66 1B A6>)
(   3,<2012-03-31 16:54:05.234 -0500>,<Administrator>,<TOPSPIN>,<proc1d>,<TOPSPIN 2.1>,
      <pk PHC0 = 211.8384 PHC1 = 0 
       data hash MD5: 32K
       D0 4F CE 53 EB B7 3B 91 1E 7C 08 34 C5 B0 C1 83>)
(   4,<2012-03-31 16:54:05.312 -0500>,<Administrator>,<TOPSPIN>,<proc1d>,<TOPSPIN 2.1>,
      <abs ABSG = 1 
       data hash MD5: 32K
       B7 44 E3 88 66 90 3F 31 23 9E 9B 04 20 43 AB 7E>)
(   5,<2012-03-31 16:54:05.343 -0500>,<Administrator>,<TOPSPIN>,<proc1d>,<TOPSPIN 2.1>,
      <abs ABSG = 2 
       data hash MD5: 32K
       F7 08 DE 81 4D F1 70 93 34 AE FF 84 B2 CF 7A 5E>)
(   6,<2012-03-31 16:54:05.375 -0500>,<Administrator>,<TOPSPIN>,<proc1d>,<TOPSPIN 2.1>,
      <abs ABSG = 3 
       data hash MD5: 32K
       6C 5F 4E A9 B2 68 DF 09 79 1A 6F 71 6C F4 3C FB>)
(   7,<2012-03-31 16:54:05.406 -0500>,<Administrator>,<TOPSPIN>,<proc1d>,<TOPSPIN 2.1>,
      <abs ABSG = 4 
       data hash MD5: 32K
       E3 5E 1C 98 BD 9E DA 41 32 38 51 10 01 BC 61 83>)
(   8,<2012-03-31 16:54:05.437 -0500>,<Administrator>,<TOPSPIN>,<proc1d>,<TOPSPIN 2.1>,
      <abs ABSG = 5 
       data hash MD5: 32K
       13 88 ED 9E DB E7 04 92 AA DC 2D CC F7 27 5D 2B>)
$$ ##END=
$$ 
$$ $$ hash MD5
$$ $$ 83 CC 33 C4 85 87 EB AF 6E 3D 73 A3 B5 4C A5 F7
##$RELAX= 
##$RELAX= 
##$RELAX= 
##$RELAX= 
##$RELAX= 
##$RELAX= 
##$RELAX= 
$$ Bruker specific parameters
$$ --------------------------
$$ [...]
150 150 150 150 150 150 150 150
##$TP07= 0
##$TPNAME0= <>
##$TPNAME1= <>
##$TPNAME2= <>
##$TPNAME3= <>
##$TPNAME4= <>
##$TPNAME5= <>
##$TPNAME6= <>
##$TPNAME7= <>
##$TPOAL= (0..7)
0.5 0.5 0.5 0.5 0.5 0.5 0.5 0.5
##$TPOFFS= (0..7)
0 0 0 0 0 0 0 0
##$TUNHIN= 0
##$TUNHOUT= 0
##$TUNXOUT= 0
##$USERA1= <user>
##$USERA2= <user>
##$USERA3= <user>
##$USERA4= <user>
##$USERA5= <user>
##$V9= 5
##$VALIST= <valist>
##$VCLIST= <CCCCCCCCCCCCCCC>
##$VD= 0
##$VDLIST= <DDDDDDDDDDDDDDD>
##$VPLIST= <PPPPPPPPPPPPPPP>
##$VTLIST= <TTTTTTTTTTTTTTT>
##$WBST= 2048
##$WBSW= 25
##$XGAIN= (0..3)
0 0 0 0
##$XL= 0
##$YL= 0
##$YMAX_a= 529984
##$YMIN_a= -650313
##$ZGOPTNS= <>
##$ZL1= 120
##$ZL2= 120
##$ZL3= 120
##$ZL4= 120
##$ABSF1= 14.98061
##$ABSF2= -5.57192
##$ABSG= 5
##$ABSL= 3
##$ALPHA= 0
##$AQORDER= 0
##$ASSFAC= 0
##$ASSFACI= 0
##$ASSFACX= 0
##$ASSWID= 0
##$AUNMP= <proc_prof1d_extract_pilot.lims>
##$AXLEFT= 0
##$AXNAME= <>
##$AXNUC= <1H>
##$AXRIGHT= 0
##$AXTYPE= 0
##$AXUNIT= <>
##$AZFE= 0.1
##$AZFW= 0.1
##$BCFW= 0
##$BC_mod= 0
##$BYTORDP= 0
##$COROFFS= 0
##$CY= 15
##$DATMOD= 1
##$DC= 0
##$DFILT= <>
##$DTYPP= 0
##$F1P= 0
##$F2P= 0
##$FCOR= 0.5
##$FTSIZE= 32768
##$FT_mod= 6
##$GAMMA= 0
##$GB= 0
##$INTBC= 1
##$INTSCL= 1
##$ISEN= 128
##$LB= 0
##$LEV0= 0
##$LPBIN= 0
##$MAXI= 10000
##$MC2= 0
##$MEAN= 0
##$ME_mod= 0
##$MI= 0
##$NCOEF= 0
##$NC_proc= -8
##$NLEV= 6
##$NOISF1= 0
##$NOISF2= 0
##$NSP= 0
##$NTH_PI= 0
##$NZP= 0
##$OFFSET= 14.98061
##$PC= 1
##$PHC0= 211.8384
##$PHC1= 0
##$PH_mod= 1
##$PKNL= yes
##$PPARMOD= 0
##$PPDIAG= 0
##$PPIPTYP= 0
##$PPMPNUM= 2147483647
##$PPRESOL= 1
##$PSCAL= 4
##$PSIGN= 0
##$PYNMP= <proc.py>
##$REVERSE= no
##$SF= 400.13
##$SI= 32768
##$SIGF1= 0
##$SIGF2= 0
##$SINO= 400
##$SIOLD= 32768
##$SPECTYP= <>
##$SREGLST= <1H.CDCl3>
##$SSB= 0
##$STSI= 32768
##$STSR= 0
##$SW_p= 8223.68421052632
##$SYMM= 0
##$S_DEV= 0
##$TDeff= 65536
##$TDoff= 0
##$TI= <>
##$TILT= no
##$TM1= 0
##$TM2= 0
##$TOPLEV= 0
##$USERP1= <user>
##$USERP2= <user>
##$USERP3= <user>
##$USERP4= <user>
##$USERP5= <user>
##$WDW= 1
##$XDIM= 32768
##$YMAX_p= 472944411
##$YMIN_p= -764099
##$CURPLOT= <Network HP LaserJet P1505>
##$CURPRIN= <$Network HP LaserJet P1505>
##$DFORMAT= <normdp>
##$LAYOUT= <+/1D_H.xwp>
##$LFORMAT= <normlp>
##$PFORMAT= <normpl>
##$SURQMSG= 1
$$ End of Bruker specific parameters
$$ ---------------------------------
##NTUPLES= NMR SPECTRUM
##VAR_NAME=  FREQUENCY,     SPECTRUM/REAL,   SPECTRUM/IMAG
##SYMBOL=    X,             R,               I
##VAR_TYPE=  INDEPENDENT,   DEPENDENT,       DEPENDENT
##VAR_FORM=  AFFN,          ASDF,            ASDF
##VAR_DIM=   32768,         32768,           32768
##UNITS=     HZ,            ARBITRARY UNITS, ARBITRARY UNITS
##FACTOR=    0.250966925370066, 1,           1
##FIRST=     8223.43324360095, 91,           -19717
##LAST=      0,             49305,           -235086
##MIN=       0,             -764099,         0
##MAX=       8223.43324360095, 472944411,    0
$$ Real data points
##PAGE= N=1
##DATA TABLE= (X++(R..R)), XYDATA
$$ [...]
23728 89666 -166353 -58688 214471 -114024 179279 342936 -28873 200044 11454 -212539
23717 -123098 -7333 29114 -143563 -51768 238642 51718 127136 -161101 176099 154491 -27598
23705 39041 -85398 366663 -64462 68814 221752 -9285 76900 17246 -113531 -107441 49641
23693 -208687 -133631 -6730 -173993 -62644 -105142 61264 -11130 79614 78495 219962 -304238
23681 126462 2467 199247 -174444 111341 -116498 67601 199083 149229 133765 -160020
23670 -201370 226148 -63315 -306905 -287977 211975 333254 -78404 211450 -146547 30424
23659 -271370 -273395 -260384 -219532 -58661 168486 113851 27044 245131 -52499 -330799 -330976
23648 -330976 -154260 -34574 91571 141631 -83412 409561 -201003 -248036 -101938 314127
23637 -28807 127441 -196716 -122838 -18754 92453 -190408 16314 306425 23570 -33997 -129327
23626 -129327 82496 -253815 -261404 -122675 123539 -192544 89893 -90751 72518 -49513 61406
23614 -60816 -23089 -36869 24865 -99981 75993 119913 -53961 158002 202510 -200301 -151092
23603 -151092 204298 176394 8179 158600 -294433 3340 -354757 79188 -18903 92299 129557
23592 129557 -18552 -191272 -100675 42037 170258 22114 138521 290420 573220 144418
23581 242308 -47014 283474 66317 20220 48354 22388 314193 150056 -124551 -292573
23571 -292573 -181924 26059 33977 -150899 230622 69131 92943 -19753 -99031 -97204 126182
23559 -324852 22483 91596 90657 -4890 -68458 85332 -273928 -56509 -163371 447472 -352010
23547 293173 193741 226156 155535 243553 36173 -69372 60436 -106875 -159051 17677 176207
23536 176207 60391 -313139 12632 -99155 94398 104788 2539 75735 187055 124735 -419789
23524 217938 -33349 14435 82813 -204699 123519 -46572 -80604 241610 -145320 956 204529
23513 204529 -371654 -238968 -70095 -169990 441048 -64009 -452 -111172 25296 238826 -131559
23501 135553 30439 -264823 -54527 -254433 -17878 49402 -126776 -197380 -68495 -370861 66934
23489 -48577 -150717 94268 -49200 86539 -9212 369415 150482 -123114 -149240 100716 -224909
23477 2279 -178563 -124010 116443 -27891 -146286 101679 352074 -82892 -241399 76124 66731
23466 66731 155517 -42820 204407 -329496 90236 315579 132449 72092 5530 238143 333624
23455 333624 92829 96600 -237601 24954 -40909 89416 9716 39569 -119499 -83356 -185568
23444 -185568 -457580 45839 -268661 -134501 -56827 -127271 83314 62611 80067 92518 -8194
23432 -152744 -203421 -53619 -262318 62520 24207 -48885 -291546 103870 136885 117970 98810
23421 98810 -134655 122978 6765 -229905 79400 185496 -250268 118116 -78098 -67608 19062
23409 67552 267773 -176457 66419 -11973 41027 -20656 -106979 -75578 -72972 -43993 -218972
23398 -218972 -219719 166838 -138431 69525 -31493 198162 183888 44180 67071 50539 -252598
23386 175116 -285220 -189345 181011 -52835 -124767 344396 -243827 -203312 -82912 94474 -113851
23374 66059 -102831 -15960 -251187 -27003 -82018 24287 193947 -146105 -119 8514 241861
23363 241861 104226 -125135 -288010 11561 100260 10547 -104826 96276 -50372 50781 -212644
23351 -9924 -99133 -142778 -42431 -88293 -91467 -234181 -364768 -155151 181719 -374697 -96228
23339 -277589 181618 -52075 -131780 90879 -36348 -178791 192240 254064 -155738 148268
23328 122356 1840 -4146 153225 -48334 -107317 5465 -5472 -103594 -21805 24497 -6827 -1702
23315 141116 -240849 -46736 -326407 110585 -44719 114209 -272180 17246 -153256 94479
23304 3564 -66938 -265030 137897 111428 110905 212053 -214424 75123 81503 145985 20976 148206
23292 148206 11914 -102458 -143762 -161762 117777 64231 160760 -270888 273001 -413801
23281 -62112 43947 -110760 301228 47637 -203481 6669 82626 21605 -10326 40717 -109963
23269 -66522 78472 80585 -165469 -98530 -37178 -126496 158181 -124685 -132895 -36644 112819
23257 183574 41021 -103422 -92892 -212014 -100147 -146913 -321221 -213579 -63591 110516
23246 -145866 -16597 160241 87159 -297345 26818 77381 -134298 -2231 -55849 82456 214190
23235 214190 -51782 -289453 -12361 152438 98729 -87645 277392 -100506 -162776 242682
23224 -380290 166987 -37966 -124594 -70654 166174 96563 -24702 42773 132566 195620 -296291
23212 111269 -122410 -177294 -256578 87710 52146 -233351 -128499 -434175 -60043 118333
23201 109182 -121657 79134 -280956 55170 128643 20408 -116921 -113258 -101081 89099 268442
23190 268442 -173123 186193 -31038 117314 -54060 -62563 131092 113482 -125573 -8263 44817
23178 -201913 -4944 54719 188227 147398 1040 -64168 -79226 -169084 -58052 -4253 -132548 62293
23165 57183 142771 -103695 189263 -4536 -77065 27333 -22873 6471 57467 -157181 257554
23153 110969 67977 -307362 157524 -163016 -132264 -18193 176960 -285128 85302 -92487
23142 -28688 114068 265615 49199 224538 22902 125881 -325531 -132413 -288922 54960
23131 -355583 31416 -302568 -132787 -10072 -213721 -126030 -34433 150264 -338292 160505
23120 158238 101203 -311319 -78168 116243 -467039 -111768 -243126 14688 -14349 90131
23109 83013 156590 484514 -50569 -70689 60257 -165703 39728 108 55366 -148860 -284228
23098 -284228 -51466 -348174 57433 -429865 -246016 -179228 -286492 172264 -6874 212174
23087 164490 555548 243418 -388485 -121332 69457 -128977 27275 -133561 -189446 -184042
23077 -184042 105768 317873 102206 -208305 11805 135348 41823 -48884 212788 -97633
23066 -14940 -298992 -126875 -85218 -380126 -276954 -207670 101168 -266256 -287629 -147074
23056 -147074 192214 16475 34638 138498 87669 227208 165320 -67936 73003 42070 64091
23045 64091 -308100 -119550 299615 48556 -4392 253209 174428 160004 -32371 137299 230815
23034 230815 -49722 387681 -23176 118710 -58865 70824 -81476 -167772 149783 -260357 2785
23022 -189729 80164 260228 -172761 -290165 -25429 1194 -185877 -20535 -12352 61129 -307395
23010 54765 -140888 298428 -334861 220899 7753 186496 -179939 -93209 -30784 -54099 -57980
22999 -57980 -84972 -4499 39476 -186544 -131999 154792 22158 -150361 369462 212709 -146415
22987 -196843 -184313 -103021 -4440 230006 219523 -165578 -260708 -77346 56735 -40914 126759
22975 13615 235110 -155827 -214779 -211493 -234017 -120016 144417 -46834 152203 145801 62171
22963 19851 -165715 -333826 -159454 -220536 29337 143315 75481 -18289 -74836 -57168 3645
22951 -71247 -73966 -211463 -63055 34910 -265660 -171841 200977 8323 -123456 99161 -185362
22939 -45557 65448 -205460 93305 49908 8685 78165 176380 -113466 -4376 -54118 8435 -26508
22926 -169834 -151027 -172555 -120868 194851 38274 -243263 -81191 4737 -70438 -287417 -116988
22914 181291 -756 -54283 25039 77640 224870 68077 -207730 9356 243313 142583 -118486
22902 -115433 -122363 -340389 84122 165543 -329085 204745 -7836 213885 25585 98529 -180451
22890 -279504 -68327 119957 -19597 1990 334340 -127049 -258361 -86214 59400 -372930 6874
22878 -229175 -97498 -98527 -217455 183210 229120 193534 -11713 -1271 -91787 6014 -210161
22866 66092 23420 -257147 -46920 -140710 -142025 -308507 164612 106294 -212128 146910 -77596
22854 127648 -13146 250967 211985 -318817 -222770 48813 111274 -217523 -11592 101249 181247
22843 181247 58877 -97953 -138641 -436894 156915 -137185 -221360 40873 121103 -110094 275327
22831 254307 69495 -268362 -10198 37956 -400323 33926 -51905 -10094 30027 -4882 149616
22819 49555 -76496 260580 -247714 -458612 18612 -3918 -314266 78327 64557 -114718 66146
22807 68203 -2644 -220855 -63901 -124518 213416 -164816 -58199 307213 12591 -65587 -172909
22796 -172909 -165751 -92474 -65618 -69673 -84495 52155 63049 221662 65445 -148806 -99304
22785 -99304 9086 -113092 -194496 -216056 -77227 -458716 -72291 -6286 -167128 -235380 -996 300039
22772 -151088 -444462 -11115 167134 42186 95128 298858 -77194 -94528 -107177 209768 -199607
22760 73076 27828 -346253 79214 117226 221679 -159499 123288 279940 -101217 135372
22749 -107734 55400 -262015 -64350 -203685 -279765 -87352 -14754 -163612 -226785 -467109 -49709
22737 175981 -234392 86649 231652 134068 290337 -104951 -309272 -318826 81800 134261 67497
22726 67497 -156740 -27021 77221 -397123 -5972 -31794 50028 -95991 -179038 114341 14917
22714 -231506 -102485 -121967 -27961 130071 -25430 343938 99013 403 -49031 91026 -163389
22702 233692 -34657 -18849 -213576 -94328 -170947 -51951 -43322 134366 -80893 -70217 193975
22690 295680 -133634 -523135 -264829 126725 196686 -436665 47644 139491 -21268 -84692
22680 -84692 -175068 119812 96408 -41194 16016 -16758 -59476 -193337 -25982 -31703 -176946
22669 -176946 141793 195842 31651 187473 -345123 -28111 101263 -201803 69216 524 26558
22658 26558 -181432 -93422 -333313 -79161 102265 89297 -23278 -145535 -72682 -81997 -250408
22647 -250408 252459 302960 -17036 -38591 -115843 -28713 -9615 -74906 -38057 -70161 80667
22635 -136245 -112776 -156461 188829 -847 -36616 193902 -273695 -161353 -50416 -164792 -158708
22624 -158708 275179 -151915 -97214 178813 -145549 -295427 20725 122203 -29198 100253
22613 142442 152779 -110860 30597 -69002 -97276 169079 89884 -13367 -129227 -91720 77587
22601 151167 -162171 167644 -67077 148141 85899 -106076 51480 -89488 -218328 232309
22590 122639 -30888 -20893 -4074 -100464 104473 69167 -57114 4147 -39313 -401573 -105580
22578 -189066 7852 -352058 250056 59177 227262 201528 -14549 11749 254163 -98371 -132204
22567 -132204 159113 -70957 5441 -90446 25417 244549 66141 -100396 203315 -103766 -43755
22555 287972 -395824 390626 -170707 243821 97730 113089 14066 -107851 -54382 -145255
22545 -145255 -123402 -102892 -105844 -29939 -73491 -117224 -42619 -8393 -232431 9109 157814 -92727
22532 -160772 11038 103571 49792 -150965 -273441 -128071 14577 -86316 156556 -37346 -304772
22521 -304772 9604 -392263 17142 310723 314389 -24686 -78576 103338 -7952 -64092 63807
22509 -3672 -412445 116897 138057 -40567 18877 8376 -158157 11216 -339995 -154356 -70610
22497 -327233 -44240 110129 -159467 -371601 -84220 150538 -52629 28610 98490 -129487
22486 59929 52858 169257 -180307 78009 -58728 -137978 -43721 187646 128873 104194 22634
22474 37967 -161936 64247 -262410 -117505 18751 -176402 -49044 -73139 -48910 -194463 -322964
22463 -322964 -125394 -282314 -69860 -157725 -66502 -177910 -209249 147220 190732 67175 44945
22452 44945 -24833 -70875 -19268 25772 12075 -19323 128124 -17116 136532 -121559 -62865
22441 -62865 146473 -188407 -61162 259101 -104302 166239 -232211 -129970 222736 109738
22430 -6518 -192394 -251566 199535 -365201 -30093 -57907 -273591 112863 -53205 -6400 118688
22418 -133286 452904 -48490 -83298 -78895 162027 92123 -136249 -165450 43720 26882 -140511
22406 -173817 84575 -65438 412442 320878 -257058 -165619 -318857 -159709 -42889 65297 108338
22395 108338 -29718 355628 -10672 -517467 247190 26991 8843 131434 164768 -128915 106490
22383 308714 3309 -240336 118355 -3508 -120616 16733 -137656 -10992 78038 -286536 27992
22371 -331514 -285767 -166638 -141487 271706 284757 -342307 63546 -235952 -107391 -199650
22361 -199650 -12375 -77932 279208 12606 -284578 35412 -21120 -350872 -58081 264863 -146237
22349 -166672 134582 24712 -379801 -139010 195540 30510 -38152 -124053 128480 -146345
22338 -142659 110768 -139034 -19568 6246 19253 94202 128764 148637 -49564 31816 63492
22327 63492 71806 243103 -82856 227489 245041 28428 97774 -104613 127776 22018 220803
22316 220803 -91611 -4925 -62440 -286185 17970 56909 175705 81134 -266447 -47539 -88729
22305 -88729 -1533 -258879 -5304 -372624 -264219 -134045 -173985 7345 -31678 -160749 -191257
22294 -191257 17359 -127729 -212033 -727 56891 -14033 -14849 121905 -149438 -137798 196487
22282 -314173 178918 252215 -35794 -224525 113829 183164 -39480 -127068 -10031 -50012 -395899
22271 -395899 201433 175346 28837 242345 44423 163841 305580 160843 -73065 319357
22260 -229658 89010 63524 -39216 -261492 77921 -44440 159223 100920 -196819 -259621 158421
22248 -262824 142787 101821 -20738 151872 -284061 -108194 110473 -187805 142852 161227
22238 161227 -87880 232066 -212353 -111216 -87646 -257588 -2523 60512 -147316 -77961 -34919
22226 -25837 249246 -258877 -416236 -272187 208209 82329 140401 -484236 -181539 -303879
22216 -303879 -256939 -332709 186633 -121449 -47715 151691 -335259 117165 131787 116704
22206 116704 -280031 -127084 -166662 181468 2607 172959 -244726 -46477 -10678 23663 -43802
22194 74913 -149636 -134100 -173991 -100460 152330 7205 160344 -77077 79284 -72409 -132401
22183 -132401 76194 175587 -473589 -187189 162824 -36439 86415 98922 -211097 206376
22172 -317768 76387 30779 49500 -361263 -517171 -195622 -137870 -201843 -36030 -71987 -100976
22161 -100976 98708 -107370 27966 -58064 -5642 -410948 -242530 -11169 -109978 -103701 -96993
22150 -96993 150705 116348 101803 -50599 221241 -218475 -183520 -278041 72725 19717 -193730
22138 -185385 133776 23770 50493 -213299 49283 -201469 126992 36084 129815 -427894
22127 -79956 258863 -45867 -55833 83667 199411 -110508 112224 113844 254687 123936 27936
22115 94959 -178662 -74041 -151017 -203449 -303538 -258990 -251451 -230415 44615 136644 14358
22103 102590 -334859 -220073 -77078 -238945 37030 -101505 79035 -222956 159994 -7689
22092 -157195 28977 109223 290251 -27446 61621 -130433 -39145 -98339 -229613 240510 -179239
22080 -265370 -231641 -84551 259639 -70702 -254148 -290669 -58637 89499 -26734 181836 -303185
22068 -110304 31337 60596 -271817 -112985 -35195 -217611 -277478 -246484 204300 -56608 -59841
22057 -59841 -183945 80383 26432 -28858 -88217 -117131 -237381 -17629 -419774 -17156 -93898
22046 -93898 -184312 -34001 -278470 -109835 334315 -71537 -351966 -137078 -10114 -250077
22036 -250077 169864 -411988 -45655 -366108 98641 144327 220478 -439101 94977 -235490
22025 -203303 151345 73452 60044 -144511 197690 -150891 38073 -498855 -70115 -122557
22015 -122557 -151876 81931 83456 52268 -322410 241427 20179 -139572 16073 -65422 -13626
22003 -166863 37818 -69051 -38750 -57963 -225029 162058 -368199 -50975 455466 -80156 -104250
21992 -104250 -109186 -70217 -90335 52871 -131487 864 -87248 227377 -286955 -213975 77053
21980 -325148 -250203 125734 143167 113116 316783 -177446 -125567 -26823 248082 337830 97352
21968 -197861 110031 13753 -347591 -49716 -86526 187456 -87139 236606 50205 -5876 127346
21956 -125279 22357 98611 -82164 333946 -83714 -4328 82126 -241319 1639 8986 -69192 9743
21943 229015 92524 -239341 -188289 150278 -116866 169654 -290500 -320332 -34441 58026
21932 116614 -185005 -29295 293438 -22826 81389 -114099 -154993 -276088 -50878 -90698 -306894
21921 -306894 -192489 119704 -195630 -197538 192841 -206217 146630 -87392 -156538 -201710
21911 -201710 -382195 29037 -63724 -41402 -135551 -48672 -122266 -154754 471829 -52888 -192742
21900 -192742 -50661 -208321 -239484 -57940 -135283 48836 -92346 -394230 -178097 -187237 315479
21888 -10316 -95815 11949 -234749 -312205 -133682 -131165 -121238 -95000 53280 24659 -318789
21876 2111 -124419 332667 -75253 240003 -197484 -125090 70545 -299185 -148480 -104809 -78122
21865 -78122 150536 -259350 188004 -420547 56163 -208909 -346907 -68279 -166120 -125227
21855 -125227 68063 -178569 -85435 28837 90787 -217169 -206917 81343 -176800 -45893 -223943
21844 -223943 26244 -7907 -69621 37348 -353418 -88388 231931 -24819 -59206 -218045 271204
21832 -270124 50494 323845 -108465 23706 -138070 151745 -324171 -27751 13940 -69811
21821 46143 -291564 50715 -132459 58328 71543 -284601 -69869 95520 20356 -20028 -320427
21810 -320427 -101520 -51536 -6855 -79526 -57918 47458 218689 -5164 -270688 -234223 -1411
21798 -66668 -56989 -94420 -144917 -2980 -193665 -54030 -117799 -264478 -105729 -250257 -85462
21786 -135896 -180093 34029 -267738 256686 34844 124132 61781 89123 -37539 124587 132403
21775 132403 -166501 -152516 49866 -46389 -46203 -155082 294873 -146910 63751 -119194 214440
21763 197526 9705 -47701 33764 -269977 -161467 118139 212586 -192664 85644 -120062 188552
21751 -116410 -159406 -139871 172456 123810 -239437 -268019 -176260 138688 31129 -16170 -132542
21740 -132542 121022 173563 -164630 -27881 -157025 386878 -242774 -287212 -44517 -32147
21730 -32147 -83064 -137973 -50662 -133374 74192 8517 -315338 437648 -85373 -8413 205098
21718 -51073 -638178 -68958 -126769 192721 -18299 -301059 121820 275239 -132091 -142793
21708 -142793 25464 -21957 -36777 -13281 58842 -324994 -193227 110010 -122062 116851
21697 182385 -141870 152951 189495 -37912 -10750 -25617 -140814 -294167 160879 -336264
21686 59055 -51240 90110 -7542 -292614 52399 -193913 102345 -45250 -116997 -189406 176071
21674 -203062 -66159 248648 -171131 -139369 -84155 -248241 90603 -15822 -7535 -25690 -938
21662 23484 -223671 -139764 219053 169394 -447728 -125649 5313 -113046 -177481 82876 295050
21651 295050 -223437 228167 -76446 -94153 -117436 -116363 -67519 -82454 -88611 42482 -16228
21639 43964 -138758 -165650 272773 92678 -218434 -81237 181774 36279 26164 -116245 -371151
21628 -371151 37004 40341 -127752 80082 14093 -179329 224565 -96704 -98496 -92933 64822
21616 -74801 13557 -28549 -270929 -86411 2781 -92479 -310367 -312134 -64325 239953 4955 -255821
21603 -47575 -37203 -337879 -12758 84564 107280 -76090 -389390 -256892 -212786 -131618 -281365
21592 -281365 48527 -64346 74172 87820 4649 109870 162448 -122146 -111082 -35912 -20110
21581 -20110 -81569 -77393 -11847 -136104 123299 -105828 -147427 193389 163424 134751 19335
21569 -3242 -245188 -30502 -198041 -33344 -103399 80586 -88824 -92108 70338 -261657 -102887
21557 -1620 192479 -83992 175153 -186722 -126158 228007 77280 -82655 -50922 -235662 -117465
21545 -140809 286594 246626 -202916 77457 -278505 -64410 -28397 131282 -124563 -270411
21535 -270411 -316493 -243505 -115528 258263 388027 138675 129187 -144662 -323173 -165141
21525 -165141 -97946 -134189 -24781 -57634 91767 9834 -163723 -154540 -3054 -124227 1216 -206800
21512 -53710 -42743 48588 -213764 -311436 -246699 -329230 -112094 -105981 233992 129977 -66577
21500 -243850 -288424 59680 238055 -147836 -4916 -25675 271015 -208567 -254838 -155068 -264588
21489 -264588 -175393 96829 -37719 7126 -38992 -232547 110017 -255697 -202930 -223017 34664
21477 73814 29761 -152401 202345 367827 -319778 -147296 232955 -86753 -23770 14047
21466 -74635 566863 -62633 -273010 -117519 -31565 -421507 -115793 -92392 89096 -157055
21455 237195 -21298 -443204 -135396 -67539 -137950 -207660 8156 -178407 -223449 -128374 153217
21443 -200692 -63156 -73988 -25258 125194 -231391 99889 -120290 112436 -163136 -190517
21433 -190517 244191 -17253 -134642 -76362 -34815 -189525 114720 59624 13361 210768
21423 210768 585625 233468 95275 431357 216912 471696 -94969 120398 79184 274271
21413 274271 -279662 422553 -360087 59876 41886 -146911 96224 9701 -21525 -295292 -54026
21401 144779 -115372 8604 -13461 -106580 50078 28839 177030 -137717 118843 -175851 104163
21389 -232149 -239250 393 -201472 -115891 25934 -147083 183085 95212 534 -209830 39344 -67823
21376 174847 -176471 -75277 -201221 -2251 -300084 -203045 -43907 177616 21354 21792 44407
21365 44407 34838 310825 -232651 -188738 -15137 -37428 -118808 135301 18255 -188853 154891
21353 -288761 -211910 -123359 -63712 -343844 77823 -69015 -190683 -45446 -112393 -44864 17221
21341 -186639 -79195 156156 -82910 84634 26620 -169601 -285406 42063 -56768 3546 -84488
21329 87142 78604 -197834 44383 16116 -195563 -306560 20349 40089 167961 -91071 -236468
21318 -236468 -131370 41468 -132236 219296 -399111 -266965 -289925 22674 -43924 -9866 -298950
21307 -298950 -151107 -205938 27063 102523 -181297 -210914 -386120 -104304 -102689 -298737 -66817
21295 197932 68186 -297844 -185523 97564 111441 125589 -153942 -226751 -167500 -192783 -62448
21283 -79883 115996 145833 -25838 -188186 -397556 -117420 -523797 -336865 -163039 42012
21272 94358 -103320 96535 225263 -41239 -164391 -103107 -282788 -2580 -104351 183994 -256527
21260 87607 -173196 99036 110737 -244045 171039 -159412 -311406 -223580 -176121 17351 344335
21249 344335 -17430 143820 114520 -78392 122178 48017 -7074 -188342 -302741 -19493 181362
21237 84720 -26590 201055 -124062 -183308 220878 -106836 72365 -417889 13067 -143510
21226 -225686 232056 -105585 -31540 274793 16273 -9763 -80196 -306807 -123363 -194561 -253860
21215 -253860 17482 182309 -116150 -35337 -139914 -329128 21981 -248675 261107 -200567
21204 -92739 27511 53551 -427963 -369084 -74626 36450 -168471 -125197 -94205 -161443 37483
21192 -145428 -348607 123787 -192563 35508 -115732 -2330 183671 -286440 114981 20839
21181 -322983 -248033 44151 -191753 -398364 -292104 -2928 -281851 -222937 -44280 -123425 -299693
21170 -299693 -398801 4900 -27512 -296017 55618 -141133 -195547 -249697 -42009 -111859 116508
21158 -108569 -81031 40063 203805 -168336 -17304 -156775 -281447 97814 -47191 -196684
21148 -196684 121250 -15748 131842 19386 255828 107598 -289612 -41886 80993 -1798 86180
21136 -148223 -368194 200788 -152588 179624 194666 -15864 -164412 153682 -174948 175094
21125 -83788 -213212 -132061 -9212 60883 159127 219245 -155770 -57501 109672 -199317 312314
21113 -47193 -38260 13766 -126731 -301630 2699 74092 -48217 21233 -227684 132085 -183211
21101 -201663 -31373 -48074 -96916 470972 -110277 -216423 -105394 -190965 -140302 27582 -17865
21089 -32109 -210524 -369488 285837 -179686 -119401 108208 -326887 -12369 -194783 348409
21078 105043 -172088 176452 53728 -418223 176468 -74986 -133181 155845 -116863 -213945
21068 -213945 -46190 14267 -62869 -18972 165798 54262 253613 13802 33140 -55632 -58704
21057 -58704 19451 -46525 160900 45503 -28906 315121 -204439 -124801 -206941 -157658 -98963
21046 -98963 2197 -92083 16625 -409038 -129776 -20923 112790 72032 223371 -396016 60119
21034 253424 11829 27471 39675 -177564 256271 -338100 -61069 190775 131271 115348 216551
21023 216551 -207859 11243 -176917 -93328 259045 -45036 -127463 25346 44103 349296 -288409
21011 69757 -138877 132431 167 76142 -128771 -90085 -60082 -217696 61235 177314 34437
20999 -19724 80119 -211650 89194 -69507 77298 226640 307371 477354 -135522 -72879 198850
20987 -101259 -135159 -356886 -113085 59261 -163326 143955 -295714 -24544 281480 394318
20977 394318 -118300 -130252 -255031 -37459 73261 -62779 10379 -255550 -326772 -56215 -97489
20966 -97489 -24713 21365 -199948 186643 -187100 -60570 100443 -112983 128554 160016
20956 160016 200727 208549 -237056 -136202 291727 126765 132282 36846 167286 207517 -40462
20944 17467 -33410 -136448 -104881 15962 -43648 -168904 154444 -288097 70242 74943 102605
20933 102605 227143 65404 538445 55246 321882 352708 96538 216066 237648 -66892 29759
20921 79882 -147827 131777 -410627 -90594 74960 130034 37901 -174873 150927 92608 -79523
20909 66647 -134755 141193 -441142 -19873 -110590 -147952 201388 214416 -48744 -65757 62499
20897 -139549 -28054 -97030 -250642 -266519 -21776 -59576 -330833 -246197 364454 72144 -310879
20885 -199940 4324 -135981 -50581 141029 8420 -61835 51343 -16746 -65702 -65945 -303238 -299044
20873 -299044 -117197 -216586 -89758 83345 -129038 -25462 82386 177854 -9719 -201627 -92755
20861 -169161 -211576 140089 -312639 175591 44961 -71755 -204215 -405142 22051 -40263
20850 212324 -217170 -331605 -676 -7282 -370936 -33867 -247002 -103410 150695 -76764 -444716
20839 -444716 -6649 189699 -165698 -81686 60601 370054 -302401 79565 -76096 99014 -95835
20827 -29550 129850 -238262 30521 -300093 -159373 120739 -273244 -159417 -296506 -118455
20816 -198770 -194318 144592 -273097 -46194 -57628 -28084 -431419 142977 339 -6997 -124193
20805 -124193 -198497 -263975 -105489 -194336 -23752 217153 53748 -304067 204872 101766
20794 -405641 199127 -152379 -208260 -156781 144725 77765 -74115 92144 -154459 126033
20783 163017 -366530 27118 -20423 -144802 -22700 336066 -196092 -42872 -25016 -146613
20773 -146613 30316 -248453 -244579 -58836 32032 -169032 -341983 -4634 348745 96709 -332503
20761 -42668 -162171 -125296 215739 -207587 51472 -101511 67363 288553 -266491 -10711
20750 -47325 114565 25195 -409524 -12419 -292506 -100877 123032 -125793 -157564 -46973
20739 -168220 -121814 20013 -315681 -65314 247876 9119 -232678 60548 -128504 -261776 44418
20727 -284362 115765 111965 -152701 -29633 232728 33934 -429136 -36697 114950 -201424
20716 -385109 202858 52540 -45506 151494 328541 -130429 63257 20091 -243968 -305123
20706 -305123 -152327 -183624 -508097 -342673 -238067 -65073 268792 -123608 50263 10498
20695 149700 -14342 232877 22311 -60816 87348 -187672 -252294 -65010 71949 32937 -82220
20683 -94757 124853 279970 -138288 40215 122575 -50521 3061 36103 -100645 -203998 -108122
20672 -108122 151687 150217 -200466 -43387 -2079 130937 -157071 -433508 45047 -212258 -265733
20661 -265733 11646 -49361 -60313 -112154 -120690 -199971 -342386 -7024 231176 -118752 30712
20649 -368353 275001 -340842 -182024 -150710 -229910 15774 -176372 -34884 67209 3975 -375911
20637 -16629 31497 -155114 -93693 -38824 -135430 223482 269781 -320694 -187977 -98423 -138352
20626 -138352 -71048 -84504 -247926 34126 25983 81123 -304524 -110239 -250888 -78757 -125062
20615 -125062 93204 -36830 -130713 218793 -94887 165979 207923 46424 116430 25389 148660
20604 148660 -126047 -101538 -126264 -200012 -42406 -2865 -191020 -156900 -192258 72720 -269712
20592 -114590 -172009 97244 -296197 -75989 -61962 -181289 -323637 -154150 1441 -5839 -306616
20581 -306616 365532 -306816 -85235 178581 -350031 54486 108852 391390 11358 -300818
20570 -304707 92493 161073 120216 74762 188593 -179085 41599 -251778 204610 59337 69456
20559 69456 72129 291997 -68061 189275 -180241 -150930 -145711 -394204 -61895 -141690 -137651
20548 -137651 208921 -48758 -240412 -53280 -236434 -238178 -131865 -188656 -256433 -46956 176284
20536 53983 117789 -83145 -380281 124473 -436412 63052 -173109 -277918 -378634 61482
20525 91892 194648 -155955 88438 -677341 -130995 40014 -529466 46118 51075 221780 -112010
20513 126096 -41116 -150492 -397076 -213537 -175853 -7548 -156530 102633 275840 2966 -110937
20501 39851 -49807 -90325 116060 -330306 -189501 191809 -209171 -28092 -17512 -351485
20491 -351485 -114057 9783 -316013 -253402 281448 -218132 130441 -177321 -34112 -177291
20481 -177291 -69318 24922 -34023 -247082 197410 -231956 52693 177851 27493 210472
20471 210472 -120072 -166577 -122730 -198907 21353 -166662 -215588 -130834 -71576 -65015 -126236
20460 -126236 241470 -150445 -84236 286469 -61700 -125393 4986 -71510 -297348 20712 5170
20448 -56486 -252545 165571 241979 -192287 -211993 258738 7001 -36346 -265992 -60669 -200611
20437 -200611 -68504 -151567 -91424 169549 -212853 -182241 293212 -287647 -558954 54153
20426 -77299 -113141 339403 -207720 536470 -189750 -318774 -181849 109217 -65351 92401
20415 177813 -8807 -246469 -64965 -373145 -49293 -258339 -221889 -246835 -54420 -275341 -170815
20404 -170815 135599 -51973 -56812 -144439 -48327 -28711 -43050 133919 -156989 -79300 -111588
20393 -111588 -94078 71266 79506 151942 -384453 13600 -43966 -278147 -217228 -104108 -118679
20382 -118679 79922 29742 -157701 -73944 -2404 -105865 63682 -58162 -83021 127409 -37635
20370 -27161 222666 25656 3360 21663 138657 -168538 136368 -11365 -1714 33700 254192
20359 254192 94954 -131691 -108747 425260 135948 -206650 -209620 566696 -107884 -67004
20349 -67004 -65131 -189146 13053 90143 -56649 94900 170026 186673 -199888 71685 286939
20338 286939 130475 -220426 -350442 -101382 -475818 60454 -112901 113800 -262070 83276
20327 -130855 361989 -167624 25227 -25703 10967 -48795 -485847 -77833 -572237 -161708
20316 -135716 -67021 187429 -285152 179170 -67071 185685 -4021 -105722 168309 -127391
20305 -150245 -171679 189181 130176 -77888 -552550 30704 -197236 -163022 33714 -71402 -125023
20294 -125023 -122398 -400889 -32490 -116193 6712 307279 4343 15532 158793 45207 -189542
20282 6815 40381 -394437 64665 -193749 148622 109173 -50957 -106913 -383984 -154224 186147
20270 135570 42117 -24434 220322 253270 -77284 -224158 -159516 -11147 -10428 -177617 -110292
20259 -110292 -49644 65808 -129318 -195987 92534 -287465 171331 35003 191299 92486 -145525
20247 -255898 233354 -39387 -257515 737 -109474 70310 -287559 -395195 -257933 273238
20236 -320956 -409811 -161428 -67524 -23586 146498 -91657 -76769 -416314 -20735 -89609 -70269
20225 -70269 -88778 148846 -61362 -86988 79285 -100150 180569 -349616 216675 -67682 -225249
20214 -225249 -44867 -257621 92748 183823 -106599 -231275 126398 -178855 -314421 -54861
20203 26996 -531853 153903 -258956 -81687 59258 187877 -46945 260203 153679 -184026
20192 -80484 161504 -239198 -500060 45229 43122 196625 5043 -318490 202428 184624 78635
20180 88003 -126657 66553 -100244 69489 -161310 121553 113797 -243288 -53515 -100166 71922
20168 -21026 60012 -99518 -161634 -207250 -286060 132284 317317 141023 122521 -234968 156583
20156 70330 21935 269305 301935 -23240 -43205 38566 -105277 33761 -83344 67810 -165631
20144 -78675 -241912 18100 -338315 -54707 -28624 168604 312761 62331 61796 2989 227095
20133 227095 438360 62899 455219 17484 421060 338290 115545 451896 554775 495705
20123 495705 408664 165852 -86413 87664 71585 -30622 -76400 275039 205554 9408 341222
20112 341222 352236 261371 -254211 -34540 -103194 -187752 -186658 -180523 175390 181189 138136 28798
20099 -15222 -152479 -252267 -70838 -133609 142252 -233747 47285 -207090 -76783 -100613 -333300
20088 -333300 -194274 -106314 -273485 -271824 -100222 -101851 -170786 -250622 -590189 270811 79995
20076 -56947 -92750 -224075 -188181 84878 86297 65906 -258808 -75556 105774 -188164 -230589
20065 -230589 -333990 80448 -97802 -39655 -412921 -185626 77902 -298829 -181687 368741
20054 91127 -158832 94610 -273995 -56769 -11204 -9912 112088 36220 -72248 -124415 -20133
20042 144263 241457 117235 34867 -75807 -166929 181310 92287 -172012 -150466 38988 -160060
20030 103170 3935 -185727 -109232 139277 -88371 58628 -330559 -263516 -115614 256887 -66932
20018 -157587 -113208 -441074 -184081 33903 -409873 188638 -14406 -245570 131347 28290
20007 -153813 43237 -85727 -109335 -82681 -144145 1858 105685 217783 -166664 -178528 25529
19995 29600 -154199 -143990 138501 -483688 208416 -31571 124795 -148906 -189669 -195161 -54865
19983 209639 92636 261548 173 173804 417587 -94035 80349 258566 -20089 212246 210797
19972 210797 47884 95283 170634 129806 287956 77733 -89193 210311 75263 106008 -152850
19960 -244877 164767 69609 20813 156908 -376877 252776 -368847 -197023 91645 -67380
19949 136596 150287 124097 -127935 300448 145973 25639 212232 210702 -38989 264555 193743
19938 193743 21906 10994 153054 181319 -47115 -263492 44668 -485146 -91824 3844 -168517
19926 -40943 -319670 -94230 -299097 -58952 168193 -209437 -39920 -147614 -276475 243682
19915 -256400 103542 195352 52245 80622 142320 -205005 -386962 -143465 254477 30207
19904 -202508 49353 -106997 -104795 87909 -73206 -118939 80011 -274865 -54320 -523485 17688
19892 101152 -141156 -114875 89299 -65077 -69625 -282182 -266268 -112554 -33892 -240875 -58607
19880 135631 90498 93650 127198 -272219 307119 -263339 -167325 -97992 -152416 42580 55970
19869 55970 -230504 62576 22692 -132870 68242 -176229 -154947 143843 139907 -8560 346070
19857 -254979 -58402 -211 126407 42884 -180851 -56538 266838 103328 -209071 1195 -100427
19845 361216 40964 123770 1038 3153 -308304 -114400 -167190 93909 -121579 -246375 198576
19833 -156751 -150531 -238773 94436 -186058 45227 53748 -184949 -340859 -190993 -321740 -412934
19822 -412934 -249291 96512 -81710 -380863 -201741 -406557 -54496 330520 -311820 -3222
19811 -221404 -271595 79740 -2707 -6517 -3877 -45828 -120665 -69561 -304604 -203441 -9242 -28497
19799 -28497 113636 -176477 59422 -294591 -273318 96715 18044 302567 -164948 -347573
19789 -347573 5679 -280143 -188598 15057 -163829 -239916 -259186 -523583 -89459 127492 90219
19778 90219 48322 -44609 26246 108535 -272488 6837 10310 152890 -119129 -353630 -141639
19766 3102 -69575 -57446 -22377 127123 -364426 111427 194678 -576802 -321393 -187890 103206
19754 126360 -213766 -60611 36298 40527 -272139 -149046 -203367 -117886 -26514 -29671 -13186
19742 121097 184773 -394987 94344 -6416 104204 -166088 -6046 175307 -188687 -126590 95026
19730 -80175 -98166 13840 270169 152163 -26414 306313 -39387 -30754 -111427 107875 411960
19719 411960 238694 -115208 274624 -69747 540188 450400 322817 -62355 -119531 -190762
19709 -190762 346348 -115801 138510 -366989 -61473 162339 -67739 -72961 107444 -16060
19698 205286 -131486 157133 159229 -190202 81991 -164147 164736 373816 328663 -86935
19687 -56973 143031 197611 121512 292229 104531 504136 372892 76407 241365 -100733
19676 -36959 205017 -98420 29120 33276 50557 -177969 -257349 -47581 -318640 -60924 411529
19664 215239 288173 144416 -100727 -71959 -247447 -319306 -293429 -168907 -358679 -111002
19653 -3496 -60568 -211207 28935 228396 -352683 115467 109019 34585 288734 -220385 -97444
19641 -17782 -238561 192971 -276248 136858 72296 -44460 -11881 -177859 258138 -329016
19630 -142470 -62359 -18795 37774 -26407 -209232 -146344 68097 122050 103763 -210498 -435680
19619 -435680 157794 -264383 20703 168017 51555 -110067 196000 -161876 -337011 23918
19608 142477 -3249 185648 3052 -179510 -229001 -314646 -206383 -232129 -280236 -39892 -15521
19596 -72040 -238785 -81926 96931 -27226 -55714 -104973 -86711 142549 -102239 -162899 158426
19584 21914 118656 -89426 155391 71798 -156619 -465428 1941 -493035 -78976 -236479 -122719
19573 -122719 -158937 170148 -96901 278610 -290445 -318510 -186956 18650 127176 -228074
19562 64808 -235150 -212609 -431756 87186 112950 134784 -1048 -298815 -290127 -401392 190486
19550 -133902 -93609 -69411 -246220 -130665 -469345 -166764 -300078 290812 37040 81093
19540 81093 121349 -15195 -287942 29922 71702 19855 -84185 28185 42569 -110249 156627
19528 -151086 -364591 -205084 -194052 -69442 41264 -192205 61784 -270537 -65050 100204
19517 197615 -121442 -69711 -257427 15127 152028 113928 -147497 -199847 -147976 -51209 -39913
19506 -39913 -36820 -256837 -288538 -322251 173261 -228250 39535 114492 -4044 -194686 120513
19494 -177133 200218 -264260 271180 -14999 -109269 -223954 -163059 -197606 -209324 10272 14834
19483 14834 -179963 169746 -150801 80536 -114041 93366 -94331 -241867 -156149 -289012
19473 -289012 -106297 -71033 -118245 -206984 -81246 -433719 80447 -59645 -341817 45461 -162917
19461 -16574 -432083 -337901 -131202 -194416 -11186 26162 -355032 1206 -115316 -132776 127546
19449 -218273 -15720 194340 -546913 -142617 97858 -153986 -64719 -50332 -246357 -41753
19438 276369 28413 -101556 -69817 23239 -9980 -158464 -292666 69060 -225084 -85574 -160373
19427 -160373 31351 -143058 -93035 -67681 81471 -112935 229632 -75176 -53688 22368 -343318
19415 -30744 -226064 256163 -142880 -126966 -195267 -300295 -234788 -109211 17110 -258373
19404 -20769 64451 149129 -28994 -102253 -47277 5554 8626 249631 -103797 118454 88779
19393 88779 -115013 -49899 25574 -314587 -21144 -87371 76945 -230383 -91767 -32860 -297774
19382 -297774 -74368 -102127 62746 -299465 -218229 -137050 89653 -20599 -11188 29444 -11449
19370 -29705 -125582 -79191 291396 -83950 -137387 -81540 -166841 -212764 17754 -166237 -36522
19358 2937 37575 -132597 -246790 207024 -135203 -370404 -104328 298744 -76891 -505211
19348 -505211 -158600 -111183 -226913 -17414 13169 290078 -209449 4252 -50484 -207320 89541
19336 -386738 -154807 27792 -216390 -35839 77696 27462 -205315 58654 24408 -272297 74975
19324 26753 -89569 -261878 -314683 -304757 -59852 -53229 253444 -230856 -72564 -211721 -25672
19312 -49610 -210831 43000 256721 24821 -31375 70973 -198454 -232409 -49462 64082 -250770
19300 -210489 -237235 108926 -129626 -140197 -235623 140560 103671 -34672 -29309 -79695 -18694
19288 48993 -15916 -165360 189681 -126475 55308 -166547 -352098 -311091 -15462 -125701
19278 -125701 -325378 -227161 -239541 -43291 -295896 -127213 -140210 -328960 279838 -316691
19267 -58354 -74768 -286388 101671 -19307 -396959 -122432 -180942 217192 36521 -163653
19256 -134949 138178 90853 -117194 -408764 87193 -191004 -20010 -84431 219021 201802
19246 201802 8625 -82052 -114849 195756 -106561 -141332 216528 39592 -231244 -101232 -276076
19235 -276076 26139 -191844 -239968 -430451 -41615 104121 174666 -155575 -123120 -27487 -326318
19224 -326318 -145465 53816 132839 6566 -131862 62832 -246287 -133257 -192373 118529 -96952
19212 -40858 -80702 -709 233988 -21049 -95519 -12817 -25882 382527 273175 68031 -58466
19200 -252926 -26275 85823 56845 -73473 -176765 -176137 6901 -212697 -366296 -113812 -251898
19189 -251898 -410296 90519 -203917 50478 -33178 68464 44394 33458 -143036 32939 41756
19178 41756 -299811 -226712 -69620 -318207 -62300 163812 -150122 -101838 -401139 137958
19167 18206 -312096 103227 -39045 82910 -263101 -57343 105775 -109342 -186853 63535 97770
19156 97770 213376 14649 138085 -22800 -161872 70690 52471 -205691 -67862 125012 -92962
19144 -80547 166476 -5938 -5429 226868 -277423 361173 177992 -95484 -10170 -249614 8839
19132 -64763 85213 142647 -452991 -87706 -14635 -49244 -245646 -219386 109716 -479201 -127005
19120 -427637 -26852 -16781 -16489 -67001 -141385 -196049 -451914 -351657 -194775 -42939 104644
19108 -27087 47374 275352 -67590 -294563 -115246 -76590 182877 31683 -254297 94174 -194260
19096 71588 24708 17980 -180299 -37649 -29968 -6430 -349444 94043 -110559 104622 -442406
19084 -365384 -149941 21638 -214335 -41075 -127637 -69398 88868 -158916 -121734 -198947 144937
19072 49075 -88936 -73584 -219486 7336 3992 149580 -76919 308023 96725 -223167 72582
19060 -85262 68284 -272275 3059 153871 -54151 -178567 -46322 -87190 -175212 172348 -264110
19048 142333 61457 10726 98472 -413934 -52157 -217985 4012 -137859 -115838 419189 13275
19036 330421 -56458 -44075 174670 -140003 -127748 -39733 -185378 10461 111014 -58302 -140361
19025 -140361 -44806 30629 -243716 24886 296782 149114 -331471 -50868 143586 -84854
19014 -28307 17216 41245 -202635 66371 213303 48096 78734 -22086 197416 104885 198410
19003 198410 190409 58751 -45888 -281204 -47930 -301575 -326860 62057 -224504 100827 231575
18992 231575 -133068 323306 100164 275659 -189895 -174033 259470 203724 -73755 -96735
18982 -96735 38751 -343172 193033 -190236 -152960 -83172 -26255 -136149 -97187 -94935 -181447
18971 -181447 20561 -242334 -103430 -381237 73778 -77096 74699 168207 189096 186738 214866
18960 214866 86188 148568 291809 596809 555343 208046 13819 68375 -258166 -180207 -15565
18948 -79017 162796 -9994 123011 -59878 -86057 -39566 116923 201556 -177727 -136483 -300156
18937 -300156 -90132 -22497 -80675 -54223 -22813 -70254 -266994 18117 -144854 -104636 -220293
18926 -220293 -357772 67403 -148393 169734 -136190 -70129 -45481 146320 -8169 -240313
18916 -240313 30114 69806 68909 -289331 -175163 -141307 -273723 -32749 -56173 -58690 -220508
18905 -220508 -102575 177164 -128575 -255795 -16498 -70266 -147806 178521 91616 93517 33925
18893 515536 461738 233282 314446 111304 -249399 210688 -56240 13344 -195398 -115645
18883 -115645 -294699 -118147 139718 -248506 -120941 -155867 186802 -83110 -53475 -401122
18873 -401122 -26352 10558 -82422 -154640 78198 -260538 7353 -84260 47866 -119154 -203991
18862 -203991 68498 290076 4826 43962 13868 -189794 -80529 16356 -135235 -332254 9380
18850 162496 -279059 -54369 29886 334546 42551 115276 -46729 139296 129544 494017 -202412
18838 69070 -221793 -233477 -13226 -79495 -262789 -108674 150677 84193 -319919 22764 -132674
18826 24459 -399161 -10564 -314692 127991 -259424 132553 -29112 -47510 -27076 261183
18815 78204 15155 -192940 -14880 47155 -141166 22382 -333529 -176466 -352832 227784
18804 -24127 9116 63069 -367081 -3341 -266779 80865 266367 136148 207662 116799 300174
18793 300174 384192 36250 167743 109041 9709 -74785 -67496 102414 -153682 155097 33384
18781 -254343 252589 -71028 -89189 -166819 371084 69050 -42466 -96275 -142838 224577 -86315
18769 138528 53944 -276557 200546 177139 -31992 -13266 -120990 218223 -155839 -26112
18758 32839 -149488 -188446 -381896 -168912 -377879 -66481 -367225 -265478 27151 45383
18748 45383 164326 -183915 94756 -376823 -295498 41674 -50506 250641 -153356 -190857 -214200
18737 -214200 -298234 -66433 -124131 -76159 -364845 -112617 -55433 13688 -114351 -232604 73964
18725 143670 38698 -210460 -85960 -174870 -63327 -256085 -142618 -204382 -84904 -9032 -42569
18714 -42569 -48198 241681 37431 217101 -16436 -55620 -275715 -215407 -5654 -119648 195248
18702 -6568 -139789 -163897 -180049 198418 141199 75201 147896 -253440 -68060 -204155 -279932
18691 -279932 158500 -205128 -38783 126379 46551 119818 -41661 74690 -303560 -137481
18680 6007 285730 -26010 -85446 106523 -104458 -12678 -243 22240 11436 -177582 1202 53769
18668 53769 140955 162039 149637 -407638 -268657 120449 -92447 4056 43206 -112728 189597
18656 -19279 213633 -167121 31590 181553 -143696 -192418 -212646 6686 75283 -66667 -27260
18644 200710 -33302 -40269 -128042 127723 -87783 -331592 -50273 -42727 -243207 30102 -164669
18632 95942 234737 7876 -190307 -62287 266718 122343 86040 42928 -189675 -251368 -161488
18621 -161488 -360185 -114027 143770 -126461 147418 -104311 122479 -330387 -265150 -72357
18610 266130 -133035 -497194 -237533 -245497 363614 -78110 -116129 -185378 -191620 -249163 -44351
18598 8318 25086 50931 141055 68616 57503 -421852 -428130 -119837 135734 -42565 -168564
18587 -168564 52022 -199300 43046 -209024 -25170 232501 -142934 -122419 -38654 -144598
18577 -144598 211125 -265121 -111896 -389229 -224610 -329755 208436 -212839 168279 -312458
18566 105825 -307877 -310270 137153 -37057 178473 -166826 4877 85213 248417 68721 22303
18554 3924 81646 -196509 151985 -28462 -165523 -17393 -62481 -266379 -1030 -218921 -252636
18543 -252636 -5830 286681 186037 -306165 24841 -58399 265274 -128579 -10861 -302780
18533 -302780 58875 -164661 -77073 -280516 -189304 134814 -62693 28493 -117294 -125173 314209
18521 -245458 -86175 200039 123674 -274314 -121353 177610 -96235 78757 -38152 -111449 -226714
18510 -226714 -217110 -119745 -230277 249645 -8019 -250717 53362 -129504 -71292 179430 -130163
18498 14980 76110 -161051 36354 -28870 -159800 272523 33396 17319 128625 -119831 -298235
18487 -298235 -72486 -154272 -128790 36857 -256051 -215448 -276461 -52917 162864 224559 189283
18476 189283 -113937 135265 -358199 -154677 197582 41795 -153683 -132750 -38657 -85355
18466 -85355 216992 -171308 182694 170308 -35355 -2970 -276812 -53436 -30137 4363 -116104
18454 -269495 201213 -393087 -61665 302343 50952 -226090 -174533 67818 -221682 -291680
18444 -291680 -367122 209299 352111 -184026 -80931 77826 297456 -437801 304436 -164644
18433 300206 -20444 -74676 -49404 -64881 -182517 122816 -316710 52529 -154062 -264230
18423 -264230 58452 58111 109512 -183763 -6208 -39101 137883 250472 -266714 -51571 23687
18411 272010 -111186 -236166 -17241 -15005 102658 500969 109660 -176968 -192173 -119075
18401 -119075 93920 165801 68747 107844 -9362 -44420 -234923 69554 -135049 43944 14479
18389 -22345 -222816 -88947 -10023 83513 -27548 185903 -106149 75934 53673 452646 3101
18377 -241314 -57828 88963 35023 239786 -78857 -427435 -210346 -379569 23917 -123994
18366 -226411 -307626 11366 294719 296248 45070 -295884 75625 75610 -28791 -313357 -120534
18354 17497 -30346 -134309 -47237 -106190 328364 -89659 -372655 79527 92916 -107122 279709
18342 108202 -12608 -119061 -428865 151670 18111 -33144 131628 331434 -237254 122864
18331 -1270 -80229 -96618 -185510 -164451 -605 363257 -179588 -25905 -205083 9736 -55792 138419
18318 -136324 17828 -123684 -157733 -166962 -24641 -347449 -46251 -51702 -28527 -423074 -39939
18306 90999 55965 218092 -386993 170744 -42188 15029 -15610 -72545 60567 -70426 123475
18294 -1577 265932 -188184 -96278 -348080 -112831 -224021 -68013 -385707 -9957 95412 184441
18283 184441 92859 -29457 69885 281602 -80057 -6197 -184035 -227216 -112483 25451 -97397
18271 27799 34932 42059 -215958 -196825 181968 -217926 -193868 248219 284156 100778 -260687
18259 18804 -193795 -208497 -267312 -614005 -192162 -421489 70017 69040 -113265 102721 -265821
18247 -125143 659 -56569 -26776 94946 -190436 -64359 -159207 146545 -36243 -52387 -282974
18236 -282974 127736 309741 -30895 -2768 164418 146556 -33912 108179 13375 71943 -178258
18224 118132 97651 202577 2493 44708 -62722 30695 -120172 287238 -88262 151332 155051
18213 155051 86993 13357 -103664 201410 173052 -148501 115778 -128200 -360244 138543
18202 -111038 -122870 -163398 -114327 -279874 -32739 -5177 1141 -121446 -282277 210423 -161365
18190 132465 117580 -323020 79588 211738 135960 -213103 -322849 276809 235256 133466
18180 133466 72489 184121 -171706 -282428 125931 225586 180498 -51777 -268443 269997
18169 -53389 -309238 -92122 -32209 -182782 65682 -353645 75030 -56172 -1252 -211950 131951
18157 -132898 -225877 67667 -148371 -165946 15016 -162783 -100924 204252 55828 61495 105472
18146 105472 118372 -161548 -121408 -160434 221430 240271 -8975 -136327 -50944 -147062 -197036
18135 -197036 -305844 -147995 234910 -206128 241431 -270180 -47913 -80877 -374574 199072
18124 170477 -114043 180143 -273123 264225 -150851 85433 23816 -231458 -5161 305809
18113 -30933 -75743 -114332 31083 100103 -60398 -189362 61211 135892 -136869 -374948 -264211
18102 -264211 130289 -41399 161764 118607 201062 -66101 -99471 37153 171243 60970 129869
18091 129869 418814 -14954 -87606 22848 -22056 -366684 230969 -99376 185626 -418533
18080 -337554 -115031 -289906 234795 81028 -48612 168228 -94439 72423 -163267 -66198
18069 19275 2166 -296087 -101492 12731 24350 -156258 75916 33255 -90242 -295016 -124581
18057 -276693 88384 231311 -172003 -182479 -304061 -210269 210139 -31582 -45551 -118475 -22256
18045 305320 -3140 -326319 204254 -24868 -24743 -179576 223273 -350411 -260930 -257875 -44844
18033 -403510 178674 87942 -157051 -119126 -167731 155464 130866 -272309 -114675 -38482
18022 183123 75400 -316802 185075 156423 13936 -174699 89722 345230 -72944 23781 163700
18011 163700 25304 52715 230201 20211 -2779 2153 106243 34329 -34954 47083 367117
18000 367117 -73954 -28238 -318626 -131113 835 -43460 34973 -67237 378386 -165080 -157390
17989 -157390 -107331 39331 51522 374113 258293 -28028 222291 207395 -45317 -61804 78811
17977 -243853 -61083 9223 -15736 99795 -39992 -94863 246754 -80643 -82939 447214 120866
17965 -287923 66836 209075 -58013 235603 214276 -62655 107699 -71714 -210725 81064 68844
17954 68844 -152004 118929 8265 14721 -148504 -85466 -259089 170954 135882 -306036 298138
17942 -70821 230071 -83652 13722 147305 -125725 -28794 -7514 257749 49296 43449 -50522
17930 -3236 -99865 -84700 24834 169543 34036 78924 -438989 181874 -190363 -52115 -2150
17918 150803 60040 41053 31620 337138 -37317 134223 123998 -250062 -120315 -210990 34517
17906 22845 -288266 66884 -363119 -66686 73550 272502 182059 -320702 259792 82268 176063
17895 176063 -56055 -53171 216430 -62919 4447 -217603 124049 154699 -167262 -14737 -24688
17884 -24688 -39307 -176919 -199019 67574 153286 86821 -159182 -9083 -89204 -3453 -159544
17873 -159544 -457426 -153440 55601 348433 236790 132842 -139978 184255 8791 135437
17863 135437 -17675 224159 -17301 153161 -118115 133497 103637 88888 -365756 -139923
17852 -157103 -61029 112332 170633 -51782 83760 -148752 83320 10542 -209874 47367 -30029
17840 10905 13550 -149059 300066 18347 -79823 81101 -16328 241696 -16142 3519 163528
17829 163528 -132926 79094 237664 -25321 76569 64363 126821 -59965 209394 278996 -25175
17817 -82060 -239679 45870 -45284 229593 38368 77122 29869 -202423 -168942 174748 183532
17806 183532 342639 -134501 -94501 181631 -33580 149728 -4114 -107221 402672 251000
17796 251000 -182459 -179341 157697 -76482 -41976 -35062 -144582 -509593 -55901 142761 54703
17784 63232 -293019 -6748 12331 -133645 181878 75971 -201646 -56138 125693 155993 -293196
17772 307894 275690 -209847 -159649 457018 53440 7386 -159615 -28312 -48458 355666 44783
17760 -29832 356076 52030 -151129 248285 -234440 -94484 214993 -6170 574283 -141806
17749 83483 -12820 204139 -30161 230929 477251 -41908 17987 -120962 -20997 -95507 -202453
17738 -202453 390304 -126878 -127184 108275 -37177 -201990 53128 -16188 170482 -54283 -141036
17727 -141036 151686 190891 341109 235927 30502 100995 -149688 -82259 -450460 -50491
17716 15530 60796 72723 277817 -149017 -134496 288646 9871 -91245 -22660 1818 -17031
17704 68666 227072 52462 54189 -118942 -255936 172889 321605 132254 208260 160413 -31866
17692 218784 67053 183726 238057 134977 -20657 90471 -120947 -29513 190294 580671
17682 580671 -281041 140510 285990 -95596 -31209 -328832 -244042 32338 25998 -256991 275206
17670 117808 9105 333800 149300 310121 423526 -200048 230445 228853 69555 216708
17660 216708 138500 227997 113363 226765 150650 -210512 159532 -55559 -47892 96182 322007
17649 322007 26215 -132977 -174271 55748 -8267 37679 233017 106958 -39979 48285 -73 468410
17636 38514 283277 235860 270977 99333 -10013 163222 125865 95963 82944 45909 -3201
17624 111892 230051 44728 126017 -243806 175493 99200 157585 38290 154671 192957 194948
17613 194948 529481 220534 71853 175060 316044 473129 279499 154858 82239 409414
17603 409414 141490 -189385 181705 -89026 -171171 3626 285697 75125 56697 8171 144572
17592 144572 -190574 -119834 -164431 230715 -5795 185222 519252 271578 102323 392775
17582 392775 92818 393564 285413 303899 101581 43311 148190 -167645 40899 115739
17572 115739 163212 -31983 -29672 227134 -123000 -35278 210098 329850 98048 342076 428424
17561 428424 219529 194717 176228 290018 -18694 4692 135335 -27998 452405 -288690 -14271
17549 496716 209570 38385 79912 -32579 106884 -51740 -160486 58910 95580 83048 86137
17538 86137 133178 92260 393524 154410 118362 210073 127875 270249 328990 233589 242077
17527 242077 -71435 264201 135816 198727 274798 99075 -14433 -191107 -49300 22493 360376
17516 360376 221015 383279 208347 583560 392956 814452 608624 688332 984831 747410
17506 747410 650910 595216 481796 204120 423540 323123 272243 374783 319790 529771
17496 529771 598519 861718 657493 1005614 875585 763531 831776 626455 340207 528687
17486 528687 408887 458961 153527 180979 278690 378108 302470 294130 408284 -58553 -195674
17475 -195674 250328 435691 174347 193593 517656 219472 301230 383895 161688 464458
17465 464458 275423 241164 -142443 170617 549038 85535 251602 137880 -64348 27651
17454 248766 147132 389988 257050 370653 304428 273913 380492 290015 255655 296560
17444 296560 237473 158143 283498 230142 201084 291119 250657 292604 138953 457287 398573
17433 398573 363551 588595 685036 338995 253975 513172 220646 376726 355029 217370
17423 217370 174135 388638 291481 51784 -43357 672604 288319 145669 267798 460438
17413 460438 306952 240391 359453 384746 559384 178602 297209 276312 8841 498064
17403 498064 409372 497953 180085 680257 151360 329575 20223 46603 354359 118925
17392 220384 334298 -19336 340299 33784 120545 258067 179303 634368 -21532 564714
17381 151700 550462 360596 11886 16101 241578 137195 137709 298582 268850 201407 386811
17370 386811 457934 319917 397769 159563 328153 59925 81865 137183 276561 74249 549307
17359 549307 98429 388996 89246 308877 220491 430889 144999 227521 18600 158437
17349 158437 368776 48758 347371 100458 30268 306174 -37974 8700 383570 1359 392582
17338 392582 -65680 -128200 245159 400077 206306 386973 517290 118089 319956 55794
17327 227500 203944 309139 112375 212097 304346 13836 531039 215539 579137 3801 80086
17316 80086 116278 -247704 505944 231679 408826 81200 193129 587263 236771 207486
17306 207486 522584 234779 286159 242159 184983 530093 169642 221445 183419 436729
17296 436729 178326 586889 98951 277131 165119 329933 65921 449758 223484 -49952
17285 240165 310901 379267 9852 266924 424954 302758 192035 373065 121677 273419
17275 273419 162128 408570 407091 144872 239158 356171 400770 139157 11352 544295
17265 544295 303280 348139 126543 162176 176163 391933 305072 548984 149762 408236
17255 408236 25158 246713 561052 125177 81349 143943 58953 238145 200994 257861 180398
17244 180398 -13968 65617 569363 517205 320805 -7307 498208 132148 410391 509165 365560
17233 365560 467471 350709 451336 428427 370463 197939 450001 440836 343211 420011 413379
17222 413379 354628 541457 444602 145760 157178 10638 508077 431359 95905 478389 308984
17211 308984 332879 495282 80467 353983 711370 557203 340046 216451 437207 436172
17201 436172 547296 332390 28139 355053 171707 386338 341797 374507 294079 685050
17191 685050 350632 266700 442887 753199 152157 469379 380050 509761 179003 220034
17181 220034 122218 61104 480211 777325 395505 140174 236726 388640 83347 228369
17171 228369 439691 400155 656140 464082 503529 363616 438655 197541 530577 636051
17161 636051 545322 289879 23062 568495 504524 502881 298105 228730 575594 347880 479406
17150 479406 736516 485066 689854 223367 422488 373931 743471 681458 531018 679925
17140 679925 672460 201820 186944 596795 291648 662527 466651 663407 714891 588916
17130 588916 305479 366907 609814 607579 502660 603854 554062 481541 871966 491577
17120 491577 471248 452630 630129 692285 591780 620745 418029 539568 417912 677004
17110 677004 409518 837525 315479 578420 351272 680637 606908 643456 576785 910771
17100 910771 728723 833823 523359 385117 548373 646217 590777 154045 468592 499730
17090 499730 622999 713303 720944 497544 612773 771193 675924 646787 473074 752637
17080 752637 566162 724074 584070 642505 441746 721933 560546 681237 930263 1008417
17070 1008417 566812 661958 699809 490833 624054 784329 854163 515184 770161 612695
17060 612695 850545 1015268 721371 752033 633925 366602 528742 1021889 675019 665730
17050 665730 993606 543839 643622 849123 866355 664631 530983 1024320 586413 666525
17040 666525 884471 612006 1190051 826084 744252 927160 648365 1040383 738556 1129504
17030 1129504 1169936 752212 880789 991345 837943 1126605 798471 1036120 835992 974850
17020 974850 1174658 945349 943147 851662 875575 1081029 913707 891890 1022743 1255022
17010 1255022 926731 842913 897516 1039412 1021839 1028690 901105 1172669 764136 969564
17000 969564 1119592 1292253 1009345 858948 1097821 910548 1041891 989275 1177920 1248229
16990 1248229 1025767 959449 1095135 995809 886071 964943 1300856 1608887 1352610 941798
16980 941798 1139389 1279675 1234242 1324365 1474102 1199094 1097490 1089885 1397078 1119596
16970 1119596 1554633 1249047 1274885 1445862 1592487 1338949 1484023 1656943 1607306 1496016
16960 1496016 1600870 1177354 1107657 1625772 1161676 1599568 1695214 1251742 1329979 1895576
16950 1895576 1470586 1494985 1191703 1679662 1566941 1770675 1497603 1584503 1281774 1691691
16940 1691691 1722383 1723061 1382776 1823301 1566882 1522910 1833419 1403907 1771113 1640373
16930 1640373 1805809 1794583 1604527 2067023 1409662 1742956 1876779 1902484 1919082 1842349
16920 1842349 2276498 2182151 1671550 1854260 2132973 2326443 1976219 1854973 2037334 2266475
16910 2266475 2386975 2194895 2205982 1933177 2301911 2387904 2290101 2293794 2012049 2516528
16900 2516528 2120904 2520906 2663932 2105721 2761886 2596385 2516323 2659746 2433539 2341707
16890 2341707 2366612 2487924 2633062 2934759 3027165 2873933 2463971 2965869 3154698 2950465
16880 2950465 2922122 3234254 3343310 2934399 3325046 3256235 3107912 3034389 3166635 3350827
16870 3350827 3224172 3330047 3607660 3614138 3428456 3540165 3694779 3672812 3644286 3850160
16860 3850160 3451681 3875972 3855656 4182141 3992925 4228831 3884969 4146718 4235381 4354378
16850 4354378 4096395 4403282 4211649 4506430 4486956 4658741 4742114 4773251 4596041 4795055
16840 4795055 5001660 5167516 5018882 5211597 5207464 5383236 5060205 5464624 5622150 5709379
16830 5709379 5472135 5809085 5889200 6255090 6037538 6226199 6378075 6386354 6381436 6638759
16820 6638759 6834244 6695930 6843191 7088105 7343481 7012963 7066624 7806373 7477364 7850782
16810 7850782 7862419 8256604 8022813 8432427 8727171 8766826 8796337 8988965 9500332 9441195
16800 9441195 9508341 9558366 9946638 10260956 10256500 10602637 11339574 11195273 11111657 11764949
16790 11764949 11846251 12186256 12672986 12927712 13492780 13639173 13873348 14036858 14383640
16781 14383640 14917897 15147924 15367066 15970369 16190325 16487684 17188256 17650476 18028379
16772 18028379 18494340 19033618 19427326 20415834 20877875 21194344 21993660 22521638 22994385
16763 22994385 23801065 24800290 25270080 26143239 27049692 28033762 28722429 29743684 30808725
16754 30808725 31969293 33368785 33769580 35254658 36284251 37881476 38773003 40320474
16746 40320474 41936694 43209642 44744357 46553144 48273186 49998717 52104678 53950675
16738 53950675 56220292 58631388 60869405 62754967 65578300 68078806 70744414 73795441
16730 73795441 76688990 79534042 82677272 85535307 88723434 91700602 95516158 98605782
16722 98605782 102126402 104863318 108700665 111697584 114737931 117901930 120405214 123175329
16714 123175329 125830288 127656427 129446021 130934678 132178713 132875949 132964419 133266110
16706 133266110 132733892 132146224 131004680 129334679 127932900 125214018 122976308 120098344
16698 120098344 117468916 114360012 111654032 108151364 104834379 101236628 97800224 94382947
16690 94382947 91160141 87832851 84590367 81528295 78110932 74959472 72125370 69464671
16682 69464671 66463627 64422315 61350331 59120576 56675179 54528767 52543353 50502995
16674 50502995 48508282 46773565 44452466 42917071 41642090 39747224 38855056 36978900
16666 36978900 35923630 34511179 33466218 32261467 30939633 30129049 28865987 28063638
16658 28063638 27055682 26385039 25411043 24803282 24078507 23159199 22565079 22037956 20858773
16649 20858773 20491221 20027690 19172269 18790797 18505278 17819414 17084162 16993215 16203032
16640 16203032 15849222 15603960 14665296 14608430 14721179 14245264 13734321 13594369 13126940
16631 13126940 12721118 12170268 12159384 11859314 11601499 11281050 10966545 10988626 10578830 10404116
16621 10404116 10142214 10066620 9406751 9788088 9185125 9245703 8982870 8766895 8605704 8684534
16611 8684534 8380762 8005145 7906958 7863132 7293369 7352840 7384498 7034198 6958921 6738626
16601 6738626 7163649 6564034 6176942 6652445 6385980 6275975 6248878 6312192 5958419 5763432
16591 5763432 5756217 5752110 5568327 5328549 5393568 5292354 5361185 4957104 5249457 4954010
16581 4954010 5021028 4652582 4876518 4947280 4421020 4564161 5006853 4277251 4322402 4125521
16571 4125521 4342040 4478674 4292325 3913719 3558714 3707761 3859137 3818474 3495342 3523276
16561 3523276 3552505 3629898 3611331 3253598 3499221 3523413 3504417 3155592 3408506 3196108
16551 3196108 3158235 3127849 3073274 3253765 3163238 2814326 3127833 2682291 2945468 2884209
16541 2884209 2843775 2735490 2835982 2792004 2705750 2736545 2361577 3148680 2429747 2771965
16531 2771965 2421935 2458124 2447209 2622164 2288895 2636771 2444009 2136453 2489536 2462236
16521 2462236 2264062 2197031 2202608 2451689 2298336 2317875 2399557 2270951 2131643 1747036
16511 1747036 2124206 1796086 2145946 2052184 2051462 1655554 2079399 1944243 1842079 1889496
16501 1889496 1781396 1703507 1745332 2308083 1786812 1597413 1800802 1680011 1636031 1874239
16491 1874239 1519735 1843475 1739124 1468107 1608271 1607725 1557332 1380381 1500939 1653230
16481 1653230 1031169 1325105 1363766 1844842 1761929 1551143 1435971 1543707 1333231 1366266
16471 1366266 1522082 1457460 977303 1058054 1286724 1369762 1193004 1322878 1473195 1215136
16461 1215136 1428377 1432193 1280098 1196088 1247172 1478114 1160514 1201707 1408882 1228244
16451 1228244 1188663 1293644 1167162 1153574 1234384 913635 1177900 1010343 1140111 1067809
16441 1067809 1288137 1064250 1329487 1234303 1169961 988122 1115676 636701 1172521 833927
16431 833927 1001001 670372 853777 1038998 951513 1260011 1097743 1062163 1128398 961678
16421 961678 1196981 1129446 821206 716748 745565 847631 752355 1060315 592253 1029172
16411 1029172 848880 796417 1081761 891657 644003 864715 991868 879083 889076 949709
16401 949709 836559 765760 660704 606979 915917 512644 717464 750928 648062 988172
16391 988172 482299 822673 414396 487198 736900 642584 776581 685623 857973 411080
16380 662800 568249 617128 665192 821114 677565 781071 743344 553404 980517 908725
16370 908725 358775 227737 741319 736442 571826 914998 590948 604423 542903 618765
16360 618765 485551 456502 556313 631976 487177 587568 718183 975515 532295 951923
16350 951923 249774 603790 628809 645798 783402 870365 528251 669810 767570 362596
16339 455247 462816 609503 647761 613700 280410 616878 407035 459188 656221 244641
16328 829860 473893 312802 623263 530869 270975 463955 376021 666736 520838 441440
16318 441440 309390 245361 334646 449316 378140 226283 313015 436410 315083 442830
16308 442830 463406 442792 577764 600942 446438 275508 427603 400184 358332 276315 521319
16297 521319 300768 536778 704718 537971 486547 196040 297633 410495 519548 514725
16287 514725 382214 407779 699606 366899 581086 470370 211538 663524 472732 253406
16277 253406 304131 399321 508965 73348 353229 421212 303418 492812 350152 164363
16266 324712 377346 150471 785400 229933 268678 60342 443461 517174 382865 200436
16256 200436 301386 -217258 -53698 538109 139102 231705 186057 447680 499038 512340
16246 512340 335985 258198 339117 602733 279716 481500 286124 75512 618580 540243
16236 540243 287227 452780 369325 256694 305918 221800 46892 334516 220614 422076
16226 422076 230420 175821 377970 384532 472185 343023 291503 311097 356013 68381 464736
16215 464736 576846 267323 127832 221487 110846 158486 58129 293909 330538 309508
16205 309508 264745 600664 331207 -8005 631316 243928 -93997 206078 92405 310605
16195 310605 231844 56777 329078 195030 162314 173045 -105963 308614 334585 183198
16185 183198 154198 306162 348986 281472 151242 345647 63403 73139 173786 460447 -228474
16173 164205 185927 51673 188119 102553 -40932 399930 145411 92248 314752 542978
16163 542978 34275 351484 265311 41803 -166395 338797 -1572 167980 -42473 472149 -17223
16151 108841 434881 1245 -124385 -63964 33421 78512 -146282 -1674 15153 368327 115759
16139 320683 92289 377023 357620 89868 283180 311528 -85884 -310718 -84953 488089 259995
16128 259995 162248 286927 258541 279127 301197 54067 74986 155009 261573 338955 103773
16116 315958 110070 229798 47052 30771 29394 -218727 226613 -322874 -102778 140731
16105 85963 15865 -152885 182496 296103 12563 86496 303582 359185 224272 429925
16095 429925 -119296 94492 -292395 105858 -116908 251780 -139854 190324 -196367 99054
16084 -5615 190401 -139476 383552 191419 430062 261896 77325 -113139 -150394 112926
16073 7133 166827 213290 82433 190812 329108 290829 284768 -159455 21208 99779 30653
16061 97616 186236 168902 178339 240400 41257 24972 -211833 64184 250504 205946 45429
16049 3751 -163123 234514 101110 2469 204146 323069 -214287 8474 103750 55839 308108
16038 308108 85190 1457 321140 85095 -194915 92885 238052 -163304 44658 185548 -71615
16026 -138333 100068 -72237 -10603 -138113 -91125 -70027 102737 402282 -164950 -266808
16016 -266808 -292826 109354 18828 -14645 79068 -27513 -40641 129887 18748 155625 25895
16004 -230547 91360 34912 -42659 313592 207756 -261364 324740 231223 289233 -195828
15993 162459 -147241 -128691 -85051 339131 -43607 -10960 318364 63234 273650 -234773
15982 -261001 159466 -179341 8906 29364 207782 348487 237321 174449 40862 146029
15972 146029 495507 1030859 984664 1059296 895948 1079284 867115 187139 84071 75327
15962 75327 339856 -229725 318974 378809 -77777 254492 503873 319526 97558 465083
15952 465083 179001 -201027 23250 -48164 -4652 -102400 -79285 -176619 302920 125337 140000
15941 140000 -340664 221319 -172215 90947 104396 -501712 15167 102768 185312 -210407
15930 201805 150677 -322028 -140033 124962 85108 -227139 -96261 -74745 121646 -273346
15919 -159804 287164 67605 69536 -170529 -278588 -1003 -145954 263972 201748 427517 -123724
15907 -312309 -97113 -53597 -29382 -42007 -149096 50082 5985 -44780 201598 199019 57019
15895 -21712 1404 113617 -5100 -8011 82100 -189026 246080 76860 43824 109949 22600 194605
15883 194605 -238785 -11498 -110835 -129748 195959 -215487 131617 -404839 -335828 81585
15872 -242032 -13121 -65019 -110596 -174277 144967 -1683 241974 -97457 -235142 -110876 -122208
15861 -122208 184956 -57127 288107 15969 48062 221342 -354853 -115560 -63844 31270
15850 142032 123697 -94126 -134341 71216 -87565 -149901 15898 158188 -7014 111683 -133312
15838 -170862 303625 325083 55838 -235731 -55571 -17482 -174146 130529 174601 -269440
15827 -141896 -119825 -256028 89158 -137071 -199793 -62322 -83758 181266 261935 -81910 315536
15815 -138217 -134024 7514 -501608 61007 140433 -102477 -60950 63889 -195912 -10914 -170194
15804 -170194 74717 256306 -33840 5725 -156794 -69723 14205 -29118 -530297 -38528 -154059
15793 -154059 81321 -11001 216059 139909 292703 -131172 21982 -30615 28059 47355 -304737
15781 19452 45663 -151583 -377210 -209725 -319371 -205260 23632 -106006 -159567 264473
15770 -252276 67090 -109175 195832 164664 -281490 -84961 96183 -100435 28432 269151
15760 269151 -222257 -131658 -71932 330551 -314443 229148 209388 -377356 123788 163113
15750 163113 -32533 299441 -44769 -175464 124867 99538 127401 -48836 53822 -245567 -109898
15738 -57657 -175903 -32885 139514 93039 135581 -270711 -188839 174673 529747 -135514
15727 -12542 162758 -151664 -125879 -102067 139706 -134633 165951 166541 155272 465 213705
15716 213705 205485 -29355 364961 -109143 -106814 142720 -145297 -159354 337177 -73579 -4100
15704 -31042 -240686 -21284 -10586 -142614 17443 -129430 -123384 -221470 78332 -83324 -73823
15693 -73823 180246 -309463 -175073 -98946 -38299 -139465 -79300 -347459 128437 54608
15682 -23542 52151 10332 -226678 117564 152617 44598 -58086 243963 -129813 321490 -105111
15670 220413 55659 111536 -201712 -91029 -241273 84328 -103441 -16703 -35292 -63094 126735
15658 -337786 -155222 -41983 -451900 -461 -230398 424952 -45025 99544 -237971 -304938 -194906
15647 -194906 53052 -296801 83331 44454 -79858 71340 160863 -191107 -37211 -63209 9873
15635 -121049 1393 60756 -227864 -232682 227852 -212558 -7566 92283 -265437 -141624 -420220
15624 -420220 330604 86148 131157 125334 -278743 -46039 118648 132695 55724 -127473 -148552
15613 -148552 -246936 -677 -118363 178562 92230 -408911 -207867 -24936 -109016 -161581 109798
15601 -117469 -82587 -6664 -396249 117286 813 110623 -270351 145558 166053 19278 -13608
15589 -10342 -279911 279719 230668 -247939 -52789 -12011 89482 -10268 -435386 -303442 -342899
15578 -342899 -204777 -26529 87378 43143 -7763 57546 -290573 -114164 -222781 94114 -307467
15566 -246345 -262859 -166821 -414776 454002 -106995 -45559 -214646 -196251 38011 84786 509919
15555 509919 90358 -175375 135352 49297 3472 -22692 -199891 -101636 115457 -101025 184409
15543 -212893 28181 193709 -227540 149021 9593 224078 33298 -285007 177212 -155111
15532 -306482 -344445 41904 -79591 -43200 83 105378 301733 21992 129556 -78154 338576
15520 12008 185000 9782 232629 -65561 -100654 -78531 314519 409969 65559 -65035 -169215
15509 -169215 -23899 194658 232895 -94780 -266319 111799 19689 265271 177126 175229 -172098
15497 -30504 30498 128728 241914 270583 161592 122709 86328 266070 446513 319469 276931
15486 276931 161854 -129758 -224172 114654 443377 159130 5575 117970 -248597 167804
15475 -225341 426579 -162168 271853 230464 320260 -321869 -289747 -60115 216218 204406
15465 204406 309289 284757 159855 148218 510257 510433 90585 508567 427807 500268 174584
15453 111060 365062 243213 433548 -288417 -45749 -132939 -76723 95476 317823 132405
15442 -288665 183363 24971 -130216 173309 -182126 1420 -103188 32693 200460 43679
15431 284723 -104242 245847 249112 22356 524205 440029 802108 916753 733901 485238
15421 485238 164659 62572 48808 107078 179236 102818 -89617 91605 -25398 146871 151347
15410 151347 -156338 -266425 132963 -52709 -68271 -149416 1945 -289118 -285610 -330541 99787
15398 -78374 154513 -26845 -167029 -417562 -19441 -23738 -12890 -201428 -75796 -11341 -71326
15387 -71326 137964 -35185 -77058 210779 -223783 -86605 -266627 27292 -5159 28167 -168536
15375 -103425 104082 -213172 76322 -92539 142470 226284 107285 -47922 -71553 -189225
15365 -189225 303283 59353 -612 324947 268210 -178377 276291 24256 147945 248111 389312
15354 389312 -9984 -188520 104779 247380 -225971 -54536 245803 86501 85891 522152 194452
15342 152461 307558 314407 -196149 165543 25599 208080 218237 390174 335416 140646
15331 228283 151734 -12143 378622 7449 156592 116791 616538 58522 38121 313372 542565
15320 542565 -152830 3896 262564 74414 92953 -3132 306861 468007 239551 -120139 -109129
15309 -109129 24357 -2693 128999 180315 83140 178423 -195223 -3179 325266 234302 152667
15298 152667 -91036 186392 91052 431500 23083 170597 813 52036 358792 -65731 94120
15286 -356805 2829 -128591 245157 323942 25268 -126821 246652 22813 58592 283367 -118205
15274 -211535 63907 -9882 10342 232421 -35726 28834 -77576 86958 -182188 125284 -131614
15262 -98458 12423 -511713 156722 -18283 104393 237993 145445 176969 258659 163140 148835
15251 148835 309905 -24779 -423198 175078 2613 -53139 234019 238146 -239030 -7448 1587
15239 312570 -93360 96345 172984 136696 5972 245876 -60108 318235 273413 382920 796271
15228 796271 797327 1146889 1449364 976130 1110106 647030 509154 490919 -158773 129309
15217 178732 -51474 -35171 -340783 23971 58678 -40932 377143 78937 22715 -116751 -242626
15206 -242626 39785 53554 102415 -159615 115289 117271 -12847 80272 217143 -206026 196076
15194 -123236 -86665 -29796 -287548 51545 145730 86968 10391 256192 114223 -41912 -24899
15183 -24899 137231 -84141 54486 -46685 345285 114864 183676 54291 224648 -67510 196878
15171 255943 219676 -159468 94432 310186 108723 251859 107272 96415 165185 39908
15160 111130 160121 -38952 202334 -26987 35261 -95944 230473 105824 -86935 198859 324333
15149 324333 -22711 244853 150297 107235 136848 38538 600619 133097 204488 227607 90946
15137 140994 5365 -105162 149253 17726 76326 34542 217803 275402 20924 256569 359350
15126 359350 201705 172860 85006 -71241 331913 303264 -22288 -96340 131686 60421 -98137
15114 -104974 110535 -29555 -316948 56662 352918 102055 234537 297929 449491 274838
15104 274838 225813 594353 179190 366934 449092 -89445 198147 266964 -215772 69531
15093 101706 76329 213962 -51270 167378 -46457 374602 166480 84154 83920 76881 -137978
15081 61172 -21743 157163 94067 -92645 49222 438276 -238126 -42197 -142791 321510 -144393
15069 77949 147651 214526 292350 229026 399132 85562 12570 164647 227456 9373 278679
15058 278679 168566 233215 45423 59997 403507 187685 88670 -111390 206686 47205
15047 -17540 371190 172265 158663 8104 -31315 15796 158941 383813 498273 448839 430210
15036 430210 696742 50364 273461 413333 334224 421377 301006 498288 116611 83742
15026 83742 365978 215166 240376 356222 659358 262909 402968 133865 273149 329157
15016 329157 481579 380529 496018 582659 989310 420950 579010 272445 592893 820772
15006 820772 396824 420929 634237 508097 195361 223928 411098 301477 252463 -112309
14995 176304 106721 485832 280744 564604 273909 309036 181199 392453 216583 73807
14984 432749 455013 348675 409525 187265 563573 182065 413376 479829 576314 296180
14974 296180 478117 431154 623241 346430 297549 552982 373397 656789 760604 894738
14964 894738 360150 757987 566255 762875 389322 607067 649728 428754 552457 540518
14954 540518 458210 489207 417414 229996 285826 342668 -15464 367930 210536 253521 147554
14943 147554 242174 2367 149119 549776 360507 220837 377099 383250 570835 198997
14932 361469 390545 346941 659666 378879 606602 346872 557845 711323 434647 356278
14922 356278 389279 503065 637676 449722 732492 721099 584984 903234 677083 993975
14912 993975 1137835 1178907 1364097 1692747 1435542 1575687 1495993 1579012 1528375 1661916
14902 1661916 1899031 1713811 1892248 1616682 1703053 1217964 1143038 783355 776684 471896
14892 471896 324014 520132 445721 221248 550448 604270 590724 569990 574169 539627 479009
14881 479009 391056 330683 211133 354129 403838 504390 648141 419107 163413 792498
14871 792498 604088 1033899 409938 877571 875374 886820 825658 855445 668134 838474
14861 838474 715739 605477 406498 273407 945 377855 400184 817990 363755 780639
14851 780639 950187 627148 412243 573376 396370 200808 634028 351914 698357 270164
14840 749044 824570 342567 655736 631248 779620 404957 574784 651559 642191 740330 745363
14829 745363 703995 727780 712846 971074 976615 912183 967508 755676 923705 650769 583264
14818 583264 481675 709534 630826 313583 553002 622002 418739 638979 376151 668582
14808 668582 735704 457456 766365 716048 342595 702260 569419 622384 313123 886988
14798 886988 731114 601992 913678 775707 450154 639471 418261 557223 795864 880703
14788 880703 750256 813905 806642 912785 1007365 480413 850890 372602 854028 504411
14778 504411 624266 845720 322609 631775 703889 418419 574577 486169 521309 824323
14768 824323 478006 596823 864155 720941 1077490 770831 646806 494803 902356 545908
14758 545908 821951 860851 951215 759873 649851 616863 345881 767170 746819 748122 653208
14747 653208 934740 526372 526824 812150 567603 794707 216918 876066 576711 629732
14737 629732 470233 454072 682396 654777 965643 593061 269135 571694 679577 411000
14727 411000 768899 909031 923983 910452 716703 781676 720053 806251 785654 805970 1020086
14716 1020086 1112467 1189559 1282797 1353677 1554134 1628732 1670276 1665447 1287302 1099557 1254534
14705 1254534 1071728 1166443 785277 932842 782733 834261 1173657 1226992 680244 813199
14695 813199 829440 791396 857309 897949 859042 915633 1464573 1102831 1342105 1570909 1725960
14684 1725960 2056544 1425181 1585862 1259383 937432 1158438 1038392 913123 825767 1151143
14674 1151143 861798 889818 1220615 1352968 968431 818832 1126727 1183092 736527 926232
14664 926232 871800 1100049 823056 739643 1203308 943680 1059992 1184637 1123568 1180055
14654 1180055 1335315 1235156 822938 1348325 1062192 971086 1129532 877659 1065065 780811
14644 780811 1306872 852185 1037852 1512645 1522801 1082769 1204419 1316151 1173255 1236277
14634 1236277 1379150 1474403 1117884 1367099 720953 1188010 1399118 1306696 1254405 1078672
14624 1078672 1064219 1415927 1412248 1062559 1268092 1278774 1247642 1261659 1549758 1429718
14614 1429718 1272031 1356790 1018855 1348611 1312489 1483292 1339242 1145710 1040715 1547964
14604 1547964 1606411 1211970 1518397 1454546 1622131 1453380 1275822 1345339 1757598 1612260
14594 1612260 1554799 1307555 1618698 1580972 1624688 1300543 1359436 1888907 2015986 1668978
14584 1668978 1974090 1187901 1594726 1490474 2003524 1680521 2010199 1699654 1766910 1711817
14574 1711817 1918634 1765974 1935603 1878952 1229116 1756094 1568813 2127763 2337720 1945035
14564 1945035 1815372 1998097 1962636 1989538 2339383 1859445 1970171 2368377 2112056 2316826
14554 2316826 2304130 2350210 2536688 2153054 2372329 2769063 2556787 2642097 2522626 3039983
14544 3039983 3095801 2931910 3064110 3614408 3708474 4074574 4784416 5165465 5972132 7082599
14534 7082599 9325948 13895291 20463640 32069537 30942225 18441374 11183878 7407984
14526 7407984 5285873 4329756 4225302 4767811 4464041 3498297 2891405 2509106 2593931
14517 2593931 2493817 2386459 2599650 2371019 2265752 2592112 2465631 2236491 2414182
14508 2414182 2429113 2505342 2681485 2812972 2512241 2536465 2356077 2470987 2918713 2579770
14498 2579770 2781436 2886818 2739615 2814603 2873065 3068218 2695925 2871724 2696468 3166264
14488 3166264 2868495 3127670 3419459 3075229 3132072 3293376 3066687 3410543 3354531 3344287
14478 3344287 3339189 3780214 3380301 3723514 3700521 3276523 3803860 3390723 3789210 3679500
14468 3679500 3739922 3810932 3834977 3787997 3984968 3860638 3771638 4084944 4412217 4043827
14458 4043827 4401735 4261065 4320089 4606684 4044877 4589140 4431506 4116979 4304535 4809666
14448 4809666 4934180 4805968 5033554 4643035 4755621 5276119 5001769 5093901 5242635 5218860
14438 5218860 5323051 5541878 5319629 5371868 6028466 5841136 5881305 5678792 5916284 5887445
14428 5887445 6001897 5924341 6188033 6112692 6001410 6021865 6613835 6709667 6602286 6600001
14418 6600001 7029935 6728414 6760175 7222307 7315241 7487096 7510962 7636917 7482683 8014540
14408 8014540 7892128 8057125 8450148 8623949 8349726 8639044 9028118 8882294 9074898
14399 9074898 8990188 9066130 9251629 9406264 9647090 9530504 9558170 9782613 10072692 10443931
14389 10443931 10617657 10904428 10669513 11110632 10905646 11603212 11322357 11399927 11755524
14380 11755524 11788023 12089969 12222475 12394788 12609885 12964888 13252503 13294438 13242287 13971501
14370 13971501 14341845 14297661 14782035 15076256 15312573 15147549 15610550 16323805 16443160
14361 16443160 16730006 16698151 17412666 17433915 17733603 18178123 18793419 19320855 19427057 19708374
14351 19708374 20398514 20817268 21480330 21653012 22025777 22661122 22997222 23328027 23889277
14342 23889277 24381754 25223589 25574255 26488946 26953818 27858340 28188271 28655711 29723149
14333 29723149 30216089 31140599 32241973 32912534 34027341 34603982 35481035 36484681 37366673
14324 37366673 38351447 39523298 40630862 42058356 43435775 44634881 45802825 47081747
14316 47081747 49049344 50828368 51827779 53843763 55541671 57596961 59849934 61518257
14308 61518257 63920437 65927346 68598667 70851156 73368210 76411168 79279080 82172103
14300 82172103 85285637 88711337 92047799 95730975 99818563 104070904 108283739 113300608
14292 113300608 118544580 123688020 129210448 134933216 141569571 148201299 155284750 162677734
14284 162677734 170421921 179029164 187857915 197159069 206832354 216935360 228220786 239747691
14276 239747691 252017215 265080134 278346183 292016951 306406046 320619942 335513418
14269 335513418 350269136 364717369 378767102 392726988 405853270 418327614 430013043
14262 430013043 440567569 449808545 458209342 465789049 470109415 471144050 471971018 472944411
14254 472944411 468207085 459680633 452699467 446036578 435617716 423791196 409676913
14247 409676913 395893445 382287116 367404195 352308272 337546677 322575881 308159567
14240 308159567 294024312 280788124 267948364 255622500 243143219 230260240 218343038
14233 218343038 207912162 196849360 187170063 178021597 169309641 160865536 153127867 146114738
14225 146114738 139251766 132888278 126729510 121050491 116140790 110699098 106213663 101805617
14217 101805617 97617928 94059994 90064699 86651903 83222980 80222734 77087655 74338967
14209 74338967 71896347 68957615 66495618 64047435 62093796 59839262 58159126 55941912
14201 55941912 54473349 52326273 51370787 50105141 48135195 46868103 45369887 44048764
14193 44048764 42725735 41976214 41098389 39630859 38556533 37362907 36312634 35475859
14185 35475859 34713683 33746544 32663557 32096407 30984881 30331727 29873855 29150260 28341913
14176 28341913 27575901 27111260 26229725 25735238 24972667 24340520 24226881 23379078 23105733
14167 23105733 22602044 22003325 21457923 20853969 20712448 20235095 19756755 19913317 18992093
14158 18992093 18658294 18157352 18095779 17361399 17467788 16843058 16584371 16120021 16019454
14149 16019454 16078553 15804347 15317753 14991521 14656606 14354635 14188723 13955866 13880935 13776065
14139 13776065 13392802 13171836 12879193 12647382 12277177 11909133 12111468 11965535 11487539
14130 11487539 11366166 11221084 11161598 11072808 10651869 10583177 10412069 10375504 10335667 10059629
14120 10059629 9972189 9789322 9511074 9346622 9545969 9460238 9231639 9015753 8417492 8792962
14110 8792962 8558567 8394003 8311134 8405624 7979805 8181616 7715950 7961995 8017031 7986741
14100 7986741 8133820 7420142 7409215 7282988 6788899 7286285 7187602 6544799 6925993 6684697
14090 6684697 6570151 6658750 6600626 6688287 6261085 6596311 6240628 5793310 6240603 6128496
14080 6128496 5895864 6078837 5820490 5935084 5757971 5837144 5359366 5417384 4999126 5367287
14070 5367287 5452521 5396210 5071201 4944249 4841028 5343141 5323643 4752480 4759957 5157243
14060 5157243 5168134 4686070 4660018 4734044 4816763 4268516 4477565 4661497 4439364 4287790
14050 4287790 3956240 4115782 4117088 4239737 4233343 4373623 4018273 3809996 4351217 3915568
14040 3915568 4120398 4026379 4084590 3964268 3711777 3556687 3693744 3863173 3613123 3474083
14030 3474083 3329163 3744695 3724234 3574034 3340124 3299594 3224878 3410129 2970557 3148158
14020 3148158 3023449 3064724 3215608 3192003 3188319 3517082 3257101 3215563 2914373 3229848
14010 3229848 2753125 2893570 2746657 2836319 2990419 2972789 2621469 2980774 2663014 2769376
14000 2769376 2866596 2800185 2553450 2594024 2583122 2334475 2532170 2441101 2628662 2500878
13990 2500878 2314382 2358530 2552435 2806284 2571150 2349027 2387555 2732065 2302669 2915129
13980 2915129 2664665 2758730 3159545 3656216 3768739 4409277 6167343 9207713 15488676
13971 15488676 26896129 32716250 22229042 14849974 10263572 7829664 5853583 4904502
13963 4904502 4648677 3985696 3624827 3826748 3156726 3067113 2600401 3139884 2591084 2906700
13953 2906700 2759693 2209079 2522756 2557766 2473549 2654417 2526565 1902888 2618658 1911352
13943 1911352 2041182 2183805 2292147 2102602 2063923 2198480 2323785 2146066 2079983 2017866
13933 2017866 1908933 1868568 2065198 2182490 1873375 1914668 1942462 1653701 1780946 1900724
13923 1900724 1606370 1548652 1962592 1694686 1661436 1847487 1635675 1742308 1769491 1691704
13913 1691704 1568956 1675427 1625791 1518225 1590528 1675964 1699559 1470197 1368869 1654563
13903 1654563 1702191 1664254 1877400 1421470 1693023 1525026 1463943 1448136 1801011 1485693
13893 1485693 1609008 1323747 1678657 1365265 1795799 1483130 1725768 1573475 1217467
13884 1217467 1391514 1806972 1152982 1068069 915071 1464400 1413259 1079142 1220797 1496317
13874 1496317 1331134 1277911 1022899 1359726 1062569 1319860 1201006 1511400 1230040 1277932
13864 1277932 1231627 1324259 1136715 1680376 1064340 1258022 1267683 1040761 1379108 1205429
13854 1205429 1254490 1076980 1294881 1296950 1175568 1094563 1172503 1336408 909443 1098340
13844 1098340 1078353 998456 1038476 1043593 1077365 1277190 1276994 989848 1223038 1032855 1160213
13833 1160213 1045264 1237361 1099725 1102628 1150560 1243409 1057369 1100823 1066227 1188979
13823 1188979 1058047 756278 710757 1119360 666555 1269591 1096852 1162052 1219160 998185
13813 998185 1039984 700379 1085977 914343 1052624 978098 620763 1069014 827279 885714
13803 885714 851209 909717 733245 716600 966915 831460 901101 947260 798423 884477 804805
13792 804805 974651 675645 1028393 725399 967834 792687 806436 892656 606168 955735
13782 955735 659463 939221 428178 795481 1208065 1046835 721945 1085019 1043816 773229
13772 773229 1128568 840293 559856 404857 784621 821090 439003 932003 571223 835705
13762 835705 787026 726596 812281 621030 619721 911070 709178 772924 660321 936352 1040673
13751 1040673 651987 682688 997505 776284 494784 859394 685311 845835 888050 519573
13741 519573 499451 521326 816728 639535 777590 739615 751760 647369 1027169 715914
13731 715914 617691 580688 616962 367668 659371 708127 728710 779155 727630 434401 534189
13720 534189 664761 542659 1131419 491467 859481 631063 511384 519940 735561 528714
13710 528714 692078 550977 659384 325741 377603 856696 711393 655676 720222 715421
13700 715421 518886 561500 501853 816112 584088 551953 592996 759991 704159 449604
13690 449604 335602 551729 448867 648351 644907 699197 367015 427961 593805 622774
13680 622774 511361 469521 557679 748512 314667 572362 667165 340107 640728 617588
13670 617588 372849 795755 78480 235684 217116 324602 474348 202871 574769 395096
13660 395096 537803 604831 624506 676321 415969 481798 447368 485993 606180 619424 687864
13649 687864 612969 304147 326372 337418 347707 832250 -12400 184558 594971 451300
13639 451300 150751 571082 819784 631502 541034 321575 578627 447659 328882 312847
13629 312847 481558 198301 305914 395312 489311 339613 505454 655431 410962 433862
13619 433862 489669 555626 402258 143923 707420 361778 352539 462197 416887 418082 254824
13608 254824 683272 400449 553399 390654 493521 717916 349675 344898 631834 290183
13597 255087 469255 761630 415303 438076 674497 123737 517096 84161 384885 344709
13587 344709 252432 372864 228735 485416 430418 406751 515753 541899 619270 455959
13577 455959 434674 551090 263154 328584 62097 -3725 65233 -225925 362353 387320 374474
13566 374474 282230 505910 250874 198861 375471 438367 286297 560558 230554 255929
13556 255929 602222 214015 301332 234079 156147 549443 221967 404994 516194 579003
13546 579003 80686 -33332 307294 384946 403250 576375 541544 387405 446126 452982 299794
13535 299794 352471 488633 407084 350108 134765 411872 80477 179658 609878 456457
13525 456457 400101 243268 249790 571630 -44873 323712 563161 304267 297943 355043 269283
13514 269283 212815 151391 279551 150752 535191 160115 342510 370214 697816 9725
13503 390353 377708 160588 477564 339288 9656 434061 423553 653960 120832 448608
13493 448608 29351 248354 -91400 240198 223439 581657 227875 393569 492145 107699
13482 304862 67849 95761 252997 524708 634977 202503 163377 155370 428346 407676 252519
13471 252519 423566 234354 239984 341001 290891 164391 233379 286011 476911 229807
13460 -130067 345340 235401 384475 113784 247144 443653 71363 80254 246838 239759
13450 239759 493404 261487 255475 344238 -44210 597493 53424 537540 185999 386070
13440 386070 315276 416394 442190 30400 207884 -70357 302112 20582 80927 466675 338562
13429 338562 -22091 -112107 144432 322967 397715 315707 -29447 135611 314647 109549
13418 -47812 294802 -113154 159498 351731 -41077 285783 -145857 62675 668703 261529
13407 499347 93160 278972 175657 -51662 186725 171110 194443 612152 -56674 676674
13396 -180136 249187 160522 177592 70161 561589 301261 -49069 385362 -262109 243739
13385 430877 112652 402427 333219 397188 181925 47636 495858 44429 97639 54821 250138
13374 250138 433006 300543 311562 -79310 202239 310569 449810 97773 -106488 -1673
13363 364953 198252 244064 214907 330110 212897 65296 38048 272656 155811 214669
13353 214669 322470 131805 -10734 213760 67196 540367 380161 326883 5541 -113196
13342 -76221 465496 398648 264730 186003 224547 426826 412231 219324 362999 177274
13331 647323 270499 43983 104027 330224 2898 74123 143890 114600 512227 66226 297216
13320 297216 78229 283634 68326 -20392 257467 46035 329490 394499 281039 453293
13310 453293 213538 -70792 208113 475721 105146 281441 424319 347890 286061 164929
13300 164929 275996 -25239 59292 513806 -73201 211648 155247 227890 318949 443958 -124035
13288 375430 89051 -310339 285747 176112 409496 491268 -35564 145045 296378 230062
13278 230062 -49876 120620 -21513 -4012 257303 191840 -205576 194757 902 -201689 187774
13266 276532 129259 306030 396454 59286 415766 182528 184052 226345 165976 254123 505595
13255 505595 85479 100794 -198003 187396 413940 -329892 158752 -91811 165066 30461
13244 66597 164415 244264 302115 89238 103694 160822 -143230 115957 248922 188576 -137169
13232 273906 448183 161176 302829 182654 -319563 93760 46740 107339 36929 -76324
13221 110802 139593 82882 203116 364665 -36753 181438 361948 322814 -143225 -310997
13211 -310997 271370 225899 -81305 270307 -1849 -170436 240507 -30407 224843 -88460 132784
13199 95141 206653 142672 302576 -43249 132755 -114878 91977 -181353 -155620 -52108 -179418
13188 -179418 147855 127134 209497 169418 138498 -8729 265287 35434 248480 430187 -62335
13176 -50612 153778 -70580 8629 -107803 192864 -63724 -153420 478356 46051 397160 132254
13164 4841 138278 -15298 215436 -34617 404622 -20416 122367 172157 -72595 35112 99044
13153 99044 85243 -161393 186595 192243 49268 147726 -29786 247328 -99173 270982 142994
13142 142994 120623 180051 189976 317140 -105019 -180691 228839 289527 220532 -144029 188021
13130 339010 307963 190802 -240479 230126 260327 120714 208799 -63523 256029 193099
13120 193099 122702 349321 278126 316811 -122538 224606 156174 133268 -160470 21735 -127496
13108 108115 -286956 220036 160591 -105460 193459 46416 291168 35949 -3000 184860
13097 -175615 37064 10881 428301 -37355 406556 -119961 29069 72306 27068 389305 -56816
13085 -146458 67365 199619 -147077 158849 88026 429451 256351 -34919 169923 65970
13074 -62945 -32528 235679 -67253 -93177 209137 52973 214998 25981 145854 51870 83341
13063 83341 -48051 516202 107346 131243 -160447 27826 274054 -115844 150104 122707
13053 122707 219669 151247 482410 46731 142163 -28790 223714 160693 415 -118672 -38270
13041 -3049 -32483 -120883 -167006 508710 349021 -45526 130702 -4525 218196 189925 241257
13030 241257 285893 180337 550765 -69416 266920 -78851 347095 190240 246743 -213754
13019 147350 230579 -113070 40052 -124237 251939 61015 195926 93678 88166 -18242 420206
13007 -39859 59056 -82725 -37346 184811 109294 211090 65631 78486 -151823 297514 135525
12995 1540 -173655 -37948 139337 -76428 -64039 295296 205889 -118622 284980 64666 27771
12983 -3765 -38211 263719 179291 64516 143928 19305 258213 94026 80188 -52817 8218 98985
12971 98985 -168787 -78106 74496 145540 87677 -164251 -396656 102166 -57903 86678 -106560
12959 -36507 -396539 30422 22713 -77840 122385 71247 163502 344513 -1979 186281 -44280
12947 146996 295968 74684 -27339 -161322 -68133 -71342 -18099 -35458 -256505 371700 188556
12936 188556 38515 -158752 140647 419241 -226298 -158164 -13490 121062 209609 -135383
12925 86041 -185787 454327 -25678 -74550 63767 209513 -226996 -95288 -58577 -129887 -123189
12914 -123189 -56796 -335329 -13103 240216 239080 68003 143302 274127 103957 147727 180762
12903 180762 112288 104469 -32386 -111905 -110055 74150 56957 63161 40346 -102562 -189181 151448
12890 -154494 34496 -604 180682 46142 -16084 61386 -387337 -22624 -333243 200511 141702
12879 141702 -193599 422096 169144 137416 68365 6904 -35975 287776 68878 113568 150091
12868 150091 161724 373109 -234555 239351 64859 -62166 -43297 -227799 -102655 166209
12857 242175 -143598 -118455 44469 4256 70421 -79289 -85051 71172 43953 27234 139452
12846 139452 -173261 60002 193181 130104 66370 -144235 -17018 -88148 9522 118362 157036
12835 157036 143397 163324 199064 -54144 353892 -176673 104035 141629 -119712 -244691
12825 -244691 143171 59721 -239754 425080 -145829 -176811 64261 -12086 288482 148830
12815 148830 79533 -216248 -84138 1211 58438 -205752 -408175 117977 -211241 -317825
12805 -317825 272440 -36411 -188984 -87004 -81009 156563 137893 -102826 -134864 -21638 175707
12793 124629 -46165 182073 67319 -257817 -101652 -177784 7454 -338583 -105848 226151
12782 143685 -53528 40731 52287 214259 150272 12160 108287 -413145 10146 206358 141524
12771 141524 -124371 28022 159864 -52643 23535 361808 34545 -178659 -196211 -129382 -155307
12760 -155307 -212529 -173745 27073 -305177 88348 -16116 -188531 199492 -141562 127561
12749 234780 -204947 -1161 281489 309050 113098 111466 -381816 -98382 -213019 220892 136830
12738 136830 82631 116159 60210 73530 -38607 122703 -106817 -242951 166189 -52826 -62299
12727 -62299 -3993 238413 157102 -190188 81935 233268 42589 -160661 128663 188355 -94819
12715 135727 311905 -445469 256331 115340 -87132 201712 -203989 112555 9176 26176
12705 26176 -143887 -309295 140904 146654 111527 305099 92456 143819 127650 -41503 -81592
12694 -81592 203503 205102 -303927 167627 26257 -37612 246659 377655 217101 -168876
12683 -14069 403213 104821 225630 -84826 3045 47578 219759 444780 -744 5147 343557
12672 343557 268458 -167336 71652 375561 -104326 130348 -151456 -34810 -58515 223462
12661 101344 306579 -203219 -203304 38639 62578 5316 -94847 41229 -188554 -42691 131729
12649 115257 -67749 -310057 1260 -32665 251937 -47593 75216 -144450 231515 -181340 101662
12637 -355924 93584 -105130 40706 -46309 -80868 177673 503638 -275711 26633 -111610
12626 164115 -58123 -154209 -59360 198589 -152548 97824 1076 -212407 241814 -332765 240021
12614 345721 183791 81717 229934 100430 -50495 -65210 184262 224433 66973 31045 155141
12603 155141 150625 168783 64751 330562 -193615 41350 -64779 27170 366391 -199221 -215075
12592 -215075 135146 67758 -9012 -162140 527164 66417 -110531 -96938 42903 -82550 -60092
12581 -60092 127477 -82554 97083 85541 125414 -109986 201211 24893 -118131 -53621 -52340
12570 -52340 46951 -4291 29476 -117209 302073 26520 292044 -19667 69533 77374 -278083
12558 12928 340712 -27789 -222532 217960 -92061 230015 108130 -23120 108459 219551
12548 219551 54016 -65966 94479 -50286 74667 162958 239721 -118511 -81317 -39796 181632
12536 -118622 -282221 8940 -82578 -390540 -101670 -207112 135878 -67191 -171399 173430
12525 182381 132889 -371407 -60044 -330455 -109336 -153812 410124 100659 -86179 -118576
12515 -118576 169014 372770 183115 -50395 39820 -152090 66738 -79799 -178596 -235542 247717
12503 -60836 -268641 22416 -168035 410854 -41597 24803 -168207 114851 -64983 34453 -61220
12491 149216 -144389 -127519 78036 16937 -207133 119818 71663 -283764 -107970 71110
12480 67355 66941 -61906 273629 -134308 192563 143874 -186547 285515 -361871 36613 -183503
12468 50544 -122224 361882 -41414 -86239 -80354 385875 -59633 146079 50538 263863 -50326
12456 54429 -63629 -187516 -65858 -165791 -9395 -41862 -58973 8210 -105739 153309 -138962
12444 -153314 -60988 4337 -109577 -365820 568863 37991 19267 -364920 -179018 41138 126507
12433 126507 -17666 -57977 -32551 -254454 -323861 -97132 -329775 -225697 -65245 -187366 -71750
12421 -259509 166046 -307638 -96987 145281 -28950 -189222 257861 -233338 17969 164250
12411 164250 41290 -233230 14725 -23219 -2126 92628 159331 -102539 121735 -249400 146389
12399 -215173 219791 -117259 75174 147621 -101249 -81662 -142984 -161297 443542 -9640 -181421
12388 -181421 185204 -15064 -21952 77760 153870 -292510 -294077 -126345 208913 -65631 2833
12376 124985 -340381 -24937 237063 -119458 338857 287531 122837 51995 23272 47495
12366 47495 146395 126779 -300277 416610 -21409 161450 121645 143090 121313 106694 -216277
12354 66534 44936 188908 48935 -270770 -107629 82268 -47097 -44845 -89017 -190737 -146707
12343 -146707 -246071 -322073 -88666 139596 -151620 -256576 -97677 182692 -455955 292088
12332 -238063 23119 290380 141323 -226487 69160 107234 47091 80231 178804 59983 178600
12321 178600 98261 -64066 203602 228428 178881 64184 -270168 33465 75426 359314 191223
12310 191223 32062 35495 247848 -103443 -24385 -82479 -18559 362669 356983 105388 208177
12299 208177 228967 505656 -57167 115344 50236 263801 9150 -240088 154561 -31648 62005
12287 236335 469449 288023 282813 122779 -15402 225062 -252610 -115917 -181037 100467
12276 -225108 -56758 254946 -30092 158884 11118 147337 281970 75678 184051 323926
12266 323926 240730 -107758 230230 14546 163772 259036 -281538 69594 194683 302197
12256 302197 217954 495925 130745 238192 206334 181567 232071 171992 256591 -70215 104050
12244 -2980 -69731 216756 -108029 152739 203743 239637 9789 -151426 429515 313645 -19987
12232 476515 18609 236551 184768 267833 -171081 369153 -57729 -46633 259774 -281367
12221 118417 -45068 126047 188841 149040 153117 -101013 -125496 256791 266909 -15171 185022
12209 -101282 -53473 52616 225198 359554 41282 44441 314245 388681 148605 189917 17522
12197 289502 -165276 -131779 -171034 -146844 270092 155924 74772 101840 -116028 164960
12186 76700 -88132 444533 40949 -38352 125685 -37259 107071 260641 -11429 -277149 83323
12174 127133 315443 -202651 8169 263282 159028 32370 190740 166956 71464 187118
12164 187118 -61548 303342 -52987 261120 92256 -230477 149908 333222 -476317 188528
12153 226784 42641 -30234 396590 223579 -40990 203878 36448 201746 119897 56883 48827
12142 48827 254728 251772 208237 -164288 73914 85974 -38804 -83190 162505 -5347 174942
12130 230714 -341552 -257675 -325798 135799 360350 -23162 53209 227686 -5765 285862 112744
12118 158310 377731 -75927 113496 -81328 10256 68269 92483 202989 148806 -51848 -67901
12107 -67901 38729 226443 165217 12763 -218892 91914 311598 204253 10303 63156 324757
12096 324757 24281 46218 311970 168914 89347 292938 -256405 210527 -135382 -10365
12085 113315 4988 83486 -324595 -68906 135036 46928 21111 180830 206936 297691 146806
12073 -91327 320026 166522 56014 128441 118146 2911 -36158 94328 212772 119563 5572
12061 -5207 322936 200362 210702 13653 172953 64407 268271 -149887 214662 145972 -213394
12049 157831 162748 -100267 392756 -98874 -5020 -47351 16399 222766 320 40717 281792
12038 281792 149838 -76790 298797 144985 267844 4734 194320 128953 192245 -90519 176774
12026 -48533 -196945 -197417 -259933 -102436 157515 -262076 350112 12547 -7928 185784 -141706
12014 -82821 51389 122554 257640 56309 -116970 137276 -40357 -57972 -7419 14423 188388
12003 188388 -134684 273948 -82406 257240 430591 -317852 217252 371986 173714 224249
11993 224249 175856 -38088 161309 268712 309007 89979 5221 331302 195797 -149259 -29285
11981 -4270 -349285 90226 293955 -222280 -191001 -17793 -95899 50431 298337 68542 228405
11970 228405 -95863 -168473 22671 207720 88823 148693 188436 -90539 -253484 43725 -40802
11958 -140905 -330412 -38242 -164731 209000 -243065 -6773 -27731 41575 34621 20102 -331336
11946 60238 32515 93821 -121517 -286455 -290244 47237 -87813 -17609 -89565 -28129 -45622
11935 -45622 -210462 77795 -74995 176553 -305131 88821 -28502 -273931 -222990 291914 -56075
11923 27632 -61153 28836 -138444 114963 54088 174738 125503 175968 -200787 -44483 198546
11911 70176 -271821 -140684 -181929 151731 -323500 424991 101293 -36353 -69787 -461741
11901 -461741 -199792 -98872 175531 -53181 -173752 4349 311590 -17810 -7804 -38628 -21466
11890 -21466 68423 286588 -28350 -38693 78551 106562 -61703 -139928 64618 76969 -16393
11878 -3016 -96739 -362322 -114888 -440029 -73506 -438739 32338 -214844 121777 19190 -121735
11866 11491 -287732 1438 -12234 -67636 -193392 -94226 123570 160236 -235422 -33352 -284946
11855 -284946 134116 -99404 277937 15527 -55087 554088 -126167 289026 49936 -259778
11844 -118981 -175014 -138929 -933 -238358 92719 -175793 -256151 -29403 88919 -74407 129689
11832 328684 192973 -48258 -64675 -29320 -173402 143223 -166181 -123011 65704 -247714
11821 -62836 -103377 129430 120269 -118153 -12701 -65656 171552 236018 -334641 -320525 -51183
11809 170515 55684 -219994 46260 -421387 14912 -120520 110161 56956 -14505 -366616
11799 -366616 313562 47398 -107531 -60316 -149839 -167296 84837 -216728 166283 119698 30238
11787 -65215 -16602 191954 136263 -254987 159555 18189 -52740 -178960 -13789 -358521 -137917
11775 -176148 116504 35298 -256026 -1366 -76653 -155613 -349874 158678 95116 30937 -73990
11763 206156 -38455 -332884 120511 -47567 -103314 -202938 -30542 -215171 176296 -88372 117104
11751 27074 65202 -107370 -281225 -1290 -253910 138682 -97109 113013 109777 40670 88076
11740 88076 175298 -197630 97923 -220813 -74655 26045 -16399 -183575 -236946 222187 119204
11729 119204 330614 131149 -198121 107299 163878 166742 359291 -96378 11646 10246 148022
11718 148022 93671 108924 -75057 -271242 74350 152678 -207273 428163 -17958 106869 92363
11707 92363 -109482 133463 169143 41337 31512 265618 -68246 -220201 29215 -285497 -100726
11695 307433 58175 77511 -186520 -418594 40627 -50622 -147976 -1813 -266931 -205556 -117775
11684 -117775 -37094 133677 -102905 -205875 -360430 -77457 -123062 -266906 47337 243939
11674 243939 -30013 96653 96625 123203 183366 258424 55006 123688 155102 -139326 101302 -198834
11661 50561 300371 -198847 -69855 -76858 174191 387389 -154028 82662 163498 -280592 52098
11649 -149818 -51352 -1364 -76653 89501 -163055 199220 136532 88591 362280 -350032 125093
11637 124725 110937 -274946 148260 -111382 245676 -110772 -15844 238507 -79938 -36249
11626 -231249 455153 212040 -183069 16909 -164244 75256 -139195 83703 82305 156897 -109658
11614 89122 110109 -164089 -93465 286369 39273 75832 148964 -94238 -112007 258523 -73863
11602 144197 27749 -12612 -8940 253348 -81390 -320746 -223283 105490 -8391 -5935 -315622
11591 -315622 -65027 275808 -402537 40125 -20370 -45970 -87153 29104 138132 1061 -116298
11579 15313 25590 -37939 -17145 94535 -49238 -256840 4873 -87159 23333 178397 193505
11568 193505 -87237 198665 385358 158035 -25944 377085 533857 259971 81906 -5576
11557 67536 31931 -254050 10416 84473 53928 -96478 -24377 219215 69053 -74070 -96110
11546 -96110 63167 -36270 87869 -132550 75888 70749 -107501 -121685 26544 146625 -231144
11534 -287083 467243 169191 150895 -220925 11996 12400 70222 250299 70855 -129763 61725
11522 101935 114103 150688 -98580 -263175 -240877 -12569 -125962 194971 296452 216107 58006
11510 -67814 -98239 97084 198951 240293 -96697 244686 68668 -60993 96309 93898 16605
11498 91245 -146329 62303 54434 94067 87724 284067 363018 277732 177641 63643 298084
11487 298084 57475 345295 -104211 180571 -157272 44145 146977 62771 123829 83797
11477 83797 -121701 360448 77319 36989 82939 56941 -48642 301577 -52453 175198 -162935
11465 164984 230902 294857 285237 262233 149147 -101504 61309 143476 111678 117443 225337
11454 225337 81798 165935 224341 77844 570356 5796 -146677 -54170 60408 -68700 157560
11442 11100 239666 176267 260751 18804 184680 -14037 333889 108547 95536 168198 120259
11431 120259 42450 27559 6914 51655 112339 -542361 262507 91335 253980 -41480 -178953
11420 -178953 173404 -358201 227973 111449 302765 -204870 -188232 210397 -234443 -343183
11410 -343183 116893 -181696 78622 -17923 137594 -98617 -18340 -482283 -84948 87941 -309705
11398 15290 -92979 -298673 -45304 -28694 -18794 48057 87754 93509 -59160 42054 -13943 213958
11385 57506 -195572 -29019 2478 99015 101324 216682 -68221 177200 -70501 -70111 292218 -151788
11372 195818 18916 -238609 -118205 -146975 360734 -141608 -291916 -262964 -143810 64228
11361 177311 28909 -74245 267235 -226803 -101759 151015 -4561 -522 -24574 80706 -98787
11349 232014 -49620 79350 53172 -67747 144946 -107957 11260 -258163 -237006 -217305 -274562
11338 -274562 -101997 -73839 18695 -220037 -122532 175011 -38490 128147 -246024 -2428 -18797
11327 -18797 284051 -171489 -321435 -45677 19917 62655 -56932 214180 -86140 106799 3168
11315 114690 -252452 9771 282207 29591 7030 -165509 -26147 185313 134126 345042 -52903
11303 -311461 -54457 -685 -94963 -64405 -104089 -146125 -122789 -233597 31940 -192379 -119737
11292 -119737 9206 -198573 -31427 -126508 -283168 132525 76054 5025 342817 149017 36699
11280 55392 -223732 68908 -307949 -40502 -146985 43017 -80736 -499429 -210957 153345
11269 241717 -89458 -111165 -3785 -202984 124131 -260184 -130296 -63902 -34454 150714 155708
11258 155708 -232060 20028 100398 -72128 -181395 -155155 47995 134192 -301202 -39198 58832
11246 -125858 -166334 -150024 -258634 -880 -131683 -190504 -461791 -145849 57839 143616 -220943
11234 -184073 -137989 -82445 -30820 -65347 -193238 -161925 -169297 -103874 -196190 -69793 60621
11222 -204422 -137343 26855 368941 -154183 187025 26720 -33630 140817 238729 -84889 -74706
11211 -74706 -193935 243094 202825 -69974 111950 -68311 -53803 206270 -232927 -133338 -110254
11200 -110254 -143837 -280067 -91404 -29670 -196419 -468184 221238 -91191 103755 29683
11189 -240417 -129177 148178 -418340 31238 106040 368257 184067 376115 224423 -53749
11178 -131121 -310321 -23783 30998 92990 98036 -59420 -154059 -43209 -120349 -153832 -18494
11166 45603 -221274 -141742 -138822 53480 44763 -392735 34708 -44375 140597 40016 4899 -115276
11153 -154805 -288517 -104722 -134098 -31296 208154 -132666 160327 -307105 18695 -522617
11142 -148505 -399964 -28309 -149890 -56912 171642 16965 -51136 -81020 126598 110767 -192357
11130 199403 6552 -252425 -24274 350417 321516 -271578 78994 -14132 25063 -262391 -73817
11118 217030 -4146 -1776 -231818 255169 20991 117703 -15845 83952 240902 -62622 -55825
11107 -55825 134240 -311823 -210390 -30175 4478 92983 -160474 -246052 -192481 -180791 -172743
11096 -172743 -33072 -60563 157837 101706 -186080 114433 -131395 -151836 95080 185745 -143927
11084 271747 107342 257498 289923 236493 334059 -222689 97525 87874 79818 93072 424565
11073 424565 577913 320979 354698 293323 -109463 119474 210314 108468 140004 87664
11063 87664 184939 -128659 422193 149400 452812 88236 237729 200991 78189 90130 75623
11052 75623 216137 255512 158180 291236 189578 169352 369004 155094 207886 391647
11042 391647 249044 282814 518688 503504 740554 553389 664034 417348 346976 517303
11032 517303 885717 452991 753711 265239 471929 716694 632695 554805 379702 699621
11022 699621 588807 445259 783183 395015 488012 381749 669946 670956 688061 493677
11012 493677 438795 454600 837675 569315 618254 369591 753551 515468 562597 442699
11002 442699 982793 325104 217559 571828 778405 468275 296937 385937 306620 665374
10992 665374 460791 535397 79156 765009 507352 542513 396799 554831 532481 486989
10982 486989 382682 694375 547566 534123 540952 530021 719519 828222 496855 434221
10972 434221 504253 988918 810700 814962 599380 890162 615236 943423 710725 848870
10962 848870 1079273 1110008 1430940 1261593 1282611 1540761 1610936 1916198 1732295 2029157
10952 2029157 1710139 1688236 2138613 1751774 1822975 1399162 1786219 1471651 1431959 1313070
10942 1313070 1574022 1596506 1651101 1583969 1316195 1343305 1438100 1365261 1311462 1325197 728509
10931 728509 790227 483449 699620 413587 374361 272842 243625 426148 -44003 607111
10920 6141 538978 -37635 -280313 105380 235302 207808 120994 155402 -108845 -51449 -211313
10909 -211313 246136 207534 188515 226492 59888 156874 -223419 76966 76803 6067 48929 18947
10896 154598 10709 296740 5536 -83468 72329 -193185 -203629 -114182 53820 76066 -61473
10884 110455 72062 134167 97384 141481 95609 64239 -139235 -110937 126502 135144 -71818
10872 -227611 -115165 -3354 -269069 50877 246004 -184491 223312 126910 21210 -281714
10861 117737 -8318 -65489 14197 -148989 -290962 -54693 -48215 78079 -11423 -51225 202993
10849 145215 171599 -496177 9238 50958 6587 94806 -196180 -146867 -65988 -96482 -187364
10838 -187364 -19367 178956 -152252 163371 -170270 103816 -132509 -222403 -129568 -191486
10828 -191486 -79766 146400 203951 -45739 149126 -205997 -36105 100248 67377 160340 -199834
10816 -314707 35490 -148561 -49269 -413431 124583 -40753 42797 19694 -98439 -397443 -50854
10804 155919 226209 78560 -37597 -92799 35545 21739 244512 17522 56906 -10945 -80483
10793 -80483 -255780 -404377 283305 -79556 -74354 -139746 28458 -173780 103734 182101 -274749
10781 102031 121271 106876 -102178 41945 -148518 -52975 -134219 202893 -121671 38490 -40931
10769 -78158 -151805 -125653 -161176 96304 52968 -246143 -267833 177487 56241 -191767 -127921
10758 -127921 -31754 -76131 -84851 -317523 37372 47853 -90342 -118149 -38670 133942 -26776
10746 -64194 -147948 -293091 340954 174540 140982 -293765 -189395 -38589 -171319 271049
10735 -259789 -191649 -77870 -44301 87359 -195918 127649 150005 340656 -45081 238446 -170039
10723 -264865 -239632 79314 -371153 12759 -230700 74713 -85826 236676 123826 144408 69974
10711 -287085 52557 -14955 -35017 105443 -271817 -59079 -65593 -29417 249021 152761 196446
10700 196446 50228 -244521 -200998 -136048 41460 -324637 -392506 -5451 -104194 240236 -106549
10688 -267611 -278726 -42656 -59861 -218585 -68014 -202318 -129728 -77484 -301525 229818 35030
10676 -105735 40274 -247621 29889 128349 -433064 175433 -33192 -95349 353195 295230 126767
10664 -185208 -128599 -110172 -228504 -163686 -44947 68560 -76639 -153913 -65985 233860 -12129
10652 -6056 -235859 171405 -44477 77515 -254498 147057 -87812 108476 -45 -358685 -243079
10641 -243079 -136252 -278917 -110589 -158930 -135380 54101 153385 299840 -162459 402795
10630 -192448 179395 -126226 -328055 48619 -15962 -169414 -603127 115738 44476 163911
10620 163911 -60469 -259350 -44387 -20097 -61182 -330905 118972 -462316 -228023 174901
10609 297587 -109894 -44869 -385213 -186034 13577 167819 -61001 -272224 -765 -148097 -259152
10598 -259152 -30859 73175 170372 -221958 332303 -210673 -387609 -135866 -100935 62448
10587 87202 -161202 -28193 -117408 37586 85072 37786 -419950 22952 -13834 -96588 21070
10575 92485 -104348 -224137 -101447 -125535 -296753 -106587 -138677 33981 -37091 -1269 -159626
10564 -159626 99360 -273927 -201818 51062 38614 -185355 -256515 -180966 -37209 110571 -74672
10552 -321873 134620 -112281 -422 177792 -154764 -28618 -53628 -230647 2343 -21047 140613
10540 344636 -40175 -243611 -13008 -173756 165931 68450 -216245 -316015 -85205 -18854 -20443
10529 -20443 132960 -21737 -65092 150770 -191169 55741 -274382 -168762 -178420 22111 -165705
10517 -90166 -199796 85705 -34980 -10352 -212783 -74307 -20714 104540 -87031 112207 -444616
10505 -158201 7725 213132 127030 -366119 -44471 -3849 217844 -46303 82518 -311615 207941
10493 -195266 -230358 -226372 6906 -455110 209305 218619 -150131 -212119 177989 35782 -99842
10481 303948 -56611 45326 24425 12305 -185146 39728 185042 46338 208919 176242 -213435
10469 44967 -6016 227347 -159006 90797 2076 103360 318436 46114 120340 355031 709243
10458 709243 347189 454449 -153205 296636 291077 -63426 15614 265133 -204676 174261
10447 189080 70342 98286 -37226 -112577 -101725 226073 -78767 125608 -191422 108548 -200867
10435 100271 -152079 34866 133981 -15176 -457780 -66886 168368 -233316 -16382 -132174
10425 -132174 -348604 37598 -55738 -211633 93537 -306891 -230651 -159776 97419 112567 125356
10414 125356 285540 126209 -197226 182607 -421405 9924 -54787 -2262 -36273 -3949 -221750
10403 -221750 379642 84138 -64495 -381518 39451 -320396 75149 -75165 -164363 -176431 -132238
10392 -132238 225996 384429 -41499 -76984 -412611 -212782 31712 99423 385835 -49160
10381 -77089 -379693 92357 152914 -160756 198689 -231655 241241 82131 -218149 21050
10370 -109749 90655 36600 -248999 -142436 -121082 184565 384885 -107085 -139412 -13377
10359 285974 165746 324501 375385 -188252 108116 205895 414133 200584 538268 345612
10349 345612 350581 -46640 391977 285087 191086 413023 146405 178564 516243 -15432 312265
10337 209593 -41736 156555 253205 269803 -59755 343666 217308 153694 324533 242791 296775
10326 296775 -92351 243155 336589 215988 488802 -21518 104339 -24458 272210 186792
10316 186792 -151778 302200 342513 146270 127456 325491 -11980 156272 14609 79909
10306 79909 152636 57784 73119 -141285 103887 157568 238027 163521 179519 116499 -48326
10294 -189172 26365 352756 97549 34806 -231605 -7667 68191 -209968 -55531 144451 22708
10282 -197283 176738 -8636 201058 -209957 -5338 118307 12346 -51971 -51230 58808 -177386
10270 -317193 20896 45352 229675 -91136 173140 -186464 -242487 58240 147586 229344 84162
10258 -41166 167325 -158328 62744 111924 69331 -175715 -83531 -172812 -147127 -89636 -441747
10247 -441747 -225576 -195801 -213805 49538 -102523 -16023 -114451 332986 58827 153030 74800
10235 -30982 421745 4378 205537 115508 68758 22426 -189079 -62737 208592 -83215 -92904
10224 -92904 -378634 -199948 -96645 -44201 80433 -389393 174251 91376 -286309 212848
10213 -322711 56374 52992 -225600 -297668 -83727 -192530 178093 -319639 55010 -153967 87527
10201 141559 -290111 -17258 187525 -113599 -56849 -213584 -91879 -108858 -51804 221496
10190 352479 -92293 -20858 -111598 -90536 79585 -227226 25762 -168503 -352710 -13142 132461
10178 -287155 -20406 -184722 158785 -8506 -173810 136128 -462110 6017 -136682 -60374 -2271
10166 -274751 -121575 -168881 393209 -119326 176328 -153158 -131682 -76158 -223486 237984
10155 -131458 154882 -277400 -414461 90579 -65425 -143787 64708 276913 195061 131868 -183057
10143 10604 -5578 74508 384623 285643 153512 140052 341995 -140121 -79865 91963 -178328
10131 -172910 226006 -3046 13800 249134 -42933 -72398 -263314 225538 4627 -31224 -28817
10120 -28817 87896 -185781 5190 -336141 -227351 -62954 -107557 114450 -10057 -527807 -239181
10108 -64094 59362 104260 304216 -68560 222730 -56344 96443 -172881 -254209 -44282 -239709
10097 -239709 -178553 -230339 -208574 215308 -46102 -117652 409411 93141 -369764 49334 -26535
10085 -111624 -283241 300979 -103906 -160967 123886 141091 -216144 174084 -161415 -143648
10075 -143648 -299829 116424 -19092 114103 -62188 164858 215288 -159910 -219168 113741
10064 295601 191023 123615 -105500 20292 73742 -76990 86915 -306217 -411200 -133141
10053 -5362 131491 53033 -352418 149585 168286 82353 -140441 -37633 -143694 -222481 20466
10041 192758 -14005 76896 31010 -387658 -46839 192942 -156048 165813 -18070 -17253 -69785
10030 -69785 -227369 67998 -157143 -79271 -339069 -179787 -22357 -328413 -7515 -81960 -174926
10019 -174926 156030 -149878 -28799 -36369 65733 -28493 175379 156261 -1777 -183281 -120688
10008 -120688 -232860 -104521 -134211 91887 -185886 106629 -36608 -94852 -21927 40486 -79070
9996 -60787 -136125 43759 -32225 -372803 -29918 186754 256332 -339074 71481 -260095 316984
9984 -34243 -511006 188880 -409256 -195483 61771 45839 -44173 -136990 -102668 203305 70801
9972 -63379 114605 -244061 -103337 118841 -318679 201257 96391 203956 95843 -157418
9961 -217543 138779 -252348 -109601 178900 227044 -75747 100879 -64879 320311 74933
9950 21067 36441 -17190 -275407 -582185 -335063 -115345 -292907 -508863 55629 -80067 75353
9938 7897 -391146 -319657 -88652 -129543 -225576 132092 112508 -193256 146686 -255419 -126351
9926 63712 -6054 46327 225056 -93485 -125212 -251765 -187221 -212681 261864 23732 -136471
9914 -103602 -137297 -220172 166729 -354225 142451 -364293 -79383 89426 123143 -131112 -242201
9903 -242201 -241510 -1194 -274658 5380 -100072 -97382 -172511 -281420 -205882 233616 73763 -44972
9890 -258724 -182807 -143379 -131605 -154745 57292 -264103 -350656 253244 -47317 -305376 -141594
9878 9266 -220633 -147877 -197745 -39843 5003 -326514 -4214 -282696 -198909 49581 -32953 36133
9865 178535 -172977 -86800 -48508 97792 37581 -258889 -139627 452469 -17994 -188488 193773
9853 54235 -261166 -252744 64992 -89540 -259968 -105472 65678 -184852 -272037 60110 -192745
9841 172193 -149592 -9358 -250026 101567 -81132 140960 206925 -91442 54486 -162496 -138333
9830 -138333 238974 -59810 -127868 -386749 -158083 44217 -110832 -114352 -258846 -408580 59977
9818 63123 -50036 -79175 11515 -30154 117726 -53915 64541 -253404 128583 -102311 -189910
9807 -189910 -89328 78824 378332 80756 199640 189555 -266552 179900 339991 182881
9797 182881 -249847 26212 48582 54927 27363 -182378 -302024 9149 -154025 -20589 33961
9785 -322748 64910 -110410 396012 145771 -154895 18337 183982 -199960 -318696 -108259
9774 -176971 -194957 -85384 -324944 -54970 46591 -347632 -74932 127039 -152960 -156615 -11618
9762 -221121 -305864 178580 -42257 189074 -345922 13701 108857 -105755 -47995 -52198 4343
9750 -265391 -63649 -175095 97722 -24992 157516 -206294 117439 30437 -44216 -181339 -119982
9739 -119982 61149 -155902 -239436 -57670 -44447 -135856 75876 -156165 -21361 166044 -320434
9727 22537 53548 132010 15134 -162624 -11772 -81777 228911 30551 160153 -132819 -267495
9716 -267495 195511 -353252 -17545 158364 -112862 54567 -264518 -334891 -233543 -121010
9706 -121010 -86103 -205189 -485389 -60572 -477673 -27994 26103 345960 -120262 -84838 112615
9694 28694 284633 -294111 -343946 -213676 -163923 -85609 -94400 -305203 -165077 -356717 -218389
9683 -218389 -163372 -47426 -124278 273884 -247818 -298762 -51859 97826 54880 -107088 -19411
9671 55821 -51996 -352066 -10639 96 -168619 -249628 36139 -56336 -1887 40394 -140736 -120278
9659 -120278 100275 7654 -380691 -277257 -221051 -21081 81210 -34191 -86465 -60771 -44362
9648 -44362 -176110 -134835 -18769 -57606 -253438 -130716 37426 -47481 160961 19872 -140373
9636 -112176 57407 70050 -53324 50157 -182501 -81186 -125061 -89077 46883 -157924 -368704
9625 -368704 -27422 -135922 34086 -97648 49293 65308 163932 89793 17548 -63038 -81548
9614 -81548 -51412 75043 121421 -148222 -203397 -79976 -8664 -20496 33141 42982 -52548 -41028
9602 -41028 116731 226159 -205849 -153995 -86037 -103390 92990 34755 73121 -16664 52483
9590 -32547 -54525 150925 158988 33942 103149 -52104 -215663 181790 -321889 -100377 -53597
9579 -53597 4985 57936 -228627 -294044 30764 -100570 -245685 -179838 -207170 218565 -190575
9567 -37521 -206861 34566 -108384 -116557 183488 -123373 14350 -225166 99295 -43125 -262263
9556 -262263 -65183 -133365 -8775 130132 63952 -51927 -228348 155114 -164688 -71601 -72260
9545 -72260 -151819 -188375 -33114 -256771 -30423 -290791 114865 78106 -358916 42809 -272578
9533 -454399 69771 -239531 -297987 264098 12718 -150918 97349 -48142 -219483 -91239 25727
9521 128678 -37048 -7612 -226362 69535 39880 71115 -296731 57067 32574 125279 43143
9509 7747 -184358 303971 97463 -121301 -328560 -272938 202269 18491 -122114 -116115 -344794
9498 -344794 -118864 51839 -404764 -89000 -121936 -23421 -123631 -66196 -159517 -88301 -198121
9487 -198121 125768 442832 -147719 181893 197182 -121524 -48412 -411332 -100488 -10963
9476 108094 -333918 -44130 -104748 -300947 -54242 -110473 31983 20579 311703 27955 139454
9465 139454 -94930 -155066 135285 -262188 -289485 -107994 8366 393162 -346888 -6820 -311509
9454 -311509 -222618 -174514 -72272 -307954 -197860 103620 -189844 -46314 -2035 49080 -138980
9442 -84540 71062 -101189 -204194 122971 158298 -28475 71140 -50925 210309 -47736 -288032
9431 -288032 -21563 78352 -323522 -47015 34655 14096 -104821 -157225 -382958 -126806 34447
9419 15560 13441 75406 -117669 -548116 -95580 28026 -64095 -50831 126202 -5912 131972
9407 -329168 -103653 -365832 -103362 -169250 -265534 -236507 256132 61138 84833 27217 -164102
9395 187524 -79360 -409744 -354135 -211303 -9042 -5109 -95862 233000 -232499 -47082 11235
9383 -44523 -35957 37312 -202331 -269190 -12233 16729 3856 -183418 166144 -313184 34257
9371 -116554 -100154 -75966 -16406 -124122 9234 -181838 -274380 -147461 136695 -49984 -156683
9360 -156683 68108 7989 -228271 -30635 -144130 36728 -7369 -139145 -239260 -151648 -462076
9349 -462076 28170 -51255 -143301 -143226 75613 105507 -156988 166883 -167616 -287572 182243
9337 -258466 57482 152963 -13535 -202353 22468 -361308 -307235 303255 -1862 -76164 -225711
9326 -225711 9946 -63667 -174039 280676 -16207 -69619 -173476 -279338 121692 -319215 -274047
9315 -274047 -302038 -163840 -303346 -376019 171748 -307102 224493 -194686 225600 -87957
9304 98931 -168444 -220668 12861 -90188 -151130 -115703 -764099 -67110 31565 -472183 178169
9292 -4193 -121386 108552 -52821 -129139 -299204 28982 26562 216555 -380345 190714 196351
9281 196351 34998 18748 156802 -167814 -37118 -94021 -397886 92962 151128 -233495 56402
9269 306785 32347 175606 135773 52644 -172127 -80685 6895 185089 126871 65404 -65017
9257 355872 -73243 -118666 -54110 132647 -271523 21949 -63622 27586 -28067 -292564 164181
9245 55741 141306 -306334 203434 -145411 -17455 -171876 353857 -98440 -53004 -24261 65598
9233 -215054 -178028 -108740 108261 4632 322713 -27233 -104636 -313563 40137 214060 -16359
9221 -538387 16853 -103228 -294243 72521 39907 -234793 -280900 27872 180690 -420535 -197191
9209 -129349 249668 10350 -161481 -350756 156536 58224 127087 -120207 -194696 94071 -184027
9197 206509 -53440 -77826 51993 11102 -55623 -150039 149945 -133238 -75457 -398695 68440
9185 -88659 -395035 -234279 247906 -85260 -105524 15305 205488 -623416 -201038 -152853 -122797
9174 -122797 205669 107149 -115768 -32579 -67722 -209996 -292875 317245 -274706 127267
9163 95968 -164987 -100319 -8794 93747 58965 -56312 -57561 -192014 -153849 -62749 -278626 70770
9150 90792 218625 -230883 -96333 87099 -144621 -68291 -11319 -322320 92371 -213650 -535459
9139 -535459 -119791 -51132 -96326 -83778 11651 -145469 -192598 -206813 -72310 -48115 22135
9127 -14960 156897 101410 29679 -106981 -182421 -89801 -280016 -257877 28803 229337 -4702
9115 -227096 -193349 36428 -144867 -45777 -320300 179291 75830 -113539 223047 -261485
9104 -88399 -63594 -298421 -73917 41957 -318030 -1943 65635 114208 -273309 90970 -195817
9092 198273 -61726 140134 222952 -15022 320388 -442790 -20571 145516 -254918 -83606 -75836
9081 -75836 71514 -132165 82411 139090 -303670 -87805 242371 -4261 37045 90688 24069
9069 -69032 311820 -222128 -23768 29939 -253960 -4833 -28337 153426 -362237 -112994 -405385
9058 -405385 75465 29844 -36429 -389782 -227736 -280528 76416 -201591 23178 -11551 24827
9046 -231229 76938 -131427 267279 -195172 45422 -191603 103144 -165488 -133571 -212678
9036 -212678 -99752 -384801 -22354 -213387 -5399 -280833 58470 -229781 -440324 -37361 -347298
9025 -347298 -65996 111695 -201933 118819 115781 -88696 154711 -500761 -410258 -71768 -102052
9014 -102052 -22871 -86946 -163881 -59252 -471817 -176150 1487 -60122 -209191 44756 -365371
9002 -86264 -97776 -74115 -199412 49321 9072 -64324 259394 -13766 -103712 -330357 -221919
8991 -221919 -94180 -47745 60495 70683 -480295 -117174 -168911 -393062 -182780 204056 322804
8980 322804 67022 -197440 162534 -718 -263392 -178145 -506816 161316 -205446 5163 -178928
8968 11841 -76766 -146859 37551 -80169 -330090 -248646 114700 -134703 2892 -292527 -121179
8956 40798 -180286 143508 86133 -25976 -138010 37425 -151412 -118036 -151228 173764 53384
8944 -205379 -250588 -188196 -15001 -92562 -120483 -220440 22725 40394 -380682 294 103629 237334
8932 237334 -146836 -43748 147442 82778 -217941 170954 -6249 -215433 151539 -1254 149656
8920 -210844 -335215 -139416 -117131 225873 32336 207813 410881 -309193 57560 -60180
8909 378704 312628 290050 616307 830453 2029025 3622823 7948788 4281179 2292513
8900 2292513 979540 631438 517414 48772 328114 292318 139588 267910 -163667 -49374
8889 259727 172618 -161327 -98583 219302 16967 -147759 -49393 112217 -7002 80207 201999
8878 201999 30893 102593 26882 -393098 29369 -267294 11452 -40682 156045 209046 -42184
8866 48263 -93246 -163818 11601 207457 165340 -84153 -334255 -212817 -338754 207155 -18705
8854 -60948 -21153 2153 -77523 -19041 -281298 -207152 -228501 -399901 414877 -290859 -176382
8843 -176382 -135461 91525 530743 80808 -80906 -1744 -145923 242512 21558 -134222 -105069
8832 -105069 87854 -143263 -112638 24594 -157757 -277966 34044 -186311 -60624 -20042 173154
8820 -169860 -175589 -302918 -166515 161759 97196 -102071 -317880 97536 -80650 129801 -102895
8808 51319 197146 -25833 -353311 120137 -223065 449759 -569467 -116670 169326 -82771
8797 -35531 -61380 116444 -9713 -158393 12560 111325 -327727 -353415 -263843 228154 213427
8786 213427 -132186 292969 76619 -193737 -172267 -183337 -231057 -59997 -126054 484447 -424597
8774 193143 -91552 75068 -119980 31225 -131798 -144829 -197156 -260390 -345349 -53101 -105337
8763 -105337 11822 -177537 4629 89485 211641 -221627 -85462 -35640 -140524 -234815 82304
8751 122213 -71756 -89253 82592 -385757 -301125 -149210 12418 -85246 -196864 167656 94296
8740 94296 8188 -25053 -276017 -314489 92374 88634 11630 -167956 178498 41498 -137902
8728 -157635 -234128 -208595 -16920 -210873 -212305 -77836 26433 241826 -255265 124323 -169110
8716 -126541 -43764 -90875 -127781 278606 40354 74489 -12232 -280731 223424 -117080 -37388
8704 -25599 -26217 -200861 46066 -21618 -68841 -4849 93044 192038 132767 -310059 -56153 -120263
8692 -120263 8860 145967 -116649 -25479 24802 -353090 -72517 -318104 -200935 83616 -47908
8680 48075 -205458 -34232 105686 65278 -30782 42255 -32224 -233673 110400 -292246 149582
8668 89019 156849 166919 -33594 230866 -242984 146767 -61991 145493 -287875 -304393 192777
8656 -390764 -343064 49276 -138743 -54812 120440 -105185 139909 -130305 -72167 48893 -25797
8644 58369 -47720 -5668 -45755 -95810 30492 -165393 263802 -100581 55671 13579 -143099
8632 -177389 93521 -234574 -64358 -90486 30373 72649 -49459 144684 -70201 345873 -76983
8620 -282401 -15899 -331085 -16415 -63537 -244871 -127483 104088 -10318 277852 -102790
8609 -97800 -239580 141427 -66003 303761 -49941 -31668 -129228 -220248 -110295 297479 -2855
8597 155713 147599 -333301 66000 44818 14011 -200191 25108 -23170 -32181 76290 -188541
8585 -91906 -40634 -136269 267465 -26741 123327 44379 -8499 151142 -45674 405865 -135219
8573 -154916 -20035 -302549 206794 -106033 -292986 -291151 61775 -169544 63755 -19123 156456
8561 -27688 82378 128241 -558 -192692 143520 239005 -50152 -303972 -16932 109386 -183501
8549 -48516 -173375 191110 -290663 -660229 272618 -392910 -142327 225478 169307 -254831
8538 -35049 -258522 -1180 -33936 -383737 -115736 -28642 372792 -115840 -139295 -74481 -222485
8527 -222485 66884 8054 -18113 191175 56732 65704 169150 -301386 -95531 -83391 54158
8515 -470142 12190 -35945 -206809 -359314 325265 -90727 10887 -135200 243880 236375 157657
8504 157657 283810 -168668 8939 120067 -84854 231006 134839 -715 8698 -226947 60095
8492 -27023 -163198 -368575 -99111 -88317 -130234 -95423 -226422 -210752 -117386 189739 99201
8481 99201 120906 -65280 -48922 16512 -150002 49219 -41089 -258026 103625 -197729 74417
8469 -348091 -52126 27399 18108 -34877 -289167 -119047 -96808 -182514 93353 13403 -186728
8457 16854 -240035 15067 -363 -91303 -112169 25578 -87786 -970 185384 115707 -132623 83420
8444 168112 -201826 279866 45723 -144377 97044 196219 -61699 -197142 -360462 130163
8433 -33087 94793 -380494 221373 -42284 -40562 66626 -45164 -11168 -286392 -140238 -177449
8422 -177449 -272019 55819 -14613 10593 33256 -106669 348969 -318191 172785 259587 -219060
8410 -550226 -174569 69072 -110699 371738 -234489 -11675 -36887 -28523 173863 201273 -221193
8398 80188 164522 -269485 -31261 -223237 -66859 3859 28664 -77762 -27035 231059 -73693
8386 -54076 -411471 251558 19290 181155 -274661 199214 -4153 2912 45205 39180 82928
8375 82928 -156512 -210386 -12855 -7879 -82371 455907 -239893 -83843 -168946 -234964 82353
8363 -281183 -98800 -94184 156466 10523 -73663 16938 -305740 89874 -140646 -90711 -318004
8352 -318004 -78137 117049 210306 65795 91499 -38859 165019 -69883 372463 -220877 2276
8340 -319554 -54905 -187436 -43392 77534 98312 -84842 21272 47852 -325557 116530 108114
8329 108114 10524 86393 9833 54893 -24300 -140132 197942 -189191 166854 -45798 -337335
8318 -337335 85583 301926 236524 -410436 -144292 290996 -39414 152349 164418 -165794
8307 -40900 -122140 190190 193827 66703 -516742 80205 51120 105800 -355674 -69390 26033
8295 -222068 -88481 -58117 27574 166021 53811 18180 -164375 -250434 -172402 -423829 -25403
8283 79506 91548 181880 -309098 2376 -9070 -60126 -166394 16501 -18995 6070 -183196 28861
8270 -73702 -386769 85624 133865 -171616 98666 -102147 148340 42579 -130436 11282 -128370
8258 -373210 -37676 -334500 192800 -201779 112671 -42704 -77193 14101 -2084 -164217 -65087
8246 -8853 101946 -61532 -408771 172523 324700 -166985 -124247 -223247 -69 167843 -24421
8234 -81970 -305991 -158021 -214732 26043 -292516 -231836 -89339 -111963 330679 5684 98856
8223 98856 -36838 -314042 -49754 2415 93366 -80076 133071 -51851 -77466 205394 -230283
8211 2031 23588 27714 -286099 55622 20920 118376 38498 -72031 34628 191285 253773 -131298
8198 -36150 168320 137162 -88989 60322 -176347 -3455 -21216 177825 -94077 -356916 -2888
8186 160870 252496 65844 -140714 -198813 -376608 113264 -59364 119093 63869 -93716 -23655
8174 88515 57104 -38115 -156443 -116713 262742 131189 -59280 -187603 -69621 -347141 67295
8162 28749 80824 -255138 -238877 170788 117896 110646 -117205 297468 132545 16202 -128277
8150 -60770 61857 52387 6662 -387649 -196971 177998 -94365 -133877 -204568 67646 -124732
8138 -128648 -105558 106218 -87966 149331 82056 -213045 75869 -310781 -347509 -260074 -221501
8127 -221501 -126004 111992 213532 111532 -153205 262686 -393001 -237887 47145 -137332
8116 -66885 -192973 -103394 -148054 -103992 707644 22098 -258474 50060 92419 -37278 -22469
8105 -22469 118008 21988 239816 -244603 -125470 -93756 -368589 367187 114417 -232043
8094 313788 102463 -75009 -123756 -189000 148444 65529 -197017 -207711 -27467 87405 344131
8083 344131 -145524 -209 67718 80179 -353729 -74350 168280 98406 -166004 -339661 -59994
8071 -116468 -159862 -92369 -265533 -151646 18792 -172631 -53393 60438 -136092 161559 -202535
8059 -77436 -147435 -52647 -212708 -29533 -238324 -111393 -215965 141604 15309 157659 -312573
8047 -20940 -110948 243648 -88447 152160 -37715 -8238 -381648 39396 16520 19719 118201 -16517
8034 66073 -48006 -470410 -165120 47494 51479 4759 -52772 -64205 236130 61673 -173423
8022 -478192 177591 5889 187757 -194285 -147674 -26925 -430800 -45209 91996 -99784 -77805
8011 -77805 125158 236634 25559 170271 85664 -182716 34638 -77921 -536565 78742 173371
8000 173371 -163204 -42494 -101700 177627 36770 -41345 12129 -317581 -115669 -36591 -177800
7989 -177800 139900 284378 32218 -372189 -149065 206509 129619 -13404 66798 -224042
7978 -290407 203573 173391 -248785 224069 447082 -514111 13163 -2653 -360545 -3655 15576
7966 -234590 385897 72722 -476759 -63294 -401189 -241672 177833 -401155 43580 33494
7956 33494 -313191 -374154 -184364 -343882 35959 -23464 -128211 -27171 134711 -179861 -251531
7945 -251531 -143937 193466 -2859 -288567 -195479 -142665 -55187 -156870 -128088 -188830 -76975
7933 215635 -45977 -141685 87256 86139 59866 19081 -30838 -67704 -149411 66037 -252043 113905
7920 273838 194571 -62901 65160 187430 199477 -96163 -324225 -158868 -167059 -323626 -299649
7909 -299649 54642 -290465 -26054 176030 31685 -24985 145735 -314087 -112804 265040
7898 -82586 -247139 121749 104564 286831 34411 -145392 83553 -189202 -82718 -15876 -50390
7887 -50390 -150502 -70268 76003 -97468 105436 -142531 204415 108716 -167074 -483507 -111902
7875 380263 -217865 37946 -147513 182832 -161503 -301073 235215 -107170 -229459 10966
7864 -175560 86723 -106025 -22587 1077 25098 -572829 134824 -181922 -241119 -70398 85252
7852 -147960 61763 -319146 -220209 318830 -36886 63471 345082 -80596 14320 -301496 -28808
7840 -143580 102384 95205 137319 87537 -18261 114218 -95703 220101 -263144 179620 -63753
7828 -56961 -135103 -230322 16700 226761 -279259 -352514 -222515 -281480 -16879 -16328 -77800 -109137
7816 -109137 -53712 -11858 149887 -274433 60375 -38287 79736 -250268 -191547 -119249 -220477
7805 -220477 -15460 95275 139070 82838 -207288 84176 -184276 -184563 272517 218629 46739
7793 7448 291055 -100378 -195809 10405 -55157 -69942 -98983 179818 -123317 -424185 -302145
7782 -302145 676 54984 -129608 -202922 211350 -216787 -112244 -194900 127202 169546 -27082
7770 -114977 -74842 221026 -142746 -57613 120478 268020 141830 -44010 -460147 -192265
7759 28420 -18398 -90125 150780 -33504 59624 138148 18842 -140500 -183245 36370 -232121
7747 -326573 163573 -55563 -283524 61259 204681 -111349 -92161 -79329 -29695 -343269 86529
7735 -194874 -258428 182937 -94164 -54017 -157723 268516 -90505 6476 1349 362630 -222944
7723 -258450 -206735 306956 -283653 -103260 -250307 82506 17034 77182 -176521 -321720
7713 -321720 30414 -207431 80602 6983 -58808 -17306 204077 15714 -144832 -231225 -224334
7702 -224334 95 -87472 -329659 -108732 157938 140231 55061 -127197 141943 228367 -116302
7690 -78746 -340083 79289 -21432 375765 -190210 15475 150096 29914 -177235 85266 -352937
7678 5091 -97794 -84310 -14103 -489821 -73237 -130976 -151213 -24176 -426733 -72775 -14092 -88290
7666 -88290 270023 141588 -406420 105345 -23624 -306839 -231756 -189894 136362 49061 -411772
7654 -278023 143431 72713 60153 57673 124242 -63938 80042 2362 185023 -19029 154834
7642 -137390 -209251 -244882 68789 -40347 -127983 129320 -74934 -98674 -173273 75091 66206 139003
7630 139003 -372232 -12022 -37038 296674 273418 256199 207530 -55982 16711 -269988 16580
7618 -122816 -147934 -34085 125097 139619 124478 255165 -110836 -153472 51333 23589 3938
7606 55218 -133132 -11312 116869 -46964 -134655 -50757 88466 -54055 -344071 35626 134391
7595 134391 -58859 -338963 -271675 -85242 -202364 82597 -89839 36870 -248030 255611 -456753
7583 34713 99158 352506 -253835 31138 -318975 229141 44366 -25895 64114 -30443 9243
7571 -148396 82224 -54288 -173109 -119198 -250068 -28945 -60908 13249 157409 152280 210486
7560 210486 154916 4454 -3698 -253390 -15226 113546 63807 -41927 -62735 -253630 99579
7548 -47979 -68681 156070 -252221 -220624 398986 -255082 43822 -56167 -49842 234481 8217
7536 -78458 16380 -143766 -176182 100839 124250 -91555 141448 -147911 286210 -171362 111186
7524 -100647 18394 -43077 -121306 116722 -3545 -179421 43913 209027 -160593 -64014 25579
7512 -107462 444580 -75888 -67944 -159455 -235506 -71019 -42644 -196278 9209 -214090 198699
7500 80800 -132900 32293 50123 -214146 193332 114045 -338913 94494 -160374 -36637 -1132
7488 -261990 106400 -175412 -78607 131480 69661 14529 -322700 -315840 4566 -22509 7999
7476 5941 304785 231728 219827 238491 -108166 13567 19518 61621 -289100 339762 -174117
7464 176577 -124699 -47655 168178 -90801 202172 21164 -75673 -102149 -276934 93448 336879
7453 336879 116770 198141 88256 -14259 28968 -115399 -304357 -333104 -286263 101388 129733
7442 129733 -176567 110904 -57365 225224 200075 79853 -606120 -240196 -148604 68719 -105786
7430 -141317 -432114 -44153 -142679 68358 279383 -128182 -69312 -90079 -10705 -318521 -243933
7419 -243933 228230 -387376 -37691 138001 342697 -68222 -358565 39723 6830 -84527 -190192
7408 -190192 -85942 -113433 85948 -303710 86674 146874 113759 279504 75864 35730 197462
7397 197462 123468 -4935 79424 -3626 236339 -60296 -196456 56013 -72038 -912 -300702 -148553
7384 -159721 -130773 24531 -15659 64319 12163 -412540 189437 -281524 -125007 -281212 -49608
7372 239788 -141871 185653 82369 -38252 16408 112004 200500 72649 -208959 -98014 -94030
7361 -94030 -98030 69339 -20841 -265582 503080 -291283 44825 -259715 -360478 -250412 88776
7349 97578 136644 246387 -607990 203368 -146393 -184553 225732 126937 -14890 284760 -149746
7337 -313899 -94798 19660 -169596 -337209 -257668 5921 -265566 437906 -91547 -180552 256347
7325 -266969 -32162 -113294 -231334 63125 -14737 -55369 174047 -96269 -296024 20078 -8169
7313 137022 7474 82450 3862 148434 -273821 -47665 -203673 244498 -57065 202943 -67656
7301 169883 80446 -122628 -236089 4359 -237698 -112538 -39463 44808 164343 -55592 -272157
7290 -272157 145601 306424 -193214 81984 106391 -69351 -291049 50032 -92435 -15190 58540
7278 -17462 8469 97297 -383476 45331 -27662 17737 -49508 -13202 91565 166902 -218645 45386
7265 206861 -21096 -24631 -276767 38100 304599 52235 -52009 -60432 -159843 -336449 219072
7253 -185664 3912 62606 172448 -306663 186238 178651 112811 -122637 -151187 19938 129740
7242 129740 206590 -271048 -260165 31358 2052 -250078 327140 71920 -198261 42413 -96304
7230 -70441 -25471 -157949 -1031 -34407 -75963 138318 -9029 -258726 189384 -141169 -9620
7218 -183225 122022 262533 262684 -217941 42554 216004 122856 2127 -383479 87598 -53021
7206 167754 164842 -349716 -376100 19354 -77738 -61945 -183585 127105 74251 276526 -269587
7194 -404724 372161 -48849 43566 -210633 -19112 -135589 -162031 -126435 250683 -73763 -281950
7183 -281950 261331 -1088 28629 7126 -200291 48948 179257 145930 -68684 -290263 81496
7171 -218183 -326813 -150740 -121781 -240032 -126997 140802 260093 -307814 -38468 -233277
7161 -233277 -316248 81052 -119791 97839 -136952 224537 -35426 115148 46919 55025 -283689
7149 -1669 -19991 -239110 62468 -195292 49715 74418 101537 281290 86130 -38457 -38363 56077
7136 1946 -21517 66077 -3388 57132 151341 -77278 78324 117664 219033 23687 -18524 -65779
7124 -65779 -48162 -111264 232872 -5805 -387553 -307792 59022 -227739 160636 -63990 -374808
7113 -374808 -89303 -313576 176528 441960 -57861 124122 -99237 15769 12009 135016 258066
7102 258066 -166515 -23017 -305668 -518 111966 -157835 -21960 -80246 -245225 -269266 -133715
7090 -142589 -42248 -363323 -59546 177705 15945 -345607 -288865 109855 -8149 -115940 116796
7078 -215281 -127919 -73412 -5954 -97682 -7287 -223666 7845 -221365 115882 -193915 199622
7066 -135246 -141655 9171 -113830 150948 -25097 -286517 -234263 124386 -3987 -300546 -1367
7054 -210501 203635 -167357 153498 -49483 158596 130679 -149206 -127175 104504 29439
7043 -281512 172548 -212947 37829 -292221 -42489 -132331 -60033 -37722 -2648 247291 -275560
7031 -146152 -79193 73052 76081 -80168 158971 36378 -357866 -69399 -158418 399885 -180992
7019 -174470 -261113 82898 -77348 -39178 -64974 297977 9721 -400072 -10568 201032 -87396
7007 34790 -36662 30398 233199 -179269 272916 -391337 263572 -29766 -96689 -263461 -26335
6995 -58798 -97109 42868 230523 -9646 48658 -28156 -393357 -351651 104325 132735 -29384
6983 140398 -194773 -187896 182872 -47737 109088 127441 -56977 114494 96042 -132492 -95282
6972 -95282 -118830 -61586 173570 90208 208120 -56694 -19486 272249 -250375 -88740 -219311
6961 -219311 83070 -419221 -112419 458723 -202616 -88918 -229251 -278403 209281 -30244
6950 89001 -134260 172474 -348466 225516 -460398 268250 -67688 -440576 3846 222295
6940 222295 -345756 152040 -312300 99513 285195 -447042 -36916 -88267 141934 233734
6930 233734 114493 256339 106692 22043 72770 -144985 49875 95130 -98410 -18943 140943
6918 -144598 32826 -62825 187113 -13924 84126 -42425 180302 -114306 1875 -243063 129757
6906 67740 233588 127292 84420 -83550 73062 -65358 -102988 32902 280209 36059 -146193
6894 428337 40844 129133 -144090 298732 -99140 196337 287879 -75393 -379233 -179574 -75170
6882 -113776 252343 -212538 -222236 -52618 151956 -130560 19793 196375 -56575 125345 148331
6871 148331 -46878 56168 110237 -17868 -34819 -33355 -267511 -300136 75701 -140881 25828
6859 -169513 119310 -137750 -84638 -292491 25064 -235713 -317961 335180 -32535 -69991 -102340
6848 -102340 -83478 -2799 148651 125467 -25845 -86758 -104338 -415624 89793 -147210 26622
6836 -204563 74841 245 -269106 79326 55510 -96757 -118099 67056 97673 -153314 128354
6824 109540 7017 -247949 48067 163658 -144766 -295889 -5784 -63214 -147122 45845 -98381
6812 -146351 -265458 463121 75557 46239 -145712 -129430 128072 -244083 86409 25615 -188073
6800 -60972 198160 -57927 -320270 142942 321883 -31670 112871 244438 16764 -47751 -121259
6789 -121259 120147 30090 -187548 -194570 -86283 -18594 59887 -23997 -44895 81692 -33999
6777 -83946 349944 -281827 3491 -135988 -187008 66161 -123685 -378070 282721 -51900 43279
6765 -153416 -78976 -345009 -99514 -205118 -16452 -71319 37054 -146461 -83683 -63240 300201
6753 -27464 -14049 66056 -167284 -2001 -287216 62153 301408 238873 -38714 146350 -212980
6741 24669 158044 52437 9524 -11485 -45351 -220410 280967 112087 -68213 55396 57977
6730 57977 -28509 -31615 -253855 -68052 234755 132426 -93598 187777 -197144 161050 5219
6718 42410 -61034 123352 -286361 536985 125744 -58575 6333 -117870 -76536 335446 -264056
6706 2808 92429 -351325 130561 -64654 35983 -154256 10265 -60844 -191331 -84653 169049
6694 92709 8118 22472 -174785 143303 46340 205076 86647 6169 -359614 -63451 96144
6682 -190545 -480387 -127071 -60414 192458 -297907 105016 -118622 -335682 102957 -374062
6671 5691 39970 92359 -180148 -20979 -239974 314900 -15592 -217746 43988 71558 -90660
6659 -29520 59376 -172399 143505 -17294 15531 -187159 -81872 -56112 -331418 214071 87997
6647 -88738 15335 -170478 67062 177191 -194606 14220 -128495 -40170 186071 -111163 131490
6635 14174 -82479 -200803 -205398 -8318 -18150 168770 -106079 305707 -195309 -30976 -219846
6624 -219846 78013 264235 26523 81018 149367 -87274 121963 161709 9197 152328 -377660
6612 252217 -49149 -116801 135400 51639 29272 144315 12517 32904 -17433 58170 -349303
6600 139417 -314232 189762 76317 -111488 -387373 109963 -116461 197326 -139386 287536
6589 -110721 82447 97442 -133053 65322 -109193 -47081 427423 -30604 194546 282484 321785
6578 321785 -274074 -314182 -233996 217267 54128 -206414 -254448 -397109 74998 -319070 119992
6566 216219 -142386 -253282 -155824 101024 -180912 33253 -62886 169297 27322 -13549 89075
6554 -159521 354187 -22650 132096 -193468 -28279 -207586 -238198 94321 -51040 6813 110192
6543 110192 -215132 -124226 37540 22172 -70696 -4077 160238 -242649 350175 -1186 -22140
6532 -22140 -166603 -106515 -241107 -431516 -169827 -100796 113760 112044 -209487 59776 70262
6521 70262 -199554 -189377 115030 -40379 45533 -72033 -329873 58376 78847 -9360 252090
6509 153891 109464 -165310 -13169 -48422 98357 -66675 -234073 -286633 62557 129958 -302172
6497 -97657 -131667 -89169 92297 -202167 -195914 33947 286211 -156430 -9873 -137791 -282473
6486 -282473 16755 403439 14416 -341321 -205856 -184857 -51203 -10439 -3712 182921 -23992
6474 -207815 -15780 30610 -7830 -20059 245605 75392 19387 -103556 -98096 -160631 2383 130400
6462 130400 -168678 -51496 -37682 22710 -15528 -201153 129302 14911 -158606 112162 73045
6451 73045 -93994 37566 -71991 277611 254569 143932 3521 5116 44735 166449 -73681 107189
6438 -63378 337547 -168379 -32202 -1653 -99739 -88580 -376336 59640 -163191 -20775 80326
6426 -42663 48984 -27313 -251618 -148387 14415 -75311 75110 12354 -134717 -134524 44918 -271145
6413 296888 225421 45105 262531 -94594 -157877 -215041 -147038 -15432 -104620 -84464 224741
6401 57479 106038 -143874 -175489 8454 -298917 -15815 -80132 163166 265119 5999 -1037 117243
6388 -98798 132893 380348 -87725 9724 -11587 -130401 119289 77917 -4421 -294232 97092
6376 212113 145188 -164873 29254 403968 -21174 -32478 -216886 69510 -176794 11944 -38272
6364 -82015 -125080 -205669 -88788 25273 -451306 101702 440121 14913 2912 -169722 -208205
6353 -208205 179395 -46738 -229294 -8768 25494 41636 -159422 -38212 61168 -143526 -204163
6342 -204163 275529 142099 53122 -243714 -114643 -272195 102384 149964 196461 -118972
6331 -280729 -504565 -64346 -109028 -418329 76451 -109525 -194499 233341 294665 -193231 -280357
6320 -280357 290541 -7769 244477 -9480 114851 345598 -269575 -17175 57799 -517362 -334152
6309 -334152 -42979 -165534 116462 173154 -18817 -99019 -140625 -155401 44156 -257950 114828
6297 -142440 20217 -63936 118577 -238749 -144711 212834 292726 38040 35832 19253 -5901
6285 109572 128727 440756 28166 -116139 40281 21505 -94476 146972 156067 -361640 96105
6273 -118177 -113193 112387 35802 -403534 112633 -107864 -458548 -70931 -61676 -213701 12410
6261 -171230 221358 -313892 78081 151275 76004 108503 -42338 -175943 -346821 186800 -254099
6249 -181120 76947 74336 -147097 -214866 178814 159647 117493 149807 10024 68458 -234741
6237 -241297 14475 23170 -26234 -90166 396370 143175 -56513 42479 124551 -308434 168588
6225 84638 -155026 -158451 18690 -60027 216345 60308 -71973 -13588 -146631 -106702 -251065
6214 -251065 82428 381487 28613 -256542 86844 75102 -123055 -71472 -40424 102368 30795
6202 162363 -242014 4595 83266 -118707 125277 328550 -262314 287012 -528007 -110870
6191 -181200 234612 305315 16504 241824 -200891 -76416 -104059 67165 -20379 356802 142138
6179 -109576 20850 -163109 -221752 -45116 213680 149363 93255 -64941 58962 -130235 193632
6167 -105549 -92354 141406 293121 -47810 -75592 192426 137090 374955 124368 16213 51184
6156 51184 117125 -31053 34427 -139673 152787 -438565 35152 314888 -263903 16501 -5351
6144 -280731 37494 29404 -38488 162789 -144006 -62430 143113 96455 -97292 9844 -69163
6132 -106640 57544 324164 -126984 -239658 237739 -334585 -148410 52827 -191754 -17963
6121 254558 -197583 15296 -26188 -314640 18584 -165357 30459 268049 237924 14234 62286
6110 62286 -8299 -214079 -89390 -278002 -343690 -153347 -235721 446137 -296916 -132361 -50714
6098 -102201 -72044 3666 125793 65274 -142453 106450 487631 87278 -157709 -226986 -72995
6086 -35061 32261 47796 37269 87380 -215520 310094 -172596 -58686 144604 212314 223990
6075 223990 159042 -52099 14631 -347962 -27511 49282 -428183 -15321 -5983 -55889 73478
6063 -67500 164613 -42234 -227284 8785 -151592 209079 -221400 37038 201335 -149275 -51864
6051 -78414 180512 121533 87213 -221610 203588 -272431 -146400 -44470 66030 163309 42914
6039 -189227 -348288 133746 -248398 -175980 84226 208748 -115593 -27183 22862 341477
6029 341477 85109 -216403 -103112 -200693 71145 -138057 -382394 -429282 188849 28969 72686
6018 72686 -43393 -268792 -213380 183715 96575 -408038 88486 -229684 -198564 -145638 141873
6006 -64370 196650 168463 -90529 36855 -170174 -37583 -18445 -84848 -172818 -66844 56258
5994 -55742 28863 21174 -83609 91309 252501 119627 294436 -169196 -15968 62854 -90367
5982 32038 197865 -305886 325879 64156 -225687 -160635 -336965 -78303 272074 -67331 86974
5970 245982 -22440 210403 -54535 -22971 76784 -128264 -275142 -17770 -294242 -381994 -33786
5958 175110 -157464 208345 -173087 79770 -154862 -197472 319633 318757 285390 200773 79473
5946 1698 346293 185184 163337 175787 58369 71380 -330414 120985 98262 -27803 -360631
5935 -360631 264438 -143819 -58860 47702 -788 72316 -215334 -62188 -28049 -186902 63347
5923 322977 -235907 59379 -8067 -31968 -19637 -136296 -146008 -346910 56526 -236326 127622
5911 -130123 51620 348241 36925 -157386 -61920 -61650 -41931 -75906 180014 -135794 -73696
5900 -73696 14784 -278190 -168158 -91194 -64029 -76439 52907 77228 294922 -57000 28437
5888 125326 -10118 -47599 -301810 106589 -150707 3725 179885 -164699 62839 169979 14808
5876 83002 -102704 393564 135280 142681 -210659 214381 -193318 225427 -95833 258842
5865 228976 -228477 274456 -243952 149999 -107604 107636 -47671 85381 -216639 -64541
5854 -37993 -211011 115940 -107903 290510 128804 280752 -28364 188672 265503 -203973
5843 48556 36404 -43891 -207015 -136 72050 -262140 14503 142289 135692 -161185 93115 -51864
5830 -125141 -67338 361139 71983 -50352 -52775 -43809 353418 -157089 -115370 79193 64800
5819 64800 62934 312246 255692 17183 -244268 -421621 -45893 -465106 107326 146339 -115203
5807 -131447 -69636 -120072 158323 -117349 209397 -118398 -201664 -341779 429247 7094 -243335
5795 113820 -199375 -134809 -87658 37275 -156380 43987 -61807 40626 106267 55756 -27856
5783 -147743 -374987 -19433 -244882 -250942 -35299 -34244 -34831 326705 -29307 3319 -98567 231031
5770 242185 -15208 230197 -90672 -207652 82769 54804 248881 -44783 -106279 -9397 -117361
5759 -117361 -157045 135043 -141057 -249167 -58994 -245044 -151281 -79903 -305799 148573
5748 -104536 315594 89592 -43114 -40721 54772 4077 235425 -252542 96849 287132 54401
5736 131793 -107971 118984 3723 78091 161146 37513 -29908 -87060 42055 143975 3961
5724 207475 99673 -274408 -361390 -116611 -1855 30500 -52750 80759 -220621 494311 89136
5712 148665 -207035 -150506 256799 157265 -93523 85805 -38428 165888 -90063 -179150 271030
5700 -91850 263365 -64930 249750 -1315 105753 -147749 218896 -79197 -46390 -322806 -121786
5688 151842 -258726 28231 178285 -221584 41175 136899 63896 -210551 -75712 -41374 -8287
5676 43777 271841 241618 187603 -301949 -176234 149192 50388 102259 237127 318216 200049
5665 200049 -4362 -221025 -128250 56790 -227134 14473 -11255 -102180 -183243 236047 13445
5653 -64413 87773 286418 -68521 66752 -71342 -18823 69474 -86309 -294092 163768 -314476
5641 203013 52421 5809 -103630 -92166 86690 384526 -227911 150159 -386206 -204508 425403
5629 108413 -111581 11676 -29344 149826 -133182 -207633 76957 99254 4093 -129519 209859
5617 -146091 261222 -39297 -310797 109342 -36750 374288 163513 -65506 -151410 -268824
5607 -268824 -16910 -41447 -39011 -181 -169591 346320 -130300 14758 47794 -149089 15129
5595 146653 321253 -187525 -35160 220747 277287 -432420 -29521 22059 -149777 76878 -26393
5583 -83963 -210570 -278981 156948 -110099 -132202 110847 -358789 17082 -122530 341540
5572 -266835 -22859 108889 -122861 18687 92865 116357 36435 -26288 455593 -331909 -40279
5560 -108280 124182 -81072 -284491 142730 -84147 -309124 466118 -174684 77358 -2165 187636
5548 -338399 -85501 209934 100006 -114387 45225 321033 44516 -8505 -65250 127856 -216183
5536 -222404 191362 129327 -62503 -86785 -57580 -190301 -30639 230997 20909 -231143 -20933
5524 152611 89886 81225 -60217 78243 -11223 -24488 125143 -373117 56089 196166 202315
5513 202315 -110810 23888 98424 -128420 955 237487 -103970 -110860 83941 34605 -14219
5501 -22646 70767 -136616 -128550 -142159 -55964 207879 18359 24309 42437 -208708 43853 -320588
5488 -263654 -219330 334229 -131137 -96759 -15909 -181255 365608 121839 216083 20730 180852
5477 180852 -31720 94065 295297 229733 -71041 24489 126738 143421 -3368 -270884 82455
5465 -150204 264868 277934 -171043 -121960 -172409 6883 46312 -254813 172424 -26272 -54440
5454 -54440 -151196 18656 -11097 189572 -98692 -41391 -187105 197234 -215668 216256 -247942
5442 138621 54275 -45458 213466 -40456 19307 -70063 464494 130825 -264458 -183831 -39560
5430 55076 -167658 152908 -161804 -145554 -126078 90993 -132736 47011 3878 23179 -81518
5418 268379 -338355 -41950 171369 117521 84734 69049 -69545 -55022 -47213 233031 -162142
5406 259817 20030 -83461 43842 110921 -36804 230651 -113388 11432 176863 275 -83795
5394 -67082 -236672 108790 -9569 235026 -211677 106084 119846 -197539 -63699 123312 53498
5382 -72598 137185 402559 34394 27155 292676 128902 13456 -147532 482482 -72930 170591
5370 19658 163830 -228988 -153384 -107233 -31321 -10298 -12391 8870 289060 -297842 31559
5358 302703 -38290 93209 424252 23722 -103325 -285647 220935 -197052 218247 113620
5348 113620 -150954 105906 -32311 167092 -160266 -23182 -323592 27299 -107431 -450339
5338 -450339 -130693 -170560 -183799 131820 270584 -504034 122323 -113306 441585 199262
5327 -202056 207471 225561 49832 45205 -79303 52265 105125 245263 -248228 201855 14037
5315 -84867 -48118 -242683 82127 53774 38836 209401 -234094 -74798 90955 298725 186372
5304 186372 -74784 42378 -159941 -77659 -282586 18418 -24105 78247 238130 379143 44905
5292 -86963 148143 36235 -112453 111993 -41145 280733 -41674 135423 9039 -104406 -87292
5281 -87292 -166975 82788 -144015 -251320 53156 -48174 84656 274466 -147464 227597 -31629
5269 -83821 313313 -202201 49880 -246373 -119242 93457 10955 12305 -193763 127141 67141
5258 67141 407041 -93051 -119473 44095 345865 226554 -37022 251398 24743 -85733 -295025
5247 -295025 146636 -105619 301541 -127866 250995 487317 89090 165232 24234 215838
5237 215838 119986 -181917 101235 -70353 -228225 18030 69044 22582 195817 174412 -30439
5225 33893 282483 38216 -493813 -132957 -170677 -151293 86661 -40855 -320605 -291720 -82943
5213 -143877 -198601 -206836 294082 -418986 -486860 -55484 -234315 -256342 -233778 -222916 -411810
5202 -411810 -85599 -112684 -176188 -239883 69266 52283 308199 52173 46021 139962 168029 -250011
5189 -3485 -180457 -146463 -97867 180540 64476 103866 20374 -88536 254819 36540 202719
5178 202719 -79848 146226 59421 -83881 123742 228390 -237624 -138624 -365722 -1653 -293646
5167 -293646 -16394 10363 -470990 -147756 245295 -395273 -15451 -184744 111463 145626
5157 145626 -147818 -72120 -210837 -20699 -36697 -147806 208448 -300491 -67185 39179 157285
5146 157285 161573 -38127 351821 115300 41109 258732 213905 152356 196100 76018 -196 -309405
5134 -309405 165005 -351370 145667 76436 -36625 119685 -27425 38174 123386 -179629 -38734
5122 -40460 208588 -112703 351415 496 -64351 -81506 -179713 44877 -52755 374059 80752
5110 188817 -230046 -37140 -56619 -180049 -31031 -37885 -61111 -565634 -67975 94577 3009
5098 260192 -255977 256472 -151273 -227804 61092 357900 -137525 -268349 -230350 279078
5087 24326 234073 44559 -192786 162211 -27827 -9768 -236326 -87395 148923 315232 200127
5076 200127 -87107 -28505 208551 5030 2115 -173076 -56951 -103700 221612 358379 -196523
5064 -64766 185077 -174184 250587 -272867 -80488 -2059 51479 36902 -144359 217454 242133
5053 242133 85416 69961 -257062 249193 -41985 27580 315563 -60656 -80694 -120715 172957
5041 96424 4009 -130132 49547 -157385 -352639 -92286 -14119 58972 131931 -457717 -134801
5029 -150900 239213 -72368 173186 -68854 -188819 -146020 221767 85561 -200904 -224753 106101
5017 243577 359038 249955 21332 165012 58837 57596 -13749 -133527 -163879 119477 -61191
5005 -279179 -154202 329626 -272244 -178320 -131453 -15376 60021 21802 238699 -150056 320362
4993 -145068 -62043 159225 139542 56327 95479 298076 -313543 -198095 141038 -71861 -118101
4982 -118101 -173202 897 53474 287888 -26054 -104498 86167 -270612 -82396 134329 -272009
4970 -10042 59512 56702 -33839 369107 -44119 10117 132874 -6963 -74755 -95504 79913 57178
4958 57178 -295294 195424 -23959 -321050 -369470 237 86888 -344946 -185458 -260034 112976
4946 38125 12826 -216604 88484 173825 -37386 181886 -267898 116594 81038 334913 -56743
4934 -29386 149848 8393 -322814 -137658 54189 251731 -144942 -307384 199832 61925 146844
4923 146844 -474603 199363 82789 279427 120477 252182 -74466 120522 20092 88774
4913 88774 233630 -78482 -131991 -57545 90904 -13828 -315363 410367 -4148 -275931 18424
4901 -13465 -329405 -102015 182999 -20029 -66365 -195187 -180033 -67252 9261 106366 75515
4890 75515 -122224 124717 114897 80954 -66477 -103869 -192095 -113504 21369 255257 -128049
4878 -98516 104250 35889 -207709 32521 277099 274603 57930 139696 499210 179684 -42588
4866 17828 114861 -444473 56866 345098 -123116 345339 -224378 259975 -50670 -107470 88319
4854 168023 127619 -76820 361275 146049 64466 -44330 88270 250454 -14872 80916 -117960
4842 46231 309378 -99539 135270 50429 -148513 32912 169214 -237550 -229712 260886 61893
4830 -446417 444901 -271669 -242039 8851 -197210 -404175 -261834 -72073 -213617 -83702 66902
4818 180870 123655 -203342 196188 -194497 241197 -214477 192094 218066 231308 6179 50225
4807 50225 42057 240707 -157160 -257643 137673 -163538 -381371 -211846 45255 -36546 332959
4795 -54005 -28083 -287742 -41981 -73160 -99783 9612 -161488 34920 101724 155722 2383 -109645
4782 165053 279655 -21444 -262370 -163760 -64537 37045 29824 -201342 103653 -63157 -160622
4771 -160622 -238749 457314 -37388 118488 346301 -82820 42525 144384 -134500 242185
4760 -213879 14710 151534 308208 -11791 6243 124240 1191 20394 -44735 31071 63131
4749 63131 -291242 219252 -43778 -32387 46017 -113520 -37405 15009 203520 -169708 33371
4737 -212923 215187 10381 -172137 104290 297211 -242774 147859 10436 -44784 -32491
4727 -32491 -200325 -68708 -1647 387 64628 354398 -144308 262159 -147727 -1603 -178938
4716 -178938 9132 -58326 -30493 228838 -239508 -3192 40227 -10076 146122 -15493 -233414
4705 -233414 55454 169598 182036 214897 -9733 -114533 -63762 96251 -98222 124947 -235972
4693 93644 246724 20135 49358 -136746 70007 -278386 145616 -310611 186360 78397 -37184
4681 -181199 230245 -12390 50148 79634 166109 -267183 -61738 144366 -21886 -129448 23455
4669 267347 12291 126173 281570 191144 11546 -173238 -121209 170889 -414992 -249231
4659 -249231 -198019 90506 -304664 -134684 -16935 -88434 105771 178864 206688 85278 162082
4648 162082 -15810 -214442 -137723 -157293 216676 -31335 279889 135198 -48998 -215412 221392
4636 -228847 81314 3383 48755 -55696 -240806 -359419 -108333 91274 -55723 231573 23579
4624 -29419 35305 263522 82818 230040 3131 257576 -138391 -110972 -287777 389295 59796
4612 -8007 108560 2910 -164849 10827 134727 5379 212458 397012 -11517 50206 81646
4601 81646 -13138 213524 132224 -180733 152856 -142309 342727 84040 79669 -286676 -124383
4589 216865 -145677 -200178 -68216 -83279 222833 174459 39172 311815 136983 -160580 -75019
4577 -11081 94478 475384 -238205 -85239 -49690 30630 99976 182791 2019 16951 30409 -43790
4564 21370 -67534 -178780 -185629 -6119 25419 -297587 -50365 -92477 -28221 -4664 -12432 -350942
4552 -350942 252216 -36178 196494 255426 -177248 274657 -154340 -279666 -145346 -362948
4542 -362948 -189999 -175287 -171291 119545 31781 79668 151822 -276793 103021 66452 268905
4531 268905 -90434 -211402 482751 -63838 -355246 -23783 -51946 96996 135796 47237 -33057
4519 -141233 -109620 130438 -143372 114006 178677 -49195 18641 7482 108238 -192954 58684
4507 -115322 -238221 49240 387810 225142 -70633 143295 -208740 141044 108056 -92901
4496 -81252 152494 82884 49203 252755 -80436 -86421 -128167 -126985 130574 -138121 -56173
4484 226823 -353959 191804 -52506 -213757 -79748 -91639 -51068 4002 -405804 307889 -204778
4472 403598 65781 438010 -140124 151282 -145012 64832 -131153 154725 207019 -97526
4461 238033 180881 261955 -57598 -129967 -116963 298979 16586 -13847 -13885 -25964 -174944 11387
$$ [...]
##END NTUPLES=NMR SPECTRUM
##END=
