
##TITLE=AC1144_Santa_5874622_tngZuRgah2
##JCAMPDX= 6.0         $$ Bruker NMR JCAMP-DX V2.0
##DATA TYPE= NMR SPECTRUM
##DATA CLASS= NTUPLES
##ORIGIN= BRUKER
##OWNER= Administrator
$$ 1.72 TOPSPIN		Version 2.1
$$ 2012-03-31 18:12:53.750 -0500  Administrator@TOPSPIN
$$ Compression mode = diff/dup
##.OBSERVE FREQUENCY= 400.13188235
##.OBSERVE NUCLEUS= ^1H
##.ACQUISITION MODE= SIMULTANEOUS (DQD)
##.ACQUISITION SCHEME= undefined
##.AVERAGES= 8
##.DIGITISER RES= 22
##SPECTROMETER/DATA SYSTEM= spect
##.PULSE SEQUENCE= zg30
##.SOLVENT NAME= COFFEE_meoh
##.SHIFT REFERENCE= INTERNAL, COFFEE_meoh, 1, 14.98061
##AUDIT TRAIL= $$ (NUMBER, WHEN, WHO, WHERE, PROCESS, VERSION, WHAT)
$$ ##TITLE= Audit trail, TOPSPIN		Version 2.1
$$ ##JCAMPDX= 5.01
$$ ##ORIGIN= Bruker BioSpin GmbH
$$ ##OWNER= Administrator
$$ $$ C:\Bruker\TOPSPIN/data/COFFEE/nmr/AC1144_Santa_5874622_tngZuRgah2/10/pdata/1/auditp.txt
$$ ##AUDIT TRAIL=  $$ (NUMBER, WHEN, WHO, WHERE, PROCESS, VERSION, WHAT)
(   1,<2012-03-31 18:12:46.093 -0500>,<Administrator>,<TOPSPIN>,<go>,<TOPSPIN 2.1>,
      <created by zg
	started at 2012-03-31 18:11:39.390 -0500,
	POWCHK enabled, PULCHK disabled,
       configuration hash MD5:
       1A 1E CE 29 27 FD 77 03 67 4E F0 E3 C4 B2 CB 90
       data hash MD5: 64K
       A0 89 95 11 EF 8F A1 3C D4 FE 0A BE 58 52 D7 6C>)
(   2,<2012-03-31 18:12:48.875 -0500>,<Administrator>,<TOPSPIN>,<proc1d>,<TOPSPIN 2.1>,
      <Start of raw data processing
       efp LB = 0 FT_mod = 6 PKNL = 1 PHC0 = 0 PHC1 = 0 SI = 32K 
       data hash MD5: 32K
       16 24 82 2B EA 3B 81 51 BA 8A D5 CE AD 4A EB A9>)
(   3,<2012-03-31 18:12:49.359 -0500>,<Administrator>,<TOPSPIN>,<proc1d>,<TOPSPIN 2.1>,
      <pk PHC0 = 217.9193 PHC1 = 0 
       data hash MD5: 32K
       AE 2F 7E CB 7B 8B DE FC 56 F4 D7 E2 34 37 A7 97>)
(   4,<2012-03-31 18:12:49.484 -0500>,<Administrator>,<TOPSPIN>,<proc1d>,<TOPSPIN 2.1>,
      <abs ABSG = 1 
       data hash MD5: 32K
       FF D9 5D B8 C0 26 E5 3C 7C 25 34 2B 7C 89 03 D8>)
(   5,<2012-03-31 18:12:49.531 -0500>,<Administrator>,<TOPSPIN>,<proc1d>,<TOPSPIN 2.1>,
      <abs ABSG = 2 
       data hash MD5: 32K
       1A E6 B3 4E 8F F8 31 CC 00 D3 31 12 5A C2 58 8A>)
(   6,<2012-03-31 18:12:49.562 -0500>,<Administrator>,<TOPSPIN>,<proc1d>,<TOPSPIN 2.1>,
      <abs ABSG = 3 
       data hash MD5: 32K
       F3 CB 5B 9A 32 C1 13 84 B2 D2 F4 C2 76 CB 43 EC>)
(   7,<2012-03-31 18:12:49.593 -0500>,<Administrator>,<TOPSPIN>,<proc1d>,<TOPSPIN 2.1>,
      <abs ABSG = 4 
       data hash MD5: 32K
       6C 7C C3 FC 85 C5 C2 B2 3E 4D 57 0B 51 BA 69 78>)
(   8,<2012-03-31 18:12:49.625 -0500>,<Administrator>,<TOPSPIN>,<proc1d>,<TOPSPIN 2.1>,
      <abs ABSG = 5 
       data hash MD5: 32K
       59 F3 B2 EC 4B FA 22 1F 22 81 85 53 15 FA 6A C6>)
$$ ##END=
$$ 
$$ $$ hash MD5
$$ $$ 5C E0 B1 E4 CA DE 7E 58 59 00 C5 9A 02 59 4D 8C
##$RELAX= 
##$RELAX= 
##$RELAX= 
##$RELAX= 
##$RELAX= 
##$RELAX= 
##$RELAX= 
$$ Bruker specific parameters
$$ --------------------------
$$ [...]
##$TP= (0..7)
150 150 150 150 150 150 150 150
##$TP07= 0
##$TPNAME0= <>
##$TPNAME1= <>
##$TPNAME2= <>
##$TPNAME3= <>
##$TPNAME4= <>
##$TPNAME5= <>
##$TPNAME6= <>
##$TPNAME7= <>
##$TPOAL= (0..7)
0.5 0.5 0.5 0.5 0.5 0.5 0.5 0.5
##$TPOFFS= (0..7)
0 0 0 0 0 0 0 0
##$TUNHIN= 0
##$TUNHOUT= 0
##$TUNXOUT= 0
##$USERA1= <user>
##$USERA2= <user>
##$USERA3= <user>
##$USERA4= <user>
##$USERA5= <user>
##$V9= 5
##$VALIST= <valist>
##$VCLIST= <CCCCCCCCCCCCCCC>
##$VD= 0
##$VDLIST= <DDDDDDDDDDDDDDD>
##$VPLIST= <PPPPPPPPPPPPPPP>
##$VTLIST= <TTTTTTTTTTTTTTT>
##$WBST= 2048
##$WBSW= 25
##$XGAIN= (0..3)
0 0 0 0
##$XL= 0
##$YL= 0
##$YMAX_a= 537964
##$YMIN_a= -632271
##$ZGOPTNS= <>
##$ZL1= 120
##$ZL2= 120
##$ZL3= 120
##$ZL4= 120
##$ABSF1= 14.98061
##$ABSF2= -5.57192
##$ABSG= 5
##$ABSL= 3
##$ALPHA= 0
##$AQORDER= 0
##$ASSFAC= 0
##$ASSFACI= 0
##$ASSFACX= 0
##$ASSWID= 0
##$AUNMP= <proc_prof1d_extract_pilot.lims>
##$AXLEFT= 0
##$AXNAME= <>
##$AXNUC= <1H>
##$AXRIGHT= 0
##$AXTYPE= 0
##$AXUNIT= <>
##$AZFE= 0.1
##$AZFW= 0.1
##$BCFW= 0
##$BC_mod= 0
##$BYTORDP= 0
##$COROFFS= 0
##$CY= 15
##$DATMOD= 1
##$DC= 0
##$DFILT= <>
##$DTYPP= 0
##$F1P= 0
##$F2P= 0
##$FCOR= 0.5
##$FTSIZE= 32768
##$FT_mod= 6
##$GAMMA= 0
##$GB= 0
##$INTBC= 1
##$INTSCL= 1
##$ISEN= 128
##$LB= 0
##$LEV0= 0
##$LPBIN= 0
##$MAXI= 10000
##$MC2= 0
##$MEAN= 0
##$ME_mod= 0
##$MI= 0
##$NCOEF= 0
##$NC_proc= -8
##$NLEV= 6
##$NOISF1= 0
##$NOISF2= 0
##$NSP= 0
##$NTH_PI= 0
##$NZP= 0
##$OFFSET= 14.98061
##$PC= 1
##$PHC0= 217.9193
##$PHC1= 0
##$PH_mod= 1
##$PKNL= yes
##$PPARMOD= 0
##$PPDIAG= 0
##$PPIPTYP= 0
##$PPMPNUM= 2147483647
##$PPRESOL= 1
##$PSCAL= 4
##$PSIGN= 0
##$PYNMP= <proc.py>
##$REVERSE= no
##$SF= 400.13
##$SI= 32768
##$SIGF1= 0
##$SIGF2= 0
##$SINO= 400
##$SIOLD= 32768
##$SPECTYP= <>
##$SREGLST= <1H.CDCl3>
##$SSB= 0
##$STSI= 32768
##$STSR= 0
##$SW_p= 8223.68421052632
##$SYMM= 0
##$S_DEV= 0
##$TDeff= 65536
##$TDoff= 0
##$TI= <>
##$TILT= no
##$TM1= 0
##$TM2= 0
##$TOPLEV= 0
##$USERP1= <user>
##$USERP2= <user>
##$USERP3= <user>
##$USERP4= <user>
##$USERP5= <user>
##$WDW= 1
##$XDIM= 32768
##$YMAX_p= 476523084
##$YMIN_p= -714572
##$CURPLOT= <Network HP LaserJet P1505>
##$CURPRIN= <$Network HP LaserJet P1505>
##$DFORMAT= <normdp>
##$LAYOUT= <+/1D_H.xwp>
##$LFORMAT= <normlp>
##$PFORMAT= <normpl>
##$SURQMSG= 1
$$ End of Bruker specific parameters
$$ ---------------------------------
##NTUPLES= NMR SPECTRUM
##VAR_NAME=  FREQUENCY,     SPECTRUM/REAL,   SPECTRUM/IMAG
##SYMBOL=    X,             R,               I
##VAR_TYPE=  INDEPENDENT,   DEPENDENT,       DEPENDENT
##VAR_FORM=  AFFN,          ASDF,            ASDF
##VAR_DIM=   32768,         32768,           32768
##UNITS=     HZ,            ARBITRARY UNITS, ARBITRARY UNITS
##FACTOR=    0.250966925370066, 1,           1
##FIRST=     8223.43324360095, -329261,      42337
##LAST=      0,             -23478,          24523
##MIN=       0,             -714572,         0
##MAX=       8223.43324360095, 476523084,    0
$$ Real data points
##PAGE= N=1
##DATA TABLE= (X++(R..R)), XYDATA
$$ [...]
23744 -25918 -78631 -51700 179085 116335 193717 -235858 -150975 180368 -97999 -45121 258903
23732 -186835 -52123 212183 -160999 -154962 71692 -45770 51410 -200802 -150134 197196 -92256
23720 -350956 -117412 205115 74000 20086 -51583 -107785 -137497 -248340 -136938 -150005 121275
23708 -189340 -146500 147397 -137479 149099 59931 230296 -261349 249739 54016 41902
23698 41902 121484 -140591 136005 -42939 -31932 -295673 -82898 -84282 -212253 -144947 106828
23686 195096 120819 13230 -110654 -270496 18887 -265650 143550 135411 246198 -55280 -214383
23675 -214383 183232 -184591 -285909 307057 -227373 -276413 61582 114578 -282254 -348410
23665 -348410 -316479 6099 299412 -209891 139450 -41577 -5124 -172327 236174 -63491 112193
23653 -121923 -73176 -101027 -207594 -188074 366312 -111110 30367 -67936 202345 -112211
23642 -49654 135237 -42468 200674 -138019 -58991 168651 102747 13469 -203497 117339
23631 70876 223500 -63176 83837 2654 69160 -78812 -268071 291743 -167127 -168707 115349
23619 4483 17771 171506 19967 -126843 115828 -94772 98823 -130159 89939 284101 51608
23607 -171516 -429995 -235956 -71903 6389 -63716 89977 106033 213624 -196028 5825 130793
23596 130793 -103720 186215 -125008 -202032 -402417 157423 163255 -434474 -204521 193979
23585 -27614 -168348 -80525 -66966 317066 193323 314650 112105 247574 30981 210940
23575 210940 2537 119130 27841 347263 -80150 -67520 114824 -204175 422049 -243512
23564 269525 -61085 164256 -97260 -253274 272975 237229 -176201 23053 -310524 -302956 234557
23552 -212314 153182 67660 -54529 -7044 -272254 -21723 9062 255246 67309 298806 -44585
23540 91174 -54016 131704 -27069 -70866 256545 150559 -250008 -246588 153751 119699 -51792
23528 127994 -328198 104283 113411 54347 54298 140563 9209 -268246 -55684 -97714 104978 -220130
23515 689 -22063 231655 -2267 -384023 -311893 -140925 59448 -165842 -108834 509942 -27815
23503 98573 134831 -58997 -81787 251955 -122623 -120886 -302026 -128427 -234499 -85745 -93028
23492 -93028 -79940 -251388 -265571 -333340 -19771 -7008 -141220 -97029 -110432 -34736 -74111
23481 -74111 -65157 343122 -290499 -224874 -2360 -54956 -349685 17856 220066 -11640 -467342
23470 -467342 -137660 126915 -114021 -274601 -112189 138329 161225 -157727 -107792 -74518
23460 -74518 40145 169642 -13011 120631 77414 83470 -249161 -204975 164975 -501838 145719
23448 32499 283094 -121579 347603 -198564 -299635 275726 -83426 -14187 -28476 -46298
23438 -46298 -236564 -186391 24339 57178 166912 -113017 -37227 -195422 207623 236278 18542
23426 11062 214924 -178506 83823 120597 -243997 -91465 119527 -176042 -61914 -47933 221462
23414 -221472 -117102 25021 15385 238199 101309 -45619 -91429 2983 -220606 -176415 171671
23402 -321347 5554 79795 -159955 72071 82357 -4926 -75376 188516 224815 -84542 -13843
23390 -106355 10890 9132 -205408 -40436 -74402 -72319 -362444 72602 -255878 104479 -420643
23378 18354 -167348 -338718 117573 -82675 301360 173574 -307981 11515 89204 -136617
23367 8624 -59267 417904 -290170 -108044 -68940 -88010 -236738 151067 -297256 29132 310189
23356 310189 140356 24474 122318 148863 -1665 -304681 -64116 4002 109386 152492 -60943
23344 23430 -142201 -89124 185498 -221455 -167323 288874 -7926 -144810 -148642 -9411 14525
23332 -128946 -16610 134002 -173408 257941 -267603 -36747 -74326 212554 -223819 35029
23321 -62873 382167 -119249 -265992 219682 259987 -270280 30314 239876 2965 207384
23311 207384 12175 136238 152155 277728 -243307 -178294 -40530 -54439 583208 78924 -31900
23299 -93590 237805 89172 278316 183693 386347 227752 11273 -85976 -255944 220313
23288 -288815 213728 -224 -120665 -331132 -73520 204461 -209695 -221432 -279190 -118133 80827
23276 73973 -45692 -131515 12148 43403 356307 -302812 -209151 -35186 58154 -102867 122642
23264 -60708 113472 25900 -132674 -205061 255184 443383 297140 99362 -107879 -167244
23254 -167244 -86686 -68499 -278084 -179979 -123258 -242796 -368548 -154937 -4294 -105181 286550
23242 106260 -147582 -123212 149376 -132048 -41212 -125725 -71046 -40778 -57959 240905 65784
23230 200873 29528 -94885 107794 -197172 -133056 12115 -248669 1011 -24584 326211 -177785
23218 -400826 -152469 -14264 -123852 137851 28625 81484 115794 -117226 47314 -113712
23207 31918 -44895 78071 -18840 78586 77643 -120206 -134336 -8270 -193064 -3607 31966 84067
23195 84067 291031 -219091 63564 373909 -8327 63490 -272230 15945 -106997 12604 -293723
23183 -109884 -37408 25603 -61519 -889 -60576 117242 105743 153072 -107271 127656 28468
23171 -515152 -7337 58951 -75231 140090 -266213 17276 67150 -96998 40592 -176668 35813
23159 153916 171239 -77106 88570 -125191 -139407 -65232 -1171 -306963 38485 -223371 104097
23147 93291 239322 8075 20675 129797 -148458 -185037 37070 -374034 126027 -131903 -105672
23136 -105672 -217203 74495 89527 130841 -468689 -508764 183930 79477 -182569 -196619 76205
23124 108863 341949 63731 114685 187341 213542 29878 373041 167343 -33633 10467 320556
23113 320556 5914 963 80010 -132679 152199 127937 -119686 -179108 48054 35759 -55460
23101 -230605 -511403 54045 8721 218504 218860 -21968 147279 -54152 -113233 -126938 153014
23089 -31889 -222034 -60790 34917 -102927 244079 102539 299691 -8883 -8953 76134 -192271
23077 107646 -133967 156754 74008 31339 -100277 -227413 213841 264918 -157959 -128768
23067 -128768 184091 -80497 -96262 7792 54680 -84382 -126832 5460 -25394 36613 117779 -87653
23054 -40482 21597 -162580 16351 126859 -224229 21501 157956 -233528 285600 -2850 33876
23042 -302544 -187955 -291834 380054 181976 103155 -27190 143871 -134716 297099 -114365
23031 -234143 4433 -49720 32289 114340 -141627 303111 -109448 230344 257508 -204241 -109615
23020 -109615 4673 -240005 90364 292044 98731 93619 71391 -59872 -54660 -48897 -271816 -83803
23007 -117064 83964 -116719 -112010 -185728 -350629 -32281 296847 -11102 -109739 -205827 86982
22995 108339 215984 17658 -22418 258926 -389741 19848 123177 -70246 -282711 12157
22984 -155983 80349 238375 8910 174459 312158 -5648 -214338 -218405 -158952 -262817 -332655
22973 -332655 82923 -38215 -154981 -61744 -140252 274738 -261072 108834 -353851 172786
22962 -124760 99571 -140156 -148258 142300 -333897 155253 -332764 -82054 -15607 -513971
22952 -513971 352840 -86278 108932 -15496 -5709 -130892 26309 195124 133443 -401477 131313
22940 -121163 57672 254515 97876 -277509 -238132 56327 -9098 83216 -25000 -27024 -326419
22929 -326419 251024 178141 -241177 110227 -71862 212620 212840 -245859 26891 -100266 -346324
22918 -346324 -230344 13832 -164155 -179175 -110403 212877 -248589 -429122 -70736 -310983
22908 -310983 -120143 163488 38327 42944 265820 43498 53111 17990 71162 166065 26246
22896 -174213 205798 -67299 -230949 6938 -367412 -285931 27493 -225824 -94524 328364 355688
22885 355688 -33131 -122687 131411 15074 -8222 -38464 157769 95085 69349 -44424 23627
22873 -204862 -127946 -13986 66064 -81457 -254553 -172496 241302 -13840 -134454 -267003 92199
22861 -202493 140250 280307 25327 -10323 -199820 -208086 -135784 -78060 247494 -112065 -108121
22850 -108121 -84830 139797 134724 -229873 -103264 -96865 201157 90972 -277258 -103066 -270043
22839 -270043 -92416 -113440 10459 316626 -149634 23608 -261319 -289152 115669 -247989
22828 71185 -93927 -590966 191143 83135 308614 -118273 -327353 -181435 253403 -28780
22817 88532 55536 186301 73829 79968 164968 -188999 -379489 -177261 -101412 227867 -241126
22805 -131453 -14046 149440 92606 59518 -64516 -353350 -162240 48109 -163087 254809
22794 -260189 -133019 -90035 205834 333450 -12309 31706 88825 -109866 224117 218486 -271412
22782 94460 -122182 219176 -63376 -6848 6243 -242574 -87001 195494 60794 -186398 97154
22770 -291554 70199 76467 -321417 104857 -50877 76168 154027 232164 -384161 31490 -161281
22758 -230517 -298839 -327532 -109166 -112837 -66362 86993 21094 -111580 81322 4599 -15515
22746 -74829 -249049 -18408 342249 -263405 -67184 -340361 111811 124751 212542 484 -54718
22734 24152 -106954 -108606 -105408 -513256 191237 -214525 154892 -179398 -40929 -226700 239462
22722 -88096 -153832 -394534 24595 -103294 -268288 -239671 -25399 -48148 -168198 288269 -162555
22710 96987 171807 82333 73189 34168 -126267 278405 -69156 -102671 -177179 82352 49963
22699 49963 -27110 -342986 148575 110409 -128778 -13479 -63779 38641 -61003 101339 -75819
22687 -147620 234343 98518 -8607 -241734 -233121 137262 -175331 435337 -95273 -5248 -23299
22676 -23299 -347364 229976 -40252 -42177 144002 -102989 37042 -119117 -157587 -41667 275051
22664 45698 -1116 -22277 108746 -331097 51087 43190 -246767 22207 -79041 -157023 -249953
22653 -249953 -89468 -8310 87821 -175017 -166496 142323 25864 -241251 31359 -100890 -37544
22641 69994 206795 341633 142976 -89505 191966 75769 -139625 -165801 -431108 -71717
22630 -252879 -140489 -53799 -250422 -268160 -4031 241863 -100603 -240179 73726 -119483
22619 -255189 -137427 -101714 -100190 173957 180501 227974 92329 47219 -14739 -87125 -229325
22608 -229325 -315599 -137625 -268224 52603 -55095 -48102 193510 26304 -37141 125565 22489
22596 132661 -262321 -41071 -23157 189234 19262 -275318 -169670 139132 -86879 29680
22585 290832 -159659 -111832 10248 -128867 -161868 -177124 -9891 -115220 -11105 -153557 -34231
22573 309487 -497839 135194 -397584 -127234 -61174 -30418 53937 -172013 -46469 -48743 -44642
22562 -44642 13451 19122 94123 -363056 1463 -65654 -178092 105323 -271197 -382419 327836
22550 -177776 -233026 -379505 -42646 -218081 266586 67850 -120535 299935 -53769 53385
22539 -250305 18842 -157802 83086 7031 85181 -187352 -140240 -186276 -100165 257441 -167185
22527 -128342 -149042 -201901 -56661 154088 43323 -84510 48887 -8863 -228790 28081 -17467
22515 212581 108083 69950 -244586 -42208 -104149 -130919 200278 134805 -230456 103556
22504 64786 35992 291431 176748 -48769 -106847 -111666 -285806 -178299 -13167 -14565 5958
22492 -174221 -239270 -46046 29263 -105075 45297 -93884 34917 46235 -121433 156079 -60863
22480 56861 -145427 -197470 -6641 72795 2548 -126937 186 156154 100278 -247100 334073
22468 6558 -140927 -79700 -66795 36907 99855 -103034 204204 46301 -147821 -74821 107345
22456 -342819 28293 -12959 46050 101523 225771 -163811 385605 16832 -136643 -146856 -402461
22445 -402461 -145831 64515 -138939 177462 254808 326693 -311580 320899 91712 77166
22435 77166 -57291 -35749 -350273 -267222 127085 142974 -69025 11761 104242 -36396 353110
22423 108031 -57062 -109007 -237958 5804 154151 12990 9951 22363 -59115 162528 191430
22412 191430 -110675 31370 158064 118775 -288696 39262 -251190 -72522 69910 -223354
22401 -112029 42040 -395833 -166372 221092 -216460 -441523 304108 355133 -103798 -89064
22391 -89064 -144343 102086 -131016 184557 -164823 -311589 143989 -328986 202977 -202604
22380 18418 -314095 18254 -392327 82078 93351 158449 42288 -85068 -85520 -362656 -241568
22369 -241568 43145 -187877 347574 23669 153688 -231861 -181034 267489 242776 -208663
22358 -338016 2777 -210677 215907 22853 -12579 -17172 30897 23792 15146 -79084 -356417 -182554
22346 -182554 -120791 34143 5440 -228496 17429 -178889 -58073 -199186 -3486 -45442 195752
22334 -156339 -117890 -373205 85211 -12688 24803 -75400 41732 -267691 -15983 70485 -105879
22322 -89394 -296112 -174748 -395961 -119812 -84596 -394050 9228 -149574 150016 -168276
22311 183585 -94667 -83112 -24381 152366 -28543 -82536 42239 187753 -333676 100287 243106
22300 243106 58313 -143239 -132648 -201249 -223289 59034 -101766 -12899 196596 -279359 930
22288 -142407 495967 -41223 -207170 53255 -48528 198829 132101 169553 -124259 -11963 -180563
22277 -180563 -158630 30820 -379595 -82210 -300659 -162143 -338667 377028 237498 109919
22266 93380 -272604 -9530 3971 134796 -120967 30206 43275 -409011 -255082 34498 -343033
22254 7652 192223 -201900 17670 -283773 122939 209522 -67342 4676 222125 -353861 -213668
22243 -213668 146190 98573 -152816 52746 37983 -190357 -101506 -25527 -313350 -626 -91661
22232 -91661 117203 271919 225697 133775 100056 55147 78216 376663 -45618 -188977 -136468
22221 -136468 -94134 -57189 -199288 -57020 224671 -181018 -224509 63410 85915 270271 -101918
22209 -87605 -256723 -14216 -229439 62644 89309 -38070 -48574 -109692 88301 -206869 -87233
22197 -162710 10505 -30911 -7569 -216033 40292 79283 50199 -146440 -28551 -85643 -87158
22186 -87158 -144536 254497 3553 134945 102006 51023 -258607 -289140 92305 -107879 80692
22174 -26935 -321735 -182684 -250035 -204701 -271224 -59232 31910 154866 -131717 -269095 -381744
22163 -381744 179510 127887 -70944 -183326 19957 -294293 -113481 -175083 -58139 -305908
22153 -305908 30336 -134938 192516 15822 -80431 -14326 103647 76627 -289556 135380
22142 -145833 -38298 -103998 -58864 138543 150693 -257038 -101475 -169179 -23256 -24397 -87886
22131 -87886 2784 -38975 185139 177412 -154523 228896 -9195 48017 -378773 -127382 95853
22119 -13704 -94742 -99420 17931 10113 -195239 -84613 -92977 -45959 95573 64779 -117752 -125
22106 -96766 -33573 -328597 103189 109841 113357 -44205 -113573 170986 24835 -283477 -125409
22094 10004 -1026 -11227 168276 -239634 -179440 -40216 -128892 20522 -49067 -252499 100561
22082 266026 193695 -136868 -32478 459796 58185 -39750 -175611 184339 -39087 -219900
22072 -219900 -189957 -218753 -257244 68586 58423 184557 287308 -331428 -366791 97661 -20847
22060 -125234 -72603 -262644 -23085 -76247 -15315 -190886 349991 -66109 -168899 52709 -50807
22048 38289 -81708 -95080 -92601 -241545 95987 -80061 -220948 -95277 -241690 -324447 40226
22036 31903 -39420 99011 -443692 111397 -323799 -53684 188967 -101240 -96531 201034 314119
22025 314119 -135820 -153271 175256 -233539 -302178 -26360 -292179 223302 -183456 -152196
22015 -152196 -62547 -196198 -353571 -37933 -260248 243775 -189736 -86717 133172 114689
22005 114689 -151200 87409 -241646 -256667 155721 -145888 -30966 -75357 146705 33864
21994 13397 -26091 -52581 136276 119264 31493 49875 232585 66621 125344 -293895 -59672
21982 127796 48139 109893 18418 -407754 -365595 173755 -47464 -174061 97726 -266645 -143422
21971 -143422 183325 -193127 -75462 193695 -53791 53513 184592 -13207 180699 -66830
21960 270877 71363 -339020 110126 -49338 139081 -41123 -191712 119646 -23769 -329191
21950 -329191 -49585 -489003 -88354 -330152 29282 44966 155698 -57383 -30435 -471960 -330235
21939 -330235 -301793 -282087 -29512 -240644 174438 -212690 -209234 269078 302743 -203687 -417387
21928 -417387 -94976 -113965 138638 35029 -144242 104382 -104656 23947 -18266 43921 -87012
21916 -57000 232385 -67082 194860 -82289 150729 -225334 70834 209618 -304301 119445
21905 -161755 112680 -390187 -5029 112335 92222 -127430 -106771 -30643 -7476 -4377 35087
21893 9786 -55641 -13870 -284114 -44697 -66323 -32954 -128594 -95843 -406147 -133340 -157244
21882 -157244 -299799 -296102 -322200 -68361 117747 -95506 -166905 43471 -85769 -178733 -123354
21871 -123354 -206104 -127577 76344 21712 -172653 -42951 22455 25794 -161224 309995 375
21859 35607 -123772 83450 98125 -14257 -139612 54437 238572 -220544 -280216 194428 -410315
21847 240996 -167574 33458 170393 282218 -24151 -32886 -298575 28752 -51467 -244257 -208950
21836 -208950 26619 -77324 32898 35005 194741 103617 151859 83586 -210766 -77680 133312
21824 -3156 93867 -17189 -31210 1958 -123516 264044 -26319 63573 -279102 -36651 177184
21812 78808 -56999 33409 -102279 143188 281283 -6774 188322 89530 -47450 -322254 -142925
21800 -538637 -164591 398127 -45112 -63207 -113226 -8666 63029 269140 294167 658 -92689
21788 -215271 -161082 -50544 34741 -283832 -170345 -234100 198824 -12493 -403096 108410
21777 184178 -197050 -120231 -160973 142964 101055 48213 38434 -109180 -242050 6020 -239435
21765 -206256 79294 -30926 71708 -160717 -90005 -364203 -117129 81045 -78128 -89494 241409
21753 -20385 -116021 57873 -93327 -138348 -176959 -128742 86794 65117 -3649 479251 -174658
21741 -213074 281332 -102636 -177832 61976 34955 -77203 -39194 -217327 33670 237534 -308869
21729 -113842 36129 -45415 47181 239814 -33062 -31642 252971 -133276 -87926 -83825 -20214
21717 367189 177798 360190 57600 90301 -67321 75584 282267 251899 95904 116159 -50883
21705 -130049 131487 -158113 120235 -47812 -176181 -55643 6686 -378644 -250893 -244955 -161021
21694 -161021 -271757 -108149 -69526 -372606 -170361 -183188 -175588 -220824 -56573 -255365 85181
21682 58577 -270970 -112286 4617 -288201 92984 184205 40953 -202741 -81329 -20327 79945
21670 74280 -50977 -215429 -61364 219002 81212 -609541 252275 -20820 -139177 20287 -173605
21658 105887 -90844 -316390 69616 -316165 -11709 180801 -25088 108695 -275944 56992
21647 157215 -174635 -199776 126792 31939 -113500 12956 49 -95535 99074 58124 57012 230583
21635 230583 -91090 66164 37807 -93301 76165 -35923 -125012 -263459 138435 36405 -248583
21623 38855 -295295 -211203 -132283 70755 -38444 321864 -87496 61292 101201 31064 -299517
21611 32226 -91960 4460 24051 577 -282960 99181 -31166 -330146 -146155 -21565 -153204
21600 -153204 110660 -122470 334605 63559 -340314 299626 -242313 -241262 -102034 -167848
21590 -167848 -29837 -134361 95045 73740 -25214 -98836 192278 -211307 63780 -90983 432488
21578 -106821 -122609 -131752 -133199 -2762 150920 74813 69355 -274936 96699 -218457 -218589 -45786
21565 -316466 -73424 -129904 -165667 -86371 296228 200661 351968 -178228 -127766 -215242 81400
21553 22133 -58350 -33844 33743 -90204 12389 229940 -58932 -99844 -129854 -89928 -139545
21542 -139545 -150670 -108839 -207004 -126898 -295609 -323079 -118265 -43069 -195923 -99644 -227432
21531 -227432 49872 -243257 -187436 45007 59489 118192 -97371 -349720 -250061 -310426 -25084
21519 221348 107165 -201812 -2277 -207431 3504 -189878 518939 177956 477834 217917
21508 12784 -184921 -74515 -252191 349889 -18851 -300232 112483 -88227 6065 8200 -154097
21496 -234380 -151588 -3163 -160905 -174017 146685 97107 -23484 -135256 -196090 -77256 18510
21484 -267881 68686 -37797 -249035 -330217 -218987 -90664 -274799 196289 -102216 -237692
21474 -237692 -234378 -109630 81135 35700 -97305 -39798 -214423 -302129 37700 -56227 35582
21462 -64677 -222095 -306785 127931 -261470 -235108 -122182 -213254 231026 -230038 12629
21451 38917 -47190 155264 210155 -59503 -233661 -69739 49260 341024 -151499 -415559 -109136
21439 365145 -143601 -258444 -81215 -159626 -18083 -73619 154062 -110193 47595 8059 79787
21428 79787 -203581 177314 231716 -104134 79037 498884 112332 422869 31650 106146
21418 106146 297191 -78455 345724 -135488 -11288 170746 26397 262292 -44493 -179402
21408 -179402 -397343 -40228 214225 71541 -71456 -72392 -235943 -207392 75059 221766 132278
21397 132278 -247663 -47575 9310 139069 -77110 -287440 172269 -147831 -95809 352164
21386 -129939 117742 -12162 229413 -204639 -141309 51670 96010 -241770 -129335 -183379
21376 -183379 -396344 -82967 -248564 -96172 -220518 -64392 -165883 62226 -214711 237012
21365 -109629 -171274 -132206 -156379 -242363 32237 -86708 -94457 -75655 -118918 -183339 62514 -345129
21352 -378365 -41940 -60331 -78527 -203601 -26209 -152823 -115046 -303564 167696 -185470
21341 18560 -297691 -15665 141463 -53259 -149196 -237529 -38696 -218277 -49629 237620 -11943
21329 -232608 -57450 -145174 23950 -34948 -61192 -87468 309026 6112 71650 -44393 -99616
21318 -99616 -58502 -275190 -345759 -64123 -26731 -86544 -233731 -10967 -222354 -55259 261983
21306 -168974 -235637 64765 250721 -204488 -14140 5108 -216449 -52113 -346726 -143384 12561
21294 -280134 -130864 -331169 22898 -126988 86165 64778 -260001 -29726 235662 333009
21284 333009 90527 237503 -345569 -41181 -122433 -175161 -187780 29829 70569 -179047 131563
21272 133364 -61787 127619 -77958 -106484 222273 238418 188956 -338725 -68466 -174802 -61819
21260 -260222 280463 110714 90073 -104686 192097 -258173 -260516 -282880 -201909 -303372
21250 -303372 -345941 27965 49508 -76268 10653 -120844 129750 15852 -164102 270096 -326698
21238 -21101 135021 -158184 -220327 -129319 -676 -79358 -44989 -6523 -168722 -151328 -194133 273295
21225 169350 83025 92909 112556 -385118 -114386 -140510 27924 -11367 -201062 -138012 247152
21213 -297396 45200 -63977 -315039 10073 47886 66180 -188429 256167 -130374 94018 -92145
21201 -226356 149406 -353614 -54626 303750 245177 -38234 -94977 -131423 34719 121407 260580
21190 260580 -232742 239352 235763 427 -199765 -148035 -153353 38827 -154284 -22934 53766
21178 342661 184862 72776 -27119 -293060 82446 -281883 -184146 1185 -193737 -72625 82665
21166 60358 -185935 -319542 -14508 -249913 208876 -357309 -201561 81657 -197717 -264939
21156 -264939 -2981 -230519 -73919 -211720 103759 -45306 -176939 -119486 90996 -166888 -203985
21145 -203985 -233098 -153410 -325969 -14702 -228531 -84408 -122301 7328 -167637 136540 -171499
21133 -176505 -43197 -157153 -248643 197865 -20562 -235873 -173264 -119381 121586 -147409
21122 -79263 58998 30574 -64064 62901 -84646 285 -197669 -274044 -140357 -120224 -326521
21111 -326521 -336715 -865 155660 340580 -122054 149278 -269191 -359458 -50458 -156140 -478678
21100 -478678 94060 -124770 60511 29598 78923 -407850 -134035 103524 -47912 -114569 -302389
21089 -302389 -287679 -140258 -88212 -34188 -234903 -250863 -64598 -314641 287737 106916
21078 -105793 -105120 -214928 -130467 -39119 -112345 -91650 -156900 -21702 -273505 -24803 -4310 -89537
21066 -89537 132117 72907 -157544 -408799 22178 1806 423375 -265415 -85007 91437 94704
21055 94704 -162421 -40826 -253631 347451 -231674 -81166 -125304 14233 9131 11484 -167485
21043 -99249 -253752 74945 28578 -333182 172120 133604 -16713 -2221 149682 37825 -16669
21031 62862 3470 44705 461228 -321489 43098 3969 367314 -275595 -165928 -79300 -356431
21020 -356431 133490 227868 -53170 -59498 204412 235418 271567 -169580 53036 -172302 -92362
21009 -92362 -61069 -258057 -89335 28605 317769 140896 134546 278627 -152574 -209218 -39037
20997 -24293 2340 156245 346636 318674 214591 437934 53474 408524 104697 77187 423011
20986 423011 -253881 13602 -290929 59490 -232626 -355161 10703 336515 -122666 -133561
20976 -133561 -35699 59970 -46884 -80998 -57562 -468793 7808 -308989 -120017 -216850 158216
20964 239436 9946 268311 320010 -157549 260852 70431 -10275 -248198 -22650 22881 -304359
20952 -26801 -143845 96987 -533580 217196 167180 -264644 -192932 60134 -65103 -19037 186287
20940 56068 85650 78086 -283900 270515 -253053 -122230 241909 362 -86106 16715 295133
20929 295133 388112 264135 242251 470348 526939 163606 81345 -242359 -322020 157914
20918 211726 267008 -59990 94564 -146519 -298731 -118081 84543 28269 71456 -376990 26554
20906 -21935 59040 -3603 -131185 -137713 47409 233884 -19031 -319676 -260684 -171174 11832
20894 -132531 -66377 -174861 -415773 -134463 -130528 -107736 -143908 53894 -20899 -20048 120657
20882 30520 -224177 -115657 -13308 -190406 -24069 -187115 -378380 249860 -87932 -195561
20872 -195561 2718 12730 -165782 427104 4039 -186079 -188660 -327692 -154888 -22549 107699
20860 -166483 -111999 201764 99173 146500 -48863 -91782 -57274 -109810 117553 -243148 17238
20848 -405498 178797 -72113 39659 -52763 -112929 -63740 170008 -7485 -405881 753 -200757
20836 -136551 143611 -413433 -25172 -146779 272678 -56840 323099 -213683 138592 -165099
20825 -173115 -48698 -50851 -119383 312 133341 -349296 -42384 84474 28218 -179970 -290508
20814 -290508 124720 147801 -185176 14150 -360243 50138 -219646 -173508 -187981 182737
20803 -11945 111794 -399473 48842 -142856 212536 -15531 -95721 -141261 -208723 -303201 -211026
20792 -211026 58130 164760 -67337 -323067 -65261 142176 165732 142759 -293652 2689 -184008
20780 -104187 182398 -8591 -56917 102432 -243754 -489760 -85350 -106615 -391473 -243455
20770 -243455 170180 -167451 -75225 -77222 -33996 -65324 -93060 -159381 -117363 -29272 -335811
20759 -335811 238550 -128999 -222885 -138107 46302 29934 213806 -76304 -70947 43608 33652
20748 33652 -291863 367176 30142 61487 -273731 -387249 -6073 -70241 -56341 -151974 -506931
20737 -506931 77252 -29124 -66624 90188 -56918 125374 47804 -75579 95076 -8038 -185244
20726 -185244 -212378 71841 128813 -175475 -184643 47717 -171842 -83388 -145049 -152404 -468713
20715 -468713 -27208 423677 -78582 152517 76329 -51990 -184428 -124427 -167346 -71032 -14473
20703 -178791 -318954 33146 107128 -37764 -133501 -134489 -121604 264078 -86329 18520 -207819
20691 -146595 -16583 28060 -224392 -139923 105288 -57609 144773 122539 179541 -244845 -258607
20680 -258607 -228610 35475 -232390 -90385 4215 -198684 -201044 -136538 -63474 78694 27837
20668 -68643 -52721 -95817 4030 -306271 84043 194505 252041 111405 26962 -92318 -156500
20657 -156500 134211 -155889 15016 -70954 225215 19949 -503797 -278383 67631 -28653
20646 -211327 3214 -195016 -194078 -28212 -187224 -210147 60893 83826 -113288 55912 -107058
20634 -190511 -134403 -19691 55742 54227 -506747 -100250 803 215349 -113666 -81141 -226857
20623 -226857 -329523 147923 433884 -237341 -336063 -195446 77942 -108443 5299 -115480
20612 -53398 184206 -129274 -57326 182255 -273757 -21056 -147932 45369 -50971 -35720 -169059
20601 -169059 -174739 -267844 -348265 44444 -25821 78879 -18640 -344212 -219683 363265 114991
20589 107958 -24728 -315124 -189707 178423 -339944 -245470 -31396 337227 -202517 -405945
20579 -405945 2361 -15215 -240020 -86868 20519 -39890 228539 52455 -166162 -294245 118212
20567 97636 305557 16065 -228297 265657 -71438 -245099 -96995 -542 23307 -29473 -73170
20556 -73170 149948 -425261 -296577 34971 93296 -80924 -106177 40432 62706 -60091 -22319
20544 -94861 135851 345361 -197558 -2105 -327889 -221138 -54335 16222 69514 -85500 -555198
20533 -555198 -315663 -12309 -6078 180509 -226558 -43862 189769 -76728 -135999 -205506 189353
20521 124541 55824 54143 -60815 -224631 14911 -88398 -14036 -116889 164602 23547 39812
20510 39812 -319727 -257398 17923 -93589 18379 -281511 -169185 -20286 -87609 81977 -309204
20498 -142546 -6564 -165889 -115024 256799 162017 39379 66751 -37817 -271061 -28496 -224792
20487 -224792 -144851 -176919 -4094 -223133 45672 -121191 381608 406 -33438 195396 -54022
20475 -123759 -38649 -184450 179870 -290673 -77026 242748 -195197 -103064 -213697 -153760
20465 -153760 -194388 153755 -63597 -5605 -413007 11409 -47820 -226624 -497168 71791 -58830
20453 124597 76612 -372924 -5879 59382 -4297 -23672 -139959 487047 -10808 296629 -69917
20441 -57918 21927 -110685 -117755 -260297 26989 -347310 126090 -86113 -116626 -365033 -308419
20430 -308419 -37946 -184293 -105432 -59901 -236972 -293848 122594 -59738 -151565 135080 1840
20418 -133437 -131771 25631 -131832 -38531 50481 -121388 -457444 57297 -285846 -217717 80283
20406 25167 103333 -163120 -132937 154299 -195913 -25854 9141 118887 -330767 -198428 -162316
20395 -162316 -177844 -334747 -228957 -105460 102437 -344893 -32847 -72904 -445779 198186
20384 126160 -12574 283067 152725 -380702 -77714 -349433 294538 252953 -163300 -16553
20373 -234289 119894 -127715 69384 345743 36716 64605 180162 14903 -233912 62092
20362 -54537 89065 64765 -140851 -150343 777 -99900 -131138 197126 -286659 -144731 -31080
20350 -152361 -326741 -93494 324975 -329303 -228871 -212439 -62711 174016 -124010 -6693
20339 64985 -238679 -7788 -219887 -35276 195968 118276 -167957 -200618 73114 -676190 -27870
20327 62737 91816 97888 -394458 -196076 -328405 133877 -177550 276554 -38460 -34664 -316315
20316 -316315 -122585 99098 -144793 116872 -31501 -20107 93503 -288096 -157210 -251597
20306 -251597 -90736 -69619 -219397 -5988 -19238 -147610 -22867 -105279 -235806 -267869 -89769
20294 -275535 -60933 -63454 -445305 -257217 -49752 -145855 4189 104990 -145350 96191 114596
20283 114596 -419281 92233 -48975 190676 9734 32455 119895 -217972 -247963 -109544 -76138
20272 -76138 -294250 -75035 -214276 -90086 -271554 -73504 -320890 367926 -135505 152455
20261 130762 -134657 37457 -98800 108204 102287 -227932 -104738 271746 -3727 -118789 125614
20249 351980 -9013 50810 183348 133570 -291552 -27577 47412 -101055 63737 -157095 -155820
20238 -155820 10163 41886 -359942 -5908 -126253 111743 -51123 -147401 79746 -44744 -150661
20227 -150661 -250845 -227090 -137605 -25365 -71774 -155779 -70576 203576 -240449 115615 45395
20215 20015 -6393 274978 5649 130902 247205 -316374 81719 41856 -152233 -148870 -62946
20203 251205 -127068 -58149 89400 195189 -46310 152976 -5403 -263012 85729 -181799 -4967
20191 -235730 6007 -182141 162797 -37767 136069 -234844 -65402 218148 -121767 -370452
20181 -370452 277096 80453 71081 -124346 -37840 -71837 161186 154822 232081 239056 73081
20169 -174533 -147507 -237976 199173 -384575 164135 19062 -349973 -33971 -71533 -175774
20159 -175774 130798 -271336 -73517 -80568 112344 146759 -183703 73018 95067 -168293 64795
20147 235786 97355 -243507 -569 352591 397651 20701 47697 -40991 -151226 86717 218021
20136 218021 108930 76924 203656 230802 342871 486360 -74992 325877 317909 89336 77921
20125 77921 490643 391617 437651 406552 40407 214437 169733 219936 -85265 -8572 216717
20113 226800 40801 407241 -24870 124743 93505 135602 146225 130406 112629 -478937 -85633
20101 -114076 186769 167582 -131829 22565 -120493 13240 3367 -151710 6865 229661 340928
20090 340928 -84091 -307427 158438 155001 -14446 122763 86567 -279520 13423 -11219 -106843
20079 -106843 -52853 -144403 -93030 113323 -94080 3385 46467 -159881 55238 -92272 -198742
20068 -198742 -149072 70658 174073 -85298 313647 284579 -259622 5802 -28635 66971 -205909
20056 -9558 -11121 23903 -325599 -12240 1374 -94396 206892 -192802 -194866 114472 -53771 297233
20043 323067 88156 -83850 -19143 -91304 -24913 -136590 79145 -20176 -74793 -76823 -119496
20032 -119496 12050 -259722 57631 -273841 75340 -110397 -74245 -7209 380282 -317538 -201696
20021 -201696 -369686 -536280 -126749 -263561 222790 70191 -132563 -156944 -252952 -202752
20011 -202752 -294211 -146371 95536 86813 -168699 -200222 -96826 352093 15068 27312 -177209
19999 -141253 32527 -62899 239260 9731 356731 -255349 69170 -42436 -61984 173029 -337745
19987 316761 261509 -249745 -22988 -80965 45335 70441 229758 128179 307913 732 203261
19976 203261 -44896 2853 180309 55468 266469 -42948 -93803 8097 205893 -22326 -338026
19965 -338026 -165729 -109918 -73774 -196774 -52355 -110676 -107008 36420 45266 -13663 -108636
19954 -108636 345185 1674 -65236 -28464 294464 135155 95645 319998 -293544 97132 249005
19943 249005 163335 -206426 51401 266209 -109107 43601 429519 14430 -12889 24043 -89343
19931 -62107 -412813 -331127 82660 -73376 -87266 -141225 -162084 -245685 -61185 -136476 129204
19919 220111 116868 16196 27628 -289939 -59023 181226 -31253 -37909 -30389 16730 -99872
19907 -38592 -162728 94296 -199552 -7150 -77520 -118241 -277840 -191312 -32223 154629 137299
19896 137299 -288841 -83686 87288 -53997 42237 28023 -71617 -477717 -42440 -77598 -159847
19885 -159847 -135355 -56278 -145232 -53721 -119797 -388129 -159324 -201835 17176 60736 131241
19874 131241 8323 -34655 -160462 -32065 -313281 -280958 -38779 -43031 -11610 -23781 -183002
19863 -183002 94969 -137778 -167496 22375 179755 -129520 -4015 115613 -121949 -261458
19853 -261458 2400 -332206 -32126 -66557 -14356 69148 -155031 -209989 -109293 136124 167251
19842 167251 39928 232352 -188326 147903 -131253 110831 -45258 92798 -171645 -177446
19832 -177446 -102416 -129034 103839 -20635 3293 -19806 -100751 -45075 -28515 -106089 -105955 160484
19819 -198138 62187 103063 -24859 -74142 -30510 167782 -84435 -164289 -622570 -3302 14692
19807 184563 -227206 -14221 -10721 292297 -248739 -239072 -208547 -167649 13983 -160635 -353142
19796 -353142 -185026 322054 -169304 -171880 -4539 -180495 -416173 8034 38121 75510 58753
19785 58753 256896 42900 -141111 -302713 260939 26802 -27795 -220784 93198 -423660
19774 -94086 -27220 -351835 -410865 -234446 210074 165481 108045 8476 223192 78742 -282980
19762 -141876 136973 -29084 -138626 6443 221349 -75494 -94135 -159817 27114 128017 215907
19751 215907 -198278 -193056 -71605 20964 -182568 -140217 318953 21789 22472 -367773 -10100
19739 9840 25683 1123 -159297 -268841 158590 60693 -254616 -35164 -103238 135160 -176220
19727 -65201 -74066 84568 441478 75991 34472 163039 -239888 272235 32469 315569 444443
19716 444443 420851 79470 419088 199014 510162 245312 -110191 92866 -13131 479 146372
19705 146372 176619 -186789 -59918 11899 41201 -33258 200283 284251 -33296 -55774 -218000
19694 -218000 -173066 43018 -100358 77754 181776 75035 -60333 -17650 392788 112240 39599
19682 264846 152419 -18750 127327 63748 278717 32777 188552 -235226 -188729 215635
19671 -100468 -76455 -92115 3630 15816 208462 -262584 -216960 -190598 -82271 -10674 -86681
19660 -86681 152714 -107728 84498 90133 -106101 109728 -243832 205291 -10120 -252766
19650 -252766 -143521 -3614 -364513 69801 -308683 -102952 -20512 101403 -143894 51093
19639 297379 -145368 -71876 -76088 -186104 124191 -27004 -217774 5422 -8913 -55450 -192347
19628 -192347 -142652 -250149 107238 -304100 -305932 -104929 -262327 148091 -315295 119093
19617 -225718 -490917 172155 -69941 178785 214303 83713 30056 -260898 208597 -230085
19606 -190151 -9047 149620 -87975 -162568 71234 -64045 18980 59430 -336806 -28994 -91892
19595 -91892 -34165 -272551 86056 -159042 -176938 -18898 -194280 134299 14795 192812 -208156
19583 -188590 137165 -34977 -193853 -265801 88101 17433 -177490 -1865 -237157 118383 -199269
19571 -342657 -141992 135873 -60502 -183348 212917 75496 -41860 -32950 60967 -83603 -261396
19560 -261396 -256541 -144482 -130649 -276334 -237780 -175126 78860 40474 7654 -128831 241402
19548 188503 191652 -247761 -24867 227656 0 -263487 100335 -33276 139005 -50315 48300
19536 81541 -388800 -195696 140381 -123631 -26086 -156388 -232721 6164 -299423 -348174 -145198
19524 -190706 202889 -154602 -269576 -111033 36439 211992 -245618 96850 -67907 -106495
19514 -106495 -317533 42378 -228306 -18630 68364 -229249 -18289 -2945 108226 119717 -213161
19502 25721 -124023 52322 -274684 132072 121643 -230765 -225001 86569 71870 -167262 -37360
19490 59755 -361234 246460 95181 -215630 -271296 -244967 65246 52208 413689 -238549 -94026
19478 11278 92728 109256 -96080 63231 300959 -260325 -80273 -355924 -173122 135044 80453
19467 80453 212585 -332721 -514225 -198406 -133592 -67811 -119506 -26238 -231933 -223052 81772
19455 -121682 -8973 -103001 -164876 -294258 -332930 -108453 71567 -107258 211004 -138659 20232
19443 -227513 -58134 72495 -75060 -418582 -293096 225044 106327 -192884 -226902 -42090
19432 -39579 -162224 -274559 -443614 -75091 -78254 211111 -40917 91448 10025 -194175 -362411
19421 -362411 95356 -24068 -73043 -248320 -286236 125044 -31496 -5326 -209939 -201298 -320061
19410 -320061 -35107 71186 58387 182027 -206673 -54970 143900 20365 81224 209062 320736
19399 320736 -246066 -79083 47397 -71589 -188014 6873 -178549 109350 -153307 10882 -348126
19387 -333532 -122149 80020 -93458 -136836 37480 -79449 -212459 -323852 49143 -52231 -28668
19376 -28668 -149151 -50542 -280555 307154 -61012 24590 259924 -178339 -59752 -194943
19366 -194943 -475958 -67700 -28165 -253702 -263876 307903 128572 48541 73989 -173159
19355 -58065 -197665 -75818 78560 35287 217922 -264507 117746 -699 -259543 -341377 -250533
19344 -250533 98738 -194797 -238961 -353420 135578 62397 -42944 46441 74298 -149610 -2248
19332 -97316 -50313 -165733 40302 15449 -83588 216619 40264 -37875 -43918 -56065 154330
19320 86414 -311659 -491263 -373398 -31368 -354044 -238370 -45001 -156771 -272888 103865
19309 -30856 -233934 197936 -230808 -30377 263753 65295 -139208 81699 -255048 -206577
19299 -206577 -440772 118775 -35837 9176 263201 -70241 -9372 -10021 -68446 -193074 -101921
19288 -101921 87438 155657 159079 -347857 -15237 178437 -216774 -224596 -54445 -205600 -49832
19276 -71645 -355350 -110044 -209357 -497992 -8353 50390 47667 -280477 -376111 -11382 -38344
19265 -38344 132467 106512 -384756 -38069 25379 -342825 42353 -172177 207871 -147915
19254 -41912 -138116 -193433 -127281 31361 -307681 44607 -142450 -227839 -302374 -112105 -207897
19243 -207897 -16820 -88227 -100414 127960 64452 -128940 -162891 127189 -108278 -106493 -81675
19232 -81675 339570 -256357 -158464 -59369 -21634 -342866 -2646 -236945 -16082 156736 49467
19220 231960 273048 85764 -56256 -163308 104418 -80811 12008 -233323 -216665 -71722 -123853
19209 -123853 -151793 -330434 33547 -13685 -248595 185297 -136062 71817 55211 -89335 -343284
19198 -343284 272070 -262699 134841 -205334 -47629 209997 -92074 228748 -59626 -2622
19187 14066 43355 -184993 -198200 120953 139316 -66604 -68391 -116832 60208 -305653 -124857
19175 -210968 -167297 32442 238680 -68555 81283 -301918 61506 5448 -369943 129611 -245674
19163 -375994 393379 -88693 -316828 -46072 -219159 -428612 -301071 -235256 81079 -118667
19152 -4710 -70989 -116294 -16370 42947 125435 -173987 -277491 -169898 -239768 -19243 180836
19140 -157822 -157914 -305306 -426068 -339949 -206145 -92809 109497 171098 237307 -175754 51839
19128 -303096 -5982 110905 -281376 144665 104441 -303981 73317 106511 9657 65155 -266055
19116 -285150 166978 -151008 -538089 75970 -310209 233082 88134 -54152 -364882 -296363
19106 -296363 85594 -34235 20353 -64856 -132552 -156228 -148854 256477 -205920 -168560 -74876
19094 -57436 -162666 -344986 -51734 -136507 213073 50301 77372 -79128 197355 143309 -143831
19082 131200 32678 -197512 101226 -58905 17032 -53874 4139 -99761 264291 39911 -229585
19070 55324 47167 258040 -457120 -37301 -417478 -367905 275297 -65809 211431 36846 96029
19059 96029 -137984 -418996 -104147 -212295 15253 363199 -289458 -161034 -299098 -154964
19049 -154964 -32785 6829 -223858 102062 -219400 -361528 178555 -95636 183585 205442
19039 205442 26427 73868 204711 13641 140398 -272894 -84833 109370 -6384 71302 112802
19028 112802 -80127 -108474 78111 21268 -318026 47603 73666 -293393 -167284 84941 122885
19017 122885 -303336 -220390 -90294 69983 -72911 69705 337410 166439 4453 51319 -111510
19005 10201 -93759 -339841 -179385 93300 -54783 62053 -233535 79893 -272519 -208738 54043
18993 -56626 -178274 89939 -140566 -118354 -83729 401677 -151332 113935 -44053 161407
18982 69124 -391581 -162677 78865 85523 20112 248321 -120191 -247745 78645 45111 -33321
18970 361363 -218158 -49063 94499 -226976 171518 -93389 -109877 -285899 -397902 284597
18959 234931 454219 127944 529401 310495 157284 -196871 52775 -97725 -9284 116446
18948 -48174 -493495 63205 -1510 -323596 134273 128253 159094 -212557 4932 16165 -50121
18936 -219745 71285 -107646 -163788 -99953 -340817 151995 -137955 211627 -209948 -152491
18926 -152491 -72875 -69634 13073 -344329 279919 -137172 -73222 15951 -439904 104611 171930
18915 171930 44557 -64485 75947 -149764 24403 184496 -115966 -179627 -81384 -68246 -12950
18903 -6409 -198569 -81615 132041 53838 -96386 -119054 278415 285054 325433 212471 224017
18892 224017 381909 330363 110134 47718 205234 -219775 -80552 53509 63284 -116367 -94890
18881 -94890 274813 -100392 -33671 -325013 -237990 -103455 -188904 -266031 -184764 -113711 -183025
18870 -183025 -357359 94499 183946 274318 -151567 -214065 -343862 25484 -275563 201424
18859 -225626 142846 -49318 -247569 10740 -58050 37647 -190085 -37067 3810 -63300 -334439
18848 -334439 301783 25009 -182999 105671 194928 300717 138960 -407547 -195935 137465
18837 131424 -278529 -166713 -197362 103022 -167324 312069 -129540 108813 -30866 -60623
18827 -60623 -153886 -119416 -293692 -128901 -77321 -190657 -131594 81579 43279 -27407 21414
18815 47361 120095 -245532 -88698 81241 295647 -224285 179768 -6385 -244750 -81510 -166660
18804 -166660 86721 -70537 -84913 -141034 -19330 174954 76128 202544 179894 288189 185930
18793 185930 -94493 117567 -376495 -11820 212468 -332096 -22638 -121689 -111459 -104359 -297275
18782 -297275 89161 15624 -409463 -310306 110129 -82467 6151 223328 72457 -334362 -28236
18770 -9409 -245270 416814 -229486 9965 140550 -171017 -171332 120557 -64215 -35889 30930
18758 -76479 121033 95858 -205185 -56631 -178574 176455 -63551 63403 75724 22145 -350040
18746 5853 25 -172089 315892 -376230 -98109 -34740 24536 -110705 76941 -227131 -106811
18734 210120 -216821 16351 146672 50738 -70252 -63054 159418 396122 -389102 259674
18723 -4320 42153 91739 -242552 -244504 -145245 29362 -301198 164251 -14192 -313022 303784
18711 -156966 -118544 -64256 -120926 -215311 129463 80897 295181 89500 -228814 33757 -157294
18699 187255 -105222 54228 -84856 -115424 27746 82438 362099 -291901 -204212 70367 -116843
18687 127638 84013 -253948 -211622 -234759 237619 -154580 5526 -83921 -408969 -46672 3166
18675 -138907 -107530 -137345 -294967 12438 -72850 -54079 19554 286176 61711 -4515 -408216
18664 -408216 -597708 -82873 -22734 -133971 -58539 -174909 92367 225589 14646 8722 84897
18653 84897 -198398 -191240 217572 -45993 -134357 151369 -112409 64712 -125048 184961 -108516
18641 -216427 13386 -38643 -243534 50208 -154658 14124 -59924 -56939 -256273 -43872 -321736
18630 -321736 -121397 186842 -162245 288356 -89593 -42494 -270676 -148770 -208482 226088
18619 -299369 -38282 187992 -147058 -60498 103465 81592 -202524 -197988 149176 214509 -13908
18607 124657 -144451 281282 -31743 122442 -135232 -116500 10338 -233654 118970 85018
18597 85018 272576 -150847 -131399 111988 57348 391310 67304 185302 -329571 -248808
18587 -248808 -121745 80766 -154667 31205 -284580 -41455 -280528 91316 -8437 230675 -519043
18575 -2467 -245505 -210870 -109549 -394592 -19569 -17173 -180320 46069 -320875 -87313 42326
18563 238028 123145 60037 329016 -201964 -110779 -15019 -270966 67030 -75648 -37533 -195121
18552 -195121 -208091 409413 -48151 -156571 29057 225717 -163540 -27655 -309960 -8369 -146369
18541 -146369 -194328 325318 -230889 -123958 -77297 -100006 122603 -166036 -398797 45959
18530 -149497 196520 1874 -184357 -245691 548565 92314 -312785 -36104 212263 -342568
18519 -139096 -65944 -163726 29845 216014 16839 -102775 -60334 -93209 179984 30916 -41292
18507 -111651 -193641 141352 303872 -40327 -229348 53600 -163060 21624 103970 -66714 63013
18495 -139589 49119 240335 -223950 -101579 47765 -84068 -34484 -79168 -52710 63622 -69197
18483 -17254 12191 -189168 45788 54985 60014 221621 38950 3126 -93159 -129833 80149 -58914
18470 -210552 -22736 253464 -15005 -300501 -203479 -163347 30863 -53865 -61193 233079 169872
18459 169872 162333 119256 -267104 -175015 131476 -417069 252170 31959 -216796 -314780 10195
18447 -15365 321005 -69079 191200 -110107 -170395 144341 -13693 -242820 70292 385892
18437 385892 -188473 -73561 53009 -45695 -291472 -115794 294329 82132 52304 -326917
18426 204992 -23417 88988 -42582 -346096 -399898 -36255 -43992 -172305 75136 -254901 145644
18414 -271650 -33822 40591 102798 -158590 -8850 -32803 208389 36864 -33629 -443930 -130247
18402 220149 188912 -232465 -177355 307153 44855 -140747 217050 -55727 17743 -81589 40625
18390 -96443 -14374 131136 -4106 -67838 99645 417467 -141220 42684 76109 -187353 -186827
18379 -186827 97498 306612 156221 83683 -279567 23114 245634 -379304 -120940 38202
18368 59405 -87419 -279886 255918 -78453 -246943 -279489 -114173 366329 -42927 -179285
18358 -179285 -276252 209778 309516 523 53237 274757 67907 397307 72644 -141372 -39684
18346 244087 156652 32409 237 -148416 42107 213484 -194360 -238341 279602 -31646 -387029
18335 -387029 217283 89490 -59903 -13717 -3065 217830 -163491 -178314 -165744 122818 356082
18324 356082 169469 -90066 -147645 65194 144855 63842 -404946 162987 22765 149846 -271581
18312 -32016 -29558 2912 17807 -67427 -14205 187679 260870 68152 -180705 -85778 14903 -118995
18299 345803 -269705 204751 -78701 23943 -26824 -5850 -43523 -60704 -81820 -131187 -176278
18288 -176278 -165025 -298543 27588 120433 -85476 65810 -127562 -168798 172546 -397099 -57765
18276 -173949 66067 -38000 -50079 23874 96229 -171486 -233068 -118880 -29553 -145493 -145559
18265 -145559 56137 70175 -215018 146239 -257030 -31852 75719 87490 408205 46499 101864
18254 101864 70720 122039 -29997 -304518 -226667 -200257 30908 -1112 13076 -122296 86810
18242 -189199 81623 -31088 179447 -180083 -253560 -152962 -172235 -224703 119788 -23277 57588
18230 130163 245354 -75361 100956 -277707 -75949 117553 181115 -74717 -85452 -76784 620793
18218 -53326 -218824 -428944 -161896 270953 171168 173338 43096 167590 130504 -311853 84796
18206 250710 94268 -126906 -240047 -67991 -82614 -167019 17839 149545 129911 353544 204721
18195 204721 -419236 -2849 -143781 -91468 -117527 -38045 12753 -248944 30435 -11391 170615
18183 227151 -165157 -262480 -105138 -222528 -28459 -62107 -103226 -61964 113734 -45873 -84754
18172 -84754 96564 -101297 -99226 -223259 -53971 -101265 113482 272825 -274035 -128301 -183156
18161 -183156 -169236 -183714 -282024 135668 -350064 -199389 23456 -326121 128407 57289
18150 -234044 974 -935 -43422 -352230 13960 -42670 -184074 26200 -56874 -217036 219569
18138 143315 199999 5423 208742 -72289 126632 -129358 36886 -5916 -117592 -6740 266179
18126 -8550 -241120 78292 15258 -103534 -144173 447184 -218724 254193 -24242 -276273 17789
18114 -341530 55967 -36756 341661 320133 158491 -230978 269966 -68560 178298 29657
18103 214400 -16078 31553 107422 10192 67308 -96001 99778 233110 214108 102642 27545
18091 -187963 -82277 24277 206223 183560 78314 -89804 -52148 -151440 114678 -140271 -133840
18080 -133840 -15414 105665 -90081 -493485 6838 -148726 7169 -491035 258185 -72427 -216838
18069 -216838 -83737 230651 -268340 -84743 58175 23635 -151870 -3045 -323997 215644 -37905
18057 105913 -161332 15665 5002 23169 -158730 -4309 132678 338605 316663 -153213 -114906
18046 -114906 24916 -121688 -22903 -174430 82615 -36012 54849 167848 38791 -9831 84349
18034 -21272 141606 276 -186948 73838 -42912 -125486 15306 177108 -144541 133480 5203
18022 147615 131657 -232036 -58634 -134979 38641 -97063 -27856 12328 47133 238028 188715
18011 188715 -41828 133192 70303 -305540 40051 -11060 48705 -217587 -33647 -114420 -167188
18000 -167188 390220 7290 203702 381873 -126230 -282845 -274741 70163 -245522 -153882 66263
17988 54460 -124103 404739 290355 86300 -131837 41619 158956 88921 97751 342556 -232264
17976 448519 329603 27816 -166916 -353470 83012 -35724 36738 -238092 -265592 -231756 -148330
17965 -148330 -12350 112943 -215590 131110 112088 149782 97319 67654 -187003 -88937 -149060
17954 -149060 143399 -93560 -13038 64367 59938 -11403 -67290 -19576 156996 -305699 -122861
17942 159138 214170 79212 -244296 -144810 -164291 33202 192269 -108954 290012 77130 272642
17931 272642 -210190 -63215 -71031 -20362 117583 41622 62177 9384 -2173 154013 -235262
17919 -54974 -303586 -143881 66387 79945 -21664 -227184 -88537 -95510 -17956 -89114 226250
17907 91222 -280214 100768 244108 29320 41350 110167 -17576 -15768 50423 189632 9759
17895 -92345 -133400 4100 -215227 -120905 35907 160838 -81225 136381 -20695 -406753 -208291
17884 -208291 -231728 -85102 251534 167680 49993 -23230 27818 -180769 -74256 -100675 139055
17872 -98043 -35722 -71433 352841 -42025 127436 -66672 -162705 122528 119648 -286585 -50535
17860 163816 15837 168043 -68903 82926 250427 112881 55511 -181992 -53240 314159
17849 212132 17132 -157749 -175798 -65941 -309661 -54341 -112513 -159822 194717 81633 -262484
17837 10903 -124030 -239397 225053 136715 322858 8814 100740 54652 329103 186753 158500
17826 158500 -48676 198311 -148879 14915 228554 -25727 -286395 28748 210708 165208
17816 165208 -342513 107754 83426 23179 -71785 -175139 -148078 -179706 -193614 187853 151302
17805 151302 224160 141090 -115046 8450 176744 84950 121411 24326 -193873 186579 155172
17794 155172 -122944 308616 237780 13079 -105938 127422 -99197 186200 -368780 -132329
17783 -259615 -34881 153672 -9602 67418 158274 362598 137553 -38746 152492 184502 -178416
17771 -180716 -3040 20897 15809 -20005 75433 -55985 -169273 287573 -83333 191004 182904
17760 182904 21255 161202 -109421 230512 359616 -2645 364295 47643 367452 276765
17750 276765 4572 17239 545620 331323 136636 -386586 -78847 61833 -49154 177747 6140
17738 106181 603334 -3525 327966 239005 340360 176717 -41680 -94521 30575 300286 236784
17727 236784 187906 337079 89380 241005 -339765 -11462 174929 -61117 -27601 170233
17716 -315496 29355 -33738 309697 4904 -95663 -525 86141 182052 -327439 26060 86069 -55338
17703 -25437 -133165 109060 -24587 129189 64311 102989 363035 36367 157344 139128 272554
17692 272554 -123008 108007 344195 411378 2420 50943 -175155 -16834 52665 -98360 15921
17680 71537 191248 -155410 -308129 -221773 103277 -12960 -83300 265308 -130985 251282
17669 91331 368320 107139 88794 -97994 -163886 53210 173423 99543 256634 82301 -45709
17657 283875 -53606 220218 106168 35393 -81487 46360 60312 96977 -46448 265574 223786
17646 223786 22612 -27643 -232644 53692 -222537 114253 307729 -216818 232208 242235
17636 242235 50120 118425 389343 217112 81784 -246668 92828 236384 -28823 94278 110749
17625 110749 238036 -90871 193736 227465 -140995 -61208 119234 176079 199664 -57646 47306
17613 272316 167067 331378 -128934 -199115 -9950 134269 -79115 -63003 292139 505968
17603 505968 31696 65851 -141161 36589 236973 -39975 91761 157976 260131 -4130 127572
17591 232114 145418 -66886 371648 179045 -125808 471005 13503 157740 -33597 285614
17580 -42796 63065 366159 125999 -120203 -4693 77290 447651 114873 69420 57350 -14867
17568 249277 211808 102608 235916 -75001 -55778 -16887 28816 -120277 75951 -33482 144293
17556 -365338 -213099 80459 278654 265248 234708 223749 -55503 -10422 320332 -107496 -68574
17545 -68574 -34257 -21363 253838 -63111 45945 -63279 -34336 253775 300685 40917 171994
17534 171994 384763 104940 290848 390455 113248 -583 262145 76368 -196573 185979
17523 108879 409058 388272 -117877 117912 365413 223557 318148 6951 192887 412214
17513 412214 644585 560388 715561 712105 990667 1049594 854417 493295 441220 357635 566075
17502 566075 584040 408578 252837 502682 389178 561419 622720 663976 1059517 956983
17492 956983 731607 541334 714973 218158 453074 510739 103655 384257 -76068 439412
17481 339746 204098 268135 272522 465279 -107208 379038 154673 271338 152575 436983
17471 436983 402403 -141688 96142 253681 339197 499202 238450 54402 325960 183656
17461 183656 45210 353001 396095 -113990 123727 162299 612435 582406 203279 347657
17451 347657 138337 45923 412047 160452 106198 344466 268622 243587 379627 261933
17441 261933 446797 102336 -26450 -32188 248583 468176 409133 452501 93003 333848 248306
17430 248306 59411 293310 322135 425501 287309 616514 89856 402711 114972 339778
17420 339778 173002 297100 164564 1305 228438 259052 100362 285568 115095 256380
17410 256380 490174 615690 154219 253319 576213 398373 386462 239161 528522 315117
17400 315117 437075 445620 -118760 329992 331800 99598 336816 191466 -36187 58274 437568
17389 437568 135898 330406 442315 -105865 396615 322748 535166 386036 317320 176633
17379 176633 84215 320333 184328 41057 361944 234430 220481 377634 3902 -1715 229045
17367 287622 231033 -129801 227857 330478 137014 230850 198465 216244 96772 207539
17357 207539 129420 128113 424774 211004 -272819 113534 222578 126112 163871 420263
17347 420263 151955 224123 267832 -50911 425832 208998 391107 284292 -64608 224291
17336 192261 59459 70797 -24026 443123 288204 247072 32598 103152 364023 327503 213455
17325 213455 398679 377505 575975 214881 60488 284220 56773 184650 455427 454717 175671
17313 326152 360034 248700 208722 268627 -282984 377167 275026 130801 329840 318436
17303 318436 178430 -16036 267557 161303 384623 214748 395883 100601 528603 200399
17292 -104772 147142 298488 384361 284448 305865 71930 212244 404401 444410 193102
17281 306591 118018 460059 397423 243205 78101 156228 84438 308364 -87288 447648
17270 3549 460336 132583 442880 442026 466744 456341 194549 400595 353523 67208 294743
17259 294743 364714 198226 171926 192310 350382 409143 641117 317094 417039 94035 408856
17248 408856 305086 419530 466065 154338 379794 344176 357073 531275 215173 506379
17238 506379 215869 119607 208835 269835 393991 231591 336260 362368 465098 167013
17227 390518 513818 105839 275921 456775 246252 47726 321253 221423 134169 247411
17217 247411 513072 171251 -27137 349296 574518 522970 257021 451520 187319 505110
17207 505110 436481 138002 367977 336277 543942 328353 312037 449345 498914 527936
17197 527936 519275 405686 242968 588024 81385 92233 758448 315187 484660 426216
17187 426216 571336 169695 610505 619361 433804 424313 83623 -52739 328181 57115 326871
17176 326871 333941 284918 404461 118027 365233 349602 166831 286239 269089 177289 391081
17165 391081 94455 215635 490579 775400 357178 524581 353545 316547 530468 531664
17155 531664 194240 346931 825708 300265 361706 403614 566796 327237 566232 634051
17145 634051 271629 523242 377862 502481 409888 485294 718977 558785 531203 625412
17135 625412 442629 470899 775197 307261 339006 630948 812665 455250 448137 463230
17125 463230 486966 344179 559646 348497 456677 420728 402382 480459 346220 446777
17115 446777 639530 253454 476217 747669 354973 309857 894042 394936 452921 594864
17105 594864 912182 336632 451354 565580 849295 798418 413197 607527 812079 613138
17095 613138 743328 389218 500253 569366 502678 395063 595597 664817 549473 573796
17085 573796 416702 329403 633779 773302 291316 903128 520270 590705 789233 835305
17075 835305 493146 627124 569142 541293 642815 985085 792735 703468 718126 389811
17065 389811 810566 921276 708946 725885 771129 714595 732013 926469 375065 508167
17055 508167 846581 324076 685767 949138 552796 957469 729099 794723 638154 811004
17045 811004 900965 955171 813705 743386 847545 774444 902680 966002 871612 739391 726888
17034 726888 818369 658958 1046686 664385 677563 769218 848490 1021605 825281 768145
17024 768145 955860 815380 1023462 826635 658948 757963 633934 705128 1096328 748439
17014 748439 929050 1097890 1098289 854619 883460 935394 1068560 1230736 508529 1032071
17004 1032071 894706 933182 1355397 1218379 817938 1066495 1068694 1017845 859717 898655
16994 898655 1209142 1195953 878320 1044100 1032610 1088315 1111220 1143488 840338 994562
16984 994562 1383898 1186769 1057054 1075349 790584 1354946 901746 1344885 1327351 1759070
16974 1759070 1078249 892531 1430428 1360162 1132287 1077055 1058223 1341292 998686 1542901
16964 1542901 1101313 1236204 1466662 1202957 1471940 1353094 1270784 1349631 1332055 1421940
16954 1421940 1263485 1495528 1389397 1308019 1648117 1389619 1435877 1664736 1628362 1589251
16944 1589251 1560281 1724829 1587591 1487014 1558180 1190090 1574448 1468228 1482434 1789058
16934 1789058 1478008 1827885 1860834 1706797 1658037 1538504 1701267 1546783 1627669 1800105
16924 1800105 1807006 1813226 2057140 1816170 1939357 1931805 1584893 2225261 1838415 1859035 1861134
16913 1861134 2186464 2305116 2136363 1830543 2490671 1881369 1973736 2131277 2181191 2135123
16903 2135123 2038984 2246764 2314442 2400220 2140492 2445319 2305643 2639532 2604577 2308853
16893 2308853 2427727 2446271 2872643 2475782 2590012 2489832 2861583 2916171 2929715 2632848
16883 2632848 2709853 2869924 2815576 2743895 2656222 2592116 2581496 2893403 2830986 2923456 3172369
16872 3172369 3047227 2750985 3316914 3133042 2891707 3096323 3157709 3347707 3067826 3227762
16862 3227762 3257588 3234375 3657305 3532344 3689478 3696124 3583241 3811322 3916894 3648924
16852 3648924 3988630 3983146 4312622 4131666 3904728 4324283 4130511 3806211 4446349 4487995
16842 4487995 4354397 4537592 4603368 4581990 4526102 4772045 4836423 4973921 5337864 5085465
16832 5085465 5116242 5148061 5211668 5449465 5189677 5596586 5672775 5490738 5754947 5921111
16822 5921111 6081375 6054248 6091724 6371015 6504848 6679107 6767606 6969766 6618559 7006504
16812 7006504 7644483 7396511 7340562 7588731 7717530 8026413 8109680 8488870 8356842 8287496
16802 8287496 8566019 8984347 8957723 9306688 9496918 9582663 9801413 9750393 10366108 10073118
16792 10073118 10643506 11050469 11178428 11379181 11532581 12010346 12352701 12382193 12866882
16783 12866882 12997319 13715466 13840381 14012928 14533102 14709485 15194755 15529629 15680908
16774 15680908 16294430 16462813 17637568 17535412 18281306 18454742 19234509 19662736 20425803
16765 20425803 20886126 21459262 22167164 22845400 23552587 24433448 24884927 25537708 26518266
16756 26518266 27604132 28425996 29234030 30491542 31539040 32313886 33434794 35016919
16748 35016919 36265064 37588517 38817330 40549537 41865611 43507480 45118576 47447704
16740 47447704 48670540 50896264 52594492 54939198 57191195 59723468 62201758 64568443
16732 64568443 67545558 70282847 73078484 76129479 79053464 82298992 85333954 89052862
16724 89052862 92707708 96525564 99977498 103532891 107235613 110709693 114345200 118058212
16716 118058212 121288223 124356887 127588122 130165910 133039259 135053263 137102700 138714200
16708 138714200 139706152 140533000 140726067 140702541 139885841 138965835 137575561 135705846 133667323
16699 133667323 131386836 128558866 125700382 122025780 118789635 115237481 111703061 107969602
16691 107969602 103988193 100132591 96478009 92821749 88943512 85806817 82155221 78547635
16683 78547635 75420045 72356489 69546095 66435791 63584074 61218882 58774017 56160248
16675 56160248 53792426 51743612 49406569 47414374 45646262 43977988 41890022 40366709
16667 40366709 39144096 37561870 36439197 34925541 33835037 32474905 31044388 30030891
16659 30030891 28883553 28016913 27412612 26430251 25282241 24222406 23687570 23046563 22163019
16650 22163019 21604628 20824530 20413872 19622467 19001934 18350806 18040529 17796377 16951802
16641 16951802 16606638 16201466 15597301 15238597 14926274 14154373 13739171 13714968 13180124
16632 13180124 13131005 12482682 12311165 11866622 11936173 11589815 11154675 10914612 10478590 10508432
16622 10508432 10260257 10064251 9828796 9316048 9253250 8859206 8738828 8627778 8575057 8002091
16612 8002091 7661934 7659715 8147608 7668922 7548578 7287082 7250093 7221351 7152202 6788206
16602 6788206 6355952 6590630 6647159 6150294 6463487 6195983 6445198 5967117 5794118 5756603
16592 5756603 6051088 5570164 5628400 5406104 5500558 5048206 5267465 4766183 4923808 5076866
16582 5076866 4986898 4734937 4613568 4636692 4247623 4556575 4002352 4475887 4137384 4151881
16572 4151881 4137586 4036984 3775053 4067139 3911365 3703759 3586228 3750704 3638997 3502875
16562 3502875 3466795 3644147 3706146 3652609 3438560 3444557 3250699 3088252 3051353 3008358 3026707
16551 3026707 2916793 3155027 3112205 2763802 2830600 2779412 2954941 2788214 3247622 2640188
16541 2640188 2441646 2623952 2896467 2235381 2383384 2767000 2212373 2921123 2541951
16532 2541951 2449256 2250945 2493590 2216367 2371638 2289470 2362713 2385346 2487632 2220667
16522 2220667 2229706 1858019 2065490 1860737 1981082 1888889 2205547 2226653 1730032 1894539
16512 1894539 1746648 1585884 1801261 1954919 2022499 2093437 1698693 1649137 1859638 1935185
16502 1935185 2011796 1692205 1850672 1669709 1538107 1590329 1570987 1642216 1534588 1973622
16492 1973622 1766864 1663165 1243025 1862928 1869408 1371234 1521404 1447501 1587756 1517827
16482 1517827 1595363 1748523 1373719 1477193 1212414 1600930 1162240 1709173 1650014 1666946
16472 1666946 1329402 1564701 1322619 1360721 1278104 1236661 1468182 1457622 1046293 1368463
16462 1368463 1425933 874176 1290687 1338160 1187926 907558 1141145 900509 1215546 1129677
16452 1129677 815594 1001699 973694 1127532 1187298 995287 1173935 1048939 1454772 1021883
16442 1021883 888693 734971 682300 1265865 1071549 931036 1115019 911475 902145 939323
16432 939323 761201 792731 1175469 783198 820273 707940 815374 784903 1144842 1392447
16422 1392447 1120321 1047489 1257704 823257 1129919 648135 722371 838965 815973 687387
16412 687387 940681 963796 970888 481760 878085 1056208 938123 666548 598589 720615
16402 720615 634104 904578 766645 834333 571632 614967 777176 1020685 557540 891017
16392 891017 569561 510134 568620 564069 433371 763924 849721 602996 805421 772947 799108
16381 799108 876573 562978 1044520 599112 533589 720969 842360 668404 818225 737865
16371 737865 541860 519447 743432 384331 594439 639283 870236 737800 762456 525106
16361 525106 846947 397193 684316 851886 650074 789469 470420 439881 590883 426567
16351 426567 619764 266735 160355 722835 501417 433434 706862 767025 453685 506094
16341 506094 694832 577890 346966 604439 514903 266871 753903 451480 169550 575141
16331 575141 680134 655546 -10801 827224 686386 567107 709344 619857 766360 371261
16320 554862 530994 407187 488887 410150 64672 143866 364969 539520 330136 333243 470940
16309 470940 545646 571966 428941 469367 433258 355545 495106 431089 601152 329886 636384
16298 636384 293568 248946 68541 127058 230663 322996 531784 291984 208240 478972
16288 478972 347757 391734 395163 480578 282756 277966 251832 106899 594814 81803 496885
16277 496885 305422 736204 112590 280788 57998 367515 206363 401500 328989 367896
16267 367896 221657 216622 323866 -108979 523587 258340 430224 484211 337034 482660
16257 482660 535264 273096 128300 437975 430514 8345 -117225 23423 148126 377065 306813
16246 306813 254760 47890 158968 357321 395541 421630 509450 567507 455540 3848 409555
16235 409555 64666 106562 190389 280704 481273 123753 123067 340741 506546 198107 516018
16224 516018 185768 -131727 226057 582312 339421 201594 211554 559371 196418 327693
16214 327693 275467 450048 453446 112367 302014 474150 687364 507693 49435 174611
16204 174611 386710 353370 582272 296590 279596 27031 362744 142842 -96407 177221
16193 391273 376826 92924 384325 415754 263576 310020 361565 291892 413512 -120843 236791
16181 338068 -51764 -26599 192836 50892 -35870 476015 136763 115947 -231889 203248
16170 302798 257282 624954 431746 170967 2770 183716 116222 126888 90690 337468 38381
16158 -32169 128618 218199 327856 92005 -222132 313160 92647 97044 155477 267260 -16885
16146 49585 165994 34214 344220 279995 471929 376209 133022 298964 146798 311711
16136 311711 253798 -652 -12096 47989 -52910 152959 276340 -65823 58976 -17069 -138396
16125 -138396 -87156 46721 66617 167483 161626 -137394 173645 184625 194498 150939 -25862
16113 314340 -201919 456398 203427 347221 75442 195265 352616 39537 322764 -119467
16102 -143759 52134 -108854 -47528 163229 314694 -87912 413923 93840 -9307 127448 71642
16091 71642 43469 -383409 42393 229577 260522 -213170 269139 -132486 -78796 146501
16080 164773 46273 93642 368764 181807 38409 -67420 114544 89603 -109138 141955
16069 -217949 293435 -191732 115834 60015 -197466 202739 15099 264698 79180 126235
16059 126235 208518 79315 -111397 20640 -39838 -96763 83243 17737 81617 272331 255225
16048 255225 78120 -13552 5050 -175976 81473 -65250 44113 142360 -202285 -348857 132764
16036 217673 43043 -194458 -169833 -103614 -232447 145016 121352 -69403 358181 46667 169381
16025 169381 156459 -46848 238649 324502 102701 23284 286151 -75299 213092 -96567 36918
16013 -97147 46144 297872 -43799 -240657 -91036 -36550 -65076 -11064 76395 -52913 10261
16001 -12303 170443 -158749 -64889 213271 -43547 347279 97844 265317 467261 2813 114564
15990 114564 47447 4230 -197672 455243 463898 -37595 -5173 305404 -165627 18906 182558
15979 182558 230981 -65371 20447 -6510 284649 394299 335703 256929 560807 654201 1169176
15968 1169176 700167 670900 619326 549567 448440 277065 165286 -157060 -88288 -201297
15958 -201297 -90828 350948 17826 -358773 -123082 1682 -21292 39707 -122373 151884 175147
15947 175147 275125 306809 -128038 -202638 95352 -132887 -102714 -146479 -15803 72703 -84904
15935 -92771 116308 70511 -42339 -3795 -227751 -112037 -35671 -98438 -108473 28728 -432657
15923 14144 -224641 -165208 -324433 -103941 -49376 169749 -194432 -20011 140929 -138143
15912 -133795 7113 333432 235433 41601 242484 -42860 177479 -234751 -108334 21497 39023
15901 39023 34375 -20972 -119537 -334133 36470 127539 153114 -6051 121158 168516 -120218
15889 171850 19593 292193 -40593 186823 -313078 113863 -227803 181477 109909 55731
15879 55731 -69307 34986 11321 -354734 -393222 226097 -456918 265248 -292148 54460 -349135
15867 -62609 313945 81434 60279 -320029 -165607 -48913 -289799 -176550 49441 -85893 -117057
15856 -117057 65317 -158695 -75767 -104399 -108724 -168390 384743 -248301 18282 -18863 209118
15844 160465 182597 135346 28822 5707 -42917 -265816 -33550 -123133 -88917 91980 145633
15833 145633 -230588 -73011 -285674 122689 -64623 326361 -30207 9818 -167493 -280656
15823 -280656 -105134 -29637 -174076 182426 -74547 137754 198897 168867 -83555 78859 -109732
15811 50831 107976 -152276 -106540 154507 -12433 -255604 -268084 1777 -73193 -161486 -103516
15800 -103516 108472 -8373 -1688 10754 55070 275824 -320715 -232307 67676 -35015 54643
15788 336090 -154437 4392 -127978 288709 167506 -76024 163229 -141949 -219020 -75255
15777 249451 246731 -95560 138805 -35119 -25185 -60512 -138887 -15899 -308862 -60814 -66469 54398
15764 8192 33400 9691 -150487 -23745 -95226 273273 -401032 69051 81153 -31655 -232106
15753 -232106 -38825 -243642 -39196 -187194 94053 -156968 324035 264723 -135802 272454
15742 -183082 7309 233395 55185 170995 83357 14307 -255018 -18902 -213708 -100460 398549
15730 -62874 466140 -158516 -98611 217254 -107295 60618 136105 -246139 115191 72713
15720 72713 19866 20497 -170932 -91307 -61201 -579505 399065 -70610 220722 -209182 168563
15708 -83125 -247187 -496131 -320410 -2311 -219479 103409 -53281 -172930 -131693 -102174 -322003
15697 -322003 -145388 260710 -369415 144774 70017 62763 -55244 50666 -7369 -384358 194929
15685 -256168 -98963 -201588 529468 -97960 -42741 193926 264165 34125 126430 270757 -15711
15673 27102 -90132 -17084 136841 -194604 -23926 216377 6841 51371 -36368 107118 -494136
15661 80390 -60699 137242 -33666 -195417 -60304 37533 243844 26732 -134412 355454 -86410
15649 47375 4181 -145363 -227286 -210185 -11358 -203033 70702 57295 -197995 -25900 -20567
15638 -20567 -13574 102773 -404677 -247330 13680 -78386 -93501 -2381 274674 54821 114211
15627 114211 -59275 105584 -154888 57957 -149264 -73696 -119904 159766 -240626 35270
15616 -364475 54838 64504 -111148 97596 -91408 248318 328089 -49857 117268 84019 -74874
15604 92259 -70089 -66729 -18742 228604 -25619 166900 32471 -160741 -405095 90551 -287103
15592 -58511 -9193 -355276 92072 41134 168746 -56222 7131 -131883 202477 -52327 -54841
15581 -54841 -53338 -264569 74148 -142236 4861 -275764 -188033 -93281 -124645 211758 -99194
15569 128562 87396 246027 4541 113564 2452 -230343 -118681 -6563 14269 70201 -108230
15557 62699 -81697 194125 -119995 -281247 50595 -99382 112847 -5847 -89057 310760 209621
15546 209621 426045 -3275 -49435 -119406 -114712 -67226 144346 -232382 130897 221972 139894
15535 139894 -9681 245404 -14206 327637 -61555 -185308 165419 26547 -5311 -85248 -5931
15523 224297 29693 170364 142501 121988 -37043 -160383 -4917 -16658 51240 265583 -114416
15511 75937 -22632 72882 144988 -150094 128788 160704 43704 1958 -221375 453585 385624
15500 385624 251437 236073 7616 19402 18511 -126060 -209884 -4187 -136370 249816 20443
15488 119727 38303 -83923 248191 -159675 143395 227013 148589 -44581 127783 -798 130017
15476 344054 -143230 65809 546307 -217199 282161 334863 -157314 43567 69381 269255
15466 269255 -157384 -111163 82405 39800 198614 134316 233453 -20569 26162 677357 531768
15455 531768 444658 371565 489790 91159 -11161 151102 71593 -14152 -20600 -30776 -185408
15444 -185408 8777 -96828 105437 411772 11443 -16077 115122 -101479 80199 -244718 117774
15432 19597 -161220 -117287 223877 273677 65073 319854 404133 725866 1103573 713205
15422 713205 757627 237263 312201 162321 160586 116960 31090 -66272 -75072 275443 167827
15411 167827 320043 104826 245445 -21234 66628 289843 82491 331865 195137 78829
15400 -148188 -178660 300547 154079 -119692 73333 -217090 56432 95227 -182737 138404
15389 -130555 64749 -90100 133108 171397 210659 60203 47838 -66545 -4823 109999 199654
15378 199654 -152967 222890 -63125 -96003 -21298 202948 -134755 -246653 322107 50654
15367 163171 187321 292850 -119505 -59606 -167216 131488 -201362 132128 -210117 152465
15356 215838 141184 113384 147537 86131 161070 -121559 198752 101320 96219 240180 176210
15345 176210 -15008 385325 -143995 110583 15847 24611 367577 -73344 62713 692798 63845
15333 182283 -40382 -228128 69208 659992 212752 411377 354203 593054 367324 377094
15323 377094 256949 289896 15361 28426 2292 210269 81624 292826 -159487 -45783 -53413
15312 -53413 -234104 108780 -171878 -124809 191102 523720 175586 123327 157106 -48197
15301 176349 172186 344747 136888 -14884 41075 141912 196286 -141736 136073 104110 439220
15290 439220 176817 324066 -81845 -16741 75499 14487 -40909 237270 232100 89279 -145933
15278 51345 -58512 157784 388682 338927 -176649 199056 78700 289676 110036 274231
15268 274231 234829 -107161 2998 -8346 192669 236001 -175987 -310831 28213 -133549 -120561
15257 -120561 32547 -121014 177973 402640 166838 -61675 -71327 296639 59698 -70945 145376
15245 286955 329211 -169917 127418 347166 -32936 207556 -73070 21501 -28588 70529 91035
15234 91035 414941 447450 186093 14289 459737 931740 830039 1528517 1504803 1259341
15224 1259341 1083221 522089 755380 329218 193615 -707 -282822 -104166 381353 58762
15213 -60182 583363 299503 40321 55688 160906 87600 75342 306358 87350 -66816 12323
15201 120787 89822 87580 -187858 18662 -146949 -71316 -201787 35791 -323427 -33944 -82238
15190 -82238 13651 303255 125055 71188 111713 1781 -5206 1271 17639 6894 118922 71628
15178 71628 -53446 -113929 276437 407582 121397 304106 27020 85957 -41498 160663 -46513
15166 207008 -4133 153066 230849 90683 158140 -41161 -37605 96954 27118 90162 -98030 -102554
15154 -102554 233828 229031 -352602 -89598 145309 57856 165437 270165 -130229 369975
15143 146723 220255 260464 94136 267717 69775 282501 13998 513626 184782 217510 -275127
15131 -35222 53690 -304205 339685 -114597 -61751 306864 -122985 368823 1599 -112377
15120 495852 -112499 -28466 194581 44624 155579 229582 456470 84130 318765 229659
15110 229659 93066 268888 173457 161434 161704 275532 517013 -137342 181296 -24352 5731
15098 -30360 -67314 381559 -295162 155542 -4639 16262 212702 39077 -23332 177619 270097
15087 270097 -3018 -255217 224960 -77297 46000 287150 38566 115893 394659 50850 17868
15075 205913 7067 28641 -85785 76939 363872 265716 174455 -202849 135189 16625 -182678
15063 38570 227076 89455 339021 -83680 214751 189251 276621 299886 170672 -225723 299068
15051 219027 -57899 147844 91561 223956 260474 328795 227140 168532 202708 71677 607373
15040 607373 359250 -88065 243039 -12625 -94279 302540 233660 486101 292924 422698
15030 422698 285290 115536 152336 299100 301421 102905 452216 375193 271145 9897 432805
15019 432805 476229 493060 313254 508453 704249 414735 712729 808542 557121 627899
15009 627899 379313 562114 323408 480519 578349 454448 570964 271779 740214 436498
14999 436498 374777 190975 -52999 544786 133856 343492 218295 561095 251364 328219
14989 328219 474057 235947 489376 79450 410664 470515 260756 255558 396517 600951
14979 600951 584733 152465 482029 563029 471613 140293 410556 128335 255797 377790
14969 377790 373756 256645 442776 509621 445261 617775 534807 536386 612513 376377 428041
14958 428041 589900 691726 383595 683329 601512 269262 534949 429694 350212 123913
14947 249754 238597 27277 435460 324231 497015 151872 268536 535965 358256 447888
14937 447888 280342 -79314 339875 336845 723856 327339 445016 680410 490482 476816
14927 476816 432672 574102 822314 328344 338205 332013 694546 469084 609558 509235
14917 509235 640693 606612 677120 806763 1222945 1064060 1226971 1381111 1956676 1574197
14907 1574197 1362128 1403822 1392065 1414828 1055356 1772211 1557925 1796872 1855070 1145090
14897 1145090 1336750 1080740 801281 926598 880576 580955 481879 659493 744922 775044
14887 775044 291185 468526 13195 384180 358038 510246 105231 287635 196451 387528
14877 387528 120981 413828 326460 472810 464359 558540 481093 746682 648618 873947 909308
14866 909308 575386 705392 592832 515614 671709 659026 298349 207660 715194 699310
14856 699310 597532 606062 436042 785067 561250 338837 867561 710244 689601 1051207
14846 1051207 620980 250699 397866 689687 700676 311472 568723 315564 594643 264279
14835 430456 682498 200930 743980 524378 493394 608694 551746 562060 550823 872955
14825 872955 1152326 942109 970160 1196315 1165282 793692 881236 791507 487808 381437
14815 381437 733017 774405 302844 444791 726868 645915 617381 720017 914541 802740
14805 802740 886505 660577 622076 701834 705498 883683 433919 597419 890281 714014
14795 714014 530973 524455 592663 782080 659329 1055053 694128 751735 1052689 782908
14785 782908 949610 978082 666042 711674 762025 621565 549693 413063 932967 363527
14774 811431 890837 702600 759923 596222 915378 499423 630354 600303 709514 947516
14764 947516 881484 1002784 891034 673321 819750 1222107 841451 713687 927780 919550
14754 919550 926891 467017 712953 1056913 839106 556650 356643 539857 790897 658998
14744 658998 941355 757087 265788 339950 468046 504619 660823 913261 1095214 354175
14733 847921 650059 239334 779298 703781 366162 801715 625163 1026873 809906 823585
14723 823585 841269 814666 681369 464263 809915 882870 1033787 957105 1021365 956015 1019165
14712 1019165 1280995 1456227 1600058 1702046 1529144 1573371 1114488 903092 753291 637203
14702 637203 883582 1099765 774841 977570 759916 665738 808831 918372 535929 860929
14692 860929 976438 826662 666277 717402 1376428 1404470 1299629 1217042 1489088 1549871
14682 1549871 1911437 987600 1151265 927325 1163273 935869 1130313 1089073 921017 1065023
14672 1065023 1014424 797015 887333 844871 716448 998650 1051582 1145951 914157 978414
14662 978414 1077690 966321 1272284 1228877 553039 791428 1264679 1390237 1221662 1442014
14652 1442014 1141490 1272201 1381222 1261896 1048548 941943 1133869 971138 1108413
14643 1108413 1001117 926855 1240560 1336746 1345825 1226564 977511 1491015 1392339 1399648 1325471
14632 1325471 1285633 1342148 1174081 1133011 1199889 1106131 915681 1245697 1206740 1528541
14622 1528541 1467113 1047558 1401604 1123201 1196609 1259344 753384 1546342 1653483 1156915
14612 1156915 1160423 1322715 1587497 1549270 1542292 1834955 1425295 1241125 1151246 1405961
14602 1405961 1637523 1556797 1547700 1685082 1414290 1479647 1628008 1467277 1267258 1557002
14592 1557002 1452148 1876044 1512926 1468558 1405886 1666643 1396377 1769561 1457385 1871793
14582 1871793 2063263 1920547 1907440 1663856 1376523 1570794 1659574 1654435 1776468 1946093
14572 1946093 2012219 1894624 2168049 1970066 2010358 1921283 1785701 2093843 2008912 1806201
14562 1806201 2181402 2179877 2019537 2254890 2334184 2228601 2059765 2537908 2000389 2243426
14552 2243426 2416393 2668610 2427585 2784275 2284766 2482866 2497699 2592017 2824899 3035052
14542 3035052 3167442 3196212 3677792 3989367 4531482 5143772 6024552 7676609 9906626
14533 9906626 13678589 21089310 32288985 33532682 18593496 10810118 6677056 5640572
14525 5640572 4768439 4907984 4632843 4153552 2855676 2979029 2559584 2405711 2602135
14516 2602135 2422540 2428941 2381902 2374626 2460433 2229735 2607353 2153211 2625137 2524942
14506 2524942 2708671 2501978 2518406 2490201 2475913 2535132 2656970 2525668 2995539 3216346
14496 3216346 2828066 2870099 2772988 3078539 2871233 2926684 2714895 3083294 3075950 3559854
14486 3559854 3064352 3310961 3200072 3322077 3524438 3390365 3367639 3558373 3427692 3465517
14476 3465517 3346862 3577234 3538586 3336202 3769954 3470406 3697590 3872506 3946588 3794611
14466 3794611 3700476 3732530 4277565 4418589 3827977 4092860 4374054 4055065 4329911 4596116
14456 4596116 4479562 4107479 4426838 4414421 4555773 4898320 4819741 4721438 4919187 4892784
14446 4892784 4984288 5135222 5098891 5085206 5300449 5412542 5391148 5327945 4985148 5255530
14436 5255530 5426208 5782035 5675054 5553820 5730853 5461393 5632910 6037317 6140763
14427 6140763 6266643 6006308 6322343 6267072 6305361 6851023 6505518 6547277 7043931 6837972
14417 6837972 7288649 7096056 6937303 7503838 7590020 7426846 7531473 7681687 7563861 7595067
14407 7595067 8101926 8280217 7982333 8515345 8655323 8453493 8810931 9269068 9170405 9207267
14397 9207267 9084072 9188820 9142114 9674355 9917397 9928343 9933188 10619819 10488057 10436809
14387 10436809 10602380 11206922 11111904 10974283 11070980 11349028 11686979 11987649 12241162 12084062
14377 12084062 12558360 12395300 12870572 12636563 13198224 13412806 13474263 13813167 14343362
14368 14343362 14277214 14921649 14927353 15060837 15643745 16162167 15987657 16508856 16892852 17051713
14358 17051713 17238356 17859984 18081536 18537798 18611106 19255548 19390490 20082578 20654267
14349 20654267 21058422 21652424 21527830 22123616 22827246 23022642 23701832 24343430 24956353
14340 24956353 25319010 26055314 26515447 27188859 27649269 28846119 29311461 29736302 30677935
14331 30677935 31623687 32159209 33182392 33707907 35011335 35944070 36854979 37830510 38761692
14322 38761692 39833331 40898049 42122829 43718768 44924914 46113389 47653351 49018183
14314 49018183 50614383 51891732 53834110 55641030 57865063 59381078 61460488 63866788
14306 63866788 65933142 68320726 71015424 73213317 76000210 78588715 81932219 84970708
14298 84970708 88157700 92061263 95384709 99742583 103672240 108015208 112973062 117934115
14290 117934115 123200773 128653324 134270726 140537044 147308388 154240839 161778766 169892986
14282 169892986 177727433 186811477 196202044 205826873 216181336 227205907 238947776
14275 238947776 251092919 263709258 277495868 291773111 306312283 321684262 337471329
14268 337471329 353145061 368391810 382238361 395599205 408426306 420823181 432002742
14261 432002742 442465874 452474944 460935656 466770234 470375305 472669191 475486727 476523084
14253 476523084 470507131 465555641 456587342 446848848 436317144 426318493 414217817 401394834
14245 401394834 388114366 373944920 359005486 344470506 330410639 315962078 303025935
14238 303025935 288718643 275621201 262491605 250061231 239007448 228025842 217290881
14231 217290881 207351183 197014622 186987842 177390375 168004396 160224025 152060991 145128913
14223 145128913 138603857 132242737 126229990 120582769 115344966 110386640 105985629 101812168
14215 101812168 97557218 93570746 90053198 86447099 83060427 79730526 76944622 74385253
14207 74385253 71368475 69182215 66610051 64361077 62268045 59984999 58251892 56404151
14199 56404151 54485939 52861280 51319661 49253843 48009768 46859827 45464448 44551439
14191 44551439 43271059 42060479 40608289 39394390 38318000 37477252 36722440 35235458
14183 35235458 34056822 33618250 32886781 31933603 31135290 30531766 29662333 28552661 27892736
14174 27892736 27278792 26812793 25880422 25141266 25154243 24365949 23983904 23413239 22951839
14165 22951839 22200688 22007410 21533324 21174005 20772764 20173450 19763689 19455932 18904140
14156 18904140 18700542 18462428 17680617 17384774 16863707 16991486 16429596 16199801 15938529
14147 15938529 15686100 15484964 15162753 14890652 14392331 14484652 13889728 13683739 13787124
14138 13787124 13298838 13105585 12942224 12932023 12584179 12164243 12222261 11899928 11782277 11948162
14128 11948162 11384710 11339187 11315188 10792372 10707679 10424142 10163454 10188725 10177486 9719560
14118 9719560 9462383 9707679 9305143 9667888 9687728 9119215 9126433 9269880 9110725 8882464
14108 8882464 8662476 8568813 8321606 8393762 7972215 7814196 7996164 7624934 7601448 7327568
14098 7327568 7565095 7401005 7028904 7214423 6994549 7031904 6702761 6763667 6638959 6675041
14088 6675041 6608134 6337928 6566272 6505576 6388565 6275878 6056821 5942905 6142145 5937187
14078 5937187 5925614 5750894 5386788 5722131 5962664 5588553 5555804 5289062 5255436 5306164
14068 5306164 5462832 5050274 5122240 5191937 4906010 4826640 4957383 4605621 5019247 4560680
14058 4560680 4521740 4827067 4760007 4593970 4578750 4505979 4398574 4593266 4211192 4029609
14048 4029609 4386935 4285893 4257909 4288628 4260253 4197397 4275686 4136560 4287087 3903368
14038 3903368 3929016 3693223 3687346 3761502 3689070 3682601 3501876 3500600 3839092 3419167 3506924
14027 3506924 3391224 3450346 3226623 3311927 3274713 3034752 3556127 3345809 3277955 3526010
14017 3526010 3522437 3366199 3221360 3238644 3047207 3134121 3082206 3080852 3059118 3086356 2941821
14006 2941821 3078271 2887357 3053445 2762735 2583849 3008829 2624672 2611264 2800219 2520746
13996 2520746 2520205 2452069 2560533 2462037 2574667 2197244 2457480 2526401 2405220 2258764
13986 2258764 2585236 2063129 2621389 1922272 2445658 2546090 2489384 2652682 2921927 3213343
13976 3213343 3427141 4330518 6065617 9570923 15623557 27136612 35356695 23316552
13968 23316552 14873451 9805317 7788377 6033007 5290570 4854153 3959025 3728335 3847867
13959 3847867 3524951 3103926 3022834 2933104 3001762 2871493 2540702 2469051 2469630 2575316 2362706
13948 2362706 2323328 2274861 2393932 2258500 2133305 2420571 2190077 2456658 2111120 2319601
13938 2319601 2025824 1946126 2085627 2132480 2106185 1942718 1751783 2018546 2135508 1785625
13928 1785625 2064442 1792591 2146010 1740843 2005987 2029115 1860973 2096806 1868779 1690331
13918 1690331 1554512 1425990 1979266 1788023 1564330 1764056 1842085 1797702 1476244 1620927
13908 1620927 1890548 1759453 1436872 1824071 1811388 1742149 1327483 1548464 1680306 1534183
13898 1534183 1725401 1333389 1450161 1534502 1546235 1543374 1211543 1694523 1237707 1530929
13888 1530929 857120 1417280 1632533 1094327 1327150 1412817 1450792 1219669 1401219 1876112
13878 1876112 1429725 1709489 1324898 1158809 1467448 1218491 1095074 1371432 1248919
13869 1248919 1055214 1490743 1688886 1375210 1062382 1250911 1410088 1415701 1242726 1235758
13859 1235758 1209782 1175331 1448925 1285721 1301453 1222094 1425596 1235925 1152490 1262096
13849 1262096 1185376 1023112 1634128 1032224 1127266 1100128 1261390 1098925 1260621 1163335
13839 1163335 922202 1145996 1078244 1165330 1205772 1036305 1227898 925060 830479 1259565
13829 1259565 944165 1107397 1397280 1237512 1282913 1179582 1180318 1085636 1124490 1211216 1130057
13818 1130057 979274 1121765 977201 1196397 903309 1089241 1414192 764308 761122 1163962
13808 1163962 965556 894812 895541 921799 484074 753568 874001 669238 983490 1076393
13798 1076393 1155471 855905 766741 852557 579891 775646 842031 866719 614270 887719
13788 887719 638364 520460 659298 978050 1065004 862582 787069 655663 888978 1253885
13778 1253885 640930 1158123 740855 1171776 778033 955930 896724 883726 1274441 899955
13768 899955 965031 925082 779451 953298 751980 706090 697448 755507 781337 587196 759064
13757 759064 477978 970909 842550 659585 548186 648645 299426 549067 486201 777168
13747 777168 449420 711592 566549 671436 463638 839615 707736 881208 441212 702432
13737 702432 465362 672600 910204 460755 570361 718879 558233 570688 821542 447407
13727 447407 543186 750766 581513 587322 741924 761581 619576 775264 557775 751216
13717 751216 649464 559119 799003 654757 515956 759580 805387 647186 561599 275008
13706 561634 588311 412568 736001 871818 710720 542401 553858 782061 447292 486068
13696 486068 486511 593753 584166 359798 387978 378989 414252 454206 634870 787777 669847
13685 669847 900165 703941 642317 368158 443297 473537 593471 500215 520945 407512
13675 407512 419834 558473 424244 738367 748037 522191 225117 632505 724673 554252
13665 554252 273555 535597 554298 400096 842838 627075 631486 465039 406109 403433 386680
13654 386680 304828 573918 382742 344044 364246 479555 341736 604508 182507 394252
13644 394252 554223 416263 733122 332239 172232 647596 373140 446947 643041 479139
13634 479139 308031 401529 636105 373332 750642 461947 148498 461076 487052 468927
13624 468927 559358 510565 678451 567990 381416 323889 820957 290306 282401 626509
13614 626509 464479 613894 311405 493273 650948 607992 645991 537028 291785 79192
13603 566939 389238 187007 404962 134172 249504 505241 467783 385019 318720 574993
13593 574993 572645 466726 294465 489186 575029 196199 363511 547725 362338 330466
13583 330466 505890 348116 241201 431013 25671 102628 198634 268737 254681 460282
13573 460282 215470 465108 308999 60471 405042 515841 277943 416960 -76129 400003
13562 414125 30204 379609 321970 -41312 549038 659208 565813 557417 308793 197322 172812
13551 172812 404521 26083 -62527 197079 309735 224779 369178 -44696 246950 174814
13541 174814 380150 280546 413290 336296 205558 309200 209426 376729 73932 606604
13531 606604 326569 586141 357494 449879 296411 237049 670589 515925 77842 66382
13521 66382 224127 443976 -19320 360644 21651 359598 343827 356570 294067 199456 414581
13510 414581 530889 252848 217707 45223 408812 615190 429784 148643 337472 261364
13500 261364 192230 259491 2450 -99926 241465 353117 142931 231700 525260 384030 295103
13489 295103 381595 450996 469568 316156 279760 112340 481848 -50998 192596 295611
13479 295611 293908 213860 187886 457945 383417 445281 -28640 438570 195669 353160 173972
13467 463670 139056 73089 636401 99922 388524 165369 91513 139474 74068 193029
13457 193029 198784 303005 142040 238163 -73399 615872 368427 -181073 94336 367953
13447 367953 349870 163627 -22270 328843 230838 -113447 -48209 95078 417021 229579
13437 229579 260524 215096 201443 155497 114542 290472 203363 74141 29189 -62725 341338
13425 33979 252329 343763 146494 273224 203954 135533 455412 278110 -20931 266074
13414 257787 329706 115908 -50877 91658 212896 203001 506810 255207 529436 188963
13403 315326 -26444 421101 346534 284933 69733 566687 152578 83199 176999 73804 135452
13392 135452 349800 84367 272847 279609 -83708 149435 368121 -66552 36306 208150 50164
13380 168134 84278 434739 -22520 511767 113895 20095 422117 357845 245919 351417
13370 351417 -1011 353231 331043 346220 136733 102296 195040 -26688 329401 183123 277834
13359 277834 -118716 16817 -27703 271298 154567 314126 191954 191196 180409 151670 430102
13348 430102 150147 123477 192523 20264 328550 324483 326584 321030 172515 335882 159532
13336 63351 182068 302545 2694 357636 375679 180450 245403 82906 686844 65200 366974
13325 366974 101032 -5554 328169 484185 244208 85381 172906 232952 109925 49240 102788
13314 102788 97552 273169 350719 235017 -101406 212620 133937 291944 275885 1231 -93331
13302 -38611 252673 -316613 30689 125613 113350 317504 346503 350612 181048 -148065 275662
13290 -18668 412629 118470 9381 508971 85250 240341 262609 337864 287266 152277 109433
13279 109433 24125 253839 159289 459063 444954 134417 221912 175144 169860 168769 184799
13268 184799 128984 -179328 -129948 -97265 -154705 265025 388109 -39763 255657 -231922
13257 137025 130549 119722 -4692 107565 -50033 275236 74915 -163230 387147 -30309 112051
13245 -202215 64798 305549 338475 454271 42219 -23173 150912 316324 223597 -36035 -148723
13234 -148723 257421 232274 93556 -49793 303416 302986 156343 -251204 -45934 41854 -73031
13222 146266 219599 238481 141575 -212359 230448 -125619 91225 45364 81148 249294 -56279
13210 -88200 540 388823 -18101 341586 221985 101251 505734 192971 -106192 -115062 -252576
13199 -252576 -127340 89243 -31716 332171 -124776 -159745 106758 -105061 39976 -89601
13188 -82027 -61372 106442 297221 120720 252203 303013 39931 355087 47043 138452 25788
13176 24031 300620 -66882 423792 -102841 269136 199095 412292 163213 -53635 145708
13165 -185066 283 457594 114358 -6925 129455 456969 372706 -101326 317357 -128466 136404
13153 -24364 -72995 188730 -68576 -35168 3525 343529 194207 236426 25202 62786 -107711
13141 17772 44843 -164227 61435 -4471 20137 -12032 196915 113748 226111 232073 119758
13130 119758 388692 138865 61103 224382 67838 171166 5417 72456 128325 -26936 -340713
13119 -340713 161443 -12118 140261 198999 -28813 -123222 4123 441638 137624 -55686 -77030
13108 -77030 289820 51426 -301864 286789 355425 -52109 109935 -240098 -108376 200753
13097 244305 180837 184408 404669 199762 35605 -21899 627138 57662 159410 302029 52590
13085 321835 21437 92863 -185758 -263586 -185621 -309030 219042 343617 150168 336209
13075 336209 -7161 173864 -132240 155566 72128 -65594 -85516 126196 24487 -173802 293161
13063 181252 -139496 163381 -14790 -118316 185119 224775 77693 148693 246614 -25515 231856
13051 -264593 507821 239190 -91866 373900 80582 129846 -59102 34489 -18392 -22253 141458
13039 -156861 -231543 289235 111482 31010 374114 122612 -241785 235926 133520 97364
13029 97364 117824 -179353 334126 168413 87951 -4671 62152 37905 173468 109283 123519
13018 123519 -30036 139279 -72666 375357 -57561 -226455 188608 -31345 395782 281168
13008 281168 335699 -161276 164660 -120271 149892 -121613 88735 64743 10026 169292
12998 169292 -97799 53429 149590 -52474 185703 -165082 -10174 106309 -212118 20441 -360432
12986 -100197 -122321 -76027 52002 -113157 170051 340831 242215 108602 -211328 208684
12975 141532 -129406 96441 133533 373856 -190655 -65837 -258652 -28568 276111 78004
12964 -39877 -67760 70452 -175520 -113247 57230 37530 -125309 47833 -311557 -103760 273389
12952 -104143 115854 2549 98673 136733 -73979 230208 18515 182514 83060 -131384 -171034
12941 -171034 188215 130888 169800 188480 18464 1367 -112387 994 12953 -408499 187434
12929 394247 76876 -172696 66034 -90924 -186399 118863 269460 189956 248137 -134003 254731
12917 160071 -6570 -131739 125432 -71234 -115978 340505 6620 -5615 50886 150755 58185
12905 81454 217264 82683 77477 140577 290062 -24678 -216303 -58885 -357116 21078 368372
12894 368372 22767 47488 69662 405816 304959 -55881 87713 140716 -266098 120267 144742
12883 144742 -476146 -22843 -166047 89697 184880 -146979 74144 264948 123888 -275893
12872 -65198 -178657 146248 -158445 -32837 181168 292326 76897 154525 73662 28747 79189
12861 79189 94479 43383 -143941 238587 -85564 210139 194563 267641 -57643 -170951 5638
12849 142508 56037 1043 20862 106108 -354907 188083 -183172 53635 -180649 49717 -159159
12837 -168303 -230752 54959 36413 27871 -193042 124333 1220 154913 138208 28330 -77865
12825 263900 247037 121070 -336160 18193 145729 68755 -218371 107402 -15482 -69995
12815 -69995 192493 -93766 161963 -23634 299756 -123455 4002 46579 -316373 35511 104368
12804 104368 219540 13558 180304 -14715 -253965 -132449 -135859 194634 -343094 -62121
12793 -28640 93544 -58344 303518 220283 -14511 -189038 -3566 86148 131196 -278084 164644
12781 -389565 299217 -26323 -37511 122460 -245802 183346 276133 -133707 -90257 -37085
12770 44568 -136006 -424794 -147282 -85802 -349419 -99456 -75780 28453 37547 -205998 -330762
12759 -330762 -19898 77855 -174011 26111 -269866 177056 37023 -58873 204633 184920 -193755
12747 63549 114369 77119 33976 170078 247016 -296456 -29913 -23138 -292616 -136390 16645
12735 -46420 170009 52256 -43698 71299 123998 170748 -104791 -199506 -84020 -131601 -38357
12723 62516 244424 -11935 -94491 43243 176622 -107235 -66164 129130 153685 19489 -146692
12711 196317 31251 -65968 96768 -262892 40098 58097 -199104 184302 93785 106835 -45684
12699 240703 178660 -329270 359109 168991 176723 16772 195739 385951 232348 334037
12689 334037 79850 177966 94824 35494 193670 -61198 -42789 425162 210077 -10986 117881
12677 43165 -267012 -155984 -54625 -7796 105411 49738 41426 367159 218013 -42147 339178
12665 57804 62706 -232626 -149884 22966 185309 -77906 147850 63988 221164 -15663 -38942
12654 -38942 322965 72316 -286360 -29828 159883 -102675 17660 87557 -105113 62292 -202509
12642 -50227 51251 182129 109526 239384 -210888 -1063 -286992 -85400 17261 23329 54080
12631 54080 179681 -132746 -99270 77216 -38759 -20789 63375 111502 -201174 3604 284515
12620 284515 -67899 99092 -161794 107416 -54284 169134 3863 -24633 -96349 282160 158726
12609 158726 74402 231635 141809 -118392 164045 14393 329602 510869 -164679 60161
12598 216086 220267 -12568 149288 364756 123010 -183776 386563 380450 194351 42828 -24307
12586 104136 -47041 196358 129948 114933 -53459 238961 46292 91954 -67957 -203483 507890
12574 -92262 -92683 134455 -177389 -70085 21310 -166132 262039 2379 -155111 -67852 -189899
12563 -189899 226611 226061 192832 213888 39692 -122292 -158242 61056 -260686 38339 -143871
12551 -55678 -40037 -158298 122964 -76134 -131453 231628 -67967 -261720 -258812 126374 247770
12540 247770 -281019 285948 -289431 124914 -54401 143972 -248079 -205845 -207484 189707
12529 -36066 -373165 166261 -72466 96153 125790 -355345 -64900 147750 50329 -90161 139841
12517 3957 -71524 -27001 -214619 -45447 240064 -144351 -32310 57066 -107772 48120 -261136
12505 -181182 64309 163848 -40860 -411050 296926 -82989 -31100 310434 -133755 53890 169656
12494 169656 -41709 -17771 -138147 -59281 251850 -24718 316089 197887 328975 -103194
12483 73253 286466 -225500 -153316 223 159784 -149793 -33268 -30448 -132126 23041 27606
12472 27606 411614 153967 -89112 119327 -11377 71453 12599 -185387 -57515 172724 -205226
12460 160033 -87763 -205408 197829 352944 -58 46257 -144617 149164 91832 118742 -407268
12448 411672 -324903 -257254 -86468 89919 -47094 120198 121491 -74775 -14587 -8919 -108798
12437 -108798 416060 -80934 -296809 14364 100715 138321 263917 -80861 -171353 -50719 -212074
12426 -212074 -354322 25881 -140066 68041 -3559 -228866 153270 -130434 -146060 -226326 -88597
12414 153995 -9712 59396 261472 156460 275502 49667 127678 122501 -145853 56103 -134717
12402 -29414 262385 -36482 -60512 -50038 261308 -107348 -192408 216719 -206686 -100974
12391 98563 -195915 -172346 -214071 -172569 -77872 20563 -97180 -89235 -69408 -573990 -259722
12379 -349369 257445 -202059 -126638 196522 7456 -113330 419999 -171444 304801 708818
12369 708818 -41002 338980 151743 109684 63551 -4458 187769 -188345 205153 35041 -1440
12357 87478 -53328 167264 -151313 -112802 173639 14235 298793 -63840 -111572 218114 -55653
12345 -107984 141989 -93732 -200754 49897 -177969 183441 27313 280661 -170840 -82502
12334 -141737 141888 -34003 75540 116831 181931 218555 34054 -17910 -44044 9201 178172
12323 178172 140776 36181 39255 -130909 -314590 -32385 -230431 67797 275807 90242 258129
12312 258129 77178 230139 131465 6550 411052 428429 70121 -33200 376532 351742 18491
12300 442549 89015 547859 148358 127057 104451 297742 111179 -180107 8000 20805 184403
12289 184403 -278711 -183756 74579 6140 51619 222684 14979 232532 -114248 -203126 -41121
12277 -42535 137589 425753 352836 285640 -242956 212541 216124 146942 -5098 251346 135516
12266 135516 -199800 -2735 350416 -81718 295228 203905 -53696 -234657 177239 121688 2580
12254 98138 301540 154719 302940 85373 147988 176124 198919 129185 32315 -312647 -10439
12242 21870 302967 -64129 376285 -58349 223022 229370 122833 462845 348767 311599 365071
12231 365071 482336 -194545 -152185 281461 -300795 314518 450427 124012 -34630 176058
12220 -206967 124557 187026 -55372 180291 82965 217530 490248 570582 448521 366466
12210 366466 562789 1023 158638 -54968 58411 266236 428607 320151 -176121 425780
12199 124760 351484 175442 145802 225113 217402 -124765 87358 317746 -377999 101674
12188 44052 -55056 -88062 180379 -55319 218016 -111769 -72099 80625 -124835 176603 319197
12177 319197 35756 302013 -14556 274024 197548 306908 342929 11274 -76587 322564 225553
12166 225553 -115664 353479 16655 -44193 243374 186796 113790 49952 -50487 172271 384977
12155 384977 17323 -385522 218185 143362 456920 -125795 1855 246214 234140 -44230 363767
12143 227033 272762 6014 307279 497864 41909 85153 296019 62735 -129137 -171786 50626
12131 -225849 46853 320645 -18002 294044 19743 397424 -78598 44513 177765 15979 37070
12120 37070 116147 144656 -200228 -3148 -40510 -155352 192750 164735 -79337 -102435 -47259
12108 -55949 -60879 241392 -4657 55909 -28080 286048 126584 168011 143858 90861 45646
12097 45646 -33474 -20635 -9553 197727 248170 187622 -175280 -22366 -315235 77308 78639
12086 78639 115606 -21739 154217 191197 -53028 450242 162382 329411 -231960 -78846 223077
12074 -26350 -14440 453382 248553 285016 242521 137267 -136749 43860 98775 104280 65941
12063 65941 160804 37109 -13096 311745 -209494 118686 13710 -344996 138966 152447 277849
12052 277849 369313 -30015 150879 480024 274778 -5206 283254 -80454 292125 145399
12041 337373 106453 -107320 141125 173308 161998 -167195 69767 -149214 -114385 153923
12030 -2223 152373 -276110 -148702 97395 -206204 -121781 -41134 284225 -233764 -150741 -148626
12019 -148626 -360515 2472 -40753 39824 394247 221806 -114297 -334784 47733 72649 25200
12007 -227597 -69246 198378 269624 71752 -28558 -37656 215692 27939 -122043 77652 426822
11996 426822 -16891 299550 86773 -25682 216108 242703 -235620 232023 126253 71247
11986 71247 -58926 43248 66849 104675 -18353 44972 66094 -8239 -593 85808 63246 32340
11974 32340 368722 -83209 400733 -212932 -352072 346221 -277661 -115081 149474 -179377
11963 -107107 -2442 33192 -147821 -155610 -84129 -93821 -302271 -70947 -35586 -233610 -20769
11951 192338 -205491 -96887 18143 243870 -251259 -299196 -88186 220496 139541 -74552 -191929
11940 -191929 -142773 -179068 -145130 -113094 -52648 67815 84482 -150906 43901 -87646 -132213
11929 -132213 -320795 151305 -155234 42012 -286428 73125 -460121 230513 31043 -113836
11918 17378 -47862 276375 172806 -15253 -93779 16326 -105959 -66831 224957 141418 75369
11907 75369 -287899 -227757 -10545 176742 -6644 99642 47626 -263321 36750 -69935 314363
11895 -245978 -139542 -9604 -5375 -156638 239365 -79001 90706 -146266 281747 -8147 -102544
11884 -102544 -63851 -130417 -175068 126223 -159172 -164739 92669 138649 8665 -91662 -155012
11873 -155012 -167729 -416101 -172973 38072 -150977 294855 -112122 31259 358888 205182
11863 205182 -204502 -157917 -15156 232011 -153313 -83881 69042 47799 -192607 61181 76300
11852 76300 -199583 376207 -91955 242692 -40103 115133 -125267 -123892 173878 19019 -183020
11840 -64468 -160786 -153656 7389 -192406 142578 -260134 238166 -251217 39251 -115053 -445533
11829 -445533 -94434 206245 -23461 52630 -18878 235561 53029 -127140 -284202 -5117 -61314
11818 -61314 187035 9034 -4002 7152 154764 -7147 -248139 -164132 121503 45588 -10742 -57248
11806 -57248 -214115 -130364 180943 -172296 -18814 -114882 14386 -21745 -128894 -494042 -35020
11794 -130578 218761 111144 -106211 53178 -206225 62349 -23323 280862 96524 -309946
11783 -262553 50095 257693 -138518 -49356 30551 4841 -166764 -32547 -59412 -25862 -313582
11772 -313582 -74622 15669 -230207 -118867 50993 -77836 -189995 -375067 -37057 -132920 -120215
11761 -120215 -179366 343950 117038 382474 263059 -132582 177567 -83821 -23079 87105
11750 160107 63815 83199 -26256 34567 -113677 -476123 -171779 104290 116222 -228860
11739 -33135 -213397 -16200 -9581 -236067 -163656 208015 15096 85286 45626 -304404 -58627
11727 8047 -256009 89319 260252 -48320 284157 -333425 174391 28040 143503 -55596 -119694
11716 -119694 -20360 19369 89740 -71338 -269646 -203950 55825 -53096 295461 26042 128448
11705 128448 -26767 90106 -210014 261384 342171 -31569 -92938 8844 136686 -89795 27908
11693 -502329 -154568 -61206 124249 -77607 -96168 189505 -316901 -161578 -4895 214194
11682 -549479 419123 70501 39483 146741 -417952 -154526 11812 134270 51844 -7562 -345026
11671 -345026 -204726 129396 -152029 -76185 9119 162900 -174135 -293246 -181768 -110565
11661 -110565 44872 -35143 173344 40255 29996 -100248 -179710 -230875 132404 178726 61247
11649 79777 -102963 117359 6953 179560 199671 330514 244948 203518 167961 66993 -54033
11637 87507 55229 251899 -147708 -34943 150886 45799 304041 92114 -204306 -5545 4945
11625 -103439 59737 -335395 -130627 -215229 -63290 -177366 -68564 -155854 217713 -307331
11614 250927 162757 154906 59207 137683 169461 -223044 52859 165365 182323 72868 104573
11603 104573 -196658 -292141 61695 -230748 68641 68310 -238202 -521357 -290379 -255405 72240
11591 -53018 -5738 138783 398247 -17600 118715 -202474 290978 8259 372929 374974 304282
11580 304282 192881 -240205 47328 -72280 -79984 -251357 183821 314395 60666 -146199
11569 -69448 334255 -22899 4812 -59990 62286 178095 347571 388741 -49271 -328065 -236190
11558 -236190 -141981 -266268 327693 202746 266423 196683 64221 -138694 130338 -172481
11547 123908 -141376 -112802 -288941 147271 245736 -195175 66747 -180209 -106129 -133206
11537 -133206 57059 -80330 -25820 -5412 -121297 -34225 46428 -192153 103178 67578 73554
11526 73554 68760 339883 -22902 -381822 192768 8077 -88272 -263414 99244 269094 16595
11514 201139 302576 103345 42230 -82270 158268 -80775 287392 314984 -202144 -83785
11503 508955 -42240 -149597 187322 17328 -145473 111398 131979 -144689 157755 -15046
11492 -130993 13499 388473 378093 226559 92938 269664 50423 50873 187090 -24399 -230388
11481 -230388 104381 -34255 425859 -49251 375830 121077 -31281 82718 -19530 247417
11470 -125447 226716 -76765 1165 100935 329063 370587 101372 186097 359537 315606 299615
11459 299615 119874 -67380 26811 -101810 -211466 -124459 -31691 35559 381645 127091
11448 223895 93084 -83303 129499 5983 14130 10457 278073 88962 220131 -110911 207969
11436 129740 -210802 -116233 36022 123192 37853 110879 -141070 307016 127612 -148817
11425 -4839 -174816 235461 120633 105822 -66329 -51331 139771 -15519 -1096 -35109 24506
11413 216043 -152132 232125 -82736 254772 39767 -129564 349356 -90718 -270040 -38336
11402 290269 50896 -229102 227735 44333 -315685 1943 143511 44154 240946 67326 -291061
11390 -60202 21377 -1621 -57386 -163195 -164447 37051 33097 38150 133116 -36121 370154 110136
11377 -88362 38233 -319724 -183458 342308 39069 -5857 -17144 -99751 -106529 -90623 -51324
11366 -51324 187394 128789 -211393 17647 -16476 -317532 461968 106049 28611 20263 26763
11355 26763 -74841 125134 -132664 95046 -309800 -48022 -160064 -28634 -60409 -153791 -85676
11344 -85676 28216 -196562 -182858 -156706 293795 -82139 323941 -203165 140636 -109121
11333 129486 -139041 174234 -349705 -109126 260033 -66901 -268497 194694 -155725 -61905
11322 13979 -242776 271813 -146598 -298478 218235 -54007 -90808 -117692 -104248 40166 -145509
11310 26554 -39840 -11099 -241804 166076 -248676 -403158 -102685 91294 16882 -42391 -240062
11299 -240062 20045 320243 -109874 -56637 -247467 -201090 105701 -182564 -111161 -1589 -127593
11288 -127593 153146 2692 -70895 30488 577595 -125041 96054 -140021 192830 -10921 764
11276 148926 -216065 79034 -139209 -80619 13744 -94306 -6470 -228192 -17299 -157306 -46913
11264 -115198 -116372 -169532 -171054 82892 -215090 51774 -96410 -33928 28149 77975 75697 -54183
11251 -223113 -356256 -250127 -24078 -53919 -123119 -444907 -167189 111657 -411407 -42140
11240 -34599 326973 62287 -28421 -248193 -43498 107513 -73521 -229870 -236716 -93601 -112865
11229 -112865 -2442 -159926 -115881 -25295 -209412 -110470 -161822 -43297 17469 43993 275834
11218 275834 -539570 -51633 271615 174651 -221981 -237884 -226202 -167057 -120814 -310700 111568
11206 79277 -19232 -377744 28922 261453 -101781 -192915 -151387 -23630 98832 146057 -57726
11194 95014 -49069 -54786 186779 207735 258853 -220019 -282769 84092 -1004 -135478 -57352
11182 230499 -372703 -242587 -113059 -389118 -310682 -263660 -32569 -171014 -100593 -234231
11172 -234231 32887 2463 -231815 -263513 -228875 84455 -41723 7014 -210961 -352881 128192
11160 -350120 -254780 294321 179469 64807 57264 -158897 -262990 -24481 54555 -24477 -218114
11149 -218114 -62308 10270 -170640 -147525 -52022 -13057 -186385 -1104 73104 158272 26243
11137 -125309 113741 -212124 -333742 -118481 246356 14087 135258 145134 14330 29452
11127 29452 179376 160115 299406 86937 329872 428190 -56031 12886 414272 -59854 59887
11115 191375 73092 -17474 202393 -44620 73292 31775 -271742 -202656 -121709 91910 349966
11104 349966 -81307 33985 221502 260233 1488 185726 -107307 -179104 200741 62018 174749
11093 174749 144607 91433 -196629 19393 261417 -277191 63909 -39462 267714 111944
11082 -14703 -48031 175161 388522 47027 226998 -74122 131349 32218 -4057 -82236 277129
11070 293625 -45261 154135 106643 136589 184329 128602 115969 77096 -38470 350278 147488
11058 322011 270947 401422 191729 77330 71838 353240 5131 344858 356750 306795 228921
11047 228921 -28154 146568 285666 387380 302640 539652 459008 438390 422632 515205 574847
11036 574847 598045 239292 820506 269373 857503 715684 485810 626972 815214 586714
11026 586714 307781 598269 599714 528936 598328 780501 859062 432168 627847 699584 493880
11015 493880 723823 305641 648973 451540 447620 319566 571366 649564 483036 494214
11005 494214 742911 400865 420499 726784 506742 642084 532621 486715 521564 126656
10994 432695 763698 622310 671132 740477 590243 798551 787744 580312 308801 485743
10984 485743 448477 507243 334311 794967 800367 418184 627893 595365 357851 797736
10974 797736 538028 329115 412505 589769 902539 523806 929767 814223 622469 707792
10964 707792 898782 776630 1101215 1068080 1308661 1284666 1727913 1362333 1633461 1962428
10954 1962428 1968334 1813998 2360430 1918659 1966672 1758896 1615790 1461314 1457694 1409635
10944 1409635 1045171 1242559 1503833 1363805 1426340 1337011 1494014 1502854 1385137 875426
10934 875426 1366974 636503 813347 746599 952835 513356 622331 318672 418779 340453
10924 340453 400639 190752 -13390 156560 263570 -124250 271049 -22251 -363291 312234
10913 130745 -2063 208802 243900 -212260 128157 78765 93274 261688 -1423 -19993 -85164
10902 -85164 177246 213506 -352254 -67238 25029 -237936 -45274 -257899 62085 -221923 -84576
10890 -129315 140970 31247 -185408 -105203 -22571 -4986 214001 190182 -114130 82502 -137358
10878 -55222 107528 202023 -34805 182774 -260292 -2714 81290 88450 261080 -106399 51736
10866 -115116 -206611 -132120 54836 151727 -114680 -64334 326901 -100276 66296 -158168 -112692
10855 -112692 -231289 -198456 129673 209976 35078 -240670 250820 25239 371951 -160144
10844 49929 56121 -189512 -16262 -24237 -39758 -13435 -60724 82273 155760 -50685 -400448 -181737
10831 -163898 279044 277793 57002 -193711 114981 -184146 -182798 -12082 171842 -193706 215264
10819 156081 -152808 123288 341134 68377 147116 -19049 -247206 64087 -59568 -242157
10809 -242157 -296778 -255702 60104 -78538 -342490 47087 13000 -266846 -249398 -3531 -495487
10798 -495487 -320969 -16019 -280409 94973 -339218 112255 -159756 -58734 -107739 -25603
10787 -79500 -12079 -8532 -182918 -301790 -145575 -15068 -143525 -222826 -137859 -131870 -177055
10776 -177055 -364322 -413451 -28637 -14616 192167 -172182 -203469 -153695 -6912 170221 -3166
10764 -216187 -42897 -47782 24833 204122 -263419 144870 31083 84031 -71044 3463 93591
10753 93591 -169914 -20476 -80806 11321 -256551 -41419 -98203 506462 49192 -252652 -357413
10742 -357413 64185 -159210 -183783 -3832 338482 144913 -81917 9478 262690 151042 76794
10731 76794 -172308 -147406 -239162 18599 -120573 139410 -51714 -87174 198463 175679 -349636
10719 -184970 -154116 165469 -314785 -41685 -43186 -115698 135083 102177 -51379 233153 -77201
10707 -163671 68688 344462 212394 -84243 -52986 -216832 -16226 -152095 -163595 -24349 13840
10695 82904 220800 59397 33372 17355 259112 37532 -155479 146638 113294 -79756 -143931
10684 -143931 -53629 -222975 102913 376015 98982 -72227 56361 -219738 47497 -116113
10673 480442 72280 -184433 39643 -62663 -299033 -83956 -211025 35497 -183599 -191722 -174384
10662 -174384 -186239 -259935 -49881 -4821 8430 -77266 -99942 -31885 119739 -96174 335115
10650 -11439 -213477 -38711 11910 -39213 -152246 169828 -194546 -46142 -59900 -316803 -72517
10638 28340 150419 -109541 132328 22524 -178286 -212639 -329141 362835 -101647 -58325
10628 -58325 -262126 -43137 105454 -46106 -152661 -431835 -69776 -200040 71419 -188530
10617 58486 126030 -10378 -160567 99666 -91961 48675 -410149 -428942 153607 -35339 -51808
10606 -51808 -417524 -101915 -23882 -175157 -128208 -61069 -149310 -221922 -151639 -62154 265651
10594 201850 22184 -182666 -508355 173041 331771 91786 141710 -48934 -263867 -163817
10584 -163817 271863 74014 -69559 -101459 -214247 -90230 -148899 -206526 -105053 69115 3670
10572 23143 -19557 -381955 206927 -2764 -1410 31189 -15581 -191085 -105012 180297 -35999
10560 44440 -114779 -113678 266691 -83764 161729 -28299 143254 146805 -75907 -191091 -166040
10549 -166040 70082 -183152 -180890 163995 157147 400 -187087 100744 -317829 -167010 255114
10537 110632 152461 162359 -179287 17514 230311 -107750 -135514 161746 -21810 259393 159721
10526 159721 -190008 27678 11706 -307971 131626 74935 133393 45890 3571 -49476 -453224
10515 -453224 62909 111687 -211318 -35193 -61741 -147778 -181784 -169620 -48205 233660 161395
10504 161395 -101375 71833 151230 -100725 37748 -127971 -9535 -27592 -185283 182408 59395
10492 -19124 -171905 -67329 77332 -161171 64940 -57322 422 183856 -240677 113496 -247243
10480 9894 -25772 36495 -57850 181615 -330771 191386 -185222 120504 -196853 -159078 -312310
10469 -312310 -103097 145631 -20778 -247232 248530 -175622 275170 136093 139530 334775
10459 334775 433511 185736 404490 -122645 340300 12315 -21586 468591 -132734 151145
10448 81486 126962 123845 -285472 -68280 -287557 257964 28945 3343 -176347 -124672 -111225
10437 -111225 -375958 -259173 174274 -163605 -154398 -263336 139742 23515 109894 25252
10426 -148983 132479 8848 -65141 -177910 44991 -116484 -133365 -117982 -301169 -264195 267318
10414 -238980 -383563 23496 3918 -543638 -27388 185990 63328 -390704 69165 129653 236638
10403 236638 -66732 -194501 -44786 -5605 -363806 -297079 126908 -56927 -26616 -38947 -189490
10392 -189490 -184322 102119 204263 -189533 163453 -215218 -61 -40858 -61065 -130317 -32047
10380 -168540 -107547 -76506 227890 23616 -46944 253457 59691 -140984 -35801 -7966 -120658
10369 -120658 133992 191386 181548 -209691 -12654 231692 -143225 430942 101781 340299
10359 340299 126537 -180221 183427 286615 107939 68629 -50024 345501 163505 209118
10349 209118 470930 375196 280470 235915 97335 184979 222095 -7867 303690 492513 99653
10337 -97428 191064 215138 83291 334085 305098 236150 406353 118040 136427 425229 164447
10325 127177 333145 275151 326444 124537 246450 -4289 -277176 29067 146604 10697 -290668
10313 136634 -325802 -43804 135869 -155703 123884 384917 -65326 102413 382757 132737
10302 337046 120982 698309 174950 250479 230920 52342 251 120571 -63066 -117291 -145223
10291 -145223 130920 -165233 325160 -200357 -134698 -213680 9688 -94312 -5569 -70498 305167
10279 181982 -185637 185636 -100721 214180 -32052 -203671 -90468 24408 112624 -61850
10268 69640 35224 -283102 -36041 52255 -86367 133822 195883 -61073 199677 -60811 94296
10256 -191992 -6923 -94601 -6535 166302 -337977 56774 -1642 120409 300585 118842 -21170
10244 -82014 -130409 -389774 446648 197740 133943 245852 395014 87174 52455 -4365 476441
10232 333591 -51417 -144290 -289690 -191107 -106774 -83439 31633 82503 -59303 -97156 -128710
10221 -128710 -936 -44480 21961 6690 42662 -6802 229789 -135729 -83042 71762 -229215 42234
10208 250525 -75250 -330839 -97131 -281727 123935 31012 -272362 -368759 -320501 -200999
10198 -200999 229764 164011 77574 313860 77054 227 73423 -160261 84478 -90939 8717
10186 105018 -180283 54259 30462 -31582 -97092 -333213 -103996 -172395 65248 -441753 -31682
10174 -105894 60713 -145354 -22469 40831 -181349 172048 -375728 -52974 79088 -323912
10163 -277044 -76073 -41364 -287069 -413665 -115145 -200051 196947 -268634 54507 -61002
10152 -109476 -34822 -236810 149334 -119274 -193750 336629 2127 -139435 -35565 102364
10141 6877 -212674 29017 -26387 -170201 78403 -61849 243838 -98485 -205040 102665 57062
10130 57062 -38430 31057 -86221 158425 -176559 -189813 390960 128239 -50728 2528 -273879
10118 -29175 -13785 -211692 -241189 -129211 -145799 -388226 147936 -220716 49501 -402759
10107 -85519 -270126 -114821 -209840 -224740 -234525 125328 -167441 -12542 -151961 -58210 283856
10095 -150943 -172361 -75348 -163805 -265380 -96791 189251 -209265 96093 -33087 43438 -175333
10083 -60705 114810 61436 -41809 178520 133991 -166824 396 117539 -47222 171206 -46689
10071 -22577 -327009 -377569 -212951 160141 -447608 -76797 -605207 -108906 -30679 70118
10060 -188921 -18205 -292235 314695 -168306 -284423 -73651 -311438 -372434 -105274 -96909
10050 -96909 20547 -342777 -151091 -59874 -180300 -81455 -6497 55811 -344712 -55152 26042
10038 -170074 -43189 42794 -204660 154397 358989 -70592 -140003 67486 -291109 -173143
10028 -173143 570 32459 40589 -71821 -390519 -246736 114560 -279909 207575 273266 68441
10016 -505828 118976 -19957 -164850 -57873 -110122 343714 -106916 152067 -148474 156301
10005 -53667 -118755 -88968 90830 22936 61988 -284483 36743 -252166 149241 -56611 -63425
9994 -63425 -70317 -132206 147808 2443 46385 110528 -117491 49375 -196853 -92483 29881 -149329
9981 36976 125386 -130274 14642 45802 -515487 -82139 -24929 53387 -200770 47445 -243024
9969 -195288 -197350 -218809 -23832 -90504 86035 -254949 -259967 251632 -231104 -213564 -131653
9958 -131653 89936 -60630 55596 -219896 149455 -173058 -162150 -333331 -33082 50973 226631
9947 226631 -146113 132550 12467 170961 57818 183248 -82620 218654 47085 -56449 78090
9935 -44566 -113703 38033 -63431 -242744 20716 -161690 -190637 -406498 112383 -189662 8798
9923 130847 23278 221589 -39670 -333393 -72494 -311284 -276722 -150358 27147 385681 165946
9911 2113 85393 -29912 165824 -242149 -141580 -221358 -260938 8575 -193302 418855 292617
9900 292617 147201 -64910 167237 14321 -183139 62299 -105150 25223 -155626 -179773 -122800
9889 -122800 124118 244828 105886 -259260 -152048 -100341 -15362 160835 47198 -170504
9878 195255 -129579 -163385 -277417 172380 13729 -31310 -157990 110579 305832 -112958
9867 190594 206718 -336307 328460 -90411 -77305 156215 -78273 -191468 -288519 -156779 -9632
9855 54397 -277831 9378 -85375 73912 126892 -61420 -73444 -116216 -49115 16162 36356 -82106
9842 38257 -80456 -83365 -259146 -160528 85990 175372 -75679 -70963 -256311 -121904 164600
9830 -116298 -99447 152990 20385 -119374 6160 -118982 -329390 85202 -88538 -180758 -265579
9819 -265579 -118554 -309142 -186281 217734 -202765 -201906 -106686 99292 429130 -245986 -98740
9807 40582 -246219 -153090 -243344 138769 -64123 235081 109283 86196 -296240 -32661 -187503
9796 -187503 -97193 119105 -16013 166494 196118 -271168 -124967 137546 -87375 -225365
9786 -225365 118831 186773 -122348 410616 -65179 -23933 -284768 -264829 62750 -325318 -67979
9774 -74319 -135287 -103401 -151849 -201276 -155993 -237715 9247 -14020 -119632 -374543 -150002
9762 210337 -137651 2305 -144064 71769 -20583 122264 -122818 168298 -236557 -117137
9751 -111224 -141036 91612 -92177 -100468 -112876 -301759 -142030 -404514 87960 -44131 82624
9739 139079 -29455 -187389 25503 -414573 -223518 -103767 301843 -104561 -156078 84624
9728 -156326 -244801 52579 82847 17761 -245868 21568 33151 172396 239524 -24874 -69985
9717 -69985 -53077 3047 155340 -93848 70483 -251757 -15182 -231460 220684 151867 74446
9705 102082 -307344 -328227 -392816 -156754 46084 334196 -123448 -62913 79934 -233182 -194210
9694 -194210 -40839 -238977 -170422 -155736 -93848 -3094 -70062 -276762 -78375 -71553 -13950 -298657
9682 -298657 -277798 -277401 -173598 59680 -415947 358421 -223387 265528 -171791 -249692 62566
9670 -103242 -97075 67004 279519 198832 33638 137974 -40841 -59697 -216508 35783 53800
9659 53800 -162872 -341780 6553 85033 -252889 -136178 -107776 -1004 192924 -226833 108778
9647 -47248 -6341 -100315 -95995 -127092 15681 46759 -153452 -1558 23481 -43458 -120454 185703
9634 6002 -293433 -393916 92788 -198742 -28450 132794 -115874 -185939 -66229 -294484 193194
9622 66507 -134885 54053 238592 15027 -229637 58474 238657 -97125 -202488 -88483 -133967
9611 -133967 357512 250407 -217149 -266013 -5089 -353182 204742 -222186 -253203 -134147
9601 -134147 108601 110664 -328290 114807 -219403 -114239 581491 24728 -137125 329664
9590 -291835 -124738 143656 -225374 244193 264298 -212991 -269850 116855 -167445 -72878
9579 70861 -88637 -274338 -338625 -157532 -190507 -4264 -141533 -19726 -243678 207228 -328028
9567 -189773 -120515 143117 -113956 -313905 -322111 -299884 -491667 -245764 108188 -51636 -165499
9556 -165499 -136205 74569 -243088 169433 371826 47782 -91565 -219094 234805 -145120
9545 -81689 -44852 -321030 140316 118317 125736 101362 149288 -169494 -18195 184912 124523
9534 124523 -172316 -182490 -69375 -23542 -37943 -263390 -221006 -134562 25149 -356795 -70686
9522 -267534 -211749 -379161 176493 -24924 -128284 -236643 97416 -292807 30540 -15884 -221522
9511 -221522 154551 -46038 -285270 -311642 207186 -14049 -238713 -500536 267248 -132132
9500 192912 128436 -186999 -173271 -89586 -70747 46432 -240265 -72871 -195864 -121948 87837
9488 -213660 -156052 -114946 -40586 45507 -241084 -191204 4118 -256873 -29750 -186386 -78884
9476 -583560 114843 -82462 -12852 -186982 25814 83656 -152515 -18637 -27642 -110809 -179168
9465 -179168 -286875 -173224 271789 42880 -157450 176032 39424 272098 155343 231339
9455 231339 -122531 -86434 -151288 -256463 -243902 -180573 371777 -374148 108814 66916 48677
9444 48677 -143400 -88128 -83706 123913 -50002 -107658 8007 76434 -109310 103848 -166281
9432 186191 -94951 184062 -174128 62355 -162300 -106546 -246324 -349348 -185290 113386
9421 -311470 15670 93875 -343817 -101353 -119446 -92987 41119 121089 -248951 -197568 -87308
9409 47275 -162373 -150298 -21770 -185106 48709 122536 -202224 -155792 -255581 -64102 -272742
9398 -272742 97726 -6326 148985 -96718 101200 -48808 -272140 59386 198116 -483457 -81936
9386 23343 -402717 128835 -125020 120928 -294419 -40080 -26860 67899 -411922 38983 -356800
9374 85774 -176148 -326996 -126806 -91191 -9563 289393 -160084 -31239 162192 -151058 -32791
9362 -181937 189005 239612 -306577 -238847 -248705 10788 -221363 -89850 206592 -117055 -267655
9351 -267655 -163463 -31454 -259056 -47587 21828 -14154 -52759 170709 -34007 204177 78048
9339 -21226 -108354 -171870 -16010 425673 204281 41750 160504 -95615 37184 -93366 -154748
9328 -154748 -26650 172190 -197550 11639 115205 279887 75701 -393505 -41664 -42390 -171260
9317 -171260 48401 56085 -204795 -5158 -84474 -139363 -215716 10660 76452 48585 8709 -449074
9304 -313655 8385 60390 182595 -41138 9424 102564 322870 258388 -135324 -74040 -88187
9293 -88187 -59948 -219472 -140081 -182832 89379 -142759 -241469 -18685 -168914 305979 1785
9281 -133348 -54993 3158 -2252 71228 4497 376423 -351941 -271564 -209113 -144847 -120324 -195511
9269 -195511 -140067 64766 133253 85601 -289698 -172572 -21244 -91704 -155759 126307 19157
9257 102905 -91331 138927 157275 -48174 -44238 -44375 -232405 -299570 35382 109973 -67129 -256226
9245 -256226 -138651 -247665 -140642 -174499 199115 -83508 193987 -14596 -85477 -318089
9235 -318089 -78002 -77546 19617 339507 122986 -105807 -72261 -190984 -12928 336219 117499
9223 -40482 166383 -127697 132104 -10035 -186 217891 -170343 -136015 -340029 -181225 88968
9211 -177595 -109468 96423 221953 -56116 -26684 47262 26435 -162441 11303 -368003 230837
9199 -104843 -31204 33029 26180 4847 -134796 102028 -18495 145002 37932 -210566 -130920
9188 -130920 -172804 34635 -82670 -264318 -144113 -97938 -173899 -185240 -90472 3640 -24347
9176 -433093 -270374 64720 -227748 -119387 -130511 -147702 -268010 -130369 60317 -233985
9165 -277464 -74993 -243813 -124709 -23819 221963 -148921 -3846 -61770 -106962 174573 -226076
9153 100506 -229140 -158560 288494 -12217 2989 -30467 -103630 50056 62678 35026 -276875
9141 -24795 -200947 -235141 -55469 176428 -102129 108490 -201782 -225991 -13873 -235291 204221
9129 -269757 -101049 160002 94563 -189848 -4519 -242974 -71988 -125451 82564 -256704 -7792
9117 -253644 287905 62564 -65506 -432194 -125037 62475 -255205 -71098 -276406 5153 -288883
9105 85703 39577 -398079 -217540 -146667 -261801 -18227 84953 -304513 110260 94363 -204127
9093 38084 -11467 103134 -10775 -196681 -289709 -32923 178924 -254886 -115295 -354320 172957
9081 220557 -262591 -83908 -141151 -154170 176876 -233589 -34353 142565 -247515 -145261
9071 -145261 -182704 -169397 201966 -201988 -203282 -242267 -141347 -143632 -178283 75002 -154922
9059 115627 79042 806 -42502 -122451 95436 420788 -191386 81030 -43329 -193410 -68525
9047 -346494 -60578 -138958 -170089 -99010 119342 176182 327412 -133995 -39469 -81763 -74324
9036 -74324 190527 -69713 116051 -111619 -441226 113971 377267 -254118 -307581 30331
9025 -127546 -157963 133485 99623 -79301 72917 379611 25508 161938 -194233 -72172 72127
9013 -31598 -116758 176788 53749 52879 397636 -201066 100371 -199660 -14628 -160487 211366
9001 -294171 -110716 35125 -135696 54364 -274535 -95050 147222 -49921 176501 224486 9082
8989 -64395 156503 162401 90267 382873 11249 -77911 150462 -339908 -56648 135875 43673
8977 -50679 3805 -170424 -52610 -285783 91203 -165325 -298155 109296 102585 -29940 -110625
8966 -110625 6961 -149898 74214 -101100 80903 -253068 -251489 60232 -230741 -46077 147127
8954 117634 -74112 134896 202700 -190400 118501 -273120 216374 -215096 -89978 -132091
8944 -132091 -190137 -132925 83514 182760 -80435 -93351 -67228 54397 127807 -75563 -180435
8933 -180435 -211365 2390 1433 135143 89201 -117325 -255043 110622 -12612 170730 286349
8922 286349 128008 -12167 -54969 -104962 -224061 -225387 280029 212572 118272 -417535 181354
8910 188230 241561 507610 30715 716998 1748026 2243178 4543736 6563585 3592862
8901 3592862 1707411 710004 295515 306036 124110 299139 -126695 -40462 -96836 13237
8890 127755 48796 368763 236283 192912 2690 -245504 -249358 -175197 -69384 -163889 -300093
8879 -300093 -37124 105822 -189208 30506 -96070 99055 92870 -89634 43116 -260824 285315
8867 32275 -6544 80774 -118834 -119290 -364262 40389 54423 -281393 159980 -39572 -250550
8856 -250550 -186976 -525637 80813 15222 168980 -53024 -228907 -101355 28972 -29310 95722
8844 -7 6830 -18824 37085 -273526 -107586 88102 -173263 -12598 243184 9232 78949 -217399
8831 36978 99994 -55409 44030 -5594 30946 -224288 62840 -47374 -64123 73796 -296562 136964
8818 -11714 -27241 -157647 36522 131609 -364275 -223404 109750 74747 74578 118052 60658
8807 60658 -304827 -174263 -132494 -158099 -137311 -137405 -80949 -80561 -9367 -123662 254381 -104947
8794 -72114 45845 -163709 -44732 -155155 -11145 -118637 -248925 -313029 197290 -95906 -140520
8783 -140520 -267134 -13958 -88914 186770 -172222 18109 -170822 -154542 1423 -225460 -342722
8772 -342722 -102563 -217576 -399985 -274834 -145989 -295558 27671 110531 -39189 42595
8761 -330436 43021 -178156 -50593 -138818 -37821 -104325 -131771 -71949 -205304 94549 168214
8750 168214 -73293 -111940 105027 228329 145979 -197041 -373697 -185525 -250056 -51528 -22254
8738 402494 28490 -227814 102450 -98983 -176039 16867 -25583 3208 88722 -273968 -109060
8726 -29669 -14905 -106213 32184 -22891 -129312 104999 -150584 109186 286483 111536 55784
8715 55784 -276803 -63609 71066 -230676 -26476 -316744 -147650 144721 131305 14328 150304
8704 150304 90851 -328908 -13268 -274643 -45537 -74865 -35706 -201625 42029 305269 -281848
8692 77575 65032 -37035 -230833 -87325 193919 -192141 -178175 -379656 97267 4088 38041
8681 38041 67846 237344 -119461 50180 -92289 -66189 -117799 330910 35028 -80253 -252412
8670 -252412 303701 109225 47394 -177081 -35717 130553 -56289 61443 -260260 22283 90825
8659 90825 -36411 -38407 -60210 147012 360421 -222368 -143134 -88617 -51328 -154707 -20059
8647 128875 -199468 -54471 44964 -12907 -169937 77562 55109 -10047 -265001 113595 -355613
8635 81835 -131141 42545 13467 108536 -85313 -153836 -33370 -236911 1218 -83289 54709 38052
8623 38052 -178139 -196747 -123016 129811 -12227 10949 -210048 -204990 -119860 266941 326897
8612 326897 -38974 -36595 -233372 180596 -45 84916 -114470 41763 26650 -149290 -52955 -121981
8600 -121981 45184 12214 112844 265486 193493 -180417 258582 -42964 -163202 -113186 -62222
8589 -62222 -74014 -33664 300293 -214054 -366120 33700 37455 -73944 -26819 -255276 190897
8577 -202725 136360 -130467 1936 267788 -95102 -55599 145385 218635 196583 -12874 -458266
8566 -458266 79434 -170997 120752 12898 -75536 109121 7821 -15976 28862 -29918 99286
8554 -226654 81882 -293521 -243680 -166869 121461 10188 -30813 -266178 -49994 -195186 59252
8542 134658 187736 -16443 -21570 -146340 -51066 -203781 -226576 132534 -74509 -48266 76978
8530 -230579 98251 -45738 100920 -68287 -99189 145063 349874 377604 -44692 81023 -250181
8518 239604 11350 275230 180146 51825 -17526 -137483 157186 -65424 129205 19156 -83220
8506 -234644 14706 -52684 71733 118252 41064 -76694 -220169 -612506 105979 -146892 8164
8494 69440 -294753 -304539 -509109 -253545 -120387 -178609 -86057 59545 -23156 -389346 82362
8482 170218 -42610 103518 85986 224758 -56062 -106777 -79746 -127407 42259 -211944 -194688
8471 -194688 78358 175248 -173949 73063 -43461 -107882 122033 -66318 -29891 -290217 -202628
8460 -202628 192222 29629 416299 -218116 144017 112526 145594 -83767 365482 -108803
8449 82467 -41466 -141513 144865 28946 -255359 -179172 -315715 -211394 152390 157395 -312539
8437 -198758 -112879 280878 171275 -46774 278041 -212185 30543 -227673 42811 -51132 -48676
8426 -48676 -76686 -101999 -51361 322115 -117951 -62247 -44473 -98789 86819 -55555 81742
8414 -172998 -81573 -134876 -158824 -343506 -305210 -115576 -111833 103229 34504 12921 -187181
8402 121493 150074 -122560 -57948 -105979 -7631 -205551 -242858 -43944 109978 22191 -186436
8390 108685 51950 -86457 -18308 30745 -212956 -12530 85839 -128157 -94791 189794 134698
8379 134698 -105911 -37339 134629 191726 -467618 -3138 118667 132754 -73041 -96543 -92647
8368 -92647 4723 51597 -82790 -75981 -160810 -334833 -198167 -106614 -145253 -223318 139328 -21875
8355 -810 -82900 -195288 176361 -85488 -144309 -42001 22422 51061 99439 -267938 40923 -166819
8342 57193 -27652 -187558 10656 229417 -367622 39414 27706 82522 249240 -187327 290782
8330 28749 -173172 463813 -191720 360669 -231143 99399 -331645 74072 301187 44615
8319 -193956 -267559 113814 -102932 -245462 -63564 -369307 -225704 206844 -223263 125280
8308 87417 -323314 -188259 -151966 -281487 -149110 96036 -207272 -133846 214162 -37287 65579
8296 -93474 -48740 -425 301127 -86485 -72134 -104782 198768 -371496 -141400 -116691 246735
8284 186458 -1679 133213 -91854 -201759 90040 -168227 173964 -1409 65856 -140791 3701
8272 -46565 19458 -297771 -84020 353019 -160187 150281 -113093 -101089 18744 -32080 -89368
8261 -89368 -144348 32936 -154200 315666 -80976 -83578 -206600 -69749 -273146 -35486 -190565
8250 -190565 -104966 97320 -110836 162302 150766 -263991 27920 -168281 72470 -46429 105279
8238 -134295 142796 -78307 71860 -250551 291850 51115 218643 -121630 -132836 -85605 -74961
8227 -74961 -218455 -159521 141066 -207325 -369143 -23587 -297459 -52583 -239315 -224336 -76648
8215 -21240 191501 -62406 -219722 214176 -60091 -101889 200521 -209324 -414082 -213006
8205 -213006 242239 22372 -49060 22199 -323579 -144541 -260167 51411 104392 39668 -213554
8193 25655 262306 114992 115555 7745 -52559 -458289 -171930 -126366 62891 -221491 -116091
8182 -116091 33665 139254 -124743 31364 42661 -187664 -35998 106879 -21537 30589 81822
8171 81822 -109199 -259 -82818 -262344 88875 -220936 -50223 -30184 -6475 -126205 -400038
8160 -400038 -290131 -11894 191042 106937 892 -60679 182628 -403080 349959 -21670 5747
8148 -108267 -220419 324713 -141094 205614 -50512 -15684 -340006 -53762 -8248 15714 -197006
8136 212590 33113 -66850 -309902 -51867 14955 -130080 -471516 -157891 -10958 -100999 -57966
8125 -57966 78684 173377 -403173 -94072 -66716 -36810 -237187 170834 443789 -113468 184896
8113 -38792 -92363 -72589 123362 -68275 -146777 4334 105129 -143542 157313 266931 43388
8101 166984 -147137 216220 -198696 31427 -213734 -110759 -193254 125440 -60092 377313
8090 -200598 88448 23763 64365 16188 -76192 14037 14466 120856 7182 254790 31301 -37014
8077 -173319 -386224 57428 -66346 -54136 27601 61033 -241848 -49144 -7867 -176105 -86982
8065 -212592 -274407 163163 -71567 96735 -49142 -37432 112580 61322 -12542 -468216 173249
8053 -223599 -120704 -287959 84333 297961 -363945 220000 162958 -296510 58271 -161056
8042 -109280 150691 199293 149800 -363333 -167441 148953 -216312 41493 -41950 -23626 -86719
8031 -86719 72273 -169817 -171575 -40830 -123633 -267849 65666 -17922 -91419 -333726 217786
8019 -43481 -237971 46004 -18867 358432 -212892 -272919 -200136 -180799 239002 -86224 97295
8007 -68044 -47322 -6248 282804 262698 152821 15728 -57446 -18558 -59649 -238603 -1756 295935
7994 67698 119405 -195531 -81559 95444 -117079 -164338 50542 -183471 -193605 -223796 -109997
7982 94025 -486307 156259 123745 29948 -171995 -14806 4197 -98353 -346792 145307 -39790
7970 -139311 30392 -19180 86708 174453 16929 -181152 -195745 -137699 -20065 -283361 -177423
7959 -177423 216628 14059 -67180 267534 -9425 150281 150937 -41614 -143923 86088 -179268
7947 -272903 -158282 -258551 -15714 17579 -113349 -170452 26910 -40888 -273032 157653 -146715
7935 -31678 -14605 24779 -200171 35824 23318 52480 16322 -46760 -9954 82159 -2011 -76387
7923 -76387 52643 -1237 -210147 1716 103981 62574 170040 -86733 73167 56385 -51603 -132618
7911 -132618 -192961 548123 134057 31314 -17856 -332958 -32579 -189713 -94132 -27806 -17953
7900 -17953 -46396 -2870 -144765 193977 39644 -282 -331057 -18280 -100568 -23650 140032 38180
7887 -33870 -190243 34775 -236602 -59980 -246304 244590 -22467 -12065 52193 -76961 34431
7875 121933 152718 -266922 204144 -457858 -261744 -23685 206680 96973 -122805 -285821
7865 -285821 -200478 -444583 52803 87777 -94729 111180 -110183 -40991 -116406 -61366 82401
7853 -343698 90529 1872 -70068 -174122 109355 47622 234719 237803 -18561 -112468 116271
7841 -163518 192688 -293659 75315 -334352 -108192 54469 115795 -30519 -277538 10613 16468
7830 16468 -434373 127948 25503 330614 -77255 -185810 16723 -167266 -53123 -207908 129660
7818 -69498 18283 123402 -413302 -597296 -265143 -162470 197824 278146 138258 -4745 -322451
7807 -322451 -191467 -154083 88319 -278962 133561 -456538 -178136 96244 -31699 -241092
7797 -241092 -75186 72043 209682 51788 68597 -107495 102049 -352073 -51731 370054 -60440
7785 -77051 -198475 -205455 -155912 -155571 100647 -125925 169213 29219 -72279 270024 122926
7773 -212974 -70586 80573 72120 -85749 -48739 -53502 -67071 74965 -134345 32083 -260196 -106836
7760 -92940 19868 54277 420008 -166083 135385 -318057 -138149 352553 -69415 -23011 -245472
7749 -245472 -172117 188476 -135671 17684 246692 -15101 -61805 -166567 -15630 -63099 420806
7737 185034 145201 -109307 -206484 -43740 163289 29727 -150246 -425638 62202 -45861 71394
7725 -91016 -110211 60603 -133879 -21266 -23323 -33147 128755 92472 -95572 -59331 -88018 -31138
7712 85243 -84272 399924 123455 -331704 129767 22620 -50877 -124719 -86902 -104271 -249282
7701 -249282 193136 33707 -117647 -206032 -116403 -94354 120413 -1254 -31192 -41211 204618
7689 -122304 -76755 -327499 -42074 -64978 2388 245620 87429 96906 128563 -187993 286253
7677 -259643 14552 -96232 287996 -175065 -120553 147024 83642 -175404 248628 -254066
7666 -55286 10276 149664 -77419 -188447 -8654 174710 -156594 14270 -42150 229624 -37344
7654 -81933 -91399 -277494 -22876 -60135 -101278 146487 14553 40542 -73359 -61653 -348403
7643 -348403 -92659 100706 -422895 109873 -118574 -131265 69882 143585 -49508 16419 -93951
7631 -485316 -323251 -333223 -205255 34268 338729 -142328 65966 284648 155303 -100516
7620 -55469 82903 -73053 -193909 -242229 465513 -65336 -125428 -93151 -139328 109333 -199772
7608 -46633 75795 72932 86486 247570 -10448 -239511 -130667 -116939 -142290 -327078 124235
7596 -24232 46835 127988 -233875 -106461 -100356 -237931 -81684 -134331 -388934 1026 -15360
7584 -189892 -87300 82190 -130541 27882 -188822 41552 116846 11179 -57664 123718 -84605
7572 -21838 -442355 -114082 -192117 -20874 43891 -181101 -106464 -11258 -105271 183186 30012
7560 -354843 -123162 -209580 -149400 -82576 -192199 434367 153459 -108833 -37978 255081
7549 121947 -264625 -116940 -462241 -54922 -95759 -53314 74727 126462 -210386 -172268 -16219
7537 99998 -98615 -69210 96162 -296946 70143 113306 254410 -88671 41859 -185644 -55889
7525 -241627 160687 -161574 189932 67803 -208432 9971 66627 243417 -222915 -72780 17281
7513 -449298 -120128 187921 15657 201250 113783 163386 -56304 226902 -337781 -6645 -121617
7502 -121617 -15882 -113343 24026 18809 -37819 1347 -249082 15961 206718 -20971 -82455 88643
7489 -347694 38010 247364 -139883 132483 77696 109623 -586445 -79188 192408 356187
7479 356187 -174629 -58780 -181323 304716 -135949 -31518 -40456 -100337 -234627 75617 -165399
7467 21555 -91882 -233144 28061 165257 -166974 -377941 201361 -36360 -88157 109132 -29301
7455 307728 50866 42006 -215468 247733 184685 -8217 265744 -244937 157874 -228512 -123924
7444 -123924 357205 37956 -58149 -162029 42341 -117579 -327399 -21010 -94637 378309 330241
7433 330241 -340179 238147 -124110 -293092 -58670 -52577 -138715 146365 -189393 -504653
7423 -504653 -184417 80620 170912 242978 -164547 -462115 -160082 75683 114808 -255933 -98764
7411 136984 103857 193540 -25552 136446 -386753 52055 5375 395310 23383 -169583 235092
7399 -93597 -260866 48734 -133531 -275743 -88001 -69066 61889 -245002 -68670 -149057 -77839
7388 -77839 -175576 -168954 -52966 -158806 -110581 -66195 71685 -316133 83473 36482 -292661
7376 115660 -142490 -89041 -161274 34556 -189388 348736 -172634 -152573 121122 -55730 -33436
7365 -33436 -20038 -183501 -44774 210318 -392684 -318254 124056 -232280 117286 -117291
7354 -20927 -142008 86416 90891 -112260 37732 -168036 154226 -44981 -155526 -124404 -218440
7343 -218440 117808 131965 -96218 109196 67437 39624 -287571 57790 -19695 72764 187467
7332 187467 79907 188776 130474 106952 -168059 74288 45495 -7428 -130367 -61172 -333606
7321 -333606 75389 172111 -780 -188635 460327 -207357 48583 151188 -168418 373911 -270541
7309 124482 -100164 307857 -138329 170547 -174922 -356003 -111071 -211469 136650 67196
7298 -117256 116087 34648 103512 267368 -80780 176732 -74462 -52293 274936 186670 67433
7286 -297608 -286945 -83114 -323542 -70268 -125415 122045 155848 140341 -75610 125587 264331
7275 264331 -262818 75277 171766 -242533 -196075 114878 -217169 -247395 38818 6986 13425
7264 13425 -49622 -164587 100153 -72965 166154 -1550 -93528 65497 101208 -106915 52752
7252 -65206 125684 -3313 -131845 -182364 197465 -4091 151206 -217014 -188625 94781 -162355
7240 226668 -188085 83455 118870 -65550 18380 6463 285288 119412 251067 -385975 -229312
7229 -229312 -30082 -116262 216312 192938 93980 -92438 1906 194419 103310 -315761 181845
7217 -122221 104212 341782 15603 -71864 -104758 -61308 94842 121545 114184 -49277 -353584
7206 -353584 -56066 -127221 -207791 -87310 109748 7586 31246 91585 -237827 -29547 -1324 3257
7193 294820 -44876 -180851 172722 -185114 -219043 428986 -121062 246522 -261132 57346
7182 -236318 402237 -141424 99466 -211661 -187579 -36867 -70288 73699 114757 -334939 -16811
7170 -340925 -21306 158852 -49216 -42949 328795 229545 -110563 -213056 170666 208408 119891
7159 119891 27201 -370747 -22036 160636 -37278 -51643 153139 -376562 -181259 -131408 10319
7147 31631 -122652 -124831 220193 -113198 -183053 252649 -241256 -16609 -134957 -95350 313938
7135 -160405 -300950 -38043 215854 -25379 54554 18317 136460 -201148 45115 -20929 -53453
7124 -53453 219553 258244 75158 -43879 241529 141251 -226187 179536 128825 -41925 -16139
7112 -40396 137620 39585 -10277 -130961 95448 380353 110134 -267841 -29710 -196832 -24998
7100 -3539 -15395 7699 119688 43965 -135698 -354106 -85041 83256 7711 -291293 -26496 -384453
7088 -384453 6254 -167310 -221659 51738 222524 91178 -190162 -52921 204107 106991 -134686
7076 -31390 -70950 -85211 -373666 152776 -286827 -54535 -4795 209272 -31395 -152861 123927
7064 -52464 -74525 70013 144763 169217 -340962 46817 -8665 -218941 -167408 -131707 -47153 -68741
7052 -68741 -90685 145053 -129281 362229 -118704 -34656 289732 -129126 6059 63192 -30929
7040 -105581 80861 206048 -135935 139173 -232922 37010 33748 -80049 -261660 -411519 92998
7028 -125796 -295637 108584 8690 95438 -65256 116958 137310 -104368 -20378 41002 145007
7017 145007 -196478 -2009 -112276 -217335 -27220 -166934 154881 36915 -42330 -146080 -136336
7006 -136336 -162152 64459 -100220 265565 -148438 74516 -155641 -51492 22435 -43348 -30673
6995 -30673 218356 214909 -209191 -150198 -234315 371248 127389 131320 124063 141459 -167377
6983 6795 -209317 128562 -115766 51375 -203963 -337970 -99559 -187072 -421192 -146099 -144772
6972 -144772 -223824 -74661 57920 25839 67080 -140790 -69603 -334676 54725 -10602 154400
6960 137182 -329841 -202991 -57603 -292500 -18539 -230863 41411 315966 8199 61086 -153276
6948 172899 -68965 18801 -74673 57656 -11495 -32798 202991 -319117 -248976 212396 -114281
6936 -139042 -249477 111752 -17079 -142011 40278 216420 36883 -269715 122170 62004
6926 62004 112192 133397 74099 -29029 78305 -14650 -138301 -35125 -7175 2313 -215098 311834
6913 239569 -60751 15525 -136265 -12960 257443 -158386 -204188 -273447 123511 163981 -6207
6901 19853 -473640 -105054 -83162 -187301 300684 4364 -402175 45608 -6349 -72505 61964
6889 256918 88460 -130563 -124460 50876 -28931 66198 96805 -142385 -197828 -296163 5617 53141
6877 53141 71328 129937 -152652 83344 17856 -115648 52377 66426 318158 -263248 6899
6865 111650 174614 240851 125049 66305 102684 -24486 -98300 139312 13891 161436 243008
6854 243008 -145103 63520 156913 -44833 247923 223688 209997 314910 158077 233202 -186541
6842 -33940 108606 66512 97698 163071 164674 -37159 86591 199290 -112367 -174400 -48133
6830 3371 -66711 -347475 316279 206174 -124705 -172154 30070 82351 -230304 147835 -34349
6818 125846 -160664 93255 -94572 -50048 -134792 -48909 234768 -57769 -166124 109478 -25400
6806 -259866 49090 -465189 160419 160766 -24692 40453 -244227 -165109 -9452 129990 -77873
6794 58220 105892 -157233 25058 -149049 -33991 -87056 -177084 129939 35988 -38051 -210634
6783 -210634 -108848 -46895 148136 -13530 113702 40628 -124493 31447 -102826 -115905 -217171
6772 -217171 -9165 -23629 48133 -230515 382847 -27316 121156 -25822 -122858 224779 -252912
6760 226960 -322852 30071 108752 -174181 134351 -72933 -108614 108244 -66624 112473 -164081
6748 -56269 7720 -46546 -130225 62375 -36446 36973 -127217 185640 -24862 50114 -216604
6736 -120768 -214704 59493 -80658 -41620 19750 -288212 18747 -26605 -101237 -80432 -42685
6725 -42685 -102448 193588 142617 23299 -44582 -6499 -280661 129164 1742 -58349 71590 -230077
6712 -119148 36931 -108324 252502 55772 244222 -98967 318807 120591 -358626 162439
6701 65685 153269 -144209 5459 147278 -59252 67887 -163599 -171449 -45062 83487 100619 -388868
6688 58334 -172644 97926 -297702 173088 93307 248727 134532 184729 141924 -293677 -111009
6676 -89197 225373 -175560 -13997 -164909 -15576 39434 173774 -200770 59824 145541 -91902
6664 -171181 140834 159342 8308 95849 -44549 -56180 119429 52392 38974 -140339 317052
6652 227551 232678 -256817 -74705 79721 -62464 11139 -33385 -150674 -8056 -280281 -99964
6640 -131629 -36880 207762 60153 -191110 -1135 -31352 -115450 -291609 199793 33431 27358
6629 27358 2624 -58563 81992 282482 -12715 208902 -33291 135735 -120908 -35840 150091
6617 -162725 -78915 51964 36094 -84869 -11854 -142687 -25360 212311 -118245 -115483 106971
6605 -30999 -70182 -273473 -45085 255817 -64260 -169993 -201251 273435 -77217 -176600 -50588
6593 44121 224788 -9813 -71231 13303 137674 114698 -159142 5303 -333282 199823 -142150
6581 -46970 152610 -166748 197654 -102008 -257337 -213036 1872 229496 -220138 120123
6570 -63289 58017 -109914 -267281 -89143 -92045 -95435 -98980 87557 -214359 93341 162212 -77382
6557 110372 -12826 -74191 -224236 113518 -27636 1795 -217772 107518 -127532 -438743 36697
6545 59647 -254379 -190905 -63779 -118908 77811 87451 34771 305393 46985 141692 247491
6534 247491 -73956 111953 44704 374026 -325578 78322 49357 -410446 -2075 -121059 -51247
6522 330092 -227033 -242277 -168427 -305472 295049 -233884 36768 164525 -136139 -17954
6511 -10438 -11812 188219 8454 -97197 84503 -155169 91019 -81353 -176707 -107023 -30789 88634
6498 -104231 225705 169289 26630 237860 -38379 -122822 211103 83316 -183122 -71205 394180
6486 -63216 -133355 -207067 -417677 -142398 -136894 -144025 36816 65876 -91519 159830 -204256
6474 6210 -117259 46443 49058 -50287 -124023 -22021 74368 -54686 -76784 22077 -220240 295988
6461 -269273 -263849 -183994 205783 -60967 76221 -48778 -11063 -108602 -265035 -45164 -196614
6450 -196614 57941 -158141 -78480 211745 -165864 256567 89191 -97785 70448 341756 -320387
6438 169072 -10450 -360096 109509 63293 -99410 276117 -238948 -297788 129584 251850
6428 251850 -88369 88023 -286142 529101 -73805 43794 159422 -234045 252789 -254438
6417 -277410 94645 111286 -75370 376503 -285597 -770 -224426 -172703 11175 -30388 123948
6405 -170060 -203797 187434 17460 -147595 57343 -213830 75796 -80371 22292 -77816 149212
6393 199732 110124 277107 -77790 146196 99236 52235 44348 77635 -204807 -197845 98850
6381 -426790 -98421 78924 82410 278385 -2600 -209756 -156631 -36234 116073 160187 61795
6369 -279157 47211 71129 22960 -233336 109670 9140 168938 -116932 -117445 -407481 84027
6357 19315 191114 131213 -128603 -15417 -119089 114381 -31669 -191169 -46420 235324 188895
6346 188895 24785 -112588 100293 -166819 138527 -311565 -65876 -12395 34689 13963 97930
6335 97930 -130737 -198217 -79453 139210 -197567 136615 115194 -153569 45371 -39237 205186
6323 230333 25223 -161179 226422 -130589 188813 24843 -80233 -267843 -9138 25064 43043
6312 43043 -234511 -99635 -372602 24842 72940 265038 -149489 183519 -55786 138511 -133328
6300 229816 -108519 269101 195333 -329162 -17859 -44198 151565 83686 -21389 343196 -94397
6288 33536 165755 31889 -97069 -180685 44199 -16854 194051 20763 173630 4179 42638
6277 42638 184455 108762 141782 219229 -84391 -78996 235273 5923 -126169 -58804 -92317 -258708
6265 -258708 249835 44933 -307817 259224 -126139 -161464 21431 -122623 -21348 105972
6254 252872 72355 127611 34288 100714 -17657 -156685 130851 -49826 -388110 74454 -159764
6242 228713 -153019 -247468 76060 -384422 27131 85211 -12378 -212541 -67533 335005 46273
6230 57865 -200072 -2312 -10636 -56545 72724 -28639 -31470 282573 150513 57531 16937 -531758
6217 143229 52981 240931 -23802 265002 56475 175453 -1223 -197602 -76567 73154 183455
6206 183455 -9417 11524 -152792 -110932 -42382 125831 12533 -68109 -30220 124540 -177783
6194 -150321 -26717 -29226 -95160 3331 -18730 202497 163648 -108967 -108669 -81973 164090 -347361
6181 -6468 -89119 106431 185967 86040 -28779 136917 -118341 -241810 -206528 38243 -266111
6169 -237193 201683 201309 24639 214294 151629 -196532 528267 140522 352551 -369849 -97915
6157 -69366 -53228 -98042 63919 -150704 -83147 116398 272488 -227437 90419 13132 231098
6146 231098 -156760 77034 57168 309249 -151222 45744 55296 -65281 -76642 -197094 69557
6134 130026 111119 33269 95512 11517 -128680 465 -20668 -249440 -63571 27069 -31199 -165704
6122 -165704 -43604 -81264 239731 312402 14869 -212569 -21837 -72749 -188336 -100983 89607
6110 54116 354121 -46316 235733 12064 -105895 -208061 224899 -297 190619 -99157 -160486
6099 -160486 -247115 74664 -41864 -270418 9419 -168866 -186006 121452 -71233 -135258 167627
6087 -194108 78040 -118871 230761 -225719 -224923 19899 93429 -225433 -236636 -242620 242613
6075 73242 29503 9356 55318 -358386 150272 213508 44657 138155 47421 10731 -212149
6063 -212632 -99012 -127631 52806 118431 -69030 95034 -158623 360809 -390041 79920 184456
6052 184456 -83085 44608 -65123 -63323 12454 66227 -214022 -196642 -11248 4569 -127037 -166213
6040 -166213 143979 588 189929 487196 47879 -163083 -182089 214324 117 -146749 -26765
6028 129640 182777 -247409 -310827 -135302 -16824 56227 -107711 287819 99094 -33180 -291306
6017 -291306 265270 -40119 -305174 -98947 201805 271975 51043 -10671 665388 -199292 -149024
6006 -149024 -57924 -23387 193294 7291 -132365 -25075 34615 -23499 103400 -32818 44006
5994 107168 -31604 93544 144391 -122065 199183 -230554 -81721 90438 -57520 54606 -22250
5982 -158827 -142262 177395 -29314 -58683 174185 -94035 -67295 184172 139424 197975 -167247
5970 46862 308035 -166079 211689 250172 -295358 215103 -253349 74977 -99704 111628
5959 15957 -36587 -150371 9610 -105284 -98464 -83865 -86369 291154 237427 98022 -91912 65815
5946 21098 -26495 74076 76725 -57045 211096 -14998 -272016 -3221 -430255 -221845 77251
5934 -15495 8904 172377 -205583 43511 -165058 140365 -207850 -13839 27473 156774 113251
5923 113251 142950 -90818 154013 -161812 27488 -27429 -232526 -21862 -127532 42678 -92155
5911 122728 124882 146829 50222 -126510 -273524 126298 -324598 132468 176440 -24610 6311
5899 -29503 93065 -213190 -129310 -195421 42833 -55404 111750 -308379 -697 -111441 93669
5887 135489 524287 83169 316667 63463 -16138 80466 104559 -156883 -40724 -97018 -51356
5876 -51356 163010 -116491 44428 -129352 -19211 -419175 -223551 157517 172112 -127194
5865 -147663 252047 -153486 -132304 44026 113170 -101782 -786 325732 314165 -64803 -165808
5854 -165808 -198198 -50531 28919 -245387 150198 92500 -199443 -340051 3686 379049 -21946
5842 16569 133879 22577 30525 269653 70257 318379 -413641 1923 164818 58169 97874
5831 97874 -285801 151258 30178 -135507 212219 -57369 12213 329743 13300 -102653 -421914
5820 -421914 -33622 17411 127556 -418086 -93433 85317 -129062 -90962 314576 -40680 93236
5808 193440 -247629 38623 -91640 -151494 -21419 -252193 110061 174649 -329516 186363 127515
5797 127515 -169622 214903 6262 -175838 81744 -184307 156708 23676 109574 47964 -41845
5785 99214 -211446 243185 -160846 -114535 61011 -70328 -14198 -335449 -128028 5718 4014
5774 4014 -191440 -101162 18009 -110853 178829 266637 280373 98841 -85202 49510 -127798
5762 -152592 -153940 149260 126927 -104451 -7309 220214 117694 73946 51323 98701 -184104
5750 12548 -56377 141961 28226 202273 -87922 -104478 96041 225909 402016 -138116 -67110
5738 -88186 41269 -13796 -35384 -50077 546075 177443 -143707 106359 30501 -182430 -185205
5727 -185205 18020 50402 -227854 -147660 2432 146124 98599 206367 4089 -20162 -9671 -123019
5715 -123019 -47830 -187668 -54516 186198 256894 -43231 -299372 -253606 -47563 91567 68138
5704 68138 -186416 237415 -279048 -8445 29244 -109599 207219 14290 -252791 186538 -62596
5692 158014 377673 -7866 209063 23166 27800 -18364 181216 301340 -205571 -278228 72097
5680 20970 48772 -101977 5622 73818 -63983 -192205 48577 -193909 42361 -122267 54966
5668 311354 169467 59972 -232666 214974 -103647 433303 48832 -354894 -32686 35411
5657 102407 -109596 -267847 -121138 -248328 9332 122493 237051 -282474 33787 92790
5647 92790 3112 -222553 60563 -85958 73030 2582 60056 -80429 -33904 56881 87069 414116
5635 414116 -98383 129369 168954 165519 -111464 -304008 -118266 306887 -119368 -106349 -299023
5624 -299023 68627 -224876 104743 2125 -53896 -218075 -20158 -44760 -191810 205707 4648
5612 43742 -26150 300006 -162852 44471 -72808 252201 15121 97709 94992 -44300 -96715
5601 -96715 -144354 528142 40617 129497 -195547 158423 190446 15352 5920 65093 197275
5590 197275 -75374 28269 81051 37262 105890 77811 -122967 61167 140553 -43887 191298
5578 -52518 115162 3196 -127675 -181618 -61486 -252366 -3837 -148267 130765 18921 -189556
5566 -219322 -89777 -21920 -284421 -55373 41770 -104006 149009 -139884 -63278 292287 2525
5554 67620 -289350 -70955 98331 15811 -258146 -82410 122041 48378 288102 -226538 241662
5542 -82403 319164 21266 -62411 103999 -79342 -186643 289530 -54149 80237 235689 223637
5531 223637 -248026 -53886 -127631 79599 -332014 -173143 62645 -12100 135486 -124721 132826
5519 -157845 132329 -12250 83379 -93441 193489 -231387 203797 -231908 190238 -32387
5508 -170934 193548 170268 60809 -72596 422862 230378 -314202 -131511 -63644 128437
5497 292234 -36921 1170 -168611 -22633 186226 314680 162707 4718 145829 -71395 83063
5485 45045 7877 -75142 -51543 56297 325818 -17937 86309 -125991 55370 -45058 143867
5473 -271418 -131256 -21759 210022 -208928 -93236 -15601 -421 116946 -49115 140720 -19259
5461 286432 -19981 -41600 -49709 76349 -2136 188179 4617 31648 208880 539958 277360
5450 277360 263215 -367850 200056 -95890 -42702 -32401 91339 177696 -92141 -116014 66823
5438 46987 -160579 -204140 -442286 5558 -218969 -37809 138250 -6464 -241684 -230885 -117201
5427 -117201 111813 -168028 -7476 -24440 -379552 -101277 159741 430757 -434252 -179444
5416 3755 -341024 328663 80388 -76250 367586 140028 133941 9304 134920 477183 -219016
5404 -96020 121404 37455 206430 -71020 -234386 190347 51928 35777 385488 -24321 85562
5392 -16633 243370 59690 76652 -17736 70146 295899 -7649 -334801 -47 -272664 17518 -284352
5379 -58207 140582 12404 78433 228943 2489 21926 173025 -31589 -182889 39113 -95073
5367 305222 -77600 -186491 344488 -527121 30844 -34855 -221757 109658 19150 -346846
5356 59911 -53453 69539 -79613 35841 -110548 78359 46286 -146749 -2091 -18530 -104340 -88283
5344 -88283 116750 86930 -265395 -540434 252906 464847 35852 3983 195356 -12120 -93299
5333 -93299 131969 283253 -152544 94442 -21863 -341296 47999 90016 39551 -154095 291932
5321 344154 -102256 186822 -201923 77596 -3708 -149175 108348 -101356 -45417 -214963
5311 -214963 -9963 -199335 158978 -171585 -90185 -122122 347495 -82792 -4216 220025 389571
5300 389571 -91985 -72839 139756 133571 -89143 28935 41260 86029 -83462 -640 317050 114155
5287 -42466 3045 93683 -74891 32670 2187 -269909 116545 -74434 198308 -295525 -15708
5275 132583 -45236 -240133 -16700 -3074 19789 -373161 -378150 87667 124002 336205 139126
5263 97451 333203 -111628 154986 -69597 -89943 165573 -91158 -101511 -109109 -329977 119854
5251 -37957 4728 57402 -98584 1303 67994 -92805 19355 -92814 -190720 -53147 -140781 -33744
5238 -71877 2769 113049 4542 90585 -69480 -216769 -38565 -284565 -486343 -244402 191540
5226 147518 -47646 -46878 159752 133139 -312222 194104 67354 80409 183670 161606 74081
5214 -272926 9534 187256 -86630 -184939 -47550 -53910 158029 430552 -280549 78457 -109574
5202 20165 -114889 -119226 -92079 140607 -154138 121970 178591 4830 150961 57194 12673
5190 -259601 127307 282696 -291987 -101240 -329278 246717 -119917 253300 -406063 440185
5179 106217 246522 94716 -85382 -262374 -56942 -45758 89019 -289489 -131170 55404 253291
5168 253291 -346670 103599 461687 56447 131450 216414 -13630 -393778 -329741 -172070 55082
5156 172009 -433608 170087 -130722 218993 71822 -72309 230093 194565 188762 -230078 -192127
5145 -192127 -179254 -169782 -224748 19107 -117921 3435 131782 187184 -235930 217262 125895
5134 125895 4649 83151 30095 296306 243539 10484 -329795 261563 291946 11267 -77239
5122 271675 -99969 -107744 379391 -35932 56844 -309040 -27598 223715 67785 269891 -101317
5110 78542 235999 18144 23234 -275086 32954 -64011 -88155 -76647 44211 -141922 -221502
5099 -221502 -26025 -118516 314671 40941 -151152 -1083 -4676 59243 402084 -210614 -211177 84429
5086 -29772 -101768 321094 -426368 11583 -33939 439412 -34212 416895 253435 25131 209852
5075 209852 -14442 -11871 -270004 -508 62285 132164 25968 1006 -166073 163580 16568 133702
5063 133702 -149491 -6463 111468 99135 63468 4093 72743 71977 41824 230668 -136236 68488
5050 -35753 23413 -367970 -140632 -130212 -249489 -8895 206631 -182844 150787 -24338 47970
5038 -12925 49169 -10866 -313818 39351 21245 193627 -156664 -37034 -210710 271660 26186
5026 -21493 -209820 169207 -91604 99995 131101 -32449 -315967 -197091 170859 -540509 346308
5014 -25142 105575 20054 -289243 35673 29383 -37441 -208982 -35680 -301809 -199924 -61428
5002 -225314 -162622 -166939 -115423 64072 96046 224148 38137 35569 -3459 251318 52336 106861
4990 106861 33375 -37980 -23550 -195082 -389866 -122861 -98711 -248872 209416 191508 75893
4978 -166371 25580 -293579 -205678 -21744 -96200 184650 -88522 -18490 -106838 235871 175676
4967 175676 318551 81787 -435837 -24903 231940 -145521 282051 -19572 -285642 161874
4956 -336403 161739 48497 72408 -234313 88103 -72874 -173144 -30547 97994 -14969 124337
4944 -106406 -269363 -52084 197130 129935 -45978 -2406 -51855 70173 153198 85096 -30884
4932 -91439 -311021 101891 157574 -43632 -86402 152606 146092 25251 251717 -112132 -226504
4921 -226504 -123213 -160733 74687 -39474 -117006 60098 -231801 -79787 30160 -52860 194819
4909 30975 -108308 22595 -263708 134828 381083 69365 63110 -233483 -295795 -279133 -24749
4897 303129 -268434 126866 16287 -304982 -267994 -159769 -118636 1107 -290422 -98242 113688
4885 134263 27856 212484 2810 -64034 -188605 46787 -317563 82265 -182376 120307 -60238
4873 -84360 50057 50381 193969 44811 -211438 140029 284274 -98587 -162994 92512 238477
4862 238477 90349 -57811 -157919 -43879 -163178 -108289 -220534 17975 -24452 -58953 -33363
4851 -33363 -8640 9756 152434 -203364 124944 145540 261318 -206340 -42308 73788 -226131
4839 -78722 90664 -50151 64030 -74498 144151 315912 235970 -45072 -281019 -228578 33835
4827 -182003 215305 131415 -132954 -175802 153837 -109586 -241469 -141621 -134126 133925 66497
4815 172480 139624 -138820 -130009 53000 -168663 278378 -461767 -13957 -50040 -42316 -314473
4804 -314473 -180797 -109137 76924 -110556 141457 -130623 60157 317136 -365011 36487
4793 -107640 -322403 1030 222098 -293677 228679 -251236 -171555 -7124 -40044 201234 57992
4781 -99130 -87404 151658 200748 108863 108959 -354231 326800 197149 -73613 280555 240725
4770 240725 -229883 170478 -52654 -136899 122169 120125 -24654 -154462 157858 179089 -19312
4758 -228676 322878 -179392 -196015 -105261 86978 -99684 -156968 -266753 110166 79441 -102689
4746 166673 -250725 63435 -103251 35235 181986 69611 -342377 408047 -172488 -122058
4736 -122058 -19806 244113 379688 -235652 235614 -101237 229346 -48133 43163 84497
4726 84497 -241491 -549351 49480 100786 -310918 -93405 -314660 -16049 36700 151068 -3546
4714 310397 273626 38545 49291 188956 226932 297683 52286 -136221 -134922 55030 -61095
4702 -292514 269943 361545 401182 43708 178939 -42572 -175782 -155797 -35537 -137756 -359981
4691 -359981 -68948 -334058 -192219 80878 -29961 186818 -78005 153098 -162112 232212
4680 101241 22288 288475 74732 80539 -313558 -88842 208063 165307 188355 187355 18218
4668 173901 -74135 -330242 -28188 101474 12388 106531 -94079 55910 259697 -283694 125606
4656 -7458 197168 -71311 -178244 179147 -35292 -271672 20702 40612 152246 -4048 -23222
4645 -23222 48701 75535 -147541 -61526 64877 115405 47260 -290948 -18500 23658 249162
4634 249162 233138 -161067 -149962 -100428 184559 288499 85349 -200537 -130990 52186 370460
4623 370460 -83499 -100914 -102991 -53644 -380651 -30611 -266148 88900 155522 425352 35699
4611 -127862 -66107 46945 -65987 103787 -9337 -256470 210578 -13044 294015 139095 -92951
4599 17173 -17851 54778 -40005 200932 406042 -46501 -150039 -36695 -4210 -168531 48822
4587 276299 74644 175127 -25292 -2074 -78985 -38638 -49187 -202088 -150620 48084 82592
4576 82592 160623 174326 -187633 -37612 -219904 -46384 -152817 -188048 -19733 16988 49485
4565 49485 379862 -44188 215380 108994 -132649 69538 115596 -18272 195003 -58217 201231
4553 -25139 94327 -146517 3595 112621 -146403 120968 122714 -259860 4796 164033 10894
4541 77959 102699 -2638 295905 -2981 -155540 20589 -358793 -258423 -117725 -42071 -147041
4530 -147041 -195985 86539 -90230 23438 53639 86322 -153900 203859 -72401 127894 137219
4519 137219 226969 142015 -140042 47632 -68666 -187041 142660 69435 172597 -64505 194454
4507 -210111 -242317 12931 298842 191414 211771 -60567 -1651 15100 313672 -186160 112861
4495 257376 107672 263656 2327 -213701 -62994 -110956 43140 -445418 -155550 202850 53753
4483 -112266 263836 12088 185488 -271676 35977 -23022 -47615 -67194 -135384 38930 -87403
$$ [...]
##END NTUPLES=NMR SPECTRUM
##END=
