
##TITLE=AC1145_Valledupar_5874472_T1F9qT1H9u
##JCAMPDX= 6.0         $$ Bruker NMR JCAMP-DX V2.0
##DATA TYPE= NMR SPECTRUM
##DATA CLASS= NTUPLES
##ORIGIN= BRUKER
##OWNER= Administrator
$$ 1.72 TOPSPIN		Version 2.1
$$ 2012-03-31 14:57:30.312 -0500  Administrator@TOPSPIN
$$ Compression mode = diff/dup
##.OBSERVE FREQUENCY= 400.13188235
##.OBSERVE NUCLEUS= ^1H
##.ACQUISITION MODE= SIMULTANEOUS (DQD)
##.ACQUISITION SCHEME= undefined
##.AVERAGES= 8
##.DIGITISER RES= 22
##SPECTROMETER/DATA SYSTEM= spect
##.PULSE SEQUENCE= zg30
##.SOLVENT NAME= COFFEE_meoh
##.SHIFT REFERENCE= INTERNAL, COFFEE_meoh, 1, 14.98061
##AUDIT TRAIL= $$ (NUMBER, WHEN, WHO, WHERE, PROCESS, VERSION, WHAT)
$$ ##TITLE= Audit trail, TOPSPIN		Version 2.1
$$ ##JCAMPDX= 5.01
$$ ##ORIGIN= Bruker BioSpin GmbH
$$ ##OWNER= Administrator
$$ $$ C:\Bruker\TOPSPIN/data/COFFEE/nmr/AC1145_Valledupar_5874472_T1F9qT1H9u/10/pdata/1/auditp.txt
$$ ##AUDIT TRAIL=  $$ (NUMBER, WHEN, WHO, WHERE, PROCESS, VERSION, WHAT)
(   1,<2012-03-31 14:57:19.750 -0500>,<Administrator>,<TOPSPIN>,<go>,<TOPSPIN 2.1>,
      <created by zg
	started at 2012-03-31 14:56:12.687 -0500,
	POWCHK enabled, PULCHK disabled,
       configuration hash MD5:
       1A 1E CE 29 27 FD 77 03 67 4E F0 E3 C4 B2 CB 90
       data hash MD5: 64K
       1A 50 87 12 B0 B9 BA 1E CC 13 83 E3 FC 53 83 F9>)
(   2,<2012-03-31 14:57:25.265 -0500>,<Administrator>,<TOPSPIN>,<proc1d>,<TOPSPIN 2.1>,
      <Start of raw data processing
       efp LB = 0 FT_mod = 6 PKNL = 1 PHC0 = 0 PHC1 = 0 SI = 32K 
       data hash MD5: 32K
       EC 78 E9 EE DA 6F BA D6 AA 77 74 C8 0B E0 CD B7>)
(   3,<2012-03-31 14:57:25.843 -0500>,<Administrator>,<TOPSPIN>,<proc1d>,<TOPSPIN 2.1>,
      <pk PHC0 = 218.3588 PHC1 = 0 
       data hash MD5: 32K
       0C 7E 41 5F D2 14 B4 CC CC 43 8B BD 03 1C 8D 6A>)
(   4,<2012-03-31 14:57:25.937 -0500>,<Administrator>,<TOPSPIN>,<proc1d>,<TOPSPIN 2.1>,
      <abs ABSG = 1 
       data hash MD5: 32K
       8D 4F EB 2F C9 74 B6 87 33 C5 6E DB 52 29 BB 76>)
(   5,<2012-03-31 14:57:25.968 -0500>,<Administrator>,<TOPSPIN>,<proc1d>,<TOPSPIN 2.1>,
      <abs ABSG = 2 
       data hash MD5: 32K
       88 75 DE 0B 8E 6F 63 97 7D D4 66 E7 89 E0 1C 24>)
(   6,<2012-03-31 14:57:26.000 -0500>,<Administrator>,<TOPSPIN>,<proc1d>,<TOPSPIN 2.1>,
      <abs ABSG = 3 
       data hash MD5: 32K
       93 D3 67 16 01 4F A1 9F 97 B7 48 A5 F5 24 60 FD>)
(   7,<2012-03-31 14:57:26.031 -0500>,<Administrator>,<TOPSPIN>,<proc1d>,<TOPSPIN 2.1>,
      <abs ABSG = 4 
       data hash MD5: 32K
       6E 05 D9 24 5C EC 27 0A 81 EF F3 F5 8F A3 D8 36>)
(   8,<2012-03-31 14:57:26.078 -0500>,<Administrator>,<TOPSPIN>,<proc1d>,<TOPSPIN 2.1>,
      <abs ABSG = 5 
       data hash MD5: 32K
       38 07 CF CC 65 1A 79 34 F0 54 32 BD 5D 09 E5 97>)
$$ ##END=
$$ 
$$ $$ hash MD5
$$ $$ DA 79 91 13 60 2B 3A 29 8F 2A 18 3F BC BB 45 4B
##$RELAX= 
##$RELAX= 
##$RELAX= 
##$RELAX= 
##$RELAX= 
##$RELAX= 
##$RELAX= 
$$ Bruker specific parameters
$$ --------------------------
$$ [...]
##$TP= (0..7)
150 150 150 150 150 150 150 150
##$TP07= 0
##$TPNAME0= <>
##$TPNAME1= <>
##$TPNAME2= <>
##$TPNAME3= <>
##$TPNAME4= <>
##$TPNAME5= <>
##$TPNAME6= <>
##$TPNAME7= <>
##$TPOAL= (0..7)
0.5 0.5 0.5 0.5 0.5 0.5 0.5 0.5
##$TPOFFS= (0..7)
0 0 0 0 0 0 0 0
##$TUNHIN= 0
##$TUNHOUT= 0
##$TUNXOUT= 0
##$USERA1= <user>
##$USERA2= <user>
##$USERA3= <user>
##$USERA4= <user>
##$USERA5= <user>
##$V9= 5
##$VALIST= <valist>
##$VCLIST= <CCCCCCCCCCCCCCC>
##$VD= 0
##$VDLIST= <DDDDDDDDDDDDDDD>
##$VPLIST= <PPPPPPPPPPPPPPP>
##$VTLIST= <TTTTTTTTTTTTTTT>
##$WBST= 2048
##$WBSW= 25
##$XGAIN= (0..3)
0 0 0 0
##$XL= 0
##$YL= 0
##$YMAX_a= 532697
##$YMIN_a= -627362
##$ZGOPTNS= <>
##$ZL1= 120
##$ZL2= 120
##$ZL3= 120
##$ZL4= 120
##$ABSF1= 14.98061
##$ABSF2= -5.57192
##$ABSG= 5
##$ABSL= 3
##$ALPHA= 0
##$AQORDER= 0
##$ASSFAC= 0
##$ASSFACI= 0
##$ASSFACX= 0
##$ASSWID= 0
##$AUNMP= <proc_prof1d_extract_pilot.lims>
##$AXLEFT= 0
##$AXNAME= <>
##$AXNUC= <1H>
##$AXRIGHT= 0
##$AXTYPE= 0
##$AXUNIT= <>
##$AZFE= 0.1
##$AZFW= 0.1
##$BCFW= 0
##$BC_mod= 0
##$BYTORDP= 0
##$COROFFS= 0
##$CY= 15
##$DATMOD= 1
##$DC= 0
##$DFILT= <>
##$DTYPP= 0
##$F1P= 0
##$F2P= 0
##$FCOR= 0.5
##$FTSIZE= 32768
##$FT_mod= 6
##$GAMMA= 0
##$GB= 0
##$INTBC= 1
##$INTSCL= 1
##$ISEN= 128
##$LB= 0
##$LEV0= 0
##$LPBIN= 0
##$MAXI= 10000
##$MC2= 0
##$MEAN= 0
##$ME_mod= 0
##$MI= 0
##$NCOEF= 0
##$NC_proc= -8
##$NLEV= 6
##$NOISF1= 0
##$NOISF2= 0
##$NSP= 0
##$NTH_PI= 0
##$NZP= 0
##$OFFSET= 14.98061
##$PC= 1
##$PHC0= 218.3588
##$PHC1= 0
##$PH_mod= 1
##$PKNL= yes
##$PPARMOD= 0
##$PPDIAG= 0
##$PPIPTYP= 0
##$PPMPNUM= 2147483647
##$PPRESOL= 1
##$PSCAL= 4
##$PSIGN= 0
##$PYNMP= <proc.py>
##$REVERSE= no
##$SF= 400.13
##$SI= 32768
##$SIGF1= 0
##$SIGF2= 0
##$SINO= 400
##$SIOLD= 32768
##$SPECTYP= <>
##$SREGLST= <1H.CDCl3>
##$SSB= 0
##$STSI= 32768
##$STSR= 0
##$SW_p= 8223.68421052632
##$SYMM= 0
##$S_DEV= 0
##$TDeff= 65536
##$TDoff= 0
##$TI= <>
##$TILT= no
##$TM1= 0
##$TM2= 0
##$TOPLEV= 0
##$USERP1= <user>
##$USERP2= <user>
##$USERP3= <user>
##$USERP4= <user>
##$USERP5= <user>
##$WDW= 1
##$XDIM= 32768
##$YMAX_p= 475540618
##$YMIN_p= -740399
##$CURPLOT= <Network HP LaserJet P1505>
##$CURPRIN= <$Network HP LaserJet P1505>
##$DFORMAT= <normdp>
##$LAYOUT= <+/1D_H.xwp>
##$LFORMAT= <normlp>
##$PFORMAT= <normpl>
##$SURQMSG= 1
$$ End of Bruker specific parameters
$$ ---------------------------------
##NTUPLES= NMR SPECTRUM
##VAR_NAME=  FREQUENCY,     SPECTRUM/REAL,   SPECTRUM/IMAG
##SYMBOL=    X,             R,               I
##VAR_TYPE=  INDEPENDENT,   DEPENDENT,       DEPENDENT
##VAR_FORM=  AFFN,          ASDF,            ASDF
##VAR_DIM=   32768,         32768,           32768
##UNITS=     HZ,            ARBITRARY UNITS, ARBITRARY UNITS
##FACTOR=    0.250966925370066, 1,           1
##FIRST=     8223.43324360095, -195875,      28885
##LAST=      0,             132765,          179848
##MIN=       0,             -740399,         0
##MAX=       8223.43324360095, 475540618,    0
$$ Real data points
##PAGE= N=1
##DATA TABLE= (X++(R..R)), XYDATA
$$ [...]
19469d20863b9043q0546j24324h5036C27263b45810a5193B87251J7979a5396A26030
$$ -420863 -29043 -109589 -233913 -85036 327263 -245810 -15193 287251 305230 -15396 126030
19457F1526d5753p2854I4861c70736O7813c1818m3146j39181D948c8866d695k6598
$$ 61526 -45753 -118607 94861 -370736 -302923 -31818 -74964 -214145 4948 -38866 -4695 -31293
19445c1293A78346a69688j28145B11466a05753C4610i3556A49502b03192B49661
$$ -31293 178346 -169688 -297833 211466 -105753 34610 -93556 149502 -203192 249661
19434b54726i752E6927P4004D9649f7724I3516b88099d5753C4277M2379b01196
$$ -254726 -9752 56927 130931 49649 -67724 93516 -288099 -45753 34277 76656 -201196
19422G9571D129a02100L3636q3858B10954c56174a51006M8598A6906K25606B4276
$$ 79571 4129 -102100 -68464 -152322 210954 -356174 -151006 -102408 16906 242512 24276
19410a40658A02623B2994b39058C82167d5506k12054R814A41021m3753a42320
$$ -140658 102623 22994 -239058 382167 -45506 -257560 -247746 141021 97268 -142320
19399C22013F6615J1906h2736C62530C6568R9785G587M8731b20093A76291d85246
$$ 322013 66615 78521 -82736 362530 36568 136353 7587 56318 -220093 176291 -485246
19387c1388C7746N0000c80775c6400a5859k88337m439E2200J86316A04041d85553
$$ -31388 37746 87746 -380775 -36400 -15859 -304196 -308635 52200 238516 104041 -485553
19375A4156c69801g0144J2726K0441j22747I1356G123N1124b19561Q1308G4441
$$ 14156 -369801 -70144 -57418 -36977 -159724 91356 7123 58247 -219561 -138253 74441
19363b48422a02874A68442d1586E8734a36797e1729F5110a20125r3701m5214i2090
$$ -248422 -102874 168442 -41586 58734 -136797 -51729 65110 -120125 -213826 -259040 -92090
19351I0740b53018Q4195c2969k4317A26409a04097A03301c55961P4877i0311m3420
$$ 90740 -253018 -168823 -32969 -57286 126409 -104097 103301 -355961 -281084 -90311 -133731
19340a33731j23769g6365a9198B364h6456D2355a65067n3316n7336B44775a28011
$$ -133731 -257500 -76365 -19198 2364 -86456 42355 -165067 -218383 -275719 244775 -128011
19328b41642D8654a53287B9529b38426c9448E7498c34490n3382b5005j24741A53494
$$ -241642 48654 -153287 29529 -238426 -39448 57498 -334490 -387872 -25005 -149746 153494
19316f4268o5184k17785a16090C9097K6696b91106B09264d72160C05356a36415
$$ -64268 -129452 -347237 -116090 39097 65793 -291106 209264 -472160 305356 -136415
19305A54904R3612r1616h5524A48984c20657k5367J70516b87n10776F847c41215
$$ 154904 248516 156900 -85524 148984 -320657 -346024 -175508 -287 -511063 6847 -341215
19293H9255a79889M9418o7013M8214j52956A06062c62799i4554n26194i9732l8430
$$ 89255 -179889 -130471 -197484 -149270 -302226 106062 -362799 -94554 -620748 -99732 -138162
19282a38162j3966o6861P0643O4789r784c3933A20345f7972C1724a35061E3697
$$ -138162 -152128 -218989 -148346 -83557 -93341 -33933 120345 -67972 31724 -135061 53697
19270B6284a36530K4323j2666j22384O3439H9119a02661k99368d5114A98442b52086
$$ 26284 -136530 -112207 -124873 -247257 -183818 89119 -102661 -402029 -45114 198442 -252086
19258h5739A73721c0767B1508K28887a01974j59741c9788k11594j37593A09703
$$ -85739 173721 -30767 21508 250395 -101974 -261715 -39788 -251382 -388975 109703
19247B52695a49050k91646b16504o8483J27135a1868k36684j23360A06959b79973
$$ 252695 -149050 -440696 -216504 -284987 -157852 -11868 -248552 -371912 106959 -279973
19236H1395K27841e0935j3256l17945D31760c5863o3280j9796C7770a52025J2085
$$ 81395 309236 -50935 -64191 -382136 431760 -35863 -99143 -118939 37770 -152025 -139940
19225a39940G3018g7797F5610a89640O8125r9124B19165j900G3832b86278R196
$$ -139940 73018 -77797 65610 -189640 -121515 -220639 219165 217265 73832 -286278 -277082
19214b77082m9722b827j75031A19873C5772O2581b60126a4693m14238b02654i4945
$$ -277082 -326804 -2827 -177858 119873 35772 98353 -260126 -14693 -428931 -202654 -94945
19202b12698a2048o551j25103A4420g3813A22571a97976E5902J89078e28248a46616
$$ -212698 -12048 -18599 -143702 14420 -73813 122571 -197976 55902 244980 -528248 -146616
19190c16447E9517b05336b0794k63858J2029A256g7989p5942A50088i1505o4100
$$ -316447 59517 -205336 -20794 -284652 -272623 1256 -77989 -153931 150088 -91505 -155605
19179a55605r4704c5308j3673k4940B12883p9617m3194R4451a23197l56718b03580
$$ -155605 -250309 -35308 -48981 -73921 212883 133266 90072 184523 -123197 -479915 -203580
19167c8395l00383F8710a00932A34424a37127c8940j6069j12183b5935A73860
$$ -38395 -338778 68710 -100932 134424 -137127 -38940 -55009 -167192 -25935 173860
19156F973a60551d8958A67300b14981F0306i7326k62730A10779b20932F8312J03591
$$ 6973 -160551 -48958 167300 -214981 60306 -97326 -360056 110779 -220932 68312 171903
19145A71903b6616A17503b73911N0923g6962B09652B8403b20957A94832h6688
$$ 171903 -26616 117503 -273911 -222988 -76962 209652 28403 -220957 194832 -86688
19134h2386r702A2655L5370b21771B4983b61181A33208P9840C1168d959l6834
$$ -82386 -92088 12655 48025 -221771 24983 -261181 133208 213048 31168 -4959 -41793
19123d1793n3770B84580a16444I0193L9116g5882k93020A05197c04306e7244l75698
$$ -41793 -95563 284580 -116444 90193 129309 -75882 -368902 105197 -304306 -57244 -432942
19112d32942e5045E1496J5209J00119o5691k6403a62781K1587B08587b33901A2056
$$ -432942 -55045 51496 66705 166824 101133 74730 -162781 -141194 208587 -233901 12056
19100a91093D8088b43868C7379K04879H5757C3678g1271m2630O281C10155b33880
$$ -191093 48088 -243868 37379 242258 85757 33678 -71271 -113901 -107620 310155 -233880
19088a81894M8630j24639c8627j71326A81860G9748J71339b56674N5908F142P9285
$$ -181894 -133264 -257903 -38627 -209953 181860 79748 251087 -256674 -200766 6142 85427
19077H5427b46960B21882a22703j36258A76036o2802k421a23534C3853f2318o4945
$$ 85427 -246960 221882 -122703 -258961 176036 113234 110813 -123534 33853 -62318 -127263
19066a27263l5343l3517K4203p5995g4719m6314A74877q2514f1023p1099p3296
$$ -127263 -162606 -196123 -171920 -247915 -74719 -121033 174877 92363 -61023 -132122 -205418
19055b05418D3492O4900g2397a3110B34406a06097A6902c2721G5881k8674J45573
$$ -205418 43492 108392 -72397 -13110 234406 -106097 16902 -32721 75881 47207 192780
19044A92780a99381j69430C0112K72447J1219A02453h549B41272E6084A260b61598
$$ 192780 -199381 -368811 30112 302559 313778 102453 -8549 241272 56084 1260 -261598
19032E5422b95835e5642j01580j79885C38381b75759A51753a2065j00399C9064
$$ 55422 -295835 -55642 -157222 -337107 338381 -275759 151753 -12065 -112464 39064
19021D23423a02927B99345G8402d6944G8307a17504j01547k6733C05751a60723
$$ 423423 -102927 299345 78402 -46944 78307 -117504 -219051 -245784 305751 -160723
19010D12818G9100c29682B30717a93930B49430j20278a82511g072r6511k3650
$$ 412818 79100 -329682 230717 -193930 249430 129152 -182511 -7072 -103583 -127233
19000a27233e2458A60754C2345p143b05368E0093a55484f7280H1389c53417a21045
$$ -127233 -52458 160754 32345 25202 -205368 50093 -155484 -67280 81389 -353417 -121045
18988b03722p3386A0355K4193j4304b66792K5600M7492B32803c9166j05246N6012
$$ -203722 -277108 10355 34548 20244 -266792 -241192 -193700 232803 -39166 -144412 -88400
18977h8400l75113J72102J40828A10592d1454b531j61189j0618b5063k82746H0418
$$ -88400 -463513 -291411 -150583 110592 -41454 -2531 -163720 -174338 -25063 -307809 80418
18965G7601c07947h1523E9711g2544A31805J51232B1835L79721R6600r8068k7092
$$ 77601 -307947 -81523 59711 -72544 131805 283037 21835 401556 498156 400088 372996
18954C72996n9037a16528q0259K4226J4120c1364n7633k1098G3319a73124A77421
$$ 372996 313959 -116528 -196787 -172561 -158441 -31364 -88997 -110095 73319 -173124 177421
18942b26819A5939c90304B41232j03042A9652f731A10349i0441a3309l9728j34191
$$ -226819 15939 -390304 241232 138190 19652 -6731 110349 -90441 -13309 -53037 -187228
18931a87228d0599j26523G7145b09528C8926b22054D2631e6303D5068c9291B11893
$$ -187228 -40599 -167122 77145 -209528 38926 -222054 42631 -56303 45068 -39291 211893
18919e6642B77335R491a17285j16369M876F5061e50305a72396J6604B19186c44451
$$ -56642 277335 286826 -117285 -233654 -228778 65061 -550305 -172396 -155792 219186 -344451
18907f5705B49673q0533f2967B04003c61631h2163H4893d1931b0572G108K17221
$$ -65705 249673 169140 -62967 204003 -361631 -82163 84893 -41931 -20572 7108 224329
18896B24329k2161O9509K79510n0150k36554A05149a35131C09976d8822l1188
$$ 224329 202168 271677 551187 501037 264483 105149 -135131 309976 -48822 -80010
18886h0010F7355H975J36213d0627F2941h2399A61037C9185J23511L02i8071q839
$$ -80010 67355 8975 145188 -40627 62941 -82399 161037 39185 162696 162998 -98071 -106910
18874a06910A55421C1607a02671k39351f1925k99688E9975h0641m167p4053n14333
$$ -106910 155421 31607 -102671 -342022 -61925 -361613 59975 -80641 -84808 -158861 -673194
18863f73194F5531a30604C172O9549J28763i3906j61541H6551J5731c89117A93721
$$ -673194 65531 -130604 3172 72721 201484 -93906 -255447 86551 102282 -389117 193721
18851B02113c58408a24537k85065d3940D8318a16090b2332k77932d571j33134
$$ 202113 -358408 -124537 -409602 -43940 48318 -116090 -22332 -300264 -4571 -137705
18841a37705A07223n3575b00071i0382L0787D6597b06213A94851i0414B3884a48175
$$ -137705 107223 53648 -200071 -90382 -59595 46597 -206213 194851 -90414 23884 -148175
18829I2876A7031b21782i1028A82493a33539B29154L4179i5969A07805a995A338
$$ 92876 17031 -221782 -91028 182493 -133539 229154 263333 -95969 107805 -1995 1338
18817A69409a48772r4787M8272h7348l35396J43273J02743B27104e9916J9521
$$ 169409 -148772 -243559 -195287 -87348 -422744 -279471 -176728 227104 -59916 -40395
18807d0395A13037a27127D5704c01866q3403e6419p9271B23109d4212B53183d38375
$$ -40395 113037 -127127 45704 -301866 -385269 -56419 -135690 223109 -44212 253183 -438375
18795e8388b2343A22164f6794A05690a20040B51395a43356C2204k98K2096a43327
$$ -58388 -22343 122164 -66794 105690 -120040 251395 -143356 32204 31906 54002 -143327
18783H7403m3199b0368I1723j5527e3390e407A67014d43068b12729D9037P83c9982
$$ 87403 44204 -20368 91723 76196 -53390 -5407 167014 -443068 -212729 49037 49820 -39982
18770a5521A83553a61111N7946k0377k7579f0239k40545e7920F103N0756J69663
$$ -15521 183553 -161111 -103165 -123542 -151121 -60239 -300784 -57920 6103 56859 226522
18759B26522c18405k6986a32185c9565r7885j364f8668k67926a34857n659K80
$$ 226522 -318405 -345391 -132185 -39565 -137450 -138814 -68668 -336594 -134857 -140516 -140236
18748a40236j18223H7602i6976o5760N0915A38059o5346c67449R8205j81830D9385
$$ -140236 -258459 87602 -96976 -162736 -111821 138059 72713 -367449 -269244 -451074 49385
18736c063n5201k84036A63991g6255j21833C9341b08831l1501M8199A07385b13301
$$ -3063 -58264 -342300 163991 -76255 -198088 39341 -208831 -240332 -192133 107385 -213301
18724A64096a03567G7227j613b75084A12555a1855l68738J6293G0767i5620q47
$$ 164096 -103567 77227 75614 -275084 112555 -11855 -380593 -364300 70767 -95620 -96467
18713i6467k00852A87716d7570k42572B20097j7975a81088d2354A35986a07143
$$ -96467 -297319 187716 -47570 -290142 220097 202122 -181088 -42354 135986 -107143
18702B04412l0789b97264B38365q0560c81700J28938B78784D7688N2648J07481
$$ 204412 173623 -297264 238365 157805 -381700 -252762 278784 47688 100336 207817
18692B07817b7009r2929j19340k6611a31182q5352E1871e0481k66040I7261N9359
$$ 207817 -27009 -119938 -239278 -265889 -131182 -216534 51871 -50481 -316521 97261 156620
18681A56620J11265H4508g672A50273N5027C1739e1772j0772C4344K21460A3374
$$ 156620 267885 84508 -7672 150273 205300 31739 -51772 -62544 34344 255804 13374
18669H0656g5744r5986L6284j09422a0771E244a7159F6824i6334r8716A97855
$$ 80656 -75744 -171730 -135446 -244868 -10771 5244 -17159 66824 -96334 -195050 197855
18657a17202D3634g4903I4604J99094b64659A50178b71943d4916j1028F7069a18358
$$ -117202 43634 -74903 94604 293698 -264659 150178 -271943 -44916 -55944 67069 -118358
18645a84407H2409i3344C2464a00225j46485E604b61523A63758a99264I6508e5144
$$ -184407 82409 -93344 32464 -100225 -246710 5604 -261523 163758 -199264 96508 -55144
18633A04468c12719Q4932m1425A0607d1478k74895J22354J4097a3535k91448A41728
$$ 104468 -312719 -227787 -269212 10607 -41478 -316373 -194019 -179922 -13535 -304983 141728
18621a9642I4786h9729b9066B4271J75104b73474J17191P2912r8214d8451A78828
$$ -19642 94786 -89729 -29066 24271 199375 -273474 -156283 -83371 -181585 -48451 178828
18609a43855j22473B62644F2589j4681P6069J36479a31029D6396b52369A18884
$$ -143855 -266328 262644 62589 47908 123977 260456 -131029 46396 -252369 118884
18598A93403b74357J11867J5884n4999H016O0403a56496G7030c4101j47200d7784
$$ 193403 -274357 -162490 -146606 -201605 8016 68419 -156496 77030 -34101 -181301 -47784
18586C0196Q0353B8631J63707e01957f3738k40221B1967a25804C9259M805h2899
$$ 30196 110549 28631 192338 -501957 -63738 -303959 21967 -125804 39259 44064 -82899
18574H8591a7227j65566B29073a41443B78451I4413J97788d8110j14881K3884
$$ 88591 -17227 -182793 229073 -141443 278451 94413 292201 -48110 -162991 -139107
18564a39107l58407h6071A01311i0798B10825D2580j447O5794a48841j9293o7263
$$ -139107 -497514 -86071 101311 -90798 210825 42580 41133 106927 -148841 -168134 -235397
18553b35397N2077M7372N7380j21617F2860J8658g6446c2362o6742l37822e4245
$$ -235397 -183320 -135948 -78568 -200185 62860 81518 -76446 -32362 -99104 -436926 -54245
18541g3604c4551l806j64712A0432b70581D510R895J1658d04862a82652E4352
$$ -73604 -34551 -38357 -203069 10432 -270581 4510 14405 26063 -404862 -182652 54352
18529c1374A00270j9639b72862J14947L8710L5645B88524a018A00310m0193A365
$$ -31374 100270 80631 -272862 -157915 -119205 -83560 288524 -1018 100310 60117 1365
18517A19521p626g5796k7287A16702M5522e1714k44067A56657c8747j74374A49686
$$ 119521 111895 -75796 -103083 116702 162224 -51714 -295781 156657 -38747 -213121 149686
18505E2451e5592C6906a72477e7968A10179K59096e675I0804L3153b92977m4283
$$ 52451 -55592 36906 -172477 -57968 110179 369275 -5675 90804 123957 -292977 -337260
18494c37260C33525g6125B59231e16I2026K50948a5770j52918I6611g6580k14606
$$ -337260 333525 -76125 259231 -516 92026 342974 -15770 -168688 96611 -76580 -291186
18483b91186D7534Q4633b016k78972O0401A1971c60594r0835A963a91806e6586
$$ -291186 47534 132167 -2016 -280988 -220587 11971 -360594 -451429 1963 -191806 -56586
18471f0519m6835b65n5056k6901l6158K049C67039a58167j01287D7781P2541b1449
$$ -60519 -107354 -265 -55321 -82222 -118380 -116331 367039 -158167 -259454 47781 120322 -21449
18458G3697a03581A42334c80149B67323j9846b14810D8009a64447A38815c3852
$$ 73697 -103581 142334 -380149 267323 247477 -214810 48009 -164447 138815 -33852
18447b11659g2013c2687q3469l12616i6450c0319D0268K73242a56559A38186b42226
$$ -211659 -72013 -32687 -116156 -428772 -96450 -30319 40268 313510 -156559 138186 -242226
18435c40078G5381b86538A5037a61149M2113j1377B68256C4596a16538j96494
$$ -340078 75381 -286538 15037 -161149 -119036 -130413 268256 34596 -116538 -313032
18425c13032B3401d4354G6485M5531d30693a45162j64030o4801C11900a92560
$$ -313032 23401 -44354 76485 122016 -430693 -145162 -309192 -373993 311900 -192560
18414A6479J40974d022j33008l25171E75K3349a9419l7328l5993G8712a8187D7
$$ 16479 157453 -4022 -137030 -462201 575 23924 -19419 -56747 -92740 78712 -18187 47
18401A34765d50137A59050g069A56490J77425j16061b72835q0314a12574N3235
$$ 134765 -450137 159050 -7069 156490 333915 217854 -272835 -353149 -112574 -59339
18391e9339B2422K68490c8316C7096i7412J7527j20728c7184B05616G205J1036
$$ -59339 22422 290912 -38316 37096 -97412 -79885 -200613 -37184 205616 7205 18241
18380A8241c81079j07476a98508C10021a08642I3564A1207g2786l11417a093k32860
$$ 18241 -381079 -488555 -198508 310021 -108642 93564 11207 -72786 -384203 -1093 -233953
18369b33953E2404o477b56026c7085j44016A33824B143L13469E5494b3778G7430
$$ -233953 52404 45927 -256026 -37085 -181101 133824 2143 315612 55494 -23778 77430
18357b4201p9257j52525m7306h6660l8769E9316L1544A8997e5731c556j20988
$$ -24201 -103458 -255983 -303289 -86660 -125429 59316 90860 18997 -55731 -3556 -124544
18346a24544o5405m201k15486E5088b82330I5845R7848j2191c8282n7141l6619
$$ -124544 -189949 -194150 -409636 55088 -282330 95845 193693 181502 -38282 -95423 -132042
18335a32042j6650J6875m9684G9889h9699j56357k0425g8838j53110k9161L093
$$ -132042 -148692 -131817 -181501 79889 -89699 -246056 -266481 -78838 -231948 -261109 -258016
18324b58016A41076a21752B3750J95900a91212A31363J11396a12264j6743l0321
$$ -258016 141076 -121752 23750 219650 -191212 131363 242759 -112264 -129007 -159328
18314a59328b3804k4843g992j56113C0365a05743J9173c1082k34946i3503A53850
$$ -159328 -23804 -48647 -7992 -164105 30365 -105743 -86570 -31082 -266028 -93503 153850
18302b3201k23638l944d9067B06017g2397a0360p7660n9412J8796A56807F7725
$$ -23201 -246839 -250783 -49067 206017 -72397 -10360 -88020 -147432 -128636 156807 67725
18290b99347D8440b4642A86082A1288c6737k84405j1460k4551J16088B64859E6426
$$ -299347 48440 -24642 186082 11288 -36737 -321142 -332602 -357153 -241065 264859 56426
18278c14157A97494b35604O0707E9041K66689I9885J32179j09437l7915l7564
$$ -314157 197494 -235604 -174897 59041 325730 99885 232064 122627 84712 47148
18268D7148a32665k52405A6520c75051A54877a76008A9777J00029a91181N2792
$$ 47148 -132665 -385070 16520 -375051 154877 -176008 19777 119806 -191181 -138389
18258a38389C092f11m7974I3284J15771l6624m7088J83989j44834c2119k82056
$$ -138389 3092 -611 -48585 93284 209055 172431 125343 309332 164498 -32119 -314175
18247c14175C17998a09090J2264A95007a51816N7868I4830g7271F187b7176r0664
$$ -314175 317998 -109090 -96826 195007 -151816 -93948 94830 -77271 6187 -27176 -117840
18236a17840a6173n0975k6860A42201a28212G8012J049B4840a51614C52309j41305
$$ -117840 -16173 -67148 -94008 142201 -128212 78012 79061 24840 -151614 352309 211004
18225B11004d7181A03151b91822a17717B54448A16903a63580k31896B15313m6997
$$ 211004 -47181 103151 -291822 -117717 254448 116903 -163580 -395476 215313 168316
18215A68316a97425M9660L6573j30224C234L6368M3800b28007A72775F5131b15794
$$ 168316 -197425 -147765 -111192 -241416 3234 39602 83402 -228007 172775 65131 -215794
18203b75808D10d1162A07680J91656G8141a75202B89172A38296o3198C7275c9138
$$ -275808 410 -41162 107680 299336 78141 -175202 289172 138296 75098 37275 -39138
18191C48085e2869m5599A04663a0049j03896G595J35746Q3269I2862g2372m2510
$$ 348085 -52869 -98468 104663 -10049 -113945 7595 143341 226610 92862 -72372 -114882
18180a14882A30420c76437a2159k06451A09269C6672J27986O7498a17924J3611
$$ -114882 130420 -376437 -12159 -218610 109269 36672 164658 232156 -117924 -104313
18170a04313j34587a10860L7701k03874A54461c23073J28842m8170A82869m2385
$$ -104313 -238900 -110860 -73159 -277033 154461 -323073 -194231 -242401 182869 140484
18160A40484b33252Q9420B54895l0501B8558h9941o8081r0772M2968J4239H9726
$$ 140484 -233252 -143832 254895 224394 28558 -89941 -158022 -248794 -205826 -191587 89726
18148D0379K21862D196a4650l8841I1238P7068O353c62250a00802I9882P5162
$$ 40379 262241 4196 -14650 -53491 91238 168306 174659 -362250 -100802 99882 175044
18137A75044j0074a39979R893M3616A58797c08241b8832C61685a68150A4232a70360
$$ 175044 164970 -139979 -130086 -86470 158797 -308241 -28832 361685 -168150 14232 -170360
18125h4189n0264N8942C28084k5809b82502H3294b84683f4589F2704Q906g1349
$$ -84189 -134453 -75511 328084 302275 -282502 83294 -284683 -64589 62704 71610 -71349
18113b49594M6981A01107d3994D9302f5010J4535j1280A2276c82666E56343E1489
$$ -249594 -202613 101107 -43994 49302 -65010 -50475 -61755 12276 -382666 556343 51489
18101D0185n208b84192P3743J4255b5462k7874k02464E8668b16630C50928e022
$$ 40185 34977 -284192 -210449 -196194 -25462 -53336 -255800 58668 -216630 350928 -5022
18089B55783r671a77594M9187G7033b2437D6268f1442E3794b48163J02533B0405
$$ 255783 246112 -177594 -128407 77033 -22437 46268 -61442 53794 -248163 -145630 20405
18077b07967n0315i9479j35715G1275b37343a02754F819b26255A4863a17750j38539
$$ -207967 -258282 -99479 -235194 71275 -237343 -102754 6819 -226255 14863 -117750 -256289
18066b56289E2755J06241D0522J24645a06492q2709A53415B679h24C254h9367
$$ -256289 52755 158996 40522 165167 -106492 -189201 153415 2679 -824 3254 -89367
18054b97384A60199a38385d5643F6684b38477c7689p4753n1781c4391j73660Q4198
$$ -297384 160199 -138385 -45643 66684 -238477 -37689 -112442 -164223 -34391 -208051 -123853
18043a23853N1292a7024F83J46198b50583C8122a0739B21334D3741a06621G918
$$ -123853 -72561 -17024 683 146881 -250583 38122 -10739 221334 43741 -106621 7918
18031A4829a81824A12412J47205e3052A10048k9997c2296B8759a8855j80281B3330
$$ 14829 -181824 112412 259617 -53052 110048 80051 -32296 28759 -18855 -199136 23330
18019A94448J05853A41749c05337A97735q1405a56245d7375D73P5786a49172b2289
$$ 194448 300301 141749 -305337 197735 116330 -156245 -47375 473 76259 -149172 -22289
18007g8275n5880c7794P11F9796M4149e3587D16455j83826b01253A96997b51130
$$ -78275 -134155 -37794 -37083 69796 113945 -53587 416455 232629 -201253 196997 -251130
17995b57234A90225J50445f2104A18495R2008l4556b3748G4453a06248D65848
$$ -257234 190225 340670 -62104 118495 210503 175947 -23748 74453 -106248 465848
17984a93119g5730A58218c1719k31394J07826b5651C60265A02382D2263J56135
$$ -193119 -75730 158218 -31719 -263113 -155287 -25651 360265 102382 42263 198398
17974A98398E3565h2086B56372Q38a71094r0664d1836J6657G6873b14816A32445
$$ 198398 53565 -82086 256372 257210 -171094 -261758 -41836 -25179 76873 -214816 132445
17962H3473J45794R1571a41373o0035A40403a79022C05907A35058b76350L8041
$$ 83473 229267 320838 -141373 -201408 140403 -179022 305907 135058 -276350 -238309
17952b38309G3578J16726a86672C8932b74936B7240b38355E6190g0517A55730
$$ -238309 73578 190304 -186672 38932 -274936 27240 -238355 56190 -70517 155730
17941g5956B294L0261f2990m8453C7435K70667D8146J97090a13457d6758B04406
$$ -75956 2294 32555 -62990 -111443 37435 308102 48146 245236 -113457 -46758 204406
17929b52085c6711C1198J77715B4870K25128F7285J32238j6152f2810D9987G061
$$ -252085 -36711 31198 208913 24870 249998 67285 199523 183371 -62810 49987 7061
17917b3336D6142J77134a20643A81677c3768A8596f4029k54444B10639B3193e1498
$$ -23336 46142 223276 -120643 181677 -33768 18596 -64029 -318473 210639 23193 -51498
17905B74646A14881C1951d1983l34572J77196A69022d9878A49654A6963K32351
$$ 274646 114881 31951 -41983 -376555 -199359 169022 -49878 149654 16963 249314
17895B49314j8356a36492A4730K76161D7602A7028a55858E3646D550h4490C268
$$ 249314 230958 -136492 14730 290891 47602 17028 -155858 53646 4550 -84490 3268
17883d3771C0045J64462k6387J97436c9967k11704M9030J203l21576B37832E871
$$ -43771 30045 194507 168120 365556 -39967 -251671 -202641 -201438 -523014 237832 5871
17871D3994A3922O8334M41889B40348F126e0709C03984a03668K1279j22302N2918
$$ 43994 13922 82256 524145 240348 6126 -50709 303984 -103668 -82389 -204691 -151773
17860a51773O1180L2391A39061a5438q3477H2557d18847B76098E9609J86949J73128
$$ -151773 -90593 -58202 139061 -15438 -98915 82557 -418847 276098 59609 246558 419686
17849D19686c23331A46280o914e4420a984k58540b0793A36709f4156G6031h0917
$$ 419686 -323331 146280 139366 -54420 -1984 -260524 -20793 136709 -64156 76031 -80917
17837B31428p8995a64499A063J14421I664M2295K48338a33189B58763m5523a13515
$$ 231428 152433 -164499 1063 115484 9664 51959 300297 -133189 258763 213240 -113515
17825a09853J2702j498C16767e4117R239j50311k8235K8526A46675b82724f5266
$$ -109853 -97151 -98649 316767 -54117 -44878 -195189 -223424 -194898 146675 -282724 -65266
17813e6994b6141j71029C7204h964k03580n2908C8392J0029a99972A46416D709
$$ -56994 -26141 -197170 37204 -8964 -212544 -265452 38392 48421 -199972 146416 4709
17801A78708l3478b85978G2826P4752e0832m5558B05460J46003Q4155A17867M6009
$$ 178708 145230 -285978 72826 147578 -50832 -96390 205460 351463 435618 117867 163876
17790A63876a95153A95366c2033G3044d4102J5633j20198c30A78963a59753a4927
$$ 163876 -195153 195366 -32033 73044 -44102 -28469 -148667 -330 178963 -159753 -14927
17778a79889B10394A04942N8495k7945L5573g5615B5547a9023I8080b21975B85568
$$ -179889 210394 104942 163437 135492 171065 -75615 25547 -19023 98080 -221975 285568
17766h1985A78987d6337B12584J37849E4145a83838O6522l8760B02563M2042b14267
$$ -81985 178987 -46337 212584 350433 54145 -183838 -117316 -156076 202563 244605 -214267
17754b48911B83517j08249K7100a12526I8979l0514b49093C56380j20047a92786
$$ -248911 283517 175268 202368 -112526 98979 68465 -249093 356380 236333 -192786
17743a61949d8479A85961a40848B20455r6886P2369A9665n399J26047l8213J49178
$$ -161949 -48479 185961 -140848 220455 123569 195938 19665 14266 140313 102100 251278
17732B51278b10982A01469b24122A1715Q362O8977C1124J39488g6409A195J03340
$$ 251278 -210982 101469 -224122 11715 20077 89054 31124 170612 -76409 1195 104535
17721A04535P1837b2554C23211a37169b3127I0702O3135a47247L1734B43157d2708
$$ 104535 176372 -22554 323211 -137169 -23127 90702 153837 -147247 -115513 243157 -42708
17709D89106j47069a71567j36629F6395J22792l6568K10258b99708a0107j29977
$$ 489106 342037 -171567 -308196 66395 189187 152619 362877 -299708 -10107 -140084
17699a40084D27527o4652a18100k4512A13040j1965R0615a05245b4643r780A61024
$$ -140084 427527 362875 -118100 -142612 113040 101075 191690 -105245 -24643 -34423 161024
17687A97454n6976o0664N5618i7239n5704d4910E96486D2884J82067c2647A05192
$$ 197454 140478 79814 135432 -97239 -152943 -44910 596486 42884 224951 -32647 105192
17675h4150B6330g5067G9933d812B55534e6626J7474C77512g8809I3553J33101
$$ -84150 26330 -75067 79933 -4812 255534 -56626 -39152 377512 -78809 93553 226654
17664B26654j04453P1815O7301A28013P4428a19428d4971A04673R1476e9609A87602
$$ 226654 122201 194016 261317 128013 202441 -119428 -44971 104673 196149 -59609 187602
17652d0639B63187b16064A6357a06898A87310c05329c9819k1015A25951Q0912
$$ -40639 263187 -216064 16357 -106898 187310 -305329 -39819 -60834 125951 206863
17642B06863m1022K84435b08064B6749d5218D19575j37510r9254N1666D0021g267
$$ 206863 165841 450276 -208064 26749 -45218 419575 282065 182811 234477 40021 -7267
17630h4744I8241k5203J49663a61044b2764l480p7373F3499d6400A9606h6524
$$ -84744 98241 73038 222701 -161044 -22764 -26244 -103617 63499 -46400 19606 -86524
17618A01324c32201B19625i3592G5821J73326D0520D700i1750A53463j7297o3854
$$ 101324 -332201 219625 -93592 75821 249147 40520 4700 -91750 153463 136166 72312
17607G2312K25810c2780G6613e4870B33175r3999R8577j15851J27412Q3118j48434
$$ 72312 298122 -32780 76613 -54870 233175 139176 237753 121902 249314 332432 183998
17596A83998a08945G6306H849N20748A07999o978J68969A06274d2824O622B08278
$$ 183998 -108945 76306 8849 529597 107999 101021 269990 106274 -42824 -36202 208278
17584B00785m7533J13488a21224A78886g7376A71372n6116L0379O29K26335D9760
$$ 200785 153252 266740 -121224 178886 -77376 171372 115256 145635 146264 372599 49760
17572A93852F56J23343J65358J85252A40744J97190N0235J44898A02238a49058
$$ 193852 656 123999 289357 474609 140744 337934 388169 533067 102238 -149058
17561d0073A36023b1340j72223b9857A50963n4293K2912D6554K86857o4551K0264
$$ -40073 136023 -21340 -193563 -29857 150963 96670 119582 46554 333411 268860 289124
17550B89124J13413a31744B02484d9082C37972j36690E4094n947K338F787K73806
$$ 289124 402537 -131744 202484 -49082 337972 201282 54094 48147 50485 6787 280593
17539B80593l6795B1561a7509H7909J85146J19089A19094B5502M18555A60736
$$ 280593 243798 21561 -17509 87909 273055 392144 119094 25502 444057 160736
17528D90814E5604R7513F6518J65677d5659B01507J01514j05985J6140L0184P6698
$$ 490814 55604 153117 66518 232195 -45659 201507 303021 197036 213176 243360 320058
17517C20058j223C0014K66318H2127M72042L8254K35961K67157r7979o8821j73796
$$ 320058 318835 30014 296332 82127 554169 592423 828384 1095541 997562 928741 754945
17506G54945k29529R6142p2799k43942K71756A33597M43786p4646L5959P8780
$$ 754945 525416 621558 548759 304817 576573 133597 577383 502737 538696 617476
17496F17476K29247J19393k20771L875J87043m44635K27119j94640q5590M3360
$$ 617476 846723 966116 745345 749220 936263 491628 718747 524107 438517 481877
17486D81877k28715L5211H5230l522f3207B06137J17272K57238B55135A00775
$$ 481877 253162 288373 85230 81708 -63207 206137 323409 580647 255135 100775
17475C64911j2015G9790j8023K21667O7406J43346j93381J80017a6856m5972K1800
$$ 364911 352896 79790 61767 283434 350840 494186 300805 480822 -16856 -62828 -41028
17464d1028B39326K3581M7430o6355E7323R983R0088K42458B1074L11624M8341
$$ -41028 239326 262907 310337 243982 57323 67306 157394 399852 21074 332698 381039
17453C81039j50263J8022L7949M4663R7208N991A82892J47783K5315o2507F7334
$$ 381039 230776 248798 286747 331410 428618 434609 182892 330675 355990 293483 67334
17441A07277J68148N6534m2097k3763P3597j07368L57634k83086A34771L45677
$$ 107277 275425 331959 289862 266099 339696 232328 589962 306876 134771 480448
17431D80448B29101L04575j19026K05927B6537K65100J11217J54662B68933j19341
$$ 480448 229101 533676 414650 620577 26537 291637 402854 557516 268933 149592
17421A49592L93980D3712K47644A33577M61472j71691L28966A56621M65090j63369
$$ 149592 543572 43712 291356 133577 595049 423358 752324 156621 621711 458342
17411D58342p5820A90305K5953K06600o0194j34629K16437A44496J64889j30027
$$ 458342 382522 190305 216258 422858 362664 228035 444472 144496 309385 179358
17401A79358J42243Q0261A56399M17007j01630R836K68502C11391A54351K24420
$$ 179358 321601 401862 156399 573406 471776 481612 750114 311391 154351 378771
17391C78771F9706J67851K72397j67638a8670A95750k9381K89275B20060J6713
$$ 378771 69706 237557 509954 342316 -18670 195750 166369 455644 220060 236773
17381B36773l8427N5104r5643M3986j4208h668j26572A34014J16949i2060C65558
$$ 236773 198346 253450 157807 201793 187585 -8668 -135240 134014 250963 -92060 365558
17369D5639K11044A07036J78629J08869k5309J30753A08148K10527D4914J97199
$$ 45639 256683 107036 285665 394534 369225 499978 108148 318675 44914 242113
17359B42113j7751n3279M8726J97783A28412c3627D28855j90951m2841J51025
$$ 242113 224362 171083 219809 417592 128412 -33627 428855 237904 195063 346088
17349C46088E7105L48903j12038o8171l568Q1246C2306K53512a50529B88391B5751
$$ 346088 57105 406008 293970 225799 222231 303477 32306 285818 -150529 288391 25751
17337C26089j59749K1443J22727G08J52599O1077P5123j9120N5038m04j9333k5088
$$ 326089 166340 187783 310510 708 153307 214384 289507 270387 325425 325021 305688 280600
17325B80600j12899O7272h5003C50243l6041R0533P9010j46230a1481D01168j45654
$$ 280600 167701 234973 -85003 350243 314202 404735 483745 337515 -11481 401168 255514
17314B55514j00123p438q293J91591A60928L56426D7757N5704J97707O8492A0644
$$ 255514 155391 147953 139660 331251 160928 517354 47757 103461 301168 369660 10644
17302A44878R5541K79057k33421J93349j69405n5124A4599P0921N74220j07702
$$ 144878 240419 519476 286055 479404 309999 254875 14599 85520 659740 552038
17292E52038A33826N9585m2821p1655C7098M04801j85907Q7850Q8000g5858B56731
$$ 552038 133826 193411 150590 78935 37098 441899 255992 343842 431842 -75858 256731
17280E18755j12102K7548E9788J11801K61257K0034Q8913F5296M00252g3162A26585
$$ 518755 406653 434201 59788 171589 432846 452880 541793 65296 465548 -73162 126585
17268b3096E85751p6694j47017B5915K92087p0747E2244J7814L59748n6419a616
$$ -23096 585751 509057 362040 25915 318002 247255 52244 70058 429806 373387 -1616
17256A28564j27K19719q3867m8855L04727j34812j52867K0145J38462j23831Q8718
$$ 128564 128437 348156 264289 215434 520161 385349 232482 252627 391089 267258 355976
17245C55976K55618j82016j28394K36459q183p3720m8777j51987J13236J19341
$$ 355976 611594 429578 301184 537643 529460 455740 406963 254976 368212 487553
17235D87553J5299j61181L0330K2230M2383L5241k18212K1300q9401M72542B19910
$$ 487553 502852 341671 372001 394231 436614 471855 253643 274943 185542 658084 219910
17223E51511O7288j96640A81517e0351A40227K06084j23621J85042k7308K35732
$$ 551511 618799 422159 181517 -50351 140227 346311 222690 407732 380424 616156
17213F16156j35133J29803k05759i2860E82352j32687B23568f0266E84869j32889
$$ 616156 481023 610826 405067 -92860 582352 449665 223568 -60266 584869 451980
17203D51980l0318Q119l1426q4982J20151A17431K13394R0235j73473M5490R8546
$$ 451980 421662 429781 398355 313373 433524 117431 330825 421060 247587 293077 391623
17192C91623j64931j08595K26608p9904J08694Q1139L44401l58404A97111J74113
$$ 391623 226692 118097 344705 264801 373495 454634 799035 440631 197111 371224
17182C71224l6882K78990k51462R6920p9698J17065B33384K53641A51706L54426
$$ 371224 334342 613332 361870 458790 379092 496157 233384 487025 151706 506132
17172E06132J18175k95920L94732j07381l570k59667P6318L29982B88538N0193
$$ 506132 624307 328387 723119 615738 612168 352501 428819 758801 288538 338731
17162C38731J07440N64295C05076L56565j95906O3497O5948j79431p5473P2293
$$ 338731 446171 1010466 305076 661641 465735 529232 595180 415749 340276 412569
17152D12569Q6679j67917P9919j16711N61353C85301J63908J82204l34115J10022
$$ 412569 499248 331331 411250 294539 855892 385301 549209 731413 397298 507320
17142E07320m1720L8384j32629K73077J53514K41589m26196B24265M50559B57153
$$ 507320 465600 503984 371355 644432 797946 1039535 613339 224265 674824 257153
17131E26238k61066M38205j54459J81901C24293J35849L77665j5262C88347o4366
$$ 526238 265172 703377 548918 730819 324293 460142 837807 822545 388347 323981
17121C23981K15956j02406K53557C15659J49516o6303J18546k3590J25901j82642
$$ 323981 539937 437531 691088 315659 465175 398872 517418 493828 619729 437087
17111D37087M78376D01491R2025j7248L7658M1196A69581M17169K76987l27224
$$ 437087 915463 401491 493516 476268 513926 555122 169581 586750 863737 536513
17101E36513J65558m421k48833Q5066N9062Q9261j0211L38715F7765O85564o7637
$$ 536513 702071 697650 448817 533883 592945 682206 671995 1010710 67765 753329 685692
17090F85692j06698L43438l52567P1986p9582J29411O8193j10999P0043o4554
$$ 685692 578994 922432 569865 641851 562269 691680 759873 648874 718917 654363
17080F54363n6334k087K80979M7512l68794J10949J61223O8990o6166L585l64537
$$ 654363 598029 595942 876921 924433 555639 666588 827811 896801 830635 834220 469683
17069D69683M85864q1653k23592j17848M64480k25425B44059N66094k40711k53567
$$ 469683 955547 873894 650302 532454 996934 771509 244059 810153 569442 315875
17059C15875M65436j15106J4241K29629M4881k61025J43695m1918m9053l7937
$$ 315875 781311 666205 680446 910075 954956 693931 837626 795708 746655 708718
17049G08718q7099L15412j60300L4219J43021r5956J65832l33846M55363l57947
$$ 708718 621619 937031 776731 810950 953971 858015 1023847 690001 1145364 787417
17039G87417R002N452L88920m6238j49687j78509J27840k16640L82410j57808
$$ 787417 796419 801871 1190791 1144553 994866 816357 944197 727557 1109967 952159
17029I52159j35187l7853J22677J71572o6562l88630L10492Q257j25531K87603
$$ 952159 816972 779119 901796 1073368 1006806 618176 928668 936925 811394 1098997
17019A098997j82973j92932L09903J32705l84870J99425j36284L44701k18245
$$ 1098997 916024 723092 1032995 1165700 780830 980255 843971 1188672 970427
17010I70427K31924j46196p2780k3333K35610j68523P362j59292Q868M05486l19313
$$ 970427 1202351 1056155 983375 960042 1195652 1027129 1034491 875199 884067 1289553 970240
16999I70240K30374k51102o632O9155K35808j78072K03098J44361j68452m3751
$$ 970240 1200614 949512 942880 1012035 1247843 1069771 1272869 1417230 1248778 1205027
16989A205027q0520K1320L48154m89888M23358k91510K07853m56961N37299j79799
$$ 1205027 1124507 1145827 1493981 1004093 1427451 1135941 1343794 886833 1424132 1244333
16979A244333l6606J34074o7269J36042J26914p2327m71882L81612l00953K13213
$$ 1244333 1207727 1341801 1274532 1410574 1537488 1465161 993279 1374891 1073938 1287151
16969A287151R5133J36292j49782J27872N5059r1647N6731j65927K63697j20632
$$ 1287151 1382284 1518576 1368794 1496666 1551725 1460078 1516809 1350882 1614579 1493947
16959A493947R7723j16724j99503J57893j7442j62952L90728p567K27927k59300
$$ 1493947 1591670 1474946 1275443 1433336 1415894 1252942 1643670 1636103 1864030 1604730
16949A604730J11864K2579n9521J3619M5456J10001k30606k20343O28112k54175
$$ 1604730 1716594 1739173 1679652 1693271 1738727 1848728 1618122 1397779 2025891 1771716
16939A771716l92501M64561L12567k48750n6082K77882m75943J64204K33116r5831
$$ 1771716 1379215 1843776 2156343 1907593 1851511 2129393 1653450 1817654 2050770 1954939
16929A954939l56537K90280r5927O7793O1981L418J05055J57362l67748K28098
$$ 1954939 1598402 1888682 1792755 1860548 1922529 1925947 2031002 2188364 1820616 2048714
16919B048714j3391J04859j87331K62173Q3043l6544k50055Q2612J7417M21591
$$ 2048714 2035323 2140182 1952851 2215024 2298067 2261523 2011468 2094080 2111497 2533088
16909B533088j35430j66161L22027n27983M88383P6034j00807O8307l38804L59709
$$ 2533088 2397658 2231497 2553524 2025541 2513924 2589958 2489151 2557458 2218654 2578363
16899B578363l96925J77316L08127r8428N9814P4746j4919J76807j11025J04481
$$ 2578363 2181438 2358754 2666881 2568453 2628267 2703013 2688094 2864901 2753876 2858357
16889B858357j73020l2965l579K15553q2694M57848q1490P3170M9793l58616K94321
$$ 2858357 2685337 2652372 2648793 2864346 2781652 3239500 3158010 3231180 3280973 2922357 3216678
16878C216678K33445k25273L48066j3654j2904j95018p296J95764J24625j81836
$$ 3216678 3450123 3224850 3572916 3559262 3546358 3351340 3344044 3539808 3664433 3482597
16868C482597J30892j15763l6258L3315K59771L10021k85586J76658j33028M90296
$$ 3482597 3613489 3497726 3461468 3494783 3754554 4064575 3778989 3955647 3822619 4312915
16858D312915j66424k33025J63623O2248L10839r1226K18055k54022K13859L57153
$$ 4312915 4146491 3913466 4077089 4139337 4450176 4358950 4577005 4322983 4536842 4893995
16848D893995j49158K52387q9196N8301J38908q5852l717K39673r8425J99855
$$ 4893995 4744837 4997224 4908028 4966329 5105237 5019385 5015668 5255341 5156916 5356771
16838E356771K9834o9957M09390J71383j84214M11199n7425k92377Q003M34302
$$ 5356771 5386605 5316648 5726038 5897421 5713207 6124406 6066981 5774604 5782607 6216909
16828F216909r8375J96082l0521L68252j52523l5840N27959j33330J23748K87856
$$ 6216909 6118534 6314616 6284095 6652347 6499824 6463984 6991943 6858613 6982361 7270217
16818G270217j27317N34460j75134L54746J62672J45790j32212P2672O65079j83747
$$ 7270217 7142900 7677360 7502226 7856972 8019644 8165434 8033222 8105894 8770973 8587226
16808H587226K97885o4158O94779p9480m8719L53535J19252J58737N8994J53250
$$ 8587226 8885111 8820953 9515732 9436252 9387533 9741068 9860320 10019057 10078051 10231301
16798A0231301L84504M97092m7994K97119L77166j58163L08310L98529N20039
$$ 10231301 10615805 11112897 11064903 11362022 11739188 11581025 11889335 12287864 12807903
16789A2807903K89441J53221L1995R54353n7102K97714M54097J46800R62388k48815
$$ 12807903 13097344 13250565 13282560 14236913 14179811 14477525 14931622 15078422 16040810 15791995
16779A5791995P96456P7037M01940N60478L63566O20256L03560O47666J36257
$$ 15791995 16588451 16665488 17067428 17627906 17991472 18611728 18915288 19562954 19699211
16770A9699211R99815M89657O04887N10746L59941J155696P84319N10713M40385
$$ 19699211 20699026 21188683 21793570 22304316 22664257 23819953 24604272 25114985 25555370
16761B5555370J115870R80918Q41594P09879J397415M69540J185152P97623J208469
$$ 25555370 26671240 27652158 28493752 29203631 30601046 31070586 32255738 33053361 34261830
16752C4261830J391065J171792J088431J445933J582116J402901J064921J630863
$$ 34261830 35652895 36824687 37913118 39359051 40941167 42344068 43408989 45039852
16744D5039852J847224J489064J653681K514380J911649J598022J682046K519121
$$ 45039852 46887076 48376140 50029821 52544201 54455850 56053872 57735918 60255039
16736F0255039K301065K533653K281936K777901K609680K704184K676750K587284
$$ 60255039 62556104 65089757 67371693 70149594 72759274 75463458 78140208 80727492
16728H0727492L126850L023163K972208L067009L079512K803703L190092L045045
$$ 80727492 83854342 86877505 89849713 92916722 95996234 98799937 101990029 105035074
16720A05035074K847738K970018K641928K380765K506470K086671K035462J329940
$$ 105035074 107882812 110852830 113494758 115875523 118381993 120468664 122504126 123834066
16712A23834066J459110J192437O72983O51801j06751j68232n70639o98883j187160
$$ 123834066 125293176 126485613 127158596 127810397 127703646 127535414 126964775 126265892 125078732
16703A25078732j825437j407968k321845k141800k540615k496779k735039k951824
$$ 125078732 123253295 121845327 119523482 117381682 114841067 112344288 109609249 106657425
16695A06657425l094646k802198l215075l270509k931265l271455k926708k865861
$$ 106657425 103562779 100760581 97545506 94274997 91343732 88072277 85145569 82279708
16687H2279708k917567l001819k633721k814930k724430k380618k404697k318586
$$ 82279708 79362141 76360322 73726601 70911671 68187241 65806623 63401926 61083340
16679F1083340k332843k193877k087250k177213j570318j994381j782682k108861
$$ 61083340 58750497 56556620 54469370 52292157 50721839 48727458 46944776 44835915
16671D4835915j175386j223504j720172j651372j348917j508548j153257r26678
$$ 44835915 43660529 42437025 40716853 39065481 37716564 36208016 35054759 34128081
16663C4128081j364693p66300j340150r03695q85776q00169j109596q68454r10313
$$ 34128081 32763388 31997088 30656938 29753243 28867467 28067298 26957702 26089248 25178935
16654B5178935o30045m22878p90917p11197q84620o77031l79217q45471m35792
$$ 25178935 24548890 24126012 23335095 22623898 21739278 21062247 20683030 19837559 19401767
16645A9401767l61040l15679o46404l37162p11811l14070k93644m27264n52474
$$ 19401767 19040727 18725048 18078644 17741482 17029671 16715601 16421957 15994693 15442219
16636A5442219k47641q99137M7176m85066k8585m22262m71998L16280q70428k77743
$$ 15442219 15194578 14295441 14342617 13857551 13828966 13406704 12934706 13250986 12380558 12102815
16626A2102815m46269j17101k92975l48550k83123l98738N4641j42295k68953
$$ 12102815 11656546 11539445 11246470 10897920 10614797 10216059 10270700 10128405 9859452
16617I859452R3205p2713n32940j50576O468m96452O2005j73103m7564l87542
$$ 9859452 9952657 9879944 9347004 9196428 9202896 8706444 8768449 8595346 8547782 8160240
16607H160240J68227m89161j72049k90576o3098j49806K52211l41658k21977O1994
$$ 8160240 8328467 7839306 7667257 7376681 7313583 7163777 7415988 7074330 6852353 6914347
16597F914347l41723j63603O2621o13531L35596L0070k02654l01414J81797k26762
$$ 6914347 6572624 6409021 6471642 5858111 6193707 6223777 6021123 5719709 5901506 5674744
16587E674744k22007j10595K05271K96619o32153J08801J78686m79104O333j8196
$$ 5674744 5452737 5342142 5547413 5844032 5211879 5320680 5499366 5020262 5026595 5008399
16577E008399k68234l5176K05553m25053N5501l71606k1646M17026j63724n3044
$$ 5008399 4740165 4704989 4910542 4485489 4540990 4169384 4147738 4564764 4401040 4347996
16567D347996j97473K29765L6047m41103Q8228J23946m29642j72610K79683j37150
$$ 4347996 4150523 4380288 4416335 3975232 4063460 4187406 3757764 3585154 3864837 3727687
16557C727687k98819J22414k24817L30886k18505n866N57327n15661l42226J33663
$$ 3727687 3428868 3551282 3326465 3657351 3438846 3432980 3990307 3474646 3132420 3266083
16547C266083K63595m82590L42444j65191o8249j50414j74484J74090l7446K05090
$$ 3266083 3529678 3047088 3389532 3224341 3156092 3005678 2831194 3005284 2967838 3172928
16537C172928l61518m6801J3375n4189J91947l26967M78193l43549k06245M9929
$$ 3172928 2811410 2764609 2777984 2723795 2915742 2588775 3066968 2723419 2517174 2567103
16527B567103k72899O30004j08595m05280k7017L97745j88177L73m42989J78305
$$ 2567103 2294204 2924208 2815613 2410333 2383316 2781061 2592884 2593257 2150268 2328573
16517B328573k00821K76205n1486j70707J9789j58954Q4602J01145k14500J06747
$$ 2328573 2127752 2403957 2352471 2181764 2201553 2042599 2127201 2228346 2013846 2120593
16507B120593k44127j1202n0501L89733m50831J76701n4506J46236k03656Q3124
$$ 2120593 1876466 1865264 1814763 2204496 1753665 1930366 1875860 2022096 1818440 1901564
16497A901564L33187k42254j94446j44759J34989J6209k10947M65817k26882J01823
$$ 1901564 2234751 1992497 1798051 1653292 1788281 1804490 1593543 2059360 1832478 1934301
16487A934301o2332j14794m5961j40983K45187L8886j2134m25765J02264l5530
$$ 1934301 1871969 1757175 1711214 1570231 1815418 1854304 1842170 1416405 1518669 1483139
16477A483139O9487j48485j28692K37492P7994j59025L4118K93342o23141K33006
$$ 1483139 1552626 1404141 1275449 1512941 1590935 1431910 1466028 1759370 1136229 1369235
16467A369235K06970k34459Q0514k12789L95693l38202j50325N04436l66484Q3452
$$ 1369235 1576205 1341746 1422260 1209471 1605164 1266962 1116637 1621073 1254589 1338041
16457A338041K40952l55815J34317j59462k2595K44500Q874m32296L07708J65517
$$ 1338041 1578993 1223178 1357495 1198033 1175438 1419938 1428812 996516 1304224 1469741
16447A469741k45395l7167K54075j64066o8629O9434j95974R6966l64049K48493
$$ 1469741 1224346 1187179 1441254 1277188 1208559 1277993 1082019 1178985 814936 1063429
16437A063429j5405m9187K71079k47655J95896l74517m0518P0873K33476L76066
$$ 1063429 1048024 998837 1269916 1022261 1218157 843640 803122 873995 1107471 1483537
16427A483537m05461J94315k75511j35537k6719K77383j61439K7874J19901l56543
$$ 1483537 1078076 1272391 996880 861343 834624 1112007 950568 978442 1098343 741800
16417G41800K0111M16140j56335k78188r4298M73209k27492r2839j2869J15805
$$ 741800 761911 1178051 1021716 743528 649230 1122439 894947 802108 789239 905044
16407I05044M3093K86442m62010M89421k26427p437O9127j68950k38879K47933
$$ 905044 948137 1234579 772569 1261990 1035563 1028126 1097253 928303 689424 937357
16397I37357k26118J64132J69017j7988J39183j90574m9189k28000j37553q4804
$$ 937357 711239 875371 1044388 1026400 1165583 975009 925820 697820 560267 475463
16387D75463M52144k47801L27817L5167l73860K54837p5502J7404l89136L67899
$$ 475463 927607 679806 1007623 1042790 668930 923767 848265 865669 476533 844432
16377H44432Q5623j57999R6366l89658M69107l72531J22593j17358K54141r7394
$$ 844432 930055 772056 868422 478764 947871 575340 697933 580575 834716 737322
16367G37322J32371j22171l1558k31456P5475J56935m4340O5627C03222K72671
$$ 737322 869693 747522 715964 484508 559983 716918 672578 738205 303222 575893
16357E75893J12721J40126J04855C84959M10884p8376j20646j9084P4840J2997
$$ 575893 688614 828740 933595 384959 795843 717467 596821 577737 652577 665574
16347F65574n5538P8347J21372j50972J32413k49753q8439J5912o526J21074k3247
$$ 665574 610036 688383 809755 658783 791196 541443 453004 468916 462390 583464 560217
16336E60217N488j50391m0401J36283j09266J28681P9215j31219j14235l4222
$$ 560217 565705 415314 374913 511196 401930 530611 609826 478607 364372 330150
16326C30150L83287j81776N2128k54889K97007j0995K16753j20867j51332j33841
$$ 330150 713437 531661 583789 328900 625907 614912 831665 710798 559466 425625
16316D25625j22571I1238L23393L21209k57860J05932j97272l6945F0648N91950
$$ 425625 303054 91238 414631 735840 477980 583912 386640 349695 60648 652598
16306F52598J77377D09210n542L5251j99097K92746r6851J18235l8028J87437
$$ 652598 829975 409210 403668 438919 239822 532568 435717 553952 515924 703361
16296G03361B30774J71369L5192k3297J43714J29984k62980J79120q4554k33285
$$ 703361 230774 402143 437335 414038 557752 687736 424756 603876 519322 286037
16286B86037K02177R1375A55766J37846K15475k09117J43527k01223L51699L274
$$ 286037 488214 579589 155766 293612 509087 299970 443497 242274 593973 597247
16276E97247B3420K59858k6601J34153A83632l4521J66856L11270j28325J97802
$$ 597247 23420 283278 256677 390830 183632 149111 315967 627237 498912 696714
16266F96714l37219l7371J41514I9556L18702p4043o1876K20425J86786k26665
$$ 696714 359495 322124 463638 99556 418258 344215 282339 502764 689550 462885
16256D62885j64888M3146L373K33072k54425o6395J25214q8579M6320J94232P0724
$$ 462885 297997 341143 344516 577588 323163 256768 381982 293403 339723 533955 604679
16245F04679k25601A14284k0315R9004K29724K5138k3265J36740j46532j90217
$$ 604679 379078 114284 93969 192973 422697 447835 424570 561310 414778 224561
16235B24561N1303O0039J17162B00380H8163L90428p3374o3210L72891l30746
$$ 224561 275864 335903 453065 200380 88163 478591 405217 342007 714898 384152
16225C84152J23237k53403J3076H4912L7865J70492P2468j49516R0501q5131k1645
$$ 384152 507389 253986 267062 84912 122777 293269 365737 216221 306722 221591 199946
16214A99946K78049k38149J02j01177L33086b4092C36093j3893k692J20041K8435
$$ 199946 477995 239846 239948 138771 471857 -24092 336093 322200 319508 439549 467984
16203D67984j01962E1526J87067p3703L35141m7066A05798J37691M9572o6666
$$ 467984 366022 51526 238593 164890 500031 452965 105798 243489 293061 226395
16193B26395P6408o2726F2104J29192M6978q5397l7367K48632d7616C3676N21731
$$ 226395 302803 240077 62104 191296 238274 152877 115510 364142 -47616 33676 555407
16182E55407j01147j24873D4771a01809J132F1273A3038P9751K61114a85963D74147
$$ 555407 454260 329387 44771 -101809 -100677 61273 13038 92789 353903 -185963 474147
16170B14670f8548c2928G9499J97035o2066n0210M7817i7444c4027B97249A27587
$$ 214670 -68548 -32928 79499 276534 214468 164258 212075 -97444 -34027 297249 127587
16158C32017e9786b0229j11276L3187m5467A83425A0163L16587r3190K724I0250
$$ 332017 -59786 -20229 -131505 -98318 -143785 183425 10163 326750 233560 236284 90250
16146I6720J46525d8907A8338Q6142K7705B6538J81970l6030l8535L41737F0468
$$ 96720 243245 -48907 18338 104480 132185 26538 208508 172478 133943 475680 60468
16134A96380j0391J42640a40620d9042A63990R524D0419j3542a915B77427i593
$$ 196380 185989 328629 -140620 -49042 163990 173514 40419 26877 -1915 277427 -9593
16122A27350J42258p528A20918a18778A00516l4649K11361A19273L5610p0310
$$ 127350 269608 262080 120918 -118778 100516 65867 277228 119273 154883 84573
16112H4573J03240F531K5793L31972j49584A9088P6668L18622j70967a2266j8596
$$ 84573 187813 6531 32324 364296 214712 19088 95756 414378 243411 -12266 -30862
16101c0862A01251K68122j13213Q8656j00404M6739r1952k6245R1321a02522m22270
$$ -30862 101251 369373 256160 344816 244412 291151 199199 172954 264275 -102522 -524792
16090e24792a44396B64339K26417F8105R7414C8958m285g5777I8784A9205M9345
$$ -524792 -144396 264339 490756 68105 165519 38958 34673 -75777 98784 19205 68550
16079F8550Q2947J09249b80072A48773F0965Q5865E2511a73223g8671A67258O8561
$$ 68550 151497 260746 -280072 148773 60965 146830 52511 -173223 -78671 167258 235819
16068B35819b14276f3002f045C4015K82287j11034J64508A43823P1306Q1348i3912
$$ 235819 -214276 -63002 -6045 34015 316302 205268 369776 143823 215129 296477 -93912
16056G7086f5273B15217a18640C03928A39689C1132J22713c74820F951K4794a28989
$$ 77086 -65273 215217 -118640 303928 139689 31132 153845 -374820 6951 31745 -128989
16044C03540A6288a03929A55949C1056M00809P8072j16815B9564Q1303i500l24498
$$ 303540 16288 -103929 155949 31056 431865 509937 393122 29564 110867 -9500 -333998
16033c33998D04026h204j62392F2314J41815b28635B069b76705H6326R4671O3383
$$ -333998 404026 -8204 -170596 62314 204129 -228635 2069 -276705 86326 180997 244380
16022B44380a44669A50755Q3699P7892c21379a15715A07211f4872a7196k52673
$$ 244380 -144669 150755 234454 312346 -321379 -115715 107211 -64872 -17196 -269869
16012b69869c2108l28439B76317A15452m4350B4029O3372P1928g203q4850A05289
$$ -269869 -32108 -360547 276317 115452 71102 24029 87401 159329 -7203 -92053 105289
16000f6044B48330h7034A56802l7936a4307n9847j48353P9238A05816d1463j44660
$$ -66044 248330 -87034 156802 118866 -14307 -74154 -222507 -143269 105816 -41463 -186123
15989a86123Q6123B82556e7701l39278D0822c01764D5951b73127I541J58422E7978
$$ -186123 -100000 282556 -57701 -396979 40822 -301764 45951 -273127 9541 167963 57978
15977F6141K5749d6383C14767A03579M54707J40809l7525K08960O9888J63619
$$ 66141 91890 -46383 314767 103579 558286 699095 661570 870530 940418 1104037
15967A104037l15327o2842k18589j42430j02361b1819B19786l5968c461j11166
$$ 1104037 788710 725868 507279 364849 262488 -21819 219786 183818 -3461 -114627
15957a14627p212C25556j19776L30112i9591p4001H7887J08942d7538p306j61720
$$ -114627 -121839 325556 205780 535892 -99591 -173592 87887 196829 -47538 -54844 -216564
15946b16564B86997J42491c69543a052j19771B31730e7022A43329j0124n6705
$$ -216564 286997 429488 -369543 -1052 -120823 231730 -57022 143329 133205 76500
15936G6500c8767l98891a74505o9524F0070a5939j84759A13362c64376D54003
$$ 76500 -38767 -437658 -174505 -244029 60070 -15939 -200698 113362 -364376 454003
15925d83611a34382d9611j34133L7354B80573a90203B65790e3059F7211h844A32136
$$ -483611 -134382 -49611 -183744 -146390 280573 -190203 265790 -53059 67211 -8844 132136
15913i3261A4573J48385B1316O6595b04857G6064K09427g1896c5730m1639A78315
$$ -93261 14573 162958 21316 87911 -204857 76064 285491 -71896 -35730 -77369 178315
15901B55736a92026A24318f8713A19548i8883a6677j77364A32007a22315N3718
$$ 255736 -192026 124318 -68713 119548 -98883 -16677 -194041 132007 -122315 -68597
15891f8597A19011n1023h094p6036j14363g6496k2987A7472K69098A15069j9863
$$ -68597 119011 67988 -8094 -84130 -198493 -76496 -99483 17472 286570 115069 95206
15880I5206J37821F3133a65978C8517J45073E5430J33713A0301a66179M434B67012
$$ 95206 233027 63133 -165978 38517 183590 55430 189143 10301 -166179 -161745 267012
15868a10635A4197J28193Q1047a56988H2032a4872q0238A88093F2739c3808k2729
$$ -110635 14197 142390 223437 -156988 82032 -14872 -95110 188093 62739 -33808 -56537
15857e6537k56797J50726D0268b58318A8411i0352j45027h9971B7242h5999c9993
$$ -56537 -313334 -162608 40268 -258318 18411 -90352 -235379 -89971 27242 -85999 -39993
15845a37577C21562l6015O0832F6711c39552A12874n2488J33242G9053j7350a33570
$$ -137577 321562 285547 346379 66711 -339552 112874 60386 193628 79053 61703 -133570
15833A45084a32544A47268o7136J10297a177B48184D8246i8379C88432a7277B99589
$$ 145084 -132544 147268 80132 190429 -1177 248184 48246 -98379 388432 -17277 299589
15821E0760a54770K6694n2083b6193A98795h0828J6172A07945b05632j9880k27563
$$ 50760 -154770 -128076 -180159 -26193 198795 -80828 -64656 107945 -205632 -225512 -453075
15810d53075b20720D7035c37887a53462N7023A70733b62308q0572g7914A45273
$$ -453075 -220720 47035 -337887 -153462 -96439 170733 -262308 -342880 -77914 145273
15799c58340h0475p7733l4410g2923a200j16934o1113p5118F6828C2817c2126
$$ -358340 -80475 -158208 -192618 -72923 -1200 -118134 -179247 -254365 66828 32817 -32126
15787c16115C74836A75116a15011j06269e0520G1388e221B62771i9760o7737D4790
$$ -316115 374836 175116 -115011 -221280 -50520 71388 -5221 262771 -99760 -167497 44790
15775a07814j93247B8822Q7208R4600q3702C521K77015E3505K16078B6104a97579
$$ -107814 -301061 28822 116030 210630 126928 3521 280536 53505 269583 26104 -197579
15763a15433B85348j11393a0666n7244j15413O8663H9365A7652i7933m9009B71872
$$ -115433 285348 173955 -10666 -67910 -183323 -114660 89365 17652 -97933 -146942 271872
15751a77129A7669K01436c03679E3830J42531p482a98426I6911K57503F4062e4787
$$ -177129 17669 219105 -303679 53830 196361 188879 -198426 96911 354414 64062 -54787
15739A40086o1254b92900b5669m9499I3038C3960g540C16717f0566B57847e0987
$$ 140086 78832 -292900 -25669 -75168 93038 33960 -7540 316717 -60566 257847 -50987
15727C9785a48349d0284A37532Q3038D3089F585b84259A76198A8544K46318F2048
$$ 39785 -148349 -40284 137532 220570 43089 6585 -284259 176198 18544 264862 62048
15715H8556b91999d8376B1561a13459l23178d8084F5540J37232n6904G2424a99385
$$ 88556 -291999 -48376 21561 -113459 -436637 -48084 65540 202772 145868 72424 -199385
15703e0326J4078H0340a88999B19095h9595q7687n8696H445R5591M0495d21569
$$ -50326 -36248 80340 -188999 219095 -89595 -177282 -235978 8445 104036 144531 -421569
15691B37657i30A20637a3516B5828L25996h5430n9491j52597E6084c24474A90963
$$ 237657 -930 120637 -13516 25828 351824 -85430 -144921 -297518 56084 -324474 190963
15679H6851a05673o8475c1221A40663i3391A02151b31061B952J51775J671B2476
$$ 86851 -105673 -174148 -31221 140663 -93391 102151 -231061 2952 154727 156398 22476
15667a28314H0926b19399K2663B74645n2678J0147a11492C09453c56250A99225
$$ -128314 80926 -219399 -196736 274645 221967 232114 -111492 309453 -356250 199225
15656A3273J1764b29123c2994F8603J49649a02773p3353j6055c0187r1614A7267
$$ 13273 25037 -229123 -32994 68603 218252 -102773 -176126 -192181 -30187 -121801 17267
15644a54572A08481a76659I3687a62416A6738C820a68174A03422h2487k7065D1514
$$ -154572 108481 -176659 93687 -162416 16738 3820 -168174 103422 -82487 -109552 41514
15632H911a92602m2716N6149B69591D6744J02801K623a97231A47112c28136B71095
$$ 8911 -192602 -235318 -179169 269591 46744 149545 152168 -197231 147112 -328136 271095
15620c1069p3721A33180E8993a45419B6255O0746J78095a46697N1693G2643a58905
$$ -31069 -104790 133180 58993 -145419 26255 87001 265096 -146697 -95004 72643 -158905
15608f0101A37457e1580C87295G6957b15217k06212G8355K50208a18687d8987
$$ -60101 137457 -51580 387295 76957 -215217 -421429 78355 328563 -118687 -48987
15597a80647A59586o1992a60187L1397e7964H6103a17015A8013M0256b08884p5719
$$ -180647 159586 97594 -160187 -128790 -57964 86103 -117015 18013 58269 -208884 -284603
15586b84603a08334b1253E3359i3465A67082a2716D03048a66738A42752a08095
$$ -284603 -108334 -21253 53359 -93465 167082 -12716 403048 -166738 142752 -108095
15575a47869D959a92583k35962a46405j50546C54573I763h7065j2717A20266m0486
$$ -147869 4959 -192583 -428545 -146405 -296951 354573 9763 -87065 -99782 120266 79780
15564G9780R6365c1799l9955D7564h0599m13671c53B4363b5550k17475j9185A0454
$$ 79780 176145 -31799 -71754 47564 -80599 -494270 -353 24363 -25550 -243025 -262210 10454
15551d5304A60846b2578A30069D2266R0728N1634d3502J9866q1041b4040A36915
$$ -45304 160846 -22578 130069 42266 132994 184628 -43502 -23636 -104677 -24040 136915
15539d8144H7309d9237j3700j84725J15197k1820A1811a84663e4538A82339C7964
$$ -48144 87309 -49237 -62937 -247662 -132465 -154285 11811 -184663 -54538 182339 37964
15527c3671A75913D2591Q8129N4454A3325K01064a15125A1969J28281M3010b0417
$$ -33671 175913 42591 130720 185174 13325 214389 -115125 11969 140250 183260 -20417
15515b20463A50173M0933b39614c2278D5010e2767p4990B03697d22592C66930
$$ -220463 150173 191106 -239614 -32278 45010 -52767 -127757 203697 -422592 366930
15504A02437J54728q4172c7896m5889F1849O677J22459L1396e1116m3004C50436
$$ 102437 257165 172993 -37896 -83785 61849 68526 190985 222381 -51116 -94120 350436
15492b19243E9972A8385K34453J16218G2197J60384M9774J3471J2860m8766m8392
$$ -219243 59972 18385 252838 369056 72197 232581 282355 295826 308686 259920 211528
15481B11528I6757R9748D6037B31L14015q7319a5507m10429A84429o0225a7794
$$ 211528 96757 196505 46037 231 314246 226927 -15507 -425936 184429 124204 -17794
15469b4541A46498l7280a85607A5246J64727B3559J00021a60914B10687J5986
$$ -24541 146498 109218 -185607 15246 179973 23559 123580 -160914 210687 226673
15459B26673J81879J39063j93076J15892L0155j55311A71736m9600a40549A22562
$$ 226673 408552 547615 354539 470431 500586 345275 171736 122136 -140549 122562
15448i8507C20719d866o9349H1685a66448E7176J52988a68564H929K36580F6009
$$ -98507 320719 -4866 -74215 81685 -166448 57176 210164 -168564 8929 245509 66009
15436A03557g5698A22890e1067j69641B01032l5950l3875J09435K11019j12754
$$ 103557 -75698 122890 -51067 -220708 201032 165082 131207 240642 451661 338907
15426C38907M10105K05944K3946j18269D20704j87392p8966R5005a0550o5409
$$ 338907 749012 954956 978902 860633 420704 233312 154346 249351 -10550 -75959
15416g5959C11606H5687J26657k4013i3538a1346B16351O6945e4675k402a9128
$$ -75959 311606 85687 212344 188331 -93538 -11346 216351 283296 -54675 -57077 -19128
15404B1914d2232j91671P8344A15728J71613j27796d5298I4029e940E3153E851
$$ 21914 -42232 -233903 -155559 115728 287341 159545 -45298 94029 -5940 53153 5851
15392a18665E1307a22780H444N4945N448L05279C0285J85803b62151A09191a35819
$$ -118665 51307 -122780 8444 63389 68837 374116 30285 216088 -262151 109191 -135819
15380B00277b02308L2703C6375J0817a17968B84424A18348b97140B10427f717
$$ 200277 -202308 -169605 36375 47192 -117968 284424 118348 -297140 210427 -6717
15369d5003Q545A83344a57744C63412j77931c15853A21657i9958B63743j14824
$$ -45003 -36458 183344 -157744 363412 185481 -315853 121657 -99958 263743 148919
15359A48919b0273C09794A08582J8174j5090K65233n9087A36217l7808O6401J01289
$$ 148919 -20273 309794 108582 126756 111666 376899 317812 136217 98409 164810 266099
15348B66099B494K49911C3103g605B27896k7726K57608b759C14027j13847a51561
$$ 266099 2494 252405 33103 -7605 227896 200170 457778 -2759 314027 200180 -151561
15336C03707a80656B99007p7103n280E7710K08312a3924F05154j35403H1404L8104
$$ 303707 -180656 299007 221904 216624 57710 266022 -13924 605154 469751 81404 119508
15325A19508J36904c0179j27085C46404h0214D9086L91818B9185H791J46099p0740
$$ 119508 256412 -30179 -157264 346404 -80214 49086 440904 29185 8791 154890 84150
15314H4150e471B68016m4990b86920a01910C56170h7809A4162L6057a3092k036
$$ 84150 -5471 268016 223026 -286920 -101910 356170 -87809 14162 50219 -13092 -15128
15303a5128D6943h0288I6842Q706K06956o0751e4258A68401J59059a46138O1740
$$ -15128 46943 -80288 96842 105548 312504 251753 -54258 168401 327460 -146138 -84398
15292h4398B81708O7294i177j65774B18908a30834k765c6191C46865H8672e551
$$ -84398 281708 349002 -9177 -174951 218908 -130834 -133599 -36191 346865 88672 -5551
15280A1572M6745d8691j07320B06815d20280A42248K42361d4542B81413J14065
$$ 11572 58317 -48691 -156011 206815 -420280 142248 384609 -44542 281413 395478
15270C95478A07659J73100C5193a2514m4365B09027L9789b56794A47915a53201
$$ 395478 107659 280759 35193 -12514 -56879 209027 248816 -256794 147915 -153201
15259a95083C68087d332A09778f1804B64147j02785b04473O7992C0386L9064M5484
$$ -195083 368087 -4332 109778 -61804 264147 161362 -204473 -136481 30386 69450 114934
15248A14934A5471e1367j47808a4899B43955A19316J79860m8306c6600C50885
$$ 114934 15471 -51367 -199175 -14899 243955 119316 299176 250870 -36600 350885
15237B45711I2412g836B37475b7985A79219b6248B31200J26905O7845k0989K06149
$$ 245711 92412 -7836 237475 -27985 179219 -26248 231200 358105 425950 404961 611110
15226F11110R88640k11814l1046J00173F09600a35981i409C19969q5425G9698
$$ 611110 1599750 1387936 1356890 1457063 609600 -135981 -9409 319969 234544 79698
15215A24360a57636A37568N913B0192J2678c76705A91852C9164p593B927K242
$$ 124360 -157636 137568 143481 20192 32870 -376705 191852 39164 31571 2927 5169
15204E169R8022m5668L00204j31008a11772A56815a69265C09549f6901j60657
$$ 5169 103191 57523 357727 226719 -111772 156815 -169265 309549 -66901 -227558
15194b27558a6358F2359J13865G7752k7415a18926A13035K25675B9143J54655
$$ -227558 -16358 62359 176224 77752 50337 -118926 113035 338710 29143 183798
15184A83798f8092m5165n8003D25215A12712a46196C73879C7244J2072R3575B6952
$$ 183798 -68092 -113257 -171260 425215 112712 -146196 373879 37244 49316 142891 26952
15172B24959Q2393D073J76128a8782h52j59831B25870H3363O2928a89394K1183
$$ 224959 307352 4073 180201 -18782 -852 -160683 225870 83363 146291 -189394 -168211
15161a68211j99631A57744Q355K00404A47664c09367D6188K02156B0060R2047
$$ -168211 -367842 157744 166099 366503 147664 -309367 46188 248344 20060 112107
15151A12107C216K00923g2139n977j69415B4409J27876e6943B63717e8190o5048
$$ 112107 3216 204139 -72139 -78116 -247531 24409 152285 -56943 263717 -58190 -123238
15140a23238A60735K9231n0009J84292d3594B8276f9706D5372L20385A02461K167
$$ -123238 160735 189966 139957 324249 -43594 28276 -69706 45372 365757 102461 104628
15129A04628A8982K05063l8269E5213J5836L73908C7396K2046J00872f9794A68436
$$ 104628 18982 224045 185776 55213 71049 444957 37396 59442 160314 -69794 168436
15117b23662B90587J6117o8336a57127A15262J90928R5471B2514K26423M394K4531
$$ -223662 290587 306704 238368 -157127 115262 306190 401661 22514 248937 253331 277862
15106B77862k6081K2776N4994J53204k38751A19710D7801J69891j963H3607J1896
$$ 277862 251781 274557 329551 482755 244004 119710 47801 217692 215729 83607 95503
15095I5503d1070I4611K23354b74579B18447j01486A4845J16173j4040J73364
$$ 95503 -41070 94611 317965 -274579 218447 116961 14845 131018 116978 290342
15085B90342j05821a0418A18753J93108j41127K04752a28185D24322K79812e6362
$$ 290342 184521 -10418 118753 311861 170734 375486 -128185 424322 704134 -56362
15074B09588I1896L36180a13023B41473a64288D08961A63972n9365P5705F2026
$$ 209588 91896 428076 -113023 241473 -164288 408961 163972 104607 180312 62026
15063C93673j54991A06650J40399O0620J85803b60213C96156a46117C29423H046
$$ 393673 238682 106650 247049 307669 493472 -260213 396156 -146117 329423 8046
15052A02784K65853A08611m364i5878A61127L9351O3398r1049C6373J11372L6049
$$ 102784 368637 108611 104247 -95878 161127 200478 263876 172827 36373 147745 183794
15041A83794O3233R471j14343K4604q2015R2471J96205j05990A21102K00729K3593
$$ 183794 247027 256498 142155 166759 84744 177215 373420 267430 121102 321831 345424
15030C45424p4086M12359B14675P7355K24567B28359I1117K19707K49761A17864
$$ 345424 271338 683697 214675 292030 516597 228359 91117 310824 560585 117864
15019F08159j80827D3778M54396q6211K30231k29732K94129k14803K42508B84511
$$ 608159 427332 43778 498174 411963 642194 412462 706591 491788 734296 284511
15008D97216K4874q4833K34730k6004q1279J99103B16965I1394N1567J99966j22184
$$ 497216 522090 437257 671987 645983 564704 763807 216965 91394 142961 342927 220743
14997B20743L80029A22329M52904k79282M3031K44777j7438A56758K27587n9608
$$ 220743 600772 122329 575233 295951 338982 583759 566321 156758 384345 324737
14987C24737N8771A82803N06548j82562j6104n6949p6546n8938N00739A87493
$$ 324737 383508 182803 689351 506789 490685 433736 357190 298252 798991 187493
14976A06119K48011f5617D79772J34726j39576r3009L28236B44688L43466j32385
$$ 106119 354130 -65617 479772 614498 474922 381913 710149 244688 588154 455769
14966D55769L65072j71391L20553m81450K14585C48002J45549J12689j85309K78300
$$ 455769 820841 649450 970003 488553 703138 348002 493551 606240 420931 699231
14956F99231L469F2468L85826L34618B63044K7828e1833D12119A59036K07913
$$ 699231 702700 62468 448294 782912 263044 290872 -51833 412119 159036 366949
14946C66949J50223B57798R1167o5134L472J4858Q2382o8671a63223C75606j22255
$$ 366949 517172 257798 348965 283831 287303 302161 384543 315872 -163223 375606 253351
14935B53351L17417k56877P202P587l707H1764J86637J34624K91976n7564k66045
$$ 253351 570768 313891 321093 328680 324973 81764 268401 403025 695001 637437 371392
14924C71392K54145n3171n7263j38272J00290K88851j43250o6627J45196K05154
$$ 371392 625537 572366 515103 376831 477121 765972 622722 556095 701291 906445
14914I06445j66406M04307K997K81152j30438l2067J99400P8859k51900J0874
$$ 906445 740039 1144346 1147343 1428495 1298057 1265990 1465390 1544249 1292349 1303223
14904A303223M33555M3813K16239j44313P1624o24408o7618O9941k58010j73099
$$ 1303223 1736778 1780591 1996830 1852517 1924141 1299733 1232115 1302056 1044046 870947
14894H70947l65201q419J78691j91344B00992N08106k65733L11054j39709k73598
$$ 870947 505746 497327 676018 484674 200992 709098 443365 754419 614710 341112
14884C41112A15471L92648o3061A99232K47944o2639j63765K61257J69229j50151
$$ 341112 115471 508119 445058 199232 447176 384537 220772 482029 651258 501107
14874E01107j89632L79377j17605N5255k46998L13139L46427l15549k90856L39844
$$ 501107 311475 690852 573247 628502 381504 694643 1041070 725521 434665 774509
14864G74509k36638P925L23038J06722k88986k01782J48313L2988B94030K58952
$$ 774509 537871 545796 868834 975556 686570 484788 633101 666089 294030 552982
14854E52982R8358k9090N8517l4403m8569K2751k1846K94377k32239K09455C77692
$$ 552982 651340 622250 680767 646364 597795 620546 598700 893077 660838 870293 377692
14842C66481J87385J80197C09383m1423M17546k01905K17707C08526K03445J0966
$$ 366481 553866 734063 309383 267960 685506 483601 701308 308526 511971 522937
14832E22937K644L93284D58666O17822l20016l0724L02000j39752K913N3672j67339
$$ 522937 525581 918865 458666 1076488 756472 725748 1027748 887996 890909 944581 777242
14821G77242K9509J75493k3726j40297j16285k30052J70718j82401j2313M63665
$$ 777242 806751 982244 958518 818221 701936 471884 642602 460201 447888 911553
14811I11553l23348J39955J97796B69992L43406j57174J33087j811L34528j70492
$$ 911553 588205 728160 925956 269992 613398 456224 589311 587500 922028 751536
14801G51536L0815P5897k57836L1438m7354J60277p8709J57759J06453j93301
$$ 751536 782351 858248 600412 631850 584496 744773 666064 823823 930276 736975
14791G36975k2811J82686J15085N9079J01107l44328k05986n0504q070q9551K1203
$$ 736975 714164 896850 1011935 1071014 1172121 827793 621807 571303 563233 473682 494885
14780D94885P7608E4472P22509k85732Q4145J08626J59328o9266k92759J50167
$$ 494885 572493 54472 776981 491249 575394 684020 843348 774082 481323 631490
14770F31490l06587N33238j25364C51919j8787O23082l85605J61538N68932l45178
$$ 631490 324903 858141 732777 351919 333132 956214 570609 732147 1301079 955901
14760I55901l54019K00232L22751E05229N34804l23982j20152n3224J97478k52740
$$ 955901 601882 802114 1124865 505229 1040033 716051 595899 542675 740153 487413
14750D87413J68211L23584k04016J17410l69948K77832L3237O2557k63971J63805
$$ 487413 655624 979208 775192 892602 522654 800486 833723 896280 632309 796114
14740G96114J64611l45792M0319K875O4211J01521j47973j15715M83216m33082
$$ 796114 960725 614933 655252 658127 722338 823859 675886 560171 1043387 610305
14730F10305K6935M9002J44708J33665m09350L52133k16809M3863L00633E05022
$$ 610305 637240 686242 830950 964615 555265 907398 690589 734452 1035085 505022
14719G08826p6025J32175L06620j96880K71531K78342k03963N82571o3812k35043
$$ 708826 632801 764976 1071596 874716 1146247 1424589 1220626 1803197 1739385 1504342
14709A504342j95552L26128l70137l65369J37764J59834E54318M50386k2011K08022
$$ 1504342 1308790 1634918 1264781 899412 1037176 1197010 554318 1004704 982693 1190715
14699A190715D72877N43710n2293m28364N34081k46198K05804J73241j58785p4565
$$ 1190715 472877 1016587 964294 535930 1070011 823813 1029617 1202858 1044073 969508
14689I69508J51287K79532K58201k468o4371k07024K51062l71593m25622J28728
$$ 969508 1120795 1400327 1658528 1656060 1591689 1384665 1635727 1264134 838512 967240
14679I67240j34754J54053l6201M40627k31402l23583J18963J38137k05132m6082
$$ 967240 832486 986539 950338 1390965 1159563 835980 954943 1093080 887948 841866
14669H41866K77361l38009K86063r3861j27569J95649O9046l53269O0919L44693
$$ 841866 1119227 781218 1067281 973420 845851 1041500 1110546 757277 818196 1162889
14659A162889k20657O8206m56310N49605l9430J67605k56557N25j32900m3628
$$ 1162889 942232 1010438 554128 1103733 1064303 1231908 975351 975876 842976 799348
14649G99348M9972K84110N487J80412k14869k50159J78779P7574k12980N50219
$$ 799348 849320 1133430 1138917 1319329 1104460 854301 1033080 1110654 897674 1447893
14639A447893m7124L5366k31843J72791M55553p71813K67160n3678j48248N1584
$$ 1447893 1400769 1436135 1204292 1377083 1832636 1060823 1327983 1274305 1126057 1177641
14629A177641K04681j22974P1808m753j53619q9855K72219J60738o9930q2982
$$ 1177641 1382322 1259348 1331156 1326403 1172784 1082929 1355148 1515886 1445956 1362974
14619A362974m55817K88299q7520J91889j54668k4121l24368O49233o34159M73039
$$ 1362974 907157 1195456 1107936 1299825 1145157 1121036 796668 1445901 811742 1284781
14609A284781J68389k29958K57269p3454j80382K91314L7229l43193K94700N0034
$$ 1284781 1453170 1223212 1480481 1407027 1226645 1517959 1555188 1211995 1506695 1556729
14599A556729M1687n01737O12816m18102l02504O47007l4383k74010M2251N3958
$$ 1556729 1598416 1096679 1709495 1291393 988889 1635896 1601513 1327503 1369754 1423712
14589A423712M08210l76358K70491N4828n7417j34465J18832l77388K19895M2487
$$ 1423712 1831922 1455564 1726055 1780883 1723466 1589001 1707833 1330445 1550340 1592827
14579A592827J96666j95703K81090l56811L29936r0089L30183l29028J69465p3380
$$ 1592827 1789493 1593790 1874880 1518069 1848005 1757916 2088099 1759071 1928536 1855156
14569A855156k2663J22154l2566r4807J2926m6028K61121j35673L6934L38656
$$ 1855156 1832493 1954647 1922081 1827274 1840200 1794172 2055293 1919620 1956554 2295210
14559B295210r0518j44946j43703K99726R8704L03548l92265J2551j17552L44001
$$ 2295210 2204692 2059746 1916043 2215769 2314473 2618021 2225756 2238307 2120755 2464756
14549B464756N202R1228R6545M05286r3287r0403O6178M98720r2320L14557O95210
$$ 2464756 2469958 2561186 2657731 3063017 2969730 2879327 2945505 3444225 3351905 3666462 4361672
14538D361672M49599N37944N81412J653977K586543M267045N670721J1991732
$$ 4361672 4811271 5349215 5930627 7584604 10171147 14438192 20108913 32100645
14530C2100645J966835j5716594p986461m197601j828401m46492j61914o2292
$$ 32100645 34067480 18350886 10364425 6166824 4338423 3891931 3730017 3667725
14522C667725N17887M55416j222925m96632n01157j64851j08041J87913k46263
$$ 3667725 4185612 4641028 3418103 2921471 2420314 2255463 2147422 2335335 2089072
14513B089072L03442k77418J07184J86268J00213K4731J73369l32268J25127l9862
$$ 2089072 2392514 2115096 2222280 2408548 2508761 2533492 2706861 2374593 2499720 2459858
14503B459858M9746j01456L64335l06312K08042P9855j10516J3189j5696O474
$$ 2459858 2509604 2408148 2772483 2466171 2674213 2754068 2643552 2656741 2641045 2647519
14493B647519K34264j7515M12088l32873n4618K09460p884k1876N0121j86548
$$ 2647519 2881783 2864268 3276356 2943483 2888865 3098325 3090441 3068565 3118686 2932138
14483B932138J73553L17441L5748q5387J31499l23720J78065P9559J15677q0518
$$ 2932138 3105691 3423132 3458880 3373493 3504992 3181272 3359337 3438896 3554573 3474055
14473C474055L50000n24468K14345K1084P5141K25878J27582J91322k54647j92868
$$ 3474055 3824055 3299587 3513932 3535016 3610157 3836035 3963617 4154939 3900292 3707424
14463C707424J98209K96003k89381P7380R583Q4499n5455J50554J82034j51117
$$ 3707424 3905633 4201636 3912255 3989635 3999218 4083717 4028262 4178816 4360850 4209733
14453D209733K42138j23958J20168R557p895K94055L76370k14196j46518L44551
$$ 4209733 4451871 4327913 4448081 4457638 4449743 4743798 5120168 4905972 4759454 5104005
14443E104005k29812N2786M98882k15091k36978K66833J0339j35206L44965K09022
$$ 5104005 4874193 4926979 5425861 5210770 4973792 5240625 5250964 5115758 5460723 5669745
14433E669745j36971R5324L22698j17861k35861K28723J06087J93973n5291L22508
$$ 5669745 5532774 5628098 5950796 5832935 5597074 5825797 5931884 6125857 6070566 6393074
14423F393074J45949M7151k38565J61061j67636L83521o5317O31251n93891M62561
$$ 6393074 6539023 6586174 6347609 6508670 6341034 6724555 6659238 7290489 6696598 7159159
14413G159159j97584J63256L83985k91024M51428K14082J10104J27763J54179
$$ 7159159 6961575 7124831 7508816 7217792 7669220 7883302 7993406 8121169 8275348
14404H275348M08110J34709j39606P7974P3761j18303J40475L01895J70359j91181
$$ 8275348 8683458 8818167 8678561 8756535 8830296 8711993 8852468 9154363 9324722 9133541
14394I133541K70622L7726J56851M76728J53943j37118N23343J17721k71142L80179
$$ 9133541 9404163 9441889 9598740 10075468 10229411 10092293 10615636 10733357 10462215 10842394
14384A0842394n8328J74821L27113Q2153Q8565N37614M8602l3084L05109M55622
$$ 10842394 10784066 10958887 11286000 11368153 11456718 11994332 12042934 12009850 12314959 12770581
14374A2770581l40045M48290N08103K27163l655J20985O36467M2896N59309m2246
$$ 12770581 12430536 12878826 13386929 13614092 13610437 13731422 14367889 14410785 14970094 14927848
14364A4927848M21152M70163J93158L31284J50444K82440K55910K11845M74837
$$ 14927848 15349000 15819163 16012321 16343605 16494049 16776489 17032399 17244244 17719081
14355A7719081O90839r524N14236Q53350j38144R71270K55119L29648K44540O72212
$$ 17719081 18409920 18400396 18914632 19767982 19629838 20601108 20856227 21185875 21430415 22102627
14345B2102627J34829O55453K53072N68540O97359Q07889N05144L14693M93190
$$ 22102627 22237456 22892909 23145981 23714521 24411880 25219769 25724913 26039606 26532796
14336B6532796O30121M89106J060522P90113Q71640P05631M72853J040195R14537
$$ 26532796 27162917 27652023 28712545 29502658 30374298 31079929 31552782 32592977 33507514
14327C3507514P96866J009460Q94191R30509O06734J607028J302624J071373J336640
$$ 33507514 34304380 35313840 36208031 37138540 37745274 39352302 40654926 41726299 43062939
14318D3062939J267225J622802Q32882J586693J895133J636990J693683J425558
$$ 43062939 44330164 45952966 46785848 48372541 50267674 51904664 53598347 55023905
14310E5023905J878689K194524J952091K347242K200730J805285L066110K486532
$$ 55023905 56902594 59097118 61049209 63396451 65597181 67402466 70468576 72955108
14302G2955108K466145L062717L094542K683129L533802L454887M204964L915186
$$ 72955108 75421253 78483970 81578512 84261641 87795443 91250330 95455294 99370480
14294I9370480L931377M500335M728110N295381N080364N950777O241631O201517
$$ 99370480 103301857 107802192 112530302 117825683 122906047 128856824 135098455 141299972
14286A41299972O639464P425918P358462Q404257Q351437R292861R331379J0273811
$$ 141299972 147939436 155365354 162723816 171128073 179479510 188772371 198103750 208377561
14278B08377561J0678203J1243737J2219656J2450112J2981104J3693600J4251946
$$ 208377561 219055764 230299501 242519157 254969269 267950373 281643973 295895919
14271B95895919J4752369J4804122J4818022J4787886J4799426J4133135J3320311
$$ 295895919 310648288 325452410 340270432 355058318 369857744 383990879 397311190
14264C97311190J2429470J1635114J0767184J0113993R500900Q471263M797446
$$ 397311190 409740660 421375774 432142958 442256951 451757851 460229114 465026560
14257D65026560K667404K982238L754367J110049o175346l382001o281044r703533
$$ 465026560 467693964 470676202 474430569 475540618 469365272 465983271 459702227 449998694
14249D49998694j1302691j2410104j3703289j3973510j4280257j4643321j4556493
$$ 449998694 438696003 426285899 412582610 398609100 384328843 369685522 355129029
14242C55129029j4681240j4669554j4391372j3677165j3925871j2847010j2621124
$$ 355129029 340447789 325778235 311386863 297709698 283783827 270936817 258315693
14235B58315693j2323523j2187682j2134932j0628792j0736974j0479030r166493
$$ 258315693 245992170 233804488 221669556 211040764 200303790 189824760 180658267
14228A80658267r226341q663162p693991p333424p166725o016360o166226n575033
$$ 180658267 171431926 162768764 155074773 147741349 140574624 134558264 128392038 122817005
14220A22817005n539619n244555m648564m390210l770350m446808m013022l475223
$$ 122817005 117277386 112032831 107384267 102994057 99223707 94776899 90763877 87288654
14212H7288654l301188l319759l175938k626235k769224k780081j838894k637654
$$ 87288654 83987466 80667707 77491769 74865534 72096310 69316229 67477335 64839681
14204F4839681k514694j832108k062021j697338j910895j737435j159031k189032
$$ 64839681 62324987 60492879 58430858 56733520 54822625 53085190 51926159 49737127
14196D9737127j177594j524681j336325j315055q66195j239903j490300j039234
$$ 49737127 48559533 47034852 45698527 44383472 43517277 42277374 40787074 39747840
14188C9747840j601917p58303n50908p91931j165871j245084o89565j171084o30113
$$ 39747840 38145923 37387620 36836712 36044781 34878910 33633826 32944261 31773177 31143064
14179C1143064n54651r41789m79249r72192r54573o75970m74242l66855q26000
$$ 31143064 30588413 29646624 29167375 28195183 27240610 26564640 26090398 25723543 24897543
14170B4897543o93311j59548r00283l74523m19356m89828n93662o68608r6039
$$ 24897543 24204232 24044684 23144401 22769878 22350522 21860694 21267032 20598424 20502385
14161B0502385k89494l65189m42044m36503m21541k65256m64900m4834n34452
$$ 20502385 20212891 19847702 19405658 18969155 18547614 18282358 17817458 17772624 17238172
14152A7238172k48687j0600q66865P6238n07878j39546n77491o624m49744N8070
$$ 17238172 16989485 16978885 16112020 16188258 15680380 15540834 14963343 14956719 14506975 14565045
14142A4565045l53342p97201L47229k17357n55467j90705q4253k57075l58850
$$ 14565045 14211703 13414502 13761731 13544374 12988907 12798202 12713949 12456874 12098024
14133A2098024O0423k89664l04287J90263n73553j7852j8024l38875k37556j16793
$$ 12098024 12158447 11868783 11564496 11754759 11181206 11163354 11145330 10806455 10568899 10452106
14123A0452106r697j98700j02537j59230l69484l19238L84037j92206k53012k23488
$$ 10452106 10442409 10243709 10141172 9981942 9612458 9293220 9677257 9485051 9232039 9008551
14113I008551J20417n06368K55683K5415l45131k24032n8745k80663M1327j60020
$$ 9008551 9128968 8622600 8878283 8903698 8558567 8334535 8275790 7995127 8036454 7876434
14103G876434N982o1242m31898K81495k06260j93565j76446K45429k71370J66757
$$ 7876434 7882416 7821174 7389276 7670771 7464511 7270946 7094500 7339929 7068559 7235316
14093G235316k36588J80387l07946k07170k86211j13967J84326k05537K067r2643
$$ 7235316 6998728 7179115 6871169 6663999 6377788 6263821 6448147 6242610 6244677 6152034
14083F152034J56651m49183J24426k34744L42916k09336l63956K46570k01273
$$ 6152034 6308685 5859502 5983928 5749184 6092100 5882764 5518808 5765378 5564105
14074E564105r3271j75679J26726k10702l9318N5193n1278k45977K68832j39362
$$ 5564105 5470834 5295155 5421881 5211179 5171861 5227054 5175776 4929799 5198631 5059269
14064E059269j6056l77702O64110p46768J45812m0646r1168k02241M2403K43376
$$ 5059269 5043213 4665511 5329621 4582853 4728665 4688019 4596851 4394610 4437013 4680389
14054D680389l18140j274L13232j50700l71067J21788J45951j54562j28853L64685
$$ 4680389 4362249 4360975 4674207 4523507 4152440 4274228 4420179 4265617 4136764 4501449
14044D501449m69167L15140l31964J665L7611m8943j65656L7460k00602k17418
$$ 4501449 4032282 4347422 4015458 4017123 4054734 4005791 3840135 3877595 3676993 3459575
14034C459575J09695K56194l36868K49163l04318m5301O9484j83982K63264j96963
$$ 3459575 3569270 3825464 3488596 3737759 3433441 3388140 3457624 3273642 3536906 3339943
14024C339943q875K8797Q1465k99173n2311j84055N46580L25735l78560k07901
$$ 3339943 3331068 3359865 3441330 3142157 3089846 2905791 3452371 3778106 3399546 3191645
14014C191645k1748m3225J78604k94807J46735N79l08594L37680k23993j15912
$$ 3191645 3169897 3126672 3305276 3010469 3157204 3157783 2849189 3186869 2962876 2846964
14004B846964r506j0098j21734O5196k8928M6497r2273K47844n39434J42931l8801
$$ 2846964 2837458 2827360 2705626 2770822 2741894 2788391 2696118 2943962 2404528 2547459 2508658
13993B508658P968j41182m6554K18004p9501j12290j03190P9013J59248j43241
$$ 2508658 2516626 2375444 2328890 2546894 2467393 2355103 2251913 2330926 2490174 2346933
13983B346933j54088j78848N05660l1287J02114M12424L48794M27582J003945
$$ 2346933 2192845 2013997 2519657 2488370 2590484 3002908 3351702 3779284 4783229
13974D783229J838529L617949N467626J1012089J0511432j3823832q507874n132124
$$ 4783229 6621758 10239707 15707333 26719422 37230854 23407022 14899148 9767024
13966I767024k394186j695797r29847l04655n69924l16000m4727l62786k19612
$$ 9767024 7372838 5677041 4747194 4442539 3872615 3556615 3511888 3149102 2929490
13957B929490J83673j89829l44836j4126R9560k05159k36611K79377J90948l75311
$$ 2929490 3113163 2923334 2578498 2564372 2663932 2458773 2222162 2501539 2692487 2317176
13947B317176R9987k83466L8088J3179k4142J26276m5633j42632o8311Q6751l41036
$$ 2317176 2417163 2133697 2171785 2184964 2160822 2287098 2241465 2098833 2030522 2117273 1776237
13936A776237J7849J31001K6500l6716K2856j41663J46398p851J04807j40276
$$ 1776237 1794086 1925087 1951587 1914871 1937727 1796064 1942462 1934611 2039418 1899142
13926A899142L1695r012O5900l74116K22958l06121K23113m11102K40274l6471
$$ 1899142 1930837 1921825 1987725 1613609 1836567 1530446 1753559 1342457 1582731 1546260
13916A546260j24478J53279l83K3208J48606j1107R0970m24729N48009l97441
$$ 1546260 1421782 1575061 1574678 1597886 1746492 1735385 1826355 1401626 1949635 1552194
13906A552194R5560j28273j7568J31255P2486l48319L63730o7712j69232J42621
$$ 1552194 1647754 1519481 1501913 1633168 1705654 1357335 1721065 1653353 1484121 1626742
13896A626742J46918l67411L10045l2749k54950n2593K40087n90240N1531J58399
$$ 1626742 1773660 1406249 1716294 1683545 1428595 1376002 1616089 1025849 1077380 1235779
13886A235779Q6253k4973K26987l01498J56114k1244J76428l5137n780K151p4828
$$ 1235779 1322032 1297059 1524046 1222548 1378662 1357418 1533846 1498709 1492929 1495080 1420252
13875A420252P2410j28393J50501m09101N8865M4362J74765j70406R0412J15814
$$ 1420252 1492662 1364269 1514770 1105669 1164534 1208896 1383661 1213255 1303667 1419481
13865A419481k46186J52626J66786k38391j64382J00770l6800j98241L30898k05642
$$ 1419481 1173295 1325921 1492707 1254316 1089934 1190704 1153904 955663 1286561 1080919
13855A080919j0409K34893n6380j53901o6979K65543l47642j0748J60322J092
$$ 1080919 1070510 1305403 1249023 1095122 1028143 1293686 946044 935296 1095618 1096710
13845A096710k97414J06884L00940J83330m20992k1286l248m1367R05J39125M46278
$$ 1096710 799296 906180 1207120 1390450 969458 948172 944924 903557 904462 1043587 1489865
13834A489865l77783j49768J35790l46251J42732L16003j48435L1690k12100N17239
$$ 1489865 1112082 962314 1098104 751853 894585 1210588 1062153 1093843 881743 1398982
13824A398982j97663m48330N35035l14885r7837J80735L48041j17240M0454m40219
$$ 1398982 1201319 752989 1288024 973139 875302 1056037 1404078 1286838 1327292 887073
13814H87073O152J57654k42373K2660j21127R2077J95261j86710J19361q7664
$$ 887073 893225 1050879 808506 831166 710039 802116 997377 810667 930028 842364
13804H42364L209J80835J67121k00154j39862j78752K07760N25284j66380n73656
$$ 842364 845573 1026408 1193529 993375 853513 674761 882521 1407805 1241425 667769
13794F67769K78155n2040K2280J30439k15014P861J08317k9008O5577J05464l99624
$$ 667769 945924 893884 916164 1046603 831589 839450 947767 918759 984336 1089800 690176
13783F90176j81292J14046M91037k17921l19225O98184j79335r5371j16587n6312
$$ 690176 508884 622930 1113967 896046 576821 1275005 1095670 1000299 883712 827400
13773H27400J74734j63909J28548N9439j30201r2198n3575O8981A78067L77153
$$ 827400 1002134 838225 966773 1026212 896011 803813 750238 819219 178067 555220
13763E55220M0381J22299l580o692K28821l30489K31065k99236K30168k19594
$$ 555220 595601 717900 714320 707628 936449 605960 837025 537789 767957 548363
13753E48363M9837m2180j53928M41531q6447q1511L8836j17515m14J52646j66560
$$ 548363 598200 556020 402092 843623 757176 675665 714501 596986 596572 749218 582658
13742E82658j47420J94145j16500J82103J72285m3747L7693j51074B87664O11133
$$ 582658 435238 629383 512883 694986 867271 823524 861217 710143 287664 898797
13732H98797m39586J17860j98662L46823N077m446p9534k96108K66335O709Q1408
$$ 898797 459211 577071 378409 725232 730309 725863 646329 350221 616556 623265 704673
13721G04673j80804n7317P7719j91358J21292K47265K81797C53566K60893n2429
$$ 704673 523869 466552 544271 352913 474205 721470 1003267 353566 614459 562030
13711E62030k5559J34492k70544J15762P5965n7346j31244K42593j95140K49525
$$ 562030 536471 670963 400419 516181 592146 534800 403556 646149 451009 700534
13701G00534k05378n0973j2622J43448q7633j46771K87859p1625k9607R605j42896
$$ 700534 495156 444183 431561 575009 487376 340605 628464 556839 527232 536837 393941
13690C93941K35246k97688K61972r5833K69588k19658k1686m6407O9064p0140
$$ 393941 629187 331499 593471 497638 767226 547568 525882 479475 548539 478399
13680D78399n4789K46866Q8020j36797m1324M97554B51667K53144l0552J10990
$$ 478399 423610 670476 758496 621699 580375 1077929 251667 504811 474259 585249
13670E85249j06779J58931p7337l3576k32531L56395k65343K26041m5831J42211
$$ 585249 478470 637401 560064 526488 293957 650352 385009 611050 565219 707430
13660G07430j14069M9282B03268L21747J42006j5055j9079j61755m6969R0032
$$ 707430 593361 642643 203268 525015 667021 651966 632887 471132 424163 514195
13650E14195K08832k78553j71975L21756J37052C12039L31908o1219j02530k10050
$$ 514195 723027 444474 272499 594255 731307 312039 643947 582728 480198 270148
13640B70148K93990A19227K69173O799J2366M4690k25667J51666K73881k10534
$$ 270148 564138 119227 388400 395199 407565 452255 226588 378254 652135 441601
13630D41601K04528k72739K33059k85762J36069K35222C26711Q7186J55030N6356
$$ 441601 646129 373390 606449 320687 456756 691978 326711 413897 568927 625283
13620F25283r3749j48875j10407M64179B08260L19338K07093B45247M8783J60785
$$ 625283 531534 382659 272252 736431 208260 527598 734691 245247 294030 454815
13610D54815B20930o5542J44472Q0928p3459j27889J46457K24468j65554r2870
$$ 454815 220930 155388 299860 380788 307329 179440 325897 550365 384811 291941
13600B91941k6677K68408B15119J45625J34052j23474J73805k02341L4400p8428
$$ 291941 265264 533672 215119 360744 494796 371322 545127 342786 377186 298758
13590B98758J49662A32656Q6070K35157B1194L55432m9591m3270L43550k0486
$$ 298758 448420 132656 218726 453883 21194 376626 327035 283765 627315 606829
13580F06829k73879j27498O1916M1094M0494K03764O5047j84773j50111A32694
$$ 606829 332950 205452 267368 308462 348956 552720 617767 432994 282883 132694
13569I5409M95410B53448M218a2838A78546L56370J32555j82686j12951q031A81232
$$ 95409 590819 253448 257666 -12838 178546 534916 667471 484785 371834 363803 181232
13557A44799k7193K08121H185L07199J31896l251B17835P1186M5120Q6821o9211
$$ 144799 117606 325727 8185 315384 447280 444029 217835 289021 334141 420962 351751
13546C51751J9339j15895K12970j02897j53192A01068K35582P8114R2263J33840
$$ 351751 371090 255195 468165 365268 212076 101068 336650 414764 507027 640867
13536F40867j50433j93668K24840j43967A60767J34903J26001J62583B04341D7669
$$ 640867 490434 296766 521606 377639 160767 295670 421671 584254 204341 47669
13525a99837I5547J93822A22666L50660B00221B2168O3921A3979K36245A01825
$$ -199837 95547 289369 122666 473326 200221 22168 86089 13979 250224 101825
13514A75318J53415K70755k80419j24226J15932N7152j3924j22640a05544D81843
$$ 175318 328733 599488 319069 194843 310775 367927 354003 231363 -105544 481843
13503A65407l3056m5599N62032A98987L8317Q8034r7945C3637L07686j37887H3956
$$ 165407 132351 86752 648784 198987 237304 325338 227393 33637 341323 203436 83956
13491B35258m2543H6784K30651J41430L4099G7987K71497K0419j78163J10369
$$ 235258 192715 86784 317435 458865 492964 77987 349484 369903 191740 302109
13481C02109M13426j60471H7406L08550j04498K0791J14818j44892R82j00188
$$ 302109 715535 555064 87406 395956 291458 312249 427067 282175 283157 182969
13471A82969p1543J9856M9938F5189L86809B20287M4943j25687K08311A72524
$$ 182969 111426 131282 181220 65189 451998 220287 265230 139543 347854 172524
13460A55984L09957A15703M19760A85525K13869j23240K29312A53349N0117K9718
$$ 155984 465941 115703 535463 185525 399394 276154 505466 153349 203466 233184
13450B33184N4716K40136j33997j30959p3376J6295J33802K12525k3471A23453
$$ 233184 287900 528036 394039 263080 189704 205999 339801 552326 528855 123453
13439D02027q1616F3603L19280C4090R7954R3899K00869k07015B2062L24592p1578
$$ 402027 320411 63603 382883 34090 132044 225943 426812 219797 22062 346654 275076
13428B75076A32390m0171P8500R450D6990P4316L40714F3476J30050J78877f6355
$$ 275076 132390 92219 170719 180169 46990 121306 462020 63476 193526 372403 -66355
13416A78876m2971M16722E535J5146M7343M43969q1722A31229M9263C532M07929
$$ 178876 135905 552627 5535 20681 68024 511993 430271 131229 180492 3532 411461
13405D11461a56397D46684b16375B01106a16422C59522A16022J485m3485L52828
$$ 411461 -156397 446684 -216375 201106 -116422 359522 116022 117507 74022 426850
13395D26850j49546J07451b8146E23761C9033J48923K1917J03957a9224j24949
$$ 426850 277304 384755 -28146 523761 39033 187956 209873 313830 -19224 -144173
13385a44173C32160I9889k5353J57370n3893d175k4172B12785N3707K30363d1062
$$ -144173 332160 99889 74536 231906 178013 -4175 -28347 212785 266492 496855 -41062
13373C44693F479Q9225K46759a76290B21059K99263A28044a13795D09082D4306
$$ 344693 6479 95704 342463 -176290 221059 520322 128044 -113795 409082 44306
13362B64393A19118j5145J66126A08604K35434M3755J35669A09640Q7311J87189
$$ 264393 119118 103973 270099 108604 344038 387793 523462 109640 196951 384140
13352C84140L6417A99244J64519K44931E4986K69971j04733D5317R3200a0603
$$ 384140 420557 199244 363763 608694 54986 324957 220224 45317 138517 -10603
13341I2673J98718N409Q0742m7537E4861K38333I5612J85563m2508J49122A39958
$$ 92673 291391 296800 377542 330005 54861 293194 95612 281175 238667 387789 139958
13329B99836D6855K86920j04796R0578J77589j40430P6340j40540I1564O624o083
$$ 299836 46855 333775 228979 319557 497146 356716 433056 292516 91564 98188 92105
13318I2105a01847b6990J743A39382B002L87523l1724A61654N5597F7264J78514
$$ 92105 -101847 -26990 -25247 139382 2002 389525 357801 161654 217251 67264 245778
13307B45778q1270J00016r4343P0632J36302l9071a9179D18730j0167A88283a9640
$$ 245778 164508 264524 170181 240813 377115 338044 -19179 418730 408563 188283 -19640
13295B64546H6476J20316k6208J7281o3411l7192K00118A12404a35655C4451L6736
$$ 264546 86476 206792 180584 197865 134454 97262 297380 112404 -135655 34451 71187
13284G1187M5569m2071L1055K0568n8618O3713O2553J9653q2177J38550J3573
$$ 71187 116756 74685 105740 126308 67690 131403 193956 213609 131432 269982 283555
13273B83555j23882m5479e4574C85029j46895m6409J03961j44995J14363Q6025
$$ 283555 159673 114194 -54574 385029 238134 191725 295686 150691 265054 351079
13263C51079I5867J47058K10895c62952h7180A91044h1426A86379j9597J44636
$$ 351079 95867 242925 453820 -362952 -87180 191044 -81426 186379 166782 311418
13253C11418A39082g918B81963a17599A51160b11542A75064Q5011f2551B13556
$$ 311418 139082 -7918 281963 -117599 151160 -211542 175064 260075 -62551 213556
13242B67777e7367B40007D9062K97553A48018O2511N5287E3785K77418A39803
$$ 267777 -57367 240007 49062 346615 148018 210529 265816 53785 331203 139803
13231A32063K17763A3571m944N0971g16l49264c0862B14110n0126E6197K18777
$$ 132063 349826 13571 8627 59598 -716 -349980 -30862 214110 163984 56197 274974
13220B74974A02470J10349l4942K19566m3543n2561J15848m3280a47972L6995
$$ 274974 102470 212819 177877 397443 353900 301339 417187 373907 -147972 -110977
13210a10977A51559J266q578J17716p1268p0859a6790E8866K35780j45516m8799
$$ -110977 151559 152825 144247 261963 190695 119836 -16790 58866 294646 149130 100331
13199A00331J64101J00320G276O7666K382Q0703f2112A62699A2716j234K54959
$$ 100331 264432 364752 7276 74942 77324 158027 -62112 162699 12716 11482 266441
13188B66441D5539M9842C6078a25501C4439K56707p4839P1192H8685J96681F9978
$$ 266441 45539 95381 36078 -125501 34439 291146 216307 287499 88685 285366 69978
13176f8800B93920G4557B1728K32557a49608B34150j04428e505D82364d6580A42847
$$ -68800 293920 74557 21728 254285 -149608 234150 129722 -5505 482364 -46580 142847
13164B31812F7515K98674G6223g4065A56909a94745d1289A45233b9060I0843e1225
$$ 231812 67515 366189 76223 -74065 156909 -194745 -41289 145233 -29060 90843 -51225
13152B15935R363r6640d2526C19942c58578D7462c8783C60611A58327J860a7759
$$ 215935 225298 128658 -42526 319942 -358578 47462 -38783 360611 158327 160187 -17759
13140B81805D2045L8179J16227A6355K21406p3602f1759B63151a59290g6354j8473
$$ 281805 42045 80224 196451 16355 237761 164159 -61759 263151 -159290 -76354 -94827
13129i4827k24463A1036J99881p7809K4291L408a06493A14362E7111K47859C1130
$$ -94827 -319290 11036 210917 133108 157399 160807 -106493 114362 57111 304970 31130
13117b4143A03629Q3809m0422a78015B19614Q7964h2621A0680J77407c14414A94718
$$ -24143 103629 187438 147016 -178015 219614 307578 -82621 10680 188087 -314414 194718
13105c01825D00878H3047A6585N0499k9133g1076C10759f1691B51351J13740o7035
$$ -301825 400878 83047 16585 67084 37951 -71076 310759 -61691 251351 365091 298056
13094B98056A41910h9954H2288B1179b42941c6040C07837B3214b6534j20466A22919
$$ 298056 141910 -89954 82288 21179 -242941 -36040 307837 23214 -26534 -147000 122919
13082A30176a10933I3120L6032M0176b3161B39480E5260N9573a85765A10462J3882
$$ 130176 -110933 93120 129152 169328 -23161 239480 55260 114833 -185765 110462 124344
13071A24344D1970K22035d02120d529E8247K41637C0821e2073A78609p6018a12554
$$ 124344 41970 264005 -402120 -4529 58247 299884 30821 -52073 178609 102591 -112554
13059G6400a1651o2109o5043C58618a17636m6904o2389C35904j40185b46409B25626
$$ 76400 -11651 -73760 -138803 358618 -117636 -164540 -226929 335904 195719 -246409 225626
13047b51562b2531D02220E4754L23671A03187M0043k7285a18120j6769c8721B56746
$$ -251562 -22531 402220 54754 378425 103187 143230 115945 -118120 -134889 -38721 256746
13035b8776A14246b4788D2539J41P8929E8125M41246F451M3532a0700D8923j0370
$$ -28776 114246 -24788 42539 42680 121609 58125 499371 6451 49983 -10700 48923 38553
13023C8553f469B22260H1576f6018A4575b53267i8845B54399F3173b8540k0138
$$ 38553 -6469 222260 81576 -66018 14575 -253267 -98845 254399 63173 -28540 -48678
13012d8678A29209F2368f0673Q60B54309K07763b25438B19089H6145J40631J07777
$$ -48678 129209 62368 -60673 -59813 254309 462072 -225438 219089 86145 226776 334553
13001C34553B9926a78584A30900J27282b28004A93641P5070i9879C13348a79686
$$ 334553 29926 -178584 130900 258182 -228004 193641 268711 -99879 313348 -179686
12990d2531j78083A73354A1132i5478j64553A29174R9643A369b17172d884A21439
$$ -42531 -220614 173354 11132 -95478 -260031 129174 228817 1369 -217172 -4884 121439
12978a25309B6848f5214j52472A89121D073Q909i3984D5061H074d1385A8929a8506
$$ -125309 26848 -65214 -217686 189121 4073 12982 -93984 45061 8074 -41385 18929 -18506
12965A75336P0007j0187b0054C6604K92699A26362m7154a19601D5184Q653b61075
$$ 175336 245343 235156 -20054 36604 329303 126362 79208 -119601 45184 53837 -261075
12953B924a2059C15306j34849H8189h7362A07800g4531F2208J78173J74874d3208
$$ 2924 -12059 315306 180457 88189 -87362 107800 -74531 62208 240381 415255 -43208
12941A1989J16634h929F0596k7429b01403b3442C16093a79862e6109I3476J48903
$$ 11989 128623 -8929 60596 33167 -201403 -23442 316093 -179862 -56109 93476 242379
12930B42379q7802e9036A766K96507i6666o0596d2265k737j4548f34D07105h7913
$$ 242379 154577 -59036 1766 298273 -96666 -157262 -42265 -45002 -59550 -634 407105 -87913
12917b29404I6150a14312G8049d8651A43615C3782c50048C35953b90393A43934
$$ -229404 96150 -114312 78049 -48651 143615 33782 -350048 335953 -290393 143934
12906I7494b5727k06324C8146h1391B6669d3288l2505C4972e7486A07093F442
$$ 97494 -25727 -232051 38146 -81391 26669 -43288 -75793 34972 -57486 107093 6442
12894B8299c62187Q9725P4082A38820b33401G1798J5010h8775A42557b5816d577
$$ 28299 -362187 -272462 -198380 138820 -233401 71798 86808 -88775 142557 -25816 -4577
12882C65847e6142H2093D0922d6551j48849R4758G6419i5179I1676P0218B5247
$$ 365847 -56142 82093 40922 -46551 -195400 -100642 76419 -95179 91676 161894 25247
12870A23919a7195k03641B52829b03742B98823A09396J28684k3131o4068B1585
$$ 123919 -17195 -220836 252829 -203742 298823 109396 238080 214949 150881 21585
12859G0331a12966j6326A94202H6873e6508A60429a15644A59670c3223G367e88078
$$ 70331 -112966 -129292 194202 86873 -56508 160429 -115644 159670 -33223 7367 -588078
12847b344B35672c7995A9137b87742A15851O7498f4313j97369b1950A09505D8655
$$ -2344 235672 -37995 19137 -287742 115851 183349 -64313 -261682 -21950 109505 48655
12835H253L857O5362a50335J1317H5053d6201o2887A9444J99171a50261L4615
$$ 8253 12110 77472 -150335 -139018 85053 -46201 -109088 19444 218615 -150261 -115646
12824a15646j82612A54217a0769B07197a15190A53509E1940b10622O5748C3989
$$ -115646 -298258 154217 -10769 207197 -115190 153509 51940 -210622 -144874 33989
12813A9261a98369A2089f4174G3092R6687q1068L3749a61773f0319D1524J88158
$$ 19261 -198369 12089 -64174 73092 169779 88711 122460 -161773 -60319 41524 229682
12802B29682n2173b0472A76176E6712b67984I8329J54186p9916J46192d5747D7015
$$ 229682 177509 -20472 176176 56712 -267984 98329 252515 172599 318791 -45747 47015
12790a77958A80583A2985M4348J6527J21923f9926B55199b4438D1551K35078f8520
$$ -177958 180583 12985 57333 73860 195783 -69926 255199 -24438 41551 276629 -68520
12778A02133e0385B70946a870B04991b55543a2192j38105H059b10007b1271A46591
$$ 102133 -50385 270946 -1870 204991 -255543 -12192 -150297 8059 -210007 -21271 146591
12766b4070j3509B43222G097a05047j83691J17929M583K6925f3047p2790l21282
$$ -24070 -37579 243222 7097 -105047 -288738 -170809 -166226 -139301 -63047 -135837 -457119
12755d57119e603A28933a18930A5056Q4181E616a76217A65187g6391C4731J43772
$$ -457119 -5603 128933 -118930 15056 99237 5616 -176217 165187 -76391 34731 178503
12744A78503d837j95365j76213F7197a34587D9521d52979e5721j25616A05676
$$ 178503 -4837 -200202 -376415 67197 -134587 49521 -452979 -55721 -181337 105676
12733C36222A07748c27182C31498e0407H6259c0866C02109a57996N895G8813K045
$$ 336222 107748 -327182 331498 -50407 86259 -30866 302109 -157996 -152101 78813 80858
12722H0858c27700A01165a49965A34339l7163N6843g1952l2120B85473B7428a39986
$$ 80858 -327700 101165 -149965 134339 97176 154019 -71952 -104072 285473 27428 -139986
12710a21752N003J7730A74354c17755I1711A4546J77689m1589e2078l70348a43267
$$ -121752 -116749 -99019 174354 -317755 91711 14546 192235 150646 -52078 -422426 -143267
12698C74248c8490o7893G8973J47738a90011C01001j2638n8620J68789A79586
$$ 374248 -38490 -106383 78973 226711 -190011 301001 288363 229743 398532 179586
12687A81700J21170a17543A95530n6124E5546J04730d9309o2172B19433I5537
$$ 181700 302870 -117543 195530 139406 55546 160276 -49309 -111481 219433 95537
12676C31293F4604Q9162p1114A9107J65510e5464d26j83713A59487E8566J34186
$$ 331293 64604 153766 82652 19107 184617 -55464 -426 -184139 159487 58566 192752
12665A92752g0024D89327A57862P6963d8954B9287L2751e4156E7331L1967c91198
$$ 192752 -70024 489327 157862 234825 -48954 29287 62038 -54156 57331 89298 -391198
12653f8364A02974b6821B70131i347B5994a39958C4195G796g3952A20314C7466
$$ -68364 102974 -26821 270131 -9347 25994 -139958 34195 7796 -73952 120314 37466
12641A04229R6184l5829J1846q7920O9555J32918a11454p3280j6405A26199J98709
$$ 104229 200413 164584 176430 88510 158065 290983 -111454 -184734 -201139 126199 324908
12630C24908h4697m9060A1712b40605b3568B71816g1831H2634b23708a05985d2753
$$ 324908 -84697 -133757 11712 -240605 -23568 271816 -71831 82634 -223708 -105985 -42753
12618f6697l8373A67920i1193C4154M1590R4359K9143b29560E7461L5410K3531
$$ -66697 -105070 167920 -91193 34154 75744 170103 199246 -229560 57461 92871 116402
12607A16402J71376c37102A3933J38536J50558A32457b50600B65846J45145i4462
$$ 116402 287778 -337102 13933 152469 303027 132457 -250600 265846 410991 -94462
12596A82146a09382D8498g3176A12457D9138K1334a46677B23841E1162K2709c9466
$$ 182146 -109382 48498 -73176 112457 49138 70472 -146677 223841 51162 73871 -39466
12584b13000B20242H8559R9197p8319g9810k8639M7659j29053B1118A814c2745
$$ -213000 220242 88559 187756 109437 -79810 -108449 -60790 -189843 21118 1814 -32745
12572A03754J31866c5688E30078F3064K4822A5322g6174j85500i689r0849a589
$$ 103754 235620 -35688 530078 63064 87886 15322 -76174 -261674 -9689 -100538 -1589
12560a59204o1839A55438n8580L4664a21026j68159i4698B52659b52979F4264
$$ -159204 -221043 155438 96858 131522 -121026 -289185 -94698 252659 -252979 64264
12549b29491p8499D4908G546K21611M4506d56431J28471C57337h735j742A58612
$$ -229491 -307990 44908 7546 229157 273663 -456431 -327960 357337 -8735 -10477 158612
12537d8030k2433e300C19365G2059J65104F1609f2376A56672g6437I0383A4999
$$ -48030 -70463 -5300 319365 72059 237163 61609 -62376 156672 -76437 90383 14999
12525D9669g752k56200d7350J9211k83398E2986a2662C32789a75643o4403A29869
$$ 49669 -7752 -263952 -47350 -28139 -311537 52986 -12662 332789 -175643 -240046 129869
12513f7424A98540p2099J45141a15944E5310a16310j44946A37827a63282d5961
$$ -67424 198540 126441 271582 -115944 55310 -116310 -261256 137827 -163282 -45961
12502B61074a86003c0770j6547A80677a67041f2975E4347I111b60225J5220q8548
$$ 261074 -186003 -30770 -47317 180677 -167041 -62975 54347 9111 -260225 -245005 -333553
12491c33553i9545j61906B49376a29739B38154A09856L10572c27822a05445j94474
$$ -333553 -99545 -261451 249376 -129739 238154 109856 420428 -327822 -105445 -299919
12481b99919a12259j1748F5610J99922b59558a6693N736n0483B00635a12526j03219
$$ -299919 -112259 -124007 65610 265532 -259558 -16693 -10957 -61440 200635 -112526 -215745
12470b15745B8415b22815h8076A72939F8427b24543B64115p8530i0710l572A59374
$$ -215745 28415 -222815 -88076 172939 68427 -224543 264115 185585 -90710 -94282 159374
12458H6839a083G4299b27628C6377b0641A85513b01865e6423J9962k76255a54081
$$ 86839 -1083 74299 -227628 36377 -20641 185513 -201865 -56423 -36461 -312716 -154081
12446A43522n5579L1053M0287g8816K0840A27455K1816a95958C5620e9636j20331
$$ 143522 87943 118996 159283 -78816 -57976 127455 149271 -195958 35620 -59636 -179967
12435a79967Q7033A45750J11693a19026c114B62718E4004a85358a0305m50664
$$ -179967 -92934 145750 257443 -119026 -3114 262718 54004 -185358 -10305 -460969
12425d60969K06632a0087k03413R2576K8510B202h4315J8824B8550a29059A1443
$$ -460969 -254337 -10087 -213500 -120924 -92414 2202 -84315 -65491 28550 -129059 11443
12413b27657R7484B44854n7455a8620k36686a08271C8838a0736M729j32538A43672
$$ -227657 -130173 244854 187399 -18620 -255306 -108271 38838 -10736 -6007 -138545 143672
12401b40116J03529M1358p7676N978P5493b7676m7545G8776J49639r6863J51263
$$ -240116 -136587 -95229 -172905 -166927 -91434 -27676 -75221 78776 228415 131552 282815
12390B82815B7408i9216j67820B31415G7427b87984A68619E8872K19261c58937
$$ 282815 27408 -99216 -267036 231415 77427 -287984 168619 58872 278133 -358937
12379A08464D2321R5482c9125Q935B92007j29029C5144J53682D5935c4301F1133
$$ 108464 42321 137803 -39125 -30190 292007 162978 35144 188826 45935 -34301 61133
12367a36481C95205G8554A851J27039a5356F3273k9553P2592J11299H438J93987
$$ -136481 395205 78554 1851 128890 -15356 63273 33720 106312 217611 8438 202425
12356B02425F4747d1210B42368e6992J8655m600k0093k2640p0008e2167A16649
$$ 202425 64747 -41210 242368 -56992 -38337 -42937 -63030 -85670 -155678 -52167 116649
12344H4029i030E8028b19020m8891E3587c98036a78843A15087K4173K5459G0585
$$ 84029 -9030 58028 -219020 -267911 53587 -398036 -178843 115087 139260 164719 70585
12332A87250d6023B12924A995i1846P334I4195i9984m0776D23859c1016A3246
$$ 187250 -46023 212924 1995 -91846 -84512 94195 -99984 -140760 423859 -31016 13246
12320A36823E2586f4832D41792a38984B11974f3434C79046D4615M01158I0178
$$ 136823 52586 -64832 441792 -138984 211974 -63434 379046 44615 445773 90178
12309B08432G6155b94127B60705E6442L47615e274a931B17605L85430E985K60266
$$ 208432 76155 -294127 260705 56442 404057 -5274 -1931 217605 603035 5985 266251
12298B66251o4764J45921j68351d0732m4895A52215M1508e2313A75369h9575b300
$$ 266251 201487 347408 179057 -40732 -85627 152215 193723 -52313 175369 -89575 -2300
12286A28658b7973A89698a52485P1267Q459E2011d3642o1259o3944D9890f4269
$$ 128658 -27973 189698 -152485 -81218 -72759 52011 -43642 -104901 -168845 49890 -64269
12274C5120J19858J82825A34417d385j03884N3369C89585A47642n7197K841J00854
$$ 35120 154978 337803 134417 -4385 -108269 -54900 389585 147642 90445 93286 194140
12263A94140M2803F1902L19268A16287K65698A89206J12221j40779n3151J00981
$$ 194140 236943 61902 381170 116287 381985 189206 301427 160648 107497 208478
12253B08478Q700g3275D14888O2912H7302M39125B58985F6573a14303C69332j61032
$$ 208478 217178 -73275 414888 477800 87302 526427 258985 66573 -114303 369332 208300
12242B08300e8752C79731j35361j0057q7770b9420A96972m7437D8983P3970J06625
$$ 208300 -58752 379731 244370 234313 146543 -29420 196972 149535 48983 122953 229578
12231B29578k3806h7482A56079E1119a11857A38372a60065g3721B05524J92769
$$ 229578 205772 -87482 156079 51119 -111857 138372 -160065 -73721 205524 398293
12221C98293f7619A00408J15892o5791m8292b01758f7823A39288l7327J2673a94634
$$ 398293 -67619 100408 216300 150509 102217 -201758 -67823 139288 101961 114634 -194634
12209f604G5303i1930g900j59121A94200a02662A45938L31192A96325Q6351A13664
$$ -6604 75303 -91930 -7900 -167021 194200 -102662 145938 477130 196325 282676 113664
12197B19850b19706B17918L0516b11595D2805J02028g8454D25350b11017I6385
$$ 219850 -219706 217918 248434 -211595 42805 144833 -78454 425350 -211017 96385
12186C89456j91903a2982A05585J67098j05695a52841L2823C13799A17013M2440
$$ 389456 197553 -12982 105585 272683 166988 -152841 -120018 313799 117013 159453
12176A59453E2606Q9351K36128a6404C76346A66985L75773B3845N2193K1771M85931
$$ 159453 52606 141957 378085 -16404 376346 166985 542758 23845 76038 97809 583740
12165E83740j04330H7016L1081P8474O9818R3233I6703A3770L06794L4847J88548
$$ 583740 479410 87016 118097 196571 266389 359622 96703 13770 320564 355411 543959
12154E43959B23802O2783E9809N0647J19590l2937I429K48194p5275L14981Q380
$$ 543959 223802 286585 59809 110456 230046 197109 9429 257623 182348 497329 505709
12143E05709B33407K3596Q5032G9627J38492C6373f7600J5523C8352h0300C96632
$$ 505709 233407 257003 342035 79627 218119 36373 -67600 -52077 38352 -80300 396632
12131A76773J62921A24067m5906C1470a95369H3653J66647G6507J61563a49629
$$ 176773 339694 124067 78161 31470 -195369 83653 250300 76507 238070 -149629
12120b3957A2591a54656A24121M8707e0525n3422k729D24625a41690j41971A20590
$$ -23957 12591 -154656 124121 172828 -50525 -103947 -106676 424625 -141690 -283661 120590
12108d6398j6494A24571l0956a18249N9009A04058L32064o7261H4168b6339I2735
$$ -46398 -62892 124571 93615 -118249 -59240 104058 436122 368861 84168 -26339 92735
12096B42253M7700K77271A53389k6106a77181A35567M9145E8510R8056a14975
$$ 242253 289953 567224 153389 127283 -177181 135567 184712 58510 156566 -114975
12085A10238b6863B40307H5861d6935j2783j5532j11064p1993b2668A78153J2036
$$ 110238 -26863 240307 85861 -46935 -59718 -75250 -186314 -258307 -22668 178153 190189
12074A90189a01010j5447C13785a74756c46k17941O3115A76987D5845Q7875a91642
$$ 190189 -101010 -116457 313785 -174756 -346 -218287 -155172 176987 45845 133720 -191642
12062B06169j0350I5115Q348N4929l5330K56881j66976j4838J27663c4016A39155
$$ 206169 195819 95115 103463 158392 123062 379943 212967 198129 325792 -34016 139155
12050A47906a63000D32343D8167J01486k2436P8290B6325K9658P8269K78259a44950
$$ 147906 -163000 432343 48167 149653 127217 205507 26325 55983 134252 412511 -144950
12038A98540a78335C54189a38500c1232C6132b7639A14917b8240D3875i8097J378
$$ 198540 -178335 354189 -138500 -31232 36132 -27639 114917 -28240 43875 -98097 -96719
12027i6719o9381C9585a54477C36454B1947b5858B9032b56543B03994b14072C7071
$$ -96719 -166100 39585 -154477 336454 21947 -25858 29032 -256543 203994 -214072 37071
12015c465m2716r8385A298J17599h7995B18810g0062K2751A65674D3249a40082
$$ -3465 -46181 -144566 1298 118897 -87995 218810 -70062 -47311 165674 43249 -140082
12003d1546r2770B15373o9580M3808F6545c27607a5440B76042J71910a51576A60435
$$ -41546 -134316 215373 145793 189601 66545 -327607 -15440 276042 447952 -151576 160435
11991I4527D3524A8346J92528n4302a92315e9607C3108h9224L3671K4718G9649
$$ 94527 43524 18346 210874 156572 -192315 -59607 33108 -89224 -55553 -30835 79649
11979i6410A87102A3208P5194c4335j30472D8574b53828a0230m3452k43270i9763
$$ -96410 187102 13208 88402 -34335 -164807 48574 -253828 -10230 -53682 -296952 -99763
11967A30263c670E4650K5046J44059q5259e10145a35214M0305l3016H2423Q560
$$ 130263 -3670 54650 79696 223755 138496 -510145 -135214 -94909 -127925 82423 90983
11956I0983K2155b78605B1444L14187A20843b9135E4381f1059j70706B44649j00230
$$ 90983 113138 -278605 21444 335631 120843 -29135 54381 -61059 -231765 244649 144419
11945A44419G667c6500m7296k6146o4323c006j5946G5665b70558A12321L2300
$$ 144419 7667 -36500 -83796 -109942 -174265 -3006 -18952 75665 -270558 112321 144621
11934A44621b1337m6716K4896A86237J08889i9496b5020k20669b9988h441j28794
$$ 144621 -21337 -68053 -43157 186237 295126 -99496 -25020 -245689 -29988 -8441 -137235
11923a37235A03475n15A3276a75619A96914d45401C33949A31875O7710a63242
$$ -137235 103475 102960 13276 -175619 196914 -445401 333949 131875 199585 -163242
11912f5852A48283i1673l0974b5267G081L54676c74411J83181B58450g3454A06550
$$ -65852 148283 -91673 -122647 -25267 7081 361757 -374411 -191230 258450 -73454 106550
11900B25695c19550B30487h235j10335A29008m5941l7184O1363a18182j24232
$$ 225695 -319550 230487 -8235 -118570 129008 83067 45883 107246 -118182 -242414
11890b42414J2924f1052F9607c31330A22773f3600A45491g5596j99750D0384A6674
$$ -242414 -229490 -61052 69607 -331330 122773 -63600 145491 -75596 -275346 40384 16674
11878b8771o7192a4029I7530b57632C10508q4149b30303g4160l1503k08349a19939
$$ -28771 -95963 -14029 97530 -257632 310508 226359 -230303 -74160 -105663 -314012 -119939
11866a4266A9947L70483d26775F4475b42133B25474C022a61210b5401D1049a18260
$$ -14266 19947 390430 -426775 64475 -242133 225474 3022 -161210 -25401 41049 -118260
11854A57333c1015l6555r8915A15953n6294a15036O824c099j93450j4043b4631
$$ 157333 -31015 -67570 -166485 115953 59659 -115036 -108212 -3099 -196549 -210592 -24631
11842h1583j22790B694J2220b771k8086D6590L43349a3315p3775B8634a71019
$$ -81583 -204373 2694 14914 -2771 -30857 46590 389939 -13315 -87090 28634 -171019
11830a4081j13291B6718O8219A1793k372a13682C6462b60947a01245B61702E4999
$$ -14081 -127372 26718 94937 11793 9421 -113682 36462 -260947 -101245 261702 54999
11818D5214a78629A99125c3952n4676A92271H9119P5882a56652A39817i2729j06023
$$ 45214 -178629 199125 -33952 -88628 192271 89119 165001 -156652 139817 -92729 -198752
11807a98752K2769k1786j83273O7710a08871J0363b9207l5662q5866A17519a09397
$$ -198752 -175983 -197769 -381042 -313332 -108871 -98508 -29207 -64869 -150735 117519 -109397
11795b72759A04402a76117Q6898j1296d730C8816a37541c9794k41132J31514A51877
$$ -272759 104402 -176117 -89219 -100515 -4730 38816 -137541 -39794 -280926 -149412 151877
11783a01930j91217C16539a69674N2129k855m6879e9540p7141A38723c38755a20267
$$ -101930 -293147 316539 -169674 -117545 -120400 -167279 -59540 -136681 138723 -338755 -120267
11771F2015O0569B8192A0117L2197A0246b24052f8332c765l44552A33813n8043
$$ 62015 122584 28192 10117 42314 10246 -224052 -68332 -3765 -348317 133813 75770
11760G5770a57925A0258c485r6267k2633j12606A34455b47318A44931B6654J201
$$ 75770 -157925 10258 -3485 -99752 -122385 -234991 134455 -247318 144931 26654 27855
11749B7855A928R4428a7558E7603K48003j29673a45785B0599b22860A17102L8732
$$ 27855 1928 96356 -17558 57603 305606 175933 -145785 20599 -222860 117102 155834
11738A55834a54935I3343B669f335j6550C51822a5102B994a78877A09794b7797
$$ 155834 -154935 93343 2669 -6335 -22885 351822 -15102 2994 -178877 109794 -27797
11726a58341A8912K8225a94316A1254b3242j09554l42360f697B1479f113A72939
$$ -158341 18912 47137 -194316 11254 -23242 -132796 -475156 -6697 21479 -6113 172939
11714A90000c63497d1506J3680j34671f5310O990B63739A01143C5876K60375a44027
$$ 190000 -363497 -41506 -27826 -162497 -65310 -58320 263739 101143 35876 296251 -144027
11702e0804A41378o4794K4115l1138M6247J13760g8675n0154B80936b17256C77492
$$ -50804 141378 76584 100699 69561 115808 229568 -78675 -128829 280936 -217256 377492
11690h7440D75252j53730a82290d3339b003j34266O0838j2576A53924J31742f5510
$$ -87440 475252 321522 -182290 -43339 -2003 -136269 -75431 -88007 153924 285666 -65510
11678A44512a59601k3495B5569d23440C9647J00558b71408a8916G9728J42469
$$ 144512 -159601 -183096 25569 -423440 39647 140205 -271408 -18916 79728 222197
11668B22197a35071o3121a8912A38490n8223J54647L8753A0564N2303b86653i1873
$$ 222197 -135071 -198192 -18912 138490 80267 234914 273667 10564 62867 -286653 -91873
11656b75788B81105B7907b76518a38111f1394q2216I9693M83269G7638J54233
$$ -275788 281105 27907 -276518 -138111 -61394 -143610 99693 582962 77638 231871
11646B31871g2261j26956B5631c5843B46026a62751a12k82702e5851G8297B0032
$$ 231871 -72261 -199217 25631 -35843 246026 -162751 -112 -282814 -55851 78297 20032
11634A10858k6182h2985p9235M8983F7041J83642a75903K870A88556C964c1070
$$ 110858 84676 -82985 -162220 -113237 67041 250683 -175903 -173033 188556 3964 -31070
11622B16551a78150F7980b5220m6430E0023A7431b37345A99319a45143r517C05318
$$ 216551 -178150 67980 -25220 -71650 50023 17431 -237345 199319 -145143 -154660 305318
11610B53591a29053M4403H9771a24279B78170b14140A28825a33991D8527n615
$$ 253591 -129053 -84650 89771 -124279 278170 -214140 128825 -133991 48527 42912
11600D2912a16834A22062K4326E8566B4826K15946n7157b80967A24434O599B0734
$$ 42912 -116834 122062 146388 58566 24826 240772 183615 -280967 124434 131033 20734
11588I2404M6836E8706b07240o3922A76528a59688p6820D6016K62855b9314I397
$$ 92404 139240 58706 -207240 -271162 176528 -159688 -236508 46016 308871 -29314 9397
11576A41583F9393J44247F8288d5937C54888C0844a0064k08238d1459k74354B78231
$$ 141583 69393 213640 68288 -45937 354888 30844 -10064 -218302 -41459 -315813 278231
11564A24566R825c5049H9151L2088l3578K75930j73794d3655C40778O6603G0391
$$ 124566 134391 -35049 89151 121239 87661 363591 189797 -43655 340778 407381 70391
11552H7432P3105G009J84441b5814j19501f2902a8631K604E42835b51153A61547
$$ 87432 160537 7009 191450 -25814 -145315 -62902 -18631 -16027 542835 -251153 161547
11540a39788A23303d2407H2696c00500E4919O1576D7141b48959g5372n1518A00553
$$ -139788 123303 -42407 82696 -300500 54919 116495 47141 -248959 -75372 -126890 100553
11528G7771K8587J3612P7343e4529k6737Q676A30592r423J89465F4134e6348C21113
$$ 77771 106358 119970 197313 -54529 -81266 -72590 130592 121169 310634 64134 -56348 321113
11515E6644L1446P5644G3514K5572a04300A37485d9688H881a03232G8317K45246
$$ 56644 88090 163734 73514 99086 -104300 137485 -49688 8881 -103232 78317 323563
11504C23563j09503a9453A15999a86234O5930J6913j20434C58179i0285H8206
$$ 323563 214060 -19453 115999 -186234 -120304 -103391 -223825 358179 -90285 88206
11493B44489K9028g3495I1415L7833a01082e496B32626C452K84281G5860P7796
$$ 244489 273517 -73495 91415 129248 -101082 -5496 232626 3452 287733 75860 153656
11482A53656Q5369b80842A21757L46335C9102i0540B21579b9094q7855n1997k2800
$$ 153656 239025 -280842 121757 468092 39102 -90540 221579 -29094 -116949 -168946 -191746
11471a91746A98987f3378A45916h2212H717L7730J33673b36201B82609e7967G4763
$$ -191746 198987 -63378 145916 -82212 8717 46447 180120 -236201 282609 -57967 74763
11459A49056h4827B33070b39476B8143c0122A59008G0548J74224A06048K39788
$$ 149056 -84827 233070 -239476 28143 -30122 159008 70548 244772 106048 345836
11449C45836C9173J30023J12706A13605J39840E6237J27644q3425a73116B22667
$$ 345836 39173 169196 281902 113605 253445 56237 183881 100456 -173116 222667
11438B93447d2224C06581a33279H7893a84315A9851a54273M4870A70340K0387
$$ 293447 -42224 306581 -133279 87893 -184315 19851 -154273 -109403 170340 190727
11428A90727a58704e5947A02156a20400L4313B01221R5562A4312b0311B34943
$$ 190727 -158704 -55947 102156 -120400 -86087 201221 296783 14312 -20311 234943
11417B89582l2495j26464a14534Q284k346C9735b00859A81341e44576F7425b06635
$$ 289582 257087 130623 -114534 -106250 -108596 39735 -200859 181341 -544576 67425 -206635
11405b90397D4555J22832a10945C9494a83356A78313a21254K883c6653p532D1118
$$ -290397 44555 167387 -110945 39494 -183356 178313 -121254 -118371 -36653 -44185 41118
11393d9072E8217P3038K6263a82850B26034A05327D6040a62476j5565f5664n2660
$$ -49072 58217 131255 157518 -182850 226034 105327 46040 -162476 -178041 -65664 -118324
11382a18324e7796A28385b45408E534b13796g8777j10399j89336B7298a0750C40715
$$ -118324 -57796 128385 -245408 5534 -213796 -78777 -189176 -378512 27298 -10750 340715
11370B63851A13571A5866a21579D2387j0986d6612A06234b89237C33711d2219
$$ 263851 113571 15866 -121579 42387 31401 -46612 106234 -289237 333711 -42219
11359a01174K5944j8646n9908A24971c22556A27181l5978b84238J31796K9908
$$ -101174 -75230 -93876 -153784 124971 -322556 127181 91203 -284238 -152442 -122534
11349a22534F3151b82275E8870a72164D26036b12169d8400A20186d60042a89439
$$ -122534 63151 -282275 58870 -172164 426036 -212169 -48400 120186 -460042 -189439
11338A18724d5268k1010B15027a51601m9558F357g8630q2572O3195m5083j87286
$$ 118724 -45268 -66278 215027 -151601 -201159 6357 -78630 -161202 -98007 -143090 -330376
11327c30376E2635b56584A2644J06483C3225c9268B98523a05488B22859a265j76360
$$ -330376 52635 -256584 12644 119127 33225 -39268 298523 -105488 222859 -1265 -177625
11316a77625A87937D7679J48368i8199k73806C54406C4294b27787j88074d9584
$$ -177625 187937 47679 196047 -98199 -372005 354406 34294 -227787 -415861 -49584
11305A55920e39741a13562F4742K03435G4196a89075A42111G0092N0837C5022
$$ 155920 -539741 -113562 64742 268177 74196 -189075 142111 70092 120929 35022
11294i4823a0234k9656m6288D4354N7761P8825j7042b08763M2696E0720c37813
$$ -94823 -10234 -39890 -86178 44354 102115 180940 163898 -208763 -166067 50720 -337813
11282B13755O5069b57880a24245C01618b14583J5985O8382j01895l71600G0906
$$ 213755 278824 -257880 -124245 301618 -214583 -198598 -130216 -232111 -603711 70906
11271d6424b437E1531b38631n0641c2750D8419d479j31053k52091a01118B36363
$$ -46424 -2437 51531 -238631 -289272 -32750 48419 -4479 -135532 -387623 -101118 236363
11259b87390C0232R8091l3303l3558g2080A27865E2816b76610A6565R2968a24797
$$ -287390 30232 128323 95020 61462 -72080 127865 52816 -276610 16565 109533 -124797
11247b17164d6393C7215e15985K39468a9828B7140a08447B21793D5970Q6837c967
$$ -217164 -46393 37215 -515985 -276517 -19828 27140 -108447 221793 45970 132807 -3967
11235A21069a93259j21140C75820a13949I6957c0796q2974B27554G9529b88214
$$ 121069 -193259 -314399 375820 -113949 96957 -30796 -113770 227554 79529 -288214
11224F8932a96051N4621L343i589C0330J99865d44940K0034f0252m1442M4633
$$ 68932 -196051 -141430 -138087 -9589 30330 230195 -444940 -424906 -60252 -101694 -57061
11213e7061A25499b66726a10353n437G3197M4080k8672a28419d175o9036A16111
$$ -57061 125499 -266726 -110353 -115790 73197 117277 88605 -128419 -4175 -73211 116111
11201a41931M1547I7042b11029A81265a76780g2662A7668b4624B45561n9205B492
$$ -141931 -100384 97042 -211029 181265 -176780 -72662 17668 -24624 245561 186356 2492
11189h5504C08958e4324p7906j08545F2636J13599e391j77991e0076j51956M0029
$$ -85504 308958 -54324 -132230 -240775 62636 176235 -5391 -183382 -50076 -202032 -162003
11178a62003e0561a2833k4820a6147j73734F2989B240f2018B426K95031A26119
$$ -162003 -50561 -12833 -37653 -16147 -189881 62989 2240 -62018 2426 297457 126119
11166b25814E5999b71932J26464A269J65600a71832L445E25c645o502k87153e6666
$$ -225814 55999 -271932 -145468 1269 166869 -171832 -168387 525 -3645 -10147 -297300 -56666
11153a98375B01078p2756d17538A04426E0493K4846a92159B9356R7954B2914b6384
$$ -198375 201078 128322 -417538 104426 50493 75339 -192159 29356 127310 22914 -26384
11141b3938j05332L3916H0857J33715a06454o0993A76317E4668j6309b12584M4037
$$ -23938 -129270 -95354 80857 214572 -106454 -167447 176317 54668 38359 -212584 -168547
11130a68547n218q7416g0042B1542a82145b4023j46661g2744j63515C3657d13186
$$ -168547 -173765 -261181 -70042 21542 -182145 -24023 -170684 -72744 -236259 33657 -413186
11118e5724k50625a19497j84135c4792a5339B40510c4660I246b85804Q7095h2742
$$ -55724 -306349 -119497 -303632 -34792 -15339 240510 -34660 9246 -285804 -198709 -82742
11106A62113p2309e3671l2667F7034h3178b3650a0949B6177e1465E6783p212J80070
$$ 162113 89804 -53671 -86338 67034 -83178 -23650 -10949 26177 -51465 56783 49571 229641
11094B29641H1319O6834c6295C6801a11086A31774a397A90102n6165i4446B34539
$$ 229641 81319 148153 -36295 36801 -111086 131774 -1397 190102 133937 -94446 234539
11082f498C06949n391q4257J9378K80067A20408K80427j73462H3685L25223j44139
$$ -6498 306949 301558 217301 236679 516746 120408 400835 227373 83685 408908 264769
11071B64769q611r8548J22277a91300n0871A62818b10615I1803h1189C72849m7155
$$ 264769 256158 157610 279887 -191300 -242171 162818 -210615 91803 -81189 372849 325694
11060C25694D7507J19007l4194C5472K25916k7467K04118k13520K84755A95305
$$ 325694 47507 166514 132320 35472 261388 233921 438039 224519 509274 195305
11049C50048L01379k78132A57013m6762K13775L2980j32549L58002k41088L92645
$$ 350048 651427 373295 157013 110251 324026 357006 224457 582459 341371 734016
11039G34016m6460j64556M59020l39370o7168j92177J38582K19327k92917j3524
$$ 734016 687556 523000 982020 642650 575482 383305 521887 741214 448297 434773
11029D34773m9461R6256m5762J59725J9945k65055M56875k44735N8775Q9768k50313
$$ 434773 385312 481568 435806 595531 615476 350421 807296 562561 621336 711104 460791
11018D60791J00043K25211n4288k31398J17209K77966l61317J50122j76551N8664
$$ 460791 560834 786045 731757 500359 617568 895534 534217 684339 507788 566452
11008E66452k22615M70071j20474j76271L09377B88371O49894m36045q8517L5296
$$ 566452 343837 813908 693434 517163 826540 288371 938265 502220 413703 448999
10998D48999L3644J00583p7687k06235l1346K50207K11079k16970L04878D08382
$$ 448999 482643 583226 505539 299304 267958 518165 729244 512274 817152 408382
10987G00795B38331J84781O9965j86673L03643j78373L11018k24339J24355j66390
$$ 700795 238331 423112 493077 306404 610047 431674 742692 518353 642708 476318
10977D76318K40768k1535O38o8071q9599B66737K37746j72316J48338M61908K2892
$$ 476318 717086 695551 696189 628118 538519 266737 504483 332167 480505 942413 965305
10966I65305m02856O89568m50198K51679n7011k29001L39425l149K74387L07797
$$ 965305 562449 1252017 801819 1053498 996487 767486 1106911 1103762 1378149 1685946
10956A685946J74704J31884R1752J45666m17611L50832j48205J72008k69687j44252
$$ 1685946 1860650 1992534 2084286 2229952 1812341 2163173 2014968 2186976 1917289 1773037
10946A773037K9311p0412L3898j40149k20604j19134j0424L89708J83788m11512
$$ 1773037 1802348 1731936 1765834 1625685 1405081 1285947 1275523 1665231 1849019 1437507
10936A437507Q6966J6906j42823k09023K8073l85972J39637D35783n852j36784
$$ 1437507 1524473 1541379 1398556 1189533 1217606 831634 971271 435783 429931 293147
10926B93147J88687m4138H9212M55688B70938J09142b4958I1434K77401b08076
$$ 293147 481834 437696 89212 544900 270938 380080 -24958 91434 368835 -208076
10915F2298f1051B26271o7468g0827A328e1913q448k1361A14461b51315A52873
$$ 62298 -61051 226271 158803 -70827 1328 -51913 -60361 -81722 114461 -251315 152873
10903F8734l0700a32561A6713K67856C7831c45713d8392o1935A11295a25711b8439
$$ 68734 38034 -132561 16713 284569 37831 -345713 -48392 -110327 111295 -125711 -28439
10891D24444A41565J26785a97655C9726r26b535F4847k2566j3881J99286a067
$$ 424444 141565 268350 -197655 39726 38800 -2535 64847 42281 28400 227686 -1067
10879A38926B0467P8146b31716F1553J93475a4622k20454K6659R8865o1425B22875
$$ 138926 20467 98613 -231716 61553 255028 -14622 -235076 -208417 -109552 -170977 222875
10867d4764B201a64095O1336q4871h0674k0645n4806A83769F228f3129m89103
$$ -44764 2201 -164095 -102759 -187630 -80674 -101319 -156125 183769 6228 -63129 -552232
10856e52232a08468L572A39939J31571a06004l7684E4889e6370b6C9784L45368
$$ -552232 -108468 -104896 139939 271510 -106004 -143688 54889 -56370 -26 39784 385152
10845C85152a13857D4749i791n9000l0407M1485C960c54517a01644M9577A21047
$$ 385152 -113857 44749 -9791 -68791 -99198 -57713 3960 -354517 -101644 -52067 121047
10833B43149b05123j26692c6334A79621D6417J3766N4320C1837m197O6234c0670
$$ 243149 -205123 -331815 -36334 179621 46417 60183 114503 31837 27640 93874 -30670
10821C4635J20669a9222F8084h5847p9484b1426l36146L7479I7315e3081l05022
$$ 34635 155304 -19222 68084 -85847 -165331 -21426 -357572 -320093 97315 -53081 -358103
10810c58103f1549A74058h9805F3457e3432D1358e6693q0989c4962D86J17441
$$ -358103 -61549 174058 -89805 63457 -53432 41358 -56693 -137682 -34962 486 117927
10799A17927L758b95099A24936b58187A96623b8153j89865m5983B05361c2802
$$ 117927 121685 -295099 124936 -258187 196623 -28153 -218018 -264001 205361 -32802
10788D4666d75817B17164G1438K2385B8708K50104C1771i2359j8342L8067B3526
$$ 44666 -475817 217164 71438 93823 28708 278812 31771 -92359 -110701 -72634 23526
10776c4388k6687k49k69344f0291C8101b25392b3057k01130p1222D0910a889j2991
$$ -34388 -61075 -61324 -330668 -60291 38101 -225392 -23057 -224187 -295409 40910 -1889 -14880
10764a4880A8064O9460J88908a61868r9384L6759A14471E3114k2410a73072N4945
$$ -14880 18064 87524 276432 -161868 -261252 -224493 114471 53114 30704 -173072 -118127
10753a18127A64500P0332E7575c8682J3453k28598B6601b23353C4546b58398N157
$$ -118127 164500 234832 57575 -38682 -25229 -253827 26601 -223353 34546 -258398 -253241
10742b53241B16516b13874A99851i1021D2963a87925j05416f2598j43830k71174
$$ -253241 216516 -213874 199851 -91021 42963 -187925 -293341 -62598 -206428 -477602
10732d77602h2620k19887G2163i5062j08462h1646A9966e067A55592d17456a2900
$$ -477602 -82620 -302507 72163 -95062 -203524 -81646 19966 -5067 155592 -417456 -12900
10720C1595i5488F7830n558Q1830m6072j1365C1899J97922a85195Q9353A96970
$$ 31595 -95488 67830 62272 144102 98030 86665 31899 229821 -185195 -95842 196970
10708a03999A19026h51k17785D2572b96009A46607F9595a18420b3463j29919k9220
$$ -103999 119026 -851 -218636 42572 -296009 146607 69595 -118420 -23463 -153382 -182602
10697a82602B31741h2688j06904j71807J0578d0861l6538a3770A60928f9372E1009
$$ -182602 231741 -82688 -189592 -361399 -350821 -40861 -77399 -13770 160928 -69372 51009
10685a32861k66817A77333a57229b0809k32465M3349B20670i2158c3723j45369
$$ -132861 -399678 177333 -157229 -20809 -253274 -209925 220670 -92158 -33723 -179092
10675a79092D7567K48501E4115b32763A68098a05743j48880A25435i1077r5286
$$ -179092 47567 296068 54115 -232763 168098 -105743 -254623 125435 -91077 -186363
10665a86363E406a04950j78333a19113m8694m09841g1326A70140b89080A98887
$$ -186363 5406 -104950 -283283 -119113 -167807 -577648 -71326 170140 -289080 198887
10654a46529A49624b26719C05685A42622a91327A28287d1150B4231e9444E9332
$$ -146529 149624 -226719 305685 142622 -191327 128287 -41150 24231 -59444 59332
10643a03090F3784J04769c332j73230F0726a6466j96305l9494j1416j08758A73375
$$ -103090 63784 168553 -3332 -176562 60726 -16466 -212771 -252265 -263681 -372439 173375
10631a32797D4170M0163a853B19562c16957f1862k17247J26496B06866g2277l2273
$$ -132797 44170 84333 -1853 219562 -316957 -61862 -279109 -152613 206866 -72277 -104550
10620a04550A28808M2580l3913N6247G644a67017a240k10157I1738O3085I106
$$ -104550 128808 171388 137475 193722 7644 -167017 -1240 -211397 91738 154823 9106
10608A23158e6471j41577G4723a79461j26923A19306n8417k4278a90670L5043
$$ 123158 -56471 -198048 74723 -179461 -306384 119306 60889 36611 -190670 -155627
10598a55627A68317F3235d9953m1774B4140e41759a47774k22629E540N4319q995
$$ -155627 168317 63235 -49953 -91727 24140 -541759 -147774 -370403 5540 59859 50864
10587E0864k3272N0301P843b13004j40239A68359c1724A68783b46878i1352j69994
$$ 50864 27592 77893 85736 -213004 -353243 168359 -31724 168783 -246878 -91352 -261346
10576b61346A27161c85643a41224n0548A33751K477h1403C5724b05549p5227D8267
$$ -261346 127161 -385643 -141224 -191772 133751 136228 -81403 35724 -205549 -280776 48267
10564a82610j06734J12860E4633J35879b38621P0800B67351a23352C1878d15364
$$ -182610 -289344 -176484 54633 190512 -238621 -167821 267351 -123352 31878 -415364
10553a13584B24484G2927M3761c683m5936J5076A56944E5156j151O1777o86d4366
$$ -113584 224484 72927 116688 -3683 -49619 -34543 156944 55156 54005 115782 115096 -44366
10540d5758j63488K9356N7803j94948B16364C7888c377A63459Q9903L5369a90476
$$ -45758 -209246 -179890 -122087 -317035 216364 37888 -3377 163459 253362 288731 -190476
10528h2771k02610g7971p6065L1581j57106B9300i8111l50818A75975e6348B17075
$$ -82771 -285381 -77971 -154036 -122455 -279561 29300 -98111 -448929 175975 -56348 217075
10516A8877d5746j35649q8637g5009A17978E4891b7591A69183q2931b23846A35312
$$ 18877 -45746 -181395 -270032 -75009 117978 54891 -27591 169183 86252 -223846 135312
10504A03444a81273A28840b30317B48594A10316b27049b3667G106J97167a84214
$$ 103444 -181273 128840 -230317 248594 110316 -227049 -23667 7106 204273 -184214
10493C8424C533Q8783e8476C3031a15419b6818q829o7541I098f1230C35491a37249
$$ 38424 3533 92316 -58476 33031 -115419 -26818 -35647 -103188 9098 -61230 335491 -137249
10480b4761J1554F8980A9497f4252B06801j998J14452a41174M4520I8726a62959
$$ -24761 -13207 68980 19497 -64252 206801 204803 319255 -141174 -96654 98726 -162959
10468B66189a4936k04553c3831A17789M1418C6720J09540J85657p9708K25970
$$ 266189 -14936 -219489 -33831 117789 159207 36720 146260 331917 252209 478179
10458D78179j32166J43840o3701j56042N3864K07702d0593j5280J9708J6733j43631
$$ 478179 346013 489853 426152 270110 323974 531676 -40593 -55873 -36165 -19432 -163063
10447a63063A19553J38478a19038a8986G6309a13241j08854b3948o4760m2594
$$ -163063 119553 258031 -119038 -18986 76309 -113241 -222095 -23948 -88708 -131302
10437a31302B2443a92148a9445k1111l17699I7906c0284j98566J02351h904k6850
$$ -131302 22443 -192148 -19445 -40556 -358255 97906 -30284 -228850 -126499 -8904 -35754
10426c5754H4541c87921a17539N7877p5880a0384j60581H5565b26897A02433K21463
$$ -35754 84541 -387921 -117539 -59662 -135542 -10384 -170965 85565 -226897 102433 323896
10415C23896a32567n6804A41109O8283a43522m7496j38307E6234a89904N1672
$$ 323896 -132567 -189371 141109 209392 -143522 -191018 -329325 56234 -189904 -138232
10405a38232A99357G4019c13848A70845F8786B4154J84328q6593a18799j31367
$$ -138232 199357 74019 -313848 170845 68786 24154 208482 121889 -118799 -250166
10395b50166A98760F038a66017j21241a33759B02599c55546B27381a37274a1409
$$ -250166 198760 6038 -166017 -287258 -133759 202599 -355546 227381 -137274 -11409
10384C33022A07592l6472I963c67664D3057f4757j9572B19451p74J72972E0494
$$ 333022 107592 71120 9963 -367664 43057 -64757 -84329 219451 218677 391649 50494
10372A24486D2770b13353B65274b14333B61794K6271a58916k6406B86702e1474
$$ 124486 42770 -213353 265274 -214333 261794 288065 -158916 -185322 286702 -51474
10361I0243J79357M5448A50519n3292N3460P9694D8741O3314O8717L52818j88250
$$ 90243 269600 315048 150519 97227 150687 230381 48741 112055 180772 533590 345340
10350C45340g263C82849N0643m0116j05115d865I6292K25401A49912C7660K81268
$$ 345340 -7263 382849 433492 393376 288261 -4865 96292 321693 149912 37660 318928
10339C18928A20073M32343j86452b1809A41028K26318j01016j01828K18833j60569
$$ 318928 120073 552416 365964 -21809 141028 367346 266330 164502 383335 222766
10329B22766J2026J87863K10937k61756j24814o0694o1152J46045K15716r0583
$$ 222766 234792 422655 633592 371836 247022 186328 125176 271221 486937 396354
10319C96354j11453B7418d9198C04584G953J19177A070a4107o8464E9635a29618
$$ 396354 284901 27418 -49198 304584 7953 127130 1070 -14107 -82571 59635 -129618
10307G4001B8488g3506B56328I8853P101d663B6876a20874A79065F4422B9338
$$ 74001 28488 -73506 256328 98853 105954 -4663 26876 -120874 179065 64422 29338
10295B07864b27060O0679B74520a35580A53790a51288f7363b688D3678J8541k9985
$$ 207864 -227060 -166381 274520 -135580 153790 -151288 -67363 -2688 43678 62219 32234
10284C2234a64286f0526D913b06667j17727b1904j2279B9676c44398k4679J68794
$$ 32234 -164286 -60526 4913 -206667 -324394 -21904 -34183 29676 -344398 -369077 -200283
10273b00283A1922d3433m6140B00524f8798o4077d9559l864g045j44598k3780
$$ -200283 11922 -43433 -89573 200524 -68798 -132875 -49559 -53423 -7045 -151643 -175423
10262a75423g0203G292h4513o306l41052C29354c8956B0289J64354M9865P0701
$$ -175423 -70203 7292 -84513 -90819 -431871 329354 -38956 20289 184643 234508 305209
10251C05209B9497d7152r2115C01492b95246a02445B00857a0058k59480e3248
$$ 305209 29497 -47152 -139267 301492 -295246 -102445 200857 -10058 -269538 -53248
10240G054a48533B72186f1447B96985j14631I0535J10159n7651Q7324b11234m0109
$$ 7054 -148533 272186 -61447 296985 182354 90535 200694 143043 230367 -211234 -251343
10229b51343E8793d0280r6223k59904f3636j0687l1999o1813G9496O1990b2667
$$ -251343 58793 -40280 -136503 -396407 -63636 -74323 -106322 -168135 79496 141486 -22667
10217a8099H5609J1343i5721j11766d1567j0765A55274d00741B6533L37910f8256
$$ -18099 85609 96952 -95721 -207487 -41567 -52332 155274 -400741 26533 364443 -68256
10205c587j88644G1492q840b34386e3911I6612l8293d9990m4467l42911G4678
$$ -3587 -192231 71492 62652 -234386 -53911 96612 58319 -49990 -94457 -437368 74678
10193d6254A8127K1903K25137M0649e975C03465e7885r7340l3553I0042e866k86042
$$ -46254 18127 40030 265167 305816 -5975 303465 -57885 -155225 -188778 90042 -5866 -291908
10181b91908J34609e3156L276k254H3829b31354A30421b15337O7223O1291j60792
$$ -291908 -157299 -53156 -49880 -52134 83829 -231354 130421 -215337 -148114 -86823 -247615
10170b47615G2947j6156e7388j02799l35155K11372C26298b60398B26382Q4047
$$ -247615 72947 56791 -57388 -160187 -495342 -283970 326298 -260398 226382 310429
10160C10429H2068A3173a81128k82788a43916k73915g939A27620K5093D3493c05547
$$ 310429 82068 13173 -181128 -463916 -143916 -417831 -7939 127620 152713 43493 -305547
10148f9809G3558g2437n082K155A62828g2844k14111B30939a0356k22316O8660
$$ -69809 73558 -72437 -77519 -75364 162828 -72844 -286955 230939 -10356 -232672 -164012
10137a64012j66722a4746F5153b74414A3235c06762g0967E8634a71447c598j4554
$$ -164012 -330734 -14746 65153 -274414 13235 -306762 -70967 58634 -171447 -3598 -18152
10126a8152A01577a05289J1494C2844J09898a82109g1700A97890b21124C25425
$$ -18152 101577 -105289 -93795 32844 142742 -182109 -71700 197890 -221124 325425
10115A45948d9481p0314P417j83625j48510B5201R031J60948a22704I6623a04049
$$ 145948 -49481 -119795 -112378 -296003 -444513 25201 34232 195180 -122704 96623 -104049
10103d41053B094K18081d20197I590K15272b89667A96512i7665l14129J29914
$$ -441053 2094 220175 -420197 9590 224862 -289667 196512 -97665 -411794 -281880
10093b81880B8781K29300g3196k57361a01967j57840k52204e9220A78306b63193
$$ -281880 28781 258081 -73196 -330557 -101967 -259807 -512011 -59220 178306 -263193
10082a1097k63172A37718c46731b9667c297k08161a04833I8684a47099A21067
$$ -11097 -274269 137718 -346731 -29667 -3297 -211458 -104833 98684 -147099 121067
10071e9276C5566J24205J7866c12117h9011d3922I6287N4800a52326A55991M9674
$$ -59276 35566 159771 177637 -312117 -89011 -43922 96287 151087 -152326 155991 205665
10060B05665c8542B33171B0444h373l16288l5858J75086B03026F0890d02941A64183
$$ 205665 -38542 233171 20444 -8373 -324661 -360519 -185433 203026 60890 -402941 164183
10048C6125c4704B2036a53324b1029m331k54772b4700k17527Q7047I5367C8894
$$ 36125 -34704 22036 -153324 -21029 -25360 -280132 -24700 -242227 -155180 95367 38894
10036A15253a77254c7739j85834b0974e38j48288j91031g3471b7869l83478n2232
$$ 115253 -177254 -37739 -223573 -20974 -538 -148826 -339857 -73471 -27869 -411347 -463579
10025d63579b12189A96736I888J88706a77770C5806h842j29789m7451O2774A03524
$$ -463579 -212189 196736 9888 198594 -177770 35806 -8842 -138631 -186082 -123308 103524
10013d5389O1r880j93068m7768c6479j70047A24417o1352K8678c66084A18836
$$ -45389 -45328 -55208 -248276 -296044 -36479 -206526 124417 63065 91743 -366084 118836
10001C9559C503b7054k30916A00826B6703b36398e2261j12269l1366j22247C9308
$$ 39559 3503 -27054 -257970 100826 26703 -236398 -52261 -164530 -195896 -318143 39308
9989A23863c65427g8589A19284b4704o4038j58527g8011j0652A9876a24464j35839
$$ 123863 -365427 -78589 119284 -24704 -88742 -247269 -78011 -88663 19876 -124464 -260303
9978b60303J27545p6423e2015B2458F276d7624k11318b1113A2045c38845G117
$$ -260303 -132758 -209181 -52015 22458 6276 -47624 -258942 -21113 12045 -338845 7117
9966B6915a23663j52399I1460b21620d4130A48647N2362I4899K35155E0761J0474
$$ 26915 -123663 -276062 91460 -221620 -44130 148647 201009 94899 330054 50761 61235
9955F1235g585C3871e2035A66017a18066D939h2167C2516a09893A64239g5059
$$ 61235 -7585 33871 -52035 166017 -118066 4939 -82167 32516 -109893 164239 -75059
9943B8871c08756e9090j32555H9380c56402e7082J3737B93146c24759F3367c9395
$$ 28871 -308756 -59090 -191645 89380 -356402 -57082 -43345 293146 -324759 63367 -39395
9931a83244Q1373A39966b35442M8115A18438a09688I688a78967d2594a4242A77002
$$ -183244 -101871 139966 -235442 -187327 118438 -109688 9688 -178967 -42594 -14242 177002
9919B9345g410D1228b68652A34427a59448m0150a2342j27299j34631B44892b0738
$$ 29345 -7410 41228 -268652 134427 -159448 -199598 -12342 -139641 -274272 244892 -20738
9907A60433a91410r7307C9472K0346b5851j46673A83728J3217c0004A53776d6121
$$ 160433 -191410 -288717 39472 59818 -25851 -172524 183728 196945 -30004 153776 -46121
9895d61143a89816g0556B2298M9997M4258b01618g3585H7835i650j8679l73951
$$ -461143 -189816 -70556 22298 72295 116553 -201618 -73585 87835 -9650 -28329 -402280
9884d02280C03812r3352b96609L4677d5117k3850k02648a10848j87632C10988
$$ -402280 303812 210460 -296609 -261932 -45117 -68967 -271615 -110848 -298480 310988
9873a77548b0147j87987C7409L7694b23738B81e6907j91810j24583a20083a6435
$$ -177548 -20147 -208134 37409 75103 -223738 281 -56907 -248717 -373300 -120083 -16435
9861a98810p2593q8835F3606Q6614J9206a44827q2834h4982b5467A16092J04745
$$ -198810 -271403 -360238 63606 150220 169426 -144827 -227661 -84982 -25467 116092 220837
9850B20837j01336l9230a39305l14340A17194d1378j40936K4844A5032L29600
$$ 220837 119501 80271 -139305 -453645 117194 -41378 -182314 -157470 15032 344632
9840C44632c9883j54430h503A49995j7871D0628b89359C3275R7l579a95100A68500
$$ 344632 -39883 -194313 -8503 149995 132124 40628 -289359 33275 33372 29793 -195100 168500
9827a10871O328j26636M5245N2465C5839b28795a7240G5636e7924j5955A06118
$$ -110871 -104543 -231179 -185934 -133469 35839 -228795 -17240 75636 -57924 -73879 106118
9815a14554r3499f3143m5747K0312G1688b69127A01168b26490A72951a50488A55818
$$ -114554 -208053 -63143 -108890 -88578 71688 -269127 101168 -226490 172951 -150488 155818
9803b92482b8799j20019j64A70651n5317L2226g1083j96722C2585K47373b05946
$$ -292482 -28799 -148818 -148982 170651 115334 147560 -71083 -267805 32585 279958 -205946
9791F8582N895H72M166e3560H0542b47383j45363B37421C7940d7182m68258b09986
$$ 68582 74477 872 5038 -53560 80542 -247383 -392746 237421 37940 -47182 -515440 -209986
9778b72042d0263j69726i6140H3006J1100i5210q9933L0617C7092b09405M1183
$$ -272042 -40263 -209989 -96140 83006 94106 -95210 -185143 -154526 37092 -209405 -168222
9767a68222d2728B0263J95804b60457a14615F9590b34561Q9623D4461i6039H2129
$$ -168222 -42728 20263 216067 -260457 -114615 69590 -234561 -144938 44461 -96039 82129
9755e61033P1745G868P9474J9583c02592c2738A30802d4414k4995B04175b28372
$$ -561033 -489288 7868 87342 106925 -302592 -32738 130802 -44414 -69409 204175 -228372
9743a04241L3451b9655j38421j7216L1347f8248E857J9460b92202I9027a08764
$$ -104241 -70790 -29655 -168076 -185292 -153945 -68248 5857 25317 -292202 99027 -108764
9731a63079l5673j15779a03672j81165i9010d9334H4386J7504p960c27128C4811
$$ -163079 -198752 -314531 -103672 -284837 -99010 -49334 84386 101890 93930 -327128 34811
9719b03178l7039h9426A25965n2405a89792O4284E0251b23500A4969i5116M580
$$ -203178 -240217 -89426 125965 73560 -189792 -125508 50251 -223500 14969 -95116 -90536
9708i0536H6415J05540F4563k1603a20682Q925k1685G1024b86228M4448i7021
$$ -90536 86415 191955 64563 42960 -120682 -111757 -133442 71024 -286228 -241780 -97021
9696i1876j29746K853E2863M0224k0991h416l0202E8436a93403o6661A82191B313
$$ -91876 -221622 -218769 52863 93087 72096 -8416 -38618 58436 -193403 -260064 182191 2313
9683G8745A1460c05484a50505A6390f3726E637a10948m9264q6209m9636D7170
$$ 78745 11460 -305484 -150505 16390 -63726 5637 -110948 -160212 -246421 -296057 47170
9671a28587j79751a33985F6943b5546q7275B52971J44335c8143j52194m7466C3163
$$ -128587 -308338 -133985 66943 -25546 -112821 252971 397306 -38143 -190337 -237803 33163
9659b36939j7994k4873a20413j21790M642E5801k5534L6055b79343A91695C4792
$$ -236939 -254933 -279806 -120413 -242203 -237561 55801 30267 66322 -279343 191695 34792
9647A60780m9923P0704a41004A07894b94381a33962j59640A05181a14979G824
$$ 160780 110857 181561 -141004 107894 -294381 -133962 -293602 105181 -114979 7824
9636a5053k1878j33796j86181C24844d88557a31991N0365j69589J14210A2297
$$ -15053 -36931 -170727 -356908 324844 -488557 -131991 -81626 -251215 -137005 12297
9625a16059L5005k11228B42448i5982l2148n401M4547j02062j30933A58425M2256
$$ -116059 -81054 -292282 242448 -95982 -128130 -133531 -88984 -191046 -321979 158425 200681
9614B00681a12095j26282e3452k15935J24573H3193K9034f0286k20323O4671g0594
$$ 200681 -112095 -238377 -53452 -269387 -144814 83193 112227 -60286 -280609 -215938 -70594
9602c33416J51772A61671p5525K81861e7934b1211o2600G455O2207a84758c0811
$$ -333416 -181644 161671 86146 368007 -57934 -21211 -83811 7455 69662 -184758 -30811
9590b38282l7774O3714f8044k3660p969D7572M8989a60784c692m5787A83893d02429
$$ -238282 -276056 -212342 -68044 -91704 -99673 47572 96561 -160784 -3692 -49479 183893 -402429
9577F2113b27851c6832k36146B0532a57849g5272j78919A1658a41221C59037b97327
$$ 62113 -227851 -36832 -272978 20532 -157849 -75272 -254191 11658 -141221 359037 -297327
9565a10486d6731k73513f0759E8166K0993d5599C5888P7265a6377A61440A1291
$$ -110486 -46731 -320244 -60759 58166 79159 -45599 35888 113153 -16377 161440 11291
9553a11981A32863r143b796j84288r1359C26634j36074a89118A6341b03534J8663
$$ -111981 132863 123720 -2796 -187084 -278443 326634 190560 -189118 16341 -203534 -184871
9542a84871B8488g2770k19386B30505n0683A3487c30420a45124A27655d2189A49698
$$ -184871 28488 -72770 -292156 230505 179822 13487 -330420 -145124 127655 -42189 149698
9530d09945F8883L5343a02225l4527l26111a51885E12140a51683l6863k64078
$$ -409945 68883 104226 -102225 -136752 -462863 -151885 512140 -151683 -188546 -452624
9520d52624f8166B0052a52288A5777a30275B36695e87444B2239J18522h925B11988
$$ -452624 -68166 20052 -152288 15777 -130275 236695 -587444 22239 140761 -8925 211988
9508B13171d32792J40919C2898b17660d5658j37967M4443A5350c90099a02718
$$ 213171 -432792 -291873 32898 -217660 -45658 -183625 -139182 15350 -390099 -102718
9497A46268b0333l8047A7503a66693Q0214j41208i0683E5127e0287A59634c5580
$$ 146268 -20333 -58380 17503 -166693 -86479 -227687 -90683 55127 -50287 159634 -35580
9485A07454a06430l2151L2961A18149a3796k1797A2504b18374G0364K0194J36843
$$ 107454 -106430 -138581 -105620 118149 -13796 -35593 12504 -218374 70364 90558 227401
9474B27401D6792h1202N066n8782k47032h2699m6725G6478a00384A82455a79319
$$ 227401 46792 -81202 -76136 -134918 -381950 -82699 -129424 76478 -100384 182455 -179319
9462C351c14212p0672Q4409j21915i800B51351c09491j1701J49401e4920k12655
$$ 3351 -314212 -384884 -300475 -422390 -9800 251351 -309491 -321192 -171791 -54920 -267575
9451b67575b0654j79258i2871H268a1921A02770c79863o4642h4057O544L8462
$$ -267575 -20654 -199912 -92871 8268 -11921 102770 -379863 -444505 -84057 -77513 -39051
9440c9051j0907a148j18933o5975A41282j5326c84321J26946F7584d04209e2938
$$ -39051 -49958 -1148 -120081 -186056 141282 125956 -384321 -257375 67584 -404209 -52938
9428B30195G6066N5558b22742P8238B22103D5348e18439A13884a24121k34688
$$ 230195 76066 131624 -222742 -144504 222103 45348 -518439 113884 -124121 -358809
9418c58809h9262O298c4591A54755h0017B2884a12976k26085A8313a59967g0365
$$ -358809 -89262 -82964 -34591 154755 -80017 22884 -112976 -339061 18313 -159967 -70365
9406E2402n664g5126C086d05472a32719b1779A09469J460b63432G3167a20140
$$ 52402 46738 -75126 3086 -405472 -132719 -21779 109469 110929 -263432 73167 -120140
9394A02605a24040N9900p8952K97j0845C95J25966c6254A72738h8789b2715K900
$$ 102605 -124040 -64140 -143092 -142795 -153640 395 126361 -36254 172738 -88789 -22715 -19815
9382a9815C3906J54029a49139A80794a77490b3108k15800A65141e3940j07735
$$ -19815 33906 187935 -149139 180794 -177490 -23108 -238908 165141 -53940 -161675
9372a61675m4080e1235B34024c62148b9746E9128b01435A12426a25301C32846
$$ -161675 -205755 -51235 234024 -362148 -29746 59128 -201435 112426 -125301 332846
9361A01451a80659p8388L699a3008k31770l5134b1927A40669E6105b32431f9980
$$ 101451 -180659 -259047 -255348 -13008 -244778 -279912 -21927 140669 56105 -232431 -69980
9349c5159j81580Q6362C9795j2530J41859F0050M345b96780c29A59179m8232C6059
$$ -35159 -216739 -130377 39795 27265 169124 60050 64395 -296780 -329 159179 110947 36059
9336B55688q4392G9880c26143P1708f1657j41861P362d0532D7567O1647b7927
$$ 255688 171296 79880 -326143 -254435 -61657 -203518 -196156 -40532 47567 109214 -27927
9324c05784d9336B34280b91484A3401K4194d73740i1097a2936q9950j30479q7046
$$ -305784 -49336 234280 -291484 13401 37595 -473740 -91097 -12936 -102886 -233365 -320411
9313c20411F8650a49787d566r2659A21212e8628I9519k6124b09147e1289A55691
$$ -320411 68650 -149787 -4566 -97225 121212 -58628 99519 73395 -209147 -51289 155691
9301h4765j82351a24736r523A70060C0597a46714A8473J3360a2445A8392J10257
$$ -84765 -267116 -124736 -134259 170060 30597 -146714 18473 31833 -12445 18392 128649
9290A28649o1231g7216F7007J33481e4401k33607f768k11352d0730k7416k09438
$$ 128649 67418 -77216 67007 200488 -54401 -288008 -6768 -218120 -40730 -68146 -277584
9279b77584P0678A92306b45213J7830F3659a13297b5641p8813A64952b26674G4965
$$ -277584 -206906 192306 -245213 -227383 63659 -113297 -25641 -104454 164952 -226674 74965
9267a99929f1424p8614j23852g4283j03326g4848j42135f2499E622a47773a7661
$$ -199929 -61424 -140038 -263890 -74283 -177609 -74848 -216983 -62499 5622 -147773 -17661
9255A65404b7077j97801k3937J00371e8068k17187H3740G296d5565l30846c7844
$$ 165404 -27077 -224878 -248815 -148444 -58068 -275255 83740 7296 -45565 -376411 -37844
9243A0833Q5898B2428K6973b39950K0344g9606A17678a68990L6570o9997C02620
$$ 10833 96731 22428 49401 -239950 -219606 -79606 117678 -168990 -132420 -202417 302620
9231h7769B6178b86162d5664j19733N0681A27467c2641j47568q4296a05614j39890
$$ -87769 26178 -286162 -45664 -165397 -114716 127467 -32641 -180209 -264505 -105614 -245504
9220b45504P8946M2606j11375G1366a35572L8234o2280A60357c70488c2302m5171
$$ -245504 -166558 -123952 -235327 71366 -135572 -97338 -159618 160357 -370488 -32302 -77473
9209g7473B70961b27858B02889F3783M2017A6472h417j25058p6798C3045c09911
$$ -77473 270961 -227858 202889 63783 105800 16472 -8417 -133475 -210273 33045 -309911
9197B47831f0068k62063J41342j05510g5485A51015c38861i6122j898B12536g178
$$ 247831 -60068 -322131 -180789 -286299 -75485 151015 -338861 -96122 -98020 212536 -7178
9185b70620c4586A6756a57570e0065I6104f3463r276j02982p5367B62331H826
$$ -270620 -34586 16756 -157570 -50065 96104 -63463 -72739 -175721 -251088 262331 8826
9173A74228a920j34965e1304C505b7753G656L42740e4174H8490C6020O8927D0135
$$ 174228 -1920 -136885 -51304 3505 -27753 7656 350396 -54174 88490 36020 104947 40135
9160c343j3212n798j14274B0242b64822A22694c8111k25889g9310C28772i2905
$$ -3343 -16555 -22353 -136627 20242 -264822 122694 -38111 -264000 -79310 328772 -92905
9148d3275o0954K6360l551B67905I6557b97439j11905A72280b60692c026B38418
$$ -43275 -104229 -77869 -81420 267905 96557 -297439 -409344 172280 -260692 -3026 238418
9136a08208K4359A42541f1548A79622a87042M1228d6228A65400d9587A79412P6481
$$ -108208 -83849 142541 -61548 179622 -187042 -145814 -46228 165400 -49587 179412 255893
9125B55893a49514A9008b78710h8958q9206g6517I70d49252c4979q8984L3466
$$ 255893 -149514 19008 -278710 -88958 -178164 -76517 970 -449252 -34979 -123963 -90497
9114i0497J0051j32405C3906b15384J04016A34083J54698a62249A07820a13191
$$ -90497 -80446 -212851 33906 -215384 -111368 134083 288781 -162249 107820 -113191
9103a37319c8537B09533J39822g7893l5378A6249L05101b00662A99600a42048
$$ -137319 -38537 209533 349355 -77893 -113271 16249 321350 -200662 199600 -142048
9092b09351P4709k22930a55892C86373a75939j09782C1266a430A63323a95514
$$ -209351 -134642 -357572 -155892 386373 -175939 -285721 31266 -1430 163323 -195514
9081c12191B24711b75656J11880a6030A46545a38356e180j20322L5004F970a45015
$$ -312191 224711 -275656 -163776 -16030 146545 -138356 -5180 -125502 -90498 6970 -145015
9069I085a84195h76r7090Q60b0914E9274N3340m1017J19610a25335A85572E2866
$$ 9085 -184195 -876 -97966 -97106 -20914 59274 112614 71597 191207 -125335 185572 52866
9056A35289h3641C45567F881d4555J5325p1363l46845c2419j20493f731A37750
$$ 135289 -83641 345567 6881 -44555 -29230 -100593 -447438 -32419 -152912 -6731 137750
9044a94379C07823b8412j44762A3459N7404c8064G6822J38946K8945a32736p1675
$$ -194379 307823 -28412 -173174 13459 70863 -38064 76822 215768 244713 -132736 -204411
9033b04411k56008a05540A36644K23301a62771f6108j57504R7489K6124A58943
$$ -204411 -460419 -105540 136644 359945 -162771 -66108 -223612 -126123 -99999 158943
9022f1208A0753i2730p3285j3388J731A95997a14751K6093L0071Q004C4739b0450
$$ -61208 10753 -92730 -166015 -179403 -177672 195997 -114751 -88658 -58587 -50583 34739 -20450
9009A9147J05766c5603D0963a89786M8110l78510b27417F8852a15260M6981l03639
$$ 19147 124913 -35603 40963 -189786 -141676 -520186 -227417 68852 -115260 -68279 -371918
8998c71918g9805o244j42718d5994A8611M8583M3199b85245h8143B9461J17404
$$ -371918 -79805 -86049 -228767 -45994 18611 67194 110393 -285245 -88143 29461 146865
8987A46865c21739r841A90209p233a54815j52041b2763r5673A41880J69237F6084
$$ 146865 -321739 -331580 190209 182976 -154815 -306856 -22763 -118436 141880 311117 66084
8975b28877A44488f700A90279a2314j38388j05130B24826a74662B03455b65016
$$ -228877 144488 -6700 190279 -12314 -150702 -255832 224826 -174662 203455 -265016
8964A4149e149E3945J09300c49926a26491P962H372b87528j8751n063e5778B28202
$$ 14149 -5149 53945 163245 -349926 -126491 -118529 8372 -287528 -306279 -311342 -55778 228202
8951a16308F5018K29768A0989a02810k4137L5026m9996k05180b1871k57160A27342
$$ -116308 65018 294786 10989 -102810 -126947 -91921 -141917 -347097 -21871 -279031 127342
8939a13061i975j76964q4058g8981J5098p3090f1107J5527j10746b3560I4991
$$ -113061 -9975 -186939 -270997 -78981 -63883 -136973 -61107 -45580 -156326 -23560 94991
8927e47r9569A14284d6744b2975j34958B44446D4948O2057j957a67152j70982
$$ -547 -100116 114284 -46744 -22975 -157933 244446 44948 107005 105048 -167152 -338134
8916c38134E07859a6534A97236a10030B45616J44991p9915j55316J80377K88603
$$ -338134 507859 -16534 197236 -110030 245616 390607 310692 155376 335753 624356
8906F24356L80196N47683J122501K686092k84425B209272A064939m65170B36011
$$ 624356 1004552 1552235 2674736 5360828 5076403 2209272 1064939 599769 236011
8896D56705k8343P3275b3666C57578b39782C82344I3236J92774n250E2396a21856
$$ 456705 428362 501637 -23666 357578 -239782 382344 93236 286010 280760 52396 -121856
8884A21618A6242a26579l3724O8815C3431E111a15015B9174d41916b6422j29043
$$ 121618 16242 -126579 -160303 -91488 33431 5111 -115015 29174 -441916 -26422 -155465
8873a55465g7161F6657a35122a5812j06186k659B53368a78220Q266E9426b56835
$$ -155465 -77161 66657 -135122 -15812 -121998 -124657 253368 -178220 -169954 59426 -256835
8861D2405b52811A2180b22282H6469e3689k59658j23216A28962b56755C65971
$$ 42405 -252811 12180 -222282 86469 -53689 -313347 -436563 128962 -256755 365971
8850A09891c49553J17121o0041l707g4588A4298c49662J50607m3244J01171a5113
$$ 109891 -349553 -232432 -292473 -296180 -74588 14298 -349662 -199055 -242299 -141128 -15113
8838e9472F5312h4923I5340a84588h6939p5606P6836k08989a47343m9818Q3551
$$ -59472 65312 -84923 95340 -184588 -86939 -162545 -85709 -294698 -147343 -197161 -113610
$$ [...]
##END NTUPLES=NMR SPECTRUM
##END=
