
##TITLE=AC1145_Valledupar_5874472_T1F9qT1H9u
##JCAMPDX= 6.0         $$ Bruker NMR JCAMP-DX V2.0
##DATA TYPE= NMR SPECTRUM
##DATA CLASS= NTUPLES
##ORIGIN= BRUKER
##OWNER= Administrator
$$ 1.72 TOPSPIN		Version 2.1
$$ 2012-03-31 15:11:06.890 -0500  Administrator@TOPSPIN
$$ Compression mode = diff/dup
##.OBSERVE FREQUENCY= 400.13188235
##.OBSERVE NUCLEUS= ^1H
##.ACQUISITION MODE= SIMULTANEOUS (DQD)
##.ACQUISITION SCHEME= undefined
##.AVERAGES= 64
##.DIGITISER RES= 22
##SPECTROMETER/DATA SYSTEM= spect
##.PULSE SEQUENCE= noesygpps1d.comp
##.SOLVENT NAME= COFFEE_meoh
##.SHIFT REFERENCE= INTERNAL, COFFEE_meoh, 1, 14.96865
##AUDIT TRAIL= $$ (NUMBER, WHEN, WHO, WHERE, PROCESS, VERSION, WHAT)
$$ ##TITLE= Audit trail, TOPSPIN		Version 2.1
$$ ##JCAMPDX= 5.01
$$ ##ORIGIN= Bruker BioSpin GmbH
$$ ##OWNER= Administrator
$$ $$ C:\Bruker\TOPSPIN/data/COFFEE/nmr/AC1145_Valledupar_5874472_T1F9qT1H9u/12/pdata/1/auditp.txt
$$ ##AUDIT TRAIL=  $$ (NUMBER, WHEN, WHO, WHERE, PROCESS, VERSION, WHAT)
(   1,<2012-03-31 15:11:01.390 -0500>,<Administrator>,<TOPSPIN>,<go>,<TOPSPIN 2.1>,
      <created by zg
	started at 2012-03-31 14:59:29.703 -0500,
	POWCHK enabled, PULCHK disabled,
       configuration hash MD5:
       1A 1E CE 29 27 FD 77 03 67 4E F0 E3 C4 B2 CB 90
       data hash MD5: 64K
       4A E9 4E 68 CC AA 33 AD B0 DD 24 B0 7B BB 50 40>)
(   2,<2012-03-31 15:11:04.718 -0500>,<Administrator>,<TOPSPIN>,<proc1d>,<TOPSPIN 2.1>,
      <Start of raw data processing
       efp LB = 0.3 FT_mod = 6 PKNL = 1 PHC0 = 0 PHC1 = 0 SI = 128K 
       data hash MD5: 128K
       00 59 FC 70 80 F3 D0 1C E5 78 6A 6D 8A 48 5C EB>)
(   3,<2012-03-31 15:11:06.000 -0500>,<Administrator>,<TOPSPIN>,<proc1d>,<TOPSPIN 2.1>,
      <pk PHC0 = 40.30334 PHC1 = 0 
       data hash MD5: 128K
       68 72 6E 99 80 1C A5 66 7E E1 2A 0E 2D 61 A6 4E>)
(   4,<2012-03-31 15:11:06.562 -0500>,<Administrator>,<TOPSPIN>,<proc1d>,<TOPSPIN 2.1>,
      <abs ABSG = 1 
       data hash MD5: 128K
       55 5C D5 A2 D9 12 71 D3 6E 41 94 0B 6F 83 18 74>)
(   5,<2012-03-31 15:11:06.640 -0500>,<Administrator>,<TOPSPIN>,<proc1d>,<TOPSPIN 2.1>,
      <abs ABSG = 2 
       data hash MD5: 128K
       56 3C E3 8F C2 6E 69 2D F6 DB 84 C3 E5 E0 65 BD>)
(   6,<2012-03-31 15:11:06.703 -0500>,<Administrator>,<TOPSPIN>,<proc1d>,<TOPSPIN 2.1>,
      <abs ABSG = 3 
       data hash MD5: 128K
       8D F0 87 1E 40 BF 4B A6 E1 3C AF 28 9B 1B AB EF>)
(   7,<2012-03-31 15:11:06.750 -0500>,<Administrator>,<TOPSPIN>,<proc1d>,<TOPSPIN 2.1>,
      <abs ABSG = 4 
       data hash MD5: 128K
       93 39 F3 86 D4 B7 07 52 07 C4 57 9B 44 CE 54 E0>)
(   8,<2012-03-31 15:11:06.812 -0500>,<Administrator>,<TOPSPIN>,<proc1d>,<TOPSPIN 2.1>,
      <abs ABSG = 5 
       data hash MD5: 128K
       44 9E FA 4D 5A D8 CD A2 CD 31 75 04 73 5C 07 8F>)
$$ ##END=
$$ 
$$ $$ hash MD5
$$ $$ 39 CD 6C 97 E6 51 5C 78 EA 94 1A B7 5F FA 80 61
##$RELAX= 
##$RELAX= 
##$RELAX= 
##$RELAX= 
##$RELAX= 
##$RELAX= 
##$RELAX= 
##$RELAX= 
$$ Bruker specific parameters
$$ [...]
##$TP07= 0
##$TPNAME0= <>
##$TPNAME1= <>
##$TPNAME2= <>
##$TPNAME3= <>
##$TPNAME4= <>
##$TPNAME5= <>
##$TPNAME6= <>
##$TPNAME7= <>
##$TPOAL= (0..7)
0.5 0.5 0.5 0.5 0.5 0.5 0.5 0.5
##$TPOFFS= (0..7)
0 0 0 0 0 0 0 0
##$TUNHIN= 0
##$TUNHOUT= 0
##$TUNXOUT= 0
##$USERA1= <user>
##$USERA2= <user>
##$USERA3= <user>
##$USERA4= <user>
##$USERA5= <user>
##$V9= 5
##$VALIST= <valist>
##$VCLIST= <CCCCCCCCCCCCCCC>
##$VD= 0
##$VDLIST= <DDDDDDDDDDDDDDD>
##$VPLIST= <PPPPPPPPPPPPPPP>
##$VTLIST= <TTTTTTTTTTTTTTT>
##$WBST= 2048
##$WBSW= 25
##$XGAIN= (0..3)
0 0 0 0
##$XL= 0
##$YL= 0
##$YMAX_a= 13529249
##$YMIN_a= -6282514
##$ZGOPTNS= <>
##$ZL1= 120
##$ZL2= 120
##$ZL3= 120
##$ZL4= 120
##$ABSF1= 14.96865
##$ABSF2= -5.58388
##$ABSG= 5
##$ABSL= 3
##$ALPHA= 0
##$AQORDER= 0
##$ASSFAC= 0
##$ASSFACI= 0
##$ASSFACX= 0
##$ASSWID= 0
##$AUNMP= <proc_prof1d_extract.lims>
##$AXLEFT= 0
##$AXNAME= <>
##$AXNUC= <1H>
##$AXRIGHT= 0
##$AXTYPE= 0
##$AXUNIT= <>
##$AZFE= 0.1
##$AZFW= 0.1
##$BCFW= 0
##$BC_mod= 0
##$BYTORDP= 0
##$COROFFS= 0
##$CY= 15
##$DATMOD= 1
##$DC= 0
##$DFILT= <>
##$DTYPP= 0
##$F1P= 0
##$F2P= 0
##$FCOR= 0.5
##$FTSIZE= 131072
##$FT_mod= 6
##$GAMMA= 0
##$GB= 0
##$INTBC= 1
##$INTSCL= 1
##$ISEN= 128
##$LB= 0.3
##$LEV0= 0
##$LPBIN= 0
##$MAXI= 10000
##$MC2= 0
##$MEAN= 0
##$ME_mod= 0
##$MI= 0
##$NCOEF= 0
##$NC_proc= -3
##$NLEV= 6
##$NOISF1= 0
##$NOISF2= 0
##$NSP= 0
##$NTH_PI= 0
##$NZP= 0
##$OFFSET= 14.96865
##$PC= 1
##$PHC0= 40.30334
##$PHC1= 0
##$PH_mod= 1
##$PKNL= yes
##$PPARMOD= 0
##$PPDIAG= 0
##$PPIPTYP= 0
##$PPMPNUM= 2147483647
##$PPRESOL= 1
##$PSCAL= 4
##$PSIGN= 0
##$PYNMP= <proc.py>
##$REVERSE= no
##$SF= 400.130004784177
##$SI= 131072
##$SIGF1= 0
##$SIGF2= 0
##$SINO= 400
##$SIOLD= 131072
##$SPECTYP= <>
##$SREGLST= <1H.CDCl3>
##$SSB= 0
##$STSI= 131072
##$STSR= 0
##$SW_p= 8223.68421052632
##$SYMM= 0
##$S_DEV= 0
##$TDeff= 65536
##$TDoff= 0
##$TI= <>
##$TILT= no
##$TM1= 0
##$TM2= 0
##$TOPLEV= 0
##$USERP1= <user>
##$USERP2= <user>
##$USERP3= <user>
##$USERP4= <user>
##$USERP5= <user>
##$WDW= 1
##$XDIM= 131072
##$YMAX_p= 552040795
##$YMIN_p= -410657948
##$CURPLOT= <Network HP LaserJet P1505>
##$CURPRIN= <$Network HP LaserJet P1505>
##$DFORMAT= <normdp>
##$LAYOUT= <+/1D_H.xwp>
##$LFORMAT= <normlp>
##$PFORMAT= <normpl>
##$SURQMSG= 1
$$ End of Bruker specific parameters
$$ ---------------------------------
##NTUPLES= NMR SPECTRUM
##VAR_NAME=  FREQUENCY,     SPECTRUM/REAL,   SPECTRUM/IMAG
##SYMBOL=    X,             R,               I
##VAR_TYPE=  INDEPENDENT,   DEPENDENT,       DEPENDENT
##VAR_FORM=  AFFN,          ASDF,            ASDF
##VAR_DIM=   131072,        131072,          131072
##UNITS=     HZ,            ARBITRARY UNITS, ARBITRARY UNITS
##FACTOR=    0.0627417313425165, 1,          1
##FIRST=     8223.62146879498, 2312,         -96295
##LAST=      0,             3355,            -95834
##MIN=       0,             -410657948,      0
##MAX=       8223.62146879498, 552040795,    0
$$ Real data points
##PAGE= N=1
##DATA TABLE= (X++(R..R)), XYDATA
$$ [...]
60666A686015j3536j4265j4233j5006j7118j8608j7734j5483j3690j2112r552
$$ 1686015 1672479 1658214 1643981 1628975 1611857 1593249 1575515 1560032 1546342 1534230 1524678
60655A524678o711n401n520n251m171l766m594n197m467l326l183m217n823p545
$$ 1524678 1517967 1512566 1507046 1501795 1497624 1493858 1489264 1484067 1479600 1476274 1473091 1468874 1463051 1455506
60641A455506q899r356q988q288p113m859j923L48J420K145L185M128M574M873
$$ 1455506 1446607 1437251 1428263 1419975 1412862 1408003 1406080 1406428 1407848 1409993 1413178 1417306 1421880 1426753
60627A426753N133M660L080J114m29j639l010m832p509j1374j5655j8663j9816
$$ 1426753 1431886 1436546 1439626 1440740 1440311 1438672 1435662 1430830 1423321 1411947 1396292 1377629 1357813
60614A357813k0505k1976k3272k2543j9872j7357j6423j6154j4717j1656q225
$$ 1357813 1337308 1315332 1292060 1269517 1249645 1232288 1215865 1199711 1184994 1173338 1165113
60603A165113n850m848m623m622m637m429l751k822k140j533j59K015L491L002
$$ 1165113 1159263 1154415 1149792 1145170 1140533 1136104 1132353 1129531 1127391 1125858 1125699 1127714 1131205 1134207
60589A134207J430Q29J818L118L528L182K682K134J544J126Q65N15L87J278L162
$$ 1134207 1135637 1136466 1138284 1141402 1144930 1148112 1150794 1152928 1154472 1155598 1156463 1156978 1157365 1158643 1161805
60574A161805M767N120M862N360O934Q712R995J1063J2562J4647J7032J9536K2168
$$ 1161805 1166572 1171692 1176554 1181914 1188848 1197560 1207555 1218618 1231180 1245827 1262859 1282395 1304563
60561A304563K4558K5881K5882K5777K7278L0476L3496L4609L3941L2573L0905
$$ 1304563 1329121 1355002 1380884 1406661 1433939 1464415 1497911 1532520 1566461 1599034 1629939
60550A629939K8835K6756K5092K3146J9782J5176J0824P577M599N66m793j0646
$$ 1629939 1658774 1685530 1710622 1733768 1753550 1768726 1779550 1787127 1791726 1792292 1787499 1776853
60538A776853j5906j9891k2493k4024k4820k5094k5163k5258k4864k3007j9549
$$ 1776853 1760947 1741056 1718563 1694539 1669719 1644625 1619462 1594204 1569340 1546333 1526784
60527A526784j5704j2715j0802r828r861j0206r130o000k801j981l409n007n764
$$ 1526784 1511080 1498365 1487563 1477735 1467874 1457668 1448538 1442538 1439737 1437756 1434347 1429340 1423576
60514A423576o296o795o547n528m688m221l252j488L55K122M632Q019J1033J2601
$$ 1423576 1417280 1410485 1403938 1398410 1393722 1389501 1386249 1384761 1385116 1387238 1391870 1399889 1410922 1423523
60500A423523J2880J2372J1394J0786J1668J3774J5336J5410J5041J5462J6425
$$ 1423523 1436403 1448775 1460169 1470955 1482623 1496397 1511733 1527143 1542184 1557646 1574071
60489A574071J7178J7784J8425J8550J8002J8156K0655K5484L1187L6547M1142
$$ 1574071 1591249 1609033 1627458 1646008 1664010 1682166 1702821 1728305 1759492 1796039 1837181
60478A837181M4975M8557N2936N8390O3107O4224O0427N2964M3925L3973K2180
$$ 1837181 1882156 1930713 1983649 2042039 2105146 2169370 2229797 2282761 2326686 2360659 2382839
60467B382839P940p354k0884l0675l6806m0069m0313l7050l1230k4901j8909j2221
$$ 2382839 2390779 2383425 2362541 2331866 2295060 2254991 2214678 2177628 2146398 2121497 2102588 2090367
60455B090367m149M018J0515J5448K0393K5955L0865L3855L5595L8104M2483M7924
$$ 2090367 2086218 2090236 2100751 2116199 2136592 2162547 2193412 2227267 2262862 2300966 2343449 2391373
60443B391373N3220N8647O5665P4956Q5693R6904J08787J22264J37992J56146
$$ 2391373 2444593 2503240 2568905 2643861 2729554 2826458 2935245 3057509 3195501 3351647
60433C351647J76475J98085K19907K41709K63729K85176L04700L22999L43083
$$ 3351647 3528122 3726207 3946114 4187823 4451552 4736728 5041428 5364427 5707510
60424E707510L66477L90647M11466M26064M30566M16848L75614L03585K05586
$$ 5707510 6073987 6464634 6876100 7302164 7732730 8149578 8525192 8828777 9034363
60415I034363Q9881l5707j62672k80258l77555m47115m86837n00069m94152m76700
$$ 9034363 9124244 9088537 8925865 8645607 8268052 7820937 7334100 6834031 6339879 5863179
60405E863179m52051m21762l87846l53526l20778k89571k60059k33444k09974
$$ 5863179 5411128 4989366 4601520 4247994 3927216 3637645 3377586 3144142 2934168
60396B934168j88225j67341j48237j31669j16953j03570r2230q3217p5272o7265
$$ 2934168 2745943 2578602 2430365 2298696 2181743 2078173 1985943 1902726 1827454 1760189
60386A760189n9628n3176m7907m3867m1555m0437l8631l5290l1865k9855k8719
$$ 1760189 1700561 1647385 1599478 1555611 1514056 1473619 1434988 1399698 1367833 1337978 1309259
60375A309259k7207k5269k3338k1144j8554j6326j4686j2555r569p505p973r781
$$ 1309259 1282052 1256783 1233445 1212301 1193747 1177421 1162735 1150180 1140611 1133106 1125133 1115352
60363A115352j0313q776o525m881m084l911l882l236j640M48K679N221P702Q956
$$ 1115352 1105039 1096263 1089738 1084857 1080773 1076862 1072980 1069744 1068104 1068552 1071231 1076452 1084154 1093110
60349A093110Q611P674O695M899K296Q68K044M428N835O250O759O914N640M042
$$ 1093110 1101721 1109395 1116090 1120989 1123285 1124153 1126197 1130625 1136460 1142710 1149469 1156383 1162023 1166065
60335A166065M630P653J0421J0631Q756O792O070O658P786Q362P803O478M926
$$ 1166065 1170695 1178348 1188769 1199400 1208156 1214948 1221018 1227676 1235462 1243824 1251627 1258105 1263031
60322A263031L086R04r14j750k170l133m479n162m716l672k775k449k651k756
$$ 1263031 1266117 1267021 1266107 1264357 1262187 1259054 1254575 1249413 1244697 1241025 1238250 1235801 1233150 1230394
60308A230394k180j430j458j614J66M120P289P031M564L163L893N240O195P371
$$ 1230394 1228214 1226784 1225326 1223712 1223878 1227998 1235287 1242318 1246882 1250045 1253938 1259178 1265373 1272744
60294A272744R168J0836J1700J1886J1727J1549J1832J2483J2402J1103J0193
$$ 1272744 1281912 1292748 1304448 1316334 1328061 1339610 1351442 1363925 1376327 1387430 1397623
60283A397623J1510J4157J5217J3482J0730R018Q258P039M549J197j814l121k285
$$ 1397623 1409133 1423290 1438507 1451989 1462719 1471737 1479995 1487034 1491583 1492780 1490966 1487845 1485560
60270A485560l97R13J213J339K093L659N818P795Q186O435M163L713N154N912
$$ 1485560 1485163 1486076 1487289 1488628 1490721 1494380 1500198 1507993 1516179 1522614 1526777 1530490 1535644 1541556
60256A541556L638j346o632r900j0389r048p617p172p413p478p051o408n889n832
$$ 1541556 1545194 1543848 1537216 1527316 1516927 1507879 1500262 1493090 1485677 1478199 1471148 1464740 1458851 1453019
60242A453019o373o881o244m356k480j456n98Q23K160K685L077M106M871M190
$$ 1453019 1446646 1439765 1433521 1429165 1426685 1425229 1424631 1425454 1427614 1430299 1433376 1437482 1442353 1446543
60228A446543L010L432N662P785Q466Q066P209O059N239N699P204Q385Q697R144
$$ 1446543 1449553 1452985 1458647 1466432 1474898 1482964 1490173 1496232 1501471 1507170 1514374 1522759 1531456 1540600
60214A540600J0556J2398J3715J4428J5167J6495J8569K0999K2937K3901K4462
$$ 1540600 1551156 1563554 1577269 1591697 1606864 1623359 1641928 1662927 1685864 1709765 1734227
60203A734227K5728K8280L2030L6706M1865M6950N1754N6296N9997O2248O4433
$$ 1734227 1759955 1788235 1820265 1856971 1898836 1945786 1997540 2053836 2113833 2176081 2240514
60192B240514O9605P8672Q8395R5216R9847J05812J14403J23696J32195J40586
$$ 2240514 2310119 2388791 2477186 2572402 2672249 2778061 2892464 3016160 3148355 3288941
60182C288941J49559J58331J66010J72545J77613J80260J80221J78107J73823
$$ 3288941 3438500 3596831 3762841 3935386 4112999 4293259 4473480 4651587 4825410
60173D825410J66387J55778J43380J29949J14577R6447P6485N6655L8491K2684
$$ 4825410 4991797 5147575 5290955 5420904 5535481 5631928 5708413 5765068 5803559 5826243
60163E826243Q981l792j6542k8325l6976m1407m2227m0102l4943k7020j7467p063
$$ 5826243 5835224 5831432 5814890 5786565 5749589 5708182 5665955 5625853 5590910 5563890 5546423 5539360
60151E539360M387J7069L0587M4794O0090P6474R3185J09503J25118J39502J51800
$$ 5539360 5543747 5560816 5591403 5636197 5696287 5772761 5865946 5975449 6100567 6240069 6391869
60140F391869J61405J67832J70220J68065J62157J53598J42034J26194J06012
$$ 6391869 6553274 6721106 6891326 7059391 7221548 7375146 7517180 7643374 7749386
60131G749386Q2821N7646L1006M342k0299m2343o2853q2278r9612j13940j25030
$$ 7749386 7832207 7889853 7920859 7925201 7904902 7862559 7799706 7717428 7617816 7503876 7378846
60120G378846j31845j32389j25987j14349r9758q3363o5639m6973k7181n834J6268
$$ 7378846 7247001 7114612 6988625 6874276 6774518 6691155 6625516 6578543 6551362 6545528 6561796
60109F561796L7254N6216P3727Q9968J03989J15261J23960J29006J27906J19915
$$ 6561796 6599050 6655266 6728993 6818961 6922950 7038211 7162171 7291177 7419083 7538998
60099G538998J07700R4413Q0413O4329M6106K7488J0325m151j4997k1681k4178
$$ 7538998 7646698 7741111 7821524 7885853 7931959 7959447 7969772 7965621 7950624 7928943 7904765
60088G904765k2155j4904k745J2464K9218M8024P0212R5884J24045J54114J86174
$$ 7904765 7882610 7867706 7864961 7877425 7906643 7954667 8024879 8120763 8244808 8398922 8585096
60077H585096K20001K54652K89025L22514L55571L89611M25468M61695M95275
$$ 8585096 8805097 9059749 9348774 9671288 10026859 10416470 10841938 11303633 11798908
60068A1798908N24277N48703N68462N81855N86774N82209N67745N42811N07425
$$ 11798908 12323185 12871888 13440350 14022205 14608979 15191188 15758933 16301744 16809169
60059A6809169M62958M11089L52547K87404K15965J38972N7808k5057j06777j85690
$$ 16809169 17272127 17683216 18035763 18323167 18539132 18678104 18735912 18710855 18604078 18418388
60049A8418388k60937l30166l89214m35103m68042m89387m98989m96025m81394
$$ 18418388 18157451 17827285 17438071 17002968 16534926 16045539 15546550 15050525 14569131
60040A4569131m57451m25909l87442l43223k95452k46302j97140j48746j01639
$$ 14569131 14111680 13685771 13298329 12955106 12659654 12413352 12216212 12067466 11965827
60031A1965827n6282j3508K5410N9395Q7852J09992J24354J29501J24920J11202
$$ 11965827 11909545 11896037 11921447 11980842 12068694 12178686 12303040 12432541 12557461 12668663
60021A2668663R0064O4217L6355P680k1902n2075q1559j09459j35888j60700j82769
$$ 12668663 12758727 12822944 12859299 12866979 12845077 12793002 12711443 12601984 12466096 12305396 12122627
60010A2122627k01282k16757k29987k40740k48280k52466k53668k52105k47641
$$ 12122627 11921345 11704588 11474601 11233861 10985581 10733115 10479447 10227342 9979701
60001I979701k39620k26886k08989j87531j65163j42917j19765r4868o8621m1237
$$ 9979701 9740081 9513195 9304206 9116675 8951512 8808595 8688830 8593962 8525341 8484104
59991H484104j2427J6680M3449O6962Q9329J12148J33454J50223J62250J71011
$$ 8484104 8471677 8488357 8531806 8598768 8688097 8800245 8933699 9083922 9246172 9417183
59981I417183J75683J73194J62150J44482J22834R8139P0248L9383O319k7943
$$ 9417183 9592866 9766060 9928210 10072692 10195526 10293665 10363913 10403296 10409615 10381672
59971A0381672o2257r5555j27021j55480j78975j95844k05961k10237k09240k03186
$$ 10381672 10319415 10223860 10096839 9941359 9762384 9566540 9360579 9150342 8941102 8737916
59961H737916j92820j79153j62505j42830j20850r7801p4090m9238k3289K683
$$ 8737916 8545096 8365943 8203438 8060608 7939758 7841957 7767867 7718629 7695340 7698023
59951G698023K7829N2487P7490J02961J28221J52547J75633J97249K16724K32973
$$ 7698023 7725852 7778339 7855829 7958790 8087011 8239558 8415191 8612440 8829164 9062137
59941I062137K45024K52191K53511K47576K33671K12785J86662J56035J20912
$$ 9062137 9307161 9559352 9812863 10060439 10294110 10506895 10693557 10849592 10970504
59932A0970504Q2501M3473N833l0265o5228r8621j29732j58143j82747k01074
$$ 10970504 11053005 11096478 11102311 11072046 11006818 10908197 10778465 10620322 10437575 10236501
59922A0236501k10836k11883k05923j94747j79389j60471j38540j14060q7534
$$ 10236501 10025665 9813782 9607859 9413112 9233723 9073252 8934712 8820652 8733118
59913H733118n9609l0983k403K5342N1796P6834R9869J19772J36438J51520J65940
$$ 8733118 8673509 8642526 8640123 8665465 8717261 8794095 8893964 9013736 9150174 9301694 9467634
59902I467634J77445J82663J81435J76751J70432J61439J49076J35114J21504
$$ 9467634 9645079 9827742 10009177 10185928 10356360 10517799 10666875 10801989 10923493
59893A0923493J08296R5279Q3706P4956O9382O7823P2098Q2436R6592J13567J35919
$$ 10923493 11031789 11127068 11210774 11285730 11355112 11422935 11495033 11577469 11674061 11787628 11923547
59882A1923547J65899K01241K37866K75268L15901L59987M04327M46349M86014
$$ 11923547 12089446 12290687 12528553 12803821 13119722 13479709 13884036 14330385 14816399
59873A4816399N22966N54321N76411N86888N84072N65442N27824M68812L88067
$$ 14816399 15339365 15893686 16470097 17056985 17641057 18206499 18734323 19203135 19591202
59864A9591202K88178J74218N1789p4228j98335l13093m11071m88239n44336n80411
$$ 19591202 19879380 20053598 20105387 20031159 19832824 19519731 19108660 18620421 18076085 17495674
59854A7495674n97727n98825n87444n66278n35915m96584m50240m00243l49417
$$ 17495674 16897947 16299122 15711678 15145400 14609485 14112901 13662661 13262418 12913001
59845A2913001k98720k47537j95177j42307r0758m1918M253M8259Q9708J27353
$$ 12913001 12614281 12366744 12171567 12029260 11938502 11896584 11900837 11949096 12038804 12166157
59835A2166157J59884J86227K05528K17181K20270K12871J92860J59827J15279
$$ 12166157 12326041 12512268 12717796 12934977 13155247 13368118 13560978 13720805 13836084
59826A3836084O0901j950p0701j41367k10652k76542l35960l84155m18281m40001
$$ 13836084 13896985 13895035 13824334 13682967 13472315 13195773 12859813 12475658 12057377 11617376
59816A1617376m52626m57091m52637m40083m22082m00854l77583l53250l28281
$$ 11617376 11164750 10707659 10255022 9814939 9392857 8992003 8614420 8261170 7932889
59807G932889l02114k74784k47978k22845j98122j72559j47932j27056j09815
$$ 7932889 7630775 7355991 7108013 6885168 6687046 6514487 6366555 6239499 6129684
59798F129684r4103q0065p0216o5275o2933o1204o0291o0335n9840n7518n3897
$$ 6129684 6035581 5955516 5885300 5820025 5757092 5695888 5635597 5575262 5515422 5457904 5404007
59787E404007m9960m5623m0436l4764k9549k5728k4070k4865k7706l2378l9272
$$ 5404007 5354047 5308424 5267988 5233224 5203675 5177947 5153877 5129012 5101306 5068928 5029656
59776E029656m7823n5415n9697o1383o2754o3881o2635n8213n2126m5461l7711
$$ 5029656 4981833 4926418 4866721 4805338 4742584 4678703 4616068 4557855 4505729 4460268 4422557
59765D422557k8952k0674j3378n300N153J7190K8842L9061M7710N4821O0879O6915
$$ 4422557 4393605 4372931 4359553 4354253 4359406 4376596 4405438 4444499 4492209 4547030 4607909 4674824
59753D674824P3367P9641Q5240R0491R5687J00237J03003J02819R8820R1165Q1328
$$ 4674824 4748191 4827832 4913072 5003563 5099250 5199487 5302490 5405309 5504129 5595294 5676622
59742E676622P0633N8870M5751L3256K4599K0747J9760J9857K1313K4974L0906
$$ 5676622 5747255 5806125 5851876 5885132 5909731 5930478 5950238 5970095 5991408 6016382 6047288
59731F047288L9236N0562O4562P9765R5690J13837J35434J59480J84202K09552
$$ 6047288 6086524 6137086 6201648 6281413 6377103 6490940 6626374 6785854 6970056 7179608
59721G179608K37079K67794L01063L35273L69082M02337M35894M69840N01509
$$ 7179608 7416687 7684481 7985544 8320817 8689899 9092236 9528130 9997970 10499479
59712A0499479N25351N34349N20942M77630L99532K88365J54240J3299j17159
$$ 10499479 11024830 11559179 12080121 12557751 12957283 13245648 13399888 13413187 13296028
59703A3296028k23793l00731l49426l74584l80079l68937l45408l14539k79563
$$ 13296028 13072235 12771504 12422078 12047494 11667415 11298478 10953070 10638531 10358968
59694A0358968k41473k01207j60497j20526q1685m4878j1108K0537N2480Q5531
$$ 10358968 10117495 9916288 9755791 9635265 9553580 9508702 9497594 9518131 9570611 9656142
59684I656142J17992J48636J78684K09867K42125K74464L06806L39758L73646
$$ 9656142 9774134 9922770 10101454 10311321 10553446 10827910 11134716 11474474 11848120
59675A1848120M08789M45892M85353N26931N70752O17571O67311P18400P69444
$$ 11848120 12256909 12702801 13188154 13715085 14285837 14903408 15570719 16289119 17058563
59666A7058563Q20805Q73547R27366R80090J028789J070723J103637J125668J135013
$$ 17058563 17879368 18752915 19680281 20660371 21689160 22759883 23863520 24989188 26124201
59657B6124201J130036J110277J077458J035223R88403R42757R04172Q76575Q60846
$$ 26124201 27254237 28364514 29441972 30477195 31465598 32408355 33312527 34189102 35049948
59648C5049948Q56506Q63373Q80078R02024R22907R37732R42362R31005Q96957
$$ 35049948 35906454 36769827 37649905 38551929 39474836 40412568 41354930 42285935 43182892
59639D3182892Q36443P50007O40612N12656L72740K28780Q7819m3492j56988k44965
$$ 43182892 44019335 44769342 45409954 45922610 46295350 46524130 46611949 46568457 46411469 46166504
59629D6166504l04597l37675l45520l27376k84425k21673j43862n2403N1805J65563
$$ 46166504 45861907 45524232 45178712 44851336 44566911 44345238 44201376 44148973 44200778 44366341
59619D4366341K85748M11965N43921O77986Q09109R34595J052886J159272J245275
$$ 44366341 44652089 45064054 45607975 46285961 47095070 48029665 49082551 50241823 51487098
59610E1487098J301949J321512J295929J216311J075041Q68879O01174K82608
$$ 51487098 52789047 54110559 55406488 56622799 57697840 58566719 59167893 59450501
59602E9450501p0030m36276p93750j119819j395572j610627j763363j856178j892509
$$ 59450501 59380471 58944195 58150445 57030626 55635054 54024427 52261064 50404886 48512377
59593D8512377j878951j826931j749079j654740j550880j446053j351139j276710
$$ 48512377 46633426 44806495 43057416 41402676 39851796 38405743 37054604 35777894
59585C5777894j230997j218740j238645j281231j330949j371970j393089j389516
$$ 35777894 34546897 33328157 32089512 30808281 29477332 28105362 26712273 25322757
59577B5322757j362341j316305j256616j187220j111555j033434r56041q80791
$$ 25322757 23960416 22644111 21387495 20200275 19088720 18055286 17099245 16218454
59569A6218454q08094p38594o73111o12300n56893n07283m62288m19723l78870
$$ 16218454 15410360 14671766 13998655 13386355 12829462 12322179 11859891 11440168 11061298
59560A1061298l40979l06785k75384k46456k21384k00574j81841j63474j47337
$$ 11061298 10720319 10413534 10138150 9891694 9670310 9469736 9287895 9124421 8977084
59551H977084j36516j31134j28828j28391j30494j35341j41871j49061j56114
$$ 8977084 8840568 8709434 8580606 8452215 8321721 8186380 8044509 7895448 7739334
59542G739334j61542j63929j63592j62059j59900j56369j50837j43370j34130
$$ 7739334 7577792 7413863 7250271 7088212 6928312 6771943 6621106 6477736 6343606
59533F343606j23426j12032j00277q7458p3305n9357m7447l7257k6888j5437l723
$$ 6343606 6220180 6108148 6007871 5920413 5847108 5787751 5740304 5703047 5676159 5660722 5656999
59522E656999P169J6688K4476L0698L6441M2672M8923N4069N7953O1193O3935
$$ 5656999 5664168 5680856 5705332 5736030 5772471 5815143 5864066 5918135 5976088 6037281 6101216
59511F101216O6062O8204P1286P5476Q0730Q7907R7981J10477J23906J37581J51850
$$ 6101216 6167278 6235482 6306768 6382244 6462974 6550881 6648862 6759339 6883245 7020826 7172676
59500G172676J66890J82432J98558K15759K34376K54616K76539K99347L21559
$$ 7172676 7339566 7521998 7720556 7936315 8170691 8425307 8701846 9001193 9322752
59491I322752L42884L64866L88382M11478M31255M47002M59753M69456M74463
$$ 9322752 9665636 10030502 10418884 10830362 11261617 11708619 12168372 12637828 13112291
59482A3112291M73340M65462M50373M28669M03321L77794L52550L25120K93970
$$ 13112291 13585631 14051093 14501466 14930135 15333456 15711250 16063800 16388920 16682890
59473A6682890K60494K26916J94263J63370J36148J14465R8607Q8024Q2859Q3703
$$ 16682890 16943384 17170300 17364563 17527933 17664081 17778546 17877153 17965177 18048036 18131739
59463A8131739R0061J00073J11756J23845J34843J41500J39024J23450R3727N0981
$$ 18131739 18221800 18321873 18433629 18557474 18692317 18833817 18972841 19096291 19190018 19240999
59453A9240999l698o9520j44166k23381l03126l80771m53513n17286n68746o07225
$$ 19240999 19237301 19167781 19023615 18800234 18497108 18116337 17662824 17145538 16576792 15969567
59443A5969567o33307o46542o46331o34139o12877n84444n49668n10338m69288
$$ 15969567 15336260 14689718 14043387 13409248 12796371 12211927 11662259 11151921 10682633
59434A0682633m28297l87532l47311l08798k72511k37709k03930j71958j42404
$$ 10682633 10254336 9866804 9519493 9210695 8938184 8700475 8496545 8324587 8182183
59425H182183j14392q6542n8595l1138m225K2628M9182P4360R7935J21629J47591
$$ 8182183 8067791 7981249 7922654 7891516 7887291 7909919 7959101 8033461 8131396 8253025 8400616
59414H400616J75854K04272K30974K55833K79156L00333L18788L34849L48081
$$ 8400616 8576470 8780742 9011716 9267549 9546705 9847038 10165826 10500675 10848756
59405A0848756L55804L55136L45683L28086L00631K60176K06467J42804P2261
$$ 10848756 11204560 11559696 11905379 12233465 12534096 12794272 13000739 13143543 13215804
59396A3215804l598q1594j55906k22069k79696l29696l71181m02805m24801m37630
$$ 13215804 13212206 13130612 12974706 12752637 12472941 12143245 11772064 11369259 10944458 10506828
59386A0506828m40766m34928m23519m09614l93111l72902l49990l26299l02277
$$ 10506828 10066062 9631134 9207615 8798001 8404890 8031988 7681998 7355699 7053422
59377G053422k78115k55535k35670k16741j96655j76497j58550j42265j25440
$$ 7053422 6775307 6519772 6284102 6067361 5870706 5694209 5535659 5393394 5267954
59368E267954j08425r3641q1299o8923n5289m1975l0610k0873j1601k039Q051
$$ 5267954 5159529 5065888 4984589 4915666 4860377 4818402 4787792 4766919 4755318 4753279 4761330
59357D761330J7958K6066L1871L7132M3485N0344N7211O6001P7592Q7572Q9766
$$ 4761330 4779288 4805354 4837225 4874357 4917842 4968186 5025397 5091398 5168990 5256562 5346328
59346E346328Q4099P7223P5103P8481Q5928R7178J11904J28487J46078J65484
$$ 5346328 5430427 5507650 5582753 5661234 5747162 5844340 5956244 6084731 6230809 6396293
59336F396293J86367K05611K20214K30538K39883K52293K71195K97938L30642
$$ 6396293 6582660 6788271 7008485 7239023 7478906 7731199 8002394 8300332 8630974
59327H630974L66092M03476M44463M89265N35330N81057O28139O78170P28811
$$ 8630974 8997066 9400542 9845005 10334270 10869600 11450657 12078796 12756966 13485777
59318A3485777P75542Q15875Q49454Q74526Q86628Q81455Q58115Q19339P69109
$$ 13485777 14261319 15077194 15926648 16801174 17687802 18569257 19427372 20246711 21015820
59309B1015820P10454O45246N75554N04316M34457L67851L05479K47488J92282
$$ 21015820 21726274 22371520 22947074 23451390 23885847 24253698 24559177 24806665 24998947
59300B4998947J36718P8525J7841m4696j10089j79451k51177l21549l87454m46718
$$ 24998947 25135665 25214190 25232031 25187335 25077246 24897795 24646618 24325069 23937615 23490897
59290B3490897m96680n34988n61790n79275n89430n94214n97167o02023o09573
$$ 23490897 22994217 22459229 21897439 21318164 20728734 20134520 19537353 18935330 18325757
59281A8325757o17995o26221o34490o41797o45511o43981o37184o24598o05133
$$ 18325757 17707762 17081541 16447051 15805254 15159743 14515762 13878578 13253980 12648847
59272A2648847n79657n50986n20641m88033m53558m19752l88135l57248l25330
$$ 12648847 12069190 11518204 10997563 10509530 10055972 9636220 9248085 8890837 8565507
59263H565507k93042k62205k33455k06394j80753j56406j33371j12295r3609p5995
$$ 8565507 8272465 8010260 7776805 7570411 7389658 7233252 7099881 6987586 6893977 6817982
59253F817982n7529l8545k1388o842O914K1159L4832M6987N8773P1612Q5258R8938
$$ 6817982 6760453 6721908 6700520 6693678 6700592 6721751 6756583 6803570 6862343 6933955 7019213 7118151
59241G118151J12701J26429J39070J50095J60260J69978J78459J85339J91315
$$ 7118151 7230852 7357281 7496351 7646446 7806706 7976684 8155143 8340482 8531797
59232H531797J96246J98416J96876J92721J86750J77878J65470J51542J38830
$$ 8531797 8728043 8926459 9123335 9316056 9502806 9680684 9846154 9997696 10136526
59223A0136526J27869J17739J08582J01687R7771R6580R7645J00301J03551J06682
$$ 10136526 10264395 10382134 10490716 10592403 10690174 10786754 10884399 10984700 11088251 11194933
59213A1194933J09261J09985J06809R8989Q7799P4270N7354L5208P149k6407o4331
$$ 11194933 11304194 11414179 11520988 11619977 11707776 11782046 11839400 11874608 11881757 11855350 11791019
59202A1791019j03689j39514j67299j85443j94509j95247j88566j76424j61097
$$ 11791019 11687330 11547816 11380517 11195074 11000565 10805318 10616752 10440328 10279231
59193A0279231j43524j23315j00191p4917m9031k3967j44K3154M6487O8999Q9275
$$ 10279231 10135707 10012392 9912201 9837284 9788253 9764286 9764142 9787296 9833783 9902782 9992057
59182I992057J07154J23509J38307J50374J59247J65894J71373J76074J80488
$$ 9992057 10099211 10222720 10361027 10511401 10670648 10836542 11007915 11183989 11364477
59173A1364477J85386J91087J97998K07966K23315K44096K67872K92666L18503
$$ 11364477 11549863 11740950 11938948 12146914 12370229 12614325 12882197 13174863 13493366
59164A3493366L45557L72325L96161M14024M22179M16696L95148L56865L01492
$$ 13493366 13838923 14211248 14607409 15021433 15443612 15860308 16255456 16612321 16913813
59155A6913813K28798J40217L9133p0458j84191k96567m01925m96358n76984o39988
$$ 16913813 17142611 17282828 17321961 17251503 17067312 16770745 16368820 15872462 15295478 14655490
59145A4655490o82062p03931p09777p02846o84195o55914o22101n85534n46211
$$ 14655490 13973428 13269497 12559720 11856874 11172679 10516765 9894664 9309130 8762919
59136H762919n04487m62934m23664l86357l50412l16798k86384k58710k33674
$$ 8762919 8258432 7795498 7371834 6985477 6635065 6318267 6031883 5773173 5539499
59127E539499k12117j93661j76411j59964j45930j34300j22471j09441r7671q8702
$$ 5539499 5327382 5133721 4957310 4797346 4651416 4517116 4394645 4285204 4187533 4098831
59117D098831q0290p0513o1507n5756n1351m4659l5850k8160k2846j8157j2384
$$ 4098831 4018541 3948028 3886521 3830765 3779414 3734755 3698905 3670745 3647899 3629742 3617358
59106C617358n144L525J2658J9920K4185K7816L3950M2450N0775N7787O4292P0749
$$ 3617358 3612214 3615739 3628397 3648317 3672502 3700318 3734268 3776718 3827493 3885280 3949572 4020321
59094D020321P7002Q3549R0709R7223J02030J06655J13418J21890J29645J36141
$$ 4020321 4097323 4180872 4271581 4368804 4470834 4577489 4690907 4812797 4942442 5078583
59084E078583J43378J52639J62779J71832J78611J82829J85156J86987J88812
$$ 5078583 5221961 5374600 5537379 5709211 5887822 6070651 6255807 6442794 6631606
59075F631606J89180J86468J81055J74253J65987J55171J41725J26671J10918
$$ 6631606 6820786 7007254 7188309 7362562 7528549 7683720 7825445 7952116 8063034
59066H063034R5389Q1632P0757O2462N6437N3753N5441O0828O8892P9977R4430
$$ 8063034 8158423 8240055 8310812 8373274 8429711 8483464 8538905 8599733 8668625 8748602 8843032
59055H843032J10844J27788J46029J66705J88444K08776K27410K45248K60615
$$ 8843032 8953876 9081664 9227693 9394398 9582842 9791618 10019028 10264276 10524891
59046A0524891K69460K69257K60001K41297K11298J69449J18189O0984N20o0335
$$ 10524891 10794351 11063608 11323609 11564906 11776204 11945653 12063842 12124826 12125346 12065011
59036A2065011j17431j66602k05486k33630k51481k59826k59723k52643k40614
$$ 12065011 11947580 11780978 11575492 11341862 11090381 10830555 10570832 10318189 10077575
59027A0077575k25936k10407j95123j80997j68712j58127j49039j42929j42443
$$ 10077575 9851639 9641232 9446109 9265112 9096400 8938273 8789234 8646305 8503862
59018H503862j48304j58129j69188j80792j92892k04096k12925k19821k26111
$$ 8503862 8355558 8197429 8028241 7847449 7654557 7450461 7237536 7017715 6791604
59009F791604k31696k35277k36109k34269k30002k23953k17176k09858k01103
$$ 6791604 6559908 6324631 6088522 5854253 5624251 5400298 5183122 4973264 4772161
59000D772161j90864j80644j71256j61536j50684j40094j31235j23380j15310
$$ 4772161 4581297 4400653 4229397 4067861 3917177 3777083 3645848 3522468 3407158
58991C407158j07664j01534r6250r0646q5248q1008p7107p2235o6857o2046n7287
$$ 3407158 3299494 3197960 3101710 3011064 2925816 2844808 2767701 2695466 2628609 2566563 2509276
58980B509276n1748m6528m3015m0021l5310k9327k4672k2163j9935j6487j2379
$$ 2509276 2457528 2411000 2367985 2327964 2292654 2263327 2238655 2216492 2196557 2180070 2167691
58969B167691q779o228m812m018k587Q0K823M236M555M560L765J602n51o95R21
$$ 2167691 2158912 2152684 2147872 2143854 2141267 2141347 2144170 2148406 2152961 2157521 2161286 2162888 2162337 2161642 2162563
58954B162563K209K137J597J763L091N427P769Q720Q352Q570J0381J2202J2418
$$ 2162563 2164772 2166909 2168506 2170269 2173360 2178787 2186556 2195276 2203628 2212198 2222579 2234781 2247199
58941B247199J1933J2289J2877J2258J0944J0498J0950J1305J1504J1821J1658
$$ 2247199 2259132 2271421 2284298 2296556 2307500 2317998 2328948 2340253 2351757 2363578 2375236
58930B375236J1040J1878J5301J9248K1184K1728K2910K4481K5061K5553K7823
$$ 2375236 2386276 2398154 2413455 2432703 2453887 2475615 2498525 2523006 2548067 2573620 2601443
58919B601443L0883L1927L0698K9737L0618L2910L6244M0418M3814M4837M4686
$$ 2601443 2632326 2664253 2694951 2724688 2755306 2788216 2824460 2864878 2908692 2953529 2998215
58908B998215M5972M9007N2205N5450N9865O4735O7986O9627P1624P4564P7411
$$ 2998215 3044187 3093194 3145399 3200849 3260714 3325449 3393435 3463062 3534686 3609250 3686661
58897C686661Q0283Q4194Q8306R0829R2681R6850J03867J11277J17947J25493
$$ 3686661 3766944 3851138 3939444 4030273 4122954 4219804 4323671 4434948 4552895 4678388
58887D678388J34785J44331J53211J62633J73512J85069J96755K09270K22866
$$ 4678388 4813173 4957504 5110715 5273348 5446860 5631929 5828684 6037954 6260820
58878F260820K36979K52140K70033K90932L13179L35689L59035L83735M09574
$$ 6260820 6497799 6749939 7019972 7310904 7624083 7959772 8318807 8702542 9112116
58869I112116M37088M67686N01869N38960N78659O21175O66155P13229P63000
$$ 9112116 9549204 10016890 10518759 11057719 11636378 12257553 12923708 13636937 14399937
58860A4399937Q15386Q67800R17567R65254J012636J057848J095582J121720J134377
$$ 14399937 15215323 16083123 17000690 17965944 18978580 20036428 21132010 22253730 23388107
58851B3388107J130507J105013J053809R74903Q66322P26333N56803L64086J56377
$$ 23388107 24518614 25623627 26677436 27652339 28518661 29244994 29801797 30165883 30322260
58842C0322260n7591k67760m64225o40427p92695r17101j010099j072448j109151
$$ 30322260 30264669 29996909 29532684 28892257 28099562 27182461 26172362 25099914 23990763
58833B3990763j124829j121682j102019j069479j027122r77163r22917q68014
$$ 23990763 22865934 21744252 20642233 19572754 18545632 17568469 16645552 15777538
58825A5777538q13389p58091p03227o51811o04487n59045n14882m74302m38549
$$ 15777538 14964149 14206058 13502831 12851020 12246533 11687488 11172606 10698304 10259755
58816A0259755m05994l75545l48448l25252l03934k82669k62053k43243k26039
$$ 10259755 9853761 9478216 9129768 8804516 8500582 8217913 7955860 7712617 7486578
58807G486578k09726j93819j77542j60676j44962j32159j20798j07824r3300q0278
$$ 7486578 7276852 7083033 6905491 6744815 6599853 6467694 6346896 6239072 6145772 6065494
58797F065494o9971o0504n0691m1237l1743k0373p426M383J4254K4458L6368M8780
$$ 6065494 5995523 5935019 5884328 5843091 5811348 5790975 5783549 5787932 5802186 5826644 5863012 5911792
58785E911792O1017P4049Q7561R9708J10852J23801J39124J54040J67310J81366
$$ 5911792 5972809 6046858 6134419 6234127 6344979 6468780 6607904 6761944 6929254 7110620
58775G110620J97963K15547K32784K50975K70995K91325L11265L32928L57843
$$ 7110620 7308583 7524130 7756914 8007889 8278884 8570209 8881474 9214402 9572245
58766I572245L84557M11579M39885M70713N03748N39262N79149O23894O71056
$$ 9572245 9956802 10368381 10808266 11278979 11782727 12321989 12901138 13525032 14196088
58757A4196088P18438P66461Q16014Q66391R16242R63813J005601J037627J058274
$$ 14196088 14914526 15680987 16497001 17363392 18279634 19243447 20249048 21286675 22344949
58748B2344949J066440J056843J021732R57905Q67353P50286O03470M27801K32221
$$ 22344949 23411389 24468232 25489964 26447869 27315222 28065508 28668978 29096779 29329000
58739B9329000K7314j80113l83236n71546p35583q72011r80603j060063j110490
$$ 29329000 29356314 29176201 28792965 28221419 27485836 26613825 25633222 24573159 23462669
58730B3462669j136318j142634j131298j103841j064971j019460r68542r12874
$$ 23462669 22326351 21183717 20052419 18948578 17883607 16864147 15895605 14982731
58722A4982731q56120q01846p49601o97750o47672o01551n58612n17257m78727
$$ 14982731 14126611 13324765 12575164 11877414 11229742 10628191 10069579 9552322 9073595
58713I073595m45036m15370l87934l63188l41908l22177l01829k81948k64533
$$ 9073595 8628559 8213189 7825255 7462067 7120159 6797982 6496153 6214205 5949672
58704E949672k48710k32568k16833k03181j90659j77257j63509j51207j39961
$$ 5949672 5700962 5468394 5251561 5048380 4857721 4680464 4516955 4365748 4225787
58695D225787j28267j16714j07002r8924r1016q3093p5731o8580o1569n6194n3217
$$ 4225787 4097520 3980806 3873804 3774880 3683864 3600771 3525040 3456460 3394891 3338697 3285480
58684C285480n0804m7211m3538m1440m0152l8277l6536l6022l5661l4165l2788
$$ 3285480 3234676 3187465 3143927 3102487 3062335 3024058 2987522 2951500 2915839 2881674 2848886
58673B848886l3343l4978l5572l4915l4189l3729l3497l4106l5443l6129l6098
$$ 2848886 2815543 2780565 2744993 2710078 2675889 2642160 2608663 2574557 2539114 2502985 2466887
58662B466887l7446m0784m3394m3311m2562m3659m5534m5863m5045m4753m4565
$$ 2466887 2429441 2388657 2345263 2301952 2259390 2215731 2170197 2124334 2079289 2034536 1989971
58651A989971m3188m1216l9831l8417l6003l3461l1913l0764k9398k8706k8906
$$ 1989971 1946783 1905567 1865736 1827319 1791316 1757855 1725942 1695178 1665780 1637074 1608168
58640A608168k8124k5413k2734k1685k0895j8993j7494j8093j9630k0245k0025
$$ 1608168 1580044 1554631 1531897 1510212 1489317 1470324 1452830 1434737 1415107 1394862 1374837
58629A374837j9250j6863j3083j0563j0366r863p048l658j482P59L835N174L038
$$ 1374837 1355587 1338724 1325641 1315078 1304712 1294849 1287801 1284143 1282661 1283420 1287255 1292429 1295467
58616A295467M8r75j153k153k464r46m02l182o564o863n103m247l871j962P24
$$ 1295467 1295515 1294540 1293387 1291234 1288770 1287824 1287422 1284240 1277676 1270813 1265710 1261463 1257592 1255630 1256354
58601A256354K402L729N594O428N510N548Q086R965Q646P175R091J2483J4289
$$ 1256354 1258756 1262485 1268079 1274507 1280017 1285565 1293651 1303616 1312262 1319437 1328528 1341011 1355300
58588A355300J6461K2025K8638L2241L3944L7142M0863M2348M3230M6646N0923
$$ 1355300 1371761 1393786 1422424 1454665 1488609 1525751 1566614 1608962 1652192 1698838 1749761
58577A749761N2827N4369N9356O5726O8866P0566P6747Q7464R7040J03589J10889
$$ 1749761 1802588 1856957 1916313 1982039 2050905 2121471 2198218 2285682 2382722 2486311 2597200
58566B597200J20774J31086J41608J55099J71448J86977K00647K15382K32529
$$ 2597200 2717974 2849060 2990668 3145767 3317215 3504192 3704839 3920221 4152750
58557D152750K50220K67678K85948L03814L17882L26979L31770L30054L17077
$$ 4152750 4402970 4670648 4956596 5260410 5578292 5905271 6237041 6567095 6884172
58548F884172K90548K51058J98565J33505O0908j1781q0700j45094k02062k47093
$$ 6884172 7174720 7425778 7624343 7757848 7818756 7806975 7726275 7581181 7379119 7132026
58538G132026k79132l00177l10815l11123l04475k94965k82247k64445k44375
$$ 7132026 6852894 6552717 6241902 5930779 5626304 5331339 5049092 4784647 4540272
58529D540272k26741k10858j92868j73868j58527j46539j32965j16879j02266
$$ 4540272 4313531 4102673 3909805 3735937 3577410 3430871 3297906 3181027 3078761
58520C078761r0313p8183o5885n6970n1625m6141m0106l7146l7594l7587l6409
$$ 3078761 2988448 2910265 2844380 2787410 2735785 2689644 2649538 2612392 2574798 2537211 2500802
58509B500802l7504m0805m1511l8472l6559l8287l9909l8622l7249l8645m1247
$$ 2500802 2463298 2422493 2380982 2342510 2305951 2267664 2227755 2189133 2151884 2113239 2071992
58498B071992m3137m5316m8053m8948m7304m5846m5855m4931m1682l8265l6478
$$ 2071992 2028855 1983539 1935486 1886538 1839234 1793388 1747533 1702602 1660920 1622655 1586177
58487A586177l5302l3719l2018k9491k5038k0514j8977j9431j8315j5946j5817
$$ 1586177 1550875 1517156 1485138 1455647 1430609 1410095 1391118 1371687 1353372 1337426 1321609
58476A321609j7598j7198j4212j2585j2973j1417p115m492n469o273m447k792
$$ 1321609 1304011 1286813 1272601 1260016 1247043 1235626 1228511 1224019 1218550 1212277 1207830 1205038
58464A205038l640m917m579l694k863p99J577J029k113l422j646p54k806m707
$$ 1205038 1201398 1196481 1191902 1188208 1185345 1184546 1186123 1187152 1185039 1181617 1179971 1179217 1176411 1171704
58450A171704m386m474p096j0337j2401j4268j5969j5325j2563j1008j1242r776
$$ 1171704 1167318 1162844 1155748 1145411 1133010 1118742 1102773 1087448 1074885 1063877 1052635 1042859
58438A042859n610k610l188m868n407o084p657q063o555n407n611n373m225l875
$$ 1042859 1037249 1034639 1031451 1026583 1021176 1015092 1007435 999372 992817 987410 981799 976426 972201 968326
58424I68326m014k412P6J49j767k016p28j724m709m899j503P37l0m53M34p23l831
$$ 968326 964312 961900 961976 962125 960358 958342 957614 955890 951181 946282 944779 945516 945486 945033 945467 944744 940913
58407I40913l956l00J544p07k142J75K243J190M47K603M509L943M144P285J0150
$$ 940913 936957 936657 938201 937494 935352 935527 937770 938960 939407 942010 946519 950462 954606 961891 972041
58392I72041J0484J1000J3041J3091R700P035P281O421J899k553m198o397j1475
$$ 972041 982525 993525 1006566 1019657 1029357 1036392 1043673 1050094 1051993 1049440 1045242 1038845 1027370
58379A027370j5287j4204j1328j0706j1092j0208r402r600q407n391m427o899
$$ 1027370 1012083 997879 986551 975845 964753 954545 945143 935543 927136 921745 917318 910419
58367I10419q736p777p370q869p982k899J323J271P65L131N252M568M593P892
$$ 910419 901683 893906 886536 877667 869685 866786 868109 869380 870145 873276 878528 883096 887689 895581
58353H95581J0611R669Q604J0549J2173J0345Q318R504J1490J1651J2203J4483
$$ 895581 906192 915861 924465 935014 947187 957532 965850 975354 986844 998495 1010698 1025181
58341A025181J4979J2369J1371J4230J5848J3031J0920J3875J7580J6921J4383
$$ 1025181 1040160 1052529 1063900 1078130 1093978 1107009 1117929 1131804 1149384 1166305 1180688
58330A180688J3749J2540P927L425K652K739M98j317l68m32m141p058n710m368
$$ 1180688 1194437 1206977 1214904 1218329 1220981 1223720 1224218 1222901 1222533 1222101 1217960 1210902 1205192 1200824
58316A200824o912r207o909l698m067m879j835K268L377L805O559Q547O811N088
$$ 1200824 1193912 1184705 1177796 1174098 1170031 1165152 1163317 1165585 1168962 1172767 1179326 1187873 1194684 1199772
58302A199772O940Q938P666O533Q599R900P252N165P523R954Q103N780P146Q616
$$ 1199772 1206712 1215650 1223316 1229849 1238448 1248348 1255600 1260765 1268288 1278242 1286345 1292125 1299271 1307887
58288A307887O396M023M604M049N9j104M507J0005R192P269J0472J4324J2733
$$ 1307887 1314283 1318306 1322910 1326959 1327018 1325914 1330421 1340426 1349618 1356887 1367359 1381683 1394416
58275A394416R717J1188J3548J1493Q841J0606J2595J0008P977J2182J7336J6741
$$ 1394416 1404133 1415321 1428869 1440362 1449203 1459809 1472404 1482412 1490389 1502571 1519907 1536648
58263A536648J4896J8602K3714K3106J9924K0589K2317J9938J7294J9580K2155
$$ 1536648 1551544 1570146 1593860 1616966 1636890 1657479 1679796 1699734 1717028 1736608 1758763
58252A758763J9367J6387J9785K4646K3783K1343K4149K8161K6955K4959K8521
$$ 1758763 1778130 1794517 1814302 1838948 1862731 1884074 1908223 1936384 1963339 1988298 2016819
58241B016819L2578L0206K6492K8704L1929K9204K6387L1463L8558L8488L5829
$$ 2016819 2049397 2079603 2106095 2134799 2166728 2195932 2222319 2253782 2292340 2330828 2366657
58230B366657L9171M3968M2084L8774M2614M7996M5926M2769M9228N9553O1288
$$ 2366657 2405828 2449796 2491880 2530654 2573268 2621264 2667190 2709959 2759187 2818740 2880028
58219B880028N7380N8964O4445O5523O5926P3794Q3285Q4064Q1281Q5949R3675
$$ 2880028 2937408 2996372 3060817 3126340 3192266 3266060 3349345 3433409 3514690 3600639 3694314
58208C694314R3752R0760R5658J03918J04497J01873J06789J14148J13384J11625
$$ 3694314 3788066 3878826 3974484 4078402 4182899 4284772 4391561 4505709 4619093 4730718
58198D730718J22194J39013J47407J51388J64432J82118J90981J96082K11912
$$ 4730718 4852912 4991925 5139332 5290720 5455152 5637270 5828251 6024333 6236245
58189F236245K33814K46587K53959K70992K94662L10784L22489L42747L66840
$$ 6236245 6470059 6716646 6970605 7241597 7536259 7847043 8169532 8512279 8879119
58180H879119L82175L96609M25961M62486M87885N08231N42779N87985O26954
$$ 8879119 9261294 9657903 10083864 10546350 11034235 11542466 12085245 12673230 13300184
58171A3300184O63887P13164P65712Q04420Q41423R00014R71510J031911J088159
$$ 13300184 13964071 14677235 15442947 16247367 17088790 17988804 18960314 19992225 21080384
58162B1080384J162801J246278J313358J374602J460541J567160J670409J781354
$$ 21080384 22243185 23489463 24802821 26177423 27637964 29205124 30875533 32656887
58154C2656887J928878K100143K259708K416242K606582K827394L052084L301724
$$ 32656887 34585765 36685908 38945616 41361858 43968440 46795834 49847918 53149642
58146E3149642L623539M011872M431564M907126N502077O223462P040240P979083
$$ 53149642 56773181 60785053 65216617 70123743 75625820 81849282 88889522 96868605
58138I6868605R097695J0383848J1798526J3390411J5221906J7205649J9188310
$$ 96868605 105966300 116350148 128148674 141539085 156760991 173966640 193154950
58131A93154950K1194949K3440115K6179670K9767767L4573498M0043888M3564052
$$ 193154950 214349899 237790014 263969684 293737451 328310949 368354837 411918889
58124D11918889M1108044L0192104J2505789o777096k2503813l2379979l6929174
$$ 411918889 453026933 483219037 495724826 488947730 466443917 434063938 397134764
58117C97134764l7748732l6284026l3638830l0608732k7588655k4661454k1867499
$$ 397134764 359386032 323102006 289463176 258854444 231265789 206604335 184736836
58110A84736836j9293895j6962588j4820376j2859140j1127500r624938q289627
$$ 184736836 165442941 148480353 133659977 120800837 109673337 100048399 91758772
58103I1758772p089318o034252n105065m249794l451360k731423k092205j510054
$$ 91758772 84669454 78635202 73530137 69280343 65828983 63097560 61005355 59495301
58095E9495301r73313m69217O0902P04517J500609K361867L018515L051580K128302
$$ 59495301 58521988 58052771 58113673 58818190 60318799 62680666 65699181 68750761 70879063
58086G0879063L34180j765915l499406m529980m926105m903328m629237m231741
$$ 70879063 71213243 69447328 65947922 61417942 56491837 51588509 46959272 42727531
58078D2727531l825216l460897l120592k792034k499605k251819k021162j794507
$$ 42727531 38902315 35441418 32320826 29528792 27029187 24777368 22756206 20961699
58070B0961699j591918j421060j261565j107951r82403q91747q13486p36035o73110
$$ 20961699 19369781 17948721 16687156 15579205 14596802 13705055 12891569 12155534 11482424
58061A1482424o28187n83309n33280m94259m69052m39231m00466l70979l56150
$$ 11482424 10854237 10270928 9737648 9243389 8774337 8335106 7934640 7563661 7207511
58052G207511l38374l10803k88468k77144k63078k42737k31564k33682k32528
$$ 7207511 6869137 6558334 6269866 5992722 5729644 5486907 5255343 5021661 4789133
58043D789133k21106k12704k12385k06149j88349j72612j65414j54977j36486
$$ 4789133 4568027 4355323 4142938 3936789 3748440 3575828 3410414 3255437 3118951
58034C118951j22903j20114j15727j03103r3350r2785r0717q0427p1362p0115
$$ 3118951 2996048 2875934 2760207 2657104 2563754 2470969 2380252 2299825 2228463 2158348
58024B158348o8930o2830n9207o1403o1027n4902n1639n3916n2427m4656m1003
$$ 2158348 2089418 2026588 1967381 1905978 1844951 1790049 1738410 1684494 1632067 1587411 1546408
58013A546408m4923m5544l7758l1305l1929l1624k5845k2603k5727k6334j9779
$$ 1546408 1501485 1455941 1418183 1386878 1354949 1323325 1297480 1274877 1249150 1222816 1203037
58002A203037j4680j6384j7486j3398j1493j5867j8377j4013j0604j4161j8450
$$ 1203037 1188357 1171973 1154487 1141089 1129596 1113729 1095352 1081339 1070735 1056574 1038124
57991A038124j7766j6605j8221j6853r837m758o311q252n918m512p514r187o039
$$ 1038124 1020358 1003753 985532 968679 958842 954084 947773 939521 933603 929091 921577 912390 906351
57978I06351l789n753o151j949N91j939l363j79J511j753l709o55J083k570n553
$$ 906351 902562 896809 890658 888709 889300 887361 883998 883819 885330 883577 879868 879213 880296 877726 872173
57963H72173l585k440o350r575p607o049j0022j4767j4936j3485j3797j2508p717
$$ 872173 868588 866148 859798 850223 842616 836567 826545 811778 796842 783357 769560 757052 749335
57950G49335m825o807q058m971l100o576r975q234n360n716n770k132R92k3j115
$$ 749335 744510 737703 729645 724674 721574 714998 705023 696789 691429 685713 679943 677811 678803 678780 677665
57935F77665J105K468j43j901Q46L014q7m161l985k048j827m69M230P294M857
$$ 677665 678770 681238 681095 679194 680040 683054 682967 678806 674821 672773 670946 670477 674707 682001 686858
57920F86858J663K696M445K113j410j394K80k05j534j608k769o390q546p129o582
$$ 686858 688521 691217 695662 697775 696365 694971 695251 695046 693512 691904 689135 682745 674199 667070 660488
57905F60488r671j1803r686q107j1227j4651j3370j0465j0426j0735p861n060
$$ 660488 650817 639014 629328 621221 609994 595343 581973 571508 561082 550347 542486 537426
57893E37426o301q490p374n417o249p026l922J87R20J34J312K472P68r48P75L263
$$ 537426 531125 522635 515261 509844 503595 496569 492647 492834 493754 493888 495200 497672 498440 497492 498267 501530
57877E01530K859J659K469K430j315m945m117j767k625m918m825m255o643r489
$$ 501530 504389 506048 508517 510947 509632 504687 500570 498803 496178 491260 486435 482180 475537 466048
57863D66048q582n611m447l849q47K544K924K001K920M132L276K950N922Q958
$$ 466048 457466 451855 447408 443559 442712 445256 448180 450181 453101 457233 460509 463459 469381 478339
57849D78339Q155O192P311R431Q380N865N851O834N155K500K581L702J965j214
$$ 478339 486494 492686 499997 509428 517808 523673 529524 536358 541513 544013 546594 550296 552261 551047
57835E51047k061j898m314p739q166o747p476r510r004o646o434q513r606r074
$$ 551047 548986 547088 542774 535035 526869 520122 512646 503136 494132 487486 481052 472539 462933 453859
57821D53859q672q010n904m254n180o405m772j873r10q03J073L303L301K811M683
$$ 453859 445187 437177 431273 427019 421839 415434 410662 408789 407879 407076 408149 411452 414753 417564 422247
57806D22247P076O808N588O873R419J0038R784J1181J2229R652N430L568L195
$$ 422247 429323 436131 441719 448592 458011 468049 477833 489014 501243 510895 516325 519893 523088
57793E23088J238q80k52O84k415p751j0103r575j0309j2185j1439q477p692r951
$$ 523088 524326 523446 523194 523878 521463 513712 503609 494034 483725 471540 460101 451624 443932 433981
57779D33981j1778j1701j1317j0725q753o948p708r409q738o570o132p108p159
$$ 433981 422203 410502 399185 388460 379707 372759 365051 355642 346904 340334 334202 327094 319935
57766C19935p238r377j1226r281n728n468q024r017q101q467r842r169p187p328
$$ 319935 312697 303320 292094 282813 277085 271617 263593 254576 246475 238008 228166 218997 211810 204482
57752B04482q848p972n071l775l802j801J320J386j044j100J850L478K540K388
$$ 204482 195634 187662 182591 178816 175014 173213 174533 175919 174875 173775 175625 179103 181643 184031
57738A84031L857L930K459L069O168P862P119P391R595J0171P837N910O005N423
$$ 184031 187888 191818 194277 197346 203514 211376 218495 225886 235481 245652 253489 259399 265404 270827
57724B70827K856Q91P84K67j444j790j68K40j924l775l563l657n777p675p139
$$ 270827 273683 274574 275358 275625 274181 272391 272223 272463 270539 266764 263201 259544 253767 246092 238953
57709B38953n456m672m634m468l925k259J149M474N195M319N166P996R952J0193
$$ 238953 233497 228825 224191 219723 215798 213539 214688 219162 224357 228676 233842 241838 251790 261983
57695B61983J0432J0392P760L172J29o41j736l394k697N80K680K025J570L307
$$ 261983 272415 282807 290567 293739 293868 293227 291491 288097 285400 285980 288660 290685 292255 295562
57681B95562N221N542N474N922N725M850N152O539O545N122N533Q933J2273J3124
$$ 295562 300783 306325 311799 317721 323446 328296 333448 339987 346532 351654 357187 366120 378393 391517
57667C91517J2566J1906J0818J0062J1762J5450J7862J8016J8312J9585J9757
$$ 391517 404083 415989 426807 436869 448631 464081 481943 499959 518271 537856 557613
57656E57613J8798J9953K4005K7151K7037K6438K8438L1970L4728L6768L8747
$$ 557613 576411 596364 620369 647520 674557 700995 729433 761403 796131 832899 871646
57645H71646M0142M1383M4478M9424N3514N5888N9212O5039P1238P6141Q1391
$$ 871646 911788 953171 997649 1047073 1100587 1156475 1215687 1280726 1351964 1428105 1509496
57634A509496Q8567R6587J04664J14409J26772J40163J53526J67948J83459J97848
$$ 1509496 1598063 1694650 1799314 1913723 2040495 2180658 2334184 2502132 2685591 2883439
57624B883439K10665K24737K41474K58111K71565K81492K87394K86419K76414
$$ 2883439 3094104 3318841 3560315 3818426 4089991 4371483 4658877 4945296 5221710
57615E221710K57855K30659J92918J45555R4886M7813P255k5932n0651o8618q6536
$$ 5221710 5479565 5710224 5903142 6048697 6143583 6191396 6198651 6172719 6122068 6053450 5966914
57604E966914j11435j45112j84480k24273k57477k76984k80585k72716k59230
$$ 5966914 5855479 5710367 5525887 5301614 5044137 4767153 4486568 4213852 3954622
57595C954622k42558k23335k03219j83444j63315j42640j23197j05948q9714p4431
$$ 3954622 3712064 3488729 3285510 3102066 2938751 2796111 2672914 2566966 2477252 2402821
57585B402821o2297n3479m4314l2586k1057j2628n388L845J4119K2562K9582L7773
$$ 2402821 2340524 2287045 2242731 2210145 2189088 2176460 2171072 2174917 2189036 2211598 2241180 2278953
57573B278953M7352N6682O6070P7261R0030J02492J14360J27006J40626J53832
$$ 2278953 2326305 2382987 2449057 2526318 2616348 2718840 2833200 2960206 3100832 3254664
57563C254664J65786J76869J87378J96898K04421K08123K05939J97073J81682
$$ 3254664 3420450 3597319 3784697 3981595 4186016 4394139 4600078 4797151 4978833
57554D978833J58677J25779Q2754L2783k0055p2521j20864j60893j91085k13366
$$ 4978833 5137510 5263289 5346043 5378826 5358771 5286250 5165386 5004493 4813408 4600042
57544D600042k29419k38451k39919k35735k28171k17952k05833j93457j81200
$$ 4600042 4370623 4132172 3892253 3656518 3428347 3210395 3004562 2811105 2629905
57535B629905j67851j53968j42453j33962j25005j12999j00328r0652q3851p7439
$$ 2629905 2462054 2308086 2165633 2031671 1906666 1793667 1693339 1602687 1518836 1441397
57525A441397p0753o4727n9246n3586m8194m3852m0254l7006l4601l2957l0799
$$ 1441397 1370644 1305917 1246671 1193085 1144891 1101039 1060785 1023779 989178 956221 925422
57514I25422k7793k5218k3299k0395j6124j2614j1039r789p776o478o722o538
$$ 925422 897629 872411 849112 828717 812593 799979 788940 779151 771375 764897 758175 751637
57502G51637m522k270j031R01M786Q499J0064J1141J3782J6486J7101J7126J9411
$$ 751637 747115 744845 743814 744715 749501 758000 768064 779205 792987 809473 826574 843700 863111
57489H63111K3452K6713K8944L1756L5299L8594M1950M6158N0554N4546N9376
$$ 863111 886563 913276 942220 973976 1009275 1047869 1089819 1135977 1186531 1241077 1300453
57478A300453O5785P1739P5493P9054Q5471R4297J02940J10923J19539J28651
$$ 1300453 1366238 1437977 1513470 1592524 1677995 1772292 1875232 1986155 2105694 2234345
57468B234345J37086J45066J53097J59591J62620J62810J61346J56144J43271
$$ 2234345 2371431 2516497 2669594 2829185 2991805 3154615 3315961 3472105 3615376
57459C615376J21437R2374N7799J9172k0360n6978q8935j15953j36818j50163
$$ 3615376 3736813 3829187 3886986 3906158 3885798 3828820 3739885 3623932 3487114 3336951
57449C336951j56896j59329j58513j54684j49129j43060j35791j26571j17058
$$ 3336951 3180055 3020726 2862213 2707529 2558400 2415340 2279549 2152978 2035920
57440B035920j09167j01728r2317q1380p1465o3135n4810m6148l8492l2272k6700
$$ 2035920 1926753 1825025 1732708 1651328 1579863 1516728 1461918 1415770 1377278 1345006 1318306
57429A318306k1737j7697j3367p194n5N683R672J3712J8842K4573L0676L7353
$$ 1318306 1296569 1278872 1265505 1258311 1258256 1263939 1273611 1287323 1306165 1330738 1361414 1398767
57417A398767M3910M9430N4389N9813O5618P1745P9677R0373J01680J10700J17859
$$ 1398767 1442677 1492107 1546496 1606309 1671927 1743672 1823349 1913722 2015402 2126102 2243961
57406B243961J25773J34660J41905J45871J46966J44728J36656J20579R6281O4706
$$ 2243961 2369734 2504394 2646299 2792170 2939136 3083864 3220520 3341099 3437380 3502086
57396C502086K7560j2208n1398q8195j21461j49063j68837j80953j87482j89848
$$ 3502086 3529646 3517438 3466040 3377845 3256384 3107321 2938484 2757531 2570049 2380201
57386B380201j88238j83006j75044j65221j54758j45228j36766j27457j16094
$$ 2380201 2191963 2008957 1833913 1668692 1513934 1368706 1231940 1104483 988389
57377I88389j04359r4520q6558p9366p3082o7910o2334n5261m8522m4490m2434
$$ 988389 884030 789510 702952 623586 550504 482594 420260 364999 316477 271987 229553
57366B29553l9923l6573l3512l0551k7058k4427A3225a1879k3984k1071j8888
$$ 229553 189630 153057 119545 88994 61936 37509 13225 -11879 -35863 -56934 -75822
57355g5822j7945j6610j4869j4504j5398j5281j3461j1731j1154j0841j0337j0354
$$ -75822 -93767 -110377 -125246 -139750 -155148 -170429 -183890 -195621 -206775 -217616 -227953 -238307
57343b38307j0859j0921j0743j1309j2007j1154q905p069o159n318m898o116q110
$$ -238307 -249166 -260087 -270830 -282139 -294146 -305300 -314205 -321274 -327433 -332751 -337649 -343765 -351875
57330c51875q495p143o476p515q544q280p552p218p023p101q105r192q421n754
$$ -351875 -360370 -367513 -373989 -381504 -390048 -398328 -405880 -413098 -420121 -427222 -435327 -444519 -452940 -458694
57316d58694l306k106j089K70Q48J31r01j800l128m290l491r32M03j518n078p217
$$ -458694 -462000 -464106 -465195 -464925 -464077 -463946 -464847 -466647 -469775 -474065 -477556 -478488 -478085 -479603 -484681 -491898
57300d91898o777m660k288q73r98k061k934l311l499l285k441k007l144n032n742
$$ -491898 -498675 -503335 -505623 -506496 -507494 -509555 -512489 -515800 -519299 -522584 -525025 -527032 -530176 -535208 -540950
57285e40950n042m347m126l475k290j668j870j798p16J060L159N216O306O027
$$ -540950 -545992 -550339 -554465 -557940 -560230 -561898 -563768 -565566 -566282 -565222 -562063 -556847 -550541 -544514
57271e44514N669O463P404O973O147P155R875J2222J3651J5294J6840J6444J3967
$$ -544514 -538845 -532382 -524978 -518005 -511858 -504703 -494828 -482606 -468955 -453661 -436821 -420377 -406410
57258d06410J1350R484P553N670N297O385O913N982M970N025N699O559P836R094
$$ -406410 -395060 -385576 -378023 -372353 -367056 -360671 -353758 -347776 -342806 -337781 -332082 -325523 -317687 -308593
57244c08593R557R929J1593J3914J4924J4750J5663J8354K0979K2247K2738K2738
$$ -308593 -299036 -289107 -277514 -263600 -248676 -233926 -218263 -199909 -178930 -156683 -133945 -111207
57232a11207K1635K0070J9938K1459e345A7650K3435K5061K7602L1170L6054M0683
$$ -111207 -89572 -69502 -49564 -28105 -5345 17650 41085 66146 93748 124918 160972 201655
57220B01655M2764M2983M4469M7963N0638N0480M8608M6323M2961L7859L1425
$$ 201655 244419 287402 331871 379834 430472 480952 529560 575883 618844 656703 688128
57209F88128K3243J2108q83j2396k1157k9146l7248m3084m4856m4236m3437m2235
$$ 688128 711371 723479 722596 710200 689043 659897 622649 579565 534709 490473 447036 404801
57197D04801l9813l6901l3947k9666k3554j7726j4205j2170r597n853j264L788
$$ 404801 364988 328087 294140 264474 240920 223194 208989 196819 187222 181369 180105 183893
57185A83893P872Q780O494L993L612M511M953M873M712M042K972K885M136N004
$$ 183893 191765 200545 207039 211032 214644 219155 224108 228981 233693 237735 240707 243592 247728 252732
57171B52732M443L852M712O523Q497J1097J4338J6852J8254K0208K3381K5611
$$ 252732 257175 261027 265739 272262 280759 291856 306194 323046 341300 361508 384889 410500
57159D10500K5048K3064K2018K2111K2467K3413K5555K8097L0163L2406L5672
$$ 410500 435548 458612 480630 502741 525208 548621 574176 602273 632436 664842 700514
57148G00514L9408M2900M6601N0757N4309N6466N7737N8275N7241N5040N3747
$$ 700514 739922 782822 829423 880180 934489 990955 1048692 1106967 1164208 1219248 1272995
57137A272995N3554N1461M5643L8809L4669L3214L2186L1260L1578L2549L2478
$$ 1272995 1326549 1378010 1423653 1462462 1497131 1530345 1562531 1593791 1625369 1657918 1690396
57126A690396L1821L2758L5677L8583L9990M0128L9189L6556L2314K7863K4450
$$ 1690396 1722217 1754975 1790652 1829235 1869225 1909353 1948542 1985098 2017412 2045275 2069725
57115B069725K2109K0484J9788K0410K2029K3576K4140K3820K3432K3295K2831
$$ 2069725 2091834 2112318 2132106 2152516 2174545 2198121 2222261 2246081 2269513 2292808 2315639
57104B315639K1762K0777K0093J8323J4117Q085J526n904j5194k5328l4078m1176
$$ 2315639 2337401 2358178 2378271 2396594 2410711 2418796 2420322 2414418 2399224 2373896 2339818 2298642
57092B298642m8356n6266o3742p0206p6445q2683q8224r3327r9329j06521j14006
$$ 2298642 2250286 2194020 2130278 2060072 1983627 1900944 1812720 1719393 1620064 1513543 1399537
57081A399537j22002j32326j46190j63159j82130k01859k20985h539k58986k80579
$$ 1399537 1277535 1145209 999019 835860 653730 451871 230886 -8539 -267525 -548104
57071e48104l02087l21417l40348l62509l88944m19073m54736m99145n52492o12399
$$ -548104 -850191 -1171608 -1511956 -1874465 -2263409 -2682482 -3137218 -3636363 -4188855 -4801254
57061d801254o78238p51236q30977r15769j006157j104598j212405j330492j461700
$$ -4801254 -5479492 -6230728 -7061705 -7977474 -8983631 -10088229 -11300634 -12631126 -14092826
57052a4092826j608485j769892j944998k137230k350670k584608k837330l113147
$$ -14092826 -15701311 -17471203 -19416201 -21553431 -23904101 -26488709 -29326039 -32439186
57044c2439186l419939l762212m142412m566197n040372n569843o164511o846066
$$ -32439186 -35859125 -39621337 -43763749 -48329946 -53370318 -58940161 -65104672 -71950738
57036g1950738p640619q566389r628438j0810995j2069647j3356179j4667735
$$ -71950738 -79591357 -88157746 -97786184 -108597179 -120666826 -134023005 -148690740
57029a48690740j6031710j7388448j8517416j9188337j9454083j9743894k0556226
$$ -148690740 -164722450 -182110898 -200628314 -219816651 -239270734 -259014628 -279570854
57022b79570854k1975231k3438519k3953804k2598814j8983087j3418564o719075
$$ -279570854 -301546085 -324984604 -348938408 -371537222 -390520309 -403938873 -410657948
57015d10657948K25001O784369J2621166J7510601K1238087K3684593K4937105
$$ -410657948 -410432947 -403648578 -391027412 -373516811 -352278724 -328594131 -303657026
57008c03657026K5250982K4907009K4116677K3024020K1736111K0332113J8863905
$$ -303657026 -278406044 -253499035 -229382358 -206358338 -184622227 -164290114 -145426209
57001a45426209J7363689J5852003J4345348J2867760J1454415J0137168Q929524
$$ -145426209 -128062520 -112210517 -97865169 -84997409 -73542994 -63405826 -54476302
56994e4476302P831844O845616N974095N213232M551319L976193L476560L039496
$$ -54476302 -46644458 -39798842 -33824747 -28611515 -24060196 -20084003 -16607443 -13567947
56986a3567947K654088K316134K023812J771003J549905J357214g03814C45894
$$ -13567947 -10913859 -8597725 -6573913 -4802910 -3253005 -1895791 -703814 345894
56977A269879Q11952P13453O26419N47768M77164M15948L63765L19311K82033
$$ 1269879 2081831 2795284 3421703 3969471 4446635 4862583 5226348 5545659 5827692
56968E827692K50110K19557J88805J61342J40509J24589J10417R8400Q9691Q1470
$$ 5827692 6077802 6297359 6486164 6647506 6788015 6912604 7023021 7121421 7211112 7292582
56958G292582O9756N4931M0381K7480J5799O393P80k079m528p350j1139j8578
$$ 7292582 7362338 7417269 7457650 7485130 7500929 7507322 7508102 7506023 7501495 7494145 7483006 7464428
56946G464428l1476m6679n8422o4286o6290o7059o7558o8094o8975o9694o8467
$$ 7464428 7432952 7386273 7327851 7263565 7197275 7130216 7062658 6994564 6925589 6855895 6787428
56935F787428o3198n4696n1175o7575j14438j85146k57833l12275l42498l53120
$$ 6787428 6724230 6669534 6618359 6550784 6436346 6251200 5993367 5681092 5338594 4985474
56925D985474l49605l35711l15588k92794k68666k44561k23499k06981j92710
$$ 4985474 4635869 4300158 3984570 3691776 3423110 3178549 2955050 2748069 2555359
56916B555359j78063j63313j49094j33981j17555j02691r1468q1616p0354n9015
$$ 2555359 2377296 2213983 2064889 1930908 1813353 1710662 1619194 1537578 1467224 1408209
56906A408209n0228m3107l5111k6512j9124j2442m791L072R063J3144J6281J7246
$$ 1408209 1357981 1314874 1279763 1253251 1234127 1221685 1216894 1219966 1229029 1242173 1258454 1275700
56894A275700J3868O675j547r172j6173k1956k5200k5508k3635k0774j8487j7813
$$ 1275700 1289568 1296243 1294696 1285524 1269351 1247395 1222195 1196687 1173052 1152278 1133791 1115978
56882A115978j7465j4977j0455o724m675j780L246P980J0752J4001K0208K7544
$$ 1115978 1098513 1083536 1073081 1066357 1061682 1059902 1063148 1071128 1081880 1095881 1116089 1143633
56870A143633L2561L4168L2043K4390J1044l685j4945k2094k6718k8736k7867
$$ 1143633 1176194 1210362 1242405 1266795 1277839 1274154 1259209 1237115 1210397 1181661 1153794
56859A153794k6200k5477k4067k0262j6246j4957j5213j3977j1375r563q460o708
$$ 1153794 1127594 1102117 1078050 1057788 1041542 1026585 1011372 997395 986020 976457 967997 961289
56847I61289n151n247n609m154k193k231l088j504K457N782P507R280J1575J3166
$$ 961289 956138 950891 945282 941128 938935 936704 933616 932112 934569 940351 947858 957138 968713 981879
56833I81879J4037J5331J6808J7569J8589K1373K4858K6724K6831K6243K3971
$$ 981879 995916 1011247 1028055 1045624 1064213 1085586 1110444 1137168 1163999 1190242 1214213
56822A214213J8085R206l75r881j9171k5960k7750k5694k3102k0961j8233j5258
$$ 1214213 1232298 1241504 1241129 1231248 1212077 1186117 1158367 1132673 1109571 1088610 1070377 1055119
56810A055119j3107j0519n468R84O074R786J4186J9336K3841K8558L5374M2619
$$ 1055119 1042012 1031493 1026025 1027009 1033083 1042869 1057055 1076391 1100232 1128790 1164164 1206783
56798A206783M5867M3088L5311K2981O209j1622k5229l2882l6663l7411l3965
$$ 1206783 1252650 1295738 1331049 1354030 1360239 1348617 1323388 1290506 1253843 1216432 1182467
56787A182467k7458k1450j6685j0199j012P573J3140J7768K4443L2961M1431M9266
$$ 1182467 1155009 1133559 1116874 1106675 1105663 1113236 1126376 1144144 1168587 1201548 1242979 1292245
56775A292245N6841O4163P0909P5668P4502O2994M1112J4123j2072l4439n1540
$$ 1292245 1349086 1413249 1484158 1559826 1634328 1697322 1738434 1752557 1740485 1706046 1654506
56764A654506o1886o5252o3708n9773n4508m8040m0633l2826k5350j8890j2997
$$ 1654506 1592620 1527368 1463660 1403887 1349379 1301339 1260706 1227880 1202530 1183640 1170643
56753A170643o088K252J0080J5889K1125K7853L5256M0763M2886M0261K9977J0985
$$ 1170643 1164555 1166807 1176887 1192776 1213901 1241754 1277010 1317773 1360659 1400920 1430897 1441882
56741A441882j1814l0873m3036n0052n3364n2677m9114m5145m1025l5178k8292
$$ 1441882 1430068 1399195 1356159 1306107 1252743 1200066 1150952 1105807 1064782 1029604 1001312
56730A001312k2964j9134j4034p195j382K282O001J1133J6216K0170K3653K5929
$$ 1001312 978348 959214 945180 937985 936603 938885 944886 956019 972235 992405 1016058 1041987
56718A041987K4099J7088P209l329j4225k4294l0575l1997l0911k9474k7364k4352
$$ 1041987 1066086 1083174 1090383 1087054 1072829 1048535 1017960 985963 955052 925578 898214 873862
56706H73862k1906k0611j8852j5786j3070j2026j1642j0766r867r282q094o069
$$ 873862 851956 831345 812493 796707 783637 771611 759969 749203 739336 730054 721960 715891
56694G15891m455l836l419l169m055n438n149l079j853k797m231m862n714p229
$$ 715891 711436 707600 704181 701012 696957 691519 686370 683291 681438 678641 674410 669548 663834 656605
56680F56605p537n491k840j601j513j675k308l436m000l733l857m761n184m702
$$ 656605 649068 643577 640737 639136 637623 635948 633640 630204 626204 622471 618614 613853 608669 603967
56666F03967m602n255n130l555k014j539j331r71j378k486k704j762j373j948
$$ 603967 599365 594110 588980 585425 583411 581872 580541 579570 578192 575706 573002 571240 569867 567919
56652E67919j732l28J28j145j818m93P47o4j514j593j148k004l815n143n840o320
$$ 567919 566187 565859 565987 564842 563024 562531 563278 563214 561700 560107 558959 556955 553140 547997 542157 535837
56636E35837o220n513n170n309m676l180k559l184k944q77R91J355K218N374R048
$$ 535837 529617 524104 518934 513625 508949 505769 503210 500026 497082 496205 497196 498551 500769 506143 515191
56621E15191J0694J0883J1491J2101J1050Q629O608N675N431N632N584L912P64
$$ 515191 525885 536768 548259 560360 571410 580039 586647 592322 597753 603385 608969 612881 613645
56608F13645j410j206o17j920l997m234k688j743k508l990n253o339p233p616
$$ 613645 612235 611029 610412 608492 604495 600261 597573 595830 593322 589332 584079 577740 570507 562891
56594E62891p544p324o908o114n144m493m754o167p659p130m207j700k098l616
$$ 562891 555347 548023 541115 535001 529857 525364 520610 514443 506784 499654 495447 493747 491649 488033
56580D88033k737J90J626P78M48J626J835P5j151o62r75l577n924n781m706m464
$$ 488033 485296 485486 487112 487890 488338 489964 491799 491874 490723 490061 489086 485509 479585 473804 469098 464634
56564D64634l704j410m4j616l731l327j672j757l027k722p90M08J65j68P4N42
$$ 464634 460930 459520 459476 457860 454129 450802 449130 447373 444346 441624 440834 441242 441407 441239 441313 441855
56548D41855J362K524K961K356K425M313O304O351N143M428M139L542L390M416
$$ 441855 443217 445741 448702 451058 453483 457796 464100 470451 475594 480022 484161 487703 491093 495509
56534D95509N391N062M434M819N478N352N194N699N608M189L343M543N771M513
$$ 495509 500900 505962 510396 515215 520693 526045 531239 536938 542546 546735 550078 554621 560392 564905
56520E64905J860N88Q82J052R16J391K083K202K583M114N474N163M360M996O382
$$ 564905 566765 567353 568235 569287 570203 571594 573677 575879 578462 582576 588050 593213 597573 602569 608951
56505F08951O550N633N187N329N247N422O788Q630R563R483Q757P075N046M886
$$ 608951 615501 621134 626321 631650 636897 642319 649107 657737 667300 676783 685540 692615 697661 702547
56491G02547P240R352Q828P077O423O216M782K999K536K447R36j140j908k114
$$ 702547 709787 719139 727967 735044 741467 747683 752465 755464 758000 760447 761383 760243 758335 756221
56477G56221l722o203p443p346p418p925q197q569r484r920r124q301q259p459
$$ 756221 752499 746296 738853 731507 724089 716164 707967 699398 689914 679994 670870 662569 654310 646851
56463F46851n050l446m701o746o563m998m711n441n186m286m445n165m863m098
$$ 646851 641801 638355 633654 626908 620345 615347 610636 605195 600009 595723 591278 586113 581250 577152
56449E77152m175m210k985j889k461l046j699j87r91k579k118p73j367k704j609
$$ 577152 572977 568767 565782 563893 561432 558386 556687 556500 555509 552930 550812 550039 548672 545968 544359
56434E44359R20J107r71j587K96K075K610L248L886K940J253J316K578K104q7
$$ 544359 545279 546386 545415 543828 544124 546199 548809 552057 555943 558883 560136 561452 564030 566134 566047
56419E66047r36L51J509J893L312N677O320M456K430J836K004K550L856M895M180
$$ 566047 565111 565462 566971 568864 572176 577853 584173 588629 591059 592895 594899 597449 601305 606200 610380
56404F10380K806K996M143M075L540N068P941Q851P444O591P243P617P410Q096
$$ 610380 613186 616182 620325 624400 627940 633008 640949 649800 657244 663835 671078 678695 686105 694201
56390F94201Q979P731N021L841M116K966M16m83L11n97l469m130r20K331K362
$$ 694201 703180 710911 715932 719773 723889 726855 727271 726788 727099 726502 723033 718903 717983 720314 722676
56375G22676P12k08q02j820k258j956k782n323p682q916j0211j1494j0771q136
$$ 722676 723388 723180 722378 720558 718300 716344 713562 708239 700557 691641 681430 669936 659165 651029
56361F51029o581p265p855p011o599p726q359o860m569l097k146j496j961l044
$$ 651029 644448 637183 629328 622317 615718 607992 599633 592773 588204 585107 582961 581465 579504 576460
56347E76460k769j094l20j054j145K71J123O9j464k115k303k183j085K22K0r37
$$ 576460 573691 572597 572277 571223 570078 570349 571472 571541 570077 567962 565659 563476 562391 562613 562633 561696
56331E61696kK782M353L547K534K632K524J540Q61O27l70j496p02J292J410o55
$$ 561696 561694 564476 568829 572376 574910 577542 580066 581606 582467 583094 582724 581228 580526 581818 583228 582573
56315E82573j995j569j097m83K486P046R360Q742Q667J0227J0187P318N008N227
$$ 582573 580578 579009 577912 577429 579915 586961 596321 605063 613730 623957 634144 641462 646470 651697
56301F51697N326L559K511M028N477M276J980R07O50N34J506L143K828L04j050
$$ 651697 657023 660582 663093 667121 672598 676874 678854 679761 680411 680945 682451 685594 688422 688726 687676
56286F87676L43J889K063L127O053P617N871L904M816P035P918P997Q281P362
$$ 687676 688019 689908 691971 695098 701151 708768 714639 718543 723359 730394 738312 746309 754590 761952
56272G61952M635K795L705N177M963M667O611J0009J3045J5528J7055J6010J2902
$$ 761952 766587 769382 773087 778264 783227 787894 794505 804514 817559 833087 850142 866152 879054
56259H79054J1160J2238J3473J2981J2601J3668J4190J2950J2036J2551J2120
$$ 879054 890214 902452 915925 928906 941507 955175 969365 982315 994351 1006902 1019022
56248A019022R620P980R116J0345R152P316O964O713N267M693O519Q245P433N751
$$ 1019022 1028642 1036622 1045738 1056083 1065235 1072551 1079515 1086228 1091495 1096188 1102707 1110952 1118385 1124136
56234A124136N644O475P078Q532J1418J3833J4888J6468J9138K0536K0296K1804
$$ 1124136 1129780 1136255 1143333 1151865 1163283 1177116 1192004 1208472 1227610 1248146 1268442 1290246
56222A290246K6371L0622L2573L4969L9459M2992M3806M5376N0313N5730N9145
$$ 1290246 1316617 1347239 1379812 1414781 1454240 1497232 1541038 1586414 1636727 1692457 1751602
56211A751602O3440P1132P8979Q3548Q7320R3933J02053J09284J17753J30163
$$ 1751602 1815042 1886174 1965153 2048701 2136021 2229954 2332007 2441291 2559044 2689207
56201B689207J44338J56960J68951J82197J95039K06079K18205K33560K48640
$$ 2689207 2833545 2990505 3159456 3341653 3536692 3742771 3960976 4194536 4443176
56192D443176K59544K67788K75549K79744K76700K68584K58951K45684K24500
$$ 4443176 4702720 4970508 5246057 5525801 5802501 6071085 6330036 6575720 6800220
56183F800220J96055J63758J27924Q7858M6523P613k8832o2956r1340j12043j29057
$$ 6800220 6996275 7160033 7287957 7375815 7422338 7429951 7401119 7338163 7246823 7134780 7005723
56172G005723j46012j59883j66960j70279j74320j76955j74324j69630j69030
$$ 7005723 6859711 6699828 6532868 6362589 6188269 6011314 5836990 5667360 5498330
56163E498330j71874j72974j71961j72562j74689j74866j73024j71822j70764
$$ 5498330 5326456 5153482 4981521 4808959 4634270 4459404 4286380 4114558 3943794
56154C943794j67482j63184j60557j58034j52267j44238j36886j29039j18076
$$ 3943794 3776312 3613128 3452571 3294537 3142270 2998032 2861146 2732107 2614031
56145B614031j06320r8223r3186q7387q0665p5312p0352o3420n6228n1849m8677
$$ 2614031 2507711 2409488 2316302 2228915 2148250 2072938 2002586 1939166 1882938 1831089 1782412
56134A782412m3259l6868l3064l1131k8179k5191k4484k3919k0226j5520j3763
$$ 1782412 1739153 1702285 1669221 1638090 1609911 1584720 1560236 1536317 1516091 1500571 1486808
56123A486808j3360j0132n083k151p89K130N511O322O258Q951J2862J4187J4321
$$ 1486808 1473448 1463316 1458233 1456082 1455293 1457423 1462934 1469256 1475514 1484465 1497327 1511514 1525835
56110A525835J7086K0966K1762K0573K1555K3924K3919K2486K3248K4893K3356
$$ 1525835 1542921 1563887 1585649 1606222 1627777 1651701 1675620 1698106 1721354 1746247 1769603
56099A769603J9540J7236J5572J1353O644N854P425O469L676L519N716O656P200
$$ 1769603 1789143 1806379 1821951 1833304 1839948 1845802 1853227 1859696 1863372 1866891 1872607 1879263 1886463
56086A886463J0794J6021J9368K3052L1439M1964M8511N1812N7473O5874P3268
$$ 1886463 1897257 1913278 1932646 1955698 1987137 2029101 2077612 2129424 2186897 2252771 2326039
56075B326039Q0855R3179J08887J22313J32598J42349J49231J48463J41857J34911
$$ 2326039 2406894 2500073 2608960 2731273 2863871 3006220 3155451 3303914 3445771 3580682
56065C580682J26930J13824R8638Q8712Q3712P6579O5060N2309L7743J8053l841
$$ 3580682 3707612 3821436 3920074 4008786 4092498 4169077 4234137 4286446 4324189 4342242 4338401
56054D338401k1176l3690m5756n6364o1662o5478p5740r1676j05621j15957j26519
$$ 4338401 4317225 4283535 4237779 4181415 4119753 4054275 3978535 3886859 3781238 3665281 3538762
56043C538762j34937j34168j25117j15623j07357r5624q1422p1306o5547n8572
$$ 3538762 3403825 3269657 3144540 3028917 2921560 2825936 2744514 2673208 2607661 2549089
56033B549089n0729m7402m7074m2902l5701l2562l3162l0466k4348k1034j9664
$$ 2549089 2498360 2450958 2403884 2360982 2325281 2292719 2259557 2229091 2204743 2183709 2164045
56022B164045j3609m879k565o548p281k485N71N5J984O715P956O474R787J7041
$$ 2164045 2150436 2145557 2142992 2136444 2129163 2126678 2127249 2127304 2129288 2136003 2143959 2150433 2160220 2177261
56008B177261J9371J6492J7420K3439K6206K4340K5595L0688L1547K7792K8214
$$ 2177261 2196632 2213124 2230544 2253983 2280189 2304529 2330124 2360812 2392359 2420151 2448365
55997B448365L3604L4957L1206L1338L6354L6933L2075L1840L8012M0512L7041
$$ 2448365 2481969 2516926 2548132 2579470 2615824 2652757 2684832 2716672 2754684 2795196 2832237
55986B832237L7592M5023M9739M8515M9968N6377N8887N5917N7455O5813P1026
$$ 2832237 2869829 2914852 2964591 3013106 3063074 3119451 3178338 3234255 3291710 3357523 3428549
55975C428549P0441P3488Q1987Q5865Q3697Q6831R7328J03091J00889J02527J11646
$$ 3428549 3498990 3572478 3654465 3740330 3824027 3910858 4008186 4111277 4212166 4314693 4426339
55964D426339J16732J14296J16322J26964J34532J34663J38585J50364J59263
$$ 4426339 4543071 4657367 4773689 4900653 5035185 5169848 5308433 5458797 5618060
55955E618060J62734J72859J91724K05251K10046K20677K41494K57949K65293
$$ 5618060 5780794 5953653 6145377 6350628 6560674 6781351 7022845 7280794 7546087
55946G546087K78171L01529L20558L30387L46363L73430L95769M08896M30418
$$ 7546087 7824258 8125787 8446345 8776732 9123095 9496525 9892294 10301190 10731608
55937A0731608M65991M97427N18572N48899N96144O40735O73759P14164P70489
$$ 10731608 11197599 11695026 12213598 12762497 13358641 13999376 14673135 15387299 16157788
55928A6157788Q22969Q63027R12278R81752J051119J109661J177257J262536J342861
$$ 16157788 16980757 17843784 18756062 19737814 20788933 21898594 23075851 24338387 25681248
55919B5681248J409935J491411J602212J720231J835983J976710K152858K332999
$$ 25681248 27091183 28582594 30184806 31905037 33741020 35717730 37870588 40203587
55911D0203587K502934K695521K930395L183706L452167L782404M197783M665869
$$ 40203587 42706521 45402042 48332437 51516143 54968310 58750714 62948497 67614366
55903F7614366N181937N810439O596625P517319Q567146R798214J1216886J2750760
$$ 67614366 72796303 78606742 85203367 92720686 101287832 111086046 122302932 135053692
55895A35053692J4390842J6250320J8408652K0843453K3606350K6875739L0702920
$$ 135053692 149444534 165694854 184103506 204946959 228553309 255429048 286131968
55888B86131968L4922625L9412302M3903846M6936053M5367232L6132286J9234483
$$ 286131968 321054593 360466895 404370741 451306794 496674026 532806312 552040795
55881E52040795j284555j9838106l2809593l9790074m2230189m1743603l9543936
$$ 552040795 550756240 530918134 498108541 458318467 416088278 374344675 334800739
55874C34800739l6532691l3267930k9939431k6609883k3423702k0518780j7901993
$$ 334800739 298268048 265000118 235060687 208450804 185027102 164508322 146606329
55867A46606329j5540326j3470710j1725051j0243186q949779p840712o921700
$$ 146606329 131066003 117595293 105870242 95627056 86677277 78836565 71914865
55860G1914865o136576n427047m800288m275516l821844l405213l042210k753064
$$ 71914865 65778289 60351242 55550954 51275438 47453594 44048381 41006171 38253107
55852C8253107k509729k279639k075339j914449j773387j625387j485237j374371
$$ 38253107 35743378 33463739 31388400 29473951 27700564 26075177 24589940 23215569
55844B3215569j277910j175773j081864j014297r58359q94631q33875p90489p50466
$$ 23215569 21937659 20761886 19680022 18665725 17707366 16812735 15978860 15188371 14437905
55835A4437905o98146o47240o14038n86035n46973n07613m82565m61128m29514
$$ 14437905 13739759 13092519 12478481 11892446 11345473 10837860 10355295 9894167 9464653
55826I464653l98692l82388l69733l46682l23110l12219l03676k83285k59842
$$ 9464653 9065961 8683573 8313840 7967158 7644048 7331829 7028153 6744868 6485026
55817F485026k47062k37609k19971k03083j99361k00074j91662j80705j79073
$$ 6485026 6237964 6000355 5780384 5577301 5377940 5177866 4986204 4805499 4626426
55808D626426j79578j69694j55675j50503j50526j45246j37955j36265j34202
$$ 4626426 4446848 4277154 4121479 3970976 3820450 3675204 3537249 3400984 3266782
55799C266782j23302j09853j02626r5426q0016o4129n8196n6099m7449l7600l7215
$$ 3266782 3143480 3033627 2931001 2835575 2755559 2691430 2633234 2577135 2529686 2492086 2454871
55788B454871m2767m5127m6973n4193o0311n6971n0181m9532n0839m5778l8740
$$ 2454871 2412104 2366977 2320004 2265811 2205500 2148529 2098348 2048816 1997977 1952199 1913459
55777A913459l7666l7844l1528k4385k5743l1194l1229k8630l1070l4744l1829
$$ 1913459 1875793 1837949 1806421 1782036 1756293 1725099 1693870 1665240 1634170 1599426 1567597
55766A567597k6659k8260l3724l4352l1588l1845l2521k8073k3218k5174k9445
$$ 1567597 1540938 1512678 1478954 1444602 1413014 1381169 1348648 1320575 1297357 1272183 1242738
55755A242738k7713k3214k3665k5747k1651j4649j2989j4131j0164l469j965l774
$$ 1242738 1215025 1191811 1168146 1142399 1120748 1106099 1093110 1078979 1068815 1065346 1063381 1059607
55743A059607j445L099K517j274q62K116L30m909o609o056r963j6582j8229j5272
$$ 1059607 1058162 1061261 1063778 1062504 1061642 1063758 1064088 1059179 1052570 1046514 1036551 1019969 1001740 986468
55729I86468j4635j6612j5801j3050j3963j7393j7312j4348j4098j5925j4679
$$ 986468 971833 955221 939420 926370 912407 895014 877702 863354 849256 833331 818652
55718H18652j1441j1397j3103j0948o376n886r621j2267j3204j5567j7575j5231
$$ 818652 807211 795814 782711 771763 765387 759501 749880 737613 724409 708842 691267 676036
55706F76036j1301j1373j3442j1720p920q043j0532q937m210l061n763o672n498
$$ 676036 664735 653362 639920 628200 620280 612237 601705 592768 588558 585497 579734 573062 567564
55693E67564o953j0275j0116p277p955j2455j4782j3245j1758j1017q005m002
$$ 567564 560611 550336 540220 532943 524988 512533 497751 484506 472748 461731 453726 449724
55681D49724l584n852n676l243l291n478m779j125M07j130j827j155k266m523
$$ 449724 446140 440288 434612 431369 428078 422600 417821 416696 417103 415973 414146 412991 410725 406202
55667D06202m313k835m507q139q363n272m028n395n476m266n486q077o949k368
$$ 406202 401889 399054 394547 386408 378045 372773 368745 363350 357874 353608 348122 340045 333096 330728
55653C30728J62m19J97K752L232J207Q92L129M341L965N070P113O163K712J448
$$ 330728 330890 330471 330668 333420 336652 337859 338751 341880 346221 350186 355256 362369 368532 371244 372692
55638C72692K866K918J254J732M322M710K615K418M852O065N685P490J1093J1224
$$ 372692 375558 378476 379730 381462 385784 390494 393109 395527 400379 406444 412129 419619 430712 441936
55624D41936O784K796J773P78j488k198p84n53k136k215l26j52k506l725k504
$$ 441936 448720 451516 453289 454067 452579 450381 449597 449044 446908 444693 444367 444215 441709 437984 435480
55609D35480j797k604k395q76q15k051j103K181M046L617L733M465K836l92q73
$$ 435480 433683 431079 428684 427808 426993 424942 423839 426020 430066 433683 437416 441881 444717 444325 443452
55594D43452J438J882m29j244N16Q00j558k580j012r04l950o466o655p832j1538
$$ 443452 444890 446772 446343 445099 445615 446415 444857 442277 441265 440361 436411 429945 423290 415458 403920
55579D03920j4112j3187j1460j1196j0739r087q283q787q096o018n714p594q059
$$ 403920 389808 376621 365161 353965 343226 334139 325856 317069 308973 302955 297241 289647 281588
55566B81588o129n213o433o471m107k646l491l718k275k297m555n073k177L30
$$ 281588 275459 270246 263813 257342 253235 250589 247098 243380 241105 238808 234253 229180 227003 227333
55552B27333N2m2K270M265L583K218J935R70j479k764j858j794l987n267l627
$$ 227333 227385 227343 229613 233878 237461 239679 241614 242584 241105 238341 236483 234689 230702 225435 221808
55537B21808j778j863j797j58L09k280n020m742k494n64R57K083J631K28L68J516
$$ 221808 220030 218167 216370 216212 216521 214241 209221 204479 201985 201421 202378 204461 206092 206320 206688 208204
55521B08204n5m537p048n085k182j629k005j670k084l565l180j50J929J402J596
$$ 208204 208149 203612 196564 191479 189297 187668 185663 183993 181909 178344 175164 175014 176943 178345 179941
55506A79941M247N603L024o2j65N61q18k350j285N88N09j64P95J743K79k098k678
$$ 179941 184188 189791 192815 192753 192588 193149 192331 189981 188696 189284 189793 189629 190424 192167 192446 190348 187670
55489A87670j964j623j088K62P80k29l26J764L299K307J411L084N074M513K969
$$ 187670 185706 184083 182995 183257 184037 183808 183482 185246 188545 190852 192263 195347 200421 204934 207903
55474B07903L208M243L843K875L015L113J790Q49K193M055M097L453L994M434
$$ 207903 211111 215354 219197 222072 225087 228200 229990 230839 233032 237087 241184 244637 248631 253065
55460B53065L005J267J395K265J952J473K212K315l44l848m983m359n017p581
$$ 253065 256070 257337 258732 260997 262949 264422 266634 268949 268605 264757 259774 255415 250398 242817
55446B42817j0178j1638j1804j0308p656n786n265m264k235j639l668n510m679
$$ 242817 232639 221001 209197 198889 191233 185447 180182 175918 173683 172044 168376 162866 158187
55433A58187k791k103j699l64J98j353k699j633j02p07k105j951j516l085n135
$$ 158187 155396 153293 151594 151230 151428 150075 147376 145743 145641 144934 142829 140878 139362 136277 131142
55418A31142m556j812J65O09Q15R62M56j20l45j385l349l656r65J783J524l85
$$ 131142 126586 124774 124939 125548 126363 127325 127781 127661 127316 125931 122582 118926 117961 119744 121268 120883
55402A20883j092j084k283l789l533k220j806j876j047j59o30j503j287p97j049
$$ 120883 119791 118707 116424 112635 109102 106882 105076 103200 102153 101994 101364 99861 98574 97777 96728
55387I6728p00J209K501J344o0R02K543J776n71j570j207j355j609m63R68O03
$$ 96728 96028 97237 99738 101082 101022 101924 104467 106243 105672 104102 102895 101540 99931 99468 100436 101039
55371A01039o52n91J13o59k216k181o47M28P66J253J249j74j666j537p03n99j44
$$ 101039 100387 99796 99909 99250 97034 94853 94206 94634 95400 96653 97902 97728 96062 94525 93822 93223 93079
55354I3079J836L460K733J451K171L569K905J066O80J203M54p72l54N88m04k163
$$ 93079 94915 98375 101108 102559 104730 108299 111204 112270 112950 114153 114607 113835 113481 114069 113665 111502
55338A11502j802j83m35k094j957J1Q34J27L66J800K064R79Q33J646Q67j662k932
$$ 111502 109700 109517 109082 106988 105031 105042 105876 106003 106369 108169 110233 111212 112045 113691 114558 112896 109964
55321A09964j701j72j04q29j609k442k241K53L483M348K544N15o49j753k485j678
$$ 109964 108263 108091 107987 107158 105549 103107 100866 101119 104602 108950 111494 112009 111360 109607 107122 105444
55305A05444l34n85j755j353J91p5k414l707k476p34j98k44j97l10o6J235K155
$$ 105444 105110 104525 102770 101417 101608 101533 99119 95412 92936 92202 92004 91760 91563 91253 91187 92422 94577
55288I4577P05j783k064k26L49j413k732j677M12J943K982L285J999J46J13J762
$$ 94577 95282 93499 91435 91209 91558 90145 87413 85736 86148 88091 91073 94358 96357 96503 96616 98378
55272I8378K171N1k526l474k799j022J493L133K102o61k377k316j869j046J345
$$ 98378 100549 100600 98074 94600 91801 90779 92272 95405 97507 96846 94469 92153 90284 89238 90583
55257I0583M198M670K708J147R42K67j176j291M8J42j767k935j910p82r40o07
$$ 90583 94781 99451 102159 103306 104248 104515 103339 102048 102096 102238 100471 97536 95626 94844 93904 93297
55241I3297J288K527J412j55M6J016P78l26r76j311j794j593j07J576K415K819
$$ 93297 94585 97112 98524 98369 98415 99431 100209 99883 98907 97596 95802 94209 94102 95678 98093 100912
55225A00912K992J886o07k413j918k29P20P33O14L92k68j064j466j259k17J481
$$ 100912 103904 105790 105183 102770 100852 100623 101343 102076 102690 103082 102814 101750 100284 99025 98808 100289
55209A00289K478J546k97q65j03jj127j820j210m62l09Q6J021J375P30R5j40p01
$$ 100289 102767 104313 104016 103151 103048 103047 101920 100100 98890 98428 98119 98205 99226 100601 101331 101426 101286 100585
55191A00585j265l31J974L426K924J722P31p61k753l521k332p65j90m0L30L38
$$ 100585 99320 98989 100963 104389 107313 109035 109766 109005 106252 102731 100399 99634 99444 99404 99734 100072
55175A00072j74j90M67N36k33k82R86J915J239q5q34j233j497q19Q98K170K105
$$ 100072 99898 99708 100175 100711 100478 100196 101182 103097 104336 104251 103417 102184 100687 99868 100766 102936 105041
55158A05041J706J925K032J013q42k508l100k018K22J461K19j659j279P48J099
$$ 105041 106747 108672 110704 111717 110875 108367 105267 103249 103471 104932 105151 103492 102213 102961 104060
55143A04060q25j896l94J546J894J645K039K016N18j239j730j168j38J471K894
$$ 104060 103235 101339 100945 102491 104385 106030 108069 110085 110603 109364 107634 106466 106328 107799 110693
55128A10693K383J25j307q17l99j298j617J87K206J934j1j418j734j642j172l44
$$ 110693 113076 113201 111894 111077 110678 109380 107763 107950 110156 112090 112079 110661 108927 107285 106113 105769
55112A05769k4l65n3J357K215J528Q20J561K694K623J593M04j221l095l550k018
$$ 105769 105745 105380 105327 106684 108899 110427 111247 112808 115502 118125 119718 120122 118901 115806 112256 110238
55096A10238o91j451l018l223k285j575j005P1R34Q13P06J626K453J692J02o45
$$ 110238 109547 108096 105078 101855 99570 97995 96990 97061 97995 98808 99514 101140 103593 105285 105387 104742
55080A04742o96j216j918j577k73Q43J303J312Q62J99K51J254K016J706J071P94
$$ 104742 104046 102830 100912 99335 99062 99905 101208 102520 103382 103581 103832 105086 107102 108808 109879 110673
55064A10673J87j119j858j039L86J172J527J865J590O75M96J430J635O3j371p84
$$ 110673 110860 109741 107883 106844 107230 108402 109929 111794 113384 114059 114555 115985 117620 117683 116312 115528
55048A15528M98K66r06r74N7O27N56Q29J269R11J09M5O69J050J134J428J688J575
$$ 115528 116026 116292 115386 114412 114469 115096 115652 116481 117750 118661 118770 118815 119484 120534 121668 123096 124784 126359
55030A26359J666K240K177R06M5J085K676K541J029L23R33J381Q78M6o84j310
$$ 126359 128025 130265 132442 133348 133393 134478 137154 139695 140724 141047 141980 143361 144239 144285 143601 142291
55014A42291j206R8J445J171m72j695j623p88K99J395J703O22q73j188k82M74
$$ 142291 141085 141183 142628 143799 143327 141632 140009 139221 139520 140915 142618 143240 142367 141179 140897 141371
54998A41371L89lk81o99j347j815j712r39L15J361J404N67j33k32k76o26j007
$$ 141371 141760 141757 141476 140777 139430 137615 135903 134964 135279 136640 138044 138611 138478 138246 137970 137344 136337
54981A36337j530k599l415k430N6J717J410N38K75j54j115j041R49L012L098J672
$$ 136337 134807 132208 128793 126363 126419 128136 129546 130084 130359 130205 129090 128049 128998 132010 135108 136780
54965A36780K21r14j516o62J093J088j430l183j395J788K635J463J389K945L790
$$ 136780 137001 136087 134571 133909 135002 136090 134660 131477 130082 131870 134505 135968 137357 140302 144092
54950A44092K949J760J003K27k23N18J723J647J47j473k688l704l928k781j317
$$ 144092 147041 148801 149804 150031 149808 150326 152049 153696 153843 152370 149682 145978 142050 139269 137952
54935A37952p51k94J121K110P17j906k714j145O99J680K378K669J745M94P86K247
$$ 137952 137201 136907 138028 140138 140855 138949 136235 135090 135789 137469 139847 142516 144261 144755 145541 147788
54919A47788K596J247j58q07j333j372L01K820L530J986P53J458K848L632M420
$$ 147788 150384 151631 151473 150666 149333 147961 148262 151082 154612 156598 157351 158809 161657 165289 169709
54904A69709N596N816M208K078J060J209J972L351N042O095O441P261Q910J0029
$$ 169709 175305 181121 185329 187407 188467 189676 191648 194999 200041 206136 212577 219838 228748 238777
54890B38777R726R225J0170J2435J4689J6203J7140J7710J7793J7076J5091J1514
$$ 238777 248503 257728 267898 280333 295022 311225 328365 346075 363868 380944 396035 407549
54878D07549O528P30n080r756j2227j2877j3536j5183j6546j6176j4796j3959
$$ 407549 414077 414807 409727 399971 387744 374867 361331 346148 329602 313426 298630 284671
54866B84671j3523j2296j0413q935p779o092m195k997k081n94N42k01j902j916
$$ 284671 271148 258852 248439 239504 231725 225633 221438 218441 216360 215766 216308 216107 214205 212289
54852B12289L35K886M529N949P381P892P686Q507J0819J2869J3595J4303J6284
$$ 212289 212624 215510 220039 225988 233369 241261 248947 257454 268273 281142 294737 309040 325324
54839C25324J8457J8650J5958J1067N452P58k390n329r726j4740j7573j7178j5595
$$ 325324 343781 362431 378389 389456 394908 395666 393276 387947 378221 363481 345908 328730 313135
54826C13135j4921j4726j3489j1104q807p530p196p069o473n625n656o986q223
$$ 313135 298214 283488 269999 258895 250088 242558 235362 228293 221820 216195 210539 203553 195330
54813A95330p810o202m913m081k767j292r59j667j909j335j208k007k609k247
$$ 195330 187520 181318 176405 172324 169557 168265 167306 165639 163730 162395 161187 159180 156571 154324
54799A54324j458o98K14R47P93R2p7K12m0p99j245j806l440m997m109j131P65
$$ 154324 152866 152168 152382 153329 154122 154214 154137 154349 154309 153510 152265 150459 147019 142022 137913 136782 137547
54782A37547J92o08L38J854K169J687J358N44j327k755k065r6R41M33m81r20q71
$$ 137547 137739 137131 137469 139323 141492 143179 144537 145081 143754 140999 138934 138838 139779 140212 139731 138811 137940
54765A37940m30K85Q49J088J436K149K836L247L696M189M075L066J704N53k34
$$ 137940 137510 137795 138644 139732 141168 143317 146153 149400 153096 157285 161360 164426 166130 166683 166449
54750A66449k35J098L343N210O054O260O129N692N542O389P701Q365Q613R447
$$ 166449 166214 167312 170655 175865 181919 188179 194308 200000 205542 211931 219632 227997 236610 246057
54736B46057J0368R901Q633R046J1736J4303J5016J5194J6469J7940J7725J5575
$$ 246057 256425 266326 274959 284005 295741 310044 325060 340254 356723 374663 392388 407963
54724D07963J2332Q185L144j928o043q983j0688j1056j1002j2036j3862j4224
$$ 407963 420295 428480 431624 429696 423653 414670 403982 392926 381924 369888 356026 341802
54712C41802j2202r816q966q665p083m662l159k801k446j771j408j379j021j70
$$ 341802 329600 319784 310818 302153 295070 290408 287249 284448 282002 280231 278823 277444 276423 276253
54698B76253Q58K113L737N338O572P951J0158J2962J5438J6909J7237J6867J6813
$$ 276253 277111 279224 282961 288299 294871 302822 312980 325942 341380 358289 375526 392393 409206
54685D09206J7819J9158J9276J7748J5400J2290P387Q26n214q960j0974j2734
$$ 409206 427025 446183 465459 483207 498607 510897 518284 519110 513896 504936 493962 481228
54673D81228j4619j6301j7765j8860j8949j7998j6871j5855j4238j2145j1035
$$ 481228 466609 450308 432543 413683 394734 376736 359865 344010 329772 317627 306592
54662C06592j1366j1388r614p080n638n431n575n990o816p106n955m126k961k286
$$ 306592 295226 283838 274224 267144 261506 256075 250500 244510 237694 230588 224633 220507 217546 215260
54648B15260j077M05P95k13j392j643j099n19l96o41q11o75n80p46l94J260L234
$$ 215260 214183 214588 215383 215170 213778 212135 211036 210517 210121 209480 208669 207994 207414 206668 206274 207534 210768
54631B10768L460J587l92q09m5R10J800K165J026j265k481j329O81J588J630K039
$$ 210768 214228 215815 215423 214614 214569 215479 217279 219444 220470 219205 216724 215395 216076 217664 219294 221333
54615B21333K588K297J618J910L318M758N604O051O256O251O284O310N774M748
$$ 221333 223921 226218 227836 229746 233064 237822 243426 249477 255733 261984 268268 274578 280352 285100
54601B85100M489N844P827Q724P951O107M085K831K921L653L635K831K654L435
$$ 285100 289589 295433 303260 311984 319935 326042 330127 332958 335879 339532 343167 345998 348652 352087
54587C52087L655K697K193L102L528J655q70j044J137L085L706M412O182Q088
$$ 352087 355742 358439 360632 363734 367262 368917 368047 367003 368140 371225 374931 379343 385525 393613
54573C93613R113R498R736R797R811J0228J0698R768O433J553k859n678p764j0734
$$ 393613 402726 412224 421960 431757 441568 451796 462494 472262 478695 480248 477389 471711 463947 453213
54559D53213j4559j7094j6669j4406j2670j1882j0679q844p653p140n686l029
$$ 453213 438654 421560 404891 390485 377815 365933 355254 346410 338757 331617 325931 322902
54547C22902j104o88J21K432M097K848o1j688j349n96n37j252k694m313m854m116
$$ 322902 321798 321110 321231 323663 327760 330608 330547 328859 327510 326914 326377 325125 322431 318118 313264 309148
54531C09148l658m371n031m865n408p607r209p893n213m334n151n013l401k431
$$ 309148 305490 301119 296088 291223 285815 278208 268999 261106 255893 251559 246408 241395 237994 235563
54517B35563l003l728l898m611o407q153q695p873n746k661PR19N30K12P6n43
$$ 235563 232560 228832 224934 220323 213916 205763 197068 189195 183449 180788 180795 181714 182244 182456 182532 181989
54501A81989j137p08Q2k89j519j857r83k45j30K85J288K057K295K400K051N94
$$ 181989 180852 180144 180226 179937 178418 176561 175578 175333 175203 175488 176776 178833 181128 183528 185579 186173
54485A86173j174j661q73j87J42J028K157K009N55l40K31J113J316J432K134L069
$$ 186173 184999 183338 182465 182278 182420 183448 185605 187614 188169 187829 188060 189173 190489 191921 194055 197124
54469A97124L791M295M272L471K967M250O751Q093P295N848N183M863L937K367
$$ 197124 200915 205210 209482 212953 215920 220170 226921 235014 242309 248157 253340 258203 262140 264507
54455B64507M75j623l352l919l694m071n481o772o912o081m844l603k971l312
$$ 264507 264982 263359 260007 256088 252394 248323 242842 236070 229158 223077 218233 214630 211659 208347
54441B08347l789l254k129j788k232k123j222q05j320j631j140q05j338j970j760
$$ 208347 204558 201304 199175 197387 195155 193032 191810 191005 189685 188054 186914 186109 184771 182801 181041
54426A81041p79N36J895K604J972N81k19k99o23j043j53K067L450K429J28j225
$$ 181041 180262 180798 182693 185297 187269 187850 187631 187332 186709 185666 185513 187580 191030 193459 193587 192362
54410A92362p00J141L177M142L363J721R02J348K049K434K942L508L099J342p86
$$ 192362 191662 192803 195980 200122 203485 205206 206108 207456 209505 211939 214881 218389 221488 222830 222044
54395B22044k300l092l210k717k360k863l432k718j251q97j739j842o20N3r19
$$ 222044 219744 216652 213442 210725 208365 205502 202070 199352 198101 197204 195465 193623 193003 193056 192137
54380A92137j952j461k99Q8K7L93N59n01k089k529j486j84J67p14k191l007k313
$$ 192137 190185 188724 188425 188513 188540 188933 189492 188991 186902 184373 182887 182703 182870 182156 179965 176958 174645
54363A74645r64p30j766k152o95J300K090J973K430L728M689M283K533L16j041
$$ 174645 173681 172951 171185 169033 168338 169638 171728 173701 176131 179859 184548 188831 191364 191680 190639
54348A90639n83J357L538N275O637P318O641M967L693L442L611M049N470P626
$$ 190639 190056 191413 194951 200226 206863 214181 220822 225789 229482 232924 236535 240584 246054 253680
54334B53680Q816Q144O769O084O020O005O053O088N628N012N387O554O485L967
$$ 253680 262496 270640 277409 283493 289513 295518 301571 307659 313287 318299 323686 330240 336725 340692
54320C40692J97l200n941p743p391m903k832l311n183o024n801o252p589q142
$$ 340692 340889 337689 331748 324005 316614 311711 308879 305568 300385 294361 288560 282308 274719 266577
54306B66577p101n549m759m894n382n478m566k852j454j004p72J01J230J795J888
$$ 266577 259476 253927 249168 244274 238892 233414 228848 225996 224542 223538 222766 222867 224097 225892 227780
54291B27780K008K057J826J672J743J479Q52R60K173K993K285J484K618N057O357
$$ 227780 229788 231845 233671 235343 237086 238565 239417 240377 242550 245543 247828 249312 251930 256987 263344
54276B63344N886N417O217P430P712O821N303L800K931K725K129J51k488l977
$$ 263344 269230 274647 280864 288294 296006 302827 308130 311930 314861 317586 319715 319866 317378 313401
54262C13401l780l180l375m169m923n747p053q581r509r365q535p859p711p544
$$ 313401 309621 306441 303066 298897 293974 288227 281174 272593 263084 253719 245184 237325 229614 222070
54248B22070o715n648n415n943n754m106k398k339l464l885l061k363k885l907
$$ 222070 215355 209707 204292 198349 192595 188489 186091 183752 180288 176403 173342 170979 168094 164187
54234A64187m059l062j728o58M31J995L591L889K112p72k874l325k775k018j118
$$ 164187 160128 157066 155338 154680 155111 157106 160697 164586 166698 165926 163052 159727 156952 154934 153816
54219A53816j07M38J34n52r23p71k17M82P17j5j117j334n87j41m84l15J429L713
$$ 153816 153709 154147 154281 153729 152806 152035 151818 152300 153017 153002 151885 150551 149964 149823 149339 149024 150453 154166
54201A54166M726M117K780J329jn87L5J117J363N25n06j012j083j092j187j217
$$ 154166 158892 163009 165789 167118 167117 166530 166565 167682 169045 169570 169064 168052 166969 165877 164690 163473
54185A63473q25P4P93N07m19o28L45J344J248K82q64k108l287l543k388n75R80
$$ 163473 162648 162722 163515 164022 163603 162975 163320 164664 165912 166194 165330 163222 159935 156392 154004 153429 154409
54168A54409K190K913K325L15j479j420kR60O07m44j198q74P22K393K212K7j779
$$ 154409 156599 159512 161837 162152 160673 159253 159251 160211 160818 160374 159176 158302 159024 161417 163629 163656 161877
54151A61877j320K14N44l54q57o20n50n45L46J571J322n88k226k378j898j595
$$ 161877 160557 160771 161315 160961 160104 159484 158934 158389 158735 160306 161628 161040 158814 156436 154538 152943
54135A52943p88R02K032J062j219k435j467M24J243M55n95k66J386K492J506p78
$$ 152943 152155 153057 155089 156151 154932 152497 151030 151454 152697 153152 152557 152291 153677 156169 157675 156897
54119A56897k036j074R71K089J346p55l059m422m058j835J486M442N676M973L347
$$ 156897 154861 153787 154758 156847 158193 157438 154379 149957 145899 144064 145550 149992 155668 160641 163988
54104A63988J765M8k277m300m210j833O57J412J151J599K574K243J11j801j308
$$ 163988 165753 165801 163524 159224 155014 153181 153838 155250 156401 158000 160574 162817 162928 161127 159819
54089A59819J174K950K010q04k810k421m85J433K935M108M038J878j037k151j074
$$ 159819 160993 163943 165953 165149 162339 159918 159433 160866 163801 167909 171947 173825 172788 170637 169563
54074A69563l2o04j970k998l983n171n503m253k384r43L26J598J927J118Q55K114
$$ 169563 169531 168927 166957 163959 159976 154805 149302 145049 142665 141722 142048 143646 145573 146691 147546 149660
54058A49660L094J797p30k040j961k176k987l038j893n76L19J046J346N78p31
$$ 149660 152754 154551 153821 151781 149820 147644 144657 141619 139726 139150 139469 140515 141861 142439 141708
54043A41708j173l11J024K135K786K580J431K23k44m97j249j884j618j134j353
$$ 141708 140535 140224 141248 143383 146169 148749 150180 150403 150159 149662 148413 146529 144911 143777 142424
54028A42424j422p6J837K332J226j25j312k695l369k126r7L91m79l29J265K095
$$ 142424 141002 140926 142763 145095 146321 146196 144884 142189 138820 136694 136597 136988 136509 136180 137445 139540
54012A39540J349J070K430L530K617J031J029K452L372K687O08k199m466m596
$$ 139540 140889 141959 144389 147919 150536 151567 152596 155048 158420 161107 161715 159516 155050 150454
53998A50454k444L3J129J377K143L233L290J967M18j50M00J343J906K004K229
$$ 150454 148010 148043 149172 150549 152692 155925 159215 161182 161600 161450 161850 163193 165099 167103 169332
53983A69332K893L436L484L942N710P645P476M909K185J174J480J985K706M179
$$ 169332 172225 175661 179145 183087 188797 196442 203918 208827 211012 212186 213666 215651 218357 222536
53969B22536O264Q372R998J0442R098O635M885M880N840O592O912P019O804O271
$$ 222536 228800 237172 247170 257612 266710 273345 278230 283110 288950 295542 302454 309473 316277 322548
53955C22548N789N416M747L816L242L113K815K195J806J653R88k90j285j609j903
$$ 322548 328337 333753 338500 342316 345558 348671 351486 353681 355487 357140 358128 357838 356553 354944 353041
53940C53041k269j761k08R00M30o40p63j70l85j923l545l728k221l42R2j415l298
$$ 353041 350772 349011 348803 349703 350133 349493 348730 348560 348175 346252 342707 338979 336758 336416 336508 335093 331795
53923C31795l682k760k308k931l386k977k827l851n046n030m169l750l933l915
$$ 331795 328113 325353 323045 320114 316728 313751 310924 307073 302027 296997 292828 289078 285145 281230
53909B81230l515l289l304k952j888m07J030J891J515k89k574l794l195j429L26
$$ 281230 277715 274426 271122 268170 266282 265875 266905 268796 270311 270022 267448 263654 260459 259030 259356
53894B59356J581K776M179M956M006J865Q30K411N335P029O530M939L600L128
$$ 259356 260937 263713 267892 272848 276854 278719 279549 281960 287295 294324 300854 305793 309393 312521
53880C12521L780N338O720O948O441O296O713P228P888Q678Q565O975N523O040
$$ 312521 316301 321639 328359 335307 341748 348044 354757 361985 369873 378551 387116 394091 399614 405654
53866D05654P353O746M311K868L185K639l26l475m187k971j640k98J678L407L619
$$ 405654 413007 419753 424064 426932 430117 432756 432430 428955 424768 421797 420157 419859 421537 424944 428563
53851D28563K695J810J103M97R66L052N197N587M895N209O742P570O326L711J314
$$ 428563 431258 433068 434171 434668 435634 438686 443883 449470 454365 459574 466316 473886 480212 483923 485237
53836D85237J67L16Q60P05j44o48o62j618m294p004p550o145m931n083n881o431
$$ 485237 485404 485720 486580 487285 487141 486493 485831 484213 479919 472915 465365 459220 454289 449206 443325 436894
53820D36894o907p918r439j0552j0100p995n896n689p024p604o318m703m542n556
$$ 436894 429987 422069 412630 402078 391978 383983 378087 372398 365374 357770 351452 346749 342207 336651
53806C36651o557p347q080p946o263l983k633k438k804l672m971n669n089m492
$$ 336651 330094 322747 314667 306721 300458 296475 293842 291404 288600 284928 279957 274288 269199 264707
53792B64707n480p251p283m734j630m11j430l061l481k325r86j022k081k247q94
$$ 264707 259227 251976 244693 239959 238329 237918 236488 233427 229946 227621 226635 225613 223532 221285 220391
53777B20391K02n33k150k741k097j327q99q55j840l913n085l258O14L360L499
$$ 220391 220593 220060 217910 215169 213072 211745 210846 209991 208151 204238 199153 195895 196509 199869 203368
53762B03368K487K051K307K692K975K740J403n99j849j673q13k3R52K443L865
$$ 203368 205855 207906 210213 212905 215880 218620 220023 219424 217575 215902 215089 215066 216018 218461 222326
53747B22326M209L134J265j19J98K279M640N532M698L335K511K340K538L051M004
$$ 222326 226535 229669 230934 230815 231013 233292 237932 243464 248162 251497 254008 256348 258886 261937 265941
53732B65941N497P423R149R683Q618O622M605K945J920K133L706N540O163N004
$$ 265941 271438 278861 288010 297693 306311 312933 317538 320483 322403 324536 328242 333782 339945 344949
53718C44949K418p99l349l896k539j083q81j218q35j11l48j649l039m157n341
$$ 344949 347367 346568 343219 339323 336784 335701 334820 333602 332767 332656 332308 330659 327620 323463 318122
53703C18122o310o277n252l898k311j63J962K716J613m47k337l470l659l137k670
$$ 318122 311812 305535 300283 296385 294074 293911 295873 298589 300202 299755 297418 293948 290289 287152 284482
53688B84482k724k689j752k96M61O7q63j595j746j141m1Q25J220J763K568K427
$$ 284482 281758 279069 277317 277021 277482 277549 276686 275091 273345 272204 272163 272988 274208 275971 278539 280966
53672B80966O90r41k16K506M574M410K990J933J752K315L608N369O730O847N623
$$ 280966 281656 280715 280499 283005 287579 291989 294979 296912 298664 300979 304587 309956 316686 323533 329156
53657C29156L867K893L379M270L780J997J243K720M249L137N8k045k139j679j547
$$ 329156 333023 335916 339295 343565 347345 349342 350585 353305 357554 360691 360749 358704 356565 354886 353339
53642C53339j060k45n13k256l843l880k813j591l14R14J327P07J95R06K597M329
$$ 353339 352279 352034 351521 349265 345422 341542 338729 337138 336824 337738 339065 339772 339967 340873 343470 347799
53626C47799N630O424O591O112N017L009J36k146j906O79K931K809J512J845M489
$$ 347799 353429 359853 366444 372556 377573 380582 380718 378572 376666 377345 380276 383085 384597 386442 390931
53611C90931P043O836L881O03r37q43k21Q29K887N215N870M402K747K376K122
$$ 390931 397974 404810 408691 409294 408357 407514 407293 408122 411009 416224 422094 426496 429243 431619 433741
53596D33741L67j973k723j817j185j685k273k194k003k132k189k061k266k833
$$ 433741 434108 432135 429412 427595 426410 424725 422452 420258 418255 416123 413934 411873 409607 406774
53582D06774l055k639k094j928k297l229m231m180k811j574j626j776k48K193
$$ 406774 403719 401080 398986 397058 394761 391532 387301 383121 380310 378736 377110 375334 375086 377279
53568C77279L147K176J135J039J047Q41J522L437N134N302M110K298N47j7J364
$$ 377279 380426 382602 383737 384776 385823 386664 388186 391623 396757 402059 406169 408467 409014 408997 410361
53553D10361L447M125L411L222M056M372L720L764N203O322N943N414O068O807
$$ 410361 413808 417933 421344 424566 428622 432994 436714 440478 445681 452003 457946 463360 469428 476235
53539D76235O060M422L563L861M650N524O100N828N216N750P464Q180O659M673
$$ 476235 482295 486717 490280 494141 498791 504315 510415 516243 521459 527209 534673 542853 549512 554185
53525E54185M387N194N121L954K979K698K770L374M638N324M021J352n17l94J051
$$ 554185 558572 563766 568887 572841 575820 578518 581288 584662 589300 594624 598645 599997 599480 599086 600137
53510F00137K454K721J480k21l10J906M284M069J241j536k007l53J671K629K528
$$ 600137 602591 605312 606792 606571 606261 608167 612451 616520 617761 616225 614218 613865 615536 618165 620693
53495F20693K572L694N254N874N561N732O740P059N698L971L609M489N486O388
$$ 620693 623265 626959 632213 638087 643648 649380 656120 663179 668877 672848 676457 680946 686432 692820
53481F92820P521Q555R165R970J1353J2258J1669J0514J0558J1975J3448J4105
$$ 692820 700341 708896 718061 728031 739384 751642 763311 773825 784383 796358 809806 823911
53469H23911J3976J3076J1532J0323J0566J2250J4474J6449J7518J7048J5546
$$ 823911 837887 850963 862495 872818 883384 895634 910108 926557 944075 961123 976669
53458I76669J4898J6226J8279J9296J9571K0579K2328K3387K3211K2794K3117
$$ 976669 991567 1007793 1026072 1045368 1064939 1085518 1107846 1131233 1154444 1177238 1200355
53447A200355K4341K6328K8687L0533L1323L1654L2268L2902L3217L3977L5915
$$ 1200355 1224696 1251024 1279711 1310244 1341567 1373221 1405489 1438391 1471608 1505585 1541500
53436A541500L8194L9611M0581M2166M3859M4312M3725M3423M3415M2656M1562
$$ 1541500 1579694 1619305 1659886 1702052 1745911 1790223 1833948 1877371 1920786 1963442 2005004
53425B005004M1826M3450M4386M3670M2684M2409M1646L9329L6792L6037L6909
$$ 2005004 2046830 2090280 2134666 2178336 2221020 2263429 2305075 2344404 2381196 2417233 2454142
53414B454142L7499L6681L4903L3054L1647L0837L0279K9085K6601K3194J9967
$$ 2454142 2491641 2528322 2563225 2596279 2627926 2658763 2689042 2718127 2744728 2767922 2787889
53403B787889J7799J6756J6004J4258J0821O467K845Q33j81j415l686p246j1748
$$ 2787889 2805688 2822444 2838448 2852706 2863527 2869994 2872839 2873672 2873491 2872076 2868390 2861144 2849396
53390B849396j6020j8587j9029j8553j8826k0425k2581k4265k5286k6414k8427
$$ 2849396 2833376 2814789 2795760 2777207 2758381 2737956 2715375 2691110 2665824 2639410 2610983
53379B610983l1102l3365l4491l4806l4884l4758l4342l4054l4166l3893l2211
$$ 2610983 2579881 2546516 2512025 2477219 2442335 2407577 2373235 2339181 2305015 2271122 2238911
53368B238911k9428k7030k5833k5094k3718k1627j9470j7421j4838j1166o923
$$ 2238911 2209483 2182453 2156620 2131526 2107808 2086181 2066711 2049290 2034452 2023286 2016363
53357B016363l500j783j183m04J028K687M481O940R962J2422J3607J4227J5334
$$ 2016363 2012863 2011080 2009897 2009493 2010521 2013208 2017689 2024629 2034591 2047013 2060620 2074847 2090181
53344B090181J7137J9537K2789K6665L0003L2152L4021L6472L8676L9524L9913
$$ 2090181 2107318 2126855 2149644 2176309 2206312 2238464 2272485 2308957 2347633 2387157 2427070
53333B427070M1859M5725N0049N3820N7268O0496O3086O5245O7624O9716P0095
$$ 2427070 2468929 2514654 2564703 2618523 2675791 2736287 2799373 2864618 2932242 3001958 3072053
53322C072053O8863O8249O9897P2737P4562P4833P4850P5751P7199P7949P6943
$$ 3072053 3140916 3209165 3279062 3351799 3426361 3501194 3576044 3651795 3728994 3806943 3883886
53311C883886P4000O9766O5178O0926N7250N3881M9994M4863L9041L4125L0562
$$ 3883886 3957886 4027652 4092830 4153756 4211006 4264887 4314881 4359744 4398785 4432910 4463472
53300D463472K6380J9370J0114J449n114j0987j8263k7000l5296m1157m3973m4905
$$ 4463472 4489852 4509222 4519336 4520785 4515671 4504684 4486421 4459421 4424125 4382968 4338995 4294090
53288D294090m6202m9486n4267n8582o1136o2337o3295o4621o6327o8048o9037
$$ 4294090 4247888 4198402 4144135 4085553 4024417 3962080 3898785 3834164 3767837 3699789 3630752
53277C630752o8519o6369o3234n9975n7342n5848n5353n4905n3745n2176n0890
$$ 3630752 3562233 3495864 3432630 3372655 3315313 3259465 3204112 3149207 3095462 3043286 2992396
53266B992396m9788m8370m6824m5576m3991m0910l6518l2410k9532k7241k4753
$$ 2992396 2942608 2894238 2847414 2801838 2757847 2716937 2680419 2648009 2618477 2591236 2566483
53255B566483k2433k1057k0731k1051k1655k2141k2008k1128j9814j8330j6765
$$ 2566483 2544050 2522993 2502262 2481211 2459556 2437415 2415407 2394279 2374465 2356135 2339370
53244B339370j5326j4158j2934j1296r558q201o911n111l148j812q79N69K421
$$ 2339370 2324044 2309886 2296952 2285656 2276098 2267897 2260986 2255875 2252727 2250915 2250036 2250605 2253026
53231B253026L698M615O810J0975J5735J9578K2537K5147K7177K8483K9923L2168
$$ 2253026 2256724 2261339 2268149 2279124 2294859 2314437 2336974 2362121 2389298 2417781 2447704 2479872
53219B479872L4408L5504L5817L6608L8027L8791L7857L5519L2873L0693K8912
$$ 2479872 2514280 2549784 2585601 2622209 2660236 2699027 2736884 2772403 2805276 2835969 2864881
53208B864881K6902K4393K2025K0426J8850J5618J0337M735O71j927m471p763
$$ 2864881 2891783 2916176 2938201 2958627 2977477 2993095 3003432 3008167 3008838 3006911 3002440 2994677
53196B994677j1393j4603j6950j8561k0306k3232k7181l0503l1919l2149l2836
$$ 2994677 2983284 2968681 2951731 2933170 2912864 2889632 2862451 2831948 2800029 2767880 2735044
53185B735044l4253l5172l4873l4217l4416l5543l6647l6879l6132l4828l3394
$$ 2735044 2700791 2665619 2630746 2596529 2562113 2526570 2489923 2453044 2416912 2382084 2348690
53174B348690l1904l0184k8267k6599k5728k5745k6120k6022k4872k2722k0159
$$ 2348690 2316786 2286602 2258335 2231736 2206008 2180263 2154143 2128121 2103249 2080527 2060368
53163B060368j7750j5695j4052j2984j2431j1911j1173j0822j1523j2680j2829
$$ 2060368 2042618 2026923 2012871 1999887 1987456 1975545 1964372 1953550 1942027 1929347 1916518
53152A916518j1497r774q799q571q708r600j1869j5141j8130j9859k0334k0182
$$ 1916518 1905021 1895247 1886448 1877877 1869169 1859569 1847700 1832559 1814429 1794570 1774236 1754054
53140A754054k0102k0539k1486k2435k2780k2255k1052j9705j8822j8688j8954
$$ 1754054 1733952 1713413 1691927 1669492 1646712 1624457 1603405 1583700 1564878 1546190 1527236
53129A527236j9126j9330k0232k2000k3864k4985k5384k5633k6082k6689k7361
$$ 1527236 1508110 1488780 1468548 1446548 1422684 1397699 1372315 1346682 1320600 1293911 1266550
53118A266550k7901k7875k7075k6017k5461k5335k4760k3439k2448k2900k4102
$$ 1266550 1238649 1210774 1183699 1157682 1132221 1106886 1082126 1058687 1036239 1013339 989237
53107I89237k4005k1830j9236j8298j9011j9854k0099k0160j9869j8318j5873
$$ 989237 965232 943402 924166 905868 886857 867003 846904 826744 806875 788557 772684
53096G72684j4532j5204j6085j5144j3077j2178j3076j4376j5002j5099j4681
$$ 772684 758152 742948 726863 711719 698642 686464 673388 659012 644010 628911 614230
53085F14230j3242j1091r650r682j0280j0056q635o680n165m828n530o085n361
$$ 614230 600988 589897 580247 570565 560285 550229 541594 534914 529749 524921 519391 513306 507945
53072E07945l724k514k202j986j334q43j177j967k366k201k113k745l837m116
$$ 507945 504221 501707 499505 497519 496185 495342 494165 492198 489832 487631 485518 482773 478936 474820
53058D74820k469M36K401K228J264J484K851L924M380N109O064N942M332K535
$$ 474820 472351 472787 475188 477416 478680 480164 483015 486939 491319 496428 502492 508434 512766 515301
53044E15301J748J684J511R36q5j668l565n286o778q204r236r540r665j0057r722
$$ 515301 517049 518733 520244 521180 521095 519427 515862 510576 503798 495594 486358 476818 467153 457096 447374
53029D47374p570m876m209n852p482p786p930q674q557o477l994l316m407n771
$$ 447374 439804 434928 430719 424867 417385 409599 401669 392995 384438 377961 373967 370651 366244 360473
53015C60473o771p575p843p065n641m389l622l444m095n099n224m105k845k181
$$ 360473 353702 346127 338284 331219 325578 321189 317567 314123 310028 304929 299705 295600 292755 290574
53001B90574j332L98K154K777K285J089q82l167m365m108l969m867n125k888P60
$$ 290574 289242 289640 291794 294571 296856 297945 297063 293896 289531 285423 281454 276587 271462 268574 269334
52986B69334L109L244K236R46l65j020n99j49q92k220k624j972j210n59J35J11
$$ 269334 272443 275687 277923 278869 278504 277484 276885 276736 275844 273624 271000 269028 267818 267259 267394 267505
52970B67505j115k025r57R16J056l11m82J223K275J054o95q62p6r7q91j123m14
$$ 267505 266390 264365 263408 264324 265380 265069 264587 265810 268085 269139 268444 267582 267506 267409 266518 265395 264981
52953B64981N57J453K325K707J933K79j028j019J54J354J387J34j160j206j02
$$ 264981 265538 266991 269316 272023 273956 274235 273207 272188 272342 273696 275083 275217 274057 272851 272749
52938B72749J120K086L216M392M787M228L593L355K802J365j49n21K78J124J153
$$ 272749 273869 275955 279171 283563 288350 292578 296171 299526 302328 303693 303544 303023 303301 304425 305578
52923C05578N73J19J37L16L00M36J380K911L809L473K907L206L829L542K617K590
$$ 305578 306151 306270 306407 306723 307023 307459 308839 311750 315559 319032 321939 325145 328974 332516 335133 337723
52907C37723L957N585O570P381Q703J0344J1678J2281J1816J0187Q120O626N717
$$ 337723 341680 347265 353835 361216 369919 380263 391941 404222 416038 426225 434345 440971 446688
52894D46688M570L130K293K130J405m83k296k816k735l490m956n731n386n048
$$ 446688 451258 454388 456681 458811 460216 459733 457437 454621 451886 448396 443440 437709 432323 427275
52880D27275n535o048n284l301j607j522k788l981m182l808l803m352m808m624
$$ 427275 421740 415692 410408 407107 405500 403978 401190 397209 393027 389219 385416 381064 376256 371632
52866C71632l790k519j121j47j3l47l12L01P53L71n83j251j103l17M12L86n38
$$ 371632 367842 365323 364202 364055 364042 363695 363383 363684 364437 364808 364225 362974 361871 361554 361966 362352 361814
52849C61814j719k280j907r50J48J185J962K131J401p0j511j890p89J022K254
$$ 361814 360095 357815 355908 354958 355106 356291 358253 360384 361785 361715 360204 358314 357525 358547 360801
52834C60801K367J741O90p30j838j406P20L020M044L906L271K039J66j172p79
$$ 360801 363168 364909 365599 364869 363031 361625 362345 365365 369409 373315 376586 378625 378791 377619 376840
52819C76840P66J823J779J125K04p40q60K27J098J37j789k178m03J598K292K118
$$ 376840 377606 379429 381208 382333 382537 381797 380937 381164 382262 382399 380610 378432 378029 379627 381919 384037
52803C84037J694P03n68m94J678M330N431M914M035L406K858K499K697L353M020
$$ 384037 385731 386434 385866 385372 387050 391380 396811 401725 405760 409166 412024 414523 417220 420573 424593
52788D24593M280L804K595J582K038M023O221P668Q583R209R133Q421Q074Q488
$$ 424593 428873 432677 435272 436854 438892 442915 449136 456804 465387 474596 483729 492150 500224 508712
52774E08712Q528P184N045L188J607j74j911l256m680o537p938p876o881o251
$$ 508712 517240 524424 529469 532657 534264 534090 532179 528923 524243 517706 509768 501892 495011 488760
52760D88760o128n742n108n195o364p848q768q703p479n448l849l821m932n720
$$ 488760 482632 476890 471782 466587 460223 452375 443607 434904 427425 421977 418128 414307 409375 403655
52746D03655n624n370n338m816l351j888j731k882m109m461m105l585k963k067
$$ 403655 398031 392661 387323 382507 379156 377268 375537 372655 368546 364085 359980 356395 353432 351365
52732C51365j362j787l323m475l965k607k317l374l989l044j751j681k387k398
$$ 351365 350003 348216 344893 340418 336453 333846 331529 328155 324166 321122 319371 317690 315303 312905
52718C12905j723j712k756l663l513k822k510k739l205l691l778k810q43Q15Q38
$$ 312905 311182 309470 306714 303051 299538 296716 294206 291467 288262 284571 280793 277983 277140 277955 278793
52703B78793m94j506j153k10m3o11n20P50J717P59j518k994k865k377k620l130
$$ 278793 278299 276793 275640 275430 275387 274776 274256 275006 276723 277482 275964 272970 270105 267728 265108 261978
52687B61978l270l566m547n388n136m395m342m602l707j563J02j9j313k288k142
$$ 261978 258708 255142 250595 245207 240071 235676 231334 226732 223025 221462 221564 221545 220232 217944 215802
52672B15802j044J25J45j525l680m231k504R1J891K527K248R84j019k467k182
$$ 215802 214758 214883 215028 213503 209823 205592 203088 203179 205070 207597 209845 210829 209810 207343 205161
52657B05161o45O43J074J203J302P45p51k217k453j510n01j30p8J89O23Q73R89
$$ 205161 204516 205159 206233 207436 208738 209483 208732 206515 204062 202552 202051 201921 201843 202032 202655 203528 204517
52640B04517J325J866K149K065K300L538N437O793O853O078N513N704O399P002
$$ 204517 205842 207708 209857 211922 214222 217760 223197 229990 236843 242921 248434 254138 260537 267539
52626B67539O983O022M261K373J015J14r29k196k973k821k479l108m856o800q158
$$ 267539 274522 280544 284805 287178 288193 288307 287378 285182 282209 279388 276909 273801 268945 262145 253987
52611B53987q824q714p504n433l667l216l829m387m091k963j650j075j757l014
$$ 253987 245163 236449 228945 223512 219845 216629 212800 208413 204322 201359 199709 198634 196877 193863
52597A93863l397k471j557j915k895k922j837r10p62o94l12l91j436k485k220
$$ 193863 190466 187995 186438 184523 181628 178706 176869 175959 175197 174503 174191 173800 172364 169879 167659
52582A67659o66Q30J008l36k329l568l140j459J80J013J353J643J729J332O57
$$ 167659 166993 167823 168831 168495 166166 162598 159458 157999 158179 159192 160545 162188 163917 165249 165906
52567A65906J34P6P10J845K347R96j625l196k390o71l29j519k489k240j387n16
$$ 165906 166040 166116 166826 168671 171018 172014 170389 167193 164803 164132 163803 162284 159795 157555 156168 155652
52551A55652P33K404L393K783J279L92O04J148J393J480J531J081j65j501j897
$$ 155652 156385 158789 162182 164965 166244 166636 167240 168388 169781 171261 172792 173873 173708 172207 170310
52536A70310j227l11K43N57Q08Q02N53O00J244J946K033J588R82R9j207k198j720
$$ 170310 169083 168772 169015 169572 170380 171182 171735 172335 173579 175525 177558 179146 180128 180227 179020 176822 175102
52519A75102L44K866M627N120M487L389K859L340L936L338J474n98k176l265l650
$$ 175102 175446 178312 182939 188059 192546 195935 198794 202134 206070 209408 210882 210284 208108 204843 201193
52504B01193k885j337J2R80K264L774M337L481K217J431Q18K22N87K352L995L626
$$ 201193 198308 196971 196983 197963 200227 204001 208338 211819 214036 215467 216285 216507 217094 219446 223441 227067
52488B27067J466n22j041l92N63J263J391R82O41R74J880K815L557M219M759M981
$$ 227067 228533 228011 226970 226578 227141 228404 229795 230777 231418 232392 234272 237087 240644 244863 249622 254603
52472B54603M853M370L495K369J298K90p87j443q27R21K434K799K498K104J136
$$ 254603 259456 263826 267321 269690 270988 271278 270491 269048 268221 269142 271576 274375 276873 278977 280113
52457B80113q46k873l503k567r19Q74K499L159K258O48k8O84J668J784R61k30
$$ 280113 279267 276394 272891 270324 269405 270279 272778 275937 278195 278843 278815 279499 281167 282951 283912 283682
52441B83682j265j851k021k162k558k858k357p41J467K978K499K65j458o24J704
$$ 283682 282417 280566 278545 276383 273825 270967 268610 267869 269336 272314 274813 275078 273620 272996 274700
52426B74700K385N96q48K83K163J712q15k499k113j056l50N81J914K622K282J724
$$ 274700 277085 277681 276833 277116 279279 280991 280176 277677 275564 274508 274158 274739 276653 279275 281557 283281
52410B83281J294K75j255j814o58R92J819K201L120M375M941M328K785Q39p36
$$ 283281 284575 284850 283595 281781 281123 282115 283934 286135 289255 293630 298571 302899 305684 306523 305787
52395C05787j251r44o78m47O94K651L566K133l11j346m65P03R54R13J718L191
$$ 305787 304536 303592 302914 302467 303161 305812 309378 311511 311200 309854 309389 310092 311046 311959 313677 316868
52379C16868L927K970J067j01R9M46l32j454r98J109K547J703l9k64J160K243
$$ 316868 320795 323765 324832 324731 324830 325276 324944 323490 322492 323601 326148 327851 327812 327548 328708 330951
52363C30951J966J499K088L035K751J137j00M52K223L512L659L544L877L909K643
$$ 330951 332917 334416 336504 339539 342290 343427 343327 343779 346002 349514 353173 356717 360594 364503 367146
52348C67146P70K18J677L701M567M192L553L082K503J805J409J388J299R27N90
$$ 367146 367916 368134 369811 373512 378079 382271 385824 388906 391409 393214 394623 396011 397310 398237 398827
52333C98827M96K48p24k334l756m185l644l016l188m082m617l756j586P27K069
$$ 398827 399323 399571 398847 396513 392757 388572 384928 381912 378724 374642 370025 366269 364683 365410 367479
52318C67479K326K163K021J598M12j368k848l111j953j57Q94L01j263j873l30
$$ 367479 369805 371968 373989 375587 375999 374631 371783 368672 366719 366562 367456 367757 366494 364621 364291
52303C64291K393M218M217L147K127J764K304L372L536J628j117j766P39M095
$$ 364291 366684 370902 375119 378266 380393 382157 384461 387833 391369 392997 391880 390114 390853 394948
52289C94948N681N627N674O314O723O607O385O101N741O099P583Q644P295M068
$$ 394948 400629 406256 411930 418244 424967 431574 437959 444060 449801 455900 463483 472127 479422 483490
52275D83490J608J299K030K501K870L583M360N057O144P501Q056P529P233Q229
$$ 483490 485098 486397 488427 490928 493798 497381 501741 506798 512942 520443 528499 536028 543261 551490
52261E51490R708J0324J0235J0509J1173J0988R253O884N577O233Q308J0526J2226
$$ 551490 561198 571522 581757 592266 603439 614427 623680 630564 636141 642374 650682 661208 673434
52248F73434J3843J5854J7788J8915J9448K0052K0430J9766J8550J8502K0157
$$ 673434 687277 703131 720919 739834 759282 779334 799764 819530 838080 856582 876739
52237H76739K1989K2688K3069K4609K6983K8426K8150K7304K7514K9152L1188
$$ 876739 898728 921416 944485 969094 996077 1024503 1052653 1079957 1107471 1136623 1167811
52226A167811L2372L2507L2537L3241L4116L4201L3744L3980L5069L5477L4039
$$ 1167811 1200183 1232690 1265227 1298468 1332584 1366785 1400529 1434509 1469578 1505055 1539094
52215A539094L1598K9777K8939K8319K7564K6899K6024K4047K0812J7467J5305
$$ 1539094 1570692 1600469 1629408 1657727 1685291 1712190 1738214 1762261 1783073 1800540 1815845
52204A815845J4425J3910J3124J2388J2194J2009J0515P259L571J267P89J176
$$ 1815845 1830270 1844180 1857304 1869692 1881886 1893895 1904410 1911669 1915240 1916507 1917296 1918472
52192A918472J526J690J651J300J036J661L373N425P046Q137Q923R585J0505J2179
$$ 1918472 1919998 1921688 1923339 1924639 1925675 1927336 1930709 1936134 1943180 1951317 1960240 1969825 1980330 1992509
52178A992509J4566J6933J8583J9386J9559J9476J9697K0588K1811K2653K2839
$$ 1992509 2007075 2024008 2042591 2061977 2081536 2101012 2120709 2141297 2163108 2185761 2208600
52167B208600K2505K1595J9902J7589J5031J2431J0158Q907Q523P417M499J110
$$ 2208600 2231105 2252700 2272602 2290191 2305222 2317653 2327811 2336718 2345241 2352658 2357157 2358267
52155B358267p23j511l649p588j1153j3206j5376j8902k2136k3163k3068k4257
$$ 2358267 2357544 2356033 2352384 2344796 2333643 2320437 2305061 2286159 2264023 2240860 2217792 2193535
52143B193535k6611k7734k6693k5243k5122k5949k6453k6441k6571k6827k6263
$$ 2193535 2166924 2139190 2112497 2087254 2062132 2036183 2009730 1983289 1956718 1929891 1903628
52132A903628k4409k2233k1099k0808j9615j6689j3704j2901j4083j4913j4041
$$ 1903628 1879219 1856986 1835887 1815079 1795464 1778775 1765071 1752170 1738087 1723174 1709133
52121A709133j2429j1443j1103j0625r449p406m979l555m142n731o493o518p450
$$ 1709133 1696704 1685261 1674158 1663533 1654084 1646678 1641699 1638144 1634002 1628271 1621778 1615260 1607810
52108A607810r243r721q124o559o617o929n858m461m620n918o642o558o520o476
$$ 1607810 1598567 1588846 1580722 1574163 1567546 1560617 1554759 1550298 1545678 1539760 1533118 1526560 1520040 1513564
52094A513564o047o067p257q241p168m816l710m518n455n157m001k682j404o10
$$ 1513564 1507517 1501450 1494193 1485952 1478784 1473968 1470258 1465740 1460285 1455128 1451127 1448445 1447041 1446431
52080A446431q17j520j874k319l903o027o610m843k220n05J4L4K14Q50J653J784
$$ 1446431 1445614 1444094 1442220 1439901 1435998 1429971 1423361 1418518 1416298 1415793 1415807 1415841 1416055 1416905 1418558 1420342
52064A420342R80K83O93J648J992J811J757J310l50k271k657j659j063j062J58
$$ 1420342 1421322 1421605 1422298 1423946 1425938 1427749 1429506 1430816 1430466 1428195 1425538 1423879 1422816 1421754 1421912
52049A421912L241O330P757Q133Q733R656J0642J2191J4573J6989J8808K0637
$$ 1421912 1425153 1431483 1439240 1447373 1456106 1465762 1476404 1488595 1503168 1520157 1538965 1559602
52037A559602K3122K5632K7226K8187K9688L2286L5425L8012L9231L9248L9195
$$ 1559602 1582724 1608356 1635582 1663769 1693457 1725743 1761168 1799180 1838411 1877659 1916854
52026A916854L9893M0741M0732M0249M0464M1075M0385L7962L5387L3694L1789
$$ 1916854 1956747 1997488 2038220 2078469 2118933 2160008 2200393 2238355 2273742 2307436 2339225
52015B339225K8486K4503K1222J8579J5593J2063Q425M661O51k843m745n157n445
$$ 2339225 2367711 2392214 2413436 2432015 2447608 2459671 2468096 2472757 2473408 2470565 2465820 2460663 2455218
52002B455218o947r911j3420j6000j6838j6678j6973j8013j8774j8804j8850j9065
$$ 2455218 2448271 2438360 2424940 2408940 2392102 2375424 2358451 2340438 2321664 2302860 2284010 2264945
51990B264945j8102j5240j2138j0872j0937r951p107m241l147l186k290M80M030
$$ 2264945 2246843 2231603 2219465 2208593 2197656 2187705 2180598 2176357 2173210 2170024 2167734 2168214 2172244
51977B172244O645P750Q270R435J1410J3284J4223J4203J3614J2671J1496J0309
$$ 2172244 2178889 2186639 2194909 2204344 2215754 2229038 2243261 2257464 2271078 2283749 2295245 2305554
51965B305554R217Q080O774N320L703K030P58J22o49k706n897q736j0420j1981
$$ 2305554 2314771 2322851 2329625 2334945 2338648 2340678 2341436 2341558 2340909 2338203 2332306 2323570 2313150 2301169
51951B301169j4668j8086k0983k3234k5793k8825l1184l2117l2483l3660l5739
$$ 2301169 2286501 2268415 2247432 2224198 2198405 2169580 2138396 2106279 2073796 2040136 2004397
51940B004397l7519l8229l8512l9429m0955m2184m2749m3182m3650m3404m2152
$$ 2004397 1966878 1928649 1890137 1850708 1809753 1767569 1724820 1681638 1637988 1594584 1552432
51929A552432m1130m1563m2526m1752l8615l5050l3173l2996l3011l2171l0666
$$ 1552432 1511302 1469739 1427213 1385461 1346846 1311796 1278623 1245627 1212616 1180445 1149779
51918A149779k9279k8549k8331k7931k6834k5260k3633k1870j9793j7987j7244
$$ 1149779 1120500 1091951 1063620 1035689 1008855 983595 959962 938092 918299 900312 883068
51907H83068j7206j6573j4928j3400j3243j4392j5746j6214j5375j3761j2551
$$ 883068 865862 849289 834361 820961 807718 793326 777580 761366 745991 732230 719679
51896G19679j2401j2634j2289j1642j1666j2324j2647j2288j1616j0410q202o009
$$ 719679 707278 694644 682355 670713 659047 646723 634076 621788 610172 599762 591560 585551
51884E85551n798p653r245q857p257n882m984m514m942n869n644l791k288k770
$$ 585551 579753 572100 562855 553998 546741 540859 535875 531361 526419 520550 514906 511115 508827 506057
51870E06057m114m595m812o091p312o147l009r25j395k736k964k146j273o79m53
$$ 506057 501943 497348 492536 486445 479133 472986 469977 469052 467657 464921 461957 459811 458538 457859 457406
51855D57406q96j651j676r28r96l047n977p513o726m685l082k782l519m386m593
$$ 457406 456510 454859 453183 452255 451259 448212 442235 434722 427996 423311 420229 417447 413928 409542 404949
51840D04949m066l398l250l756m348m066k398j29J038J69j856l357l566k845j741
$$ 404949 400883 397485 394235 390479 386131 382065 379667 379538 380576 380745 378889 375532 371966 369121 367380
51825C67380m84P12J543J775J164m14k388l479k915j252M14J544J963J391J40
$$ 367380 366896 367608 369151 370926 372090 371676 369288 365809 362894 361642 362056 363600 365563 366954 367094
51810C67094n32R0R38O65p6M93K332L260J966j28o62R85L374M596L828J879M56
$$ 367094 366562 366652 367590 368255 368179 368672 371004 374264 376230 376102 375440 376425 379799 384395 388223 390102 390558
51793C90558L12L80m95j411m48K259M276M174L336L492M177L861K504J355R25
$$ 390558 390870 391250 390755 389344 388896 391155 395431 399605 402941 406433 410610 414471 416975 418330 419255
51778D19255P22M99M82N50M16M26R89J492R83r2k60P92J691J427N57k29j347l127
$$ 419255 419977 420476 420958 421508 421924 422350 423339 424831 425814 425722 425462 426254 427945 429372 429929 429700 428353 425226
51760D25226m476m167k823k168k594k846k140j145n62m3P17J002J75r62j037J38
$$ 425226 420750 416583 413760 411592 408998 406152 404012 402867 402305 402262 402979 403981 404156 403194 402157 402295
51744D02295J521K257K297J892J397J329J726J659M39r74r64L83J289R55O49J418
$$ 402295 403816 406073 408370 410262 411659 412988 414714 416373 416812 415838 414874 415257 416546 417501 418150 419568
51728D19568K183J385m48j385r12n87j682l317l549j743P69K224K249J963K386
$$ 419568 421751 423136 422688 421303 420391 419804 418122 414805 411256 409513 410282 412506 414755 416718 419104
51713D19104L238L565L076K172J065j63p76P6J779K573J885J128J457K047J678
$$ 419104 422342 425907 428983 431155 432220 432057 431281 431357 433136 435709 437594 438722 440179 442226 443904
51698D43904Q56R16J825K425K332K174K294K635L606N425O773N791K840O13Q94
$$ 443904 444760 445676 447501 449926 452258 454432 456726 459361 462967 468392 475165 480956 483796 484409 485303
51683D85303K513L363L206L385M554N991O873P120O842N944M685M101N167P510
$$ 485303 487816 491179 494385 497770 502324 508315 515188 522308 529150 535094 539779 543880 549047 556557
51669E56557R509R989R517R491J0153J0406R709R189J0111J1933J2786J1617Q964
$$ 556557 566066 576055 585572 595063 605216 615622 625331 634520 644631 656564 669350 680967 689931
51656F89931N871L044J167R12K050L125K662O63j445k344k036j464j206j015p01
$$ 689931 695802 698846 700013 700925 702975 706100 708762 709425 707980 705636 703600 702136 700930 699915 699214
51641F99214q12j767k889l146k632k177j761p37L18j83k099k954j205J370K153
$$ 699214 698402 696635 693746 690600 687968 685791 684030 683293 683611 683428 681329 678375 677170 678540 680693
51626F80693J186M13N59Q21R99J826L369M990O709Q770R981Q457M220o44m630
$$ 680693 681879 682292 682851 683672 684671 686497 689866 694856 701565 710335 720316 728773 732993 732349 727719
51611G27719p753r766r647p621n814n690o277n946m668l457k704k239k087k123
$$ 727719 719966 710200 700553 692932 687118 681428 675151 669205 664537 661080 658376 656137 654050 651927
51597F51927j649k77J398K714L804M869N285M343K374L93q91j228o09L02R0k180
$$ 651927 650278 650001 651399 654113 657917 662786 668071 672414 674788 675181 674290 673062 672453 672755 672845 670665
51581F70665n818r095j0832j1121j0789j0485j0207r612q879q881r909j0785j0225
$$ 670665 664847 655752 644920 633799 623010 612525 602318 592706 583827 574946 565037 554252 544027
51568E44027q755q043q448q691p984o878n786m422l278l770n916p562p112n534
$$ 544027 535272 527229 518781 510090 502106 495228 489442 485020 481742 477972 472056 464494 457382 451848
51554D51848m353l259j393K00l90l007n371n817m630k853j183n4L66N14R73J708
$$ 451848 447495 444236 442843 443043 442653 439646 434275 428458 423828 420975 419792 419738 420104 420618 421591 423299
51538D23299K237K236J505lj546j853q45j00n97j057N1J883K435J626J186J762
$$ 423299 425536 427772 429277 429274 427728 425875 425030 424930 424333 423276 423327 425210 427645 429271 430457 432219
51522D32219K280K275K799M457O297P294P548P426O804N976O075P607R467J0191
$$ 432219 434499 436774 439573 444030 450327 457621 465169 472595 479399 485375 491450 499057 508524 518715
51508E18715R617Q582P608O605N535M666M069L204J184k069m995n457l302j015
$$ 518715 528332 536914 544522 551127 556662 561328 565397 568601 569785 567716 562721 557264 553962 552947
51494E52947q93k310l187l377m545o911q428p760o039m687l310j053J447L046
$$ 552947 552054 549744 546557 543180 538635 531724 523296 515536 509497 504810 501500 500447 501894 504940
51480E04940L944N054O234O663O476O707P781R140J0140J0453R919Q919Q453Q786
$$ 504940 508884 513938 520172 526835 533311 540018 547799 556939 567079 577532 587451 596370 604823 613609
51466F13609Q514O171K545j3n67n42j356k505k750k155j885k325k517j570J01
$$ 613609 622123 628294 630839 630826 630259 629717 628361 625856 623106 620951 619066 616741 614224 612654 612755
51451F12755J257J340J009J108J543J626J327J426K232K891K472J243J72l05l73
$$ 612755 614012 615352 616361 617469 619012 620638 621965 623391 625623 628514 630986 632229 632401 632096 631723
51436F31723p6O32J153O25r37k563l637m460n325n786n450m845m829n433n896
$$ 631723 631647 632279 633432 634057 633120 630557 626920 622460 617135 611349 605899 601054 596225 590792 584896
51421E84896n771n523n807o432o298m518j560J016K119K206K541L594M637M830
$$ 584896 579125 573602 567795 561363 555065 550547 548987 550003 552122 554328 556869 560463 565100 569930
51407E69930M178L454L602N037P026P941O897N195N219P640J0554J1782J1219
$$ 569930 574108 577562 581164 586201 593227 601168 608065 613260 618479 626119 636673 648455 659674
51394F59674J0295R973J0129J0376J0575J0672J0797J1350J2370J3012J2271J0126
$$ 659674 669969 679942 690071 700447 711022 721694 732491 743841 756211 769223 781494 791620
51382G91620P481N190L597K647J836L89j752l527m015l673l439l114k034q74j128
$$ 791620 799101 804291 807888 810535 812371 812760 811008 807481 803466 799793 796354 793240 791206 790332 789204
51367G89204k602l194j762L46J380J405J461J799K181K807L638L678K283N31k14
$$ 789204 786602 783408 781646 781992 783372 784777 786238 788037 790218 793025 796663 800341 802624 803155 802941
51352H02941m39j649l870n714o697p718r111r993j0052j0303j1274j1865j0973
$$ 802941 802502 800853 796983 791269 784572 776854 767743 757750 747698 737395 726121 714256 703283
51339G03283r211p954p540p424p350p352p078o237n451n569o272o320n289m074
$$ 703283 694072 686118 678578 671154 663804 656452 649374 643137 637686 632117 625845 619525 614236 610162
51325F10162l413k830j644m14l80j511k155j052Q88J776J236O19O24K33j296k656
$$ 610162 606749 603919 602275 601861 601481 599970 597815 596763 597651 599427 600663 601282 601906 602139 600843 598187
51309E98187k233q57j123m106q303j1884j4397j5819j5693j4149j2555j2020j2015
$$ 598187 595954 595097 593974 589868 581565 569681 555284 539465 523772 509623 497068 485048 473033
51296D73033j1412j0194r215q956r306r956j0228r221p114n602n933p104p166
$$ 473033 461621 451427 442212 433256 423950 413994 403766 394545 387431 381829 375896 368792 361626
51283C61626n816m380l580k825j789j164j473k169k507k402k172k030k152k523
$$ 361626 355810 351430 347850 345025 343236 342072 340599 338430 335923 333521 331349 329319 327167 324644
51269C24644k588j806o76k98p20o72N43J851J861P39j41L8Q74J547J599J151Q20
$$ 324644 322056 320250 319574 319276 318556 317884 318427 320278 322139 322878 322737 322775 323649 325196 326795 327946 328766
51252C28766J286K383L028K493J428J073J739K737L517M113M488M402M096M444
$$ 328766 330052 332435 335463 337956 339384 340457 342196 344933 348450 352563 357051 361453 365549 369993
51238C69993N967Q133R899J0577J0117R002Q102Q044Q356P763N768L291J276o58
$$ 369993 375960 384093 393992 404569 414686 423688 431790 439834 448190 455953 461721 465012 466288 465630
51224D65630l167n456o007n030m551n548o535o040n147n955q250r671r147q208
$$ 465630 462463 457007 451000 445970 441419 435871 429336 423296 418149 412194 403944 394273 385126 376918
51210C76918q404r084q886p976p451p297o593n410m928n447n673m590l010k386
$$ 376918 368514 359430 350544 342568 335117 327820 321227 315817 310889 305442 299769 295179 292169 289783
51196B89783k788l023k491j922k134k810k961k133p37N94J481J697J183L06k59
$$ 289783 286995 283972 281481 279559 277425 274615 271654 269521 268784 269378 270859 272556 273739 274045 273786
51181B73786j88K13N80J017J690K209J939R26K8M4R23J916K279J923J560J957
$$ 273786 273598 273811 274391 275408 277098 279307 281246 282172 282200 282244 283167 285083 287362 289285 290845 292802
51165B92802K796K652O88j939l178k484j184m48L5R51J922J994J019j91q13o21
$$ 292802 295598 298250 298938 296999 293821 291337 290153 289705 289740 290691 292613 294607 295626 295435 294622 294001
51149B94001Q3O65N14m44j634k408k373j271Q51L101M120L528K419J998K251K416
$$ 294001 294084 294749 295263 294819 293185 290777 288404 287133 287984 291085 295205 298733 301152 303150 305401 307817
51133C07817K114J421M22o35j167r09l44p2j72o09j440k188j997j150j288k997
$$ 307817 309931 311352 311774 311139 309972 309063 308719 308647 308475 307866 306426 304238 302241 301091 299803 296806
51117B96806m393l621j837j663l242m045k574j06J673K638L128K747J440K13l51
$$ 296806 292413 288792 286955 285292 282050 278005 275431 275325 276998 279636 282764 285511 286951 287164 286813
51102B86813j092k651m013l879k549j283n83l18o24j379j541m58P79R02P03J851
$$ 286813 285721 283070 279057 275178 272629 271346 270763 270445 269821 268442 266901 266443 267222 268124 268827 270678
51086B70678L754L809J239j530k323k202l356n350n580l007M66K521K744J929
$$ 270678 274432 278241 279480 277950 275627 273425 270069 264719 259139 256132 256598 259119 261863 263792
51072B63792N89p91j102L71K522L187J572r98k859l648l677k785p33J604K674
$$ 263792 264381 263590 262488 262859 265381 268568 270140 269142 266283 262635 258958 256173 255440 257044 259718
51057B59718K077J219J624L107M048L422K106J954L544N196M675J961l39J57K874
$$ 259718 261795 263014 264638 267745 271793 275215 277321 279275 282819 288015 292690 294651 294312 294469 297343
51042B97343N152N446M494L388J978o6j861k300j906k168l142l133j281Q33J197
$$ 297343 302495 307941 312435 315823 317801 317735 315874 313574 311668 309500 306358 303225 301944 302777 303974
51027C03974R0l94P17K168K448J633O86j0m92l57P06J867J891R04K66M89N96m9
$$ 303974 304064 303670 304387 306555 309003 310636 311322 311312 310820 310463 311169 313036 314927 315831 316097 316586 317182 317133
51009C17133n20K19J645K488K428J903R61m28j401j004K09P36L03L7L36R3j273
$$ 317133 316613 316832 318477 320965 323393 325296 326257 325829 324428 323424 323633 324369 324672 324709 325045 325138 323865
50992C23865k436j858O3J531J508M12p84j269n82R16J905J295l99j438p02J293
$$ 323865 321429 319571 319634 321165 322673 323085 322301 321032 320450 321366 323271 324566 324167 322729 322027 323320
50976C23320L203M067L808L108K985L998N539O308N708M514L884M002M196M224
$$ 323320 326523 330590 334398 337506 340491 344489 350028 356336 362044 366558 370442 374444 378640 382864
50962C82864M664N814O794O495N046L569K566J534M45M05K070M128M554L052J212
$$ 382864 387528 393342 400136 406631 411677 415246 417812 419346 419791 420196 422266 426394 430948 434000 435212
50947D35212M04N59J139K202M017O318Q370R510R464Q617Q026Q681J0546J2707
$$ 435212 435616 436175 437314 439516 443533 449851 458221 467731 477195 485812 493838 502519 513065 525772
50933E25772J4329J5100J5072J4780J5206J6651J7916J7785J7182J8303K1512
$$ 525772 540101 555201 570273 585053 600259 616910 634826 652611 669793 688096 709608
50922G09608K4739K6551K7969L0348L3097L4995L6413L8548M1399M4336M7979
$$ 709608 734347 760898 788867 819215 852312 887307 923720 962268 1003667 1048003 1095982
50911A095982N3512O0325O6271P0439P4119P8732Q4250R0153R6413J02801J08274
$$ 1095982 1149494 1209819 1276090 1346529 1420648 1499380 1583630 1673783 1770196 1872997 1981271
50900A981271J12035J14563J16914J19350J21083J21006J18386J13238J06233
$$ 1981271 2093306 2207869 2324783 2444133 2565216 2686222 2804608 2917846 3024079
50891C024079R7878Q7782P5410O1489M7788L5235K3163J0795j452j2761k3166
$$ 3024079 3121957 3209739 3285149 3346638 3394426 3429661 3452824 3463619 3462167 3449406 3426240
50880C426240l2988m1571m7554n0404n0976n0571m9913m9072m7945m6804m6476
$$ 3426240 3393252 3351681 3304127 3253723 3202747 3152176 3102263 3053191 3005246 2958442 2911966
50869B911966m7741n0367n3229n5763n8751o3018o7835p1660p4267p7035q0791
$$ 2911966 2864225 2813858 2760629 2704866 2646115 2583097 2515262 2443602 2369335 2292300 2211509
50858B211509q4409q6244q6076q4812q2708p9136p4143o9046o4911o1090n6259
$$ 2211509 2127100 2040856 1954780 1869968 1787260 1708124 1633981 1564935 1500024 1438934 1382675
50847A382675n0539m5590m2347l9631l5665l0507k5993k3276k1395j8682j4951
$$ 1382675 1332136 1286546 1244199 1204568 1168903 1138396 1112403 1089127 1067732 1049050 1034099
50836A034099j1453q946o800m218j632k23l68j107j113K14K567N153P097P919
$$ 1034099 1022646 1013700 1006900 1002682 1001050 1000827 1000459 999352 998239 998453 1001020 1006173 1013270 1021189
50822A021189P942Q087R063J0849J3052J5354J7456J9064K0378K2264K5332K9036
$$ 1021189 1029131 1037218 1046281 1057130 1070182 1085536 1102992 1122056 1142434 1164698 1190030 1219066
50810A219066L2265L4773L7265M0093M2689M4647M6608M9538N3473N7698O1849
$$ 1219066 1251331 1286104 1323369 1363462 1406151 1450798 1497406 1546944 1600417 1658115 1719964
50799A719964O6366P1992P9209Q8030R7906J07911J17451J26881J37260J49417
$$ 1719964 1786330 1858322 1937531 2025561 2123467 2231378 2348829 2475710 2612970 2762387
50789B762387J63292J77956J92245K05572K18245K30712K42513K52527K60349
$$ 2762387 2925679 3103635 3295880 3501452 3719697 3950409 4192922 4445449 4705798
50780D705798K66565K71177K72595K68959K59812K45437K25277J98544J66270
$$ 4705798 4972363 5243540 5516135 5785094 6044906 6290343 6515620 6714164 6880434
50771F880434J31192R5401N9435K4011r069l8703o5629r0365j10938j24324j29797
$$ 6880434 7011626 7107027 7166462 7190473 7181404 7142701 7077072 6986707 6875769 6751445 6621648
50760F621648j29460j25758j19905j12768j05614r9481r4867r2577r3844r9043
$$ 6621648 6492188 6366430 6246525 6133757 6028143 5928662 5833795 5741218 5647374 5548331
50750E548331j07130j16850j27673j38981j49555j58812j67668j76918j85352
$$ 5548331 5441201 5324351 5196678 5057697 4908142 4749330 4581662 4404744 4219392
50741D219392j90783j92562j91689j88622j82747j74219j64755j55662j46354
$$ 4219392 4028609 3836047 3644358 3455736 3272989 3098770 2934015 2778353 2631999
50732B631999j35807j24567j14006j04320r4578q4650p5672o8334o1759n4683
$$ 2631999 2496192 2371625 2257619 2153299 2058721 1974071 1898399 1830065 1768306 1713623
50722A713623m7134m0289l4964l0822k7058k3384k0155j7711j5852j4078j2134
$$ 1713623 1666489 1626200 1591236 1560414 1533356 1509972 1489817 1472106 1456254 1442176 1430042
50711A430042j0196q538p319o577o263o117n858n504n190m680l524j910p73o58
$$ 1430042 1419846 1411308 1403989 1397412 1391149 1385032 1379174 1373670 1368480 1363800 1360276 1358366 1357593 1356935
50697A356935q19L8K347N414Q367J1053J3963J7453K1027K3547K4648K5885K9623
$$ 1356935 1356116 1356154 1358501 1363915 1372282 1383335 1397298 1414751 1435778 1459325 1483973 1509858 1539481
50684A539481L6444M4289N0613N4682N7383N9878O3326O8959P7023Q5943R3763
$$ 1539481 1575925 1620214 1670827 1725509 1782892 1842770 1906096 1975055 2052078 2138021 2231784
50673B231784J00188J06380J13259J21187J30607J41305J51258J58053J61679
$$ 2231784 2331972 2438352 2551611 2672798 2803405 2944710 3095968 3254021 3415700
50664C415700J64182J66305J66334J62825J56458J48069J36621J20727J00929
$$ 3415700 3579882 3746187 3912521 4075346 4231804 4379873 4516494 4637221 4738150
50655D738150P8730N4332K7257j333k8680n2809p3343q9961j01650j07949j09769
$$ 4738150 4816880 4871212 4898469 4897136 4868456 4815647 4742304 4652343 4550693 4442744 4332975
50644D332975j08315j04042r7202q8775q0227p2640o6422o1623n8218n6376n6811
$$ 4332975 4224660 4120618 4023416 3934641 3854414 3781774 3715352 3653729 3595511 3539135 3482324
50633C482324o0515o7692p7013q6324r4358j01470j08382j14486j17982j17804
$$ 3482324 3421809 3354117 3277104 3190780 3096422 2994952 2886570 2772084 2654102 2536298
50623B536298j14727j10162j04548r7681r0020q2488p5259o7822o0376n3855m8404
$$ 2536298 2421571 2311409 2206861 2109180 2019160 1936672 1861413 1793591 1733215 1679360 1630956
50612A630956m3007l7006l0916k5198j9510j3679q338l785N65M758P576Q530R388
$$ 1630956 1587949 1550943 1520027 1494829 1475319 1461640 1453302 1449517 1450082 1454840 1462416 1470946 1480334
50599A480334J2104J5978J8642J9429K0011K1762K4231K6550K8804L1426L4250
$$ 1480334 1492438 1508416 1527058 1546487 1566498 1588260 1612491 1639041 1667845 1699271 1733521
50588A733521L6857L9213M1552M4179M7478N1610N6088O0315O4463O9118P4094
$$ 1733521 1770378 1809591 1851143 1895322 1942800 1994410 2050498 2110813 2175276 2244394 2318488
50577B318488P8460Q1860Q4886Q7885R0217R1136R0868R0267Q9731Q8601Q5526
$$ 2318488 2396948 2478808 2563694 2651579 2741796 2832932 2923800 3014067 3103798 3192399 3277925
50566C277925P9564P1242O2267N3781M5313L6116K6953J9343J3314P481J496l054
$$ 3277925 3357489 3428731 3490998 3544779 3590092 3626208 3653161 3672504 3685818 3693299 3694795 3691741
50554C691741m799m387l238j595J062M421P331R144J0008J0063R227P799O275
$$ 3691741 3686942 3682555 3679317 3677722 3678784 3683205 3690536 3699680 3709688 3719751 3728978 3736777 3743052
50541C743052M335P52n248j3152k2093l2105m3730n6551o8939p9565q8453r6142
$$ 3743052 3747387 3748139 3742891 3729739 3707646 3675541 3631811 3575260 3506321 3426756 3338303 3242161
50529C242161j02320j06160j07630j07585j06499j04059j00221r5667r0812q5321
$$ 3242161 3139841 3033681 2926051 2818466 2711967 2607908 2507687 2412020 2321208 2235887
50519B235887p9229p3622o9275o5352o0450n4443m8188m1996l5575k9261k3958
$$ 2235887 2156658 2083036 2013761 1948409 1887959 1833516 1785328 1743332 1707757 1678496 1654538
50508A654538j9799j5915j1683p281l037Q70M004O091P977J1089J5592K0042K3293
$$ 1654538 1634739 1618824 1607141 1599860 1596823 1597693 1601697 1607788 1615765 1626854 1642446 1662488 1685781
50495A685781K5810K8629L1897L5132L8247M1485M4682M7222M8687M9285M9771
$$ 1685781 1711591 1740220 1772117 1807249 1845496 1886981 1931663 1978885 2027572 2076857 2126628
50484B126628N0969N3016N5026N5868N5433N4734N4821N6002N7983O0238O2243
$$ 2126628 2177597 2230613 2285639 2341507 2396940 2451674 2506495 2562497 2620480 2680718 2742961
50473B742961O4009O6465P0698P6725Q3570R0523R7682J05253J13193J21568J30534
$$ 2742961 2806970 2873435 2944133 3020858 3104428 3194951 3292633 3397886 3511079 3632647 3763181
50462C763181J39649J48001J55118J61158J66031J69078J69871J68536J65033
$$ 3763181 3902830 4050831 4205949 4367107 4533138 4702216 4872087 5040623 5205656
50453E205656J58902J49988J38658J25000J08497Q8913O6820M2937J7659q405
$$ 5205656 5364558 5514546 5653204 5778204 5886701 5975614 6042434 6085371 6103030 6094625
50443F094625l4122n8466q0815j00256j15437j25587j31086j32609j30157j23466
$$ 6094625 6060503 6002037 5921222 5820966 5705529 5579942 5448856 5316247 5186090 5062624
50433E062624j12792r8958q3031o6170m9229l2324j5448L29J3128K1867K6655
$$ 5062624 4949832 4850874 4767843 4701673 4652444 4620120 4604672 4605001 4618129 4639996 4666651
50422D666651K7246K2277J0866n917k5968m7910p1043r4162j15359j32955j46164
$$ 4666651 4693897 4716174 4727040 4721123 4695155 4647245 4576202 4482040 4366681 4233726 4087562
50411D087562j55089j60461j63005j62837j59785j54290j47292j39128j29524
$$ 4087562 3932473 3772012 3609007 3446170 3286385 3132095 2984803 2845675 2716151
50402B716151j18931j08752r9682r0886q1544p2236o3979n6715m9707m2618l5424
$$ 2716151 2597220 2488468 2388786 2297900 2216356 2144120 2080141 2023426 1973719 1931101 1895677
50391A895677k7974k0611j4527j0365p027k815K618Q348J3589J8076K1503K3798
$$ 1895677 1867703 1847092 1832565 1822200 1815173 1812358 1814976 1823324 1836913 1854989 1876492 1900290
50379A900290K5789K8598L2291L5812L8205L9467M0420M2174M5099M8045M9193
$$ 1900290 1926079 1954677 1986968 2022780 2060985 2100452 2140872 2183046 2228145 2276190 2325383
50368B325383M8205M6618M5571M4352M2168L9951L8801L7630L4450K9563K5485
$$ 2325383 2373588 2420206 2465777 2510129 2552297 2592248 2631049 2668679 2703129 2732692 2758177
50357B758177K3708K3369K3365K3870K5167K6579K7576K8884L1598L5819M0723
$$ 2758177 2781885 2805254 2828619 2852489 2877656 2904235 2931811 2960695 2992293 3028112 3068835
50346C068835M5400M9258N2200N4764N7423N9519N9705N7655N4556N1413M7722
$$ 3068835 3114235 3163493 3215693 3270457 3327880 3387399 3447104 3504759 3559315 3610728 3658450
50335C658450M2351L4996K5983J5322K902j0545k3740l6259m8961o2655p6671
$$ 3658450 3700801 3735797 3761780 3777102 3780004 3769459 3745719 3709460 3660499 3597844 3521173
50324C521173q9128r8383j03896j05967j05257j02656r8773r3151q4659p3245
$$ 3521173 3432045 3333662 3229766 3123799 3018542 2915886 2817113 2723962 2639303 2566058
50314B566058o0804m9239l8380k6998j5526n941J036O695J1665J4306J3014Q483
$$ 2566058 2505254 2456015 2417635 2390637 2375111 2369170 2370206 2376901 2388566 2402872 2415886 2424369
50302B424369K341n131j4381k4766l4981m4442n2657n8211o0224o0144o0239o0745
$$ 2424369 2426710 2421579 2407198 2382432 2347451 2303009 2250352 2192141 2131917 2071773 2011534 1950789
50290A950789o0402n9074n7617n5427n0851m4374l8965l6260l4598l1918k8716
$$ 1950789 1890387 1831313 1773696 1718269 1667418 1623044 1584079 1547819 1513221 1481303 1452587
50279A452587k6509k4909k2122j7730j3303j0271q461o831m917l022j392L72K840
$$ 1452587 1426078 1401169 1379047 1361317 1348014 1337743 1329282 1322451 1317534 1314512 1313120 1313492 1316332
50266A316332N973R249J2500J5788J8480J9649J9849K0931K3176K4321K3074K1848
$$ 1316332 1322305 1331554 1344054 1359842 1378322 1397971 1417820 1438751 1461927 1486248 1509322 1531170
50254A531170K3558K7015K8526K7319K6157K6632K7391K7519K7945K8381K6397
$$ 1531170 1554728 1581743 1610269 1637588 1663745 1690377 1717768 1745287 1773232 1801613 1828010
50243A828010K1609J7648J7292J8078J5679R910M354J240m10k109m148o387q723
$$ 1828010 1849619 1867267 1884559 1902637 1918316 1928226 1932580 1933820 1933410 1931301 1927153 1920766 1912043
50230A912043j0654j1910j3277j5402j7420j8209j8332j8978j9821j9787j9401
$$ 1912043 1901389 1889479 1876202 1860800 1843380 1825171 1806839 1787861 1768040 1748253 1728852
50219A728852k0151k1922k3192k3652k4421k5801k6877k7488k8305k8781k7419
$$ 1728852 1708701 1686779 1663587 1639935 1615514 1589713 1562836 1535348 1507043 1478262 1450843
50208A450843k4594k2657k2410k1862j9698j7604j7346j7629j6080j2925j0302
$$ 1450843 1426249 1403592 1381182 1359320 1339622 1322018 1304672 1287043 1270963 1258038 1247736
50197A247736q816p225n155l769l446k949j453K11J135J825L112M579N148M704
$$ 1247736 1238920 1231695 1226540 1222771 1219325 1216376 1214923 1215134 1216269 1218094 1221206 1225785 1230933 1235637
50183A235637M101L881L831L750L789L877L434J985k64k585m270m993n068n329
$$ 1235637 1239738 1243619 1247450 1251200 1254989 1258866 1262300 1264285 1264021 1261436 1257166 1252173 1247105 1241776
50169A241776o372p682q066p234o317o373o997p159o863o897p252p037o026n052
$$ 1241776 1235404 1227722 1219656 1212422 1206105 1199732 1192735 1185576 1178713 1171816 1164564 1157527 1151501 1146449
50155A146449m505l625j860P7J215J515J372R45P61J951M745P436Q105O863N274
$$ 1146449 1141944 1138319 1136459 1136536 1137751 1139266 1140638 1141583 1142344 1144295 1149040 1156476 1164581 1171444 1176718
50140A176718M181L347K606J830J56k965o053o774n160l895m829o865q092q381
$$ 1176718 1180899 1184246 1186852 1188682 1188838 1185873 1179820 1173046 1167886 1163991 1159162 1152297 1144205 1135824
50126A135824q605q656p823o398n452n330n560n967o748p608p932p858q196r192
$$ 1135824 1127219 1118563 1110740 1104342 1098890 1093560 1088000 1082033 1075285 1067677 1059745 1051887 1043691 1034499
50112A034499j0207j0773j1134j1456j1212r895p811n775m272l321k908l156m032
$$ 1034499 1024292 1013519 1002385 990929 979717 969822 962011 956236 951964 948643 945735 942579 938547
50099I38547n159o140o954p928r182j0203j0289r586r238j0095j1416j1494r803
$$ 938547 933388 927248 920294 912366 903184 892981 882692 873106 863868 853773 842357 830863 821060
50086H21060p915p709q979r582q153n877m954n753o442n464l404j940j701j951
$$ 821060 813145 805436 796457 786875 778722 772845 767891 762138 755696 750232 746828 744888 743187 741236
50072G41236j945j666j263n34O74K095L279L971M217M303M596N209N913O589P474
$$ 741236 739291 737625 736362 735828 736502 738597 741876 745847 750064 754367 758963 764172 770085 776674 784148
50057G84148Q603R505R945J0489J1500J2153J1687J1183J2417J4900J6001J4576
$$ 784148 792751 802256 812201 822690 834190 846343 858030 869213 881630 896530 912531 927107
50045I27107J2535J1744J1268R392O874N933O844P779P778P632P756P334O121
$$ 927107 939642 951386 962654 972046 978920 984853 991697 999476 1007254 1014886 1022642 1029976 1036097
50032A036097N261N516O162O380O382O442O248O007O765Q631J0043J0013R743
$$ 1036097 1041358 1046874 1053036 1059416 1065798 1072240 1078488 1084495 1091260 1099891 1109934 1119947 1129690
50019A129690J0524J1375J0604Q864Q538J0510J3470J6260J8813K0679K0734J9132
$$ 1129690 1140214 1151589 1162193 1171057 1179595 1190105 1203575 1219835 1238648 1259327 1280061 1299193
50007A299193J7890J8627K0966K3660K6048K7643K7768K6581K5386K4874K4091
$$ 1299193 1317083 1335710 1356676 1380336 1406384 1434027 1461795 1488376 1513762 1538636 1562727
49996A562727K2184K0012J8817J8204J6938J5038J3597J2904J2195J1063R700
$$ 1562727 1584911 1604923 1623740 1641944 1658882 1673920 1687517 1700421 1712616 1723679 1733379
49985A733379Q040N951M100L052J675j793o862j0812j2114j2081j2345j2578j2196
$$ 1733379 1741419 1747370 1751470 1754522 1756197 1754404 1747542 1736730 1724616 1712535 1700190 1687612 1675416
49972A675416j2581j5440j9709k2297k1872k0243j9693k0440k1132k0636j8754
$$ 1675416 1662835 1647395 1627686 1605389 1583517 1563274 1543581 1523141 1502009 1481373 1462619
49961A462619j6120j3924j2972j2663j1632r649p922p196o710n693m630m061l228
$$ 1462619 1446499 1432575 1419603 1406940 1395308 1385659 1377737 1370541 1363831 1358138 1353508 1349447 1346219
49948A346219j410L57O62J69O19J587P33k158m045k928j059j664m151n278m251
$$ 1346219 1344809 1345166 1345828 1345997 1346616 1348203 1348936 1346778 1342733 1339805 1338746 1337082 1332931 1327653 1323402
49933A323402l694n451q234j0245j1678j3192j3902j2723j0617r630j0253j1256
$$ 1323402 1319708 1314257 1306023 1295778 1284100 1270908 1257006 1244283 1233666 1224036 1213783 1202527
49921A202527j1653j1481j0831r449p387n072k680j71K116L730M887O347Q606
$$ 1202527 1190874 1179393 1168562 1159113 1151726 1146654 1143974 1143803 1145919 1149649 1154536 1160883 1169489
$$ [...]
##END NTUPLES=NMR SPECTRUM
##END=
