
##TITLE=AC1146_Santa_5875032_1DaXPQNHdO
##JCAMPDX= 6.0         $$ Bruker NMR JCAMP-DX V2.0
##DATA TYPE= NMR SPECTRUM
##DATA CLASS= NTUPLES
##ORIGIN= BRUKER
##OWNER= Administrator
$$ 1.72 TOPSPIN		Version 2.1
$$ 2012-03-31 22:08:53.312 -0500  Administrator@TOPSPIN
$$ Compression mode = diff/dup
##.OBSERVE FREQUENCY= 400.13188235
##.OBSERVE NUCLEUS= ^1H
##.ACQUISITION MODE= SIMULTANEOUS (DQD)
##.ACQUISITION SCHEME= undefined
##.AVERAGES= 8
##.DIGITISER RES= 22
##SPECTROMETER/DATA SYSTEM= spect
##.PULSE SEQUENCE= zg30
##.SOLVENT NAME= COFFEE_meoh
##.SHIFT REFERENCE= INTERNAL, COFFEE_meoh, 1, 14.98061
##AUDIT TRAIL= $$ (NUMBER, WHEN, WHO, WHERE, PROCESS, VERSION, WHAT)
$$ ##TITLE= Audit trail, TOPSPIN		Version 2.1
$$ ##JCAMPDX= 5.01
$$ ##ORIGIN= Bruker BioSpin GmbH
$$ ##OWNER= Administrator
$$ $$ C:\Bruker\TOPSPIN/data/COFFEE/nmr/AC1146_Santa_5875032_1DaXPQNHdO/10/pdata/1/auditp.txt
$$ ##AUDIT TRAIL=  $$ (NUMBER, WHEN, WHO, WHERE, PROCESS, VERSION, WHAT)
(   1,<2012-03-31 22:08:44.968 -0500>,<Administrator>,<TOPSPIN>,<go>,<TOPSPIN 2.1>,
      <created by zg
	started at 2012-03-31 22:07:38.250 -0500,
	POWCHK enabled, PULCHK disabled,
       configuration hash MD5:
       1A 1E CE 29 27 FD 77 03 67 4E F0 E3 C4 B2 CB 90
       data hash MD5: 64K
       10 E3 CA 6C 82 CA 5B 02 32 7E A2 D2 63 C5 49 82>)
(   2,<2012-03-31 22:08:48.515 -0500>,<Administrator>,<TOPSPIN>,<proc1d>,<TOPSPIN 2.1>,
      <Start of raw data processing
       efp LB = 0 FT_mod = 6 PKNL = 1 PHC0 = 0 PHC1 = 0 SI = 32K 
       data hash MD5: 32K
       59 0E FB 8B 3E C7 A5 4E D9 A6 15 57 61 6D C0 20>)
(   3,<2012-03-31 22:08:48.875 -0500>,<Administrator>,<TOPSPIN>,<proc1d>,<TOPSPIN 2.1>,
      <pk PHC0 = 217.5018 PHC1 = 0 
       data hash MD5: 32K
       01 C7 D8 D4 FB E4 DB BE 1A 8E DA 63 BD 7B 9D F8>)
(   4,<2012-03-31 22:08:49.046 -0500>,<Administrator>,<TOPSPIN>,<proc1d>,<TOPSPIN 2.1>,
      <abs ABSG = 1 
       data hash MD5: 32K
       E3 63 58 AF 77 1A 83 9B 13 AE C5 AE 2F 00 A3 AF>)
(   5,<2012-03-31 22:08:49.218 -0500>,<Administrator>,<TOPSPIN>,<proc1d>,<TOPSPIN 2.1>,
      <abs ABSG = 2 
       data hash MD5: 32K
       69 DC 2A 1F 14 FF 72 40 B7 23 70 FF 9B A0 13 31>)
(   6,<2012-03-31 22:08:49.265 -0500>,<Administrator>,<TOPSPIN>,<proc1d>,<TOPSPIN 2.1>,
      <abs ABSG = 3 
       data hash MD5: 32K
       83 2D 20 20 08 BD 8F 76 12 31 3A D7 18 BC 4C A2>)
(   7,<2012-03-31 22:08:49.296 -0500>,<Administrator>,<TOPSPIN>,<proc1d>,<TOPSPIN 2.1>,
      <abs ABSG = 4 
       data hash MD5: 32K
       A8 DC 62 0A A9 E2 92 14 53 3A 50 2C C2 E7 31 9B>)
(   8,<2012-03-31 22:08:49.343 -0500>,<Administrator>,<TOPSPIN>,<proc1d>,<TOPSPIN 2.1>,
      <abs ABSG = 5 
       data hash MD5: 32K
       07 1C 7F 69 7D AE 5E A1 2A 93 2D 1F FF 8D F7 A2>)
$$ ##END=
$$ 
$$ $$ hash MD5
$$ $$ 85 F6 A0 1B FA C6 E5 B6 D4 78 B5 1E 29 AD 6C 1B
##$RELAX= 
##$RELAX= 
##$RELAX= 
##$RELAX= 
##$RELAX= 
##$RELAX= 
##$RELAX= 
$$ Bruker specific parameters
$$ --------------------------
$$ [...]
150 150 150 150 150 150 150 150
##$TP07= 0
##$TPNAME0= <>
##$TPNAME1= <>
##$TPNAME2= <>
##$TPNAME3= <>
##$TPNAME4= <>
##$TPNAME5= <>
##$TPNAME6= <>
##$TPNAME7= <>
##$TPOAL= (0..7)
0.5 0.5 0.5 0.5 0.5 0.5 0.5 0.5
##$TPOFFS= (0..7)
0 0 0 0 0 0 0 0
##$TUNHIN= 0
##$TUNHOUT= 0
##$TUNXOUT= 0
##$USERA1= <user>
##$USERA2= <user>
##$USERA3= <user>
##$USERA4= <user>
##$USERA5= <user>
##$V9= 5
##$VALIST= <valist>
##$VCLIST= <CCCCCCCCCCCCCCC>
##$VD= 0
##$VDLIST= <DDDDDDDDDDDDDDD>
##$VPLIST= <PPPPPPPPPPPPPPP>
##$VTLIST= <TTTTTTTTTTTTTTT>
##$WBST= 2048
##$WBSW= 25
##$XGAIN= (0..3)
0 0 0 0
##$XL= 0
##$YL= 0
##$YMAX_a= 505813
##$YMIN_a= -598084
##$ZGOPTNS= <>
##$ZL1= 120
##$ZL2= 120
##$ZL3= 120
##$ZL4= 120
##$ABSF1= 14.98061
##$ABSF2= -5.57192
##$ABSG= 5
##$ABSL= 3
##$ALPHA= 0
##$AQORDER= 0
##$ASSFAC= 0
##$ASSFACI= 0
##$ASSFACX= 0
##$ASSWID= 0
##$AUNMP= <proc_prof1d_extract_pilot.lims>
##$AXLEFT= 0
##$AXNAME= <>
##$AXNUC= <1H>
##$AXRIGHT= 0
##$AXTYPE= 0
##$AXUNIT= <>
##$AZFE= 0.1
##$AZFW= 0.1
##$BCFW= 0
##$BC_mod= 0
##$BYTORDP= 0
##$COROFFS= 0
##$CY= 15
##$DATMOD= 1
##$DC= 0
##$DFILT= <>
##$DTYPP= 0
##$F1P= 0
##$F2P= 0
##$FCOR= 0.5
##$FTSIZE= 32768
##$FT_mod= 6
##$GAMMA= 0
##$GB= 0
##$INTBC= 1
##$INTSCL= 1
##$ISEN= 128
##$LB= 0
##$LEV0= 0
##$LPBIN= 0
##$MAXI= 10000
##$MC2= 0
##$MEAN= 0
##$ME_mod= 0
##$MI= 0
##$NCOEF= 0
##$NC_proc= -8
##$NLEV= 6
##$NOISF1= 0
##$NOISF2= 0
##$NSP= 0
##$NTH_PI= 0
##$NZP= 0
##$OFFSET= 14.98061
##$PC= 1
##$PHC0= 217.5018
##$PHC1= 0
##$PH_mod= 1
##$PKNL= yes
##$PPARMOD= 0
##$PPDIAG= 0
##$PPIPTYP= 0
##$PPMPNUM= 2147483647
##$PPRESOL= 1
##$PSCAL= 4
##$PSIGN= 0
##$PYNMP= <proc.py>
##$REVERSE= no
##$SF= 400.13
##$SI= 32768
##$SIGF1= 0
##$SIGF2= 0
##$SINO= 400
##$SIOLD= 32768
##$SPECTYP= <>
##$SREGLST= <1H.CDCl3>
##$SSB= 0
##$STSI= 32768
##$STSR= 0
##$SW_p= 8223.68421052632
##$SYMM= 0
##$S_DEV= 0
##$TDeff= 65536
##$TDoff= 0
##$TI= <>
##$TILT= no
##$TM1= 0
##$TM2= 0
##$TOPLEV= 0
##$USERP1= <user>
##$USERP2= <user>
##$USERP3= <user>
##$USERP4= <user>
##$USERP5= <user>
##$WDW= 1
##$XDIM= 32768
##$YMAX_p= 453805423
##$YMIN_p= -753486
##$CURPLOT= <Network HP LaserJet P1505>
##$CURPRIN= <$Network HP LaserJet P1505>
##$DFORMAT= <normdp>
##$LAYOUT= <+/1D_H.xwp>
##$LFORMAT= <normlp>
##$PFORMAT= <normpl>
##$SURQMSG= 1
$$ End of Bruker specific parameters
$$ ---------------------------------
##NTUPLES= NMR SPECTRUM
##VAR_NAME=  FREQUENCY,     SPECTRUM/REAL,   SPECTRUM/IMAG
##SYMBOL=    X,             R,               I
##VAR_TYPE=  INDEPENDENT,   DEPENDENT,       DEPENDENT
##VAR_FORM=  AFFN,          ASDF,            ASDF
##VAR_DIM=   32768,         32768,           32768
##UNITS=     HZ,            ARBITRARY UNITS, ARBITRARY UNITS
##FACTOR=    0.250966925370066, 1,           1
##FIRST=     8223.43324360095, 126909,       -121857
##LAST=      0,             -90019,          -298529
##MIN=       0,             -753486,         0
##MAX=       8223.43324360095, 453805423,    0
$$ Real data points
##PAGE= N=1
##DATA TABLE= (X++(R..R)), XYDATA
$$ [...]
23747 -70842 9516 56817 491056 167522 16994 138027 -13828 91478 61724 141619 -15959
23735 -232084 -42275 1507 -87819 -21592 -364214 -142435 684100 -33105 -280072 -22727 -56879
23724 -56879 -351250 129389 95793 -62415 -218236 -216850 -229458 97311 -143982 -118802 -197439
23713 -197439 294969 -51584 -186190 103711 216613 -322519 -185597 -197635 467773 43938
23702 -393847 -202742 325518 19408 18558 32610 -291263 -680 -335556 80474 -294682 -326545
23691 -326545 -24456 121557 63016 -24505 -375318 -351220 175023 -39921 -166421 -166542 18371
23679 -37956 -24193 116599 166536 -196834 -45106 -139883 7102 162322 -132750 -152192 85266
23667 140090 123221 -41014 13182 92862 -182889 -268029 34790 -75738 96363 38543 -384866
23655 227225 -38508 -89869 -66159 -15999 -23966 -60464 -60251 -74936 -244420 -116908 17624 168463
23643 168463 -27529 219215 -266798 -26325 53615 187069 -282883 -51232 237489 -30407
23632 188188 -23379 38789 73595 90966 -186198 193776 -71254 -19088 172449 88523 -223459
23620 -205028 -63026 23707 53698 -244555 -99973 -307098 -13902 220492 310090 -174080 19828
23608 23394 -158275 168496 49390 -65924 -410203 -144779 -170029 -113051 118543 61895 264721
23597 264721 231818 -117046 440945 28287 213294 206888 86751 35007 -340458 67467 174925
23586 174925 -208080 -163234 65089 181473 -156370 -110361 130239 151983 31472 236196
23576 236196 47345 43011 318481 -212218 191571 -47219 -162264 62367 177536 -173884
23565 120203 234053 447879 278711 20072 -13569 157857 118174 -53950 350147 -82143
23554 -70104 -198816 -74258 309729 -131919 -174444 262895 -80122 -32158 49953 -177663 -32836
23542 -72458 134769 -46262 -66180 43431 -224054 112233 81687 111846 79488 127939 -200998
23530 -11775 59794 -34678 54760 -104371 -47606 60371 -234821 -178457 -180183 -409892 67634
23518 -149387 7016 86854 -63589 314204 -117639 -103984 -59903 146192 -164888 163431 46774
23506 -20960 -52606 -140416 -40461 -78917 -14426 -261808 118919 -337852 -67784 -278681 59853
23494 100989 -70528 -46090 71335 31994 2396 232635 -80547 -27685 25612 -77833 -126190
23483 -126190 224968 230194 -345177 97740 -226769 -22474 -71830 -209362 316949 -205633
23472 -21375 27281 181237 -62800 -318818 -84595 -36512 260671 104486 -181882 -307041
23462 -307041 -264369 -47100 -155995 -319109 -347061 -414667 328818 -241169 40362 -174363
23451 102483 -75074 130349 -68550 -196419 -153384 -67701 -60698 168677 -29601 126592 186745
23440 186745 219119 -149347 -36161 -189538 90790 18291 207940 -128730 33042 -80861 116822
23428 260913 -53144 -196736 106605 231700 135437 189804 -45112 -96363 200234 20246 206918
23417 206918 -125244 -69844 306086 -112807 -32038 173466 214056 148072 -372777 138907
23406 -167318 -48774 -41441 -55613 -37317 43320 -261844 91739 -10494 -225956 165013 -381856
23394 80790 -118405 138646 -318306 -5273 105351 -339682 -276445 23226 -131218 -255549
23384 -255549 -86113 -139404 303304 207804 337936 -183868 155573 353692 -162915 -171429
23374 -171429 422698 23781 70914 91707 137215 128926 107493 -70688 80581 155682 -129411
23362 -1131 121206 137658 62255 -285311 122046 141116 -25509 -185305 339345 102408 284761
23351 284761 207375 3242 41740 -160581 167548 -385658 -245538 -162870 -141056 -69487 273576
23339 -186825 -207491 -6070 183147 -82710 -98328 -15563 129780 -184791 -244228 -47086 -321666
23328 -321666 -49146 -73413 242232 240832 -394491 -229420 259296 -75131 -223995 -128051 -57831
23316 -71219 347744 -178886 -67678 -22380 198213 202895 -322778 150214 -1423 -180194 -35422
23304 346529 -182382 -166961 4284 -111315 -166604 -120262 -137044 245562 -80141 69718 -309776
23292 -21836 -131691 -202750 -297786 194092 42019 38416 -103510 -49011 274594 -232500 -52917
23280 -37946 11349 -95384 -194138 -125543 -36618 163863 -5039 198092 -203185 58602 -372568
23268 -52954 -112366 31754 61991 230306 9208 -143513 -355695 -320858 -249675 111914 -24079
23256 -82262 -63738 169345 -175075 -273544 -159998 197233 -11833 -147105 84725 -359091
23245 -46552 -136027 118572 -128772 -62238 -113629 335336 222265 138096 -110044 -243636
23235 -243636 17315 -137937 214007 184068 181080 -89238 183892 48755 -169777 84731 77058
23224 77058 48234 -83593 58584 625465 -183204 72013 41805 -246172 191470 113295 176122
23213 176122 -114353 -126777 -54558 -138960 -117030 -270648 -55811 -73704 3855 -248666 -173319
23202 -173319 344426 -10870 -184504 195170 105091 -301368 -189210 -262133 20828 29220 -77974
23190 -205668 -226759 -9721 314652 -234138 1198 -283715 -26945 -333766 -326681 -195869 44396
23178 -132671 273957 -150759 -18922 -16070 112076 47732 94379 -199150 45105 -130752 -453566
23167 -453566 41292 -54579 19496 -214649 184077 -41008 -190817 -21810 372972 291892 -12975
23155 31848 347332 241090 211539 204786 -221349 -296394 146078 47659 148767 -385981 26866
23143 -115595 21482 -145365 58907 -141059 -94154 -203000 -114241 45574 83978 70507 58716
23132 58716 -151876 205157 125484 462930 -92403 139111 -312741 -12168 -246090 -247670 111094
23120 -17239 64273 -238280 173043 -207196 -82607 257305 -10146 339499 287013 66598 178140
23109 178140 11892 -54959 -378751 77980 -48262 520195 -250302 -46634 -112442 52508 -256433
23097 125201 -9676 -75039 31236 -12508 -92813 -235218 -335346 89874 173059 138193 168601
23086 168601 -233089 487284 -121424 -55842 -227677 90221 -14020 89610 153072 -89170 189037
23074 28673 110810 107940 337157 -71679 -178648 33087 -114145 -220812 -84520 -9348 -572664
23063 -572664 53352 -117401 -317103 -58578 -336916 -984 46987 -45138 -129081 -139446 146669
23051 -190107 158882 271129 88849 470295 -132256 40434 -98464 45505 62909 153988 -35289
23039 581280 425097 -136284 183873 -61416 -12831 150381 27813 134508 251385 -87604
23028 180982 -55303 -141 -116443 -307785 99069 118616 -220132 -25484 -138665 99465 40525
23016 295779 -321373 82773 -82512 240119 59736 142158 -98626 -71279 253533 111712 85054
23005 85054 -145036 -103539 33468 224801 43286 72506 307886 282462 18944 171419 69758
22993 -273598 3431 -71301 -61519 -156750 -244355 -318726 137819 39456 -190571 -1371 -322207
22982 -322207 224417 -215876 -79725 -224551 -255738 -81715 -117396 149267 -162020 18323
22971 91008 157138 -241721 -272271 45802 13253 -21566 1742 -56614 80331 -335243 85292
22959 -82490 43407 -22754 89144 -349316 -138819 -221069 118990 147098 -130752 140475 16884
22947 -73467 -40085 -238807 335444 -123800 7336 -48173 102217 188577 13058 -129827 243503
22935 -64526 36941 -28489 -135746 -160416 32325 -23106 -25930 164565 -189559 -132538 -116467
22924 -116467 -313373 -316692 -37175 61918 115276 224469 145217 -361109 -128669 3705 110690
22913 110690 60715 196215 -93848 85474 116151 66002 -453273 162989 54330 -211028 354393
22901 -134312 -304494 -122800 129094 -97202 -257148 -471480 169973 -222180 50525 -369394
22890 186565 -106086 62190 71717 346761 -104416 -196795 -17153 219533 -98740 -184484 -15739
22878 -256000 154208 41548 -5859 -407412 -73552 -43864 -136201 398146 103802 45555 117546
22867 117546 193895 -157436 -92682 106829 -41103 -177714 24147 -34996 59488 -72956 -190780
22856 -190780 251612 96079 171807 -231621 -101287 72520 -267867 -3221 -349894 -209785
22846 -209785 -167241 215004 40673 -176503 -277096 -196517 -205259 -52074 190165 31457 -206798
22834 -163569 133737 -238998 -227896 -147967 -137991 -242895 -246919 311005 -451879 326314 92679
22822 -229952 -254264 10388 51695 -100214 244979 -45140 123932 16796 -173887 -58142 128931
22810 -151654 118000 54505 144230 123286 -3547 -102181 -15012 -20833 -46545 -298453 -270051
22799 -270051 44087 -51844 -216817 -285300 9450 -109280 -323491 173800 158831 -98961 -297410
22788 -297410 -22927 198005 -160053 -107888 -166361 324440 -233561 -189109 127119 11843
22777 -130997 262134 -19769 8415 322462 -280493 16603 259696 -334975 358615 81658
22766 147908 -112127 -146025 12819 -271792 -181924 45386 -125573 49223 55180 336 -48746
22754 -15047 -115868 -237312 -13519 -396517 -398330 44365 203793 -117330 54638 69433 -224248
22742 157548 131053 22978 -272513 -90035 -246792 -63126 -89736 -130610 101368 87077 261077
22731 261077 124125 313384 -138089 -128074 -17361 -224380 189710 6632 135879 -181049
22720 -214841 -218171 -241426 -156236 -109574 -203280 -29766 129766 -37498 -161163 -47693 358581
22708 221027 5077 -204419 66835 -170496 -59449 -112936 209010 -26197 39237 94095 -103248
22696 61906 -213634 -444692 -19235 69751 22533 83425 -294899 428129 88915 -220050 -268741
22685 -268741 -21348 113441 -318601 -6467 -219169 141306 129013 -26098 -40523 -432022 343065
22673 -353495 -40479 235646 -19215 408914 138127 142970 -162266 -154353 63224 31001 96112
22662 96112 -179437 -257681 -522610 -429538 -36943 -5515 169393 -48631 -110914 -136468 -189 -134774
22650 -134774 -152810 17208 75742 -47355 317284 108397 -272182 -54856 -111584 73139 -259348
22638 -151053 -48464 68336 -186598 5527 122763 -52797 -110285 76166 71178 -261199 -264811
22627 -264811 -101791 -217354 128550 -286773 -71222 49135 -92061 -254319 -256993 -64039 165298
22615 -266526 200680 -144492 -418667 -12347 -86036 55211 217613 -191747 42978 299550
22605 299550 343755 -87770 -294704 -33728 308654 49384 -89342 56285 -64983 77229 -66889
22593 -95534 258546 -200350 7143 119656 -9031 -217015 -311977 71180 15891 -330371 253062
22581 -147343 67606 -207159 -322606 246749 -135666 39481 -143430 -187296 -148196 22215
22570 6005 -137776 -94751 -120255 -410437 -249586 -2393 -298933 -60849 -108583 7361 -142868
22558 139319 43802 45304 100735 -215471 -137300 -33310 -10500 -168955 -108201 99214 219493
22547 219493 -60126 -109350 30369 -75154 6238 12979 258172 -293859 -361847 142225 -13468
22535 -183968 -420806 -31453 -167017 -2064 -261376 41558 91606 -274647 40045 -161942 -25500
22523 234525 121477 -238770 33943 87388 -50063 -149737 254464 202331 -88273 148795 85160
22512 85160 -87109 -546051 -153471 63528 42473 97861 -199494 -129272 -180025 -216731 -93580
22500 143945 297056 -231407 92328 36776 269249 -49283 -185861 -348821 112349 375991
22490 375991 357051 -6717 63586 110206 113737 65997 54887 54578 -117383 -106490 220247 -125564
22477 -122652 -170945 89101 -358699 73423 144205 -35871 -56785 -206270 -36868 19305 -129101
22465 -34997 111657 206885 5402 -126366 100602 163336 63540 -10601 125517 49152 -299166
22453 -178677 -322259 41925 138026 20257 16235 234774 82667 8834 -37313 -106972 8426 -42460
22440 -28529 -52287 79247 121265 -260326 -407104 -257688 158903 -219914 15413 95608 -56044
22428 17220 -75634 20376 -45663 -143997 4575 -316986 -178633 27699 -77123 -332193 361891
22416 -94341 -86797 -71941 -150125 -208339 -73412 -59360 -171095 214149 -253858 -57662 -51785
22405 -51785 133842 85103 -126201 91151 164913 55319 -191846 -394840 50252 -125430 201855
22393 -204556 -172329 5289 -157316 44578 35706 59064 118169 177834 -217036 80998 130977
22382 130977 157752 -1815 -145222 -182967 32812 -61732 -146292 -16709 -126475 -40364 -153257
22371 -153257 -195633 -171087 -237822 -221664 -113788 28015 23043 -122488 -36880 -8608 44848
22359 76234 141896 -99215 161261 -53527 57953 -317801 53218 -70582 -117931 -234806 -67910
22347 73352 -320412 252814 204236 -176242 339096 149907 -192544 155292 179677 -93768
22336 -37168 -69279 -238503 -56252 -210766 74176 4492 59052 -219232 192491 126596 -146363
22324 -73788 54483 227087 121754 -229406 -174609 -20144 -87924 -142402 -126632 -86383 -135940
22313 -135940 208975 275336 52984 -185237 -204575 -162287 -267910 44176 -74437 254422 -126818
22301 44948 120319 -136547 -119253 -245005 -205882 -105863 -162348 -147678 303 38307 35735 -222552
22288 44605 -79756 -17647 20200 -7662 -26158 -146553 -8157 -21107 -166209 -30005 -343227
22277 -343227 154978 -96179 213816 -62694 -274978 205284 153439 9120 157568 -338296
22266 52810 72724 15937 -58693 148476 140955 -374174 -198775 46982 63140 16967 181703
22255 181703 481430 -24287 163861 57225 -85383 -32235 400573 -309266 -134883 62480
22244 43354 -156296 -143881 109194 51396 -302269 -224698 -3268 57308 -71546 43559 -217379
22232 -387921 -332568 -114022 24331 -122049 -46190 -128398 93640 -150267 -97414 -251083 85956
22220 122181 127339 153214 -163532 -338253 159697 -246217 43255 -277357 -132460 -49749
22209 -51863 -252401 -298527 -135350 174047 -254891 139722 -180201 22598 -54282 13325
22198 43966 -101064 -194699 -150404 -55756 -87208 -186252 -158381 -122534 41338 -148008 -201012
22187 -201012 100885 -121286 115095 -449505 -81408 -150874 -238499 46836 -151389 137342
22176 -71714 -64017 134503 -165138 47039 -26527 -49397 -49939 -27504 153591 24710 -24886 -11007
22163 -105841 84281 11201 43389 229237 -134056 115998 290206 32706 -28505 263986
22152 151927 207312 85799 49242 -123557 -66070 -59689 16082 2571 -231343 53899 -190200
22140 120629 -368161 -103321 -30799 150795 -206409 181417 -75294 -52772 346684 -41628
22129 68388 -259714 -169591 232367 -203410 -27 131279 -19893 -422589 141366 -61301 -106258
22118 -106258 125188 73508 73411 -120016 -104079 35375 62743 -188215 -245273 -214726 -304087
22107 -304087 251450 165741 -242699 53078 -292185 -4949 -44049 64587 -192858 30711 222641
22096 222641 205874 -240165 -240273 -40138 78550 -476179 203606 30141 121202 -47953 -125851
22085 -125851 -98976 -20730 -181151 -134202 20042 -47354 -230898 30353 -179675 -100975 164694
22073 -242184 218798 280375 -74987 30526 -21623 -38700 42347 -209008 -468005 182639 -112782
22061 -87252 97325 212529 -23765 30085 -123781 148894 -76426 -136533 -25354 -20483 -40795
22050 -40795 1636 -14845 111616 -18730 182546 -116075 -64612 -166003 -253286 97708 82900
22039 82900 -153898 62723 -368472 -142341 -40121 -160648 -163013 -78248 -3977 113606 -271145
22027 -77337 -76411 -83971 72157 208235 59037 9366 -110517 -160769 -126126 83886 -118945 -34653
22014 -116363 -164932 -53912 -34695 -538804 -132169 -107654 -83102 111738 -18350 -258665 455414
22002 -293878 124296 254167 -27023 100973 -380183 -15090 -332278 112819 -100750 -254472
21992 -254472 -284800 159665 -92725 -333311 223895 -198443 -155275 239015 -50185 32495
21981 58048 -147705 133811 -109529 -197051 93163 -143639 -133021 -29579 -222212 137582
21970 92487 51775 47869 59238 -184106 -261540 -155882 116372 -181204 -50254 -279154 188387
21958 -60461 51841 -258225 -79999 193845 -30587 -112109 21453 -70366 -84678 35132 -24408
21946 324987 38290 -159264 65962 192709 146570 -174571 59595 64186 -91010 55033 -139909
21934 -131119 -37293 -122354 66555 -376207 -158020 -307167 -360609 -114373 184947 -40807
21923 -9319 3494 -324671 -209748 -166776 76207 116642 26223 179329 -27480 137787 -230282
21911 -165016 -391168 296070 -28514 -145270 -198194 133499 72279 -246592 -345250 84609
21900 -307836 7713 -247879 -241284 -21123 -187915 -105799 307738 -80235 -121488 192487 -321022
21888 41254 318924 154930 -178948 -216580 -33091 -58364 -229480 51261 -20885 -375702 -93684
21876 -44846 57250 92124 103086 -151947 -231137 -43502 -81120 78148 -36885 -221028 333462
21864 92446 -294555 88246 222731 -177435 -99567 -273123 269115 -124864 -70252 90750
21853 -184699 -497057 -217748 12116 436491 59362 -69787 191440 -99805 48694 151173
21843 151173 67808 -27076 -84796 -37579 83357 -143474 -8651 -539302 38814 268716 185006
21832 185006 -70400 -936 -117803 383371 -178149 -298048 96211 -93047 -58184 -273428 -126159
21820 65622 -85294 -298527 -304668 -213852 -50548 -19258 99817 -149033 -89908 21342 -14870
21808 -128897 -103750 -59956 49842 -119931 -4763 -153251 -180382 217081 116856 1778 -68876
21796 -68072 185603 -68299 -270430 168891 -247023 -192999 -41649 102716 6066 184998 -320710
21784 -79889 -153474 45415 -412971 -210627 218097 379265 -124385 -6584 7899 90082 352893
21773 352893 106346 146374 -18513 -55923 -93509 -72813 -14805 47588 -82487 -11838 75288
21761 -159213 -131076 57356 -314788 12480 45414 -70567 -53139 38643 65184 32423 207565
21750 207565 -208167 -278830 152495 -103485 23157 81991 -167405 74255 170956 339380
21740 339380 142406 77819 -259908 -91111 253304 83660 -219011 -233982 -19589 -296802
21730 -296802 126446 -179307 46826 -12521 118379 25910 -68099 -228655 91187 -10467 -153162
21719 -153162 330010 66517 -118454 -69876 128454 -110960 -38447 100738 -140759 -181940
21709 -181940 18472 -51920 -95635 -144420 -77473 -2585 64203 175713 -144518 -86731 134980
21697 312388 -78837 95047 -412403 -172144 -131464 240277 -13608 144734 -87203 -106775 105914
21685 -15871 23103 -157671 324715 20736 -31787 -153416 -134468 112112 38220 -128061 -189698
21674 -189698 -204994 182478 -269255 -47689 -51106 17774 -328586 -232691 -249453 -316302 -164784
21663 -164784 -319594 -255882 -52317 -89946 215016 115769 -215212 -32210 403504 -49829 -134106
21652 -134106 -87892 -35829 422805 -322898 -265921 -82512 -47257 -110263 -181888 298340 313394
21641 313394 -96651 -80497 232828 113784 -245577 -70383 -171484 26867 -103964 333791
21630 23082 97094 -38191 159704 -82511 -90503 290792 -130685 235823 25577 129164 -199742
21618 -32217 -106771 -158366 -194383 -44317 61379 29736 -252612 7835 -467960 -227400 123646
21606 -232236 -217448 -13223 38496 -386374 108193 -65121 -323633 39580 -385320 -218854
21596 -218854 106591 100878 389075 758 230673 -40705 -29725 17334 -185496 72120 1686
21584 -180956 -204566 -93256 7233 -219442 -132673 -117880 234754 -343798 462778 -33819 -31078
21573 -31078 -329003 28788 -303009 -201710 -40688 -224018 143733 -36171 100185 -177427
21562 -369091 -155247 93573 -33068 13327 -458537 -37428 370974 -298318 -170886 -187409
21552 -187409 226568 -109852 173910 -487037 395574 297088 29324 -52523 1536 110043
21542 110043 91116 -423276 173533 -92327 -73688 -41971 -163334 -86133 -124359 -404924 30635
21530 42163 -222646 99567 -32274 90166 -78256 1306 -3861 223532 -70174 100718 8450 -114574
21517 -294468 -292112 2669 -51265 -28307 -60468 -16661 -57469 137172 -280705 221727 -279880
21505 -26592 -299277 -334499 196761 -119785 -52973 -153538 -247039 81138 -91658 -73631 -140163
21494 -140163 -78476 177821 422845 62061 -150468 -258628 54006 28484 -346907 -54369
21483 -38752 -141125 -19544 14819 -144379 -125980 -215809 -121828 -150135 218350 -203860 64327
21471 -8989 -205373 -111344 86399 224802 -81924 451191 45660 40143 293330 -128763 101489
21459 -383531 -26212 125429 -175507 -197995 -21256 90106 -261826 54543 -133207 60819 -83933
21447 -164159 -364036 -223525 -242989 -70421 -92861 161522 -146718 133540 1486 101623
21437 101623 271177 157937 93074 103294 -122248 -81262 72778 -400094 -279972 334978
21426 176614 360498 26284 349585 532734 256422 252439 59245 113966 373410 -3819 418104
21414 -139252 -176807 -71185 249559 -129838 -203121 -107253 -96961 -177276 -279095 -89802 -226327
21403 -226327 -195535 -191076 85206 119775 -289592 -73712 -122879 -103986 194953 -160855 -18486
21391 301724 90805 -163529 -44747 286026 -184606 154180 56693 -65515 72320 153688 -164687
21379 -231462 -133271 90251 5065 106472 -377624 -235728 120137 143038 -92844 -34150 -139074
21368 -139074 -289746 48122 -48892 213052 -215246 87495 105552 -24647 -100029 -184181 -319421
21357 -319421 -52767 -149423 -365480 265002 -178719 87755 115748 -45835 -127515 127412 -516430
21345 -425493 -107259 -152430 -36299 5582 -108302 215853 252639 -333855 314423 -144395
21334 -268025 -71732 -140079 163140 19533 -144546 -177249 -225191 -568104 150638 -65143 89047
21322 126320 -144329 -349489 38871 15812 7434 2144 64455 48344 78559 25126 -84919
21310 -209624 -108147 -350038 105703 -482143 -264939 -36064 -298943 -204891 -114741 -56994
21299 30249 141964 -380126 -28864 22412 107392 151553 -154492 -80539 46687 67855 290106
21288 290106 198244 97492 10706 -38222 79950 -93645 -1856 -67160 105434 -10340 234314
21276 -43542 -12370 -122846 -90957 84865 -260439 -384410 5625 212986 -208762 -80876 -192562
21265 -192562 -155536 -160077 -41095 105952 94296 -226684 -192110 -42652 67628 332881 18608
21253 128579 48840 -283262 -89386 -114052 -143504 -24647 11576 -203874 -68884 -215629 -231895
21242 -231895 -179288 6512 -109296 135221 -250325 -359926 -70074 -95435 94415 -25995 163621
21230 -278484 239425 -117085 -335788 -168755 97327 163749 -108934 -196660 -101155 -78226
21220 -78226 -45513 30671 -247766 -248029 56540 -421282 22266 -89174 -81995 -58767 78287 -268899
21207 -245323 -83428 -285550 -104470 -52535 -308416 -198681 -61836 -11671 -5242 -161506 -269412
21196 -269412 16513 61972 -318184 -175760 -74057 -68792 -61376 237051 221577 -280029 -117112
21184 -23395 -81723 117976 -313775 13699 36466 -101583 103962 231040 230972 -132687 -126273
21173 -126273 -93806 -210353 -119742 158266 -216800 -91696 -119179 38728 -139599 -295325
21163 -295325 -21449 86910 82408 -123938 -98705 146384 124461 -44703 -89958 -136281 -243050
21152 -243050 -93415 -76792 19991 71200 -211207 115347 -164706 -301932 15887 -256682
21141 54175 39431 -253985 123237 -133391 52995 40987 -22773 165983 115395 51478 -225332
21129 24450 -275696 -76073 -229751 -245415 23847 49013 -130390 -467948 88549 -224514 91655
21117 9163 93935 -191197 141607 -52780 -116013 -369984 -80716 5181 85614 -214395 -15576
21105 -216559 37866 -202840 87918 141189 150256 -154005 -52078 213276 165865 160168 -164200
21093 -3179 249378 -288216 -80313 276171 246745 -117499 -79037 118082 122561 -210086 61971
21081 -83971 -164620 -12677 103125 -232069 243742 -104543 96596 -95221 -262121 -166159 46235
21069 327021 -322394 162975 -122411 166140 138049 -139193 -1128 7736 -104709 -132385 82894
21057 160331 -284721 -144966 -168865 233074 -161919 -81791 -478146 -307401 -141747 -250218
21047 -250218 -126776 -8774 3223 -226686 -110001 -227266 -138956 371129 -344390 -127590
21036 -279570 328716 -110465 -59785 120339 387591 -47311 19093 -238754 -267693 -337321
21026 -337321 246995 -106661 -221885 -182951 268008 -109793 321625 2326 78062 74330 313774
21015 313774 170751 -158435 -64224 118019 49690 152650 344479 -70697 61159 -98094
21004 93024 345298 -376232 13730 -67083 -340471 -45662 140127 285488 415971 338911
20994 338911 582156 437616 357182 98737 198127 170536 163918 230786 144580 157767 -370946
20982 -430764 -20186 51524 -224301 -212918 -150108 -78253 -153292 61811 -292253 -59252 -125634
20971 -125634 292992 -76223 18604 332511 45665 13948 546998 -174549 -9819 326061 212974
20960 212974 228264 -132974 5081 14296 46991 -107468 245047 -229138 -78606 70090 -19533
20948 -81540 -253179 115735 -145327 -30412 162590 251339 50076 -216837 -175063 -80168 -231226
20937 -231226 63668 -154268 183220 97753 148924 120966 357196 754308 731553 330794
20926 131973 253277 354346 291746 -74261 -119384 -225040 -319697 144174 36163 -101554
20915 -26345 36075 -144502 -18043 -327562 -193840 -29139 -250117 -174070 -146146 41524 13225
20903 -192989 -465484 9499 -8690 124825 -488679 74320 -79552 -61219 -343405 78139 -260965
20891 29881 -186790 -175451 -202868 -271506 -189649 -205920 267689 -157105 -28185 129942 -151201
20879 -4546 123458 -281897 -393875 -95886 288018 -219489 1641 -215484 187904 118755 -44966
20867 -255345 82032 201808 -263403 -264710 -8506 -144126 -62295 -68 -32560 229205 -258041
20855 -86991 -356885 -19518 64759 -65424 -35619 -47158 -179571 -43880 66742 -69970 -255821
20844 -255821 134911 -135058 223176 238878 -230228 246865 -203414 6752 -67751 -169555
20834 -169555 39759 -78471 -13661 133287 -47812 -54128 -84395 -215340 -82617 89775 281599
20823 281599 -315238 -88515 50123 9104 -640848 70715 -322078 -112559 -3634 96035 -1801
20811 -187524 15093 175471 6971 37160 -101629 99899 -369301 -311625 100197 -13232 -64851
20800 -64851 205004 -28961 13016 -375308 -288928 -144917 207640 -336011 185866 -395732
20789 -453923 16109 82490 -366138 -334469 -246462 -292766 17820 14625 -127453 80221 -131510
20777 208138 137575 -237809 249082 17140 -52255 -66887 -72685 -15751 -9298 -178620 263845
20765 -132976 -221133 -93586 7178 -281846 -92843 -12913 -76627 -26866 489619 -555707 -135827
20753 90921 148272 -200305 -145906 181362 264245 -34205 -38931 -125062 18417 -34426 -203655
20742 -203655 -161733 -173474 -286115 -412965 -101932 -409934 -204190 -150724 -36237 -237258
20732 -237258 11800 -106303 160209 172282 -51033 -93260 -552414 -255930 713 -22653 24848
20720 -134208 -222592 -65698 133583 15285 -230862 -65782 -225462 231977 -351445 -106529
20709 -162313 -91406 -91920 -257972 -214612 -323097 -29004 -31249 174035 -44562 -353793 253313
20697 -145453 21998 -200187 -284134 -176468 -110141 -51479 67028 -99969 -74126 -5000 -210563
20686 -210563 48336 -218593 75867 -33236 -284423 173146 -390907 -155608 8266 -119800
20675 104333 106536 -53520 -170680 -151634 387260 -155786 69641 -325969 -214589 -293461 -7898
20663 218525 13208 -60407 206346 -5582 71209 -263572 -199697 -321572 112829 79762 353765
20652 353765 62320 136289 -236872 -6487 -137508 226668 -104591 -194745 -290873 -87463 -44881
20641 -44881 -239478 63450 -179288 93847 -291210 -255137 61078 -246989 -292800 177739 -125082
20629 74910 -64204 -310736 -64148 -94884 147196 156776 182499 -404170 -74553 -168846 -232462
20618 -232462 -18939 -207452 6312 169974 161588 -185145 -160768 -153000 84847 289623 293789
20607 293789 56959 42902 260658 -162080 -176227 73908 -369007 66553 -223890 238024
20596 -195006 254 165200 -83523 -8729 -16492 -13711 -136269 -55738 -84252 14406 -308710 85113
20583 -32461 -207925 325129 213287 -119494 94575 -17700 -77438 -109843 -164286 102413 -52137
20571 149666 -107625 -74421 137766 165026 122773 -127117 187276 179237 40215 26591 -79874
20559 61042 -251831 -16610 18706 105624 -95637 -292359 -195965 -130195 -75161 -94737 174244
20547 -14688 -15334 -67223 49138 59127 -198758 203888 206838 -34112 -272989 -127001 120224
20535 -106804 -30949 -459198 -331161 -195789 82331 117661 -30272 55111 -315357 67697 -24806
20523 -3648 12605 -128830 120437 -2167 147487 -52396 -418334 -160265 92470 -129604 -206319
20512 -206319 238518 -11814 -272854 -75956 30056 -50308 24056 -123341 128154 -58756 -270376
20501 -270376 177078 187540 132153 16217 140258 -140044 -205525 -12378 -110705 -334846 68624
20489 -16044 -418768 -300031 -168207 -247948 339794 -183081 211589 -13957 -197140 33784
20478 -107026 137381 -17067 -104616 -168709 -144005 -13108 -383645 197013 55268 76173 7761
20466 127595 83778 12637 257030 -393676 50799 -113584 -424267 520 -7585 29117 139946
20455 139946 -59237 11414 270733 264889 -49301 176798 -69475 39032 -302641 -186160 -148472
20444 -148472 -228440 -176012 -6479 -105616 -110330 150304 146659 37570 203686 71940 -115945
20432 -25734 61509 -121681 124098 191144 -864 133048 -3346 58378 262419 236191 155338
20421 155338 -20269 -45983 -172381 -117077 181690 -87792 227 -55924 454395 -219537 192622
20409 -171281 -246372 -164348 -282687 -58179 -255076 -236292 139948 -86179 -198197 -173499 18727
20397 -219271 235449 9598 231709 -52523 -22980 -141550 -249044 -128297 261459 -168217
20386 -58403 -27983 157617 -207635 -132286 -50123 -317238 -27064 -107729 116908 8020 146443
20375 146443 -137497 -78397 -62524 -251631 -170615 -643304 -235682 -291159 -53412 -239938
20365 -239938 148202 -324701 -151335 -176390 -183730 -80952 -121823 212939 -66268 248322 -209653
20353 407183 -213291 -97216 -98830 -62925 -84280 -247903 -224843 32766 103970 -135094 157668
20341 -186588 -94796 -51548 153274 -102498 -228565 -65520 140272 -52026 -86612 -109744 -243950
20330 -243950 -132045 -151096 -28091 -229797 -60326 191553 -72639 -138731 -217443 60115 -366286
20318 164952 -388664 -9552 -81687 -227210 -126505 -369582 4679 -24724 192392 185877 -267264
20306 -146308 -196763 -264362 57039 -121816 -234389 -101528 -266153 227093 -196163 -250943
20296 -250943 -206644 87970 -369346 50324 -173928 -211486 72923 -92746 -318462 415455 -70456
20284 -32135 -36382 -24772 -114233 -309113 -226120 -178529 34677 -60940 -335894 -63098 -123326
20273 -123326 102537 -69781 -132124 -242310 -339010 57203 -173510 150346 -79350 -402059
20263 -402059 -266713 -144875 173266 126879 43724 -201851 -20449 -68690 -184729 -184540 -153039
20252 -153039 -10919 -16955 15911 -102526 21010 -124527 -148849 -92121 154009 101530 -81606
20240 -43782 114818 -148899 -54050 -26589 -389490 -79340 -14908 84505 -40959 -232510 -52188
20228 451 184340 -271887 57695 -264240 158954 205596 -218047 -151268 -69173 -103522 2875
20216 64687 -211242 -18060 119143 300760 79500 -154237 102294 -140627 -63117 214890
20205 -181242 -107330 -189899 111449 127015 100654 142443 -584591 -131389 107034 -205292
20194 37800 -13329 -338384 -347702 14718 177158 137670 29152 -206571 189199 188515 -65740
20182 -285774 170890 -129025 -224805 242234 -298478 -23370 -76077 -170334 290941 -56321
20171 -329017 45429 -122779 -301242 -59961 38817 -237669 13817 170722 -434662 -185131
20160 63580 101090 -83392 50423 321961 6271 -45557 -3737 -45039 -50304 -20423 325866 -27018
20147 -9601 -18773 69607 305823 176273 -125217 236526 8839 175609 22645 111168 294822
20136 294822 267739 230963 365862 275578 472154 286431 229075 3397 432438 203189 315218
20125 315218 678148 127447 521706 664687 347471 -38414 232563 115947 -123925 -41373
20114 -60810 -242463 64103 -10525 -58887 16677 182031 -54237 -231238 -130967 -145106 178845
20102 -131773 -35777 -154445 124873 -98890 -22020 87519 -44941 20194 16102 38862 55061
20091 55061 100438 -39953 -225114 -216720 -87833 -25691 -137665 282625 -322696 140876 -171920
20079 360492 284448 -5127 -191122 -13951 49796 27372 -320902 -141705 -185732 -278108 -269668
20068 -269668 -166421 -173663 -229627 -169832 -307652 217098 -43671 -187877 -79472 73509 50928
20057 50928 2258 -207907 206769 -45972 -111286 262130 126863 167108 -75631 -265216 -11492
20045 252989 -340337 -265096 -75152 193883 30305 -62233 -256639 -143462 39605 33079 -273566
20033 168115 -88275 -48945 367428 -231209 107144 118489 -63206 -64514 16035 -71826 -22076
20021 -71883 -136748 -178143 118140 -91679 -44266 -258321 67939 -66165 -253543 -369522 36492
20009 -93439 126560 14200 -73645 -104852 -183056 -16506 -167273 -209069 -177124 230842 150419
19998 150419 21145 356204 -87692 188 -26852 108206 42018 -212017 75792 32785 -201039
19986 24480 36830 112600 -100667 -61401 402439 274868 145465 252316 209740 378979
19976 378979 10504 309531 392622 224712 135890 272544 244380 169273 26452 -56960 -21208
19964 -84432 -70107 -281256 103295 -44020 67362 -89977 304408 -55312 165334 123673 -258330
19952 36413 204996 97870 106731 51246 16097 166083 -236751 222919 -275636 60172 209934
19941 209934 140834 47027 -133200 -33001 -32712 -74961 187895 -300229 -243483 -530148 -79341
19929 -61543 16984 100630 -193137 247428 171399 62569 94858 -19292 -105744 105005 -87944
19917 4104 -6819 -432957 -250696 276710 105818 -406681 -17941 -307144 104872 -139023
19906 -436942 48342 80242 -202191 -25399 -2752 -698 -160697 -139086 -229140 -148906 -270488
19895 -270488 -132054 -172393 82471 -289252 -160106 146480 -63784 -8956 -14346 181511 -145520
19883 -131510 -225907 56079 -200154 -4808 56512 69435 -121279 107227 -41035 -98219 -157507
19872 -157507 -296983 107638 -234353 -67021 162099 204371 59254 -360600 15360 -89164
19861 -45819 -111423 -48622 27247 -378523 15100 -104133 126433 -3016 27896 -250908 -90365
19849 -131975 128879 234755 -202175 -11857 56430 85386 -183094 40465 95200 -181739
19838 -329457 -50970 -9206 160335 111973 -218488 60392 73999 -84227 4384 -51022 -199362
19827 -199362 19942 38973 77130 226825 -135159 -20211 -73864 9401 -192731 49218 -113439
19815 259137 -230680 48774 -65139 -308547 -35842 -367352 -61746 -285239 90626 6690 -4205
19803 26165 -87708 -169318 -105810 -338839 196465 49950 113744 -100609 76055 -93388 151198
19791 -479223 -112853 -49615 151479 -217252 81923 -24152 -45829 78386 -369987 -94457 208168
19779 -228053 -273017 27305 140777 250829 -264711 -189547 -156546 -121727 -73400 -381064 123773
19767 -105781 126188 5764 -33748 -68767 -494122 127861 -2455 -140944 -259836 89358 -7712
19755 238088 72546 -129513 -137653 -10720 165089 -166664 -148019 -244593 -166512 -102822 49070
19743 75459 -132663 -159519 112526 -72952 -171125 -174822 -3027 47838 162781 -105405 241091
19731 54590 -67154 -299949 -197676 18996 183571 12670 183041 24574 80619 -119762 -93465
19720 -93465 268557 348531 20814 225451 459744 686504 550093 379653 397293 72324
19709 -146349 287644 192294 -40002 -173618 -104566 349534 -94839 138487 4334 -427163 -60812
19697 124530 -67180 -338615 9338 -23294 113039 -15308 114601 -42291 38458 -66963 196779
19685 94129 200661 510732 690689 652339 350627 327666 42603 201379 195727 198788 239447
19674 239447 8472 -18422 -205777 -91158 -327929 100011 -335401 97665 14941 77082 43287
19663 43287 -143618 62006 -194890 -127694 -54645 -85522 -332296 69542 125036 90679 67511
19652 67511 -29939 52036 263899 -162351 32061 150798 -140861 84241 -235015 48779 -104658
19640 -264324 -10978 -122230 -552441 -255724 -141880 -91331 -228905 -58752 51280 -98412
19629 -86572 247986 -277773 40044 -223385 -162400 205891 -221937 -155489 70196 33581 -100129
19617 -104119 -287414 -135621 -320295 -232421 -5589 -145835 -6100 520440 28292 -300537 227307
19605 -34570 123996 -374027 8150 -86042 -78314 -6245 -216423 41994 78648 -423278 -120285
19593 -265392 180733 -63245 -26585 -283961 -240651 85680 81013 -93979 -62421 -174039 -18765
19581 -574860 7595 -131972 -17337 166797 -194726 -131477 103450 -96945 163391 38023 85827
19570 85827 -195283 567 -248277 -94778 288690 76891 -191575 346233 166318 -33562 125507
19558 206713 -207442 -199321 -103446 136661 -138503 -85633 168407 -101169 -17056 -212014
19548 -212014 -337959 -203785 -96939 -17071 -97489 -243061 409467 -87115 -74598 -161911 -147712
19537 -147712 -260576 -41885 -31469 -97490 100632 51243 -119153 -82615 178974 -138200
19526 -16296 -207981 -70211 106965 -81456 83308 -8139 32321 -242295 -285791 -102608 407574
19514 -234556 -8647 -105643 121063 -48620 141675 -52374 92139 13479 -112655 166488 198278
19503 198278 131231 -293742 100540 -347462 -232589 -179140 145781 -169620 -74729 -318196
19493 -318196 -139883 -102778 -325148 5726 -35642 -120869 -50133 -215126 -65350 -50951 132456
19481 -296103 -223150 -284724 355536 -172588 224530 18949 49639 72986 59281 10814 93777
19470 93777 52803 -272853 -295745 -235215 -199833 -352233 223603 -44666 -387600 -63865 117495
19458 -120361 -364409 -226585 -371117 22282 40402 -148880 -255724 -288917 -363329 -233674
19448 -233674 -73073 99286 102754 -106044 -186676 -15764 -189807 -18656 -383539 -214737 670
19436 -265695 -120678 -113646 -209292 -33078 -73768 22719 -485618 -118135 73678 148650 112828
19425 112828 -43630 -103690 297035 94825 -74042 119776 -332518 -27694 -540720 -95807 -226430
19414 -226430 226108 113181 -103339 -245611 -201847 194029 90230 -1537 -598916 -104385
19403 -91278 -49699 10723 -294524 272259 -90138 15140 151225 -230284 297709 -320539
19392 11523 67324 -216258 -83466 149951 50308 23662 -180999 26051 244761 98271 -63343
19380 -135135 45013 290080 -424903 28720 -168761 41069 -209246 -77096 -21673 -151374
19370 -151374 5096 -207013 -60859 -119779 -82774 -464174 -93816 -141426 -156339 -106576 -287819
19359 -287819 207783 -227523 -36947 -179366 -122288 259017 76441 203494 -113599 -336884
19349 -336884 81331 -50130 142581 -164218 -133421 -259338 -189898 141771 -63679 27258 36822
19338 36822 11809 -341256 163906 9217 -278812 -26929 -211000 -57445 58075 145775 -195865
19326 -7099 -39219 -133404 172173 -240326 -125309 53793 108103 -443390 -178687 166171 -274237
19314 118577 -305511 186463 -133969 -66154 262704 -114072 80200 72374 -281547 -42341
19303 -91456 -428255 -34809 -112106 15650 -366296 18603 -128606 363876 120670 -242044
19292 25180 -273334 15050 411136 -119480 146764 -139556 -107314 -105914 -242529 -121401
19282 -121401 12267 -473848 53015 -90617 23925 -99729 68573 -159057 90573 -292616 -359367
19271 -359367 72681 248822 29196 90403 -540376 -85380 272955 151391 -176791 -416361
19261 -416361 -67775 -332130 101764 -120002 54902 98346 101637 -439693 233860 -28918 -162650
19250 -162650 -280695 -213647 -48040 -963 23009 -275050 -339262 -55283 276812 -102661 102248
19238 -208731 187795 92552 -61727 -70630 -297498 109357 -264088 -384768 -329846 -326403 -99769
19226 -353585 59627 -235369 13761 -151663 4379 -54630 221683 -108319 -257753 -77490 -227214
19215 -227214 55964 73644 285480 81622 91675 149078 -202551 -203583 -41495 -70536 145181
19203 -104394 -203043 46471 126032 253317 -275919 -45246 8441 -81896 147861 -175040 -206068
19192 -206068 -96564 35937 -90914 -117716 8504 110698 -216601 15862 -481583 38196 -35678
19180 -40854 -139792 -351194 -231186 -97669 -527700 -141550 -63674 -83213 -340540 -499975
19170 -499975 209295 79133 -268453 -216149 -154721 16653 -91018 -249280 -9517 39404 -285960
19158 -141840 5099 -158623 133054 -225783 -18002 -70419 -55309 182439 -4179 -82576 52155
19146 -124905 12860 17931 -231826 -42375 52144 43803 22485 123766 -39425 5166 -279568
19134 -12315 -158526 -43944 -76721 -216843 -164864 -94931 138215 -93226 -149943 42509 48833
19123 48833 -306519 -365013 48028 -218771 233080 319841 -9400 -302781 9246 -223289 -158027
19112 -158027 -249080 -61492 -39287 -236875 -442884 27870 -4019 200796 -84115 -143394 -157009
19101 -157009 22553 92917 -216482 267525 -46595 202552 -167239 80704 -198776 -115574
19091 -115574 -37346 -742 -4325 51105 113729 -164567 50197 40953 -114487 -89548 -223179 139621
19078 -175598 177093 40575 -205322 62716 -5499 227995 5408 -155876 293983 9486 -283607
19066 -180395 95237 -21326 -72364 6611 255325 -61694 24502 -148899 93497 59891 138852
19055 138852 163396 -340012 -239492 -407318 -12870 -343728 -106494 37381 319736 198729
19045 198729 29875 -198302 180981 -219956 19657 96886 -87523 -17105 -226710 -189407 -124845
19034 -124845 109754 -454 -44582 -99166 -12910 -59560 -358227 19438 149132 -178555 -11892
19022 -48913 17919 -249635 54905 -574890 -58529 -140246 34942 54435 95115 64120 -308110
19010 135394 47125 52887 -49163 194008 -200840 114576 49177 -13842 -94152 -177802 201099
18998 2192 -122291 161264 56981 134852 -81382 209673 249123 -48402 15118 38861 -48759
18986 -45256 85666 372473 152026 135087 336925 79535 300796 102131 385755 87337
18975 -117249 -133877 -198669 81453 -12276 -144904 -321781 50899 -144075 80794 -427550 -112188
18963 -422436 67080 33445 298696 120388 222947 229029 301888 25900 784 75959 -72341
18951 196119 -141098 -86777 221597 17020 24054 -94181 77690 -220466 -125014 -367249 -54600
18939 -126755 -175612 82469 41195 -438541 -127565 -180264 -179079 -214660 -158882 -160471 48317
18927 -147933 -100766 -16441 104849 149900 -288630 64731 135128 55262 40097 62047 -233784
18915 124958 -176260 -191184 -87173 96074 -121625 -291473 -63972 141575 -187136 -108444
18905 -108444 240003 -167605 364567 126253 66677 232223 -85145 -349174 148109 109374
18895 109374 447849 419306 244611 87408 -233152 -143498 -44517 -72230 -127896 69749 216580
18884 216580 -37560 41083 -27860 319039 102916 -154301 148978 -373285 270118 -135229
18873 90066 -136431 95991 -268225 194614 -8926 28007 -339354 -58677 41079 57787 119045
18862 119045 65500 125614 80978 40222 -341663 -51196 59516 74614 62035 -75959 -188584
18851 -188584 -106889 -260140 -78536 -87699 204793 123201 -83513 -90902 -312096 -441355 97635
18839 -242075 246793 45304 -69217 63223 213046 211593 -83902 -10461 148518 72861 27507
18827 182577 230601 -442144 -190560 -155725 -71038 -441233 -91433 3984 191220 36125 -43722
18815 41306 -1434 -62242 -92306 -214271 -117591 -227047 52464 171445 -40697 -23042 -185376
18804 -185376 20020 -73295 -225002 -151661 -16555 83388 -12694 255083 16472 235028 61836
18792 -80343 55233 -248325 183600 -158012 -137013 -92682 -454738 9183 -212444 -63304 254580
18780 -639864 -195527 -38754 73691 -28498 -258177 -106916 -62000 260304 -104846 43558
18769 92870 78146 -260850 70433 -265080 -10142 -214178 -71918 27097 -236255 -189583 214049
18757 52354 -268089 262975 63470 131163 86235 7593 18734 195364 -200845 -121000 237450
18745 -153382 -62614 108905 -69795 204164 116476 -63898 -151253 -71939 121700 -31040 -309508
18734 -309508 -350791 -14850 -24369 -198481 -198188 -61895 -33867 -74587 156757 -161937 -153659 -362449
18722 -362449 -189054 91226 31472 117876 55828 -208573 73080 -161610 -193749 -928 93926
18710 -198695 -75612 -161279 32144 204463 -23538 33144 118437 -143367 -97102 -164554 27539
18698 48419 37759 -205219 356016 -92821 -95805 -88591 61525 -217147 -103480 -257344 96350
18686 152969 -162193 -70522 -260244 -284403 -232528 -121289 29252 -377693 12400 -73133 -172538
18675 -172538 81453 190680 -148220 31675 -104568 60920 -24797 -160668 -172051 -3389 -164399
18664 -164399 -19235 -117783 -157153 -207874 -37159 3940 170519 -337440 -285222 -96072 -217041
18653 -217041 101689 66479 55248 -268154 50948 -331976 -326200 30354 -282704 254728 -139323
18641 -93765 147905 -55194 15399 7839 22182 4678 -139044 -298281 -11293 -315609 99093
18629 -91626 221339 109988 -12959 -65971 -158959 -37572 -247847 -135701 394861 -98527 -236782
18618 -236782 75708 111915 -231300 269334 -4907 -271622 110351 -56778 -335312 -180234
18608 -180234 311430 11883 249901 152410 -232446 -249231 -107722 -190132 -58061 117904
18597 -15516 45876 203983 12364 20976 -43109 -136188 53560 168503 -168591 -114157 -349210
18586 -349210 -77422 -212793 23999 -113263 -91456 40839 -142982 -391436 -17014 24089 -221834
18574 214507 26177 -172610 20491 -87293 -10566 -167489 -130794 163713 -27163 249803 -192737
18562 -53823 35599 -250269 57283 -63168 -68411 -83906 -53056 -241714 -50205 -254531 57020
18550 -303544 -330421 -62306 -46861 127890 -506957 -221109 52157 210505 185662 -265075
18539 18792 -65248 -19930 -26426 -4558 370 -112503 -168714 82704 363015 14642 334771 -119378
18526 67496 -62596 262160 -34558 -281934 117146 -30178 -43360 153110 -34565 23048 -78781
18514 55649 -248907 67412 -39405 -103513 80319 111069 86552 -62360 -189461 -332766 203559
18502 65504 -89444 -65763 -143250 28928 -21948 -145975 -182960 -171705 173036 117377 -27816
18490 31508 -17203 -140195 55814 -17672 27674 -92187 136077 -362811 184702 107245 59212
18479 59212 -235468 -181393 103204 132692 -273742 18015 21093 -183917 124229 -298091 -75611
18467 76753 92346 -221172 107514 28886 -164589 134699 147892 -342150 167587 -51870
18456 213458 100963 -162159 79968 -337406 92218 324687 -100972 -159072 -166553 -70022 188072
18444 -221172 -93383 -124400 266523 -42679 -192638 203442 -61195 -80888 -149963 81123 -1059
18432 -137305 -31218 -314264 -193145 -350299 -233518 -106675 -44111 -22666 -214963 -263307
18422 -263307 -125714 -278493 45594 -227834 17353 -158863 29178 64481 6556 -12245 -276193
18411 -276193 -24577 127549 -173153 -70318 -298309 252830 155011 652 24621 382593 63232
18399 -143667 245995 -190782 -116646 37348 82665 119976 -125415 -142727 -112091 -53602 -61646
18388 -61646 -23766 -127814 -60587 85790 187383 -92576 32754 47180 -17688 -51162 62309
18376 -51211 3541 -4646 -32307 370264 -138231 -24315 -84102 64747 -172299 -78774 -117361
18365 -117361 284456 103003 -405236 -302602 -420413 16430 -211200 410179 -271622 22879
18354 -187044 56885 165802 -278062 -185230 -109000 66394 169607 -199721 239758 -76018
18343 92880 56703 -241989 -63719 -24021 243670 -113106 358873 -118161 -314675 45441
18332 -14924 -86592 -200462 10831 -205693 -21019 -206199 172367 -15457 -11304 -247783 -240292
18321 -240292 109792 68281 -62177 87083 54775 -73876 -133981 -514378 98424 -223109 -29182
18309 -98270 -20440 -15074 -179908 -321880 -291925 -215426 -41228 92437 -120595 -158824 -103567
18298 -103567 -30745 78065 167005 -257843 -72565 438187 -95731 -126422 49470 157190 -240173
18286 -211050 -179 66877 -58875 236631 73023 -257117 30943 53416 -46830 -389887 -135428
18274 93695 -55429 -114314 -53089 -146349 -120359 -118267 -47649 -35220 223264 -26446 -103201 89062
18261 30104 71083 -34495 172092 36250 83479 238193 -246588 369593 84572 105958 238987
18250 238987 253578 84262 21268 276260 -270665 -100915 430777 -81815 -89452 242094 16240
18238 -39260 -79855 228278 9664 87654 -70447 21029 3047 -39308 -275247 11663 -163376
18226 -43981 209154 -46855 370544 21957 51282 245767 -280492 -195346 46066 -143518 -23342
18214 -29385 -146160 -6490 -57875 -1750 -266232 143864 129005 -120553 126690 -31384 -162648
18203 -162648 71214 -131990 -79405 8686 -68915 28878 -95150 -231797 -292309 -155588 344489
18191 -187699 -68771 150304 158896 -303928 -197841 -71661 -125056 75331 230075 144268 -234270
18179 -196467 22795 116317 -52881 79151 96985 221237 -123124 222204 -207774 -56286 -168667
18168 -168667 -11321 -86080 139377 120270 -263791 -15607 302714 -412208 -290377 164681
18157 -184189 47917 21642 109091 -13050 -332319 -302626 214354 161885 -87558 -45165 83177
18145 159362 -158769 91348 -78097 -158931 -168984 174025 -125885 -191257 33179 -241615 -130233
18134 -130233 -353595 64432 -239798 22036 -76373 -194706 -388224 335619 137247 -207566
18123 -43773 -32136 -70611 258901 106827 252653 -391755 -175242 19604 -230149 164118
18112 58770 79813 264645 92826 -190964 -52844 -309646 -191762 145617 -145207 125893
18101 82523 165450 -242257 -258562 -76505 331818 -154363 -115160 -302444 -158250 -257155 -125783
18089 -164771 -33372 177836 -127474 131567 45017 242020 88164 154666 55283 68004 14451
18077 19279 -78750 5576 -188127 149103 -52204 -10602 -101114 -14491 -353792 -287726 36978
18065 125288 -94190 -111637 -92330 -141830 -162229 10907 -108580 -258055 12394 293013 -31472
18053 -368856 20400 -175234 180237 64780 -226286 60563 -111575 155504 188776 -205925
18042 -139766 202873 187139 -25897 82643 -62879 -67651 -219319 -4799 -246164 -205202 346281
18030 12093 8366 176600 -156302 -77570 -426823 -221849 235270 -136184 227138 243063
18020 243063 117387 -16673 336151 59086 -256091 197134 -216710 -116038 246621 -224984
18009 53553 -203323 242469 46058 134526 -176340 -250295 -139296 -201684 230255 -100464
17998 -142613 6730 -77632 289937 -85033 -213796 40722 2788 -266104 54661 94721 -33886
17986 88352 -269468 3180 -54521 325242 -300359 -35812 168352 111441 -1008 -61541 -37791
17975 -37791 -452206 46023 231398 -13623 24663 -25285 -277312 -88675 143373 -12775 -278203
17964 -278203 -196099 272979 37526 8863 -260284 100712 -14610 -178233 168954 145574 -263356
17952 372794 -8645 103170 -408258 -22658 133578 41482 176132 227308 104065 93480 259119
17941 259119 -68473 -323716 40967 364807 -11442 -84073 439084 20999 66064 -49982 -99897
17930 -99897 -23503 -191916 -14101 124516 -47416 -127878 -242564 160828 316624 -192915
17919 -143151 94270 -155523 179732 212253 19966 215266 -158168 179965 -280253 -142350
17909 -142350 83131 227281 26742 -77550 -338752 -46329 121043 24794 85831 -235855 -210674
17898 -210674 -53614 -6356 126069 73129 30417 73990 221332 -335147 8565 62180 -124729
17886 243340 -14110 243757 -218090 -89779 -27939 214410 28012 371819 212631 -87902
17875 3108 -69227 -24340 166244 -134740 94867 -79408 384925 -199943 265824 -108694 181916
17863 -74709 315682 -104037 128113 -22811 18283 280042 -124351 -42229 -32801 -139119 36090
17851 162111 -51430 57672 -119014 361144 46719 71639 136928 226232 68584 222684 -163016
17839 -32599 -155277 423427 -217057 -204107 -279996 -216698 188093 91359 -34618 8786 179272
17828 179272 -63058 -180046 330403 177857 94292 57780 102146 163450 116929 238681 182910
17817 182910 -8683 452457 74425 -176865 130691 263111 -5165 45836 269742 53563 71634
17806 71634 223423 -57604 286582 -34066 -64788 17188 -133722 -134175 -265047 -239794 230116
17794 56911 -150001 -76295 334346 -168846 -182487 -4791 258741 -58475 255753 286767 309651
17783 309651 -106563 424015 103250 197899 242251 -4041 -248351 60350 -403841 -144883
17772 -153971 -4776 -120808 133813 239887 -199088 122502 -80740 152360 137019 -131906
17761 -244753 -55293 190943 -53841 106123 -32660 -137353 411457 29122 154019 -101476
17750 -61368 -367201 17367 400013 -224587 154481 -132910 9302 35072 -146733 -64365 -18048
17738 -73433 -318314 10931 28230 437744 406415 437144 115807 159706 43177 -49254 -312796
17727 -312796 292760 -27212 -56786 294399 -51021 -117547 -427951 152702 -141147 -42750
17716 81044 203741 51628 424 -12542 12719 38532 136886 335540 38486 -6915 -245640 61690
17703 -126404 251231 -111360 177539 89511 137478 -89344 73352 -374241 181796 -48910
17692 -72059 -158546 101799 217899 53543 80348 -63066 -197088 -124831 148684 80769 -259393
17680 -58931 -84258 -18775 488014 439484 326123 -139693 -132975 -488479 -199316 169536 -126347
17668 -195965 -154260 -15787 261063 7689 106346 -161965 182547 91019 -66749 -208204 -276592
17657 -276592 218907 9213 67899 153257 283657 99558 107884 158173 339697 -304203 170771
17645 68344 146217 284290 131061 31801 154898 215008 18405 574425 155331 -120404
17634 3561 486907 318864 -291063 -14481 -64023 241872 253979 -158985 179052 360540
17624 360540 151680 244940 70305 57876 276580 97613 96823 330575 -58293 -153892 98599
17612 384752 160801 76751 348930 60145 71920 150256 123970 352512 -68122 291421 4557
17600 264802 26306 202470 63667 -253812 231833 -242966 515033 284462 241472 80377
17589 -112879 -79764 166288 87130 -183178 35607 527740 -154289 -181935 237894 479850
17579 479850 -25151 54194 183318 -28118 -116109 120544 503531 225223 90883 60790 592546
17568 592546 354300 -106803 186998 101885 343554 348008 154167 96945 86495 29946 333662
17557 333662 3630 274487 134681 328407 678425 89728 203166 168812 -244674 216453
17546 220965 142549 236064 -124786 158592 165547 -111979 282179 170022 243346 128102
17536 128102 37276 183383 -41893 365825 61643 430296 326941 18536 89771 43215 61141
17525 61141 379553 324408 422017 121988 -85775 44202 -4746 568055 306500 358630 293058
17514 293058 472458 573527 455119 815827 805497 828773 873627 684817 408819 686150
17504 686150 403186 55126 255781 319438 379859 503452 268323 875167 653844 845657
17494 845657 918709 820210 1177394 535305 626125 486474 280728 555403 195105 408921
17484 408921 169695 287636 103366 445155 230708 -127522 251649 335710 274818 260532
17474 260532 160231 138635 335659 153602 365871 602341 331078 263522 317530 302722
17464 302722 331086 313975 149018 458632 588182 68265 223068 513275 189176 410539
17454 410539 241493 339245 344488 45583 253510 230543 143022 627528 106150 288327 174927
17443 174927 323021 326285 -46337 312098 87240 210785 386070 91806 101098 281721 496760
17432 496760 175771 153806 264142 169631 229924 665191 358762 387036 244237 225764
17422 225764 317315 463853 148019 569303 664222 6968 340222 384251 328050 503502 167438
17410 295770 762825 12162 270642 623531 344320 228249 354165 129387 204303 461422
17400 461422 471713 219976 621042 142845 349753 331400 224667 277422 -20316 361078
17389 170567 347159 197455 116143 4027 41627 156336 317937 221949 178000 291099 -85738
17377 435278 61573 182849 489794 147225 479413 283816 363491 369582 299101 245399 274151
17366 274151 -96908 166408 122988 371187 54489 529522 513660 499278 249218 74513 206940
17355 206940 199812 381436 -205648 343732 82094 506862 132695 229938 -132091 255909
17344 80267 356625 366890 78399 90719 103267 136420 -26598 -176076 36797 388855 69227
17332 63198 204248 478363 195189 526612 468180 239658 71578 109394 96668 430212
17322 430212 228821 295909 222550 266643 451556 24816 454774 -83807 168209 383465
17312 383465 280753 53934 288527 303397 539652 381362 132005 249386 395096 390746
17302 390746 360330 344889 526636 297349 521407 351469 130248 424084 142977 234419
17292 234419 259759 291334 330944 174120 75673 319901 123867 332884 137599 -78750
17281 424012 125446 369935 229492 312360 408348 297638 103479 100028 412145 368912
17271 368912 253591 570278 278266 631404 354683 597603 -24276 -224747 335787 162583
17260 216084 99988 357883 170675 575700 368019 549723 701218 542178 -81076 416910
17249 84285 494339 409323 228488 783835 527688 359905 359043 292022 370868 464512 357739
17238 357739 377253 463661 752985 293922 425338 521422 590018 194213 142540 649316
17228 649316 387985 41792 495690 309536 198454 341971 769650 191871 383895 324486
17218 324486 435414 120495 170975 197872 9342 726555 283351 133413 447924 350678
17208 350678 327392 195795 112315 277059 353463 421205 156374 47668 528238 333927
17198 333927 571274 111254 290225 -61955 308954 383553 387846 310144 285674 78597 238963
17187 238963 815191 383741 419693 598310 338993 433041 400914 442349 70746 704472
17177 704472 -55001 409215 355315 513292 265687 135869 388566 625948 465630 620259
17167 620259 790433 693790 202112 550017 641330 535240 273852 836793 477308 380331
17157 380331 107857 203474 510563 659965 147460 566466 577816 254322 609597 350518
17147 350518 366913 276601 414557 670282 324951 125 621695 543857 503489 83253 487524
17136 487524 387206 483640 408587 397386 416083 620829 264590 386736 548864 412696
17126 412696 501369 560353 572691 624103 40651 377341 650966 364792 360244 646025 902796
17115 902796 341464 519189 396148 410243 614593 488001 543448 212699 471889 455035
17105 455035 580652 904888 842370 566463 803924 591659 551114 610064 279689 705622
17095 705622 511277 606621 611572 599650 696291 559563 569614 294019 723778 648446 373671
17084 373671 545576 676642 687336 436202 868933 407153 865207 884878 804219 892771
17074 892771 709168 623128 908394 990928 799915 885959 358306 812101 744503 501731
17064 501731 981984 479120 870560 519920 479240 984328 771595 908243 921814 802240
17054 802240 924134 678783 955844 900547 753629 927742 938721 726727 827724 881902
17044 881902 524681 767523 806669 567576 672179 884837 625050 890650 740918 1033859
17034 1033859 739454 824973 539748 928561 948064 1098422 946435 1129379 805139 897746
17024 897746 817906 818236 598925 1041346 823412 1259416 708158 708484 985242 895894 730254
17013 730254 1185162 666802 1054978 1109858 793572 994565 865202 967830 1034764 974586
17003 974586 788612 902558 1142146 511172 1282915 1239513 839247 883248 902982 1195905
16993 1195905 1266743 1027428 760651 1149652 1148757 1037204 1355447 1005921 893045 1467638
16983 1467638 1150061 1165084 1116704 1573721 1312669 1141045 1009092 1248610 1404815 1130195
16973 1130195 1082240 1030121 1605843 1316176 1517026 1329901 1305992 1245231 1365845 1494131
16963 1494131 1424187 1329159 1448737 1425546 1340459 1198388 1524873 1561269 1407517 1342659
16953 1342659 1432068 1502501 1520253 1530429 1360789 1391146 1553023 1571965 1424629 1503108 1618774
16942 1618774 1757680 1295041 1625420 1809303 1444815 1511989 1541991 1639492 1421435 1709670
16932 1709670 1463427 1712251 1652966 1865979 1538207 1767159 1894520 1705165 1906051 1822837
16922 1822837 1921390 1913861 1578873 1757332 2047282 1866108 1739553 2166944 2009298 1892768
16912 1892768 1540148 2019392 2014860 2203847 2191656 2130748 2329183 2154841 2228073 2128561
16902 2128561 2296295 2376106 2582636 2414845 2386837 2130614 2223201 2121053 2273869 2561776
16892 2561776 2913344 2761734 2746988 2465092 2601261 2699410 2434656 2965253 3051648 2910521
16882 2910521 2655494 2753248 2809607 2747854 3250258 2959214 3151324 2718813 2913031 3019885
16872 3019885 3044681 3615146 3489331 3262725 3176003 3190627 3179764 3354262 3720054 3431541
16862 3431541 3558229 3704255 3590987 3808067 3761917 3568025 4080693 3730974 4080591 4164580
16852 4164580 3883643 3793339 4200405 3880028 4369242 4291390 4181035 4521335 4508896 4502491
16842 4502491 4907009 4547266 4756538 4856323 5170788 4928668 5244914 5131183 5459184 5212542
16832 5212542 5278405 5408427 5554304 5738211 5738722 5886540 5957970 5974965 5979519 6445796 6301355
16821 6301355 6404961 6700586 6593333 6719278 6740089 6890848 7022343 7398960 7533787 7522892
16811 7522892 7625742 7745947 7778102 8388212 7911558 8120794 8279974 8436635 8690696 9014528
16801 9014528 9276234 9471165 9844141 9664884 9854548 10193909 10368660 10345222 10811088 11123670
16791 11123670 11250745 11468028 11783295 11763499 12494764 12428053 13118244 13390510 13623069 13980089
16781 13980089 14325324 14717912 15129346 15312600 15651227 16319366 16483432 17071797 17498783
16772 17498783 17562133 18438956 18971686 19214004 19732476 20250174 21113720 21501214 22491962
16763 22491962 23237675 23440637 24556176 25038909 25678700 26851643 27150732 28468444 29283196
16754 29283196 30167678 31436330 32409693 33479653 34438144 35965202 37196019 38525121
16746 38525121 39727375 41146690 42832945 44196854 46098992 47828862 49710879 51382421
16738 51382421 53873332 55625145 57693802 60110231 62238034 64502915 66880760 69871972
16730 69871972 71916630 75384222 77798271 80378322 83811874 86329064 89835532 92772528
16722 92772528 95594452 98497357 101711646 104300380 107091861 109904942 112309481 114796309
16714 114796309 116897686 118700872 120589218 121919333 122849751 123549107 123783129 123469609
16706 123469609 123475628 122664045 121865094 120739338 118953716 117016982 114757106 112565451 110361586
16697 110361586 107192174 104320504 101853185 98974458 95480463 92618759 89552125 86544267
16689 86544267 83650991 80719738 77833097 74969237 72406817 69380656 66772264 64438311
16681 64438311 61894894 59532809 57485783 55141556 53075249 50895771 49164814 47303613
16673 47303613 45285250 43668275 42273611 40650526 38898447 38046284 36630938 35119973
16665 35119973 34277067 32955636 31758477 30738102 29380049 28831427 27669969 26855127
16657 26855127 25910740 25248142 23946240 23697666 22786290 22185923 21636437 21010656 20430019
16648 20430019 19802363 19223810 18697448 18079285 17589286 17194346 16787804 16291611 15820881
16639 15820881 15473499 15099506 14726827 14449025 14112384 13381789 13167210 12820535 12655032
16630 12655032 12287454 12231714 11738111 11807858 11016643 10798255 11001421 10455601 10711777 9792703
16620 9792703 10010489 9489055 9435714 9291053 8769892 8903814 8846018 8811948 8401972 8022382
16610 8022382 8075723 7701606 7550613 7605336 7487132 7286313 6996609 6831622 6665172 6824723
16600 6824723 6647115 6496718 6266660 6504470 6043313 6012167 6183703 6016711 5801178 5384392
16590 5384392 5716946 5563999 5278249 5494322 5399490 5119716 5134161 4967057 5046984 4566544
16580 4566544 4921559 4692892 4716020 4417168 4632195 4559405 4284537 4231952 4033726 4279434
16570 4279434 3991944 3976928 4386013 3943921 3941618 3940617 3869253 3523315 3789329 3649159
16560 3649159 3623755 3155009 3634480 3299042 3157674 3191589 3247274 3079504 3232801 2908173
16550 2908173 3063253 2945051 2987176 3320905 3279155 2793574 3046384 2875525 2721197 2723477
16540 2723477 2601135 2446954 2782308 2596137 2985966 2576490 2736146 2441259 2416126 2473708
16530 2473708 2483062 2551202 2369839 2620493 2301199 2230631 2395634 2441134 2302237 2312698
16520 2312698 2651374 2016109 2209497 2485872 2101935 1767916 1692894 1925871 2196313 1868740
16510 1868740 1976712 1471467 2064767 1845737 2110712 2259110 2002476 2169090 1719787
16501 1719787 1753718 1617350 1439758 1660201 1633355 2066449 1762738 1910260 1768474 1435028
16491 1435028 1449029 1614779 1697495 1537372 1672285 1536720 1686259 1631043 1721148 1558854
16481 1558854 1669731 1634504 1370848 1891905 1875493 1281384 1536967 1473586 1461160 1162570
16471 1162570 1546892 1463934 871198 1208674 1345732 1617571 1317813 1444783 1332794 1348299
16461 1348299 1346490 1475202 1226478 1216306 1224441 1172995 1149528 1290419 1400008 1341502 976255
16450 976255 1170753 1025129 1208482 1037325 1101900 1233451 1408511 1366358 972024 1238907
16440 1238907 1389153 1174766 1104415 789988 1132061 986455 1309593 1003332 1198846 1108499
16430 1108499 949005 984464 1006645 704497 965084 1084719 964685 957527 1071902 923412
16420 923412 902629 800720 676107 1076216 944084 854523 742751 928868 1018633 521846
16410 521846 713905 963076 860995 609522 584192 969238 1007540 470706 669523 876365
16400 876365 841797 1044517 501666 931278 856661 725720 781583 1122405 634201 799584
16390 799584 750465 600348 641042 562920 1174127 616768 783074 768597 1060070 682822
16380 682822 751198 731685 849399 885576 539598 233122 425989 560945 676997 532109
16370 532109 488242 562918 656260 427759 485059 360180 546474 667830 508981 777401
16360 777401 361820 761160 395960 529886 587179 414258 529854 1060467 492595 604325
16350 604325 277996 771041 417285 352379 445764 663368 454331 640840 744421 609990
16340 609990 708384 415563 322145 677411 434358 480115 504814 283263 601699 689612
16330 689612 520309 861462 222940 130240 362189 367990 726720 154077 539635 258696
16319 495202 711871 548673 261811 459490 708626 504082 632922 459153 494940 283707
16309 283707 213964 578828 458472 440435 396478 540439 415634 589250 581726 405304
16299 405304 457365 482700 361908 325065 408797 524386 350548 354740 331394 634925 470503
16288 470503 477252 407489 499097 224603 631957 604327 219374 776042 700253 435214 338597
16277 338597 508188 218920 223744 385963 408496 208067 496376 431722 706382 428083
16267 428083 395741 545567 266838 359473 184052 292252 285322 155491 379552 169122
16256 631493 372892 541624 248404 170934 367222 347425 741013 637362 355113 115145
16245 254706 428427 730309 -72801 226502 521748 161994 84119 398596 215425 279233
16235 279233 52294 67411 91546 251291 574237 254798 423954 225319 43976 246638
16225 246638 256333 456578 362464 399743 61775 22095 52296 64846 32158 239389 493069
16214 493069 -66194 393041 382515 320118 135312 358291 352898 -27696 277871 370536 -46306
16202 336507 290888 570055 140570 248903 463601 -230172 466958 385628 91069 271172
16192 271172 457679 202542 645581 417243 285460 296822 -13839 353703 167345 169952
16182 169952 3744 51588 52737 327905 111870 27568 411810 171545 133472 -120623 264681
16170 155185 257110 593426 255246 273419 -83626 409161 223666 344223 186126 938
16159 221960 198968 212637 -261205 368734 389538 94428 89940 82101 508724 98020 355476
16148 355476 -54323 -197531 341227 485100 432370 293752 123878 181540 312644 343118
16138 343118 190922 73830 111534 72576 -15172 72010 120416 55610 -110066 -21125 317285
16126 169469 -137926 362930 173369 439390 491791 145038 -128792 71051 94036 502405
16116 502405 14201 58315 8076 141839 55211 356519 -54050 221775 15546 312784 333430
16105 333430 -32663 -65898 160637 -38296 253300 62928 21885 -9760 -211005 273696 -213677
16093 193330 -120955 175034 215926 166969 -318635 195831 -28514 289814 279902 217424 -245806
16081 192536 307946 98025 -57493 78184 178252 270936 4244 48484 44512 -15360 137929
16069 244306 61472 44547 -50213 563 9533 -106834 112836 214882 209125 98763 127618 27730
16056 -39824 88954 117921 76096 -4386 327745 -16128 231153 140596 129537 24435 -22842
16044 218953 78666 63409 -144553 56993 142550 335069 265494 -101741 -86162 -156431 -297408
16033 -297408 -147016 18267 32260 173925 -194324 74485 -220969 -121222 303052 -19386
16022 255260 10461 62686 -111276 -204997 -46596 56988 126338 73288 -288899 -32548 45385
16010 25436 -54710 352364 -161095 178124 63716 40512 143212 -15588 -211836 -54661 -79728
15999 -79728 490095 162239 -4371 459662 -38131 35786 54675 -195273 -142742 -51404 365019
15987 208952 -170399 114288 256995 279796 -152022 -44836 -304 -145066 141797 -237865
15976 -182630 199772 223151 -79628 399498 622173 442855 1010960 1032127 969456 776783
15966 776783 641611 686826 549851 129059 175106 283980 262009 44045 -256298 -103189
15955 56817 88950 172416 -22960 182083 -368639 197763 -128703 105535 145110 -105633
15944 90311 -56852 2760 322645 -114 -55880 -69716 -177492 123943 367586 -5040 -8911 226212
15931 -20027 -123927 55892 -251557 42720 -94290 143022 -233900 301549 321925 199056
15921 199056 -217219 184144 -166912 -60475 154217 -111876 -126843 -43842 -81370 -159375
15911 -159375 -132328 80525 156602 14101 -242857 82821 185912 21710 -54721 -26477 -75442
15900 -75442 -129756 -167505 -33419 55541 -165754 65942 49795 100961 -290713 312268 -442809
15888 104149 -60875 -357135 -12367 -16845 24972 -87928 -697 -315347 108752 -202503 47402
15876 6815 107204 -142365 -152580 -51039 255831 132595 242192 -96802 413294 107483
15865 -25096 -21436 91743 47075 151279 -184776 -41108 219312 54229 -165547 -18573 -80846
15854 -80846 -23354 -222498 113627 24399 -476173 212953 212908 -109561 -217004 -169398 -249844
15843 -249844 12069 -99264 -94978 61369 228890 235884 -41267 -112147 -156866 -197619 -28501 261070
15830 40362 106844 149056 -44636 3380 -137931 -435915 17382 35546 -181792 15551 -291844
15818 20183 216642 -168489 -75534 141657 -153150 34862 -138506 46370 44532 -209782 246905
15806 -27692 -205415 -231296 149575 41819 -106790 -44939 115927 112618 -145171 -103282 8702
15794 -153097 -61113 214998 -128274 92757 -9878 -34372 -127204 131211 56760 -66347 -104432
15783 -104432 -161897 -10092 -393171 6298 158959 127871 56878 219025 223279 -49024 477573
15771 35137 87146 150898 -97078 82379 -197361 -71275 -111604 99876 -79737 -210604 -287784
15760 -287784 -6076 54271 -332541 -62827 -216073 -47716 133775 120218 -55125 126911 253896
15749 253896 -383207 -112029 -143514 27866 212343 -29789 -213670 194145 -87342 -88867 -100614
15738 -100614 4985 -408090 -20473 4757 48204 -146653 -393738 -228167 107843 -207265 -513250
15727 -513250 -7748 112559 -234278 50718 -81136 110343 -104873 -236605 -125880 -188482
15717 -188482 -183866 -59559 216285 94028 88812 -341309 -189551 364308 274902 109253 16608
15705 301048 114800 80388 382404 -141669 -234421 285709 -8373 104533 -14928 159378
15694 7455 12207 -32383 56468 52049 58716 -155341 251 124471 29905 -180074 19531 -115843
15681 19861 -253081 197077 -128471 202067 -33108 -43192 -92468 -172588 -323193 96408 -449730
15669 247104 -69016 -451917 15162 -36199 65593 54266 186348 165105 -543913 124796 -177488
15657 -13780 278171 -72073 70646 -41674 -91110 -262041 -230027 103519 -77627 45283 20437
15645 86144 55016 -172371 54291 169761 191243 -236780 18451 -85270 -355758 47127 -94173
15633 -27467 -131634 26872 -53913 -143776 -148503 -85893 -167454 -102335 225148 -281731 -191946
15622 -191946 509 477191 111350 78253 -79248 -99087 -217112 68888 -98275 277537 -167215
15610 46150 -182389 304042 272373 -148727 79158 140951 -30968 -170248 5645 188135 144448
15599 144448 147911 -213562 -109958 24838 29646 61793 -45031 -36489 368540 -68447 -449963
15588 -449963 -43380 184228 -94026 -68495 328310 192706 23612 3787 364339 -146073 116056
15576 193797 -178168 -170242 121570 -497897 -293004 -23395 266265 -79281 -59133 -242556
15566 -242556 5929 294189 -143851 -131762 -31660 -391733 -139531 71779 263746 150038
15556 150038 -265698 198896 -113749 -420383 169834 -85799 -218978 -15381 -39895 82298
15545 -211144 -101218 -51106 -151851 -109025 -561415 -220815 -129228 44351 -142122 63492
15534 132229 -78190 -216260 -139320 27461 12087 187507 120713 -65374 191101 267081 46356
15522 98168 -83806 -204933 -43004 -193478 195949 -323066 -294112 -324723 275208 172252
15512 172252 186396 -218743 101262 -93573 75226 -2381 -5582 95570 273420 -78268 186870
15500 77062 -33439 370653 149457 140180 55207 168263 28927 140022 253015 150950 96532
15489 96532 417863 -89296 433200 117393 118743 501889 259309 257757 140814 96638 198370
15478 198370 134515 172730 158503 264750 207139 148922 59402 -4861 306062 71246 32112
15466 -80469 87946 121436 180253 25536 -65121 50643 9073 283487 822037 507565 692691
15455 692691 469087 197686 290742 -66074 -198360 293412 95615 125476 -91044 211696
15444 118070 -210859 -43015 -79243 164 6842 222110 116083 -41097 129571 -217722 228692
15432 -218332 17382 194216 -57861 58655 191517 261379 756513 534229 1144175 701337
15422 701337 366659 229128 370668 179644 -201799 -25024 -173031 -139439 64576 233611
15412 233611 27919 326390 258110 -133495 27799 114254 -475979 93703 -171627 187239
15401 74895 92624 -93011 -28534 -21046 85274 186947 128498 -29567 31310 3695 -174667 -217595
15389 -217595 42889 77997 -173893 -60793 101481 46971 -27308 -46722 -129656 -70493 376385
15377 -87043 33225 -58817 -77924 -34331 -76299 -79368 5731 8695 116977 111471 194078 27169
15364 -48147 -107527 216533 103767 59542 -19314 125456 236911 320968 167832 296855
15354 296855 244043 -57165 174170 78865 -132714 -109926 -269799 170382 203692 179938 404622
15343 404622 80430 78799 128884 -64979 246595 235528 161196 83318 -62988 163276 6115
15331 518190 157016 322821 1560 85831 148293 411726 228726 301396 111814 -176230
15320 -135464 217486 159397 65814 72865 221867 240930 368388 264138 -80931 222624 473701
15309 473701 -70435 273228 -87218 124810 284662 45353 497044 301789 274418 -73311
15298 -82387 162686 -35824 236331 118061 270279 328931 -92808 1152 592983 24976 168523
15287 168523 -176430 124139 152757 315906 -296006 159205 110162 225132 21562 -24044
15276 -76453 -135806 14432 234787 36801 162978 -46746 142012 37340 -44955 56920 20927
15264 -82130 -153624 368745 -145228 -243684 226727 156119 -55671 186263 173835 -147430 -278911
15253 -278911 -34866 195696 18844 243175 -215676 -143057 455434 225951 21002 61292
15243 61292 -121968 2818 215501 -173292 85685 277353 176455 334698 222333 351058
15233 351058 306017 118397 60835 335002 208846 842859 914911 1702802 1097366 1399254
15223 1399254 1010207 556259 406747 147314 173555 131322 -324755 -221560 130158 151514
15213 151514 327234 221496 355355 17107 24113 112275 270597 74906 874 -132364 423871
15201 -128988 -414689 -66176 -144514 224741 -32539 -19981 110193 185750 -153908 89399 -299770
15189 34594 233447 294866 -94025 162220 62079 107785 288814 -144257 78630 18306 -123006
15177 -122686 106193 247332 -302642 404746 -17458 386129 225127 -108638 -102337 108376
15166 265465 -9486 279828 356728 195321 54663 324558 -32808 242695 174076 -24799 -114890
15155 -114890 -139742 -30681 -70965 235723 -7304 58339 -172717 63677 71382 -249332 10750
15143 -257582 214361 204893 -22419 57192 436167 132872 381352 12110 320816 17768 -50482
15131 59655 115525 -44488 -18329 -283052 76179 226540 108252 25528 106414 99697 95541
15120 95541 -37182 -40169 30195 144835 166392 265752 -17174 288795 -89871 418850 -116262
15108 -209945 -90631 421620 92940 535530 418878 410300 151145 291610 91265 149390 212396
15097 212396 219838 333270 -104342 345034 12734 240135 -222547 277803 -96485 -39231
15086 36428 62343 269278 -117400 173257 209030 -78546 5321 5942 219432 -32764 80173
15074 89282 -74150 86751 284493 215582 -210214 167141 49388 136272 63610 -193635 95044
15062 -56536 -64372 209325 128012 -144286 395568 -141424 -58317 -237456 -263799 163938 118347
15051 118347 235605 211843 139257 154317 -140434 235090 49703 33799 96490 247497 226912
15040 226912 416660 393927 214174 276863 369302 64153 408422 434643 177751 379313
15030 379313 417848 389380 148923 452532 187270 479801 350856 484523 539713 199057
15019 -44260 434532 309474 378837 363245 471447 617767 419616 552932 502074 796645
15009 796645 513912 590669 443732 406214 306817 920934 281369 82775 892798 431371
14998 151013 470480 558499 354531 326954 379568 565556 399418 310635 361193 638848
14988 638848 156340 74308 203218 388969 541483 278736 287633 601788 253654 513197
14978 513197 431990 346958 566475 595879 381835 615238 471279 454853 439135 604826
14968 604826 438520 636536 769062 782046 390152 517661 459962 543156 647568 293442
14957 -42745 538947 306734 418577 374520 486352 -192218 134139 217317 405012 263561
14947 263561 8689 180044 237113 101817 552100 302334 281672 653438 377942 141198
14936 481503 538561 405378 503419 126930 587241 357876 588578 448283 259876 649174
14926 649174 584269 700974 480202 380231 508470 586988 411256 422134 783531 822709
14916 822709 637683 850711 866330 1177513 1110745 1160244 1611046 1266733 1480606 1484987
14906 1484987 1194652 1285969 1546391 1171290 1743843 1650481 1758396 1652400 1257311 1763174
14896 1763174 876504 528455 994959 341737 568543 838125 488621 805378 444994
14887 444994 182453 45314 231899 241577 315030 445633 326678 259129 474612 794089
14877 794089 519830 545308 522795 373818 587553 670088 545666 407849 569741 834569
14867 834569 734970 958510 682576 922337 554874 558107 856436 736207 272108 701629
14857 701629 230243 444474 272240 422897 395470 495903 439901 710830 748709 670231
14847 670231 601386 362295 567144 420984 380466 498583 393178 200566 188818 622416
14837 622416 412226 151551 384028 469224 386576 408168 306058 487673 629662 851856
14827 851856 952484 766615 977051 1267615 1147349 745768 733292 627038 679484 655167
14817 655167 474650 661213 488960 595688 126916 796053 365452 486237 665555 525403
14807 525403 627301 852024 649574 601081 680571 861573 572438 1024136 551741 802325
14797 802325 596099 638387 648633 677997 931571 869376 676757 447226 899419 949092
14787 949092 953523 565208 363062 658151 605948 359956 570922 396772 280195 458733
14777 458733 747501 814830 727184 794027 401832 474647 302515 627686 573693 459124
14767 459124 626462 496596 864911 1246283 956428 746421 873551 637703 543979 436804
14757 436804 801386 875113 690293 826336 626952 459392 737361 818139 676901 581864
14747 581864 455415 890158 629491 604002 750561 997148 650271 626302 735004 821686
14737 821686 545116 462104 805300 634145 360786 606970 662447 712115 448533 772606
14727 772606 816150 650852 845810 742743 673128 699152 870496 601357 720934 944811
14717 944811 690339 946861 1157086 1520532 1212425 1496145 1266214 1234984 1479316 1224247
14707 1224247 1211719 976519 1147492 943709 1082672 1010439 976625 915886 518971 915020
14697 915020 1273850 778263 863151 780484 995037 1046178 1041852 1250253 890927 1294004
14687 1294004 1580916 1669726 1519732 1776982 1385851 1257195 1089743 1117886 801040 1062678
14677 1062678 1141746 856846 835019 922416 932051 1015712 1025833 767554 805357 1068035 679916
14666 679916 1140204 843562 855004 757767 1039331 948607 905249 1020208 873338 895882
14656 895882 876485 968955 732786 985381 821199 1121166 1163599 575470 1093032 603241
14646 603241 846794 784142 1026685 977560 928921 1278240 1033184 1084658 1087621 973336 1103514
14635 1103514 1334504 1583909 1386238 1460198 1082428 949984 1097339 1148766 1255689 1047483
14625 1047483 1057067 1154384 659063 862459 1037761 908394 1171047 1278124 1231086 1627829
14615 1627829 1189423 1168092 1074041 1234816 1432895 1226700 1397224 1405256 1413813 1261157
14605 1261157 1461024 1115830 1474354 988449 1355703 1165619 1164772 1532705 1577566 1682004
14595 1682004 1402297 1363672 1253205 1542157 1314781 1509163 1724407 1387502 1187620 1584541
14585 1584541 1419544 1680087 1561826 1693927 1564365 1929827 1676849 1469199 1709283
14576 1709283 1654319 1637380 1506540 1743653 1916143 1570023 1776972 1401729 1773434 2026432
14566 2026432 1699236 1649264 1696897 2134847 1915461 2195161 2096018 1936567 2085042 2012210
14556 2012210 2177792 1883614 2182405 2174754 2321389 2643325 2212803 2309589 2535741 2427028
14546 2427028 2544867 2530329 2744198 2706799 2924355 2942839 3570102 3570352 4326844 4838520
14536 4838520 5576116 6898262 8894776 12915213 19696689 30852999 30817790 17561768
14528 17561768 10048041 6375275 4620200 4175455 3875669 3992843 5144804 3897335
14520 3897335 3141848 2416507 2211304 2070648 2273641 2037211 2567575 1938465 2068192
14511 2068192 2223355 2074546 2117359 2658341 2241905 1809543 2086148 2453601 2414063 2357057
14501 2357057 2079908 2648278 2484632 2636858 2587633 2716198 2449575 2364702 2718229 2865955
14491 2865955 3161919 2739579 3021579 2943464 3159105 2820786 2809405 2979970 2924740 3084486
14481 3084486 3065861 3146207 3178976 3255827 3206593 3351316 3602597 3268670 3469757 3462758 3602753
14470 3602753 3222907 3362653 3868267 3685392 3746469 3541007 3938159 3930650 3488446 3440467
14460 3440467 3613781 3684847 3973051 4084377 4204960 4007456 4046747 4114064 4344948 4361125
14450 4361125 4275453 4535418 4264908 4505442 4675869 4716223 4422364 4681187 4733465 4584196
14440 4584196 4687130 4623856 4603870 5064016 5201710 5445532 5484914 5071183 5145780 5568215
14430 5568215 5278878 5416298 5679147 5704509 5837275 5496542 5934867 5862726 5976828 6273710
14420 6273710 6160935 6249963 6785554 6374860 6190468 6649260 6957304 6594457 6859848 6833482
14410 6833482 6947055 7300618 7062740 7204807 7867197 7364425 8055260 7896039 7900620 8420790
14400 8420790 8417363 8476842 8441695 8636218 8405236 8735128 9033430 8898510 9504793 9431580
14390 9431580 9224527 9729022 9945952 9769841 10116434 10194447 9906597 10144421 10580724 10621518
14380 10621518 10919422 11486138 11175685 11083575 11372737 11808667 12064269 12285395 12357821 12579158
14370 12579158 12965980 13490975 13334189 13563069 14114485 14357635 14315687 14929796 15330489
14361 15330489 15168718 15890163 16023204 16167789 16382263 16461349 17085099 17171937 17938524 18412172
14351 18412172 18582118 19183961 19760893 20017521 20246601 20518428 21151253 21257559 22115954
14342 22115954 22564431 23104913 23140172 23979878 24605052 25005416 25852153 26187548 26879911
14333 26879911 27929122 28919687 29116619 29906729 30752617 31603027 32670591 33422415 34446968
14324 34446968 35071287 36212645 37006041 38491023 39378896 40318978 41440151 43366428 44378194
14315 44378194 46027740 47054245 48849798 50723003 52225061 53853979 55950780 57635422
14307 57635422 59805722 61824344 63908498 66468082 69595388 72107423 74681492 77060293
14299 77060293 80128811 83515144 86572189 90586984 94174431 98433664 103048840 107653845
14291 107653845 112521956 117484909 122903537 128736013 134804979 141190001 148216239 155979875
14283 155979875 163430149 171711487 180678920 189848084 199595751 210092719 221035887 232414977
14275 232414977 244795593 257206689 270927467 284785841 298950068 312803071 327118586
14268 327118586 341651527 355715727 369552323 382998996 395091535 406213506 416896002
14261 416896002 426091568 434660487 441771148 447358206 450190436 451913756 453805423 452131809
14253 452131809 445589612 441114706 432250292 422574688 410365677 398889179 387545206
14246 387545206 374678066 361420072 347545913 334367464 320648780 306795381 293163752
14239 293163752 280078936 266816030 254190696 242376120 231641577 220823336 209933916
14232 209933916 199055439 188721072 178930777 169949386 161400750 153578230 145768260 138848922
14224 138848922 132433852 126479835 120765227 115489848 110045574 105475063 100718079 96902627
14216 96902627 92808192 89180713 85632275 82145834 79139793 75850424 72904027 70531841
14208 70531841 67717849 65487311 63160027 61026906 58983375 56899483 55021316 53291240
14200 53291240 51727263 49925021 48696834 47396690 45706503 44161011 43152231 41664085
14192 41664085 40949059 39907144 38420648 37007197 36057659 35152428 34458966 33631141 32813738
14183 32813738 31897220 31018825 30078463 29409244 28691723 27528516 27378127 26484850 26199062
14174 26199062 24949955 24789067 24228781 23712294 23071595 22513933 21969684 21557473 21450616
14165 21450616 20641451 20091155 19652161 19220859 18974408 18792243 18226414 17964900 17771685
14156 17771685 17297439 16761062 16651011 16188125 15659433 15838138 15225312 15227367 14960050 14733641
14146 14733641 14217447 13946199 13900339 13723609 13405633 13029194 12786171 12427027 12798550
14137 12798550 12438366 11859158 11769861 11886982 11038791 11338348 11162567 10888412 10740865
14128 10740865 10656965 10448399 10190589 10119892 9775004 9768813 9484681 9433303 9373719 9453670
14118 9453670 9153585 8958286 8699513 8719268 8744113 8357063 8584305 7919222 8235742 7915157
14108 7915157 8083027 7665275 7862938 7637549 7858468 7622201 7134491 7231983 7049966 6971887
14098 6971887 6559959 6735689 6726407 6841652 6468406 6680425 6708903 6263549 6157466 6070183
14088 6070183 6159008 5763186 6003676 6046417 5776339 5550318 5414707 5624533 5603981 5761886
14078 5761886 5291648 5166597 5544690 5436157 4806178 5309371 5385601 5343495 4742078 4949942
14068 4949942 4832247 4859450 4744806 4400263 4495547 4711871 4385949 4558321 4460043 4774033
14058 4774033 4178046 3964549 4319227 4235793 4323762 4283338 4046309 4390976 4218603 3994347
14048 3994347 3952892 4218843 4220682 4104535 3997514 4253287 3982966 3835395 3500024 3651873
14038 3651873 3724634 3570812 3387870 3187665 3657189 3222027 3180644 3408229 3561425 3088410
14028 3088410 3304109 3347410 3049691 3354911 3346968 3030478 2943160 2805302 3003414 2783111
14018 2783111 3006654 2871977 2848142 2835700 3003414 3150530 3032224 2763447 2517199 2792184
14008 2792184 2648431 2571594 2700125 2697360 2569624 2526312 2435786 2193789 2491299 2480419
13998 2480419 2615164 2242158 2577383 2257109 2547105 2300891 2325365 2434278 2242321 2495379
13988 2495379 2356629 2409320 2365664 2323852 2011297 2095967 2516046 2336270 2420871 2337380
13978 2337380 2545119 3022920 3618786 4437929 5307609 8813658 14405211 26050695 33686631
13969 33686631 22022062 14232587 9376890 6897034 6098376 4974981 4639553 3743572
13961 3743572 3470218 3438657 3411839 3117149 2849385 2947880 2644213 2524062 2361245 2320523
13951 2320523 2251510 2177633 1931753 2257839 2247935 1971097 1990070 1791263 2163123 2073022
13941 2073022 2057358 1927497 1933617 1911853 2117793 1814264 1927820 2035834 1796381 1879981
13931 1879981 1942676 1696611 1685485 1877371 1705093 1822291 1885640 1465173 1788484 1906525
13921 1906525 1855028 1813662 1803432 1393440 1434414 1566588 1537969 1524063 1850853 1662190
13911 1662190 1725882 1649438 1331709 1705047 1636281 1614373 1309442 1510601 1720511 1441005
13901 1441005 1729588 1495085 1432648 1569196 1339617 1606063 1478752 1399624 1181472 1556246
13891 1556246 1320593 1258107 1242640 1237496 1260121 1341840 1437952 1327387 1450466 1115294 1262427
13880 1262427 1234696 1346767 1188691 1316620 1291151 1150026 1115435 1333062 1321554 1166586
13870 1166586 1161132 1128583 775765 1090245 1293191 1060398 1372701 1473317 1419971 1070883
13860 1070883 1519741 1026130 1102449 1025187 1105976 1042054 1137469 1116851 1121061 970060 1021705
13849 1021705 1109798 778310 1127133 1189563 853045 996744 1076856 885336 1271332 1058646
13839 1058646 1115907 920612 722476 968510 1187249 873665 984714 876402 1065490 1389245
13829 1389245 684605 1186467 1267839 885488 1006569 1270756 1046812 969389 812906 1168547
13819 1168547 1055899 905556 912956 908094 1106277 984541 889153 1012185 979800 650271
13809 650271 763990 557539 923979 964103 640199 897958 813758 965584 450713 908873
13799 908873 736101 975624 844003 1098028 549430 1070506 1079986 844732 698705 846952
13789 846952 778399 1089659 658487 601631 867217 817927 886299 720515 549486 591552
13779 591552 552781 620516 672255 646744 1146179 733826 717620 794482 887659 832019 654971
13768 654971 564469 796042 579495 625236 492940 452386 613780 895420 595780 544231
13758 544231 553746 465262 584432 709658 722995 274866 994342 535102 615047 508340
13748 508340 652755 525638 610123 607346 694908 586136 880319 628136 712652 551040
13738 551040 582524 656358 627209 679694 648724 1046361 329980 754159 357425 754852
13728 754852 550234 684510 623421 547676 634040 724442 637335 733114 595861 180339 530803
13717 530803 515312 721718 526611 608869 613412 622875 634132 522629 524639 768466 806502
13706 806502 784078 504301 540686 408466 394547 705902 557271 355998 421304 270822
13696 270822 707343 597430 346098 337913 650142 400890 657718 307403 621322 535004
13686 535004 265819 514569 280388 576231 771437 398554 496613 489410 486244 358660
13676 358660 680282 641221 571867 876073 366882 325753 691063 585964 309028 497316
13666 497316 575120 327489 655318 214893 673996 728533 656988 662646 212801 442243
13656 442243 148341 150678 546287 355493 189203 289427 355119 353482 376380 564692 620624
13645 620624 262422 424705 416488 531472 265305 452654 393646 702917 515133 430058
13635 430058 703548 197674 430652 458993 395232 369396 247958 239455 265023 206035 755089
13624 755089 216266 745314 611602 34651 309615 456995 612824 503457 574215 157831
13613 261627 396583 707582 209540 101573 340623 509165 731840 316532 -4627 401645
13602 352715 347064 453414 746831 345485 715922 512842 256482 306031 280982 649897
13592 649897 422451 56995 328545 601637 121603 263152 196724 556870 270770 294998
13582 294998 29248 619549 461693 532961 216603 466433 384992 413510 296617 485532
13572 485532 482186 411357 637338 236863 539620 392320 340839 698082 419905 319640
13562 319640 161076 77064 334701 483142 -134788 165933 453931 238411 560139 287891
13552 287891 272925 85550 740570 260443 160416 193736 300019 140805 521975 134693
13541 164000 95384 315793 222720 -91607 374137 556796 272674 170474 388139 396194
13531 396194 -96001 423745 526643 331472 431058 157725 244353 333945 448593 272068
13521 272068 229343 157212 314377 422098 484035 88611 500271 330365 11136 43729 82326
13510 82326 241426 426105 506813 424033 -6451 319025 323933 159809 198095 293914 421708
13499 421708 188140 121241 344511 478019 239172 189121 866880 391098 503088 284631
13489 284631 433001 87233 463928 143256 -53465 -25629 169878 133737 417037 376667
13479 376667 129681 223822 18964 130319 119310 -50361 178953 282229 311096 167739
13469 167739 270127 320774 111498 322294 52205 162363 355999 1705 243494 203973
13459 203973 218253 175882 316143 90943 -172455 194648 289912 468331 482337 472701 411516
13448 411516 406160 319480 222640 -18724 194380 92758 385513 310830 123637 185178 370052
13437 370052 126054 121267 115064 173870 348197 168773 188867 328491 221215 169844 195831
13426 195831 200265 -132928 484214 184777 497117 155415 129188 -23828 270948 19135
13415 177495 262972 327603 233757 104171 189871 12937 186719 121721 86721 192514 302010
13404 302010 247867 364914 343762 139752 40022 319548 128468 66541 344339 337389 319135
13393 319135 84522 261441 227142 108777 347418 114427 301965 499480 132785 402622
13383 402622 50567 206088 16300 290473 -46796 312733 -214824 173073 6066 50540 9500
13371 334973 336361 153051 577558 227993 180514 103293 504988 226806 221006 480033 157933
13359 16293 51595 -29631 282261 121534 358178 371390 -42146 128203 21412 33599 302939
13348 302939 -173082 383148 92040 63638 328241 191189 364207 147395 83224 429672
13338 429672 444399 539559 95478 209481 177270 239843 253721 277068 382883 433401 70362
13326 -42773 81862 269638 464038 -141302 262144 297078 25594 105802 201684 499445 549216
13315 549216 4663 245244 655915 190236 271143 203106 -17313 101661 269029 334998 74791
13303 328986 131763 325696 12346 408541 218080 137684 87797 237045 -85317 88210
13292 81122 304050 83862 460257 -818 15138 290809 52455 394501 -33097 402991 -211807
13280 179118 315872 55684 466996 225508 360365 96359 -127150 91729 170885 547222
13270 547222 285625 225187 64554 149594 187394 -20743 -40274 99744 -12860 56035 111296
13259 111296 293406 140282 31199 443299 98567 -95322 -72671 285701 295631 248838 -55190
13247 252604 240536 78987 -151827 -208005 24679 367023 -61486 293805 45782 205192 353531
13236 353531 170620 335554 -22010 -10603 9968 -14168 -69562 -9344 138042 71984 -11415
13224 65536 205211 29902 -203668 384969 -91891 -10752 238151 195369 107626 315381 -126454
13212 422401 169620 19685 472239 15836 70311 167228 250582 283871 293446 188547 166039
13201 166039 -4789 -26999 166837 15119 142508 -84673 15782 -92625 168644 -166374 87995
13189 27067 -146546 -73382 92814 -100066 -300387 138444 290622 1373 -49443 35487 -90497
13177 64560 317569 319567 103297 -296090 31563 176769 -17361 277842 165821 368430
13167 368430 169750 -9022 -114962 148527 31305 213135 243251 122980 161265 286912
13157 286912 9696 -24491 127026 -88280 209141 -11661 257335 -65809 -40811 -131307 191978
13145 -149018 38491 283135 94405 -17517 206374 299122 45681 245153 328262 305706 110560
13133 -172279 144521 -251843 284213 13319 2124 368869 -89726 -125430 -101582 196198 136372
13122 136372 133904 107596 29750 48254 271866 -24982 573697 277236 -22818 -91192 104508
13110 81049 388671 -113178 -393921 -38581 326382 -70419 238843 -22988 -103071 4250 -116600
13098 115702 57877 100759 8084 354591 136567 -301791 102501 458514 118519 -71566
13087 16626 91401 -113358 274696 -48384 -140456 303079 60423 179190 -104993 223270
13076 307457 301327 -104357 433771 182356 18119 206660 -50196 124164 -307279 188299
13065 -131288 283456 298715 205762 -59775 105621 101362 45292 -33523 -20733 272260 -235316
13053 -126593 42262 165454 6315 -86616 -31190 -15720 68272 49325 120585 345768 302820
13042 302820 147503 -51419 198167 89275 389590 81258 -114430 130459 101242 197533
13032 197533 270520 116052 310178 15459 -68919 123036 181231 30278 369473 57065 192254
13021 192254 42008 46661 7159 337666 -61372 84077 -123192 -163405 -64439 133513 -106722
13009 106421 63161 103919 -288673 -21209 -105534 304911 208143 387310 22148 51179 34744
12998 34744 177243 173339 31011 166492 -162925 -63383 -172323 236471 377515 -151892
12987 -105866 325312 163534 166480 272514 55592 372097 124572 -11558 113588 18803
12976 -118200 225473 105903 -87125 3284 -179014 7136 394939 212243 234026 206598 -179927
12964 36652 189156 311701 30012 141193 126416 283890 110963 305968 32717 71707
12954 71707 244020 192774 54832 -381044 -76269 417204 339115 5015 -130931 217788 -67793
12942 -103093 234292 -2165 -5966 -158143 218765 -83620 -179969 333589 -5527 -123173 218235
12930 -207325 42206 115292 -118475 -248794 -34574 -163860 123692 85148 -119545 -80926
12920 -80926 -34678 172067 -215798 2342 255663 230753 84214 -4182 201015 9254 -25874
12908 -138142 205980 66364 196503 -209391 -92815 -98024 -113945 32249 120149 318710 90747
12896 49652 -213030 160441 -112313 82812 416147 50975 137621 250410 -33328 -189369
12886 -189369 130792 -94008 -6777 -119012 117877 208546 205631 203307 109558 -258444 122632
12874 -27681 -20321 314762 232958 -51833 259943 123262 181905 285618 -153261 -201617 33008
12862 21309 280440 9990 107743 -231287 70171 4429 94537 -177357 403012 183236 13926
12850 162717 99900 -169081 104163 162477 -206095 117910 -358676 -110003 -137610 -181913
12840 -181913 -130444 18999 -103693 -245996 -57013 184172 -92396 -30542 204052 26948 115085
12829 115085 -282469 -203926 -113906 223796 42907 -16859 37762 -200505 60350 -13142 -117657
12818 -117657 -146289 -167739 25442 -291257 280149 110864 282321 -9466 104521 68391 23423
12806 143840 18494 105379 226420 949 -40457 99224 185472 3635 -38033 192285 -175936
12794 -35690 -68154 179147 -123468 -134356 -170671 -203173 8499 -76673 139429 12439 -130435
12782 -174335 331927 -16668 -216166 326772 64859 -72459 78458 54596 111526 -22863 -281004
12771 -281004 -203865 -108070 106078 -273585 -39404 -109809 171692 -161224 15630 25840 -14987
12759 -118181 -75416 -8648 -119987 75599 333160 189395 199752 -241320 -200075 -38981 146608
12747 106340 445954 165217 91666 -31256 -563 135712 -46151 92397 80076 98967 -63220
12735 162722 -119990 210 36933 -254069 -291211 248227 182931 251817 -42702 -30360 82764
12723 104774 -155153 65042 154826 247749 119936 112919 -32296 -201556 -119492 23214 68813
12712 68813 -133286 -316809 -78128 310927 211995 -88752 17727 -236399 -81363 -238017 333829
12700 49128 530531 132202 75811 366205 85223 237511 15788 56711 260578 -123280
12689 -11722 3090 25493 172083 166396 -16206 -182173 315005 454996 101134 10519 209818
12678 209818 39165 77392 91574 -119946 -77296 -439112 -135093 184583 -98171 28771 -44678
12666 106181 -12587 -280355 -41662 384905 -173633 58414 -20539 32642 43780 -14497 -22010
12655 -22010 -113118 4636 155626 -50752 -5597 15858 18207 -189410 -217293 -236488 -307050 -77463
12642 259031 -46221 174744 221752 222449 -328966 18268 238265 402879 407964 291528 -196353
12630 237766 -206481 -240413 32742 117568 95036 -176854 196398 267907 -229203 3122 -44422
12618 49209 -8703 -14191 104819 208504 107136 44008 -85899 211476 158588 -46715 131612
12606 344959 13392 370131 318136 47064 -69219 -179480 5085 -253768 -10597 341606 -116192
12594 29776 31635 65912 -166517 139836 176114 -193206 134285 -91908 178809 74470 -158890
12582 -189358 101847 -35760 218295 -220867 267872 170163 44964 81039 -79441 82872 418663
12571 418663 29896 70582 -49683 32900 -176838 -55063 -264539 146908 -74106 -78395 74476
12559 65783 -141243 -284708 19775 -162409 66218 -86561 108376 215774 123698 -150179
12548 -97023 64952 -105542 319052 -129375 -259642 -88973 10978 103924 -195831 110143
12537 89579 -371067 39263 186214 -11694 -176114 35288 82306 73924 146653 315549 -22893
12525 59951 132280 173622 -136227 -206242 53296 152874 88695 69884 82856 49626 1991 186972
12513 186972 -54041 -138657 155040 -80611 -73963 -209117 -63328 -84554 432768 -18009 128621
12501 56933 138042 187083 -86335 256564 31335 193478 912 -43139 111638 -480551 243378
12489 98157 395671 -98933 116504 157447 -19156 -147114 108341 73984 -159404 -9372 147513
12477 442123 127135 -59808 -10149 -35691 309351 -135902 -81522 -74836 173758 -179303 17052
12465 -208322 -175554 -14480 -147336 -15985 213868 -153596 -339596 -14256 96866 97126 -47403
12453 -34802 15276 33777 94862 -125718 -194820 -141216 -309053 146957 109519 -140634 167676
12441 -351666 -187840 1289 -54795 -163404 62869 -47769 -46028 -41318 -145160 51987 -127887
12429 -28215 -17551 87472 252488 37736 -45997 -122209 79139 61667 -169756 294361 -235040
12417 -48266 102750 -252761 -111609 -484490 135489 -24580 -133148 -46465 -65056 -140197
12407 -140197 -2945 -31826 8962 -192081 72473 178745 22149 64740 -395383 -268413 -200307
12396 -200307 -32597 -52113 -56632 -108693 -39909 127150 -18757 3514 -292530 -105290 -122039
12385 -122039 -125541 -182794 -39905 -169771 -140333 -187404 46871 -40020 224900 -32427 -148389
12374 -148389 -171740 161152 164560 194673 100951 129017 -76024 -10397 184209 -287257 294962
12362 61133 229947 -210575 47089 53141 -149035 36812 -132558 99322 -31100 156855 49310
12350 -161559 -149865 249249 2814 133367 -160827 282694 237532 187896 -64484 -102864 -28120
12338 40239 -175097 121081 194927 60499 503098 -49445 -7712 -564377 36575 -137291 -136114
12327 -136114 165706 95394 -14003 82568 117174 111039 -134540 149739 164187 -7229 83838
12315 -44978 -9228 244723 407543 -217986 87011 -171136 289974 156499 450509 -141984
12304 356813 281438 -39478 133411 -2124 451131 378930 245466 140633 250859 -34914 125440
12292 238919 139129 -142860 -43883 35288 15124 555888 492100 -130471 36870 269194 42913
12280 -44216 498959 319944 -41470 180637 -366338 122849 173547 132520 -347824 -113285
12269 122833 79988 400379 25413 -4638 -104969 262307 133282 71340 322863 -46911 171132
12257 531152 -209264 46527 476702 185008 481883 194855 133175 473658 63175 -181356
12246 -108033 47938 -69248 266656 277691 109557 333650 260426 187695 -30799 -47127 65924
12234 287976 -10462 41966 225453 77257 117812 274523 91402 422114 154781 89721 -1945
12222 328083 -83204 14847 265147 465164 238336 155331 102018 23809 165744 -71887 150675
12210 175626 -69473 -17442 307781 99813 237682 169749 146485 530553 233330 337876
12200 337876 91225 162299 437348 66292 329118 385552 195047 73654 598163 164365
12189 199480 -198995 135895 -15060 -149509 171144 263636 120974 -10183 16929 259008
12179 259008 112066 -136179 209984 170039 215912 6477 427251 -153351 210737 -239601
12168 283036 217594 -118125 121745 -20887 -59417 120313 -87717 247022 238278 170715 269254
12157 269254 120272 480747 279226 344682 -103003 337508 101953 202143 104821 14861
12146 24021 123417 321714 374213 18332 192689 80926 237018 -9401 -49234 168888 -65772
12134 -281560 155675 95066 -29783 113458 -154787 -257589 -98291 42501 -148116 234762
12123 -89766 -95834 71137 27323 191643 98933 336235 34864 -175152 42108 188043 242890
12112 242890 44487 -11298 -46103 -214095 39514 14112 -216790 96948 211124 149437 197517
12101 197517 290057 -81466 367089 81586 153165 241166 77035 224822 8581 -227062 30189
12089 314910 436492 -248559 316325 -78340 151913 36258 118326 -73995 395627 -308335
12078 42362 -257017 145612 124225 150571 57385 154073 11890 -266563 -53348 -40560 187166
12066 141 -3657 -30825 188891 -85158 224634 162681 218056 200871 279863 356462 204612 -87466
12053 118958 262448 442604 -222730 -21326 499236 261595 119554 120011 -55299 221788
12042 -88398 -112328 249701 32389 -15044 -39093 18346 -294193 -63736 82056 329497 -73076
12030 51554 -105740 -316371 -128267 37512 219049 11200 -98895 -11259 24869 -197032 221570
12018 -82637 189681 16991 -91550 95279 11339 -151035 -78786 131666 -60116 -168527 138187
12006 -115604 -64046 141141 195420 308624 135307 142267 197549 160751 -151103 221181 -7607
11994 84885 153002 230480 217597 265146 -19535 12258 37184 155499 134044 7047 274147
11983 274147 86484 190989 -40509 315601 -64426 -160560 179032 164479 219612 67465 -182617
11971 19664 -297475 -186953 -166909 213833 84811 -243841 139179 -232263 88615 190123
11961 190123 -130561 105784 -67872 10289 -143075 -525078 -121908 187026 29645 -46750
11950 -32609 92240 316740 -372785 171349 -115981 8503 365186 103951 -252017 -44044
11939 105481 -47251 252848 5715 87293 -34746 56292 -25578 -28488 27061 -236508 -246581
11928 -246581 32955 103242 -28265 90723 -124041 -111410 -102522 28890 10342 -52350 -48089 52306
11915 21379 515 -175086 -227165 -134362 -274857 -105436 -212557 -158506 -309456 297269 136960
11903 623489 -342466 -203950 113908 -72900 -127477 160649 -288652 -48257 -105880 -540969
11893 -540969 -56003 261264 80276 228663 -216705 166979 -263164 -74764 91566 27269
11882 144068 158368 -172923 42723 322082 -289105 -12035 -143027 -247323 -387421 -226336
11872 -226336 -70907 -347382 -267362 -71889 63897 -356757 -174373 225796 -72318 103278
11861 280584 6041 35677 241849 182050 -2492 -181116 -202859 233732 329522 -291536 272216
11849 -4563 -21560 -18342 -127153 179665 -373878 -22967 707 -175158 -259685 -111477 -285988
11838 -285988 -129862 -183517 376735 -166543 92997 -132432 251637 84624 73371 -151599
11827 60236 5517 120501 -176946 -165834 82285 88842 -115790 -79440 9109 -9421 -63053 -358102
11815 -358102 188504 -209368 -140878 -196037 -166672 -77475 448606 -4506 113584 -282831 -163735
11804 -163735 7534 -279426 248193 16615 -301180 -26997 -224531 444612 -103219 67901
11793 108834 -57522 -423043 -255984 -51163 -185561 46355 143378 -384876 41388 -91443 361314
11781 -521262 -198536 -69989 -36534 -21085 -222734 -83977 -159118 -154092 -14765 126457 -5275
11769 -143736 -91572 -82582 51195 46509 102265 233955 32296 -152016 -28886 170942 -6186
11757 -64706 -132887 -300288 -8015 -277151 -135966 30130 -122893 -82237 -121445 -78770 -1409
11745 -51073 -224076 -42525 -141392 -63245 -110448 -117867 -141719 11218 -31817 -104789 5341 90226
11733 90226 -205904 -145139 -106040 -49881 60344 -223616 84708 -194178 -312124 -217841 -103039
11721 -220932 -78305 273959 2344 44416 23103 45693 -52361 54604 421075 17320 275085
11710 275085 -105047 -117814 19743 173064 79922 -293881 -312091 169512 -259421 374016
11699 25592 111039 -132237 -140942 -36571 75784 93949 264950 99118 9509 94209 -48462 -192645
11687 -192645 277205 163637 -17416 33603 -223015 -40456 117509 -51809 126254 188524
11677 188524 -43744 7098 252607 227202 29137 469396 58194 360945 -81800 -226741 102890
11665 -107357 88002 102222 241638 247413 -137739 -171187 396657 10362 165164 23883 -144705
11653 -137043 320562 34711 64699 -22891 155071 12499 -107414 22637 -101412 230116
11642 42800 -75732 -59167 -60975 -12057 -120791 46711 -162444 -38028 -275421 106659 -7056
11630 -21888 -146296 48547 13017 -100286 -112723 239351 -208831 -168943 -49687 -99575 -48581
11618 -132037 6510 113430 -8627 57956 -140196 207165 23420 43499 12521 113284 -44887
11606 -184556 -130201 284023 110970 -21925 176267 -25194 202666 -70679 -147668 132718
11595 333653 -34584 368712 -199307 175346 -263255 -61253 138138 -50784 -164092 -48711
11584 -108616 -130710 -335605 26154 -8331 35437 -83985 -64051 -91909 -245955 -23662 -48575
11573 -48575 245277 1048 310158 -102348 -21155 -5293 173066 -175614 -158040 -202211 -13655
11561 -175915 109079 146248 144352 -176204 -34896 -368665 69983 251383 16689 -160533 -208971
11550 -208971 -256989 192671 -240917 93332 -197238 -570 39195 -40934 -291696 96365 -100903
11538 195334 -70440 78555 -176058 143128 -135122 233342 112850 -353981 110671 -146879
11527 4217 -193631 323701 46422 54534 213729 133992 181613 -203872 10597 301113 41864
11515 -223582 8734 -20061 401769 -160474 32416 -116179 172023 29270 281243 90347 65176
11504 65176 135172 -17782 165465 -211739 -18712 293432 1023 40650 -7909 68568 297679
11493 297679 -96970 138525 81447 22476 549462 -203371 -82774 153477 185672 -326547
11482 -61635 -253902 303664 158157 176648 232756 -164286 50762 64334 183923 -54328 182268
11470 98172 81304 273883 -22759 -129492 95956 24194 34537 -106180 -302797 37720 67143
11459 67143 142575 202951 -92306 300775 225936 158326 -150640 138534 -169313 -60815 20472
11447 342232 204297 -89532 169684 172256 71016 62259 332759 -222516 -19438 -31237 -105182
11436 -105182 -15698 -67292 421308 272656 -182102 -53614 147950 -76006 72962 104001 347329
11425 347329 84157 116761 205288 -136933 -3268 78042 46404 243557 251162 -111036 -88995
11414 -88995 -77781 -54394 -51182 224589 86441 236423 -28723 28626 8983 112834 112439 89319
11402 89319 243660 26415 -270781 -86918 -109972 143365 57414 -51987 -263870 67116 166888
11391 166888 -101851 -182185 -391496 123260 354509 -181656 -10262 -106618 22126 -38618
11380 -115241 19771 236687 42343 88590 82134 -98496 -36903 129021 -45802 5660 203094
11369 203094 -95553 -40671 57823 -402039 104088 -292015 -64434 -69701 -219920 -195112 330065
11357 -58566 -39597 41646 -108605 74945 387891 15194 -131565 39644 3049 -53308 -165433
11346 -165433 12084 -112561 105807 -201151 190834 -81787 -440553 -17079 59327 162602
11336 162602 147197 16243 -111613 112482 170710 279991 514192 30072 45857 -264666
11325 -155539 162491 -27502 117099 222842 -265396 222525 126754 -226230 113033 -13815
11314 -13780 50388 -84866 -58877 138466 -417017 -191523 -114185 160248 574852 -111050
11303 -169691 -126570 -262109 16223 -191064 330648 127067 -215622 -361119 -234038 409054
11292 -205206 -186974 24816 324374 -240939 -220830 92249 -217211 -215861 99143 -178373 -113541
11281 -113541 230988 69632 -124225 -203497 317023 187128 -133444 13050 66346 -141252
11270 -284780 12659 -12414 -4362 63667 -44508 262534 -253606 -16022 -197982 -169137 -115775
11259 -115775 -111078 -24134 142611 220514 -223889 -289699 -204933 334327 -19724 -50806 -64679
11248 -64679 -28448 -346921 -49549 249111 27374 237968 2107 -313845 213840 -79820 -49578
11237 -49578 66199 234290 -381594 -86042 54061 -445656 218804 225933 -50001 -175851 -103744
11226 -103744 -216503 -107821 -115851 -63237 -220913 28878 -247680 126973 5213 -73801 -409959
11215 -409959 64484 -12184 115603 57735 279973 63515 6371 -301195 34785 96010 -139264
11203 -129381 -194820 186485 120257 169845 -17629 126374 -99959 -246321 -375323 30249 88925
11192 88925 358177 -138090 -252167 -507597 172149 -407185 -417422 -83923 -167412 -154835
11182 -154835 -197652 -164250 -57716 166864 32111 -273078 -144835 -51411 -228452 -338228
11172 -338228 -233725 168106 -37158 61555 -337379 -124183 -181898 -143998 -178728 -177132 -118012
11161 -118012 -45249 136295 -196200 77959 -175571 -38013 -67546 -70533 -135329 -272447 -198801
11150 -198801 -14287 -221431 -267194 -24180 102861 82873 14904 -236585 43999 -345643 41833
11138 -105728 -213138 -166549 200459 120515 187214 77957 -193439 -146980 -201485 -28289 -51598
11127 -51598 -134360 305526 -128252 -448283 84363 -250402 -108861 -100192 105394 -42842 -6881
11115 -56309 -38949 -102791 211740 134047 164771 61639 -103424 157974 -173230 291771 -206034
11103 77208 116624 -171083 254705 -3324 9666 9045 -175851 86312 -126600 -213511 -55695 77400
11090 163663 -105877 136750 -306648 154919 348842 -201824 -106341 97673 358524 -26297
11079 -75291 3963 37636 228752 -223092 46708 48996 220059 -134212 -148112 -40685 256049
11067 -171887 80408 88516 151015 10849 267685 204185 366759 250643 370044 318127 87283
11055 52986 37158 457723 501264 217536 399284 121800 335196 228756 339270 529463
11045 529463 555392 178832 503274 620865 611630 430726 557968 174911 621891 531801
11035 531801 586489 639112 757003 582617 522450 624427 614764 649925 777851 492812 374051
11024 374051 384125 724821 433441 585857 747406 538590 551308 537827 135429 336381
11014 336381 701230 351575 526224 680554 378452 744824 424440 318725 484237 524256
11004 524256 602829 549060 459267 128728 414268 551451 329557 754517 573153 505824
10994 505824 552535 223520 321247 535530 139511 590005 345821 408497 394234 325346
10984 325346 449691 354618 585043 538495 494490 776087 249449 431552 437962 258079
10974 258079 658402 625874 609876 551479 574555 400756 300057 776625 391587 771198
10964 771198 931287 694799 567203 891619 1128460 1227224 1433778 1424282 1707910 1827537
10954 1827537 2165786 2066708 2013488 2102236 1848813 1778655 1521024 1688294 1690343 1220436
10944 1220436 1225332 1306998 1370342 1203860 1182158 1443240 1082988 1134767 1091334 1325404 949839
10933 949839 789918 744215 783783 522279 182173 584744 367797 334668 288656 445830
10923 445830 451668 591389 242449 -4219 64390 123879 62035 27035 107115 100411 -153473
10911 -56367 -99563 33451 275083 -52758 29700 139466 -103737 -21977 -265710 71120 -109323
10899 -135652 -50654 156374 -145114 84601 -69464 -24405 118848 -87526 -139079 101475 113820
10888 113820 150500 -147370 109611 108230 140529 -101225 -19916 -183774 249939 -448044
10877 3008 -209664 -25228 209077 -326214 -114227 388687 -187927 234794 -322389 -250126
10867 -250126 -34464 -81350 -89375 141164 -326587 -44700 -79837 26506 -173015 -64350 2460
10855 -218266 -153464 94276 92690 -86687 -82467 -52192 -118472 50624 28452 101901 -106139 174954
10842 -236043 218255 -948 263510 -48835 77003 314006 168825 7091 -118883 38381 -178547
10830 -245424 -327941 -290118 118338 106806 -186773 169642 -58904 -386925 -222418 -184428
10820 -184428 -110333 180084 -99325 -136704 -163912 87431 245003 -392636 -204209 -257299 369344
10808 -42374 -18934 119525 102940 -384013 -19450 -110299 -244575 -44500 -38449 416656 -86598
10796 -45105 4248 -220632 -18258 -307751 287633 -131116 -33042 -220680 -122147 168748 -344691
10784 -83364 -153298 -52510 152252 -53558 -131871 -239823 -275357 -272961 31508 -230449 -51266
10772 79184 -206225 -58415 122348 -67536 58793 -164294 -134253 -120785 -181748 -181523 -274404
10761 -274404 -40118 123376 -293821 -19906 -80430 154828 -57685 -172462 -231531 239744
10750 -37944 -357042 88958 -294092 36499 347036 -288940 86047 -99354 8045 91529 -78827
10738 -108861 -212301 342134 -93136 -281163 181095 -103998 -391765 47776 -74601 -310119
10728 -310119 243029 -177664 -202149 -51159 -327442 101690 -261696 -203939 213126 24017
10717 -368306 -290189 354299 53627 96872 -198441 -239105 10157 92460 -13209 -41075 3470
10705 -23678 -131896 98895 -244633 290079 -199344 36742 -66100 -7586 222335 -135610 30309
10693 56444 152725 20248 -12794 -81534 282294 -378579 -193230 -96459 -31646 -372645 -87373
10681 89991 -15223 94550 7609 119489 -9288 338545 241587 -34591 234160 -42128 26096
10669 234229 146286 39547 -339067 112610 -151787 -59815 -141788 -377358 207806 -167286
10658 172362 -105458 -209697 -246794 -107675 -18833 57274 -86290 -285214 175813 20645
10647 -140668 -312565 -214126 19520 -100339 -190729 -109803 -106726 -249472 -84801 43684 146003
10636 146003 -112916 -30989 -170049 8775 -207648 -127305 -168920 -217340 169399 45339 -75268
10624 -14094 -162834 165808 213007 -262822 -304148 -37864 -229524 71333 -158362 -120617 95371
10612 -179316 -39196 -97376 -61348 -167884 106121 -51487 226415 154407 -149525 56331 -184560
10600 -93072 261860 -2447 -60870 -241571 -266827 -122337 -357406 -54647 177647 264855 -64517
10588 -138903 -209995 -206023 90505 -142207 62366 166629 144911 115302 54710 -234110 -68850
10576 -82857 287257 -187632 -179930 -34022 -281993 -244172 -3267 291456 -69900 -218983 180755
10564 -35726 -207368 -240945 -94241 -19311 -25985 7350 -211509 -63379 -5610 -297620 -185215
10553 -185215 -287619 219690 -96595 129958 72053 -3895 -66084 2940 -14072 58207 141948
10542 141948 -103784 217064 -77436 123469 133616 -211416 -117560 405198 429274 -79642
10531 102592 -277291 -122031 -16413 -114640 141961 81669 269078 -33706 -283719 -269314
10521 -269314 80450 -248113 -28117 370609 -63336 153948 -191017 -332944 -189322 -79314
10510 -58038 -448250 91299 -21957 182088 -197468 179096 -183157 -155570 -205840 102416
10499 -34468 -180438 -234101 -170464 -37181 40336 288874 28273 41728 133211 -307877 -73272
10487 -186911 57817 -191973 -40322 -156227 144107 -89405 -108842 -40913 153228 87259 129789
10476 129789 102611 5254 125553 -85169 -80650 43141 -142331 31127 223450 92741 108165
10465 108165 43547 -157483 -26869 129937 -49438 274280 584133 200090 421414 123369
10454 267031 171274 12594 -192800 -69318 -168291 -12946 -180243 -89552 -225986 526944 -168201
10442 170863 247124 -69990 41754 147050 -229790 -159484 -157389 61739 3101 -188253 -6289
10430 -240797 -61402 46599 -46580 12998 -260015 -117635 -56842 -187321 -153223 73103 -284860
10418 253296 -196233 -149086 -216750 -255349 -173801 109065 -102716 -270068 -124455 -196373
10408 -196373 342697 -112435 -141445 -254304 -8061 -190917 -277527 -57460 -70940 -236016 -284903
10397 -284903 14879 164487 -17691 -89683 -136626 143510 -242483 -264847 -36109 -214571 10046
10385 -185310 -177047 -128397 281462 37302 30433 -294311 -166201 90588 -181558 101723 -83045
10373 92769 175912 14240 16617 160019 84642 131637 -76080 -69536 13903 -8563 -14996 220334
10360 334469 -22007 257048 -199888 252252 38502 400507 258018 196497 97893 27394
10349 83324 290430 252533 273698 94863 72211 310591 197467 370288 328686 232220 261060
10338 261060 -38094 403928 290400 532762 400665 436459 270258 63835 120066 526587
10328 526587 128728 476327 25491 247592 603919 467045 235220 313237 68309 197497
10318 197497 44366 -79710 364638 93335 134351 237591 299298 17560 -12950 -110855 60210
10306 -4735 -33524 -17672 118941 359166 356758 95321 114612 42350 40362 330347 309524 -107349
10293 392248 -342560 85714 63498 -39570 -270130 86500 67069 -50994 -134727 -44120 144851
10281 148 -44166 -64870 -145325 126891 -53722 141458 -196750 125276 -87142 -327437 3765
10269 -116060 -259004 -69751 188664 -262274 -178256 -248553 -180631 -69052 -238327 30025 198227
10258 198227 -442496 -22481 -167657 -463666 -64230 52758 -43169 -120996 -365833 -319896 -142120
10246 -120512 -122392 -255893 -167110 214583 193721 -102088 23895 177338 -204014 130801
10235 256991 122290 173112 199692 -25701 -61032 165651 92467 -189966 -204150 -146581 41611
10223 173228 209576 -424250 -157935 85917 -198367 -61370 -32741 89282 -61201 -195716 -69662
10211 87439 -91199 222065 80646 -60049 -117916 -120861 -61455 -189779 -109659 91912 170265
10200 170265 116929 37248 -32136 -196038 242035 -336958 -58738 -202389 32977 179057
10190 179057 13278 -276731 63520 -71579 -96431 18167 320005 71966 -254417 118059 -281934
10178 102651 151875 -167544 -19550 27800 326505 -65733 -103855 -354307 -231556 -419 -77369
10167 -77369 -149729 165644 -204844 -27924 -252612 228290 -252893 42788 -226039 -258729
10157 -258729 -161817 -91005 -312117 51980 -159487 -444682 275456 99183 -244518 -38591
10146 5605 -362736 -228164 -177460 -237058 5507 -78029 -147821 -173417 -36251 -311082 -95232
10134 -89373 -22930 18231 -191324 40640 -34749 224911 -128790 -177058 -188156 78555 -68433
10122 338000 45554 140708 -6179 -74857 20631 -234273 152236 243154 7053 116821 -422530
10110 -326242 37182 36005 -524327 -160462 -18544 115866 -46596 -170712 -753486 -230340
10099 -56941 -45023 37898 -68057 99738 -204239 -434 -42302 -34535 -79057 -106436 -135874 114746
10086 -125888 206417 26593 -240388 -99102 -300611 -221611 -156317 3174 -305007 -111350 -56382
10075 -56382 219781 10720 -62402 70573 22551 -133687 -152101 -138597 -362569 -133976 -12940
10063 -100165 331725 -198640 89565 -226790 238606 189416 -51055 46013 83489 -44116 -73529
10052 -73529 -15782 108963 -238717 141529 -394637 269504 -1157 264661 178718 -70320 165629
10040 -15426 -61802 17983 -219434 241528 133358 -239720 -214133 48972 -196508 -112126 141965
10028 -209111 2121 -150042 -353746 228573 -288762 41809 165029 -91420 -230101 281475
10017 -37131 799 -230937 -287354 165236 78541 -214768 -92247 122277 205553 -71127 27573
10005 -290484 33386 -296834 154393 4863 -82150 301940 51985 495283 -98596 -61865 68549
9993 -291449 -484522 -119512 -60336 62237 -132397 -75161 -141334 -22043 -218124 -65364 245288
9981 -130108 -169086 -41972 166128 289151 59157 -166797 -92086 -75668 -238382 305174 136337
9969 23624 -406495 191048 -195714 219881 200561 -95863 4321 317088 -137509 -180008 -326800
9958 -326800 -192781 151823 -67164 44264 66969 193935 -95261 -61023 -311243 -11657 -216783
9947 -216783 -149138 215803 -11607 -16388 -275374 -141350 3195 -2059 -203704 100578 -147751
9935 -182060 -351675 -521030 -10911 -256802 -49102 99614 54565 -151844 -79241 -120724 114551
9923 -27500 -129055 -82167 -49570 45239 -236976 -14210 -216806 -162697 -367024 -309146 -139637
9911 144097 -38504 -6140 151382 -231193 -160688 -316835 -392016 189958 198266 237436 -87535
9899 -206512 -102667 111479 -6649 173496 -228267 -114840 -207520 -321766 48457 248828
9889 248828 -109717 128078 -309869 -226815 -177815 -14074 -291341 68393 67369 132194 -142677
9877 273928 -279870 -77606 -150184 -170041 229643 -212969 -7815 -51886 -159678 -100037 -79621
9866 -79621 -24170 77345 -329582 -210198 72154 -274527 -125373 235992 -209011 254460
9855 231179 954 -20121 -274758 -171900 -262617 82229 209193 -90891 -266053 105452 -269386
9843 -199398 -105011 -111190 -8395 -320803 158539 50807 257242 17331 1939 -143184 161307
9831 -80697 -9712 -51124 -163633 1502 -102260 -447393 131512 -136992 -114671 -144270 12290
9819 -48822 -13807 -80981 11133 -145795 -358463 -168367 -18842 -102755 -315157 43268 128119
9808 128119 129308 -106108 -100462 71437 -79961 -150249 23449 223536 95149 173035 -26063 181788
9795 224826 -337207 -153238 208024 354162 -187927 115170 191124 -200419 -166706 147985
9784 -123958 -44003 140328 -61847 199853 23122 -131009 -242917 145808 -68813 6483 -126806
9772 -32665 -46517 53370 -73831 -66622 -200942 -8763 -124223 -94045 -113743 -51847 100555 7572
9759 42150 -158377 -749 -276378 -258178 -14115 -208201 140745 -100416 -7243 346419 -312178
9747 147493 92177 -271006 63688 -33257 191357 -42878 51905 -170402 -178205 -246544 208460
9735 -402271 168603 78644 -313651 -206015 -106876 -90452 83154 -149858 16929 -40887 -368254
9724 -368254 -155063 134626 -309479 -54958 -7043 -211565 -132848 48673 18772 45704 125724
9713 125724 75968 -121811 167083 52359 269170 102895 -130607 -234850 -211437 2311 -162748
9701 36864 38478 -81871 -87958 -191677 -74917 -141711 -94703 50787 -111747 -141389 -291026 -286066
9689 -286066 -280274 -3260 -85368 -88029 -76745 70271 72177 -112832 -107999 62420 -272814 233159
9676 -556198 -149640 -41551 -153877 -50142 21889 -235666 -334918 191437 -170135 -129078 -183645
9665 -183645 -132664 -57922 -193782 -194286 -265065 -81671 -213872 -129853 -242244 -82666 -2430 -68977
9653 -68977 105453 14188 267609 182909 109023 -108680 148067 -457614 -552391 -266027 60126
9641 -69004 -73234 394 -188049 7136 278180 190544 -116966 -77963 173493 -19524 -81764 -92110
9629 -92110 -122954 -385871 -141855 67452 -172436 -44620 -496468 -338140 323781 -474533
9618 -113239 32641 -113073 117545 77826 -333948 -366259 -246889 105914 150925 -233409
9607 198240 -73613 21104 -270494 30765 -24641 -171344 -88044 59987 -68192 98776 -67193
9595 -374139 -159638 -141189 -216964 175413 -245561 -48359 -88616 -28112 -146766 191205 13496
9583 -40441 -135851 -38299 -154305 40538 -220158 18877 159047 -80217 40857 92847 -34041
9571 -268323 -132333 9243 124473 492192 188726 -218272 -190017 38840 21335 -211110 -173193
9560 -173193 -386340 49821 15899 -452703 -48727 -146031 263 -125327 286101 -397415 -252994
9549 -252994 -395611 -337018 -152344 -267587 -381045 -4830 23885 -462332 -88725 70387 -215673
9537 -77853 243966 123462 140235 185221 198344 -50002 13282 15242 -190944 -48850 202900
9525 -211296 201488 73872 -97701 -218214 104358 -63491 -128492 -132216 164364 114228 298899
9514 298899 169 -89649 -291091 -140293 99815 -116369 -214804 -56343 -195089 100230 -280096
9502 -113421 -295123 -282573 -14277 310729 -277087 160500 -209197 -56671 -164649 288783
9491 -150430 -72102 179908 -14855 -19424 -115978 -272157 48390 147551 -54926 26734 204507
9480 204507 -151955 282971 98153 -66975 -374845 -461281 -360937 -241701 -122179 -60839
9469 -181111 -165534 76070 138789 190383 -276758 21428 159339 -276628 -134353 -93093 76826
9457 -135574 -5636 -10256 69953 3048 3955 108420 293567 -163634 -42799 -251095 7545 -190369
9444 -73143 222638 -66782 -197945 -241311 -78185 -54216 34837 -35214 33949 -32870 -273894
9433 -273894 -37422 111944 70732 -219514 48894 -183028 -24924 37224 120057 -72108 -311554
9422 -311554 -136215 -47162 -171202 -138019 -178207 -237991 -289373 61834 83270 -482857 -63058
9410 -62802 -170404 221337 -294021 42378 -51340 -268329 121350 -18189 156915 -190027
9399 -26921 -65117 290090 -26653 -20017 4941 -299611 48917 336171 130757 -38360 -63146
9388 -63146 -148277 -33575 -22969 -135891 -259782 -65059 196896 35736 159598 -56971 134495
9376 61552 -204267 -46458 99543 -240295 90394 -72670 -405287 144913 -240603 172415 118836
9365 118836 16896 -292747 -382861 262922 -294279 -138227 -115717 -167045 -422148 -46942 -121031
9354 -121031 169583 -37687 -22319 -14565 -269508 218444 -290043 39179 -245429 -258527 100746
9342 -345626 -19767 -17637 -103757 -92466 -372704 -218191 -257975 -490405 -191976 -120723 -256010
9331 -256010 -318126 -280081 -23900 -222920 63262 16720 25931 77649 -294050 -395500 -169258
9319 -219414 -206590 -265176 -121338 -216081 51205 -205739 -174937 -15856 39318 -165049 -228712
9308 -228712 -99852 250963 78643 -83975 -83009 61579 -129263 -200081 141673 -94899 -120228
9297 -120228 -473454 -156670 -246749 -62150 -169735 -230059 -342050 -124352 -79237 113618
9286 173750 -178962 110029 -113426 -221567 -16811 -62899 -26076 -61098 -171366 -112666 -126046
9275 -126046 290249 -105748 -131699 164691 158051 -94895 -234612 5203 -80035 19623 -140947
9263 -315283 -284159 -224965 -241844 -302322 60747 -85227 -114214 -323662 -28901 42378 -101019
9251 -215387 84856 -93532 -19401 60646 1692 155719 -139148 111745 -113083 -49320 -185915
9240 -185915 323160 297866 -68733 143432 -217506 -58497 -63856 242426 -16126 -241640 57757
9228 -256606 -29216 -56711 -40031 54614 190305 163318 74119 105862 83569 -129052 -145314
9217 -145314 -163366 -49296 -417443 -72535 12778 -129302 -31175 221801 68298 -19787 101969
9205 -63652 -25026 -73248 -133073 212984 -167783 186075 301028 -159470 -88995 210147 87832
9193 -34469 212337 73479 -151962 179775 332738 -96303 -87328 -79845 -156624 -237927 -161827
9182 -161827 110717 192642 -132626 -140075 195094 -288785 80672 -89419 151276 -245167 -107197
9170 -78103 360745 188515 61039 191955 138120 -147200 12431 -770 25020 111859 -150759
9158 -136695 -46309 138987 -57894 -90806 -147423 -17273 -173279 49756 87307 150835 -151890
9146 211673 239222 -373859 135265 -59768 -186798 -221645 -278406 -146123 -110412 149207 -233722
9134 -7753 253812 -211742 -188034 -105793 -188940 -92799 80849 -490018 29637 107857 -117580
9122 75643 125935 -119280 -69904 -88261 135338 -118596 115665 -241795 22873 14635 15657
9111 15657 -223513 -144680 178392 -272310 -39769 -92518 285977 -133340 -64375 -119730 -183084
9100 -183084 -140665 -237872 -209625 2208 -143667 -14457 22425 -150025 -108387 -143522 -1633 107517
9087 -224074 133384 221723 -311152 43384 40331 -7191 -59295 88232 -33879 -75997 -532608
9076 -532608 -151104 -173026 -39178 -4160 70889 -61696 -137836 -39297 -107019 -192981 -28832 -88165
9064 -88165 -191341 -187394 18583 -350292 -196219 -1527 -135271 37240 312251 -30480 -175514
9053 -175514 -35557 -208236 -16655 -395885 -88313 -67411 -127471 -97136 126563 -110308 -86515
9042 -86515 -184681 89136 -32856 218063 263542 -209757 135843 -80488 -272100 63505 -125409
9030 54853 -109868 -210970 -106053 11848 -13887 -231555 -220839 -110251 -48164 -437640 248393
9018 -425027 -75211 165976 -100219 -230161 381168 138029 -441421 -90311 -464007 9661
9007 -44775 -217897 351819 -114993 -159368 -173232 28378 152528 49417 43831 -283124 35609
8995 -175553 139291 93938 -191376 57407 95084 -521258 -84440 -127785 -205657 -96050 -32019
8983 -117587 -125554 -129062 79857 -111820 48640 308287 -11213 -243582 -72472 -339429 252888
8971 -125636 -238266 -55108 62964 -109960 222872 287945 -380311 209831 43256 -53744 114023
8959 107998 -37959 -36000 -63389 35162 -101955 175151 41617 -105051 -240475 -29561 -47332
8948 -47332 716 -238372 204730 112056 84275 5594 -195407 -216428 -73440 -275223 156909
8936 -101089 -215058 -35030 -61239 228953 -219444 5847 -116464 -46826 58823 -105080 -66701
8925 -66701 -124257 149440 77075 -100062 68876 -123846 7152 418093 183737 162483 412549
8914 412549 212092 113180 90181 65105 -12121 84747 379838 452976 586306 1493815 3249883
8903 3249883 7260671 3995545 1887287 1010121 546515 68726 456317 39391 -122032
8893 75043 32351 -15628 399670 239003 152460 290691 -77958 24503 -124455 288557 -141103
8881 -15649 -185165 23019 -476724 -26858 18711 87598 6683 125420 205227 151535 -95531
8869 -74230 -167739 -9903 -146609 208862 157606 -103965 5682 -47305 115648 -138575 -252624
8858 -252624 -27997 -220592 91125 -234804 22577 -142135 72798 -140837 -25055 -10760 5235
8846 -12984 -31495 229924 -82928 -149126 -156766 -20061 -107630 -5614 -272454 -348483 -116909 189374
8833 70655 -396250 100060 -359031 -191027 -200911 40302 173948 199621 -236741 186014 92728
8821 152945 -227118 132707 -37322 21725 -193563 40743 -242488 -178938 3599 49758 -116900
8809 141684 77139 151362 -196865 -4066 33819 -85600 57656 -105730 -12705 -69864 106762
8797 -70463 -141033 234163 97318 -84911 156049 -392578 110017 -288613 106684 -143457
8786 301385 -234515 -73073 -16819 31296 -79677 -210344 -67221 -393598 -178300 -157738 -196066
8775 -196066 101429 -196211 -303268 -1895 -184852 79678 -146738 2062 -32513 169515 72724
8763 -134878 49402 -31362 -219525 -173645 -56813 355 71513 119201 -397155 219940 -371314
8751 194546 -266934 -284509 -53937 -300747 -154116 -48485 -108236 84874 13833 -356146 -162808
8739 32523 88853 -214663 -127404 -325621 58015 -99524 -31149 12335 119663 -42857 -110709
8728 -110709 -140876 31015 -356176 -227726 -131044 68803 -30829 -213564 -75238 -72459 70756
8716 162179 -212897 236647 -146891 -68228 -108151 64343 53472 121960 86342 -10789 159611
8704 -90751 -315086 83890 -364367 163404 -347368 146057 -143132 185655 -18774 -339810
8694 -339810 -30664 -178551 -45211 -346616 -296736 311081 -17863 72446 33368 335185 -38011
8682 -40522 31936 325543 125370 -100871 122212 -124642 -10945 -94354 180319 46933 132728
8671 132728 -21250 269825 -72118 -237268 115783 62422 -164791 226828 -27889 352354
8660 -31458 -103126 -142691 -234716 -67061 -26911 -173730 226751 96705 -78842 -113890 -37446
8648 -144409 -3650 -184867 -86149 116508 6975 -405727 -14880 -63278 43319 -178782 -358234
8637 -358234 -156597 -319671 -87816 52836 -39196 -332928 -50504 -159036 48563 -67235 117967
8625 -131539 -149577 -91945 306099 114799 -211260 123119 135261 95836 -193781 182877
8614 -54108 261508 78432 -290941 -329523 89335 -285913 333243 157585 -194320 128498
8603 -108958 23167 130211 -365650 56168 144545 84475 -265462 349695 197997 -175489
8592 -416399 -123537 -98338 66079 -83186 -254435 106473 -194596 -30452 101635 38323 95501
8581 95501 -265686 260102 36400 -99483 -226728 -35530 -238295 -294888 117369 -27703 110946
8569 -145297 -116871 -3331 -279333 280917 9208 -131385 137854 -232520 -5238 -43573 -75000
8558 -75000 -269155 -94162 -256168 -74382 203815 -219184 117284 195130 -249947 116989
8547 -203117 64047 -157406 -63044 108164 181921 -46018 -458696 -290530 -223725 -16548 30872
8535 -177003 -17567 -171802 30414 -324238 73236 221234 -27187 -218471 -162592 -31114 -55315
8524 -55315 143015 -167989 -530236 -11361 -303311 122556 262081 156384 170143 -179974
8513 -35055 -109044 -183011 164954 -4529 -68834 -185034 55481 230005 -93412 143096 159401
8502 159401 68098 -381 25984 -63199 66346 63031 -480155 -317730 160644 -29133 -151206
8491 -151206 219886 -130187 313640 -258220 190723 76060 149965 -209314 -222865 -134324
8481 -134324 -27688 -5830 -273885 133671 -160680 -95426 -195653 -202807 67929 -47629 -40186
8470 -40186 -50522 -61772 -254973 73218 -69044 -455752 -113483 104810 -148207 142333 201511
8459 201511 -179625 18480 -84329 -171156 133609 354036 31604 -229431 -210022 -61385 16399
8447 299955 117640 129874 -169711 -63072 181270 -22747 -86093 -261952 -162748 352189 -233226
8435 -12153 -180338 283670 7605 -163352 -315326 309245 -319792 64402 -88440 -83524 66228
8423 26634 -14841 477853 -288985 -422012 291100 -60386 215583 -361270 -126819 -15518
8412 290308 -55843 43669 160177 -223612 -219142 7673 -132031 -70086 -60769 -274438 -312192
8401 -312192 -195284 -149254 274005 -302562 83607 -208888 -162338 -98441 -113406 -365679 -60821
8389 -264308 -169697 227787 -98890 -103864 340877 117680 -358223 278539 61104 -146084 -146945
8378 -146945 114778 146625 -53307 -69331 76241 -119602 -19568 -214432 -202554 136781 255719
8367 255719 -205829 -91566 -173413 -233941 -207165 -39986 -56280 105947 -166472 -119382 -101353
8356 -101353 -195966 -202999 -51353 174614 -74480 21300 246139 171319 252268 -183634 102582
8344 110676 18489 191695 -309984 -68144 3419 -92081 29291 -304281 143725 -284558 -71440
8332 -281320 295490 -50309 -109600 26441 216084 -195876 -132813 -51017 -174882 -566308 -6794
8320 -47850 179742 -11842 56946 -332344 84636 259427 -102490 89969 -167056 -66089 -162977
8309 -162977 -151914 170652 -31164 140738 255531 124956 133929 -210006 -124068 71933 -97386
8297 -36872 -354643 125587 137069 171821 -149078 77526 -45741 -87921 -127612 14017 83178
8286 83178 1493 -401370 -142825 134394 216805 -70530 184222 61320 -391912 -191524 253805
8274 -71217 -359008 -214674 -41552 -278573 -74192 289912 44451 -196651 -77145 -272357 181970
8262 -46538 -110934 -86005 -350196 77070 28687 -70882 -214992 -212001 58959 151135 3125 -92971
8249 -371933 76492 -179033 157685 108256 57234 6547 93632 101282 -179934 27431 -346785
8237 -62022 -83988 -234744 -404559 -267207 -56235 156801 -305624 -278510 -23421 20657 -71879
8225 -263871 -150539 139013 -118636 -95774 117912 -12365 -86562 -72411 231948 -16527 -14645
8214 -14645 -112204 -193039 -13413 35425 162181 -120993 158709 -355083 99603 -374108 122143
8202 60340 -149710 172785 -30365 -138274 -107562 4948 -420287 16480 -3655 85779 41690
8190 21833 -226078 -90925 19195 11276 -117335 117028 222885 56716 -40319 217010 -239229
8178 84767 246508 -90256 245318 -15092 -217091 -139206 -204687 289790 26918 285572 -4369
8166 82656 34561 -53428 -78551 -218232 94222 21908 238913 -133292 -100157 179585 135480
8155 135480 -147537 9583 -66515 -47583 362946 77312 -8792 193031 136876 -286183 -268819
8144 -268819 147245 112931 -211053 6509 -103874 -16015 -196230 -98827 68729 222334 13628
8132 -279811 137107 -44754 -120657 -138284 -3915 -108190 -416241 260366 -269459 84639 -76368
8120 153298 73502 -55207 115495 -184036 96030 -123936 49031 -9861 -92550 12963 4758
8108 253955 -547267 -130314 -277283 189733 -186082 -83851 -28234 75957 47064 -126349
8097 -21432 -270394 -19896 -240990 72584 -17271 -274597 42793 15932 161835 -81907 -114342
8086 -114342 -10320 -156925 223728 7730 116901 -122623 -134285 -132640 79160 309694 218805
8075 218805 20538 102750 -65614 -413968 -35635 -192600 168813 -66390 -161216 -30277 132373
8063 -176515 126042 -209830 -61603 -165777 -247014 -76221 -104431 77160 165030 -152034 -297791
8052 -297791 -108466 -6878 -26981 21529 -6843 -10664 107279 173979 -846 -5718 -313671 208260
8039 211730 -52414 -183832 -283991 266190 86871 -21968 70878 -139312 49163 41740 -37509
8027 -133611 -251681 -94371 -202058 -157388 -103847 2378 -32650 -250747 -255723 240348 43067
8015 -414627 -293902 126661 8047 -79945 100156 -88908 -122710 252622 -182150 125457 227065
8004 227065 -246528 64493 -277524 308052 -158770 47621 94373 41479 -127732 28794 -393211
7992 -70330 96606 -316881 -33673 -109162 185654 -252792 -121184 -101715 -73764 -18769 -273833
7981 -273833 -14402 -170125 -154079 -184400 -267585 41921 -206485 -97800 213405 -104745 -33917
7969 -30059 122906 -64478 -65147 -46984 -73626 -12757 46523 245012 -285719 5518 -177687 301661
7956 -111027 58580 -8984 -203654 -114027 -62027 -51853 -190537 -350266 171446 43423 180343
7945 180343 -182478 -207391 -87395 -76964 -42618 113164 125446 -279053 -343659 -27849 -188437
7934 -188437 -176081 -45377 9990 55013 -181744 51169 167180 -375163 -67988 190565 -113126
7922 -142484 198765 225284 201222 -153094 -113888 -267201 247345 -27145 -129164 60310 -308555
7910 -82820 -395939 -283946 -102127 87815 56718 54632 -317465 -127592 196257 92976 -158849
7898 -154419 14768 -146324 -105815 -97009 -29418 -93454 -35974 -293156 -51198 96323 -385110
7886 -47850 310520 67563 208105 11837 -143653 91171 82995 86557 125417 -122453 -217931
7875 -217931 -142148 249294 -245288 -164228 22140 -113280 284612 248933 110679 178196 8719
7863 -295423 148453 -11244 247129 -172266 102103 -185476 -83896 -60446 323918 283738
7853 283738 61344 337360 -172957 200415 169142 149948 20665 -103947 -23726 19613 76285
7842 76285 69494 -50076 -288738 86824 191061 -32066 -105025 96520 44425 225484 -174629
7830 -92842 207577 153290 -57149 -619487 135667 -387599 263825 -250944 -36196 -186466
7820 -186466 -169686 162715 -214961 -40391 -98902 157143 157470 -35752 -104466 184331 -82274
7808 40857 -285740 -66743 -173945 -31980 -188176 -296356 142217 47141 -293720 -342219 -146232
7796 174658 -62409 98235 -163425 -40538 -228153 32713 -176617 -9946 290147 80965 -4704
7784 -349268 -134270 318304 365198 -42256 -22696 -40031 -89589 -108653 -367031 19364 -1098
7772 -19172 56322 -209 -224627 -220356 -74362 -187348 -90088 203906 -280078 348816 -123022
7760 88177 -226944 32667 -292033 -233577 194995 -53624 332348 -89021 -19 -40824 2779 -151821
7747 119200 -13239 -272669 -173435 28351 -347946 -22292 -65037 -31713 -26871 60767 -62088
7735 -202257 -253708 69079 -255173 2522 140583 20011 -126402 -92213 212132 -264977 235688
7723 254036 85944 -279034 -63441 -419532 -300576 63411 -190393 -23094 -101677 -270559 -113668
7711 -38577 -122808 -92757 -107006 -202161 84160 -13782 -8798 19813 5948 -67851 -164557 37951
7698 165229 -248803 -464264 418372 -713 231675 290590 4689 264185 -251198 -310656 187968
7686 -76904 117066 -106571 -70361 28881 77397 -58682 -165842 -136869 -167838 185701 118858
7675 118858 -178885 -83886 154001 -267579 -18692 165121 62255 -13601 -109104 260953 -86724
7663 -256702 -50573 67504 -7572 -322250 -50671 -254294 -241646 -249939 87723 -186328 17427
7651 75708 9412 -99617 -50052 59822 -9862 -506167 55042 -33002 -75541 -75181 -114378 -96146
7639 -96146 -65378 -48968 78828 -99387 -110537 147933 21856 170384 -72106 -123419 -218924
7628 -218924 -62511 -243634 -301446 -14823 -416302 49656 -332314 -180148 -62530 -14314 278897
7616 -260610 362487 -80087 -8357 152214 66416 28254 -333245 9637 210718 -192526 -306161
7605 -306161 -52146 -75131 -192118 -223587 -337427 -352069 -124517 184309 -61026 -8285 -85861
7594 -85861 -114116 -15979 89931 -366796 -52214 89300 -122297 -63305 -107795 147566 -8245
7582 32683 44620 321255 -79769 -93756 399531 -192894 -225192 223280 -25361 216484 -38869
7570 -227546 74273 182177 -93713 -144014 120559 164653 131533 -161853 -250664 119804 -259695
7558 -556829 95482 -47060 358677 -227070 -95544 -91428 -31933 45429 -50564 -346928 22381
7546 -153254 -378720 -72692 375914 -400286 24377 -321740 405504 -35907 118172 257121
7536 257121 65006 235155 -24541 -96514 -280670 -203748 121240 194882 171802 -105469 79966
7524 -77252 6999 51063 43802 46273 194701 100201 51070 15367 -327703 138074 330974 37604
7511 -47214 -42285 -195918 75555 -176954 -211235 104042 28672 141911 39730 103437 -201236
7499 -35471 -52067 -190081 -88813 -104700 -77619 -339116 -17194 -84740 -64914 -287477 142712
7487 -20761 -338435 110121 26859 -331809 -5111 -130724 134057 7041 81555 372951 -234631
7475 92278 -65337 -5213 135124 43752 -264961 220071 -38144 -105910 -21468 58078 157766
7464 157766 -4662 -42616 126268 -319695 -34198 -167874 -233656 -151723 -93416 -191330 270165
7452 119118 -139941 -120773 -52089 84327 22636 157650 69177 10262 -7574 -130416 68477
7440 187560 -284395 -119667 -242322 266392 156010 -98079 -315900 -55487 58181 285715
7430 285715 273156 206818 -21460 -23565 78326 -330460 -83413 196886 120404 260974 213842
7419 213842 41518 -282758 -57340 -439022 137717 103551 -205509 -229857 -171150 -206818 -70157
7407 -40704 -48784 134965 -296018 187532 131018 185589 -163670 105135 -18318 13652 39469
7396 39469 117286 123665 -82681 -249891 58887 181062 -152872 -30751 -131599 -339266 32010
7384 176360 -124278 125406 84746 97394 -249768 83145 -108020 -159222 -52783 2040 12508
7373 12508 184344 -213251 -93638 -76541 -83980 -56221 -39420 -365816 -132680 -172768 -100983
7362 -100983 108109 114355 -142617 59463 104143 35439 259982 -25381 355443 134921 180773
7351 180773 -166797 82498 87831 298318 13606 -234123 342714 -195524 -27654 292159 153472
7340 153472 121222 -390950 -49638 112472 -12368 -184303 150040 -133848 -74875 -278899
7330 -278899 -144544 -112730 89076 15560 -143909 -219480 -222978 -190034 139149 171582 89039
7319 89039 -183166 57585 -57680 52520 -55327 56168 93398 73947 245599 84619 24667
7307 39235 -65232 -143469 41008 8474 -11751 -334706 30781 -198571 389863 -193691 -265255
7296 -265255 -41948 46197 -157021 -219758 12037 -138796 -176072 95943 -165744 177173 156738
7285 156738 -32927 -231167 -298281 -4265 112476 -117927 40994 -162468 186639 34951 -217035
7273 380646 -840 109321 -92808 57 -175992 -95685 -156327 288389 73566 -150744 -140757 109917
7260 15374 3812 -226961 250702 -86527 15049 -610945 -240979 -15929 15158 149985 -183367
7248 -270617 10462 -181258 -75056 -303622 -463471 8921 216622 -174303 -14618 -90483 -19650
7236 -39030 -7373 -27407 -57810 104427 -112811 288419 -35950 -273762 48401 -284846 -187056
7225 -187056 38966 335136 297921 -21774 80196 105922 44029 277475 -181860 190678 -51014
7213 48695 -62388 -47279 32311 229552 -149140 -185536 55590 -110570 -506678 156235 -185084
7201 -186672 73209 -35304 199298 399926 -347794 -306503 -73251 42713 -28038 -281043 38828
7189 35575 -137904 11615 -117055 -253623 -303810 -100123 -105263 159093 -253153 -249243 208096
7177 -196471 -129518 -62769 119767 104790 -176381 43801 -146905 -202697 30517 -348866 165276
7165 112402 158854 23776 98969 90913 -133311 -123329 168487 7034 -57830 108814 78790 45910
7153 45910 -48731 -207465 232066 28863 222137 -95400 102420 6393 120081 197784 -282823
7141 -60125 17112 235911 168406 28871 37038 -13966 -263498 -180292 19333 -102120 104224
7129 -52397 173914 31682 39710 121771 373970 211717 -99825 214850 144973 122521 71078
7118 71078 359216 -45081 -274944 -202366 131473 -58252 250090 -25840 -158961 -10713 -149728
7107 -149728 87890 -152614 -67490 318260 -227608 156522 -151493 -136576 -82403 -52169 217463
7095 -112444 -141067 106184 -230262 -154671 46004 -62894 -153785 -263102 154671 130426 35050
7083 -131243 -17262 9100 317248 -407175 -15459 292150 152830 283370 -104700 90093 55685
7072 55685 219321 68117 -6225 300650 -171142 -144712 -77163 -148995 128279 74290 -108408
7060 15984 -202189 175825 55772 -248619 165781 65228 -68760 -9190 45582 163315 416642
7049 416642 -92783 -13589 -17092 118995 254602 -31151 -193449 -90330 105154 -58341 -74071
7038 -74071 -103660 50760 32810 74409 -119679 -427883 -328805 -19607 -41814 147655 53121
7026 -56099 128742 -260083 -207235 61747 -157996 -252973 -70248 536399 -315376 -80202 -43249
7015 -43249 -77514 -130705 59083 17970 269808 110903 -17544 -242850 46453 2501 -209359
7003 -17345 -225419 125823 64081 -3582 -68692 -256334 213021 41818 6261 -220470 -26470
6991 -207598 -251553 -12363 102609 199815 11665 223650 -74948 -43174 -228248 171026 62455
6979 56597 -74072 96218 141332 -198395 138839 -369589 44107 239264 -93126 -97151 -272118
6968 -272118 111204 19958 -94441 -206628 -230195 -90207 -221156 -24089 273671 411993 -70664
6956 -94168 -135871 -216956 -29112 13475 174708 99400 -125730 218646 186998 -113629 -87877
6945 -87877 247631 -69868 -28404 84595 -2813 -96518 79106 161118 -223379 -28794 -428495
6934 -428495 370378 23255 -144418 19039 -35874 -158474 -52118 114210 48153 2363 97019
6923 97019 -212896 166395 111093 -373624 -39695 -199996 -178367 -250165 50171 360135 235250
6912 235250 -184085 -226963 165240 -119581 325518 -277086 -260687 151235 -203900 -221461
6902 -221461 91130 384338 -403378 219225 254608 -240760 38819 -375474 199628 79788
6891 -201536 198585 297759 -70132 118809 290180 64636 -263306 -292773 -369185 75907 -186132
6879 141782 213203 -126024 -38406 -64385 41616 198279 33173 -31680 -23496 -57105 57666
6867 -144901 -103206 -182427 95844 -273015 181637 251390 -159946 -96645 190588 -288106 220819
6855 90080 -134393 70749 308678 -123636 -18611 2040 -137095 -74296 -83785 -142265 34199
6843 -137587 178375 66096 -234445 5273 -208883 -137366 384748 314447 107231 138483 109168
6832 109168 -11809 52346 24594 97807 -480143 6021 164315 49603 -84796 120823 197061
6821 197061 124318 -255833 -16547 13643 160507 203245 -82973 118956 -81570 -6494 111993
6809 -37579 28690 -61058 57793 -323714 3759 -41883 -120407 220563 -110510 193955 -26370
6797 -130347 159683 4795 -76981 -169674 -201286 157191 -153694 162408 57792 263369 -197321
6785 222793 27804 178132 -60368 26456 -319242 17822 213919 68984 -57087 165341 -141024
6773 -204292 98459 -221516 240990 -164787 -232758 138627 -269696 -28941 154463 -25515
6762 -35131 -72092 186932 21747 20350 32435 294451 327885 -115918 -123189 194128 -191312
6750 -119085 15944 -120466 -262836 -50698 -66114 236246 -415995 92307 -3786 -224402 -168629
6739 -168629 -7590 50411 251133 -79775 21450 -138177 74451 -128389 -172157 119822 161801
6728 161801 202097 52052 -74714 81236 -139258 191675 -218358 199958 -38765 1572 137552
6717 137552 111286 -80833 145750 91164 84305 -236856 59623 -177395 60271 -274070 -87425
6705 63304 -170409 158785 -73784 -61478 307779 66022 -184229 -123070 -85995 188719 26267
6693 -168293 286012 -59088 155136 4486 -182805 -189437 154557 -112006 -199353 92988 -45222
6681 45703 17760 -563979 -36174 -124305 -238165 -44497 418853 -109702 65073 -71053 -72314
6670 -72314 242001 107782 -104602 76896 211824 -25440 114925 -145128 -137663 -138348 59783
6658 -275776 -143972 -202904 -105534 71991 -53943 154545 19308 268663 51543 119636 192246
6647 192246 79217 18276 -73699 50198 22725 -206284 -62639 -129936 70705 38644 252904
6636 252904 24734 -31792 -174728 -1837 -119493 -26393 38882 -254060 -92849 44731 113765
6625 113765 -148292 -102372 77248 69110 -52921 -217514 163821 230373 -52515 -84111 238166
6613 77610 540019 -171361 79791 -282137 -205842 116242 87561 174016 340663 253782 -119642
6601 -146192 -174418 151318 105055 98150 164609 -139156 -31501 -75817 16481 93740 117986
6590 117986 154515 -292260 38308 205780 -117898 424674 -33680 173215 2930 -479378 -206318
6578 70702 142474 -109510 -252648 75097 52456 -93010 78937 219230 177213 180652 125774
6567 125774 -37015 426495 25138 -153198 108681 -155083 88434 -191566 -185440 85664 95474
6556 95474 42257 -208784 228903 -24048 184936 218014 -158319 -88311 -68144 -204793 -293335
6545 -293335 -171236 51822 -46662 -176461 12301 -3880 153945 -221727 -209515 -81381 21921
6533 419995 39157 62052 -168781 -120307 -202988 40387 77568 -105880 -8095 30943 -98057
6521 -238076 64032 169439 -55438 35529 256945 -76307 -115916 -325852 -14655 -174719 -227132
6510 -227132 -34290 87165 -18422 -280959 60401 120913 -407992 -87558 46546 -360994 62044
6498 15320 222482 215782 -47907 178638 -59938 -253786 -83346 -311899 251241 -11722 79755
6486 -81773 10010 -144186 292483 -67852 188851 -249965 65918 -16536 -17899 -203565 -174328
6475 -174328 3992 24011 -223655 223894 196097 93281 -218303 -66492 -78769 37077 103786
6464 103786 -214816 247306 27982 181639 -138573 180178 30760 169994 -500956 -79200
6453 -118713 139779 292945 83467 39553 220862 93840 87370 -93414 80434 -243159 271953
6441 -88592 85259 230341 288627 129508 223956 -101251 -168052 104412 -96822 160533 -121518
6429 204239 50481 56239 1620 -111339 154515 -292885 -60676 108885 170950 -130400 -110371
6418 -110371 69047 90805 -152059 -214008 -28990 20043 -195936 -267191 56555 109959 218826
6407 218826 -83656 -168991 36972 -96228 -365996 213390 -128084 -192795 143100 380926 91934
6395 185360 83950 253216 -198679 177694 19731 327311 20355 -81659 -310767 52914 81814
6384 81814 -264549 -32839 -253354 107965 -23090 -64176 -135734 73715 -232461 189639 -27588
6372 195108 -206914 -183434 62745 -154329 149256 -45954 38444 188143 140627 -120097 -23869
6360 -79321 200436 -286038 6469 88958 -69076 132827 -11604 -259903 343345 21726 125663
6349 125663 50963 -285882 140308 -90643 88665 -102921 -22041 68317 370465 -151688 57881
6337 248407 35049 26488 159708 -59469 33487 51426 53734 190541 268606 -19955 195274
6325 69944 248150 -70030 -175066 -8168 -71060 -256004 -171058 229965 157154 -130683 27517
6313 -10810 193686 -45442 -60528 -110868 -159240 341786 -28877 -248975 -262092 -8964 75632
6301 -240595 -53263 312639 -253773 118858 -40222 15535 278561 -54604 -166127 -107053 59249
6289 -330090 -230776 -169965 -26560 -232261 -170756 -182932 -43106 -104719 -33942 -168995 -142320
6278 -142320 -28012 110689 -205704 30591 -15729 65809 -180027 -247340 -110048 -100902 579624
6266 -68260 182576 277170 -192283 13231 237100 45239 36850 270044 82580 278867 -217655
6254 -276985 92137 282205 -217925 -250941 -176893 109293 -151099 146461 -22932 381807
6243 -117568 -433498 -289258 -122289 -444317 26233 333597 67098 -254122 -70435 -47481
6233 -47481 192624 241086 -54250 22559 -184311 -177574 -29742 -118530 -230365 -226033 23174 -427241
6220 -24460 -204950 33709 -94772 159843 -53209 -73824 -30305 82390 165112 -355199 215386
6208 -148951 16440 -43371 12255 169361 -40854 122603 -16383 39472 97096 325846 -140800
6196 264098 -92588 -32868 -32332 -169338 -217113 148957 -223373 -84045 -84487 15383 12218 -15140
6183 -24998 -75772 -112591 -123161 335814 61946 -167399 -26701 37687 70703 147222 3328 -31322
6170 -406058 -348821 155642 -68393 180393 -7401 -85343 178801 92818 -303455 -4107 -24417
6159 -24417 -113341 -288023 77084 -50533 -3756 -138141 117054 -59185 272345 -126191 -203050
6148 -203050 -308745 -171022 -10534 -202648 -175090 102305 28230 -96807 -198755 297833
6137 243302 -271920 -46194 120014 44886 -323240 -62837 -262344 3842 289147 70461 -140763
6125 -381 203641 -164946 -71452 48149 -110583 -158678 32806 73321 521326 334949 278206
6114 278206 236475 72188 -213979 -91553 -109134 -11059 44390 97600 -116735 -229368 88515
6102 -5301 3621 74941 18350 -67792 -72901 75230 167181 -2405 33493 -70145 40064 -71453 258048
6088 221386 -78345 -382329 164009 197715 -62818 73242 -238580 -76382 41569 106534 -86860
6076 -198633 -288713 164119 275472 207115 227963 -34277 -232761 -158123 -5103 113921 -190630
6064 153364 -145689 -67281 -115906 -67242 32829 -164102 101024 239737 228630 -217298 -240539
6053 -240539 -14195 8253 230183 -53086 249207 268797 52501 -133859 87257 191028 -1801
6041 -242194 -84974 30340 -430388 -75720 -82434 252160 74572 -166492 -304167 297339 -126854
6029 179687 127729 -155248 -141409 -170357 -90313 -168097 65559 103045 25441 -299096 99174
6017 -140643 247785 60944 -219398 219338 -178939 -173058 46897 76859 -301802 127437 -251503
6005 -126965 77196 53276 52935 -167985 160689 -287217 111350 12334 145342 227226 -238129
5993 -19919 206346 -9028 -221849 -130651 13666 80303 -111148 151573 -81704 -35005 -280615
5982 -280615 186618 16008 -254817 -109010 58419 -123750 -57162 247078 -94957 -109740 74791
5970 -347374 317263 252209 -2328 -105224 130851 -123608 420756 224012 15203 39712 111904
5959 111904 -101651 31354 -200457 9600 -243620 68959 52908 128930 -220157 -225719 -259754
5948 -259754 -465719 -195811 -91315 -25665 -10733 43742 278740 -154912 -261427 183520
5937 154671 -156592 -34359 -31800 58713 -50555 224967 -88073 -48374 -56500 121338 124769 -5789
5924 18917 -338793 191466 -131877 -265683 246488 -128539 80403 141638 143599 337666 -35676
5912 114389 192405 234566 -43938 -198870 180270 220431 -265602 -279380 -62977 164782 214501
5901 214501 -295802 -234233 -14095 -238880 -110235 -218346 -16408 -261297 -219238 -52484 -56789
5890 -56789 96350 123960 -99294 62605 32427 -279016 58283 269485 -280544 -103041 122359
5878 59316 57349 -170734 -280640 -134544 30034 -136125 -99670 240294 248569 -107591 181762
5866 236419 -3997 -23602 -195791 -156304 171764 -93875 226651 85887 50690 35824 214617
5855 214617 166261 79505 84051 -288200 -428512 -10657 -84030 -68950 243328 -171221 -239844
5844 -239844 -184999 -233906 48749 -78529 36642 46814 -78381 -195524 282933 45470 -13167
5832 -244116 -90619 233637 -85486 87636 -14012 -82997 -203105 331596 -29049 65355 64418
5821 64418 -26960 -132309 -47584 -177227 -231970 -88446 235469 -198085 42023 -122072 24139
5809 120704 -290919 287017 52777 -303128 -57584 21186 -67695 -148876 58152 116253 -58485
5797 301043 -375439 -75076 -242958 -10443 78712 -235399 -318414 57536 236053 243690 423985
5786 423985 106063 22806 -351512 -392759 1217 -312382 -33197 168717 -223899 246134 -191806
5774 92076 -34004 -103682 56446 268955 -153275 65367 -6091 47293 242941 -211887 192565
5762 115723 18054 284033 -107724 -424804 -3090 -153505 302458 18885 -104446 76013 -211128
5750 27868 -58006 8400 426266 152236 -63265 -69230 -397210 20277 793 15015 94551 -137661
5737 191981 191138 -82184 88143 -194983 -76205 -55337 -78228 -273658 170885 -131902 14388
5725 -149719 12283 62960 -76578 137725 48057 190730 178376 301186 98811 -162936 27447
5713 112695 -142270 146795 60858 28681 290633 8895 -169149 -99503 286486 163371 -303885
5701 -72830 1627 169038 69713 -107493 346369 -208774 15940 21468 189599 -118762 -212105
5690 -212105 -176696 78667 -195648 187842 91132 -49264 -98927 -26388 130164 -100559 -74756
5679 -74756 58269 -345802 -95475 -199865 -251673 79284 -311660 11286 -134104 -126846 -384269
5668 -384269 -55422 -124591 -205936 184691 59581 -112033 -17781 30932 51827 -157151 -333175
5657 -333175 97825 -376184 -201196 102516 229805 -28750 232275 -194449 79269 -74940
5646 -210392 -70220 93929 -80074 72650 -236924 -194577 -2796 -52332 24192 -355499 -185979
5635 -185979 8437 -29450 -11823 341406 -56445 -189998 -306356 -106232 76543 -120012 -187656
5624 -187656 -79664 114212 259576 -149657 144236 2245 -105267 -118254 208625 232476 50317
5612 -314398 -105221 188488 -93647 26748 -69517 -414119 356985 18986 85157 -68629 319317
5600 65467 258610 76604 120057 7261 52655 -32986 41491 234087 -34933 -265230 -355037
5589 -355037 -249253 -32156 -315525 -49950 333369 181016 -92538 296243 -23444 121482
5578 192679 55056 151330 275601 -81201 -179647 -26390 175914 -26945 -117115 324140 134578
5566 -159292 -138469 270126 352746 287333 8954 117551 398134 -19872 -116762 45916 -85058
5554 -1210 -5870 -63553 24155 73025 -182744 -76099 -295762 37733 -148587 1218 -314606 -44681
5541 229817 -136184 -7764 296415 -166845 -316566 245210 68625 242111 -53702 -132717 133527
5529 -230915 -70800 -373858 -3581 163376 -270948 470907 217438 -72047 -240375 -38165 -125792
5518 -125792 235844 -240368 -126245 323203 397352 146534 108645 -127372 64520 19099
5507 -6357 97961 -70037 239948 236257 238863 349423 -4211 42228 -2233 15474 -221549 -85922
5494 -285113 -195228 22536 172926 -796 134760 -145575 -4115 -29724 -167035 129440 257479
5483 257479 79288 263430 -298454 45855 -62140 35802 -139781 -254742 -119283 226986
5472 288606 265928 -141540 215249 -91775 74365 -124028 20136 -257033 -55232 122640 367266
5461 367266 51107 113956 374784 92951 191129 60825 3129 -134327 283895 -247649 -164101
5450 -164101 -15278 333396 -39837 44549 -97291 92362 262553 17478 -223929 218010 -66327
5438 157772 42792 -162913 -205247 25180 -154740 -173719 11316 467999 -182830 164886 273511
5427 273511 138357 -199387 -81926 128994 11808 231984 -182077 -137111 -176500 73443 240736
5416 240736 19241 85058 -210069 -26045 -63892 -101991 -130641 -86212 -202624 413533 109556
5404 -53674 205981 80938 27404 -6493 -80547 191944 99485 -34000 164150 -164439 -15002
5392 -156250 -74960 6007 -235466 -80567 -375590 -130460 -264949 116963 58192 1338 250384
5381 250384 230944 -42020 58107 -122460 -169060 289376 -186152 122444 113083 -380430 -32594
5369 -90884 -213291 47722 23318 -58475 209110 123151 -270928 36431 -132413 -204784 -414535
5358 -414535 -39832 -349479 100870 109545 36421 -387204 111748 245567 312619 187457 440477
5347 440477 156257 -22442 100241 -87317 -169075 161908 200801 204381 8745 61125 201416
5336 201416 -299542 38149 -129657 57825 54971 20981 270301 -177489 -82103 288595 154838
5325 154838 50591 60298 -20346 -927 -425957 144218 -131423 129798 130084 2641 27092 -486570
5312 244866 -353698 -113102 192575 -228947 4653 -306838 -237312 98997 -233330 -298151 86941
5300 -271751 317975 -228336 -185649 151078 44707 177084 -187388 -36599 -22984 -31913 -150124
5289 -150124 -122984 -162856 44034 -17290 88160 -272316 167318 -40292 176302 -138630 -263770
5278 -263770 -200223 -22117 -296129 106470 100289 -262327 450528 -174968 -51866 281400 250461
5267 250461 -81251 -217201 82738 140194 -17344 -290102 -186824 -167579 16673 192206 111440
5256 111440 -91241 184329 -122265 106275 -109718 -56652 238595 112043 217638 -456420
5245 18897 -5156 73266 -2700 -20691 -126923 25413 -47119 -322313 -172551 -229248 264695
5233 -52505 14796 8189 -102665 -14920 -135241 -35708 -58097 59704 -65820 -39101 454949
5221 127347 12164 46888 -9523 265789 67314 182372 -30759 -225750 -60221 29266 287917
5210 287917 83565 39753 -230741 366626 -153854 88110 270134 -3719 -62385 -80971 -10977
5198 90766 -173877 25444 -75707 258786 -15032 -53948 193572 343952 28019 -181512 -30498
5186 -344864 347172 -237762 -100831 -66535 421282 -227916 -214913 325368 11432 -98608
5175 -59072 -241900 -3669 179647 60058 126475 58930 -44837 -60751 238703 41986 258456
5164 258456 -91783 -147104 -37262 -223636 412634 332101 254638 -23237 133205 319546 -27270
5152 -29321 37635 -304148 166397 146322 436302 185906 35203 -138629 14817 -332334 418008
5140 -19281 -390698 56756 -298261 140654 235912 204946 386330 95501 -174557 -90727 -75238
5129 -75238 -23471 -162460 89509 218812 -128409 -22626 233424 -26775 -26013 199164 100993
5118 100993 14065 -113619 -8889 223092 80508 189212 122199 -163611 -135199 2559 71202
5107 71202 164106 -230738 234330 -275467 -154860 137883 17906 44454 -212486 -63149 -160947
5096 -160947 37540 -101441 34165 -24721 120140 -89478 -207944 -129690 12406 -17018 38595
5084 -205112 71322 6748 -260068 -85529 42391 77760 -200091 -169124 -74136 320451 338300
5073 338300 181386 157630 141389 146462 3965 -25668 111920 61150 121113 -44538 -21582 -227410
5061 -227410 367032 -99311 -202127 -39712 136564 -54250 41940 -304629 -24595 10786 -127226
5049 -42034 57517 159409 -287114 -141000 -97196 269448 210044 -271602 -9673 -120130 82956
5037 -37774 -430312 148042 -104132 76427 -120983 -16716 191416 -122368 100762 28051
5026 411694 -146463 81821 200872 -209760 -90624 67114 119605 -114215 -88420 -12497 31563
5014 157247 103392 -389394 115171 -205250 -142926 173356 23721 -75295 25668 341283 -86587
5002 -294002 128557 -50507 153397 -11231 22332 -296081 487167 205759 65949 -73897 114025
4990 -176281 356580 -88152 100114 38946 144736 154623 -167084 -21204 35497 223961 -190463
4978 94899 160253 125150 127306 -234022 -380628 115677 174856 -166494 -28995 -125952 -266395
4967 -266395 412264 -18362 82115 -162527 457874 -247344 -138753 142954 144025 -138519
4956 54246 -125646 -12586 -492603 -282963 -29079 16600 25762 93642 -279483 83066 -36553
4944 -48904 7531 -325422 16868 247208 472934 -226372 -36952 -76884 75731 58790 -128129
4932 223424 135399 144326 -56128 -67464 -25808 58921 -100529 338266 32338 -112565 33891
4920 -85602 -253983 -2028 113607 9837 -406099 20164 -255858 -162545 285677 32555 -245039
4908 -169289 -64065 -250038 380215 23764 -97758 -205455 -118670 143708 8870 -263373 -152642
4897 -152642 365099 -49777 35457 267869 201604 356536 45656 -37832 -68418 175631 -64447
4885 121930 -229497 -135777 -88420 145114 159472 -156729 -54833 -53765 2428 15193 209514
4874 209514 136984 399721 -10692 -257576 -137380 9560 28984 -330805 -156802 227144 208072
4863 208072 -270661 -125619 -214329 -136488 -93355 30834 10251 197513 211081 -52123 -87415
4852 -87415 -5073 9380 62288 159311 67026 118711 169090 -44533 -253070 264996 -292842 110149
4839 -142857 -152666 80467 -149883 -23444 -81083 272624 -63785 -49664 311534 -247150 234605
4827 42945 151400 -145410 -85327 29086 -202844 65034 -254787 26627 70355 -380860 -21479
4815 151346 -37006 22857 152409 -305569 189791 -293538 -168838 352869 57207 -86836
4804 390059 67097 332478 50562 -228801 26669 -115558 95601 -42660 -193543 -126692 84203
4792 144127 -149337 187770 288832 -50640 -79191 -13936 -190357 35809 -162063 6714 -178587
4780 -48929 47778 -95283 33384 64929 -329887 106228 -179550 245475 66298 163517 88882
4769 88882 549889 16486 118309 115639 6281 230026 15852 -276891 79855 34662 305430
4758 305430 107037 -49819 148347 -85581 -258872 161890 99516 411069 -55688 -253846
4748 -253846 151600 345919 -175994 75692 101860 89067 118789 14298 -82903 58266 -351299
4736 226707 74246 -75624 252230 141312 -245236 166544 474792 1607 39465 -90671 110577
4724 25670 -321680 16197 80570 -45218 70204 -19027 336346 -539508 30287 154027 252019
4713 252019 157533 147766 -66614 -133388 -32739 -176609 67678 140477 -168123 178039 -163876
4701 -299585 212849 -53479 -153008 139580 -34657 6834 23777 126518 373649 -239718 201799
4689 41377 18477 -142702 -123622 -9171 211299 72706 102052 135430 -265548 104987 99215
4678 99215 -4104 254536 182241 40414 -306588 -169488 -231821 371587 -119980 41906 89045
4667 89045 -238076 187196 -74064 -115701 -88935 369186 -42887 -58967 245935 107156 135468
4656 135468 -197729 -59110 -65018 138634 -44813 -28756 111798 231806 -200727 -238686 -71001
4644 62290 29998 7221 -23336 -169944 251191 -52131 25047 278876 -322892 -269566 162320
4632 -129232 -98897 -292612 -105220 319382 155166 294221 61585 73172 4125 44410 262920
4621 262920 423798 119425 -150756 204144 -3558 89472 -251247 165352 5998 217825 -197857
4609 321974 117747 110456 272911 -154809 161312 -191689 203603 -160902 -35529 -129214
4599 -129214 279645 -74192 152413 -69161 -32673 -338716 14357 74153 180141 175937 -67541
4587 385341 62787 -18785 98967 83001 -84961 -215411 -240008 155656 -83110 -72869 84850
4575 -213658 -74598 44115 225639 220528 268920 -63051 155244 -46974 162183 -204072 -261911
4564 -261911 -124106 -145061 -46339 -107671 -29791 -144531 -213751 121257 -32380 -25272 -271072
4553 -271072 29704 70990 -35270 -309482 241914 -106512 240970 -143591 98692 -256600
4542 21060 16048 152772 -256620 528532 149291 259855 -142155 -47070 194140 -102662
4531 -213943 -150572 148153 -215124 146816 256055 263936 -200029 280122 49445 -114726
4520 -226438 -97420 99588 56296 99283 -59677 151132 -40111 146666 99656 -210266 -35296
4508 85195 112033 15251 139546 -123331 50994 5996 -139730 -78151 45278 54681 130404 1657
4495 -43041 95677 -428500 -52262 46636 48208 -71382 -219821 614 204307 233158 -153684 -401996
$$ [...]
##END NTUPLES=NMR SPECTRUM
##END=
