
##TITLE=AC1146_Santa_5875032_1DaXPQNHdO
##JCAMPDX= 6.0         $$ Bruker NMR JCAMP-DX V2.0
##DATA TYPE= NMR SPECTRUM
##DATA CLASS= NTUPLES
##ORIGIN= BRUKER
##OWNER= Administrator
$$ 1.72 TOPSPIN		Version 2.1
$$ 2012-03-31 22:22:29.437 -0500  Administrator@TOPSPIN
$$ Compression mode = diff/dup
##.OBSERVE FREQUENCY= 400.13188235
##.OBSERVE NUCLEUS= ^1H
##.ACQUISITION MODE= SIMULTANEOUS (DQD)
##.ACQUISITION SCHEME= undefined
##.AVERAGES= 64
##.DIGITISER RES= 22
##SPECTROMETER/DATA SYSTEM= spect
##.PULSE SEQUENCE= noesygpps1d.comp
##.SOLVENT NAME= COFFEE_meoh
##.SHIFT REFERENCE= INTERNAL, COFFEE_meoh, 1, 14.96851
##AUDIT TRAIL= $$ (NUMBER, WHEN, WHO, WHERE, PROCESS, VERSION, WHAT)
$$ ##TITLE= Audit trail, TOPSPIN		Version 2.1
$$ ##JCAMPDX= 5.01
$$ ##ORIGIN= Bruker BioSpin GmbH
$$ ##OWNER= Administrator
$$ $$ C:\Bruker\TOPSPIN/data/COFFEE/nmr/AC1146_Santa_5875032_1DaXPQNHdO/12/pdata/1/auditp.txt
$$ ##AUDIT TRAIL=  $$ (NUMBER, WHEN, WHO, WHERE, PROCESS, VERSION, WHAT)
(   1,<2012-03-31 22:22:23.859 -0500>,<Administrator>,<TOPSPIN>,<go>,<TOPSPIN 2.1>,
      <created by zg
	started at 2012-03-31 22:10:52.125 -0500,
	POWCHK enabled, PULCHK disabled,
       configuration hash MD5:
       1A 1E CE 29 27 FD 77 03 67 4E F0 E3 C4 B2 CB 90
       data hash MD5: 64K
       EF 4B ED 23 05 5F 03 00 CD D4 5D 31 CA DF 02 0D>)
(   2,<2012-03-31 22:22:27.078 -0500>,<Administrator>,<TOPSPIN>,<proc1d>,<TOPSPIN 2.1>,
      <Start of raw data processing
       efp LB = 0.3 FT_mod = 6 PKNL = 1 PHC0 = 0 PHC1 = 0 SI = 128K 
       data hash MD5: 128K
       A9 0B 9D CE AE 76 E0 68 88 53 A7 93 FE 41 2D AE>)
(   3,<2012-03-31 22:22:28.437 -0500>,<Administrator>,<TOPSPIN>,<proc1d>,<TOPSPIN 2.1>,
      <pk PHC0 = 38.14453 PHC1 = 0 
       data hash MD5: 128K
       27 9E D8 98 26 95 BB 90 AB 4A D8 65 8A EA 7E 9F>)
(   4,<2012-03-31 22:22:28.984 -0500>,<Administrator>,<TOPSPIN>,<proc1d>,<TOPSPIN 2.1>,
      <abs ABSG = 1 
       data hash MD5: 128K
       30 50 0E 45 0E 30 C8 50 86 B5 18 49 AB C6 95 66>)
(   5,<2012-03-31 22:22:29.078 -0500>,<Administrator>,<TOPSPIN>,<proc1d>,<TOPSPIN 2.1>,
      <abs ABSG = 2 
       data hash MD5: 128K
       47 74 74 8D BD 5D 8C 44 2E 3C 37 47 7D A1 F0 4B>)
(   6,<2012-03-31 22:22:29.125 -0500>,<Administrator>,<TOPSPIN>,<proc1d>,<TOPSPIN 2.1>,
      <abs ABSG = 3 
       data hash MD5: 128K
       6E 75 09 0A D0 28 79 36 F6 90 4A AC 72 78 48 B1>)
(   7,<2012-03-31 22:22:29.203 -0500>,<Administrator>,<TOPSPIN>,<proc1d>,<TOPSPIN 2.1>,
      <abs ABSG = 4 
       data hash MD5: 128K
       05 A2 BA 2A FF D9 B2 2B 7B 63 71 FF 4E 86 F0 1E>)
(   8,<2012-03-31 22:22:29.250 -0500>,<Administrator>,<TOPSPIN>,<proc1d>,<TOPSPIN 2.1>,
      <abs ABSG = 5 
       data hash MD5: 128K
       90 EA F6 F4 28 78 A1 29 C1 4B 56 66 B2 C7 52 7C>)
$$ ##END=
$$ 
$$ $$ hash MD5
$$ $$ 65 A6 4D 0A 2A 65 C0 9D 33 DB 9A C1 45 FB 02 8A
##$RELAX= 
##$RELAX= 
##$RELAX= 
##$RELAX= 
##$RELAX= 
##$RELAX= 
##$RELAX= 
##$RELAX= 
$$ Bruker specific parameters
$$ [...]
##$TP07= 0
##$TPNAME0= <>
##$TPNAME1= <>
##$TPNAME2= <>
##$TPNAME3= <>
##$TPNAME4= <>
##$TPNAME5= <>
##$TPNAME6= <>
##$TPNAME7= <>
##$TPOAL= (0..7)
0.5 0.5 0.5 0.5 0.5 0.5 0.5 0.5
##$TPOFFS= (0..7)
0 0 0 0 0 0 0 0
##$TUNHIN= 0
##$TUNHOUT= 0
##$TUNXOUT= 0
##$USERA1= <user>
##$USERA2= <user>
##$USERA3= <user>
##$USERA4= <user>
##$USERA5= <user>
##$V9= 5
##$VALIST= <valist>
##$VCLIST= <CCCCCCCCCCCCCCC>
##$VD= 0
##$VDLIST= <DDDDDDDDDDDDDDD>
##$VPLIST= <PPPPPPPPPPPPPPP>
##$VTLIST= <TTTTTTTTTTTTTTT>
##$WBST= 2048
##$WBSW= 25
##$XGAIN= (0..3)
0 0 0 0
##$XL= 0
##$YL= 0
##$YMAX_a= 12607450
##$YMIN_a= -6618589
##$ZGOPTNS= <>
##$ZL1= 120
##$ZL2= 120
##$ZL3= 120
##$ZL4= 120
##$ABSF1= 14.96851
##$ABSF2= -5.584021
##$ABSG= 5
##$ABSL= 3
##$ALPHA= 0
##$AQORDER= 0
##$ASSFAC= 0
##$ASSFACI= 0
##$ASSFACX= 0
##$ASSWID= 0
##$AUNMP= <proc_prof1d_extract.lims>
##$AXLEFT= 0
##$AXNAME= <>
##$AXNUC= <1H>
##$AXRIGHT= 0
##$AXTYPE= 0
##$AXUNIT= <>
##$AZFE= 0.1
##$AZFW= 0.1
##$BCFW= 0
##$BC_mod= 0
##$BYTORDP= 0
##$COROFFS= 0
##$CY= 15
##$DATMOD= 1
##$DC= 0
##$DFILT= <>
##$DTYPP= 0
##$F1P= 0
##$F2P= 0
##$FCOR= 0.5
##$FTSIZE= 131072
##$FT_mod= 6
##$GAMMA= 0
##$GB= 0
##$INTBC= 1
##$INTSCL= 1
##$ISEN= 128
##$LB= 0.3
##$LEV0= 0
##$LPBIN= 0
##$MAXI= 10000
##$MC2= 0
##$MEAN= 0
##$ME_mod= 0
##$MI= 0
##$NCOEF= 0
##$NC_proc= -2
##$NLEV= 6
##$NOISF1= 0
##$NOISF2= 0
##$NSP= 0
##$NTH_PI= 0
##$NZP= 0
##$OFFSET= 14.96851
##$PC= 1
##$PHC0= 38.14453
##$PHC1= 0
##$PH_mod= 1
##$PKNL= yes
##$PPARMOD= 0
##$PPDIAG= 0
##$PPIPTYP= 0
##$PPMPNUM= 2147483647
##$PPRESOL= 1
##$PSCAL= 4
##$PSIGN= 0
##$PYNMP= <proc.py>
##$REVERSE= no
##$SF= 400.130004842508
##$SI= 131072
##$SIGF1= 0
##$SIGF2= 0
##$SINO= 400
##$SIOLD= 131072
##$SPECTYP= <>
##$SREGLST= <1H.CDCl3>
##$SSB= 0
##$STSI= 131072
##$STSR= 0
##$SW_p= 8223.68421052632
##$SYMM= 0
##$S_DEV= 0
##$TDeff= 65536
##$TDoff= 0
##$TI= <>
##$TILT= no
##$TM1= 0
##$TM2= 0
##$TOPLEV= 0
##$USERP1= <user>
##$USERP2= <user>
##$USERP3= <user>
##$USERP4= <user>
##$USERP5= <user>
##$WDW= 1
##$XDIM= 131072
##$YMAX_p= 272847314
##$YMIN_p= -296823132
##$CURPLOT= <Network HP LaserJet P1505>
##$CURPRIN= <$Network HP LaserJet P1505>
##$DFORMAT= <normdp>
##$LAYOUT= <+/1D_H.xwp>
##$LFORMAT= <normlp>
##$PFORMAT= <normpl>
##$SURQMSG= 1
$$ End of Bruker specific parameters
$$ ---------------------------------
##NTUPLES= NMR SPECTRUM
##VAR_NAME=  FREQUENCY,     SPECTRUM/REAL,   SPECTRUM/IMAG
##SYMBOL=    X,             R,               I
##VAR_TYPE=  INDEPENDENT,   DEPENDENT,       DEPENDENT
##VAR_FORM=  AFFN,          ASDF,            ASDF
##VAR_DIM=   131072,        131072,          131072
##UNITS=     HZ,            ARBITRARY UNITS, ARBITRARY UNITS
##FACTOR=    0.0627417313425165, 1,          1
##FIRST=     8223.62146879498, -1489,        -43812
##LAST=      0,             -66,             -44714
##MIN=       0,             -296823132,      0
##MAX=       8223.62146879498, 272847314,    0
$$ Real data points
##PAGE= N=1
##DATA TABLE= (X++(R..R)), XYDATA
$$ [...]
62011B150205L8037L8768L9677M1045M2687M4015M4733M5039M5174M5042M4161
62000B618583M1958L8379L4259L0658K7788K5049K2157J9503J7281J5008J2356
61989B902979R751P645N873M311L581M302O080Q024R920J2192J4904J7593J9965
61976C027120K2120K4074K5696K7091K8553L0134L1686L3240L4875L6213L6580
61965C357382L5793L4442L3295L2667L2329L1800L0737K9295K7987K7011K5873
61954C698611K3948K1233J8251J5372J2610R987P691N814M226K786J588R05Q27
61941C823849Q59J19j659l493m125l701l721n087o983q179q637r079r632r806
61927C750725r471q906q078o690m944l441k290r66Q10K682M240N479O524P310
$$ y = [2150205, 2188242, 2227010, 2266687, 2307732, 2350419, 2394434, 2439167, 2484206, 2529380, 2574422, 2618583, 2660541, 2698920, 2733179, 2763837, 2791625, 2816674, 2838831, 2858334, 2875615, 2890623, 2902979, 2912730, 2920375, 2926248, 2930559, 2934140, 2938442, 2944522, 2952546, 2962466, 2974658, 2989562, 3007155, 3027120, 3049240, 3073314, 3099010, 3126101, 3154654, 3184788, 3216474, 3249714, 3284589, 3320802, 3357382, 3393175, 3427617, 3460912, 3493579, 3525908, 3557708, 3588445, 3617740, 3645727, 3672738, 3698611, 3722559, 3743792, 3762043, 3777415, 3790025, 3800012, 3807703, 3813517, 3817743, 3820529, 3822117, 3823022, 3823849, 3824708, 3824827, 3823168, 3819675, 3815550, 3811849, 3808128, 3803041, 3796058, 3787879, 3779242, 3770163, 3760531, 3750725, 3741254, 3732348, 3724270, 3717580, 3712636, 3709195, 3706905, 3705939, 3706749, 3709431, 3713671, 3719150, 3725674, 3732984]
61913C732984P711P720P461P191P117P024O365N025L627K587J335q54l573n704
61899C786016p010q444j0786j3694j6338j8347j9865k1159k2479k3923k5287k6252
61887C572432k6763k6944k6691k5828k4591k3514k2743k1974k0981j9858j8617
61876C313928j7050j5088j2876j0441p677m637j526J613M763P669J0181J2801
61864C281660J6297K0712K5382K9911L4602L9838M5663N2109N9339O7249P5460
61853C748222Q3929R3127J03407J14828J27725J42823J60353J79650K00104K22121
61843E176289K46630K73880L03149L33374L63544L92451M18230M38046M48101
61834H393694M43983M21357L76775L08662K18537J11742l299j17125k21364l10020
$$ y = [3732984, 3740695, 3748415, 3755876, 3763067, 3770184, 3777208, 3783573, 3788598, 3792225, 3794812, 3796147, 3795293, 3791720, 3786016, 3779006, 3770562, 3759776, 3746082, 3729744, 3711397, 3691532, 3670373, 3647894, 3623971, 3598684, 3572432, 3545669, 3518725, 3492034, 3466206, 3441615, 3418101, 3395358, 3373384, 3352403, 3332545, 3313928, 3296878, 3281790, 3268914, 3258473, 3250796, 3246159, 3244633, 3246246, 3251009, 3258678, 3268859, 3281660, 3297957, 3318669, 3344051, 3373962, 3408564, 3448402, 3494065, 3546174, 3605513, 3672762, 3748222, 3832151, 3925278, 4028685, 4143513, 4271238, 4414061, 4574414, 4754064, 4954168, 5176289, 5422919, 5696799, 5999948, 6333322, 6696866, 7089317, 7507547, 7945593, 8393694, 8837677, 9259034, 9635809, 9944471, 10163008, 10274750, 10271451, 10154326, 9932962, 9622942]
61824I622942l79896m30201m61604m75661m75088m63789m45582m22800l96620
61815E671701l68529l40485l13586k87653k62546k39087k18152j99630j82823
61806C259210j67400j53332j40389j28339j17333j07543r8647r0139q1962p4412
61796B099714o7656o1733n6728n2548m8691m4668m0518l6642l3271l0419k8047
61785A598793k5976k3901k1748j9828j8318j6956j5586j4553j4043j3382j1620
61774A402882q745n734l458k069j338j030p94k38O13J324J615J719J961K310K579
61759A391597K889L668N151P043Q748R978J1085J2718J5175J8174K1282K4288
61747A531796K7163K9858L2469L5351L8775M2554M6303N0028N4134N8838O3906
$$ y = [9622942, 9243046, 8812845, 8351241, 7875580, 7400492, 6936703, 6491121, 6068321, 5671701, 5303172, 4962687, 4649101, 4361448, 4098902, 3859815, 3641663, 3442033, 3259210, 3091810, 2938478, 2798089, 2669750, 2552417, 2444874, 2346227, 2256088, 2174126, 2099714, 2032058, 1970325, 1913597, 1861049, 1812358, 1767690, 1727172, 1690530, 1657259, 1626840, 1598793, 1572817, 1548916, 1527168, 1507340, 1489022, 1472066, 1456480, 1441927, 1427884, 1414502, 1402882, 1394137, 1388403, 1384945, 1382876, 1381538, 1380508, 1379714, 1379476, 1380089, 1381413, 1383028, 1384747, 1386708, 1389018, 1391597, 1394486, 1398154, 1403305, 1410348, 1419096, 1429074, 1440159, 1452877, 1468052, 1486226, 1507508, 1531796, 1558959, 1588817, 1621286, 1656637, 1695412, 1737966, 1784269, 1834297, 1888431, 1947269, 2011175]
61736B011175O9113P4648Q0796Q7369R3828J00065J06785J14859J24385J34687
61726B997710J45284J56583J69429J84217K00698K18591K38065K59617K83758
61717D853952L10921L41464L75603M13401M54902N00200N49233O01414O55287
61708I056377P08496P58054Q00571Q31807Q45824Q34999P91401P08854N84649
61699A5921032M21176K27408J8607j87117l73917n31447o54790p42835p97177
61690A3300940q21650q21584q02718p70360p29053o82570o33975n85510n38322
61681F915198m92729m49123m08541l71966l39305l09582k82130k57053k34570
61672C770199k14522j96655j80773j66437j52998j40243j28543j18162j08847
$$ y = [2011175, 2080288, 2154936, 2235732, 2323101, 2416929, 2516994, 2623779, 2738638, 2863023, 2997710, 3142994, 3299577, 3469006, 3653223, 3853921, 4072512, 4310577, 4570194, 4853952, 5164873, 5506337, 5881940, 6295341, 6750243, 7250443, 7799676, 8401090, 9056377, 9764873, 10522927, 11323498, 12155305, 13001129, 13836128, 14627529, 15336383, 15921032, 16342208, 16569616, 16588223, 16401106, 16027189, 15495742, 14840952, 14098117, 13300940, 12479290, 11657706, 10854988, 10084628, 9355575, 8673005, 8039030, 7453520, 6915198, 6422469, 5973346, 5564805, 5192839, 4853534, 4543952, 4261822, 4004769, 3770199, 3555677, 3359022, 3178249, 3011812, 2858814, 2718571, 2590028, 2471866, 2363019]
61663B363019j00318r2610q5675p9153p2879o7165o2213n7658n3170m9050m5691
61652A597437m2753l9499l5804l2293k9500k7342k5408k3404k1290j9229j7505
61641A283410j6262j5429j4920j4783j4898j4846j4338j3741j3696j4249j4724
61630A121524j4613j4334j4789j6190j7577j7723j6473j4969j4397j4778j5177
61619I50504j4937j4257j3655j3232j2698j1802j0591r363q409p752p177o601
61607H20030o179n891n346m371l467l110k910k128q49J65P30J393K264K687K393
61592G95411K042K154K302J998J636J790K121J825Q74K5k17o6J9k01o61r84p30
61575H09338JN42M26l0l44o02j080j538j516j097p46n77l35qJ38N7p1k55n45n83
$$ y = [2363019, 2262701, 2170091, 2084416, 2005263, 1932384, 1865219, 1803006, 1745348, 1692178, 1643128, 1597437, 1554684, 1515185, 1479381, 1447088, 1417588, 1390246, 1364838, 1341434, 1320144, 1300915, 1283410, 1267148, 1251719, 1236799, 1222016, 1207118, 1192272, 1177934, 1164193, 1150497, 1136248, 1121524, 1106911, 1092577, 1077788, 1061598, 1044021, 1026298, 1009825, 994856, 980459, 965681, 950504, 935567, 921310, 907655, 894423, 881725, 869923, 859332, 849969, 841560, 833808, 826631, 820030, 813851, 807960, 802614, 798243, 794776, 791666, 788756, 786628, 785779, 785944, 786674, 788067, 790331, 793018, 795411, 797453, 799607, 801909, 803907, 805543, 807333, 809454, 811279, 812153, 812178, 811961, 811895, 811914, 811713, 811052, 810068, 809338, 809339, 809881, 810307, 810277, 809933, 809331, 808251, 806713, 805197, 804100, 803354, 802777, 802442, 802434, 802572, 802629, 802558, 802303, 801758, 801175]
61555H01175O7J070J482R66L40N56J509K257K220J777J639J924K057J571P12J34
61539H21456M5J7l63r86j474j716j853j944j842j433q53n10p49j367j634j023
61523H03771J22J087J733K492L503M427N240O404Q025R473J0336J1165J2690J4721
61509H95189J6444J7585J8755K0637K3113K5218K5982K5476K4863K5018K5390
61498A143670K4872K3604K2803K2720K2083K0086J7739J6382J5851J5190J4206
61487A359206J3223J1850R424O356L789J977J42k121m351o175p769r146r848r673
61473A356884r048q427p771o794n349l510j623j55R21K355M741P668J0380J2967
61459A353239J6136J9956K3766K7341L1241L5850M0840M5908N1381N7702O4778
$$ y = [801175, 801242, 802312, 803794, 804760, 805100, 805656, 807165, 809422, 811642, 813419, 815058, 816982, 819039, 820610, 821322, 821456, 821501, 821518, 821155, 820169, 818695, 816979, 815126, 813182, 811340, 809907, 809054, 808544, 807795, 806428, 804794, 803771, 803893, 804980, 806713, 809205, 812708, 817135, 822375, 828779, 836804, 846277, 856613, 867778, 880468, 895189, 911633, 929218, 947973, 968610, 991723, 1016941, 1042923, 1068399, 1093262, 1118280, 1143670, 1168542, 1192146, 1214949, 1237669, 1259752, 1279838, 1297577, 1313959, 1329810, 1345000, 1359206, 1372429, 1384279, 1393703, 1400059, 1403848, 1405825, 1405967, 1403846, 1399495, 1393320, 1385551, 1376405, 1366557, 1356884, 1347836, 1339409, 1331638, 1324844, 1319495, 1315985, 1314362, 1314207, 1315128, 1317483, 1322224, 1329892, 1340272, 1353239, 1369375, 1389331, 1413097, 1440438, 1471679, 1507529, 1548369, 1594277, 1645658, 1703360, 1768138]
61448A768138P2161P9574Q7155R5385J04772J15254J25996J36144J45663J54878
61438B885120J63372J69845J72971J71785J65333J52782J34037J09831Q1263M9866
61428D256205J8046j1513l7325n9565p8827r4938j07144j14949j18456j18300
61418C533234j15495j11031j05354r8393r0132q0969p1531o2333n3543m4882l5939
61407B663632k6849j8311j0674l410L999J1164J7394K2740K7625L1821L4811L6930
61395B790872L9014M1004M1951M1500M0394L9281L8080L6746L5681L5007L4326
61384C213856L3531L3083L3059L2823L1999L0989L0044K8678K6531K4049K1735
61373C540377J9364J6588J3629J0806P840M370O22k999o573j0290j3799j6545
$$ y = [1768138, 1840299, 1919873, 2007028, 2102413, 2207185, 2322439, 2448435, 2584579, 2730242, 2885120, 3048492, 3218337, 3391308, 3563093, 3728426, 3881208, 4015245, 4125076, 4206339, 4256205, 4274251, 4262738, 4225413, 4165848, 4087021, 3992083, 3884939, 3769990, 3651534, 3533234, 3417739, 3306708, 3201354, 3102961, 3012829, 2931860, 2860329, 2797996, 2744453, 2699571, 2663632, 2636783, 2618472, 2607798, 2604388, 2608387, 2619551, 2636945, 2659685, 2687310, 2719131, 2753942, 2790872, 2829886, 2870890, 2912841, 2954341, 2994735, 3034016, 3072096, 3108842, 3144523, 3179530, 3213856, 3247387, 3280470, 3313529, 3346352, 3378351, 3409340, 3439384, 3468062, 3494593, 3518642, 3540377, 3559741, 3576329, 3589958, 3600764, 3608604, 3612974, 3613596, 3610597, 3604024, 3593734, 3579935, 3563390]
61361C563390j8499k0017k1245k2118k2584k2412k1108j8596j5675j3233j1261
61350C356642r194o935m969l531k379j438j168k008l792n852p605q872r701j0019
61336C279179r567q241o232l615M3N282J2107K0115K9145L9286N0191O1122P1858
61323C540673Q3071R5426J08698J22148J35355J48293J60726J71819J80325J85094
61313D931628J85474J81254J71963J56562J34422J06583P5502M3423J1449j9734
61303E978526m9037p5321r8140j17855j35129j50355j63138j72353j77252j78589
61293D661357j78016j76282j72725j66679j58718j49999j41147j32173j23000
61284C262618j13613j04005r4309q4666p4940o5108n5912m8247m1655l4444k5815
$$ y = [3563390, 3544891, 3524874, 3503629, 3481511, 3458927, 3436515, 3415407, 3396811, 3381136, 3367903, 3356642, 3347448, 3340513, 3335544, 3332013, 3329634, 3328196, 3327028, 3325020, 3321228, 3315376, 3307771, 3298899, 3289198, 3279179, 3269612, 3261371, 3255139, 3251524, 3251567, 3256849, 3268956, 3289071, 3318216, 3357502, 3407693, 3468815, 3540673, 3623744, 3719170, 3827868, 3950016, 4085371, 4233664, 4394390, 4566209, 4746534, 4931628, 5117102, 5298356, 5470319, 5626881, 5761303, 5867886, 5943388, 5986811, 5998260, 5978526, 5929489, 5854168, 5756028, 5638173, 5503044, 5352689, 5189551, 5017198, 4839946, 4661357, 4483341, 4307059, 4134334, 3967655, 3808937, 3658938, 3517791, 3385618, 3262618, 3149005, 3045000, 2950691, 2866025, 2791085, 2725977, 2670065, 2621818, 2580163, 2545719, 2519904]
61273B519904j6991r554l488K330Q373J4155J9196K3383K6674K9204L1463L3691
61261B678340L5320L5715L5133L4263L3084L0988K7946K4710K1859J9289J6733
61250B993380J4245J1959R792P537M967J944j403m691p754j0889j4388j8108k1792
61237B964799k5427k8946l1905l3971l5467l6913l8260l9072l9245l9037l8499
61226B578057l7496l6064l4260l1781k8407k4650k1385j8792j6337j3853j1939
61215B303093j1033j0658j0094r397r281j0072j1300j2313j2940j3171j2547j0487
61203B169800p338m478k792j472R91M913R320J3632J8356K3856K9504L4714L9993
61190B328999M6141N2939N9462O5296P0674P5485P8879P9811P7574P1904O2929
$$ y = [2519904, 2502913, 2493359, 2489871, 2492201, 2500574, 2514729, 2533925, 2557308, 2583982, 2613186, 2644649, 2678340, 2713660, 2749375, 2784508, 2818771, 2851855, 2882843, 2910789, 2935499, 2957358, 2976647, 2993380, 3007625, 3019584, 3029376, 3036913, 3041880, 3043824, 3042421, 3037730, 3029976, 3019087, 3004699, 2986591, 2964799, 2939372, 2910426, 2878521, 2844550, 2809083, 2772170, 2733910, 2694838, 2655593, 2616556, 2578057, 2540561, 2504497, 2470237, 2438456, 2410049, 2385399, 2364014, 2345222, 2328885, 2315032, 2303093, 2292060, 2281402, 2271308, 2261911, 2252630, 2242558, 2231258, 2218945, 2206005, 2192834, 2180287, 2169800, 2162462, 2157984, 2155192, 2153720, 2154711, 2159624, 2168944, 2182576, 2200932, 2224788, 2254292, 2289006, 2328999, 2375140, 2428079, 2487541, 2552837, 2623511, 2698996, 2777875, 2857686, 2935260, 3007164, 3070093]
61179C070093N0893L5693J7042m514k7081m8341o6775q1699r2734r9896j03847
61168B648834j05354j04598j01518r6598r0792q4843p9103p3727o8543o3076n7217
61157A723465n1598m6725m2153l7242l2377k8600k6114k4007k1427j8296j4945
61146A379981j1748r185p520o210m266j372J794M483O559Q171R327J0038J0437
61133A390489J0491R933Q703P115N454L659J541q12l014m676n829o994q654j0504
61119A396902j1683j1964j2205j3165j4342j4748j4427j4313j4771j5162j5023
61108A245099j4791j5024j5647j6335j7186j8504k0210k1813k2854k3224k3158
61097A036353k2987k2738k1984k0397j8387j6861j6271j6265j6340j6471j6829
$$ y = [3070093, 3120986, 3156679, 3173721, 3169207, 3142126, 3093785, 3027010, 2945311, 2852577, 2752681, 2648834, 2543480, 2438882, 2337364, 2240766, 2149974, 2065131, 1986028, 1912301, 1843758, 1780682, 1723465, 1671867, 1625142, 1582989, 1545747, 1513370, 1484770, 1458656, 1434649, 1413222, 1394926, 1379981, 1368233, 1359048, 1351528, 1345318, 1341052, 1339680, 1341474, 1345957, 1352516, 1360687, 1370014, 1380052, 1390489, 1400980, 1410913, 1419616, 1426731, 1432185, 1435844, 1437385, 1436573, 1433559, 1428883, 1423054, 1416060, 1407406, 1396902, 1385219, 1373255, 1361050, 1347885, 1333543, 1318795, 1304368, 1290055, 1275284, 1260122, 1245099, 1230308, 1215284, 1199637, 1183302, 1166116, 1147612, 1127402, 1105589, 1082735, 1059511, 1036353, 1013366, 990628, 968644, 948247, 929860, 912999, 896728, 880463, 864123, 847652, 830823]
61086H30823j7225j7212j6698j6162j6045j6064j5384j3658j1540r942q927p915
61074F64051o781o001n613m846l180j091P38K227L413L856L391K936L558M984
61060F61642N964N929N446N138N097N394O240P385Q127Q205Q145Q461R031R466
61046G59670R639R577R198Q425P315N993M682L765L460L476L273K654J807R29
61032H33863J91j02J30K77m83k178m020n434o543p561q273q424q254q260q568
61017G66361q824q566p682o492n405m536l729l008k657k814l280l901m724n504
61003F95239n592m729l597l028k958k704k063j565j681k239k599k190j000K54
60989F59548P63O01P22J657K810L412L584L903M421M878N355O053O752P232P838
$$ y = [830823, 813598, 796386, 779688, 763526, 747481, 731417, 716033, 702375, 690835, 680893, 671966, 664051, 657270, 651269, 645656, 640810, 637630, 636539, 637277, 639504, 642917, 646773, 650164, 653100, 656658, 661642, 667606, 673535, 678981, 684119, 689216, 694610, 700850, 708235, 716362, 724567, 732712, 741173, 750204, 759670, 769309, 778886, 788084, 796509, 803824, 809817, 814499, 818264, 821724, 825200, 828473, 831127, 832934, 833863, 834054, 833952, 834082, 834359, 833876, 831698, 827678, 822244, 815701, 808140, 799867, 791443, 783189, 774929, 766361, 757537, 748971, 741289, 734797, 729392, 724856, 721127, 718119, 715462, 712648, 709368, 705467, 700743, 695239, 689647, 684918, 681321, 678293, 675335, 672631, 670568, 669003, 667322, 665083, 662484, 660294, 659294, 659548, 660311, 660912, 661634, 663291, 666101, 669513, 673097, 677000, 681421, 686299, 691654, 697707, 704459, 711691, 719529]
60974G19529Q911J0029J0569J0773J1447J2823J4438J5872J6975J7634J8015J8661
60962H85676J9743K0568K0595K0382K0802K1817K2981K4505K6725K9051L0704
60951A143549L2170L4633L8186M1855M5235M8815N2823N6948O1186O5804P0559
60940A691763P5094P9912Q5706R1923R7387J02287J08205J16249J26420J38637
60930B713583J52839J68183J83617J99238K15839K33801K54237K80436L15528
60921D717301L59101M08983M66041N33660O12517P00632P99505R14446J045984
60912A0558170J187449J335411J491851J639204J714016J628892J344812R24875
60904B1824680N03819J96388L5984n082L8444J35268K22943K00851r066l90055
$$ y = [719529, 728440, 738469, 749038, 759811, 771258, 784081, 798519, 814391, 831366, 849000, 867015, 885676, 905419, 925987, 946582, 966964, 987766, 1009583, 1032564, 1057069, 1083794, 1112845, 1143549, 1175719, 1210352, 1248538, 1290393, 1335628, 1384443, 1437266, 1494214, 1555400, 1621204, 1691763, 1766857, 1846769, 1932475, 2024398, 2121785, 2224072, 2332277, 2448526, 2574946, 2713583, 2866422, 3034605, 3218222, 3417460, 3633299, 3867100, 4121337, 4401773, 4717301, 5076402, 5485385, 5951426, 6485086, 7097603, 7798235, 8597740, 9512186, 10558170, 11745619, 13081030, 14572881, 16212085, 17926101, 19554993, 20899805, 21824680, 22328499, 22524887, 22560871, 22555789, 22594233, 22729501, 22952444, 23153295, 23144229, 22754174]
60894B2754174q31112j204676j442664j547521j554242j497114j402443j290452
60886A1983950j173388j055578r39390q29179p28706o38353n57132m85398m24081
60877E152745l72935l30820k96462k68160k44016k23161k05664j90835j76971
60868B843721j63209j50276j38823j28341j18392j09694j03046r8015r3410q8456
60858A652059q2999p7304p2014o7739o4191o0351n5786n1183m7264m3877m0549
60847I88802l7282l4314l1582k8895k6355k4201k2481k1034j9713j8517j7623
60836G06805j7181j6865j5982j4389j2845j2005j1447j0374q853p515o393n056
60824E67900l728l138l250l138k400j703j689k125k477k508k039q66P38K107L057
$$ y = [22754174, 21923062, 20718386, 19275722, 17728201, 16173959, 14676845, 13274402, 11983950, 10810562, 9754984, 8815594, 7986415, 7257709, 6619356, 6062224, 5576826, 5152745, 4779810, 4448990, 4152528, 3884368, 3640352, 3417191, 3211527, 3020692, 2843721, 2680512, 2530236, 2391413, 2263072, 2144680, 2034986, 1931940, 1833925, 1740515, 1652059, 1569060, 1491756, 1419742, 1352003, 1287812, 1227461, 1171675, 1120492, 1073228, 1029351, 988802, 951520, 917206, 885624, 856729, 830374, 806173, 783692, 762658, 742945, 724428, 706805, 689624, 672759, 656777, 642388, 629543, 617538, 606091, 595717, 586864, 579349, 572956, 567900, 564172, 561034, 557784, 554646, 552246, 550543, 548854, 546729, 544252, 541744, 539705, 538839, 539577, 541684, 544741]
60809E44741L971M756M617L420K413K767L924M368L670K865K683K359P03k124
60795E85133m510n121m202l024k363k073j891j976k410k716k336j231K33J638
60781E53151K517K511J967J811K331K643K015J105J062J847K485K738L290M373
60767E85846N328N808O341P302Q200Q503Q441Q456Q449Q156P808P809Q049Q046
60753F92542P653P115O533N660M379L046K154J735J262L00r21j769k062k344l199
60738G22084m585o016p137p928q583r390j0433j1276j1280j0363r101p949o810
60725F11233n617m696m220l823l203k563j990j024O22K396L671M538N311N824
60711F06459O010O534P918R589J0696J1319J1852J1735J0154P715N991N416M954
$$ y = [544741, 548712, 553468, 558085, 561505, 563918, 566685, 570609, 574977, 578647, 581512, 584195, 586554, 587257, 585133, 580623, 575502, 571300, 568276, 565913, 563840, 561949, 559973, 557563, 554847, 552511, 551280, 551513, 553151, 555668, 558179, 560146, 561957, 564288, 566931, 568946, 570051, 571113, 572960, 575445, 578183, 581473, 585846, 591174, 596982, 603323, 610625, 618825, 627328, 635769, 644225, 652674, 660830, 668638, 676447, 684496, 692542, 700195, 707310, 713843, 719503, 723882, 726928, 729082, 730817, 732079, 732379, 731458, 729689, 727627, 725283, 722084, 717499, 711483, 704346, 696418, 687835, 678445, 668012, 656736, 645456, 635093, 625992, 618043, 611233, 605616, 600920, 596700, 592877, 589674, 587111, 585121, 584097, 584719, 587115, 590786, 595324, 600635, 606459, 612469, 619003, 626921, 636510, 647206, 658525, 670377, 682112, 692266, 699981, 705972, 711388, 716342]
60698G16342L984L204L281L699L562K751J862J555K222L776N525O751P434P926
60684G73874Q193P988P521P102O316M612K597J573J717J866J276M81R7j52p68
60669H24293j803l175m754n832n554m252l385l688m397m735n016n601n872n243
60655G60986m346m254n010n822o176o011n299m238l458l364l586l650l786m436
60641F97550n369n986o170o213o191n984n588m950l727j862k7R90J185J124J174
60626F49956J387J844K460K743K309J483R19P62O52K49p05k533n185p782r227
60611F39332r308q749q313q242q512q971r162q527p035n316l996l168k624k354
60597E45055k551l121l492l059j826m47M43P49O92L29l84j203j656j513r30k19
$$ y = [716342, 720326, 723530, 726811, 730510, 734072, 736823, 738685, 740240, 742462, 746238, 751763, 758514, 765948, 773874, 782067, 790055, 797576, 804678, 810994, 815606, 818203, 819776, 821493, 823359, 824635, 825116, 825213, 825061, 824293, 822490, 819315, 814561, 808729, 803175, 798923, 795538, 791850, 787453, 782718, 777702, 772101, 766229, 760986, 756640, 752386, 747376, 741554, 735378, 729367, 724068, 719830, 716372, 713008, 709422, 705772, 701986, 697550, 692181, 686195, 680025, 673812, 667621, 661637, 656049, 651099, 647372, 645510, 645483, 646473, 647658, 648782, 649956, 651343, 653187, 655647, 658390, 660699, 662182, 663101, 663863, 664515, 664764, 664059, 661526, 656341, 648559, 639332, 630024, 621275, 612962, 604720, 596208, 587237, 578075, 569548, 562513, 557197, 553201, 550033, 547409, 545055, 542504, 539383, 535891, 532832, 531006, 530559, 531002, 531751, 532443, 532772, 532388, 531185, 529529, 528016, 527086, 526867]
60581E26867K09o1r70j733j621r07m39l56lQ75J670J952K137K736L590M301M897
60564E43144N566O220O818P668Q991J0493J1826J3011J4067J4677J4739J4868
60552F72088J5729J7150J8393J9058J9250J9032J8349J7294J6019J4333J1809
60541H58504Q314M205O8l563o401q574j0420j1982j2903j3065j2933j2908j2699
60528G65643j1829j0561r700r448r001p575n455l742l087l108l107l060l418m046
60514F78506m073l136k143k123k698k581j478m31j43N9J074K661L912M518M876
60499F76800N258N619O103P121Q776J0562J1829J2338J2390J2441J2713J3170
60487G95120J3858J4965J6390J7558J8095J8506J9587K1401K3361K5278K7446
$$ y = [526867, 527076, 527015, 526045, 524312, 522691, 521784, 521345, 520989, 520986, 521861, 523531, 525483, 527620, 530356, 533946, 538247, 543144, 548710, 554930, 561748, 569416, 578407, 588900, 600726, 613737, 627804, 642481, 657220, 672088, 687817, 704967, 723360, 742418, 761668, 780700, 799049, 816343, 832362, 846695, 858504, 866818, 871023, 871091, 867528, 861127, 852553, 842133, 830151, 817248, 804183, 791250, 778342, 765643, 753814, 743253, 733553, 724105, 715104, 707529, 702074, 698332, 695245, 692137, 689030, 685970, 682552, 678506, 674433, 671297, 669154, 667031, 664333, 661752, 660274, 659843, 659700, 659759, 660833, 663494, 667406, 671924, 676800, 682058, 687677, 693780, 700901, 709677, 720239, 732068, 744406, 756796, 769237, 781950, 795120, 808978, 823943, 840333, 857891, 875986, 894492, 914079, 935480, 958841, 984119, 1011565]
60476A011565K9610L0589K9330K5763K0374J3550N799j830q213j2869j6031j8161
60464A109476j9487j9812j8692j6052j2522q910n451j988J387M516P694J1166
60452A031325J4313J6304J7515J9139K1355K3110K4095K5612K8827L3281L7977
60441A292853M2982M8977N6067O3960P2882Q3305R5127J07783J20892J34328J48039
60430B267195J62255J77206J92207K05753K16986K25994K31591K29646K15089
60421D123922J85552J42350Q8552K7433l7133j00083j55848j99791k29489k45305
60411C600160k49702k45596k35297k20835k04343j87355j70264j53204j37007
60402A796557j22620j09993r8454q7847p8530p0453o3130n6485n0940m6656m3260
$$ y = [1011565, 1041175, 1071764, 1101094, 1126857, 1147231, 1160781, 1166580, 1164750, 1156537, 1143668, 1127637, 1109476, 1089989, 1070177, 1051485, 1035433, 1022911, 1014001, 1008550, 1006562, 1007949, 1012465, 1020159, 1031325, 1045638, 1061942, 1079457, 1098596, 1119951, 1143061, 1167156, 1192768, 1221595, 1254876, 1292853, 1335835, 1384812, 1440879, 1504839, 1577721, 1661026, 1756153, 1863936, 1984828, 2119156, 2267195, 2429450, 2606656, 2798863, 3004616, 3221602, 3447596, 3679187, 3908833, 4123922, 4309474, 4451824, 4540376, 4567809, 4530676, 4430593, 4274745, 4074954, 3845465, 3600160, 3350458, 3104862, 2869565, 2648730, 2444387, 2257032, 2086768, 1933564, 1796557, 1673937, 1563944, 1465490, 1377643, 1299113, 1228660, 1165530, 1109045, 1058105, 1011449, 968189]
60391I68189m0279l7421l4531l1654k9035k6735k4476k2182k0230j8784j7424
60380F65438j5908j4681j4057j3474j2328j1008j0262r998r598q993q521q058
60368E28552p246o315n777n491m888l972l258k889k624k494k614k558j819p34
60354D75873j4M67J421K791L723L854L658L458L070K634K712L261L430K812K070
60339E15220J899K072K042J921K299L299M250M304L385K474K699L895M544L622
60325E57925K027J394J947K474K181J485R40M76m7m61q30j571k684l538l685l310
60309E54723k667j697n07L99Q07J189K047L260M331M944M964M365L423K715K626
60294E84922L053L698M418N119N630N868O001O249O493O187M856K845J366J318
$$ y = [968189, 927910, 890489, 855958, 824304, 795269, 768534, 744058, 721876, 701646, 682862, 665438, 649530, 634849, 620792, 607318, 594990, 583982, 573720, 563722, 554124, 545131, 536610, 528552, 521306, 514991, 509214, 503723, 498835, 494863, 491605, 488716, 486092, 483598, 480984, 478426, 476607, 475873, 475859, 476326, 477747, 480538, 484261, 488115, 491773, 495231, 498301, 500935, 503647, 506908, 510338, 513150, 515220, 517119, 519191, 521233, 523154, 525453, 528752, 533002, 537306, 540691, 543165, 545864, 549759, 554303, 557925, 559952, 561346, 563293, 565767, 567948, 569433, 570373, 570849, 570802, 570341, 569511, 567940, 565256, 561718, 558033, 554723, 552056, 550359, 549852, 550251, 551058, 552247, 554294, 557554, 561885, 566829, 571793, 576158, 579581, 582296, 584922, 587975, 591673, 596091, 601210, 606840, 612708, 618709, 624958, 631451, 637638, 642494, 645339, 646705, 648023]
60280F48023K167K584K136J528J164O03j96l51M30J058P98O52J689L023L119K282
60264F70709J989K300J905O25j85R5M93K60j17k47o29j491k229k536k862l166
60248F64914k623j242m14r65j881j901j274r81j122j162r66p13l22K15N42O05
60232F50710R05J501J605Q59K14O18J692K529L063L642L986L694L306L680M671
60217F86675N441N781O103O335O032N520N867P436R284J0319J0492J0591J1284
60204G87160J2648J4314J5864J7139J8303J9642K1368K3517K5832K7899K9780
60193A013466L2243L5767L9499M2157M4031M6947N1816N7331O1819O5371O9184
60182A559631P3537P7668Q1165Q4210Q6668Q7962Q7981Q7120Q5320Q1888P6480
$$ y = [648023, 650190, 652774, 654910, 656438, 657602, 658205, 658009, 657658, 658088, 659146, 659944, 660596, 662285, 665308, 668427, 670709, 672698, 674998, 676903, 677528, 677343, 677438, 677931, 678191, 678074, 677827, 677198, 675707, 673478, 670942, 668080, 664914, 662291, 661049, 660635, 659670, 657789, 655888, 654614, 653633, 652511, 651349, 650383, 649670, 649348, 649563, 650105, 650710, 651615, 653116, 654721, 655580, 655794, 656412, 658104, 660633, 663696, 667338, 671324, 675018, 678324, 682004, 686675, 692116, 697897, 704000, 710335, 716367, 721887, 727754, 735190, 744474, 754793, 765285, 775876, 787160, 799808, 814122, 829986, 847125, 865428, 885070, 906438, 929955, 955787, 983686, 1013466, 1045709, 1081476, 1120975, 1163132, 1207163, 1254110, 1305926, 1363257, 1425076, 1490447, 1559631, 1633168, 1710836, 1792001, 1876211, 1962879, 2050841, 2138822, 2225942, 2311262, 2393150, 2469630]
60171B469630O9581O1799N3269M4063L4631K5500J6763Q227l8p493j3480j7697
60159B744755k0284k1462k1220j9486j6405j2156o691p9P006J3804K0475K7827
60147B696084L5868M3481M9961N6082O2881P0037P6271Q0880Q4000Q5518Q4676
60136C425739Q0956P4769O7015N8239M8344L6966K4168J0836j831j3334k4121
60125C787746l4650m4527n2862n9081o3027o4567o3602o0325n5101m8173l9779
60114C202052l0368k0467j0442n69Q908J8006K6964L5710M3612M9936N4334N6712
60102C434388N7056N5643N2996M9250M3854L6390K7483J8541J0728M389p23m856
60090C785139p806q910p621m105J140Q069J6930K7333L8349M9778O2460P6940
$$ y = [2469630, 2539211, 2601010, 2654279, 2698342, 2732973, 2758473, 2775236, 2783463, 2783425, 2775932, 2762452, 2744755, 2724471, 2703009, 2681789, 2662303, 2645898, 2633742, 2627051, 2626972, 2633978, 2647782, 2668257, 2696084, 2731952, 2775433, 2825394, 2881476, 2944357, 3014394, 3090665, 3171545, 3255545, 3341063, 3425739, 3506695, 3581464, 3648479, 3706718, 3755062, 3792028, 3816196, 3827032, 3825201, 3811867, 3787746, 3753096, 3708569, 3655707, 3596626, 3533599, 3469032, 3405430, 3345105, 3290004, 3241831, 3202052, 3171684, 3151217, 3140775, 3140206, 3149114, 3167120, 3194084, 3229794, 3273406, 3323342, 3377676, 3434388, 3491444, 3547087, 3600083, 3649333, 3693187, 3729577, 3757060, 3775601, 3786329, 3790718, 3789995, 3785139, 3777333, 3768423, 3760802, 3756697, 3757837, 3765906, 3782836, 3810169, 3848518, 3898296, 3960756, 4037696]
60078D037696R2613J08731J25429J43056J61150J78953J96444K13922K30953K46565
60068E735512K60237K71855K80862K86307K87669K84819K77255K64194K45612
60059H194322K22527J95998J66313J33363R7356N9008J9287k0848o0542r8966
60049H907818j35037j67358j94605k15852k30557k38578k40383k36813k28390
60040G020245k15227j97861j77715j56200j33761j10277q6097o2154l9313j8115
60030E823525J027J7898L2529M4746N3801N8805N9377N5545M7498L5991K2614
60019F253356Q959m465j8026l1879m5592n8659p0816q1903r1818j00580j08061
60008E650516j13888j17975j20812j22739j23241j21576j17825j12592j05888
$$ y = [4037696, 4130309, 4239040, 4364469, 4507525, 4668675, 4847628, 5044072, 5257994, 5488947, 5735512, 5995749, 6267604, 6548466, 6834773, 7122442, 7407261, 7684516, 7948710, 8194322, 8416849, 8612847, 8779160, 8912523, 9009879, 9068887, 9088174, 9067326, 9006784, 8907818, 8772781, 8605423, 8410818, 8194966, 7964409, 7725831, 7485448, 7248635, 7020245, 6805018, 6607157, 6429442, 6273242, 6139481, 6029204, 5943107, 5880953, 5841640, 5823525, 5824552, 5842450, 5874979, 5919725, 5973526, 6032331, 6091708, 6147253, 6194751, 6230742, 6253356, 6262315, 6257850, 6239824, 6207945, 6162353, 6103694, 6032878, 5950975, 5859157, 5758577, 5650516, 5536628, 5418653, 5297841, 5175102, 5051861, 4930285, 4812460, 4699868, 4593980]
59999D593980r7202q6666p5316o3945n2376m0159k7427j4660k007J0750K3672
59988D168644L6402M8351N8975O7936P5085Q0332Q3590Q4667Q3039P7847O8568
59977D933436N5858M1313K6223J0842n011k1214l7382n3071o7524p9714q9159
59966D714597r6247j01315j03848j03203r9635r4021q6901p8443o8968n8767m7678
59955C775571l5568k2998j0622J857J5222K9369M3222N6101O8329Q0299R1744
59944D092526J02135J11163J18464J23422J25545J24682J20619J12921J01536
59935E133013Q7201P1002N3704L5692J7261j317j9850l8050n5302p0748q3659
59924E128947r3680j00643j04226j03973r9846r2605q3343p2772o1230m9155l6964
$$ y = [4593980, 4496778, 4410112, 4334796, 4270851, 4218475, 4178316, 4150889, 4136229, 4134222, 4144972, 4168644, 4205046, 4253397, 4312372, 4380308, 4455393, 4535725, 4619315, 4703982, 4787021, 4864868, 4933436, 4989294, 5030607, 5056830, 5067672, 5062661, 5041447, 5004065, 4950994, 4883470, 4803756, 4714597, 4618350, 4517035, 4413187, 4309984, 4210349, 4116328, 4029427, 3950984, 3882016, 3823249, 3775571, 3740003, 3717005, 3706383, 3708240, 3723462, 3752831, 3796053, 3852154, 3920483, 4000782, 4092526, 4194661, 4305824, 4424288, 4547710, 4673255, 4797937, 4918556, 5031477, 5133013, 5220214, 5291216, 5344920, 5380612, 5397873, 5396556, 5376706, 5338656, 5283354, 5212606, 5128947, 5035267, 4934624, 4830398, 4726425, 4626579, 4533974, 4450631, 4377859, 4316629, 4267474, 4230510]
59913D230510k4458j1087K987J6740K9398M1070N1952O1664O9869P6861Q2886
59902D628392Q7403Q9635Q9407Q6953Q2403P6156O9230O2527N6090M9702M3739
59891E421637L8820L5127L2793L2512L4858L9536M6118N5146O7497Q2967J00485
59880E987496J19483J40010J61714J83737K05615K27234K47911K66340K81379
59871G820919K91946K96192K91843K77516K52926K17932J72617J18569N9007k663
59861I796804o3697j21251j72118k13958k46159k69053k82971k88573k87238k80307
59851G571479k68254k51253k30306k07234j83550j59715j35509j10841q6079o1649
59841E877089l7624j3960Q858K9996M9188O6878Q2971R6114J04827J08770J08115
$$ y = [4230510, 4206052, 4194965, 4197952, 4214692, 4244090, 4285160, 4337112, 4398776, 4468645, 4545506, 4628392, 4715795, 4805430, 4894837, 4981790, 5064193, 5140349, 5209579, 5272106, 5328196, 5377898, 5421637, 5460457, 5495584, 5528377, 5560889, 5595747, 5635283, 5681401, 5736547, 5804044, 5887011, 5987496, 6106979, 6246989, 6408703, 6592440, 6798055, 7025289, 7273200, 7539540, 7820919, 8112865, 8409057, 8700900, 8978416, 9231342, 9449274, 9621891, 9740460, 9799467, 9796804, 9733107, 9611856, 9439738, 9225780, 8979621, 8710568, 8427597, 8139024, 7851786, 7571479, 7303225, 7051972, 6821666, 6614432, 6430882, 6271167, 6135658, 6024817, 5938738, 5877089, 5839465, 5825505, 5834363, 5864359, 5913547, 5980425, 6063396, 6159510, 6264337, 6373107, 6481222]
59830F481222J02176Q9707P0441M5417J5953j6826n1442q5968j18615j47932j72655
59819F211478j92149k06727k16787k21927k21781k17364k10430k01720j91050
59810D331543j78889j66444j54133j41421j28401j16071j04683r3304q1615p0816
59800C095766o1894n4259m6994m0463l5623l2586l0781k9935k9885k9952k9374
59789B674020k8108k6538k4737k2588k0284j8153j6254j4532j3150j2391j2596
59778B464689j4259j7618k1953k5957k9040l1543l3454l3955l2649l0309k7721
59767B166231k4633k0601j6081j1774p506k677K658P903J2726J6991K0357K2730
59755B166324K4791K7363L0501L3875L7583M1810M5954M8883M9947M9144M6636
$$ y = [6481222, 6583398, 6673105, 6743546, 6788963, 6804916, 6788090, 6736648, 6650680, 6532065, 6384133, 6211478, 6019329, 5812602, 5595815, 5373888, 5152107, 4934743, 4724313, 4522593, 4331543, 4152654, 3986210, 3832077, 3690656, 3562255, 3446184, 3341501, 3248197, 3166582, 3095766, 3033872, 2979613, 2932619, 2892156, 2856533, 2823947, 2793166, 2763231, 2733346, 2703394, 2674020, 2645912, 2619374, 2594637, 2572049, 2551765, 2533612, 2517358, 2502826, 2489676, 2477285, 2464689, 2450430, 2432812, 2410859, 2384902, 2355862, 2324319, 2290865, 2256910, 2224261, 2193952, 2166231, 2141598, 2120997, 2104916, 2093142, 2085636, 2082959, 2085617, 2093520, 2106246, 2123237, 2143594, 2166324, 2191115, 2218478, 2248979, 2282854, 2320437, 2362247, 2408201, 2457084, 2507031, 2556175, 2602811]
59744B602811M2773L8369L4084K9656K4550J9225J4971J2378J0807R552Q889R535
59732B857600J1666J4874J8955K4212L1012L9221M8305N7930O8322P9856R2528
59721C344481J06117J20778J37005J54871J73811J93223K12779K31885K49099
59712D924049K62235K68505K64332K45821K10493J59185R6500K9561l4073q8510
59702F338098j30758j60301j77725j84066j81176j71746j58255j42163j24282
59693D907626j05416q6245o7113m8362l0534j3824K213J7950L3108M7361O1148
59682D717912P5316R0189J05440J20744J36105J51724J67884J84899K02880K21754
59672F174847K41644K62931K85760L09813L34772L60602L87131M13872M40582
$$ y = [2602811, 2645584, 2683953, 2718037, 2747693, 2772243, 2791468, 2806439, 2818817, 2829624, 2839176, 2848065, 2857600, 2869266, 2884140, 2903095, 2927307, 2958319, 2997540, 3045845, 3103775, 3172097, 3251953, 3344481, 3450598, 3571376, 3708381, 3863252, 4037063, 4230286, 4443065, 4674950, 4924049, 5186284, 5454789, 5719121, 5964942, 6175435, 6334620, 6431120, 6460681, 6426608, 6338098, 6207340, 6047039, 5869314, 5685248, 5504072, 5332326, 5174071, 5031908, 4907626, 4802210, 4715965, 4648852, 4600490, 4569956, 4556132, 4558345, 4576295, 4609403, 4656764, 4717912, 4793228, 4883417, 4988857, 5109601, 5245706, 5397430, 5565314, 5750213, 5953093, 6174847, 6416491, 6679422, 6965182, 7274995, 7609767, 7970369, 8357500, 8771372, 9211954]
59663I211954M67356M93552N17101N35567N47669N53213N51935N43370N27942
59654A3949659N07604M85194M63455M44655M30633M22727M21569M26809M36928
59645A7989233M49528M62019M72018M77142M74702M61952M36693L97886L46129
59636B1967302K83798K14506J42254P1020M780n2958r9933j35160j58060j68056
59626B2069493j65178j50404j25112r0541m8096M96N3855J11543J73479K39002
59616B2068537L06756L75153M42505N06816N65571O15506O52329O70974O66509
59607B6870656O34859N72965M79169L54254K02423L1396j48355l25103m88005
59598B8184259o28821p42174q25000q76724q99774q98734q78422q43298p98324
$$ y = [9211954, 9679310, 10172862, 10689963, 11225530, 11773199, 12326412, 12878347, 13421717, 13949659, 14457263, 14942457, 15405912, 15850567, 16281200, 16703927, 17125496, 17552305, 17989233, 18438761, 18900780, 19372798, 19849940, 20324642, 20786594, 21223287, 21621173, 21967302, 22251100, 22465606, 22607860, 22678880, 22683660, 22630702, 22530769, 22395609, 22237549, 22069493, 21904315, 21753911, 21628799, 21538258, 21490162, 21490658, 21544513, 21656056, 21829535, 22068537, 22375293, 22750446, 23192951, 23699767, 24265338, 24880844, 25533173, 26204147, 26870656, 27505515, 28078480, 28557649, 28911903, 29114326, 29145722, 28997367, 28672264, 28184259, 27555438, 26813264, 25988264, 25111540, 24211766, 23313032, 22434610, 21591312, 20792988]
59589B0792988p49020p00134o55380o18983n96002n89708n98935o18705o42718
59580A5023403o64747o79154o82276o73846o56147o31610o01675n67512n30759
59571I335677m93167m56011m19945l85169l51825l20484k92008k66605k43492
59562F106971k21801k01462j82769j65623j49805j35492j22849j11438j00764
59553D714968r1158q3409p7799p4024p1891p1363p2079p3457p5178p7146p9105
59542C868359q0729q1947q2725q2742q1669p9532p6441p2375o7593o2787n8264
59531C041555n3392m7533m1089l4999k9506k4215j8969j3875q659k960K779P514
59519B776651J0890J3629J6511J9510K2144K4191K5815K7230K8515K9689L0995
$$ y = [20792988, 20043968, 19343834, 18688454, 18069471, 17473469, 16883761, 16284826, 15666121, 15023403, 14358656, 13679502, 12997226, 12323380, 11667233, 11035623, 10433948, 9866436, 9335677, 8842510, 8386499, 7966554, 7581385, 7229560, 6909076, 6617068, 6350463, 6106971, 5885170, 5683708, 5500939, 5335316, 5185511, 5050019, 4927170, 4815732, 4714968, 4623810, 4540401, 4462602, 4388578, 4316687, 4245324, 4173245, 4099788, 4024610, 3947464, 3868359, 3787630, 3705683, 3622958, 3540216, 3458547, 3379015, 3302574, 3230199, 3162606, 3099819, 3041555, 2988163, 2940630, 2899541, 2864542, 2835036, 2810821, 2791852, 2777977, 2769318, 2766358, 2769137, 2776651, 2787541, 2801170, 2817681, 2837191, 2859335, 2883526, 2909341, 2936571, 2965086, 2994775, 3025770]
59508C025770L3005L6191M0341M4756M9161N3976N9569O5736P2231P9173Q6636
59497C646545R4401J02558J11750J22250J33404J44573J56012J68138J80499J92168
59487E052298K02771K12327K20470K26597K30517K32180K31092K26732K19333
59478G054317K09653J98192J85202J70988J55568J38508J19968J01531Q5050P0988
59468H489965N8782M8589M1544L8379L8721M1903M7528N5048O3433P1525P8168
59457I073585Q1949Q1252P4720O1418M0824J3203k0112n7299r6767j37080j76572
59446H939121k13645k47081k75501k97030l10332l15756l14782l08594k97839
59437F358561k83402k66436k47720k27783k07535j88063j69737j52202j35169
$$ y = [3025770, 3058775, 3094966, 3135307, 3180063, 3229224, 3283200, 3342769, 3408505, 3480736, 3559909, 3646545, 3740946, 3843504, 3955254, 4077504, 4210908, 4355481, 4511493, 4679631, 4860130, 5052298, 5255069, 5467396, 5687866, 5914463, 6144980, 6377160, 6608252, 6834984, 7054317, 7263970, 7462162, 7647364, 7818352, 7973920, 8112428, 8232396, 8333927, 8418977, 8489965, 8548747, 8597336, 8638880, 8677259, 8715980, 8757883, 8805411, 8860459, 8923892, 8995417, 9073585, 9155534, 9236786, 9311506, 9372924, 9413748, 9426951, 9406839, 9349540, 9252773, 9115693, 8939121, 8725476, 8478395, 8202894, 7905864, 7595532, 7279776, 6964994, 6656400, 6358561, 6075159, 5808723, 5561003, 5333220, 5125685, 4937622, 4767885, 4615683, 4480514]
59428D480514j18656j02676q7276p2745n9235m6340l3585k0960q519M111J7177
59417C951810L0257M3012N5944O9533Q3177R5968J08102J20401J32822J44558
59407D835584J55292J65004J72675J76461J75354J69549J59123J43430J22058
59398F274530R5459O4441K9919o665m3432p8819j11696j40840j65133j84218j98233
59387E535313k07052k10607k09822k06218k00634j93152j84224j74734j64978
59378C783892j54569j43535j32612j22305j12477j02948r3717q4596p5500o7048
59368B694585o0017n4186m8550m2618l6655l0748k4626j8452j2836p984l595N22
59356B354840M464Q505J2597J6026J8747K2272K7698L3216L5505L3706L0289K8009
$$ y = [4480514, 4361858, 4259182, 4171906, 4099161, 4039926, 3993586, 3960001, 3939041, 3930522, 3934633, 3951810, 3982067, 4025079, 4081023, 4150556, 4233733, 4329701, 4437803, 4558204, 4691026, 4835584, 4990876, 5155880, 5328555, 5505016, 5680370, 5849919, 6009042, 6152472, 6274530, 6369989, 6434430, 6464349, 6457684, 6414252, 6335433, 6223737, 6082897, 5917764, 5733546, 5535313, 5328261, 5117654, 4907832, 4701614, 4500980, 4307828, 4123604, 3948870, 3783892, 3629323, 3485788, 3353176, 3230871, 3118394, 3015446, 2921729, 2837133, 2761633, 2694585, 2634568, 2580382, 2531832, 2489214, 2452559, 2421811, 2397185, 2378733, 2365897, 2357913, 2354318, 2354840, 2359304, 2367809, 2380406, 2396432, 2415179, 2437451, 2465149, 2498365, 2533870, 2567576, 2597865, 2625874]
59344B625874K7817K9892L4461M0750M7010N2837N9945O9495P9827Q8086R3255
59333C249249R6586J00020J05189J13212J24294J37819J53312J70873J90283K10634
59323D651471K31479K53518K77485L02968L28864L54291L78368L99768M17033
59314G595245M28968M34428M32455M22970M06698L84270L56233L24171K90649
59305A1076087K57572K25439J94497J65438J38343J12009Q5109N7205K8121k721
59295A2337099l5555o9706j04346j38941j72355k02477k27632k47674k63199k74628
59285A0600586k82750k89138k95071l00665l05782l10910l16312l21132l24311
59276G854515l25701l25355l22377l15588l04989k91765k77125k61780k46117
$$ y = [2625874, 2653691, 2683583, 2718044, 2758794, 2805804, 2858641, 2918586, 2988081, 3067908, 3155994, 3249249, 3345835, 3445855, 3551044, 3664256, 3788550, 3926369, 4079681, 4250554, 4440837, 4651471, 4882950, 5136468, 5413953, 5716921, 6045785, 6400076, 6778444, 7178212, 7595245, 8024213, 8458641, 8891096, 9314066, 9720764, 10105034, 10461267, 10785438, 11076087, 11333659, 11559098, 11753595, 11919033, 12057376, 12169385, 12254494, 12311699, 12339820, 12337099, 12301544, 12231838, 12127492, 11988551, 11816196, 11613719, 11386087, 11138413, 10875214, 10600586, 10317836, 10028698, 9733627, 9432962, 9127180, 8816270, 8499958, 8178826, 7854515, 7528814, 7203459, 6881082, 6565494, 6260505, 5968740, 5691615, 5429835, 5183718]
59267E183718k30268k14206j98172j82685j67842j53323j39289j26373j14449
59258C657111j02463r0106p8603o9045o0807n2509m3776l5185k7155j9770j3120
59247C064572o997p03O127J3119J9990K7064L4334M1013M6701N2199N8308O4771
59235C420498P1209P8162Q6136R4446J02120J09247J16321J23050J28931J34306
59225D464426J39502J43534J45017J44001J41613J38239J33294J26596J18724
59216E694946J10132J00967R1692Q2834P4104O4611N3898M1938K8301J2236o409
59205F349250k6918m8236o9074q7898j03536j15721j24468j29374j30194j27571
59195E386260j22382j14822j04974r3765q2236p0290n7289m3566l0167j7225l943
$$ y = [5183718, 4953450, 4739244, 4541072, 4358387, 4190545, 4037222, 3897933, 3771560, 3657111, 3554648, 3464542, 3385939, 3316894, 3256087, 3203578, 3159802, 3124617, 3097462, 3077692, 3064572, 3057575, 3056872, 3062999, 3076118, 3096108, 3123172, 3157506, 3198519, 3245220, 3297419, 3355727, 3420498, 3491707, 3569869, 3656005, 3750451, 3852571, 3961818, 4078139, 4201189, 4330120, 4464426, 4603928, 4747462, 4892479, 5036480, 5178093, 5316332, 5449626, 5576222, 5694946, 5805078, 5906045, 5997737, 6080571, 6154675, 6219286, 6273184, 6315122, 6343423, 6355659, 6349250, 6322332, 6274096, 6205022, 6117124, 6013588, 5897867, 5773399, 5644025, 5513831, 5386260, 5263878, 5149056, 5044082, 4950317, 4868081, 4797791, 4740502, 4696936, 4666769, 4649544, 4645601]
59184D645601R770K2879L4839M6547N9171P2691Q6063R8422J09661J20143J30121
59173E435908J39486J48061J56040J63815J71312J78029J83972J89913J96343
59164F962879K02771K08465K13224K16724K17739K14612K06064J91002J68232
59155H801712J37254R8835N4169M014n0553j07155j62731k14731k61073k99720
59145H000021l29359l50031l62180l65730l61053l50203l35826l19186l00482
59136D925971k80538k60773k41618k22523k03595j85939j70096j55397j41230
59127C064262j28021j16498j06779r8470r1104q4208p7498p1104o5250n9752n4348
59116B111230m9308m5054m1402l7818l4229l0888k7724k4501k1451j8843j6165
$$ y = [4645601, 4655371, 4678250, 4713089, 4759636, 4818807, 4891498, 4977561, 5075983, 5185644, 5305787, 5435908, 5575394, 5723455, 5879495, 6043310, 6214622, 6392651, 6576623, 6766536, 6962879, 7165650, 7374115, 7587339, 7804063, 8021802, 8236414, 8442478, 8633480, 8801712, 8938966, 9037801, 9091970, 9095984, 9045431, 8938276, 8775545, 8560814, 8299741, 8000021, 7670662, 7320631, 6958451, 6592721, 6231668, 5881465, 5545639, 5226453, 4925971, 4645433, 4384660, 4143042, 3920519, 3716924, 3530985, 3360889, 3205492, 3064262, 2936241, 2819743, 2712964, 2614494, 2523390, 2439182, 2361684, 2290580, 2225330, 2165578, 2111230, 2061922, 2016868, 1975466, 1937648, 1903419, 1872531, 1844807, 1820306, 1798855, 1780012, 1763847]
59105A763847j2633q474m788k120Q7K506N255Q229J1476J4952J8481K2017K5601
59092A844436K9128L2511L5897L9295M2313M4799M7359N0711N4776N8983O3116
59081B343324O7243P1256P5211P9734Q5291R1310R6729J01206J05154J08944J12735
59070C338137J16688J20601J23622J25004J24751J23024J19598J14645J09254
59061D415324J04145R8692R2302Q5997Q1186P7588P4072P1135P0675P3278P7455
59050E321849Q1798Q6336R1224R5448R7486R6217R0677P9865O3385M1826J6293
59039F162404j1857m0711o8098r2432j12891j28834j39789j45930j47847j45942
59029E128073j40658j33022j24093j14058j02728r0637p8702o7122n5653m4775
$$ y = [1763847, 1751214, 1742740, 1737952, 1735832, 1735919, 1738425, 1743680, 1751909, 1763385, 1778337, 1796818, 1818835, 1844436, 1873564, 1906075, 1941972, 1981267, 2023580, 2068379, 2115738, 2166449, 2221225, 2280208, 2343324, 2410567, 2481823, 2557034, 2636768, 2722059, 2813369, 2910098, 3011304, 3116458, 3225402, 3338137, 3454825, 3575426, 3699048, 3824052, 3948803, 4071827, 4191425, 4306070, 4415324, 4519469, 4618161, 4710463, 4796460, 4877646, 4955234, 5029306, 5100441, 5171116, 5244394, 5321849, 5403647, 5489983, 5581207, 5676655, 5774141, 5870358, 5961035, 6040900, 6104285, 6146111, 6162404, 6150547, 6109836, 6041738, 5949306, 5836415, 5707581, 5567792, 5421862, 5274015, 5128073, 4987415, 4854393, 4730300, 4616242, 4513514, 4422877, 4344175, 4277053, 4221400, 4176625]
59019D176625l5406k7662k1095j6060j3537j3627j5493j8809k4107l1449m0076
59008C919304m9543n9973p0883q0978q9482r6696j02882j07607j10583j12112
58998C038565j12376j11162j08638j05515j02127r8226r3878q9617q5449q0731
58988B050846p5386p0323o6197o2585n8773n4660n0483m6426m2752l9723l7075
58977A446463l4160l0782k7281k3812k0272j6969j4484j2754j1029q878o489m078
58965A235475j792j40L66j2o62j617l189m795n402n040m665m487l795k535j675
58950A196035j592j433n05P42J680K421L242M002M481M661M392L586K694K144
58936A226550J426j42j875k281j191J22J045K276M054N492O224P225R129J1107
$$ y = [4176625, 4141219, 4113557, 4092462, 4076402, 4062865, 4049238, 4033745, 4014936, 3990829, 3959380, 3919304, 3869761, 3809788, 3738905, 3657927, 3568445, 3471749, 3368867, 3261260, 3150677, 3038565, 2926189, 2815027, 2706389, 2600874, 2498747, 2400521, 2306643, 2217026, 2131577, 2050846, 1975460, 1905137, 1838940, 1776355, 1717582, 1662922, 1612439, 1566013, 1523261, 1483538, 1446463, 1412303, 1381521, 1354240, 1330428, 1310156, 1293187, 1278703, 1265949, 1254920, 1246042, 1239553, 1235475, 1233683, 1233543, 1233909, 1233897, 1233235, 1231618, 1228429, 1223634, 1218232, 1213192, 1208527, 1204040, 1200245, 1197710, 1196035, 1194443, 1193010, 1192505, 1193247, 1194927, 1197348, 1200590, 1204592, 1209073, 1213734, 1218126, 1221712, 1224406, 1226550, 1227976, 1227834, 1225959, 1223678, 1222487, 1222609, 1223654, 1225930, 1229984, 1235476, 1241700, 1248925, 1258054, 1269161]
58922A269161J2216J2681J3046J3241J3328J3983J5362J6526J6850J7048J7972
58911A431414J9319K0447K1508K2898K4291K5197K5837K6685K7716K8762L0052
58900A704126L1743L3505L5041L6472L7813L8867M0028M2310M6020N0152N3673
58889B149750N6720O0052O4065O8776P4106P9716Q5206R0823R7164J04066J10710
58878C041154J17143J24515J33375J42937J52594J62953J74597J86940J99240
58869D435448K11950K26140K42222K60035K79486L00481L22757L46305L71384
58860F996208L97697M24311M50687M76923N02555N25974N45452N59694N66897
58851A1446398N64290N49327N20607M77256M18546L44847K58184J61490N8273
$$ y = [1269161, 1281377, 1294058, 1307104, 1320345, 1333673, 1347656, 1363018, 1379544, 1396394, 1413442, 1431414, 1450733, 1471180, 1492688, 1515586, 1539877, 1565074, 1590911, 1617596, 1645312, 1674074, 1704126, 1735869, 1769374, 1804415, 1840887, 1878700, 1917567, 1957595, 1999905, 2045925, 2096077, 2149750, 2206470, 2266522, 2330587, 2399363, 2473469, 2553185, 2638391, 2729214, 2826378, 2930444, 3041154, 3158297, 3282812, 3416187, 3559124, 3711718, 3874671, 4049268, 4236208, 4435448, 4647398, 4873538, 5115760, 5375795, 5655281, 5955762, 6278519, 6624824, 6996208, 7393905, 7818216, 8268903, 8745826, 9248381, 9774355, 10319807, 10879501, 11446398, 12010688, 12560015, 13080622, 13557878, 13976424, 14321271, 14579455, 14740945, 14799218]
58842A4799218m6642j47535k39967l21805l91725m47997m89562n17177n32547
58833A1664261n37255n33156n22608n07246m87439m63809m38262m12619l87163
58824G374704l61538l36161l11861k88942k67542k48104k30610k14218j98567
58815D917161j84490j72472j61449j50209j39094j29175j20450j12063j03693
58806C644066r5547q7556p9677p2525o6615o1381n5778m9607m3452l7724l2435
58795B961769k7544k2830j7905j2775p892l224J970P938J3870J9134K4295L0188
58783B966994L6744M3442N0174N7066O4041P1155P8690Q6517R4149J01778J10326
58772C761076J20097J30412J40912J51972J63525J74911J86451J99601K14773
$$ y = [14799218, 14752576, 14605041, 14365074, 14043269, 13651544, 13203547, 12713985, 12196808, 11664261, 11127006, 10593850, 10071242, 9563996, 9076557, 8612748, 8174486, 7761867, 7374704, 7013166, 6677005, 6365144, 6076202, 5808660, 5560556, 5329946, 5115728, 4917161, 4732671, 4560199, 4398750, 4248541, 4109447, 3980272, 3859822, 3747759, 3644066, 3548519, 3460963, 3381286, 3308761, 3242146, 3180765, 3124987, 3075380, 3031928, 2994204, 2961769, 2934225, 2911395, 2893490, 2880715, 2872823, 2869599, 2871569, 2879507, 2893377, 2912511, 2936806, 2966994, 3003738, 3047180, 3097354, 3154420, 3218461, 3289616, 3368306, 3454823, 3548972, 3650750, 3761076, 3881173, 4011585, 4152497, 4304469, 4467994, 4642905, 4829356, 5028957, 5243730]
58763E243730K30620K46391K63417K83094L04853L27454L50904L75756M01617
58754H027836M27705M53695M78769N00829N17893N29080N33070N26944N07980
58745A2503801M75422M29081L67682K90641K00585J02399N02j01375j98798k87185
58735A3782755l63631m26964m76549n12353n35467n47211n48304n40064n25394
58726I306818n07109m85997m61983m36203m10409l85135l60141l35984l13491
58717E610366k92287k71541k51679k33803k17982k03574j90679j79719j70094
58708C599008j60726j51485j42771j34314j25810j17946j11277j04873r7669r0395
58698B361742q4424p9415p3935o7921o2586n8302n4316n0314m6568m2869l8930
$$ y = [5243730, 5474350, 5720741, 5984158, 6267252, 6572105, 6899559, 7250463, 7626219, 8027836, 8455541, 8909236, 9388005, 9888834, 10406727, 10935807, 11468877, 11995821, 12503801, 12979223, 13408304, 13775986, 14066627, 14267212, 14369611, 14370113, 14268738, 14069940, 13782755, 13419124, 12992160, 12515611, 12003258, 11467791, 10920580, 10372276, 9832212, 9306818, 8799709, 8313712, 7851729, 7415526, 7005117, 6619982, 6259841, 5923857, 5610366, 5318079, 5046538, 4794859, 4561056, 4343074, 4139500, 3948821, 3769102, 3599008, 3438282, 3286797, 3144026, 3009712, 2883902, 2765956, 2654679, 2549806, 2452137, 2361742, 2277318, 2197903, 2123968, 2056047, 1993461, 1935159, 1880843, 1830529, 1783961, 1741092, 1702162]
58687A702162l5488l3427l2106l0115k7398k5068k3573k2459k1616k1062k0104
58676A409746j8209j6348j5779j6061j5883j5317j5414j6047j6068j5358j4939
58665A234323j5220j5834j6829j8369j9633j9817j9749k0628k1648k1015j9055
58654A026526j8027j8768j9671j9282j7968j6626j5454j4500j3969j3712j3416
58643H45133j3292j3485j3268j2143j1075j1124j1504j0825r546r132r400q970
58631G11369p928p551p628o640m719l810m466m847l617j694l72L48Q90J336K125
58616F62796L905O104P193O756N857N037L678J623k38j444k468l380l491k718
58602F89210j866j283o32q7k37p20n04L89J008J326K251L817N132O220P992J0270
$$ y = [1702162, 1666674, 1633247, 1601141, 1571026, 1543628, 1518560, 1494987, 1472528, 1450912, 1429850, 1409746, 1391537, 1375189, 1359410, 1343349, 1327466, 1312149, 1296735, 1280688, 1264620, 1249262, 1234323, 1219103, 1203269, 1186440, 1168071, 1148438, 1128621, 1108872, 1088244, 1066596, 1045581, 1026526, 1008499, 989731, 970060, 950778, 932810, 916184, 900730, 886230, 872261, 858549, 845133, 831841, 818356, 805088, 792945, 781870, 770746, 759242, 748417, 738871, 729739, 720339, 711369, 703441, 695890, 688262, 681622, 676903, 673093, 668627, 663780, 660163, 658469, 658097, 658445, 659335, 660671, 662796, 666701, 672805, 679998, 686754, 692611, 697648, 701326, 702949, 702711, 701267, 698799, 695419, 691928, 689210, 687344, 686061, 685429, 685342, 685105, 684385, 683881, 684270, 685278, 686604, 688855, 692672, 697804, 704024, 712016, 722286]
58586G22286J1754J2265J3122J5010J7160J9005K0858K2687K3981K5065K6851
58575I30044K9087L0676L1871L4205L8012M1943M5291M8846N3117N7634O2419
58564A403145O8245P5008Q1702Q8407R6436J06113J16270J26277J36624J46999
58554B445226J55783J61930J65544J66156J62203J52671J37529J16418Q8914N6401
58544C808775K1761j3017m6966p8026j03375j22310j36412j46374j51126j50643
58534B882287j47019j41883j35089j26783j18374j10449j02012r2808q4320p7382
58524A746168p0941o4102n7508n1706m6188m0874l6586l3222k9482k5230k2048
58513A268281k0649j9788j8526j7345j6385j4866j3041j2340j2702j2204j0384
$$ y = [722286, 734040, 746305, 759427, 774437, 791597, 810602, 831460, 854147, 878128, 903193, 930044, 959131, 989807, 1021678, 1055883, 1093895, 1135838, 1181129, 1229975, 1283092, 1340726, 1403145, 1471390, 1546398, 1628100, 1716507, 1812943, 1919056, 2035326, 2161603, 2298227, 2445226, 2601009, 2762939, 2928483, 3094639, 3256842, 3409513, 3547042, 3663460, 3752374, 3808775, 3830536, 3817519, 3770553, 3692527, 3589152, 3466842, 3330430, 3184056, 3032930, 2882287, 2735268, 2593385, 2458296, 2331513, 2213139, 2102690, 2000678, 1907870, 1823550, 1746168, 1675227, 1611125, 1553617, 1501911, 1455723, 1414849, 1378263, 1345041, 1315559, 1290329, 1268281, 1247632, 1227844, 1209318, 1191973, 1175588, 1160722, 1147681, 1135341, 1122639, 1110435, 1100051]
58502A100051r306j0239j1774j2539j3358j5244j7514j9326k1028k2680k3311
58491I23732k2782k2218k1692j9884j7073j5710j6586j7234j5760j3618j2699
58480G28476j2328j1218j0044r853r876r059p969p350o575n273m580n068n333
58467F23950m326l158l023l250l127l453m577m995l818k535k489k619j612k58
58453E80710L31P77J755K267J572Q34R43P13p39k047k108k341l996n451m777l143
58437E65300k945m111m849m701m403m053l640m081n580o355n054l064k355k604
58423E07505k435k055k380k964k861k323j863j022K55O89k13q71k15M41j39r39
58407D88610r34j190k566l570k919j975k159k208o50J198J575J467K542L864L848
$$ y = [1100051, 1090745, 1080506, 1068732, 1056193, 1042835, 1027591, 1010077, 990751, 969723, 947043, 923732, 900950, 878732, 857040, 837156, 820083, 804373, 787787, 770553, 754793, 741175, 728476, 716148, 704930, 694886, 685033, 675157, 666098, 658129, 650779, 644204, 638931, 634351, 629283, 623950, 619624, 616466, 613443, 610193, 607066, 603613, 599036, 594041, 590223, 587688, 585199, 582580, 580968, 580710, 581041, 581818, 583573, 585840, 587412, 588246, 589189, 589902, 589163, 587116, 585008, 582667, 578671, 573220, 568443, 565300, 562355, 558244, 553395, 548694, 544291, 540238, 536598, 532517, 526937, 520582, 515528, 512464, 510109, 507505, 505070, 503015, 500635, 497671, 494810, 492487, 490624, 489602, 489857, 490546, 490333, 489462, 489247, 489688, 489549, 488610, 487676, 486486, 483920, 480350, 477431, 475456, 473297, 471089, 470439, 471637, 473212, 474679, 477221, 481085, 484933]
58392D84933L603N037P191P796P152P250Q131Q281P634P225O710N039K857J619
58378E70458J066q1j703k785l381m067m492m387m720o011o959o542n787n683n336
58363E09590m092l269l615l482j805m81j105j944r58O69J025J041K342L890M031
58348E01837L733M525N399N043M832O215P468O620N234N589O484N715M424M900
58334E78018O174N999N234O028P517P510O723P122P806O720M759L982L527J408
58320F58527j387k777l554n291o458n057k943k826l288j683L23l96k230j282J708
58305F21386K804J793J745K847K705J886L145N704O147M570M159N139M849L419
58291F72298L640N287N267L357K388K832K532J657K494M420M415K551J791K584
$$ y = [484933, 488536, 493573, 500764, 508560, 515712, 522962, 531093, 539374, 547008, 554233, 560943, 565982, 568839, 570458, 571524, 571443, 569740, 566955, 563574, 559507, 555015, 550628, 545908, 539897, 532938, 526396, 520609, 514926, 509590, 505498, 502229, 498614, 495132, 493327, 492846, 491741, 489797, 488839, 489508, 490533, 491574, 493916, 497806, 501837, 505570, 510095, 515494, 520537, 525369, 531584, 539052, 545672, 550906, 556495, 562979, 568694, 573118, 578018, 584192, 590191, 595425, 601453, 608970, 616480, 623203, 630325, 638131, 644851, 649610, 653592, 657119, 658527, 657140, 654363, 650809, 645518, 639060, 634003, 631060, 628234, 624946, 623263, 623586, 623190, 620960, 619678, 621386, 624190, 625983, 627728, 630575, 633280, 635166, 638311, 644015, 650162, 654732, 658891, 664030, 668879, 672298, 675938, 681225, 686492, 689849, 692237, 695069, 697601, 699258, 701752, 706172, 710587, 713138, 714929, 717513]
58277G17513K732K264L118M539M115K879L905O541P541P117Q052R804R600Q483
58263G98203R796J2444J2372J0128R990J2061J2371J0632J0602J2577J2882J1206
58251I35264J1203J3221J3574J1675J0888J1816J1641J0579J1702J4164J3981
58240A069708J1906J2747J6530J8301J7254J7794K0737K1928K0778K1624K5104
58229A274411K6618K5017K4561K6481K6928K5027K4617K6373K6516K4965K6166
58218A557680L0224L1968L0540L0914L4233L5964L5328L7017M1552M3771M2949
58207A952140M4441M9136N1597N1033N3455O0245O5418O7032P0420P7142Q2048
58196B624107Q4347Q9938R9355J05362J06195J09060J16727J23061J25848J31121
$$ y = [717513, 720245, 722509, 725627, 730166, 734281, 737160, 741065, 747606, 755147, 762264, 770316, 780120, 789720, 798203, 807999, 820443, 832815, 842943, 852933, 864994, 877365, 887997, 898599, 911176, 924058, 935264, 946467, 959688, 973262, 984937, 995825, 1007641, 1019282, 1029861, 1041563, 1055727, 1069708, 1081614, 1094361, 1110891, 1129192, 1146446, 1164240, 1184977, 1206905, 1227683, 1249307, 1274411, 1301029, 1326046, 1350607, 1377088, 1404016, 1429043, 1453660, 1480033, 1506549, 1531514, 1557680, 1587904, 1619872, 1650412, 1681326, 1715559, 1751523, 1786851, 1823868, 1865420, 1909191, 1952140, 1996581, 2045717, 2097314, 2148347, 2201802, 2262047, 2327465, 2394497, 2464917, 2542059, 2624107, 2708454, 2798392, 2897747, 3003109, 3109304, 3218364, 3335091, 3458152, 3584000, 3715121]
58186C715121J40483J47356J50373J56952J68862J78258J83016J91460K06523
58177E238404K20277K29833K43024K62157K78375K88934L03502L26373L49482
58168G740361L70249L98134M35575M71256N00702N33864N73665O08316O34947
58159A2267069O68772P17830P71318Q24180Q88237R66258J041561J108533J186696
58150B0440454J288777J403054J523294J664536J830761K001401K172110K374035
58142C4698422K630239K931914L281850L717054M260394M899786N645351O546073
58134F8611083P610559Q780865J0029968J1402668J2921900J4598622J6601752
58127A50557417J9118645K1660535K2605259K0007908J3289605M053134m968048
$$ y = [3715121, 3855604, 4002960, 4153333, 4310285, 4479147, 4657405, 4840421, 5031881, 5238404, 5458681, 5688514, 5931538, 6193695, 6472070, 6761004, 7064506, 7390879, 7740361, 8110610, 8508744, 8944319, 9415575, 9916277, 10450141, 11023806, 11632122, 12267069, 12935841, 13653671, 14424989, 15249169, 16137406, 17103664, 18145225, 19253758, 20440454, 21729231, 23132285, 24655579, 26320115, 28150876, 30152277, 32324387, 34698422, 37328661, 40260575, 43542425, 47259479, 51519873, 56419659, 62065010, 68611083, 76221642, 85002507, 95032475, 106435143, 119357043, 133955665, 150557417, 169676062, 191336597, 213941856, 233949764, 247239369, 251292503, 246324455]
58120B46324455j1745867j5797869j7657641j8030160j7467765j6400856j5119727
58113A34104570j3742497j2317818j0929746r655270q495432p423364o453612
58106F5086831n608288m862930m183005l575918l056555k597521k162687j757543
58098C7282384j398743j065995p33534m14422j11794K40954O96569J133980J264997
58089C6894396Q69034J3382r82881j789811k262565k444220k445272k348155k195888
58080B3308020k018063j838294j665218j496736j335950j192394j067956r54384
58072A1739025q47347p51661o69876n97382n32978m82634m47340m17881l87417
58063F604509l59393l37320l16880k94505k74129k58554k42924k23563k04825
$$ y = [246324455, 234578588, 218780719, 201123078, 183092918, 165625153, 149224297, 134104570, 120362073, 108044255, 97114509, 87459239, 78963807, 71540443, 65086831, 59478543, 54615613, 50432608, 46856690, 43800135, 41202614, 39039927, 37282384, 35883641, 34817646, 34084112, 33669690, 33557896, 33798850, 34495419, 35629399, 36894396, 37763430, 37776812, 36793931, 35004120, 32741555, 30297335, 27852063, 25503908, 23308020, 21289957, 19451663, 17786445, 16289709, 14953759, 13761365, 12693409, 11739025, 10891678, 10140017, 9470141, 8872759, 8339781, 7857147, 7409807, 6991926, 6604509, 6245116, 5907796, 5590916, 5296411, 5022282, 4763728, 4520804, 4297241, 4092416]
58054D092416j90497j76756j60449j46297j38749j34309j28832j25011j25491
58045B766025j25915j22109j17428j15739j13606j06810r8438r3071q8606q1238
58035A703065p3204o8361o4895n9432n3808n1059m9166m5207m1370m0543m0277
58024A115743l7329l3946l3375l3362l0394k6407k4986k4675k2266j9188j8439
58013H11376j8545j6612j4222j4411j5748j5077j3309j2945j2787j0643q373q780
58001F49924j0161r357p631q061r628r321p825p880q921q443o850o230o141n095
57987E38380m180m945n788m657l072l289l937k771j140j308j957r70l0j519l410
57972D95407k375J71L85j555k498k186k849m286m361l460l724m757m489l373l418
$$ y = [4092416, 3901919, 3725163, 3564714, 3418417, 3279668, 3145359, 3016527, 2891516, 2766025, 2640110, 2518001, 2400573, 2284834, 2171228, 2064418, 1965980, 1872909, 1784303, 1703065, 1629861, 1561500, 1496605, 1437173, 1383365, 1332306, 1283140, 1237933, 1196563, 1156020, 1115743, 1078414, 1044468, 1011093, 977731, 947337, 920930, 895944, 871269, 849003, 829815, 811376, 792831, 776219, 761997, 747586, 731838, 716761, 703452, 690507, 677720, 667077, 658704, 649924, 639763, 630406, 622775, 614714, 605086, 595765, 587940, 580060, 571139, 562696, 555846, 549616, 543475, 538380, 534200, 529255, 523467, 518810, 515738, 512449, 508512, 505741, 504601, 503293, 501336, 500366, 500336, 498817, 495407, 493032, 493203, 493588, 492033, 489535, 487349, 484500, 480214, 475853, 472393, 468669, 463912, 459423, 456050, 452632]
57957D52632m119l518k243k375l349l124k303k933m318m146k906k967m125m137
57943D06069k936k377k491j840q96j264k296k074j062j150j990j805q95o99m26
57928C81868J487L660L457J533O69R28J31j482j470K03R57L6p69q81j676l201
57912C85450l846l534l850m802m715l524l027l617l858l368l245l562l320k821
57898C34361l207l882l289k028k159l605m280l682l313l613l528l043l175l458
57884B88099k397m05O12N20R48K091K473J850J510J677J356O98P74J206P34k44
57868C01502m31m37j721l364l194j786j725l125l509k236j246j141k33J831L069
57853B82254K664K190K461K319J389J091J968K748K866L192L670L069J598R49
$$ y = [452632, 448513, 444995, 442752, 440377, 437028, 433904, 431601, 428668, 424350, 420204, 417298, 414331, 410206, 406069, 403133, 400756, 398265, 396425, 395529, 394265, 391969, 389895, 388833, 387683, 385693, 383888, 382993, 382294, 381868, 383355, 387015, 390472, 392005, 392674, 393602, 393733, 392251, 390781, 390984, 391941, 391977, 391208, 390327, 388651, 385450, 381604, 378070, 374220, 369418, 364703, 361179, 358152, 354535, 350677, 347309, 344064, 340502, 337182, 334361, 331154, 327272, 323983, 321955, 319796, 316191, 311911, 308229, 304916, 301303, 297775, 294732, 291557, 288099, 285702, 285297, 285909, 286429, 287377, 289468, 291941, 293791, 295301, 296978, 298334, 299032, 299806, 301012, 301746, 301502, 301071, 300634, 298913, 295549, 292355, 290569, 288844, 285719, 282210, 279974, 278728, 277587, 277354, 279185, 282254, 284918, 287108, 289569, 291888, 293277, 294368, 296336, 299084, 301950, 305142, 308812, 311881, 313479, 314428]
57839C14428J167M67j258j983j314j394l083m403m004l170l049k787j847j413
57825B86357k018k343j738j494k253k649j932j462k141k726k210j619j923k283
57811B57566j862j311j045q8J851L197K910K248K666L704M348M772N244N019L757
57796B92976K569K279K006P43j022k280k895l105k946k929l798n079n407m830
57782B66282m865n794o048n105m615n546o398n714m312l543l167k511k095k500
57768B04069l009k887k757l366m152m246l803l340k883k624l158m174m332l230
57754A56108k148k084k437k440k342k426k309j960j937k041j395l08j61r22r01
57739A30297K62P04n06j658j112L89J500K263K898K603J168m9j96k07o45l33J310
$$ y = [314428, 315595, 316062, 314804, 312821, 311507, 310113, 307030, 302627, 298623, 295453, 292404, 289617, 287770, 286357, 284339, 281996, 280258, 278764, 276511, 273862, 271930, 270468, 268327, 265601, 263391, 261772, 259849, 257566, 255704, 254393, 253348, 253260, 255111, 258308, 261218, 263466, 266132, 269836, 274184, 278956, 284200, 289219, 292976, 295545, 297824, 299830, 300573, 299551, 297271, 294376, 291271, 288325, 285396, 281598, 276519, 271112, 266282, 261417, 255623, 249575, 244470, 239855, 234309, 227911, 222197, 217885, 214342, 211175, 208664, 206569, 204069, 201060, 198173, 195416, 192050, 187898, 183652, 179849, 176509, 173626, 171002, 167844, 163670, 159338, 156108, 153960, 151876, 149439, 146999, 144657, 142231, 139922, 137962, 136025, 133984, 132589, 132281, 132120, 131198, 130297, 130559, 131263, 130757, 129099, 127987, 128376, 129876, 132139, 135037, 137640, 138808, 138759, 138563, 138356, 137711, 137378, 138688]
57722A38688K701K623K338L204M151L678K548K217K081Q19q37j184m68l65j137
57707A61057j453o72M98J352J705J452Q02M53O44Q22R26J682K792K617Q98p9J325
57690A76821L539M241L729L611L735K973J867J899K787K960K252J904K232K443
57676B16993K479L019L867M218M288M932N749N469M137L245L571M434N112N672
57662B77185O227O599O905P534Q490R488J0454J1316J1732J1709J1871J2494J2996
57649D05000J3111J3609J5061J6898J8553K0341K2269K3382K3522K4278K6728
57638F22752K9638L1539L3243L6342M0421M3981M7207N1499N6880O2065O6889
57627A122456P2614P9892Q8151R6900J05995J14801J22555J29414J35757J40741
$$ y = [138688, 141389, 144012, 146350, 149554, 153705, 157383, 159931, 162148, 164229, 165048, 164211, 163027, 162559, 162194, 161057, 159604, 158932, 159430, 160782, 162487, 163939, 164741, 165194, 165838, 166660, 167586, 169268, 172060, 174677, 175575, 175496, 176821, 180360, 184601, 188330, 191941, 195676, 198649, 200516, 202415, 205202, 208162, 210414, 212318, 214550, 216993, 219472, 222491, 226358, 230576, 234864, 239796, 245545, 251014, 255151, 258396, 261967, 266401, 271513, 277185, 283412, 290011, 296916, 304450, 312940, 322428, 332882, 344198, 355930, 367639, 379510, 392004, 405000, 418111, 431720, 446781, 463679, 482232, 502573, 524842, 548224, 571746, 596024, 622752, 652390, 683929, 717172, 753514, 793935, 837916, 885123, 936622, 993502, 1055567, 1122456, 1195070, 1274962, 1363113, 1460013, 1566008, 1680809, 1803364, 1932778, 2068535, 2209276]
57617B209276J42766J40989J35086J24153J07469Q6131O2640L9116J6921k807
57607C061740j9811l5379n1040o7018q2885r8531j13051j23832j28700j28299
57597B213194j24768j19038j11162j02127r3167q4020p4006o4118n5937m9184
57587A335667m2527l6097l0891k6393k1275j6058j2400r992o756k052K748O936
57575A140910J1220J5741J9727K3380K7830L3041L7952M2757M8737N5747O2296
57564A519338O8290P5136Q2846Q9655R4986J00037J04801J07053J05242R9780
57554B447164R0619P6281N6653L4387J1861j1074l4801n7458p6561r1526j02906
57543B342639j10489j13927j14087j12280j08836j03714r7600r1446q5545p9953
$$ y = [2209276, 2352042, 2493031, 2628117, 2752270, 2859739, 2945870, 3008510, 3047626, 3064547, 3061740, 3041929, 3006550, 2955510, 2888492, 2805607, 2707076, 2594025, 2470193, 2341493, 2213194, 2088426, 1969388, 1858226, 1756099, 1662932, 1578912, 1504906, 1440788, 1384851, 1335667, 1293140, 1257043, 1226152, 1199759, 1178484, 1162426, 1150026, 1140034, 1133278, 1131226, 1133974, 1140910, 1152130, 1167871, 1187598, 1210978, 1238808, 1271849, 1309801, 1352558, 1401295, 1457042, 1519338, 1587628, 1662764, 1745610, 1835265, 1930251, 2030288, 2135089, 2242142, 2347384, 2447164, 2537783, 2614064, 2670717, 2705104, 2716965, 2705891, 2671090, 2613632, 2537071, 2445545, 2342639, 2232150, 2118223, 2004136, 1891856, 1783020, 1679306, 1581706, 1490260, 1404715, 1324762]
57533A324762p4893p0179o5115n9612n4427m9890m5539m1398l8253l6131l3912
57522G55413l1030k8237k6038k3866k1427j9411j8107j6748j4947j3379j2360
57511E29863j1235r903r338r711r624q146o141m575l135j533n52m72m4J616L438
57496D60508M144M315N253O835Q047Q667R111R433R779J0952J3314J5892J7777
57483E84027J9462K1621K3568K4353K4596K5811K8414L1706L5267L9105M2865
57472I00795M6192M9599N3987N9419O5086P0164P4254P7368P9947Q2270Q3430
57461A642511Q1705P6288O7719N6301M1482K3463M074j4839l2698m8949o2075
57450A834982p1125p7032q1122q3234q2678p9961p6185p1582o6041o0287n5126
$$ y = [1324762, 1249869, 1179690, 1114575, 1054963, 1000536, 950646, 905107, 863709, 825456, 789325, 755413, 724383, 696146, 670108, 646242, 624815, 605404, 587297, 570549, 555602, 542223, 529863, 518628, 508725, 499387, 489676, 480052, 471906, 465765, 461190, 458055, 456522, 455970, 455498, 455454, 457070, 460508, 464652, 468967, 474220, 481055, 489102, 497769, 506880, 516313, 526092, 537044, 550358, 566250, 584027, 603489, 625110, 648678, 673031, 697627, 723438, 751852, 783558, 818825, 857930, 900795, 946987, 996586, 1050573, 1109992, 1175078, 1245242, 1319496, 1396864, 1476811, 1559081, 1642511, 1724216, 1800504, 1868223, 1924524, 1966006, 1989469, 1993543, 1978704, 1946006, 1897057, 1834982, 1763857, 1686825, 1605703, 1522469, 1439791, 1359830, 1283645, 1212063, 1146022, 1085735, 1030609]
57439A030609n0277m5258m0710l7397l4557l0785k6076k1620j7925j4552j1373
57428G00079q732o563m431k248L9K958O732J0406J2926J4651J6697J9299K1957
57415G83770K4755K8238L2263L6233M0320M5201N0649N5546N9407O2914O6823
57404A286119P1144P5330P8515P9447P6885P0227N9590M5515K8862J0626q491
57393A873769k7916m6402o2163p4220q2858q8406r0627q9830q7535q5064q2356
57382A056392p8870p4713p0107o4797n8979n3841n0093m6904m3274l9508l6206
57371D39100l3004k9558k6767k5471k4760k3170k0827j8944j7790j6749j5757
57360A86303j5161j4611j3623j2753j2755j2948j2040j0220q872q489q280p690
$$ y = [1030609, 980332, 935074, 894364, 856967, 822410, 791625, 765549, 743929, 726004, 711452, 700079, 691347, 684784, 680353, 678105, 678144, 681102, 687834, 698240, 711166, 725817, 742514, 761813, 783770, 808525, 836763, 869026, 905259, 945579, 990780, 1041429, 1096975, 1156382, 1219296, 1286119, 1357263, 1432593, 1511108, 1590555, 1667440, 1737667, 1797257, 1842772, 1871634, 1882260, 1873769, 1845853, 1799451, 1737288, 1663068, 1580210, 1491804, 1401177, 1311347, 1223812, 1138748, 1056392, 977522, 902809, 832702, 767905, 708926, 655085, 604992, 558088, 514814, 475306, 439100, 406096, 376538, 349771, 324300, 299540, 276370, 255543, 236599, 218809, 202060, 186303, 171142, 156531, 142908, 130155, 117400, 104452, 92412, 82192, 73320, 64831, 56551, 48861]
57348D8861o888n901m650l703l718m280m486m326m281B611c82j969k234l496m135
57333a2216l599l004l160l522l387k904k515k349k405k537k293j518r21j158j729
57318d9217j758j402j334j281n05N70P30j34r03j028j105j589k197k685l056k945
57302f9839j969p25l28q61j345j255j070j263j688k026k061j678j145j097j539
57287h9889j527o71o1o31j540j541j095j417k231k269j455p64l18M04Q86R8j371
57270a05392j753o57N86J168J542J824J391L46l31k98n2L58J268K112K013J485
57254i4390J730K342J823L60j72P24J410R56N59J375K855M092N018N555N233M449
57238e6081M471N535O508O903P614R050e579E918J3281J6032J8466J9748K0771
$$ y = [48861, 41973, 36072, 31422, 27719, 24001, 19721, 15235, 10909, 6628, 2611, -382, -2351, -4585, -8081, -12216, -15815, -18819, -21979, -25501, -28888, -31792, -34307, -36656, -39061, -41598, -43891, -45409, -46330, -47488, -49217, -50975, -52377, -53711, -54992, -55497, -54927, -54197, -54331, -55234, -56262, -57367, -58956, -61153, -63838, -66894, -69839, -71808, -72533, -72861, -73722, -75067, -76322, -77392, -78655, -80343, -82369, -84430, -86108, -87253, -88350, -89889, -91416, -92087, -92148, -92779, -94319, -95860, -96955, -98372, -100603, -102872, -104327, -105091, -105409, -105005, -104119, -104021, -105392, -107145, -107802, -107216, -106048, -104506, -102682, -101291, -100945, -101276, -101574, -101626, -101268, -100000, -97888, -95875, -94390, -92660, -90318, -88495, -88135, -88307, -87583, -86173, -85217, -84658, -83283, -80428, -76336, -71318, -65763, -60530, -56081, -51610, -46075, -39567, -32664, -25050, -16000, -5579, 5918, 19199, 35231, 53697, 73445, 94216]
57225I4216K2478K4512K6376K8443L0711L1992L1418K9655K7711K5619K3052K0164
57213D16347J7098J3676J0125P175M971K867N34j811m239o977r520j1281j2878
57200D26087j5042j6617j5861j3609j2604j3376j3460j1407q849p555o913n694
57188B85100m179k940j404Q87L091M459N530O887Q119Q911R737J0652J0994J0886
57174C56730J1358J2416J2935J3065J4524J7649K0478K1753K2647K4281K5798
57163E53634K6202K6044K5896K5147K3632K2479K2064K1193J9530J8728J9690
57152H04239K0984K1349K1717K3165K5028K6533K8196L0086L0928L0486L0602
57141A093313L2229L3718L3742L3398L3579L2817K9889K6277K3767K1787J9409
$$ y = [94216, 116694, 141206, 167582, 196025, 226736, 258728, 290146, 319801, 347512, 373131, 396183, 416347, 433445, 447121, 457246, 464421, 469392, 472259, 472793, 470982, 466743, 459766, 450246, 438965, 426087, 411045, 394428, 378567, 364958, 352354, 338978, 325518, 314111, 305262, 297707, 290794, 285100, 280921, 277981, 276577, 277464, 280555, 285014, 290544, 297431, 305550, 314461, 324198, 334850, 345844, 356730, 368088, 380504, 393439, 406504, 421028, 438677, 459155, 480908, 503555, 527836, 553634, 579836, 605880, 631776, 656923, 680555, 703034, 725098, 746291, 765821, 784549, 804239, 825223, 846572, 868289, 891454, 916482, 943015, 971211, 1001297, 1032225, 1062711, 1093313, 1125542, 1159260, 1193002, 1226400, 1259979, 1292796, 1322685, 1348962, 1372729, 1394516, 1413925]
57130A413925J7695J7687J8028J7027J5265J3960J2697J0920R671R696R784R082
57118A575437Q902J0083J0960J0211R231R181Q313M986R04j633l296n609p637
57105A630033q018q060r470j1081j1066j0464j1244j2823j3830j5312j8863k3388
57093A476414k7051l0535l5208m0046m3599m6916n1245n5063n6803n8225o1660
57082I70063o6394p1241p7958q8180r9663j09682j19515j31478F1624i4322j67603
57071b61925j80961j94044k04917k16322k31524k48815k65335k82958l04686l28836
57061b720323l53039l80437m15289m55934m99013n47091o04766o70927p42718
57052g389537q23479r18344j025879j143105j275060j429991j609044j810702
$$ y = [1413925, 1431620, 1449307, 1467335, 1484362, 1499627, 1513587, 1526284, 1537204, 1546875, 1556571, 1566355, 1575437, 1584339, 1594422, 1605382, 1615593, 1624824, 1634005, 1642318, 1647304, 1648208, 1646575, 1643279, 1637670, 1630033, 1622015, 1613955, 1604485, 1593404, 1582338, 1571874, 1560630, 1547807, 1533977, 1518665, 1499802, 1476414, 1449363, 1418828, 1383620, 1343574, 1299975, 1253059, 1201814, 1146751, 1089948, 1031723, 970063, 903669, 832428, 754470, 666290, 566627, 456945, 337430, 205952, 61624, -94322, -261925, -442886, -636930, -841847, -1058169, -1289693, -1538508, -1803843, -2086801, -2391487, -2720323, -3073362, -3453799, -3869088, -4325022, -4824035, -5371126, -5975892, -6646819, -7389537, -8213016, -9131360, -10157239, -11300344, -12575404, -14005395, -15614439, -17425141]
57044a7425141k040915k307773k610651k947002l325963l763163m267489m846571
57036d3534668n518126o298661p186087q169459r245732j0405773j1614977j2830485
57028a14803968j4015630j5102329j5982736j6632803j7235177j8022960j8873352
57021b30668955j9112504j7877121j4744433j0009757m410362J311897O597703
57014b88913532J1033139J4337047J6430187J7451259J7664177J7346267J6729635
57007a77921821J5978926J5183287J4373561J3556085J2729356J1881201J0995851
57000h3223554J0073492R134594Q204296P302266O446679N654847M935715M289272
56992b7182393L714819L212900K779258K405006K083882J812612J583961J386853
$$ y = [-17425141, -19466056, -21773829, -24384480, -27331482, -30657445, -34420608, -38688097, -43534668, -49052794, -55351455, -62537542, -70707001, -79952733, -90358506, -101973483, -114803968, -128819598, -143921927, -159904663, -176537466, -193772643, -211795603, -230668955, -249781459, -267658580, -282403013, -292412770, -296823132, -295511235, -288913532, -277880393, -263543346, -247113159, -229661900, -211997723, -194651456, -177921821, -161942895, -146759608, -132386047, -118829962, -106100606, -94219405, -83223554, -73150062, -64015468, -55811172, -48508906, -42062227, -36407380, -31471665, -27182393, -23467574, -20254674, -17475416, -15070410, -12986528, -11173916, -9589955, -8203102]
56984h203102J214584J066671R41866Q35326P43551O66047O00611N42186M87776
56975a104484M38042b73360G7571L11127K75477K44394K16079J90170J68495J51530
56965A634843J37522J25687J16744J09639J01252R0315P8728O8398N9577N2730
56955B575435M8878M7285M5537M2579L9250L5418K9494K1456J3735Q040L441j734
56943B908814q263j7043k9319m4374n8134o5436o3984n7060n3072o0690q1686
56932B369753j08743j32044j47365j56144j59688j57255j49397j39025j28028
56923A092064j15858j02582r0589q1964p6322p2363o9508o6940o3113n7633n2128
56912B43064m7998m4680m1086l7311l3801H071a7601k0784j5991j1222o246j273
$$ y = [-8203102, -6988518, -5921847, -4979981, -4144655, -3401104, -2735057, -2134446, -1592260, -1104484, -666442, -273360, 77571, 388698, 664175, 908569, 1124648, 1314818, 1483313, 1634843, 1772365, 1898052, 2014796, 2124435, 2225687, 2316002, 2394730, 2463128, 2522705, 2575435, 2624313, 2671598, 2717135, 2759714, 2798964, 2834382, 2863876, 2885332, 2899067, 2907107, 2910548, 2908814, 2900551, 2883508, 2854189, 2809815, 2751681, 2686245, 2622261, 2565201, 2512129, 2451439, 2369753, 2261010, 2128966, 1981601, 1825457, 1665769, 1508514, 1359117, 1220092, 1092064, 976206, 873624, 783035, 701071, 624749, 552386, 482878, 415938, 352825, 295192, 243064, 195066, 150386, 109300, 71989, 38188, 8071, -17601, -38385, -54376, -65598, -71844, -73117]
56900g3117L440P853J1706J4493J6061c178A1716J1152O146J674j630m312o399
56887A8347p254C902c492p958p663o229m837l915k294O58L809O191Q435f130G483
56871B2567J6319J7875J8408J6210J1543N931R1n815j0686j3045j2956j1885j0791
56858D3766r587q292p303o531n381B779a02k726k852k635k230k140k532l087l258
56843b1562k618j270J14R87J522K206L033L545L630L788b067C910P631Q992R880
56828C0413J0654J1806J3300J4475J4755J4094J2628J0373P602N004L029J470
56816A49603J11o50m06M73J305K059L180M661O113P578R521J1893J4027J5581
56802B25049J7027J8910K1130K3094K4013K2883J8849J2189M523k297p405j0837
$$ y = [-73117, -69677, -61824, -50118, -35625, -19564, -3178, 11716, 22868, 29014, 30688, 29058, 24746, 18347, 11093, 3902, -3492, -11450, -19113, -25342, -30179, -34094, -36388, -35730, -31921, -25730, -17295, -6130, 7483, 22567, 38886, 56761, 75169, 91379, 102922, 108853, 108944, 103129, 92443, 79398, 66442, 54557, 43766, 34179, 25887, 18584, 12053, 6672, 2779, -102, -2828, -5680, -8315, -10545, -12685, -15217, -18304, -21562, -24180, -25450, -25336, -24349, -22827, -20621, -17588, -14043, -10413, -6625, -2067, 3910, 11541, 20533, 30413, 41067, 52873, 66173, 80648, 95403, 109497, 122125, 132498, 140100, 145104, 148133, 149603, 149714, 149064, 148658, 149131, 150436, 152495, 155675, 160336, 166449, 174027, 183548, 195441, 209468, 225049, 242076, 260986, 282116, 305210, 329223, 352106, 370955, 383144, 387667, 385370, 377965, 367128]
56790C67128j2753j3224j2485j0904q737o208l658j241J336M476Q121J1969J6003
56777C39823K0390K4843K8642L1371L3115L3651L1848K6392J7115N484o129j5614
56765E70931k1901k5071k5868k5064k3206k0789j8262j5773j3078r918o357k678
56753C62966Q70M179P338J0676J4458J8373K1627K3597K3897K1671J5702O048
56741E31402m858j3742j9161k2004k3503k3820k2775k0895j8928j6939j4566j1897
56729C18314r387p111m716k028P14L261N558P621R530J1364J2717J2383R198L403
56715C70821l199q739j2570j5033j6391j6598j5839j4745j3888j3314j2654j1576
56703B16275j0065q446p161o358n735m942m139l845m171m546m388l775l125k562
$$ y = [367128, 354375, 341151, 328666, 317762, 309025, 302817, 299159, 297918, 299254, 303730, 311851, 323820, 339823, 360213, 385056, 413698, 445069, 478184, 511835, 543683, 570075, 587190, 592674, 586545, 570931, 549030, 523959, 498091, 473027, 449821, 429032, 410770, 394997, 381919, 372001, 365644, 362966, 363836, 368015, 375353, 386029, 400487, 418860, 440487, 464084, 487981, 509652, 525354, 531402, 526544, 512802, 493641, 471637, 448134, 424314, 401539, 380644, 361716, 344777, 330211, 318314, 308927, 301816, 297100, 295072, 295786, 299047, 304605, 312226, 321756, 333120, 345837, 358220, 367418, 370821, 367622, 358883, 346313, 331280, 314889, 298291, 282452, 267707, 253819, 240505, 227851, 216275, 206210, 197764, 190603, 184245, 178510, 173568, 169429, 165584, 161413, 156867, 152479, 148704, 145579, 143017]
56689A43017j963j497j505j899k129j860j261o05R2Q37J479J902K069J775Q15
56674A39267m76j263j147o31l54k53L5L62K21m23j038j284j451j896k360k118
56658A25191r38K85K36j248k676k502j015J49K69K71R47J627J337L17n53j124
56642A20573j717k056j614p50l98p19j033j091j293j623j414n04K36k1j086k140
56626A03350k566k106q51O54J714K088K040J749J168M73Q9J92O39J388K380L061
56610A15462K740J582N74L30N69Q67J162J298Q93M0n43m80k09q8K52J074J720
56593A27243J372K45p30j103j195j280j211q27k48L09O94P10K20n90j251j505
56577A20853j603j934k397k373j493l12J45m09j127j080l43K91L70J16j19k38
$$ y = [143017, 141054, 139557, 138052, 136153, 134024, 132164, 130903, 130298, 130390, 131227, 132706, 134608, 136677, 138452, 139267, 138791, 137528, 136381, 135750, 135396, 135143, 135178, 135540, 135761, 135338, 134300, 133016, 131565, 129669, 127309, 125191, 124253, 124538, 124774, 123526, 120850, 118348, 117333, 117482, 117751, 118022, 118969, 120596, 121933, 122250, 121697, 120573, 118856, 116800, 115186, 114436, 114038, 113319, 112286, 111195, 109902, 108279, 106865, 106361, 106597, 106576, 105490, 103350, 100784, 98678, 97827, 98481, 100195, 102283, 104323, 106072, 107240, 107713, 107802, 107994, 108633, 110021, 112401, 115462, 118202, 119784, 120358, 120688, 121257, 122124, 123286, 124584, 125477, 125517, 124974, 124494, 124285, 124197, 124449, 125523, 127243, 128615, 128860, 128130, 127027, 125832, 124552, 123341, 122514, 122266, 122575, 123269, 123979, 124199, 123609, 122358, 120853, 119250, 117316, 114919, 112546, 111053, 110741, 110886, 110477, 109350, 108270, 107927, 108218, 108588, 108704, 108585, 108347]
56561A08347k40j39k8M2J27J70m2m21m14K69J088J364J208J196J413J474J270
56544A16684R89O02P0j58L91J308J618J010R6m55l59M51J625K226J631N30R4K73
56526A28626N7o38o21P08K317K902K345J374N73K53N72J304J990K596L403M121
56510A51882L965K872J773J337J238J114J314K160L178L642L405K760K095J953
56496A84688K747M044M794M617M190M023L786L189K689K640K547J914J183J102
56482B28153J603J952J690R19k1p30j049j432k455l811m378l716k727k381k529
56467B09088k506k212j924j581j025n78p01j310j940k307k317j827q88K1L49m4
56451A88298r28j935k625k654k100j383q17m95m53n46l41K95O55K6j120j592j032
$$ y = [108347, 108107, 107968, 107940, 107982, 108109, 108279, 108237, 107816, 107402, 107671, 108759, 110123, 111331, 112527, 113940, 115414, 116684, 117673, 118275, 118345, 118187, 118578, 119886, 121504, 122514, 122610, 122155, 121796, 122247, 123872, 126098, 127729, 128259, 128353, 128626, 128683, 128045, 127424, 128132, 130449, 133351, 135696, 137070, 137643, 137896, 138468, 139772, 141762, 144358, 147761, 151882, 155847, 158719, 160492, 161829, 163067, 164181, 165495, 167655, 170833, 174475, 177880, 180640, 182735, 184688, 187435, 191479, 196273, 200890, 205080, 209103, 212889, 216078, 218767, 221407, 223954, 225868, 227051, 228153, 229756, 231708, 233398, 234317, 234296, 233566, 232517, 231085, 228630, 224819, 220441, 216725, 213998, 211617, 209088, 206582, 204370, 202446, 200865, 199840, 199262, 198561, 197251, 195311, 193004, 190687, 188860, 187972, 187993, 188342, 188298, 187370, 185435, 182810, 180156, 178056, 176673, 175856, 175361, 174908, 174362, 174021, 174316, 174971, 174997, 173877, 172285, 171253]
56434A71253k42L5k42r20j783k203j638n61R2L03O95J072O11l91n94K92J008Q01
56416A67588M50O81J075J209J463J846J531M95J51J247K442K255J264J053J885
56401A86635K726K917K597K002J388J224J619K016K067K168K585K867K743K645
56387B18199K691K150P78l56k61N48R37O28mp46j294j050p0N84K48l95n55n70
56369B21462j020j547j497r77m41pJ10n62j759k356k038j886k529k953k216j121
56353A98663r31j515j966k121k219k064j637j650k336k667j852o20Q5M89R70R16
56337A79545Jo13P8J132J058Q4m64j60N81J616K707K943K027J141J186J273M93
56320A94628j04P89K197K155P88p9K32Q38J250J803K328K251J887K066K615K629
$$ y = [171253, 171011, 171046, 170804, 169884, 168101, 165898, 164260, 163699, 163791, 164094, 164789, 165861, 166472, 166081, 165487, 165779, 166787, 167588, 168038, 168719, 169794, 171003, 172466, 174312, 175843, 176338, 176489, 177736, 180178, 182433, 183697, 184750, 186635, 189361, 192278, 194875, 196877, 198265, 199489, 201108, 203124, 205191, 207359, 209944, 212811, 215554, 218199, 220890, 223040, 223818, 223462, 223201, 223749, 224686, 225314, 225310, 224564, 223270, 222220, 222150, 222734, 222982, 222587, 222032, 221462, 220442, 218895, 217398, 216421, 215980, 215973, 216083, 215521, 213762, 211406, 209368, 207482, 204953, 202000, 199784, 198663, 197732, 196217, 194251, 192130, 189911, 187847, 186210, 184560, 182224, 179557, 177705, 177085, 177170, 177659, 178629, 179545, 179546, 178933, 179011, 180143, 181201, 181285, 180821, 180661, 181242, 182858, 185565, 188508, 190535, 191676, 192862, 194135, 194628, 194524, 195313, 197510, 199665, 200453, 200374, 200606, 201444, 202694, 204497, 206825, 209076, 210963, 213029, 215644, 218273]
56304B18273J989J334R41Q02J226K097K333J370L07K64N98L19O4Q12J756J596
56288B36081J004J520K684K687J382L81L92O53Q62J545K565L191L529M142M523
56273B67141L798K636K486L171L268K693K783L810M496M216L816L957M284M534
56259C17089M980N624O137O601P256P786P922Q083Q349P736O007M944N973P645
56245D12132P617O143N181M900L787J786N62P76J456K059K832L291K671J825K347
56230D59365L897M602M097L908M868O362P996R885J1309J1452J1286J2598J5210
56217E66835J7430J8901K0632K2465K3308K3724K5566K8864L1665L3269L4999
56206H47658L7612M0486M3655M8061N3334N7907O1668O6224P2151P8402Q4652
$$ y = [218273, 220262, 221596, 222537, 223339, 224565, 226662, 228995, 230365, 230672, 230936, 231534, 231853, 231917, 232729, 234485, 236081, 237085, 238605, 241289, 243976, 245358, 245739, 246131, 246784, 247646, 249191, 251756, 254947, 258476, 262618, 267141, 270939, 273575, 276061, 279232, 282500, 285193, 287976, 291786, 296282, 300498, 304314, 308271, 312555, 317089, 322069, 327693, 333830, 340431, 347687, 355473, 363395, 371478, 379827, 387563, 393570, 398514, 404487, 412132, 419749, 425892, 431073, 435973, 439760, 441546, 442108, 442884, 444340, 446399, 449231, 452522, 455193, 457018, 459365, 463262, 467864, 471961, 475869, 480737, 487099, 495095, 504980, 516289, 527741, 539027, 551625, 566835, 584265, 603166, 623798, 646263, 669571, 693295, 718861, 747725, 779390, 812659, 847658, 885270, 925756, 969411, 1017472, 1070806, 1128713, 1190381, 1256605, 1328756, 1407158, 1491810]
56195A491810R1750R9494J06439J12289J18034J23483J27137J28782J29564J29238
56185B658020J25992J19360J10593R9804Q5579O8032M9490L1418J3351m554k0638
56174C336447l4159m6097n6759o5102p1043p5873p9736q1282q0488p9274p8717
56163B587917p8114p7394p7606p8470p8206p6640p5731p6237p6575p5759p4690
56152A742495p3744p1879o9042o6731o5248o3054n9667n6528n4153n1297m7645
56141A063507m4542m2175l8961l4636l1006k8741k6424k3686k2103k1864k0776
56130G28593j7920j5278j4290j3713j2291j0736r672q348o681n930o132n539l713
56117E98350k339k088j515n6R14R70J529K912L713L952N426P936Q803P377O328
$$ y = [1491810, 1583560, 1683054, 1789493, 1901782, 2019816, 2143299, 2270436, 2399218, 2528782, 2658020, 2784012, 2903372, 3013965, 3113769, 3199348, 3267380, 3316870, 3348288, 3361639, 3357085, 3336447, 3302288, 3256191, 3199432, 3134330, 3063287, 2987414, 2907678, 2826396, 2745908, 2666634, 2587917, 2509803, 2432409, 2354803, 2276333, 2198127, 2121487, 2045756, 1969519, 1892944, 1817185, 1742495, 1668751, 1596872, 1527830, 1461099, 1395851, 1332797, 1273130, 1216602, 1162449, 1111152, 1063507, 1018965, 976790, 937829, 903193, 872187, 843446, 817022, 793336, 771233, 749369, 728593, 710673, 695395, 681105, 667392, 655101, 644365, 634693, 626345, 619664, 613734, 607602, 602063, 598350, 596011, 593923, 592408, 592352, 593266, 594236, 595765, 598677, 602390, 606342, 611768, 619704, 628507, 635884, 642212]
56102F42212P172Q126P881P695Q131P527N499M295M847N032L688K779L616M504
56088G23004M155L980N048O168O740Q090J0335J1522J1527J2943J6495J9634K1457
56075H61098K4652L0540L6548M0903M5368N0944N5277N7071N8613O1034O1404
56064A383452N7623N2108M7622M3468L8788L5404L4072L1859K6516J9710J3158
56053A783780N686k911r479j2352j4451j8451k2992k6783l1806l8978m5135m8006
56041A518122m9757n2035n2183m8278m3261l9964l6546l1091k6104k4075k2870
56030A091958j9989j7113j6144j5075j2196r899r928r406o128l157l370m167k491
56017I62895l45k50O8L042N958N747M627N585O762N783N126P492J0344J0658J0624
$$ y = [642212, 649384, 657510, 665391, 673086, 681217, 688744, 694243, 698538, 703385, 708417, 712105, 714884, 718500, 723004, 727159, 731139, 736187, 742355, 749095, 757185, 767520, 779042, 790569, 803512, 820007, 839641, 861098, 885750, 916290, 952838, 993741, 1039109, 1090053, 1145330, 1202401, 1261014, 1322048, 1383452, 1441075, 1493183, 1540805, 1584273, 1623061, 1658465, 1692537, 1724396, 1750912, 1770622, 1783780, 1789466, 1786555, 1777076, 1764724, 1750273, 1731822, 1708830, 1682047, 1650241, 1611263, 1566128, 1518122, 1468365, 1416330, 1364147, 1315869, 1272608, 1232644, 1196098, 1165007, 1138903, 1114828, 1091958, 1071969, 1054856, 1038712, 1023637, 1011441, 1001542, 991614, 982208, 976080, 972923, 969553, 965386, 962895, 962550, 962300, 962368, 965410, 971368, 977115, 981742, 987327, 994089, 999872, 1004998, 1012490, 1022834, 1033492, 1044116]
56002A044116J3013J5405J4898J3896J5410J7244J6716J6290J8582K0766K0019
55991A226355J9344K1744K4088K3257K2667K5710K8550K6912K4309K5624K8127
55980A496687K7091K5014K6726L0298L1336L1484L4264L7324L7181L6785L9974
55969A854164M3596M3519M3049M6779N1675N3290N4795O0663O7367P0009P1912
55958B460818P7893Q4483Q7111R0085R8572J07645J10726J11908J18027J25734
55948C473002J28908J31525J39860J49269J52596J54566J63393J75281J82196
55939D850596J87817K00219K15810K26663K36575K53213K71722K83621K94554
55930G020790L15084L41382L63897L87246M21453M61182M94568N24840N61754
$$ y = [1044116, 1057129, 1072534, 1087432, 1101328, 1116738, 1133982, 1150698, 1166988, 1185570, 1206336, 1226355, 1245699, 1267443, 1291531, 1314788, 1337455, 1363165, 1391715, 1418627, 1442936, 1468560, 1496687, 1523778, 1548792, 1575518, 1605816, 1637152, 1668636, 1702900, 1740224, 1777405, 1814190, 1854164, 1897760, 1941279, 1984328, 2031107, 2082782, 2136072, 2190867, 2251530, 2318897, 2388906, 2460818, 2538711, 2623194, 2710305, 2800390, 2898962, 3006607, 3117333, 3229241, 3347268, 3473002, 3601910, 3733435, 3873295, 4022564, 4175160, 4329726, 4493119, 4668400, 4850596, 5038413, 5238632, 5454442, 5681105, 5917680, 6170893, 6442615, 6726236, 7020790, 7335874, 7677256, 8041153, 8428399, 8849852, 9311034, 9805602, 10330442, 10892196]
55921A0892196O00099O29908O59484P04012P59675Q14042Q72429R46731J028390
55912A7906966J102494J179229J279900J401528J528259J666556J832664K017310
55904B9914906K203637K409596K670189K990187L360372L804671M358101N015403
55896E6727062N762474O639577P704883Q961463J0403865J2098779J4100756J6323094
55888A38721953J8639144K1023440K3238335K4258726K2424076J6693945P847695
55881B72847314j793476r923143j5490102j8643025j9964221j9990393j9177615
55874A67865339j7903066j6390038j4740767j3058504j1464286j0017850q713405
55867G5577423p552951o558052n718041m992013m362918l839630l410034l040036
$$ y = [10892196, 11492295, 12122203, 12781687, 13485699, 14245374, 15059416, 15931845, 16878576, 17906966, 19009460, 20188689, 21468589, 22870117, 24398376, 26064932, 27897596, 29914906, 32118543, 34528139, 37198328, 40188515, 43548887, 47353558, 51711659, 56727062, 62489536, 69129113, 76833996, 85795459, 96199324, 108298103, 122398859, 138721953, 157361097, 178384537, 201622872, 225881598, 248305674, 264999619, 272847314, 271053838, 261130695, 245640593, 226997568, 207033347, 187042954, 167865339, 149962273, 133572235, 118831468, 105772964, 94308678, 84290828, 75577423, 68024472, 61466420, 55748379, 50756366, 46393448, 42553818, 39143784, 36103748]
55859C6103748k716326k447356k224679k022857j835457j675016j539394j411457
55851B0231206j289596j186644j100278j014293r27606q53849p93641p34122o74704
55842A1656473o27437n92339n56670n18387m87380m63768m37072m06829l82862
55833G183729l65091l43235l16719k95377k80347k63064k43394k30174k23282
55824D623046k13028j98242j87633j82258j73411j59311j47787j40811j31830
55815C088735j20037j12389j09603j04361r5315q9222q7558q4264p8468p6415
55805B131103p8926p9415p6156p4526p5414p3238o7137o2655o0605n5558m6969
55794A380504m0855l8739l5708l1028k9954l3221l5105l3804l3691l5642l5018
$$ y = [36103748, 33387422, 30940066, 28715387, 26692530, 24857073, 23182057, 21642663, 20231206, 18941610, 17754966, 16654688, 15640395, 14712789, 13858940, 13065299, 12331177, 11656473, 11029036, 10436697, 9880027, 9361640, 8874260, 8410492, 7973420, 7566591, 7183729, 6818638, 6475403, 6158684, 5863307, 5582960, 5319896, 5076502, 4846328, 4623046, 4410018, 4211776, 4024143, 3841885, 3668474, 3509163, 3361376, 3220565, 3088735, 2968698, 2856309, 2746706, 2642345, 2547030, 2457808, 2370250, 2285986, 2207518, 2131103, 2052177, 1972762, 1896606, 1822080, 1746666, 1673428, 1606291, 1543636, 1483031, 1427473, 1380504, 1339649, 1300910, 1265202, 1234174, 1204220, 1170999, 1135894, 1102090, 1068399, 1032757, 997739]
55783I97739l1026k8293k7516k4183j8222j5191j6032j5217j1125q849j0405j1374
55771G80306r668q955j0760j1589j0343j0559j2996j3779j2038j1754j4013j5102
55759F38750j3997j4126j5909j5332j1843r971j1060j1052q496p154q437q687
55747E02686o363m766n275m869k576j537k514k210o9J47k355l548k130j940m534
55732D58147o288n415n064o896q105p494p943j0183j0658q266o831q011q161n261
55718C53571k629k555k345j31J200n96l119m078m978o969p983p016o478p468p472
55703B90954n331l574l433k570l13J15k613n025m583l423l629l742k823k976m870
55688B42164n540l664k297l437m557l600k768m067n591n433n072n831n977m384
$$ y = [997739, 966713, 938420, 910904, 886721, 868499, 853308, 837276, 822059, 810934, 802085, 791680, 780306, 770638, 761683, 750923, 739334, 728991, 718432, 705436, 691657, 679619, 667865, 653852, 638750, 624753, 610627, 594718, 579386, 567543, 557572, 546512, 535460, 526964, 519810, 511373, 502686, 496323, 491557, 486282, 481413, 478837, 477300, 474786, 472576, 472507, 472654, 470299, 466751, 464621, 462681, 458147, 451859, 446444, 441380, 434484, 426379, 418885, 410942, 400759, 390101, 381835, 375004, 366993, 358832, 353571, 350942, 348387, 346042, 345911, 347111, 346515, 343396, 339318, 334340, 327371, 319388, 312372, 305894, 298426, 290954, 285623, 282049, 278616, 276046, 275733, 275848, 273235, 268210, 263627, 260204, 256575, 252833, 250010, 247034, 242164, 236624, 232960, 230663, 227226, 222669, 219069, 216301, 212234, 206643, 201210, 196138, 190307, 184330, 179946]
55674A79946k990k938k365n71j8j545k192n76K57j572l164k145q97j806k724j220
55658A53480P24L03j364j935j925k487k385o90O12K5n95L98J355Q25O08K106L215
55641A52270K183J031J647K127O11p67L03J902J328j60m1Q65O32K72J486K792
55625A68481K006L72L01J061N25p48r29n72j214k033j419k54k89r10o02l2n62
55608A63182j416j323j197k173k866j664K2m2j147j200m05k46l77L63J195P21
55592A51427k56r8P21P18J34nk15j371k525k458j988k438l229l345l444m237m517
55575A22874l330k212k724l615l191k502l310m612m403l230k911l126k432j391
55561G9885j546k355k111j062p32j034p38m6p0n54n19l35q62j442j031k71k95
$$ y = [179946, 176956, 174018, 171653, 171082, 171064, 169519, 167327, 166751, 167008, 165436, 162272, 160127, 159230, 157424, 154700, 153480, 154204, 154507, 153143, 151208, 149283, 146796, 144411, 143721, 144333, 144358, 143763, 144161, 145516, 146341, 146949, 149055, 152270, 154453, 155484, 157131, 159258, 159869, 159102, 159405, 161307, 162635, 162475, 162434, 163299, 163931, 164203, 165689, 168481, 170487, 170859, 171160, 172221, 172746, 171998, 171069, 170497, 169283, 167250, 165831, 165577, 165288, 164378, 163776, 163744, 163182, 161766, 160443, 159246, 157073, 154207, 152543, 152565, 152523, 151376, 150176, 149771, 149525, 149148, 149511, 150706, 151427, 151171, 151073, 151794, 152512, 152646, 152641, 152426, 151055, 148530, 146072, 144084, 141646, 138417, 135072, 131628, 127391, 122874, 119544, 117332, 114608, 110993, 107802, 105300, 101990, 97378, 92975, 89745, 86834, 83708, 81276, 79885, 78339, 75984, 73873, 72811, 72079, 71045, 70307, 70261, 70191, 69637, 69118, 68783, 67921, 66479, 65448, 65177, 64882]
55544F4882n40J1O35J37q15r39o78j058j472r23k38o71j517j370n78k20N1Q74
55526E5571J247J61j227j369r40j287j742j041j8j62p95l81N93O92L13O93J225
55509E1533N76o35r43p60j270j711o51J012J238J88m09m94j312k464k266p13N34
55492D1453P73O03J63o13o94O64K003J502k3m11L73P00L56M45Q24M53j76L56J701
55473E0452K183J561R65N39l92j231p48N17R10L84L02R42J388J473J587J208j40
55456F1900j166m91P08K79j396k110j444q61p69l14K00m15j713j998j189p68j064
55439D7389j102r07j399k171j934j060j129k079k331j612j098r03k4J275J613
55424C2528R62M67mj456l094k944j214j18k12J43J387J829Q35J5L62O86p2j217
$$ y = [64882, 64342, 64353, 64988, 65125, 64310, 63371, 62693, 61635, 60163, 59240, 59002, 58331, 56814, 55444, 54866, 54646, 54697, 55571, 56818, 56979, 55752, 54383, 53443, 52156, 50414, 49373, 49355, 49193, 48398, 48017, 48610, 49302, 49615, 50308, 51533, 52109, 51474, 50531, 49771, 48501, 46790, 46139, 47151, 48389, 48577, 48168, 47674, 46362, 43898, 41632, 40919, 41453, 42226, 42829, 42992, 42379, 41685, 42349, 44352, 45854, 45831, 45420, 45793, 46493, 46849, 47294, 48118, 48571, 48395, 48751, 50452, 52635, 54196, 55161, 55700, 55308, 54077, 53329, 53846, 54756, 55140, 55442, 56384, 57772, 59245, 60832, 62040, 61900, 60734, 60243, 60951, 61230, 59834, 57724, 56280, 55419, 54650, 54336, 54536, 54121, 52408, 50410, 49221, 48453, 47389, 46287, 45380, 43981, 41810, 39876, 38816, 37687, 35608, 33277, 31665, 30567, 29664, 29640, 30915, 32528, 33490, 33957, 33953, 32497, 29403, 26459, 25245, 25127, 24915, 25058, 26445, 28274, 29109, 29124, 29486, 30172, 30100, 28883]
55406B8883j868k144k057j149J32N84K02K45R12J005J70m75m03l99q42j047p31
55389B1018m24k04K47L69o20j883j777m67L95M31O75J094N06q64j301m64J52j1
55371A6872J66R94J247N95L46R94J331P84M20P82Q46N5o42n63l16k45J71Q19P20
55352B5376j09m66j47k59r13p95K46N50n40j436r40n9K7j94K1J69l30r21j008
55333A8272r25r48o47KK44o9j27K44J77n18q26l46J5j91j49N94J228J169R27R00
55313A9026P41L69J81p8j045k090j742j56P98L32l37l12j82k97J3P39Q12J56P9
55294A7007Q68J096K21l32K02N23l05j166j031p66j270j587o47P21J106N96Q5
55277A5321k92o70o38j08P0m69p36rQ41P00k03r97j285q46N35K075K221P30p52
$$ y = [28883, 27015, 24871, 22814, 21665, 21797, 22381, 22583, 22828, 23740, 24745, 24915, 24440, 24037, 23638, 22796, 21749, 21018, 20594, 20390, 20637, 21006, 20386, 18503, 16726, 16259, 16654, 17085, 17760, 18854, 19360, 18496, 17195, 16731, 16883, 16872, 17038, 18032, 19279, 19874, 20220, 21214, 22545, 23329, 23749, 24531, 25377, 25432, 24790, 24227, 23911, 23666, 23837, 24656, 25376, 25267, 24801, 24654, 24395, 23482, 22687, 22933, 23483, 22943, 21507, 20567, 20508, 20535, 20341, 20362, 20531, 20201, 19280, 18272, 17347, 16399, 15752, 15754, 15998, 15929, 15802, 16046, 16223, 15705, 14879, 14533, 14548, 14357, 14208, 14802, 16030, 17199, 18126, 19026, 19767, 20136, 20317, 20239, 19194, 17104, 15362, 15206, 16004, 16336, 15999, 15687, 15505, 15208, 15221, 15960, 16772, 16928, 17007, 17875, 18971, 19192, 18860, 19062, 19585, 19280, 18114, 17083, 16317, 15047, 13460, 12813, 13534, 14640, 15236, 15321, 15029, 14359, 13721, 13613, 13683, 13214, 12478, 12469, 13310, 14010, 13807, 12810, 11525, 10679, 11214, 13289, 15510, 16240, 15488]
55258A5488j005p09q56j167j035o37j42P37J574J182l67j265n48M55L63k36k66
55241A1566j18o34j420j558j003j56Q97J746J517K69o26m13K6q0j55L21P05N48
55223A1432N25R41Q74l1n04K50R78L08j078j680j293n63L05J053R30M7j07J099
55205A3486K108J534L70K39P39M36n47q41q4P97J097P82m6j018j427j150r01q75
55187A4699l21P75J077N8p37LJ227J228K29m00l55k22j5N09Q85P29N96Q17N57
55168B1339o74j715j507q98j067j348n86M96L20p53r14K05J094P21l22j042j049
55151A2300l77O21J212J084Q14R26J016O61L34M84N91J85j16K65O48K15n59q05
55133A9499o74o28k78O95J389R45J24K08J036J508J305P60j18j202j663j167p46
$$ y = [15488, 14483, 13774, 12918, 11751, 10716, 10079, 9937, 10674, 12248, 13430, 13063, 11798, 11250, 11705, 12068, 11832, 11566, 11448, 10814, 9394, 7836, 6833, 6677, 7574, 9320, 10837, 11106, 10480, 10067, 10093, 10013, 9858, 10179, 10884, 11432, 11957, 12898, 13772, 13741, 13237, 13487, 14465, 14773, 13695, 12015, 10722, 10159, 10464, 11517, 12447, 12494, 12387, 13486, 15594, 17128, 17498, 17737, 18476, 18912, 18365, 17524, 17440, 18237, 19334, 20116, 20070, 19052, 17625, 16475, 15574, 14699, 14378, 15153, 16230, 16288, 15551, 15554, 16781, 18009, 18238, 17838, 17483, 17261, 17246, 17755, 18640, 19369, 19965, 20782, 21339, 20665, 18950, 17443, 16545, 15478, 14130, 13544, 14040, 14360, 13607, 12693, 12898, 13992, 14713, 14391, 13349, 12300, 11923, 12544, 13756, 14840, 15654, 16580, 17596, 18257, 18591, 19075, 19666, 19851, 19735, 20000, 20648, 20863, 20304, 19499, 18825, 18197, 17919, 18614, 20003, 20948, 21072, 21280, 22316, 23824, 25129, 25889, 25771, 24569, 22906, 21739, 20993]
55116B0993j112j182J18J680J725N96O3M37M66k51p20l71J87L10o1p99j588j784
55098A8707j241p14n50P3J522K495J874O74M25P24K93n16m23K92K67m75p28m31
55080B2268n96j073n99P79J475Q37K0K5M62O77N88J69o24j164o96L75Q92O47M49
55061B4911O38P72P74R68J095N61l12n55n6L88M69O17R30J044R39Q02L47o04j290
55042C2438r27j15M7k97j96L17M89L94N97O66j85j193p54R96K110J581M54l8J54
55023C6538O74J325J545P10o10j034k61N84P02M34J63k99q99j096p16j90K47O26
55005C8443O73J44l52n3O09M80n80j570j795j330l51Q44J425R46K84L89O84J14
54987C9004q20q63l20n19j298j173J0P73N33L25O85Q48N53N90J061R33J1m74N6
$$ y = [20993, 19881, 18699, 18817, 20497, 22222, 22818, 22881, 23318, 23784, 23533, 22813, 22442, 22629, 22939, 22878, 22079, 20491, 18707, 17466, 16752, 16202, 16275, 17797, 20292, 22166, 22840, 23265, 23989, 24282, 23766, 23343, 23635, 23902, 23427, 22699, 22268, 21672, 20599, 20000, 20779, 22254, 23091, 23111, 23136, 23598, 24275, 24863, 25032, 24408, 23244, 22548, 22923, 23815, 24462, 24911, 25549, 26321, 27095, 28063, 29158, 29719, 29407, 28852, 28796, 29184, 29653, 30270, 31200, 32244, 33183, 33985, 34332, 33728, 32438, 31511, 31396, 31443, 31146, 30950, 31267, 31756, 32150, 32747, 33413, 33228, 32035, 31281, 32277, 34387, 35968, 36422, 36384, 36538, 37212, 38537, 40082, 40792, 40182, 39148, 38887, 39471, 40173, 40607, 40770, 40471, 39572, 38476, 37760, 37570, 37817, 38443, 39116, 39260, 38908, 38855, 39464, 39944, 39364, 37794, 35999, 34669, 34318, 35162, 36587, 37533, 37817, 38206, 38890, 39004, 38184, 37321, 37001, 36482, 35184, 34011, 34021, 34794, 35327, 35652, 36337, 37185, 37738, 38328, 39389, 40322, 40333, 39859, 39915]
54968C9915N68L17K8L28N23j42j207j812j718r60K94J230R80J56L38J685K568
54951D3091K106J383J404J522Q42k26q62j084j175r69n15l89o26m63K11L34n92
54934D3992j503j360o52l46m06l41l03o68j122j091n60J49Q27J250J209R99J148
54917D1222J410J033J38k60J27M82M56P25J480J792J241Q12J164J347L23j178
54901E2314j571m36J277K527K842K307J602J645K540L426L697L672L751L795L830
54886H7218M444N862P322P962P671O706N333M071L433K920J354j330l697m698
54872A34571m943n424o063o312o224o048n504m356l079k238j775j422j237j295
54858G8651j392j532j935k308j920p85J09K00P4L83J011J768K831L963M306L748
$$ y = [39915, 40483, 40800, 40828, 41156, 41679, 41537, 40330, 38518, 36800, 35840, 36134, 37364, 38344, 38500, 38838, 40523, 43091, 45197, 46580, 47984, 49506, 50348, 50122, 49260, 48176, 47001, 46032, 45517, 45128, 44502, 44039, 44250, 44584, 43992, 42489, 41129, 40477, 40131, 39725, 39384, 39081, 38413, 37291, 36200, 35640, 35789, 36616, 37866, 39075, 40074, 41222, 42632, 43665, 43803, 43543, 43670, 44152, 44608, 45333, 46813, 48605, 49846, 50658, 51822, 53169, 53492, 52314, 50743, 50307, 51584, 54111, 56953, 59260, 60862, 62507, 65047, 68473, 72170, 75842, 79593, 83388, 87218, 91662, 97524, 104846, 112808, 120479, 127185, 132518, 136589, 140022, 142942, 144296, 142966, 139269, 134571, 129628, 124204, 118141, 111829, 105605, 99557, 94053, 89697, 86618, 84380, 82605, 81183, 79946, 78651, 77259, 75727, 73792, 71484, 69564, 68779, 68888, 69088, 69162, 69545, 70556, 72324, 75155, 79118, 83424, 87172]
54842H7172L468M407N938O788O564N724M742L942L428K703J011j521l814n284
54828A25268o384p379p644o820n606m744m038l140k415k314k600k799k837k681
54814F3867k105j241o54n51o10p58j194j502r87j26k69j509k286j714q13p05j039
54797D5804j102j111j282r93L4Q10M82l67q65j204j761j977j277k47K94N26Q84
54780C6648R87M09l19n76o67r95j038l13N03N74J98J1k38r49j468r90M5O28O91
54761C3141Q48J204J483J718J841J320K52r6R80K232K138J143P94J318J646J346
54745E3308J010R58R74J108J523J785J448J072J522K533L140L240L573M405N312
54730H6911O125O966P587P628P362P223O876N679L779J843N2j699l065l661l848
$$ y = [87172, 90640, 95047, 100985, 107773, 114337, 120061, 124803, 128745, 132173, 134876, 135887, 134366, 130552, 125268, 118884, 111505, 103861, 97041, 91435, 86691, 82653, 79513, 77098, 74784, 72184, 69385, 66548, 63867, 61762, 60521, 59867, 59316, 58706, 57948, 56754, 55252, 54265, 54139, 53870, 52361, 50075, 48361, 47548, 46843, 45804, 44702, 43591, 42309, 41316, 41350, 42160, 42642, 42275, 41410, 40206, 38445, 36468, 35191, 34944, 35238, 35764, 36648, 37635, 38044, 37725, 37149, 36482, 35487, 34449, 34136, 34639, 35213, 35411, 35422, 35184, 34235, 32767, 31777, 31822, 32450, 33141, 33989, 35193, 36676, 38394, 40235, 41555, 41807, 41711, 42691, 44923, 47061, 48204, 48998, 50316, 51962, 53308, 54318, 55276, 56250, 57358, 58881, 60666, 62114, 63186, 64708, 67241, 70381, 73621, 77194, 81599, 86911, 93036, 100002, 107589, 115217, 122579, 129802, 136678, 142357, 146136, 147979, 148031, 146332, 143267, 139606, 135758]
54715A35758m146m334m099l991m566n051m211k256o17q1k68p57j379j667j187
54700I7148m58l60o85m43N44J432J791K117K815L667M471N276N962O327O631P233
54684A43468P821P799P300O907O563N638M021K245N72j158k871m221n220o081
54670A72783o562o285n560n127n201n501n990o682p035o435n237m363l997l578
54656I5230k948k538k472k396k201k117k116j954j727j633j359n65K36K23m00
54641G1263n87K9P29Q75O62N07M69M78N35N63N27O60J078J338R38J41l65l51j47
54622G9342K5J75K45K02K68O14J056J429J793J922J311J68l36M14J499J840J694
54605I3661J825J971J441O31O11J582K821L858M538M439L407K365K295K715K411
$$ y = [135758, 131612, 127278, 123179, 119188, 114622, 109571, 105360, 103104, 102487, 102406, 102138, 101381, 100002, 98335, 97148, 96690, 96330, 95645, 95202, 95746, 97178, 98969, 101086, 103901, 107568, 112039, 117315, 123277, 129604, 136235, 143468, 151289, 159088, 166388, 173295, 179858, 185496, 189517, 191762, 192334, 191176, 188305, 184084, 178864, 172783, 166221, 159936, 154376, 149249, 144048, 138547, 132557, 125875, 118840, 112405, 107168, 102805, 98808, 95230, 92282, 89744, 87272, 84876, 82675, 80558, 78442, 76488, 74761, 73128, 71769, 71204, 71440, 71663, 71263, 70676, 70705, 71434, 72309, 72971, 73478, 73947, 74425, 74960, 75523, 76050, 76710, 77788, 79126, 80064, 80205, 79840, 79489, 79342, 79367, 79542, 79787, 79989, 80257, 80871, 81927, 83356, 85149, 87071, 88382, 88550, 88214, 88628, 90127, 91967, 93661, 95486, 97457, 98898, 99529, 100140, 101722, 104543, 108401, 112939, 117378, 120785, 123150, 125445, 128160, 130571]
54590A30571J368O70O82O90L18N3K81Q18J405J792J582Q92P91J957L368L602L033
54573A53873L278M673N916O226O273O687O973O428N064L336J682M22n95k125m524
54558B03587o885q074q175p936p407o351n427n432n751n151l776k785k328j593
54544A26516o54m16p95p79l54m71j075j027l03k45j198j860j494j019j240j733
54528A11853k099k662l267l078k216j961k660l124k829k782l370l301j882n35
54514G6087o57j528j860j906k432k897k302j005j08K11L60J56o01j137o46K59
54498E9994M18q9l05r5j93p86j261j283j107r04n96k16J35N63J047J200Q58M79
54480E7859L78J55n04r65l99R47J996K112J604J156J261K001K994L711M029M167
$$ y = [130571, 131939, 132609, 133291, 133981, 134299, 134352, 134633, 135451, 136856, 138648, 140230, 141122, 141913, 143870, 147238, 150840, 153873, 157151, 161824, 167740, 173966, 180239, 186926, 193899, 200327, 205391, 208727, 210409, 210831, 210236, 208111, 203587, 196702, 188628, 180453, 172517, 165110, 158759, 153332, 147900, 142149, 136998, 133222, 130437, 128109, 126516, 125862, 125446, 124651, 123872, 123518, 123047, 121972, 120945, 120642, 120397, 119199, 117339, 115845, 114826, 113586, 111853, 109754, 107092, 103825, 100747, 98531, 96570, 93910, 90786, 87957, 85175, 81805, 78504, 76622, 76087, 75430, 73902, 72042, 70136, 67704, 64807, 62505, 61500, 61392, 61603, 61963, 62119, 61518, 60381, 59735, 59994, 60412, 60323, 60018, 59923, 59730, 58944, 57683, 56400, 55293, 54389, 53793, 53577, 53712, 54275, 55322, 56522, 57380, 57859, 58237, 58392, 57888, 56923, 56524, 57471, 59467, 61579, 63183, 64339, 65600, 67601, 70595, 74306, 78335, 82502]
54464H2502M030L308K257J645J675J801J798K062K494K185Q26n71j084j114j493
54449A02321k178k655k910l112l027k511k043j995k002j694j467j774k247k291
54435G0415j952j499p81K30Q72O15j07o21j010j561j832j258k53K57J59J02L42
54418F2118M44J36k55l40r4K00K10j47n30n32k30J4K29O82J027O07k60l98M86
54399F3367J240J020M41K65J78l11p45n98l45n76q70o86n75j192j840j386k30
54382E7157J40o58j521j553r23j11O14Q44K56o49q94l37J46r5p14r90o59K2N62
54363E0637N71J19l29n37p55j034q45O6R31Q75J95l0N94J401J673J345Q32O27
54345E6336R61J408J178K82j75N94J842K334K121K239K970L529L491L381L639
$$ y = [82502, 86532, 89840, 92097, 93742, 95417, 97218, 99016, 101078, 103572, 105757, 106583, 106012, 104928, 103814, 102321, 100143, 97488, 94578, 91466, 88439, 85928, 83885, 81890, 79888, 78194, 76727, 74953, 72706, 70415, 68463, 66964, 66183, 66413, 67285, 67900, 67793, 67172, 66162, 64601, 62769, 61511, 61258, 61515, 61674, 61776, 62118, 62562, 62698, 62443, 62103, 62009, 62209, 62419, 62272, 61742, 61210, 60980, 60994, 61223, 61905, 62932, 63539, 63279, 62881, 63367, 64607, 65627, 66068, 66333, 66511, 66200, 65455, 64857, 64512, 63936, 63066, 62380, 61805, 60613, 58773, 57387, 57157, 57297, 56639, 55118, 53565, 52642, 52531, 53145, 53989, 54245, 53596, 52702, 52365, 52511, 52416, 51702, 50712, 50053, 50075, 50637, 51208, 51327, 50998, 50461, 49706, 48672, 47827, 47893, 48824, 49699, 49894, 49864, 50458, 51859, 53532, 54877, 55709, 56336, 57297, 58705, 59883, 60165, 59990, 60584, 62426, 64760, 66881, 69120, 72090, 75619, 79110, 82491, 86130]
54330H6130L858L529K903K684L134L777L831K926J518M82J43j5m84j043j324j545
54314A10504k082k653k664k207k009k346k675k422j728j191j136j307j249r34
54300H3901r00j488k148j993j069l52l75n32j20N86Q50M72j61n67l56N74J607
54283G7929J826J167N98P69J240J492J769K319K652K374K086K484L189L335K878
54268A08107K420K143J774J268P86K53m02r34j309j986l098l916l879l494l466
54253I4267l536l197k790k959l433l431k904k407k120j902j858j981j683p01J25
54238E9490jn33n41l69r23j815j831j047p76j399j787j159j71K99K91K21J88J84
54220D8321K39J21m41j094j183p00j96J46M64N24O5l47J2O37L86n91r26k05M49
$$ y = [86130, 89988, 93517, 96420, 99104, 102238, 106015, 109846, 112772, 114290, 114772, 114915, 114900, 114416, 113373, 112049, 110504, 108422, 105769, 103105, 100898, 98889, 96543, 93868, 91446, 89718, 88527, 87391, 86084, 84835, 83901, 83001, 81513, 79365, 77372, 76303, 75951, 75576, 75044, 74924, 75510, 76360, 76832, 76671, 76104, 75748, 76322, 77929, 79755, 80922, 81520, 82289, 83529, 85021, 86790, 89109, 91761, 94135, 96221, 98705, 101894, 105229, 108107, 110527, 112670, 114444, 115712, 116498, 116751, 116349, 115415, 114106, 112120, 109022, 105106, 101227, 97733, 94267, 90731, 87534, 84744, 81785, 78352, 74921, 72017, 69610, 67490, 65588, 63730, 61749, 60066, 59365, 59490, 59489, 58956, 58415, 58046, 57123, 55308, 53477, 52430, 51654, 50255, 48468, 47309, 47138, 47437, 47728, 47949, 48137, 48321, 48560, 48681, 48240, 47146, 45963, 45263, 45067, 45213, 45677, 46201, 46266, 45919, 45931, 46568, 46954, 46363, 45437, 45232, 45681]
54201D5681L30K20P97J327Q93j28p55q08p43o81m97m05o10p43l54K92N16K80K86
54182D4898J010J964K171J259k1n44r2M41K83k25k94J38N08N46L41k13j197k028
54164D8945j925r73P3Q92J677K230J955R13p1n33p53q90n96J67P47O20o1r38j796
54145D9683k290k026j214n23j67K02N49L49l31n74J01R69J138O71J21l29p03p76
54127D4850m40j06j64l45j45M10Q36Q43N11%n70j052j309j248q39k20K23K22M
54108D1461LK17K81J22O6K66M36K60k12p03r05o42r9K20Q4j44q8O0J3O9O35J371
54086D2771J561J152O97M61L26L66P49J149J132R51J117J381J042J69n10q51j284
54069E2379j660j302l59J06k76o16k49L25M39J75j73o11r82r30o77r30j571j549
$$ y = [45681, 46011, 46231, 47028, 48355, 49248, 49120, 48365, 47557, 46814, 46133, 45636, 45231, 44621, 43878, 43524, 43816, 44332, 44612, 44898, 45908, 47872, 50043, 51302, 51281, 50737, 50645, 51086, 51369, 51144, 50850, 50988, 51496, 52042, 52383, 52170, 50973, 48945, 47020, 46047, 46120, 47012, 48689, 50919, 52874, 53787, 53716, 53183, 52430, 51540, 50944, 51111, 51858, 52478, 52417, 51479, 49683, 47393, 45367, 44153, 43630, 43463, 43665, 44214, 44563, 44232, 43658, 43759, 44728, 45866, 46537, 46658, 46329, 45626, 44850, 44410, 44304, 44140, 43795, 43650, 44060, 44896, 45739, 46250, 46250, 45680, 44628, 43319, 42071, 41232, 41012, 41235, 41457, 41461, 41464, 41681, 41962, 42084, 42150, 42416, 42852, 43112, 42900, 42197, 41292, 40650, 40551, 40771, 40855, 40711, 40623, 40683, 40696, 40765, 41400, 42771, 44332, 45484, 46181, 46642, 46968, 47334, 48083, 49232, 50364, 51315, 52432, 53813, 54855, 55024, 54514, 53663, 52379, 50719, 49417, 49058, 49164, 48888, 48272, 48023, 48348, 48787, 48962, 48789, 48178, 47196, 46266, 45589, 44659, 43088, 41539]
54051D1539n79K65L18M53J423K255J588j01j060o69OK3k95k33J96M61L19M0lK30
54031D6176M02K33j40l59k66Q1O91J471J868J322J02q85j201j203j216j109q42
54014D5125o58m99O3R85J563J400R17N26K1p19j145q00j06K39K45M29R22J368
53996D9876J493J350J085P39L13j28k94J77J100J621J191N36Q29K009K815K524
53980F7236J798J555J886K385K775K835K407J825J681J963K163K293K858L691
53966I9351L886L294K923L354L790L446K841K859L293L250K449J347M56J29N41
53951A37209J278J459Q17J04l2P7j12m96q14j247j862k111j643r43n05k2Q33J539
53933A33529J420P04M4m72j029j365j117n89l40m61q03j494k501l205l172k855
$$ y = [41539, 40960, 41225, 41543, 41996, 43419, 45674, 47262, 47161, 46101, 45432, 45438, 45461, 45166, 44933, 45129, 45590, 45909, 45949, 45946, 46176, 46578, 46811, 46671, 46312, 46046, 46127, 46818, 48289, 50157, 51479, 51581, 50696, 49495, 48292, 47076, 45967, 45125, 44467, 43968, 44031, 45016, 46579, 47979, 48896, 49422, 49443, 48724, 47579, 46779, 46673, 46912, 47157, 47586, 48508, 49876, 51369, 52719, 53804, 54543, 54856, 54728, 54434, 54611, 55711, 57332, 58523, 59059, 59888, 61897, 64712, 67236, 69034, 70589, 72475, 74860, 77635, 80470, 82877, 84702, 86383, 88346, 90509, 92802, 95660, 99351, 103237, 106531, 109454, 112808, 116598, 120044, 122885, 125744, 129037, 132287, 134736, 136083, 136539, 136668, 137209, 138487, 139946, 140763, 140867, 140835, 140912, 140800, 140304, 139490, 138243, 136381, 134270, 132627, 131684, 131179, 131157, 131990, 133529, 134949, 135653, 135697, 135225, 134196, 132831, 131714, 131125, 130785, 130324, 129521, 128027, 125526, 122321, 119149, 116294]
53917A16294k813k800k332j606j098o97j84L2m60j129j161p48p01j095j255r00
53901I7347m04l0L53Q23J358J938K239J612M7j280j286l50L96O52Q64J039R15
53884A06233R47J916L466M299L903L101K722K732K872L169L506L516L265L348
53870A48995L933M366M078L373K903K765K483J665M79m20m71J15N27L95L15Q95
53854A76396J694J840J407J305J848K345K272K082K458L363M158M371L956L136
53840B12631K186J331O28K4m97r15j222j325j049m84j46n57j655k800l346l151
53824A99653k721k759l391l937l732l132l148m148n445o190o030m918l135j649
53810A45318j487k435l172l026k622k471k133j351q56j160j646j787k179l184
$$ y = [116294, 113481, 110681, 108349, 106743, 105645, 104948, 104764, 104796, 104336, 103207, 102046, 101298, 100597, 99502, 98247, 97347, 96943, 96913, 97266, 98089, 99447, 101385, 103624, 105236, 105283, 104003, 102717, 102367, 102763, 103415, 104279, 105318, 106233, 107180, 109096, 112562, 116861, 120764, 123865, 126587, 129319, 132191, 135360, 138866, 142382, 145647, 148995, 152928, 157294, 161372, 164745, 167648, 170413, 172896, 174561, 175040, 174620, 174149, 174264, 174791, 175186, 175501, 176396, 178090, 179930, 181337, 182642, 184490, 186835, 189107, 191189, 193647, 197010, 201168, 205539, 209495, 212631, 214817, 216148, 216776, 216800, 216303, 215388, 214166, 212841, 211792, 211308, 211162, 210605, 208950, 206150, 202804, 199653, 196932, 194173, 190782, 186845, 183113, 179981, 176833, 172685, 167240, 161050, 155020, 150102, 146967, 145318, 143831, 141396, 138224, 135198, 132576, 130105, 127972, 126621, 125765, 124605, 122959, 121172, 118993, 115809]
53796A15809l669k577r03n88j825l042l194k674k116j675j501j710j868j528j134
53781H5805j415k008j913j050k97k8J40K90O9l35l09lj80p96r15j84P06J249J646
53762H0472J897J471L38o26p59l36K9O1l21r45j187n59M23Q36P10Q50J385J675
53744H5414J674K000K552K470J766J514J984K081J372J037J898K867K718K125
53730A13472K502L642M126L577K973K811K428J378L16K8L41M99K03j92l06k06
53714A37592k15m32o60p79r38j140j028m93j68o63j493j594q62l15n92j159j383
53697A23678j432j643j718j312q07q08j221j510j582j803k213k317j712n80M80
53682A03500R48P53K52j18j55J47O74J129J101N86J39J04O7l50o18JJ133J741
$$ y = [115809, 112140, 109563, 108660, 108072, 106247, 103205, 100011, 97337, 95221, 93546, 92045, 90335, 88467, 86939, 85805, 84390, 82382, 80469, 79419, 79122, 79094, 79234, 79524, 79593, 79258, 78949, 78946, 78766, 77970, 77055, 76871, 77577, 78826, 80472, 82369, 83840, 84178, 83552, 82793, 82457, 82486, 82547, 82226, 81281, 80094, 79535, 79958, 80794, 81504, 82354, 83739, 85414, 87088, 89088, 91640, 94110, 95876, 97390, 99374, 101455, 102827, 103864, 105762, 108629, 111347, 113472, 115974, 119616, 123742, 127319, 130292, 133103, 135531, 136909, 137225, 137253, 137594, 138093, 138296, 138104, 137798, 137592, 137377, 136945, 136285, 135506, 134568, 133428, 132400, 131907, 131739, 131076, 129583, 127989, 127127, 126812, 126220, 125061, 123678, 122246, 120603, 118885, 117573, 116766, 115958, 114737, 113227, 111645, 109842, 107629, 105312, 103600, 103020, 103500, 104448, 105201, 105453, 105335, 105180, 105327, 106001, 107130, 108231, 108817, 108956, 109060, 109127, 108777, 108159, 108160, 109293, 111034]
53664A11034J779K223L295L906L265K067J379J294J341J440J657J608R81L11M32
53649A38012J335K152K153J279j2j028j153l85N48R06O63L31K69N05R49J410J559
53632A49493J164L89k80l36M18J615K450K411J835J434J335J082N61K43L67N40
53616A64721M46L99Q44J693K478K820K520J558L31n09o44l11J69O92J132J260
53600A79599J178J270J583J664J270P65M71J20o94j771k483k497k077j705j627
53585A75066j688j536j065o24o44j176j937k542k549j669l00N84N78L62N33N69
53569A61962j30q27l70Q35J346R92J104K184L000K622J885J914K395K333J680
53554A82925J195J269J728K293K632K401J803J566K002K666L235L922M590M519
$$ y = [111034, 112813, 115036, 118331, 122237, 125502, 127569, 128948, 130242, 131583, 133023, 134680, 136288, 137269, 137580, 138012, 139347, 141499, 143652, 144931, 144919, 143891, 142738, 142353, 142901, 143807, 144470, 144801, 145070, 145575, 146524, 147934, 149493, 150657, 151046, 150766, 150430, 150848, 152463, 154913, 157324, 159159, 160593, 161928, 163010, 163571, 163814, 164181, 164721, 165167, 165566, 166410, 168103, 170581, 173401, 175921, 177479, 177810, 177301, 176657, 176346, 176515, 177207, 178339, 179599, 180777, 182047, 183630, 185294, 186564, 187329, 187800, 187920, 187226, 185455, 182972, 180475, 178398, 176693, 175066, 173378, 171842, 170777, 170153, 169509, 168333, 166396, 163854, 161305, 159636, 159336, 159920, 160498, 160860, 161393, 161962, 161832, 161005, 160635, 161470, 162816, 163808, 164912, 167096, 170096, 172718, 174603, 176517, 178912, 181245, 182925, 184120, 185389, 187117, 189410, 192042, 194443, 196246, 197812, 199814, 202480, 205715, 209637, 214227, 218746]
53540B18746L657L103L534M076L680K813K675L395M096M299M188L843L218K641
53526B67964K449K295J678Q91O52R71J228J194J183J212Q90J68m54n67k78N1J80
53509B81707J09P3K71M65K32k31j66N35Q74J81p00m63Q85K168K647K664K804L196
53491B97251L581L521K656J308O32J476L315M804N254N021M734M794N427O499
53477C50273P352P442P051O807O712O263N490N102N557O467P110P150O821O711
53463D42308P317Q497R474R631R142Q649Q578R082J0176J1531J2381J2239J1498
53450E70503J1028J1346J2445J4021J5522J6403J6774J7331J8282J8935J8819
53439G41409J8616J9133K0038K0411K0214K0223K0777K1527K2242K3014K3611
$$ y = [218746, 222403, 225506, 229040, 233116, 236796, 239609, 242284, 245679, 249775, 254074, 258262, 262105, 265323, 267964, 270413, 272708, 274386, 275277, 275929, 276900, 278128, 279322, 280505, 281717, 282607, 282775, 282321, 281754, 281476, 281527, 281707, 281816, 281889, 282160, 282625, 282857, 282626, 282460, 282995, 283869, 284050, 283350, 282887, 283772, 285940, 288587, 291251, 294055, 297251, 300832, 304353, 307009, 308317, 308949, 310425, 313740, 318544, 323798, 328819, 333553, 338347, 343774, 350273, 357625, 365067, 372118, 378925, 385637, 391900, 397390, 402492, 408049, 414516, 421626, 428776, 435597, 442308, 449625, 458122, 467596, 477227, 486369, 495018, 503596, 512678, 522854, 534385, 546766, 559005, 570503, 581531, 592877, 605322, 619343, 634865, 651268, 668042, 685373, 703655, 722590, 741409, 760025, 779158, 799196, 819607, 839821, 860044, 880821, 902348, 924590, 947604, 971215]
53428I71215K3529K2778K1977K1602K1620K1810K1956K1818K1346K0779K0155
53417A210585J9097J7569J6364J6130J6373J6175J5524J4987J4528J3647J2521
53406A383500J1768J1207R972P999O245N204M276K913J414J18j248k891m424n585
53392A430468o813q468j0065j0943j1257j1684j2476j3355j4169j5067j6069j6950
53380A283152j7560j7972j8295j8562j8839j9164j9349j8988j7899j6588j5978
53369A083958j6474j7321j7232j5664j3222j0813q859p419o572o283o219n984
53357I51896n323m043k169k90Q42J383K353M180O001O985P596Q800J0545J2003
53343A000759J2892J3629J4511J5583J7136J9406K1870K3685K4719K5531K6448
$$ y = [971215, 994744, 1017522, 1039499, 1061101, 1082721, 1104531, 1126487, 1148305, 1169651, 1190430, 1210585, 1229682, 1247251, 1263615, 1279745, 1296118, 1312293, 1327817, 1342804, 1357332, 1370979, 1383500, 1395268, 1406475, 1416447, 1424446, 1430691, 1435895, 1440171, 1443084, 1444498, 1444616, 1443368, 1440477, 1436053, 1430468, 1423655, 1415187, 1405122, 1394179, 1382922, 1371238, 1358762, 1345407, 1331238, 1316171, 1300102, 1283152, 1265592, 1247620, 1229325, 1210763, 1191924, 1172760, 1153411, 1134423, 1116524, 1099936, 1083958, 1067484, 1050163, 1032931, 1017267, 1004045, 993232, 984373, 976954, 970382, 964099, 957880, 951896, 946573, 942530, 940361, 940071, 940913, 942296, 944649, 948829, 954830, 961815, 969411, 978211, 988756, 1000759, 1013651, 1027280, 1041791, 1057374, 1074510, 1093916, 1115786, 1139471, 1164190, 1189721, 1216169]
53332A216169K7426K8593L0158L1895L3475L5105L7007L8562L8952L8569L8701
53321A594612L9755M0836M1163M0928M0538M0005L9431L9156L9046L8384L6927
53310B030781L5323L4053L2657L0497K7686K4763K1949J9159J6311J3260R759
53299B296198N828J841k031o085j0425j4437j7338j9177k0976k3764k7494l0958
53287B131182l2970l3647l4150l5103l5922l6048l6043l6693l7632l7908l7570
53276A737496l7460l7630l7163l5712l4106l3062l2345l1568l0941l0673l0363
53265A366473k9493k8091k6510k4989k3620k2322k0776j8826j6974j5814j5036
53254A124022j3748j1884j0426j0023j0210j0346j0337j0107r152p284n217l803
$$ y = [1216169, 1243595, 1272188, 1302346, 1334241, 1367716, 1402821, 1439828, 1478390, 1517342, 1555911, 1594612, 1634367, 1675203, 1716366, 1757294, 1797832, 1837837, 1877268, 1916424, 1955470, 1993854, 2030781, 2066104, 2100157, 2132814, 2163311, 2190997, 2215760, 2237709, 2256868, 2273179, 2286439, 2296198, 2302026, 2303867, 2301836, 2295751, 2285326, 2270889, 2253551, 2234374, 2213398, 2189634, 2162140, 2131182, 2098212, 2064565, 2030415, 1995312, 1959390, 1923342, 1887299, 1850606, 1812974, 1775066, 1737496, 1700036, 1662406, 1625243, 1589531, 1555425, 1522363, 1490018, 1458450, 1427509, 1396836, 1366473, 1336980, 1308889, 1282379, 1257390, 1233770, 1211448, 1190672, 1171846, 1154872, 1139058, 1124022, 1110274, 1098390, 1087964, 1077941, 1067731, 1057385, 1047048, 1036941, 1027789, 1020505, 1015288, 1011485]
53242A011485l125k668k046j094K30J770L224M508N708O722P421Q164R461J1093
53228A060853J2305J2953J3711J4979J6415J7725J9044K0324K1200K1770K2608
53217A253887K3616K3834K2884K1636K0917K0394J9424J8083J6737J5329J3800
53206A470541J2402J0953Q672N530K869J666J022n27k929n113o902q987j1232
53193A477965j2619j2930j3203j4226j5620j6807j7895j9116k0089k0251j9632
53182A295577j8801j8279j8235j8494j8694j8593j8301j8026j7702j7130j6393
53171A096929j5782j5351j4889j4370j3974j3648j3059j2118j1194j0611j0157
53160I51776r386q295p411p126p148o902o384o259o855p478p249o397o089o950
$$ y = [1011485, 1008360, 1005692, 1003646, 1002552, 1002782, 1004552, 1007776, 1012284, 1017992, 1024714, 1032135, 1040299, 1049760, 1060853, 1073158, 1086111, 1099822, 1114801, 1131216, 1148941, 1167985, 1188309, 1209509, 1231279, 1253887, 1277503, 1301337, 1324221, 1345857, 1366774, 1387168, 1406592, 1424675, 1441412, 1456741, 1470541, 1482943, 1493896, 1502568, 1508098, 1510967, 1512633, 1513655, 1513128, 1510199, 1505086, 1498184, 1489197, 1477965, 1465346, 1452416, 1439213, 1424987, 1409367, 1392560, 1374665, 1355549, 1335460, 1315209, 1295577, 1276776, 1258497, 1240262, 1221768, 1203074, 1184481, 1166180, 1148154, 1130452, 1113322, 1096929, 1081147, 1065796, 1050907, 1036537, 1022563, 1008915, 995856, 983738, 972544, 961933, 951776, 942390, 934095, 926684, 919558, 912410, 905508, 899124, 892865, 886010, 878532, 871283, 864886, 858797, 851847]
53146H51847q390r545j0214j0597j0724j0577j0383j0284j0044r494q912q606
53134G34077q455q302q392q964r652r896r784r887j0336j0608j0392j0114j0384
53121F08911j1160j1816j1892j1607j1471j1648j1901j2149j2600j3152j3077
53110D76438j1858j0136r186r417j0044j0225r891r362q831q570q901r572r708
53097C50737q848p632p000p097p423p607p518o976n947m910m491m684m849m461
53083B61294l617k835k575k897l465l886m026l914l498k798k154j880j714j200
53069B20835o12q65k233l811m519m225l490k726k015j379q24k81K19M83M29J54
53053A95140k99q28j037n92J16K99r6l01R5N79O68O52R77J526J927K017J649O55
$$ y = [851847, 843457, 833912, 823698, 813101, 802377, 791800, 781417, 771133, 761089, 751595, 742683, 734077, 725622, 717320, 708928, 699964, 690312, 680416, 670632, 660745, 650409, 639801, 629409, 619295, 608911, 597751, 585935, 574043, 562436, 550965, 539317, 527416, 515267, 502667, 489515, 476438, 464580, 454444, 445258, 435841, 425797, 415572, 405681, 396319, 387488, 378918, 370017, 360445, 350737, 341889, 334257, 327257, 320160, 312737, 305130, 297612, 290636, 284689, 279779, 275288, 270604, 265755, 261294, 257677, 254842, 252267, 249370, 245905, 242019, 237993, 234079, 230581, 227783, 225629, 223749, 222035, 220835, 220223, 219358, 217125, 213314, 208795, 204570, 201080, 198354, 196339, 194960, 194136, 193855, 194074, 194557, 194986, 195140, 194841, 194013, 192976, 192384, 192500, 192799, 192703, 192402, 192497, 193076, 193744, 194396, 195373, 196899, 198826, 200843, 202492, 203147]
53035B03147o02j373j546j794k366k625k354k427l354m117l625k565k546l807
53021A68046n017n173m521l621k645j786j443j651j975k156k361k663k805k618
53007A27611k282k007j804j641j545j539j661j997k495k819k620j907j024l45
52993A01925k9J17M25Q15O52l16j152p54M59R36K05n08k55L21L36P9J53K75L7
52974A03721l7N57J070N31o27j206j069r71j050q01l26k18l64j50K47Mq90j511
52956I6910j459j279j275j013k29P26J539K127K133J222l5n34q6M40N57O79J064
52939A01487J270J037P86Q37R35R30J025J142Q63L84N54J549K318K000J049M06
52923A18572K25M0k66m06k36J22M87P09P37P98J123J529J711J895K473L029K587
$$ y = [203147, 202545, 201172, 199626, 197832, 195466, 192841, 190487, 188060, 184706, 180589, 176964, 174399, 171853, 168046, 163029, 157856, 153335, 149714, 147069, 145283, 143840, 142189, 140214, 138058, 135697, 133034, 130229, 127611, 125329, 123322, 121518, 119877, 118332, 116793, 115132, 113135, 110640, 107821, 105201, 103294, 102270, 101925, 101896, 102013, 102438, 103253, 103905, 103589, 102437, 101683, 102142, 103078, 103283, 102775, 102520, 102841, 103177, 103256, 103409, 103684, 103721, 103684, 104241, 105311, 105842, 105215, 104009, 102940, 101969, 100919, 100118, 99792, 99574, 99210, 99060, 99307, 99311, 98421, 96910, 95451, 94172, 92897, 91884, 91655, 92381, 93920, 96047, 98180, 99402, 99367, 98833, 98747, 99187, 99744, 100423, 101487, 102757, 103794, 104580, 105417, 106352, 107282, 108307, 109449, 110312, 110696, 111250, 112799, 115117, 117117, 118166, 118572, 118797, 118837, 118571, 118165, 117929, 118051, 118538, 119247, 119984, 120782, 121905, 123434, 125145, 127040, 129513, 132542, 135129]
52906A35129J150K3K16J285K327L242M273M977M658L528K649K670L230L523L075
52891A75955J978P55J3j3M16Q56R87O16j90r25r67l63Pn92j842k749k731k123
52873A69088j633j560j608j374q89n27m58m99o05j027j754k160j731p94p6K06
52857A52599K98L33L77O94J288J471P24l25o26k77k98r87j546j456j108q47m02
52840A49912L11P74P17N76O83P27M77L29O18J030J100Q47N30L33M86J047J391
52823A61888O92p66j663j368o85m26k45L94J013Q14k2p03r51r40n85K37J080J355
52805A59119J206J189J293J028L33k80m43k19K15O52P56L94o3j99j75m03p50o45
52787A63008R9J032J646J810J645J342J148J282J778K534L357L947M080L907L799
$$ y = [135129, 136279, 136302, 136518, 137803, 140130, 143372, 147645, 152622, 157280, 160808, 163457, 166127, 169357, 172880, 175955, 177933, 178688, 178701, 178688, 179104, 179960, 180947, 181563, 181373, 180448, 179481, 179118, 179125, 178533, 176691, 173942, 171211, 169088, 167455, 165895, 164287, 162913, 162024, 161497, 161039, 160540, 159935, 158908, 157154, 154994, 153263, 152469, 152393, 152599, 152897, 153230, 153607, 154301, 155589, 157060, 157784, 157459, 156833, 156556, 156258, 155271, 153725, 152269, 151161, 150314, 149912, 150223, 150997, 151714, 152290, 152973, 153700, 154177, 154506, 155124, 156154, 157254, 158101, 158631, 158964, 159450, 160497, 161888, 162580, 161814, 160151, 158783, 158098, 157672, 157427, 157821, 158834, 159648, 159626, 158923, 157972, 157032, 156447, 156684, 157764, 159119, 160325, 161514, 162807, 163835, 164168, 163888, 163445, 163226, 163441, 164093, 164849, 165243, 165180, 164981, 164806, 164403, 163653, 163008, 163107, 164139, 165785, 167595, 169240, 170582, 171730, 173012, 174790, 177324, 180681, 184628, 188708, 192615, 196414]
52772A96414L751L419K819K457K393J828K06j704k544j995j061q62j639k820l668
52757A96994l824l589l547l778l701l036k431k616l281l436k763j954j643j654
52743A55741j547j458j938l056l967l628k067n91l83j071j311o84k01o25j261
52728A31953j079l07k3n65j310j780k030k036j581r04o28q78j077q13l41j0K39
52711A16830M76M41%m32l29K65Q11Q76M04m25j279j747j635j304j392k098k826
52694A06636k797j947j004o10o49o55o12q25j209j219p09k92n69j322j898k049
52678H8270k047k119k181k052j604q43o7J60m50j415j875j452n68L4o5o52j026
52661G0048n26Q10K080K280J204m09j626j979j595q67j20N35J075J350J135M80
$$ y = [196414, 200165, 203584, 206403, 208860, 211253, 213081, 213287, 211583, 209039, 207044, 205983, 205121, 203482, 200662, 196994, 193170, 189581, 186034, 182256, 178555, 175519, 173088, 170472, 167191, 163755, 160992, 159038, 157395, 155741, 154194, 152736, 150798, 147742, 143775, 140147, 138080, 137489, 137106, 136035, 134724, 134040, 133839, 133214, 131953, 130874, 130567, 130544, 129979, 128669, 126889, 124859, 122823, 121242, 120338, 119710, 118832, 117755, 116942, 116601, 116591, 116830, 117306, 117747, 117747, 117315, 116986, 117251, 118062, 118938, 119342, 118917, 117638, 115891, 114256, 112952, 111560, 109462, 106636, 103839, 101892, 100888, 100278, 99629, 98974, 98362, 97537, 96328, 95109, 94400, 94108, 93539, 92217, 90319, 88270, 86223, 84104, 81923, 79871, 78267, 77424, 77357, 77517, 77067, 75652, 73777, 72325, 71757, 71791, 71726, 71074, 70048, 69522, 70332, 72412, 74692, 75896, 75487, 73861, 71882, 70287, 69420, 69300, 69835, 70910, 72260, 73395, 73875]
52645G3875j88l92n9M78Q03P71N50M39N55P81J011J318J707J909J681J217R98
52628H7454J213J688K248K799L078K754J867Q18k2m64l79Q6K91l16j428k222k490
52611I6975k705l022k973k435j963j859j692j251j143j763k378k056r88j26J44
52596G0765Q3k18q48j385j158k61L91K78j49k76j27j08l54p12j088j456j693j620
52578F0064j288r86r04q71n45M0L84J62k26j32M48Q91Q79P79R23J037O74j07q16
52559F0406j046p29j18L35L28M4j23j38k59m16k12L55P32N86J28l91r27j168o07
52540E6780N91J462J455J040P67M41k22q00q02n09m82o54n70q6O61J561K189J828
52522F4650N02n54k36R91J874K040K061K199K087J566R25L57j51m71n40o91j171
$$ y = [73875, 73687, 73295, 73236, 73714, 74517, 75288, 75838, 76277, 76832, 77613, 78624, 79942, 81649, 83558, 85239, 86456, 87454, 88667, 90355, 92603, 95402, 98480, 101234, 103101, 103919, 103897, 103433, 103054, 103140, 103431, 103115, 101687, 99465, 96975, 94270, 91248, 88275, 85840, 83877, 82018, 80326, 79075, 77932, 76169, 73791, 71735, 70747, 70621, 70765, 70848, 70630, 69782, 68397, 67239, 66978, 67369, 67647, 67498, 67222, 67095, 66987, 66633, 65921, 64833, 63377, 61684, 60064, 58776, 57790, 56886, 56015, 55470, 55510, 55894, 56056, 55830, 55698, 56146, 57037, 57916, 58695, 59618, 60655, 61329, 61222, 60406, 59360, 58631, 58513, 58848, 59176, 59220, 59097, 58959, 58700, 58284, 58072, 58427, 59159, 59745, 59873, 59482, 58555, 57387, 56780, 57371, 58833, 60288, 61328, 62095, 62536, 62314, 61514, 60712, 60203, 59721, 59067, 58497, 58411, 59072, 60633, 62822, 64650, 65152, 64598, 64362, 65353, 67227, 69267, 71328, 73527, 75614, 77180, 78105, 78462, 78311, 77840, 77300, 76609, 75438]
52505G5438j536j208l83K55N38P35P83M44O1K66R81J445J325J020R25J015J154
52488H3258J222R60L31j54p6J78K1k65P5J018J818K109K066J619N72n07o50J37
52470I3732Q36R08Q15Q99P93L65J62M56P28N96M43O25Q16P20O58Q39P29p9r03
52451A04138o92N35J597J455J86j247j839j280j41O90Q35N93L42J27j64n37q64
52434A03734q86l53N38R93M80m24o61k8P12J006R70O89J4q11j122q23o38r84j329
52415A01077j079m60k3J95N04R54J311J346R24J49m30k53M60R37R90J192J729
52398A09523J889J190K23j77kK69M75O50N55Q0l43k82M5K13L24O89J122J185R30
52379A18558Q04R32J004P62K54k82m92j41M54N73no26o59k87j8J46M34O54N00
$$ y = [75438, 73902, 72694, 72311, 72566, 73104, 73839, 74622, 75066, 75127, 75393, 76374, 77819, 79144, 80164, 81089, 82104, 83258, 84480, 85440, 85771, 85617, 85541, 85719, 85740, 85475, 85550, 86568, 88386, 90495, 92561, 94180, 94752, 94245, 93595, 93732, 94568, 95476, 96291, 97190, 97983, 98348, 98510, 98966, 99694, 100290, 100733, 101358, 102174, 102894, 103552, 104391, 105120, 105041, 104138, 103446, 103981, 105578, 107033, 107219, 105972, 104133, 102853, 102712, 103402, 104237, 104830, 105172, 105299, 105135, 104598, 103734, 102848, 102495, 103033, 104026, 104506, 104082, 103421, 103393, 104105, 105111, 106081, 106770, 106784, 105973, 104851, 104028, 103390, 102406, 101077, 99998, 99538, 99515, 99710, 100214, 101168, 102479, 103825, 104749, 104898, 104468, 104215, 104675, 105612, 106602, 107794, 109523, 111412, 112602, 112825, 112648, 112646, 112915, 113390, 114040, 114595, 114675, 114332, 114050, 114095, 114308, 114632, 115321, 116443, 117628, 118558, 119362, 120294, 121298, 122060, 122314, 122032, 121540, 121399, 121853, 122426, 122421, 121795, 121136, 120849, 120831, 120977, 121411, 122065, 122565]
52360A22565K16J95J85l53j198j494r74l02j3J80P18J376J556J116N24L12O01
52343A25210J095J387J289R84Q63J187J908K710L212L245K933K467J842J076N01
52328A51909M91Q29Q40L05k37l56m23r48j717k101j986j770j611j254o65j88j2
52311A41106J23M19O04K76n45j438j999k076j701r53L9J030J641J577R45K78R2
52294A39418L87P63R64J145J533J981K080J676J131R41J183J554J815J985K059
52279A60615J958J858K202L037L702L588K952K528K486K423K251K396K988L455
52265A98439L269K599J946J535J381J565K097K704L155L533L955M216M062L734
52251B38190L887M865O259P258P454P267P423Q007Q330P967P560Q095R507J0714
$$ y = [122565, 122781, 122976, 123161, 122808, 121610, 120116, 119142, 118840, 118827, 119007, 119725, 121101, 122657, 123773, 124297, 124609, 125210, 126305, 127692, 128981, 129965, 130828, 132015, 133923, 136633, 139845, 143090, 146023, 148490, 150332, 151408, 151909, 152400, 153229, 154069, 154374, 154137, 153781, 153358, 152410, 150693, 148592, 146606, 144836, 143225, 141971, 141306, 141118, 141106, 141229, 141648, 142252, 142528, 141983, 140545, 138546, 136470, 134769, 133816, 133855, 134885, 136526, 138103, 139048, 139326, 139418, 139805, 140568, 141532, 142677, 144210, 146191, 148271, 149947, 151078, 152019, 153202, 154756, 156571, 158556, 160615, 162573, 164431, 166633, 169670, 173372, 176960, 179912, 182440, 184926, 187349, 189600, 191996, 194984, 198439, 201708, 204307, 206253, 207788, 209169, 210734, 212831, 215535, 218690, 222223, 226178, 230394, 234456, 238190, 242077, 246942, 253201, 260459, 267913, 275180, 282603, 290610, 298940, 306907, 314467, 322562, 332069, 342783]
52237C42783J1046J1003J1335J1968J2336J2324J2403J2938J3736J4304J4294
52226D80470J3756J3025J2390J1907J1536J1328J1239J1016J0530J0074R900R658
52214F16829Q846P696O969O883O945O853O826O838O361N224M028L284K740K060
52200F98382J549J610J921J850J357R37Q20Q25Q61J072J546K199K939L600L978
52185G25446M159M665N857P324Q269Q450Q422Q804R628J0520J1336J2307J3479
52172H38666J4179J3570J1775J0073R453R443Q862P389N722M389L415K936L172
52159I43044L541K974J419N1m59q52j927l227l933m211m676n176n148m783m885
52144I11752n707o705p310p271o588n734n658o729p955q043p032o066n666n230
$$ y = [342783, 353829, 364832, 376167, 388135, 400471, 412795, 425198, 438136, 451872, 466176, 480470, 494226, 507251, 519641, 531548, 543084, 554412, 565651, 576667, 587197, 597271, 607171, 616829, 625675, 633371, 640340, 647223, 654168, 661021, 667847, 674685, 681046, 686270, 690298, 693582, 696322, 698382, 699931, 701541, 703462, 705312, 706669, 707606, 708426, 709251, 710112, 711184, 712730, 714929, 717868, 721468, 725446, 729605, 734270, 740127, 747451, 755720, 764170, 772592, 781396, 791024, 801544, 812880, 825187, 838666, 852845, 866415, 878190, 888263, 897716, 907159, 916021, 923410, 929132, 933521, 936936, 939872, 943044, 946585, 949559, 950978, 951029, 950570, 949718, 947791, 944564, 940631, 936420, 931744, 926568, 921420, 916637, 911752, 906045, 899340, 892030, 884759, 878171, 872437, 866779, 860050, 852095, 844052, 837020, 830954, 825288, 820058]
52130H20058m285l298k874k854k714k364k106k037j917j620j456j886k914l878
52116G83855m057l480k780k303j792j081n64o70j332k269l319m140m171l404k648
52101G45845k521k627k372k114k620l733m428m199l525l027k841k886l107l227
52087G02618k825j891r56n95j005j977l000l465l122k328j598j094p85p46r13
52072F76318q37k00N84Q17M24p6l22m41p20j295k055k516k090q14N03J248J677
52055F70205K182K460K092J497J401J702J768J622J871K561L109L457M303N889
52041G06119P473Q307Q525Q711R169R927J0938J2019J2940J3774J4791J5895J6638
52028H55226J6795J6501J5827J4800J3870J3681J4138J4320J3553J2072J0485
$$ y = [820058, 815773, 812475, 809601, 806747, 804033, 801669, 799563, 797526, 795609, 793989, 792533, 790647, 787733, 783855, 779798, 776318, 773538, 771235, 769443, 768362, 767798, 767128, 765796, 763527, 760208, 756068, 751897, 748493, 745845, 743324, 740697, 738325, 736211, 733591, 729858, 725430, 721231, 717706, 714679, 711838, 708952, 705845, 702618, 699793, 697902, 696946, 696351, 695346, 693369, 690369, 686904, 683782, 681454, 679856, 678762, 677977, 677231, 676318, 675481, 675281, 675865, 676682, 677106, 677030, 676708, 676267, 675547, 674252, 672197, 669681, 667591, 666777, 667280, 668528, 670205, 672387, 674847, 676939, 678436, 679837, 681539, 683307, 684929, 686800, 689361, 692470, 695927, 700230, 706119, 713592, 721899, 730424, 739135, 748304, 758231, 769169, 781188, 794128, 807902, 822693, 838588, 855226, 872021, 888522, 904349, 919149, 933019, 946700, 960838, 975158, 988711, 1000783, 1011268]
52017A011268R029P682O441N256M082L139K726K510J606k94k360l533l735l747
52003A040070m201n037n743n844n357m854m989n747o452o575o232n671m782l447
51989I65139k093j341j183r77l46L53O50P02J039J737K302K481K655L173L604
51974I77895L251K209J315J082J227J338J359J226P30l3n75p72j153k094l220
51959I83785m031m576n112n635o171o954p911q559q870r487j0564j1240j1069
51946H83606j0998j1968j3342j3897j3743j3871j4402j4731j4990j5775j6638
51935G29251j6504j5608j5405j6261j6890j6489j5840j5696j5538j4863j4349
51924E55808j4677j5211j4918j3921j3079j2626j2169j1601j1134j0710j0149
$$ y = [1011268, 1020297, 1027979, 1034420, 1039676, 1043758, 1046897, 1049623, 1052133, 1053739, 1053445, 1051085, 1047552, 1043817, 1040070, 1035869, 1030832, 1025089, 1019245, 1013888, 1009034, 1004045, 998298, 991846, 985271, 979039, 973368, 968586, 965139, 963046, 961705, 960522, 959545, 959199, 959552, 960202, 960904, 961943, 963680, 965982, 968463, 971118, 974291, 977895, 981146, 983355, 984670, 985752, 986979, 988317, 989676, 990902, 991632, 991599, 991024, 990252, 989099, 987005, 983785, 979754, 975178, 970066, 964431, 958260, 951306, 943395, 934836, 925966, 916479, 905915, 894675, 883606, 872608, 860640, 847298, 833401, 819658, 805787, 791385, 776654, 761664, 745889, 729251, 712747, 697139, 681734, 665473, 648583, 632094, 616254, 600558, 585020, 570157, 555808, 541131, 525920, 511002, 497081, 484002, 471376, 459207, 447606, 436472, 425762, 415613]
51913D15613r642r499r591r527r130q415p413o398n835n717n391m444l403k976
51899C18232l052k985k561k109j819j568j316j274j611k283l103l792m054l821
51885B82884l335k968k992l502m261m744m579m017l568l357l154k990l052l095
51871B33270k597j696j207j495j935j829j266p27m04k55k85l47j01M69Q72P21
51855B21188K34k26o48j129j505j597j490j323j054q01r66j746k681l042k605
51840B00609j873j577j948k386k023q37Q1j64j082j492j118p13p53r45r86r09
51824A81884n55K98J144J069Q3p39p71n29n47n54k51J12M24J043J783J620K12
51807A85726j117q85P02K238K846K634J983J285R70R96P31r5p30l93O12J453J947
$$ y = [415613, 405971, 396472, 386881, 377354, 368224, 359809, 352396, 345998, 340163, 334446, 329055, 324611, 321208, 318232, 315180, 312195, 309634, 307525, 305706, 304138, 302822, 301548, 299937, 297654, 294551, 290759, 286705, 282884, 279549, 276581, 273589, 270087, 265826, 261082, 256503, 252486, 248918, 245561, 242407, 239417, 236365, 233270, 230673, 228977, 227770, 226275, 224340, 222511, 221245, 220518, 220114, 219859, 219574, 219227, 219126, 219595, 220467, 221188, 221422, 221196, 220548, 219419, 217914, 216317, 214827, 213504, 212450, 211649, 210683, 208937, 206256, 203214, 200609, 198736, 197159, 195211, 192825, 190802, 189965, 190046, 189882, 188800, 187308, 186190, 185477, 184724, 183779, 182793, 181884, 181329, 181627, 182771, 183840, 183923, 183184, 182413, 181884, 181337, 180783, 180532, 180644, 181068, 182111, 183894, 185514, 185726, 184609, 183724, 184426, 186664, 189510, 192144, 194127, 195412, 196382, 197378, 198109, 198014, 197284, 196891, 197503, 198956, 200903]
51790B00903K330K405J789P99J98L02R32J971L232M074L985L316K807K553K160
51775B33756J663J502J708J848J720J519J342J026N05j73j029j893k194j544l76
51760B39380M43N15Q6m94r77j182j161j202j338j218p64m92o65o96k7R03J285
51743B32396J158J139J338J351J168J153J266J076N69J58n4k94m61j54N36R86
51727B43331R34P61P70P63N31K86L06N26O66N52K21j57m02m19k10K55Q61J160
51709B50735Q45M66R62K216K843J976M99j91K7K96K84L40N57P12R48J529K029
51692B67073J748R31N87J082J741J964J908J894J896J868J906J921J712J431J446
51677B91108J661J658J495J633J987J891J286J143K184L798M763M720M432M707
$$ y = [200903, 203233, 205638, 207427, 208226, 208424, 208726, 209658, 211629, 214861, 218935, 222920, 226236, 229043, 231596, 233756, 235419, 236921, 238629, 240477, 242197, 243716, 245058, 246084, 246589, 246416, 245387, 243494, 241300, 239756, 239380, 239823, 240338, 240424, 239930, 238953, 237771, 236610, 235408, 234070, 232852, 232088, 231596, 230931, 230235, 230208, 231111, 232396, 233554, 234693, 236031, 237382, 238550, 239703, 240969, 242045, 242614, 242772, 242718, 242424, 241963, 241809, 242345, 243331, 244265, 245026, 245796, 246559, 247090, 247376, 247682, 248208, 248874, 249426, 249647, 249490, 249088, 248669, 248459, 248714, 249575, 250735, 251580, 252046, 253008, 255224, 258067, 260043, 260542, 260351, 260378, 260674, 260958, 261298, 261855, 262567, 263515, 265044, 267073, 268821, 269752, 270339, 271421, 273162, 275126, 277034, 278928, 280824, 282692, 284598, 286519, 288231, 289662, 291108, 292769, 294427, 295922, 297555, 299542, 301433, 302719, 303862, 306046, 309844, 314607, 319327, 323759, 328466]
51663C28466N472N981N750N210N173N682N698M250J576j221l340m635n112m799
51649C54151m082l618l716m195m770n240n434n337n170m985m462l500k714k768
51635B94160l432l899l860l652l500l280k895k376j656q10k90l56n55m07k78p33
51619B62181j299r40L10J253J138M14l92j348k387k860k441j712j220o69L47J390
51603B51765J719J389J085J026Q25M16M26J337K625L181K584J582J163J418J644
51588B74185J405R08L22n59j709k520k532k101j896k164k877m012n184n509m584
51573B41173l170k272j958j781j837k505l474l968l786l334k869k439k292k532
51559B02956k678k369k128k519k984k591j566q89o71k29L60K65n29j021p35k47
$$ y = [328466, 333938, 339919, 345669, 350879, 356052, 361734, 367432, 371682, 373258, 372037, 368697, 364062, 358950, 354151, 350069, 346451, 342735, 338540, 333770, 328530, 323096, 317759, 312589, 307604, 303142, 299642, 296928, 294160, 290728, 286829, 282969, 279317, 275817, 272537, 269642, 267266, 265610, 264800, 264510, 264154, 263599, 263192, 262914, 262181, 260882, 259942, 260252, 261505, 262643, 263057, 262665, 261317, 258930, 256070, 253629, 251917, 250697, 250028, 250375, 251765, 253484, 254873, 255958, 256984, 257809, 258225, 258651, 259988, 262613, 265794, 268378, 269960, 271123, 272541, 274185, 275590, 276498, 276820, 276261, 274552, 272032, 269500, 267399, 265503, 263339, 260462, 256450, 251266, 245757, 241173, 238003, 235731, 233773, 231992, 230155, 227650, 224176, 220208, 216422, 213088, 210219, 207780, 205488, 202956, 200278, 197909, 195781, 193262, 190278, 187687, 186121, 185232, 184561, 184332, 184692, 184957, 184428, 183407, 182672, 182425]
51543A82425O9M65Q23N27k69n09J52P87P74P36J277J891J844J212L84n79j392
51526A90617j273jJ434J982J804J817K471L450M183M197L516K908L150L995M551
51511B28801M695N093N698N548M448L550L578L682K888J638Q44L50n31j638k193
51496B66451k081j971k407l320m146m121k971j581j190j670j564l31P06M54j69
51481B40089L20J683K554K655K938L843M694M881M565M205M121M447M900M759
51467B90654L680K307J473J160Q47M80L85N25N94N73N67L31k88q40q14m74m24
51450C00736o47o21j46N18J173J724J962J821J594J529J535J633K073K578K239
51435C19701Q08o28j105j135j671k441k514k046k096k929l703l854l622l231k556
$$ y = [182425, 182494, 182959, 183782, 184309, 184040, 183531, 183683, 184470, 185244, 185980, 187257, 189148, 190992, 192204, 192588, 192009, 190617, 189344, 189343, 190777, 192759, 194563, 196380, 198851, 202301, 206484, 210681, 214197, 217105, 220255, 224250, 228801, 233496, 238589, 244287, 249835, 254283, 257833, 261411, 265093, 267981, 269619, 270463, 270813, 270282, 268644, 266451, 264370, 262399, 259992, 256672, 252526, 248405, 245434, 243853, 242663, 240993, 239429, 239098, 239804, 240258, 240089, 240409, 242092, 244646, 247301, 250239, 254082, 258776, 263657, 268222, 272427, 276548, 280995, 285895, 290654, 294334, 296641, 298114, 299274, 300121, 300601, 300986, 301511, 302105, 302678, 303245, 303576, 303288, 302448, 301634, 301160, 300736, 300089, 299468, 299322, 299840, 301013, 302737, 304699, 306520, 308114, 309643, 311178, 312811, 314884, 317462, 319701, 320509, 319881, 318776, 317641, 315970, 313529, 311015, 308969, 306873, 303944, 300241, 296387, 292765, 289534, 286978]
51420B86978j735j213j028p90m78m36n78m14M8K16j40m82k90L18Q67J054Q72O43
51402B83412Q08J378J752J539J219J464K173K776L126L372L362K988K851L636
51388C15856M961N759N633M989L939K220K79p29m34O4m26j782k913l122k761k716
51372C28817l436m348m430l490k452k081j924j206j55M26N49Q91J498J717J397
51357C11773J083R97P61K92p8m29j233k331k899k762k755l449m423n134n585n728
51341B78100n198m166l629m106m735m373l092j885j357j316j360j331j307j555
51327B38690k189k740k405j056M36J220J344J351J380J195P71L78J93J83K78M23
51311B39452N56O30O00L12l79j355k343l241m107m860n325n532n641n610n325
$$ y = [286978, 285243, 284030, 283002, 282212, 281734, 281298, 280720, 280306, 280354, 280570, 280430, 279948, 279658, 279976, 280843, 281897, 282769, 283412, 284220, 285598, 287350, 288889, 290108, 291572, 293745, 296521, 299647, 303019, 306381, 309369, 312220, 315856, 320817, 326576, 332209, 337198, 341137, 343357, 343636, 342907, 342473, 342537, 342111, 340329, 337416, 334294, 331533, 328817, 325381, 321033, 316603, 313113, 310661, 308580, 306656, 305450, 305295, 305721, 306270, 307161, 308659, 310376, 311773, 312856, 313853, 314614, 314906, 314828, 314399, 313166, 310835, 307936, 305174, 302419, 298970, 294547, 289413, 283828, 278100, 272902, 268736, 265107, 261001, 256266, 251893, 248801, 246916, 245559, 244243, 242883, 241552, 240245, 238690, 236501, 233761, 231356, 230300, 230736, 231956, 233300, 234651, 236031, 237226, 237997, 238375, 238568, 238751, 239029, 239452, 240008, 240638, 241238, 241550, 241171, 239816, 237473, 234232, 230125, 225265, 219940, 214408, 208767, 203157, 197832]
51296A97832m982m868m899m806m675m765m885m603l960l356k785k001j347j476
51282A44424k124k240j609j303j944k602k173j042m31p13j312j827k294k474j873
51267A18463n56P49J461J567J270P18J52j20l3K10M87P79R52P90L47o1k27j92
51249A26756L9O58J723K875L568L548L013K345J834J648J891K501L207L727L979
51234A63312L993L738L346L371M263N524N916M754K571K80j682l055l448l023
51220A89860k893l890n294n745n085m295l865l366k713k558l054l300k633j670
51206A39499j465k132k840k856k157j341j155j790k506k359j398o04n79r53j202
51191A14162j272j203q45l75l41p47q05j37M92K74m02n57j9N33O78O19O70R24
$$ y = [197832, 192850, 187982, 183083, 178277, 173602, 168837, 163952, 159349, 155389, 152033, 149248, 147247, 145900, 144424, 142300, 140060, 138451, 137148, 135204, 132602, 130429, 129387, 128956, 128243, 126931, 125104, 122810, 120336, 118463, 117907, 118656, 120117, 121684, 122954, 123672, 123824, 123704, 123671, 123881, 124368, 125147, 126099, 126889, 127236, 127175, 126948, 126756, 126795, 127453, 129176, 132051, 135619, 139167, 142180, 144525, 146359, 148007, 149898, 152399, 155606, 159333, 163312, 167305, 171043, 174389, 177760, 182023, 187547, 193463, 198217, 200788, 201068, 199386, 196331, 192883, 189860, 186967, 183077, 177783, 172038, 166953, 162658, 158793, 155427, 152714, 150156, 147102, 143802, 141169, 139499, 138034, 135902, 133062, 130206, 128049, 126708, 125553, 123763, 121257, 118898, 117500, 116896, 116317, 115364, 114162, 112890, 111687, 110842, 110467, 110126, 109379, 108574, 108437, 108929, 109203, 108801, 108244, 108225, 108758, 109436, 110055, 110725, 111649]
51173A11649J412J964K059J307J48m37j5Q55J245P71k13j028j254r90n76k03J51
51156A16845M41N47M63K86J2l07l83o3K04j27o90m99O25J615J504N73k38m94l33
51137A19981Q7N78P12K73k60j95M55R30N76m88j484j663j005k71j74n52p39o36
51119A16125p17r65o96J93O71o1j321j869j557j195j108q00q0M05R5n42n01M73
51101A06550J419J158k97j522j185M14J721J737R20J62l22p17q91n61J42P54R60
51084A10442O49j64j155j738j653j223q45m77j5L16K56p7m69q88j204j040l47
51067A00368K73K80l3L2O50J325J527J123M12j26l02m43p52n94P16K414K782J565
51049A11217O52J464K843K780J336L29O19J300J506J531J874K292K274J652N26
$$ y = [111649, 113061, 115025, 117084, 118391, 118539, 118102, 118087, 118942, 120187, 120958, 120745, 119717, 118463, 117473, 116897, 116694, 116845, 117286, 117833, 118296, 118582, 118594, 118287, 117904, 117841, 118045, 117918, 117228, 116729, 117354, 118969, 120473, 121046, 120808, 120314, 119981, 120068, 120646, 121358, 121631, 121371, 121176, 121631, 122561, 123137, 122649, 121165, 119502, 118497, 118226, 118052, 117500, 116761, 116125, 115408, 114443, 113747, 113940, 114611, 114550, 113229, 111360, 109803, 108608, 107500, 106700, 106620, 107025, 107120, 106578, 106077, 106550, 107969, 109127, 108830, 107308, 106123, 106537, 108258, 109995, 110915, 111077, 110755, 110038, 109147, 108586, 108728, 109482, 110442, 111091, 110927, 109772, 108034, 106381, 105158, 104313, 103836, 103821, 104137, 104393, 104316, 103847, 102959, 101755, 100715, 100368, 100641, 100921, 100888, 100920, 101570, 102895, 104422, 105545, 105957, 105831, 105529, 105086, 104334, 103740, 104456, 106870, 109652, 111217, 111869, 113333, 116176, 118956, 120292, 120621, 121240, 122540, 124046, 125577, 127451, 129743, 132017, 133669, 134195]
51034A34195p80j578j299l44K32Nm55n00j25K97M04q0j030j731j566q67m17k92
51016A24069K1M65M01j53l53J05M24K0n31m30J60N61O35O52N96K71j20j34K50
50997A26909O59R20J204J584J807J597R31K6q55j531j905j874j356n23J89N45
50981A28327Q13J247J527J241P16O99J181J314P55K90O53J418J756J792K349L461
50965A49539M111L670K817K569K806K511J354K51J02N50O13J65J4M98R23O96K55
50948A73444K98P66J239J778K524K854K021N50r7O66J988K985L721M410M686M386
50932B08219M265N024O095O309N576N052N632O918P961Q465Q871R558J0298J0672
50918C08915J0770J1233J2474J4080J5331J6192J7367J9295K1541K3380K4664
$$ y = [134195, 133415, 131837, 130538, 130194, 130426, 130431, 129976, 129476, 129351, 129648, 130052, 129972, 128942, 127211, 125645, 124778, 124361, 124069, 124090, 124555, 124956, 124803, 124450, 124555, 124979, 124999, 124468, 124038, 124198, 124759, 125394, 126046, 126642, 126913, 126793, 126659, 126909, 127568, 128488, 129692, 131276, 133083, 134680, 135611, 135637, 134782, 133251, 131346, 129472, 128116, 127593, 127782, 128327, 129140, 130387, 131914, 133155, 133871, 134570, 135751, 137065, 137820, 138110, 138763, 140181, 141937, 143729, 146078, 149539, 153650, 157320, 160137, 162706, 165512, 168023, 169377, 169628, 169730, 170280, 170893, 171058, 171072, 171570, 172493, 173189, 173444, 173742, 174508, 175747, 177525, 180049, 182903, 184924, 185474, 185377, 186043, 188031, 191016, 194737, 199147, 203833, 208219, 212484, 217508, 223603, 229912, 235488, 240540, 246172, 253090, 261051, 269516, 278387, 287945, 298243, 308915, 319685, 330918, 343392, 357472, 372803, 388995, 406362, 425657, 447198, 470578, 495242]
50907D95242K5780K7080K8734L0926L3780L6975L9798M1679M2681M3411M4439
50896H90525M5647M6126M4966M2241L8998L6096L3328K9954K5846K1622J7766
50885A273115J4164J0681P642N311L239P49k015m100m951n068n202n357n230n185
50871A277793o015p800r797j1637j3909j7127k0843k4254k7168k9790l2036l3749
50859A043668l5325l7267l9281m0445m0317l9292l7812l5901l3590l1265k9267
50848F43906k7489k5544k3115k0197j7294j5269j4550j4490j3978j2616j0828
50837D48536q864o531m039k343k085k692l027k574j633o82k8K49M39J070K222
50822D18018L179L293K991L336M614N901O281N965N919O666P903R135J0270J1426
$$ y = [495242, 521022, 548102, 576836, 607762, 641542, 678517, 718315, 759994, 802675, 846086, 890525, 936172, 982298, 1027264, 1069505, 1108503, 1144599, 1177927, 1207881, 1233727, 1255349, 1273115, 1287279, 1297960, 1305602, 1310913, 1314152, 1314901, 1312886, 1308786, 1303835, 1298767, 1293565, 1288208, 1282978, 1277793, 1271778, 1263978, 1254181, 1242544, 1228635, 1211508, 1190665, 1166411, 1139243, 1109453, 1077417, 1043668, 1008343, 971076, 931795, 891350, 851033, 811741, 773929, 738028, 704438, 673173, 643906, 616417, 590873, 567758, 547561, 530267, 514998, 500448, 485958, 471980, 459364, 448536, 439672, 433141, 429102, 426759, 424674, 421982, 418955, 416381, 414748, 414066, 414038, 414287, 414726, 415796, 418018, 421197, 424490, 427481, 430817, 435431, 441332, 447613, 453578, 459497, 466163, 474066, 483201, 493471, 504897]
50808E04897J2537J3423J4150J5025J6199J7508J8817K0293K2177K4404K6621
50797G06051K8572L0439L2771L6020M0042M4125M7725N1165N5265O0333O5905
50786A198413P1480P7005Q2420Q7337R1482R4984R7799R9378R9375R8191R6102
50775B193966R2313Q5727P6458O5773N4685M3446L2324K1911J2428L570m611j1316
50763B666674j5790j7986j8250j6908j4420j1449q558o233n307o687j0434j5680
50751B518972k1713k8555l6249m4299n2280o0334o8516p6104q2195q6573q9455
50740A872699r0777r0391q8679q6237q3083p8800p3435o7671o2052n6574n1185
50729A043815m6206m1926l8088l4132k9946k6035k2873k0273j7672j4972j2689
$$ y = [504897, 517434, 530857, 545007, 560032, 576231, 593739, 612556, 632849, 655026, 679430, 706051, 734623, 765062, 797833, 833853, 873895, 918020, 965745, 1016910, 1072175, 1132508, 1198413, 1269893, 1346898, 1429318, 1516655, 1608137, 1703121, 1800920, 1900298, 1999673, 2097864, 2193966, 2286279, 2372006, 2448464, 2514237, 2568922, 2612368, 2644692, 2666603, 2679031, 2682601, 2677990, 2666674, 2650884, 2632898, 2614648, 2597740, 2583320, 2571871, 2563313, 2557080, 2551773, 2545086, 2534652, 2518972, 2497259, 2468704, 2432455, 2388156, 2335876, 2275542, 2207026, 2130922, 2048727, 1962154, 1872699, 1781922, 1691531, 1602852, 1516615, 1433532, 1354732, 1281297, 1213626, 1151574, 1095000, 1043815, 997609, 955683, 917595, 883463, 853517, 827482, 804609, 784336, 766664, 751692, 739003]
50718G39003j1143r974q777p784p361p156o486n465m905n121n558n776n927o070
50704F41500n829n155m668m654m533l849l127k998l032k266n06J633L625N270
50690F11411O399P102Q081R922J2150J3752J4564J5408J6961J9185K1806K4612
50678G81353K7304K9660L1961L4549L7161L9392M1762M5222M9563N3365N5955
50667A227247N8243O1054O3641O4814O4644O3938O2499N9284N4192M8402M2648
50656A870606L6155K7835J7927P797j482r749j7154k3442k7905k9930k9568k7654
50644A793436k5217k2720k0097j7468j5407j4224j3433j2504j1882j2712j5548
50633A612224j9847k4777k9993l5394m0596m5107m8720n1469n3241n3802n3070
$$ y = [739003, 727860, 717886, 709109, 701325, 693964, 686808, 680322, 674857, 669952, 664831, 659273, 653497, 647570, 641500, 635671, 630516, 625848, 621194, 616661, 612812, 609685, 606687, 603655, 601389, 600883, 602516, 606141, 611411, 617810, 624912, 632993, 642915, 655065, 668817, 683381, 698789, 715750, 734935, 756741, 781353, 808657, 838317, 870278, 904827, 941988, 981380, 1023142, 1068364, 1117927, 1171292, 1227247, 1285490, 1346544, 1410185, 1474999, 1539643, 1603581, 1666080, 1725364, 1779556, 1827958, 1870606, 1906761, 1934596, 1952523, 1960320, 1958838, 1949089, 1931935, 1908493, 1880588, 1850658, 1821090, 1793436, 1768219, 1745499, 1725402, 1707934, 1692527, 1678303, 1664870, 1652366, 1640484, 1627772, 1612224, 1592377, 1567600, 1537607, 1502213, 1461617, 1416510, 1367790, 1316321, 1263080, 1209278, 1156208]
50622A156208n1176m8360m4930m1252l7559l3900l0350k7058k3915k0515j6694
50611G80499j2924r764p131m504j724Q03K664L894M879O059P656R424J0729J1159
$$ y = [1156208, 1105032, 1056672, 1011742, 970490, 932931, 899031, 868681, 841623, 817708, 797193, 780499, 767575, 757811, 750680, 746176, 744452, 745255, 747919, 751813, 756692, 762751, 770407, 779831, 790560, 801719]
$$ [...]
##END NTUPLES=NMR SPECTRUM
##END=
