
##TITLE=AC1148_Santa_5874936_UfhBCJFECV
##JCAMPDX= 6.0         $$ Bruker NMR JCAMP-DX V2.0
##DATA TYPE= NMR SPECTRUM
##DATA CLASS= NTUPLES
##ORIGIN= BRUKER
##OWNER= Administrator
$$ 1.72 TOPSPIN		Version 2.1
$$ 2012-03-31 20:50:09.406 -0500  Administrator@TOPSPIN
$$ Compression mode = diff/dup
##.OBSERVE FREQUENCY= 400.13188235
##.OBSERVE NUCLEUS= ^1H
##.ACQUISITION MODE= SIMULTANEOUS (DQD)
##.ACQUISITION SCHEME= undefined
##.AVERAGES= 8
##.DIGITISER RES= 22
##SPECTROMETER/DATA SYSTEM= spect
##.PULSE SEQUENCE= zg30
##.SOLVENT NAME= COFFEE_meoh
##.SHIFT REFERENCE= INTERNAL, COFFEE_meoh, 1, 14.98061
##AUDIT TRAIL= $$ (NUMBER, WHEN, WHO, WHERE, PROCESS, VERSION, WHAT)
$$ ##TITLE= Audit trail, TOPSPIN		Version 2.1
$$ ##JCAMPDX= 5.01
$$ ##ORIGIN= Bruker BioSpin GmbH
$$ ##OWNER= Administrator
$$ $$ C:\Bruker\TOPSPIN/data/COFFEE/nmr/AC1148_Santa_5874936_UfhBCJFECV/10/pdata/1/auditp.txt
$$ ##AUDIT TRAIL=  $$ (NUMBER, WHEN, WHO, WHERE, PROCESS, VERSION, WHAT)
(   1,<2012-03-31 20:50:00.203 -0500>,<Administrator>,<TOPSPIN>,<go>,<TOPSPIN 2.1>,
      <created by zg
	started at 2012-03-31 20:48:53.468 -0500,
	POWCHK enabled, PULCHK disabled,
       configuration hash MD5:
       1A 1E CE 29 27 FD 77 03 67 4E F0 E3 C4 B2 CB 90
       data hash MD5: 64K
       0E 18 E6 1D 8B F2 F2 D8 48 BB A3 DF 4F 13 8B 68>)
(   2,<2012-03-31 20:50:04.062 -0500>,<Administrator>,<TOPSPIN>,<proc1d>,<TOPSPIN 2.1>,
      <Start of raw data processing
       efp LB = 0 FT_mod = 6 PKNL = 1 PHC0 = 0 PHC1 = 0 SI = 32K 
       data hash MD5: 32K
       23 CC E4 4A 78 39 6B A4 46 7B C4 DF 7F E2 1A A8>)
(   3,<2012-03-31 20:50:04.453 -0500>,<Administrator>,<TOPSPIN>,<proc1d>,<TOPSPIN 2.1>,
      <pk PHC0 = 218.172 PHC1 = 0 
       data hash MD5: 32K
       70 6B 91 0F 65 A8 32 1E E5 86 BC D0 D5 07 83 DF>)
(   4,<2012-03-31 20:50:04.531 -0500>,<Administrator>,<TOPSPIN>,<proc1d>,<TOPSPIN 2.1>,
      <abs ABSG = 1 
       data hash MD5: 32K
       E1 7F 0B EF 2C 15 7A 7A F9 F8 DD C3 02 DE C5 A6>)
(   5,<2012-03-31 20:50:04.562 -0500>,<Administrator>,<TOPSPIN>,<proc1d>,<TOPSPIN 2.1>,
      <abs ABSG = 2 
       data hash MD5: 32K
       B0 78 24 AD 20 E6 EC A9 DF 58 BE 5D FF 2B 04 71>)
(   6,<2012-03-31 20:50:04.609 -0500>,<Administrator>,<TOPSPIN>,<proc1d>,<TOPSPIN 2.1>,
      <abs ABSG = 3 
       data hash MD5: 32K
       A7 68 23 29 28 1B E5 1D 85 0C 4E 6C 10 C2 6D 93>)
(   7,<2012-03-31 20:50:04.640 -0500>,<Administrator>,<TOPSPIN>,<proc1d>,<TOPSPIN 2.1>,
      <abs ABSG = 4 
       data hash MD5: 32K
       9F 6A 05 40 60 B6 4B 55 4D E2 BB EF 8A 4E F9 1D>)
(   8,<2012-03-31 20:50:04.687 -0500>,<Administrator>,<TOPSPIN>,<proc1d>,<TOPSPIN 2.1>,
      <abs ABSG = 5 
       data hash MD5: 32K
       5E E1 41 D0 12 F3 08 FC 3D 91 97 9D ED 90 BE C4>)
$$ ##END=
$$ 
$$ $$ hash MD5
$$ $$ CB B4 2C 07 42 45 B1 22 1D 5B C1 73 3A 2B E6 AE
##$RELAX= 
##$RELAX= 
##$RELAX= 
##$RELAX= 
##$RELAX= 
##$RELAX= 
##$RELAX= 
$$ Bruker specific parameters
$$ --------------------------
$$ [...]
##$TP= (0..7)
150 150 150 150 150 150 150 150
##$TP07= 0
##$TPNAME0= <>
##$TPNAME1= <>
##$TPNAME2= <>
##$TPNAME3= <>
##$TPNAME4= <>
##$TPNAME5= <>
##$TPNAME6= <>
##$TPNAME7= <>
##$TPOAL= (0..7)
0.5 0.5 0.5 0.5 0.5 0.5 0.5 0.5
##$TPOFFS= (0..7)
0 0 0 0 0 0 0 0
##$TUNHIN= 0
##$TUNHOUT= 0
##$TUNXOUT= 0
##$USERA1= <user>
##$USERA2= <user>
##$USERA3= <user>
##$USERA4= <user>
##$USERA5= <user>
##$V9= 5
##$VALIST= <valist>
##$VCLIST= <CCCCCCCCCCCCCCC>
##$VD= 0
##$VDLIST= <DDDDDDDDDDDDDDD>
##$VPLIST= <PPPPPPPPPPPPPPP>
##$VTLIST= <TTTTTTTTTTTTTTT>
##$WBST= 2048
##$WBSW= 25
##$XGAIN= (0..3)
0 0 0 0
##$XL= 0
##$YL= 0
##$YMAX_a= 531975
##$YMIN_a= -625326
##$ZGOPTNS= <>
##$ZL1= 120
##$ZL2= 120
##$ZL3= 120
##$ZL4= 120
##$ABSF1= 14.98061
##$ABSF2= -5.57192
##$ABSG= 5
##$ABSL= 3
##$ALPHA= 0
##$AQORDER= 0
##$ASSFAC= 0
##$ASSFACI= 0
##$ASSFACX= 0
##$ASSWID= 0
##$AUNMP= <proc_prof1d_extract_pilot.lims>
##$AXLEFT= 0
##$AXNAME= <>
##$AXNUC= <1H>
##$AXRIGHT= 0
##$AXTYPE= 0
##$AXUNIT= <>
##$AZFE= 0.1
##$AZFW= 0.1
##$BCFW= 0
##$BC_mod= 0
##$BYTORDP= 0
##$COROFFS= 0
##$CY= 15
##$DATMOD= 1
##$DC= 0
##$DFILT= <>
##$DTYPP= 0
##$F1P= 0
##$F2P= 0
##$FCOR= 0.5
##$FTSIZE= 32768
##$FT_mod= 6
##$GAMMA= 0
##$GB= 0
##$INTBC= 1
##$INTSCL= 1
##$ISEN= 128
##$LB= 0
##$LEV0= 0
##$LPBIN= 0
##$MAXI= 10000
##$MC2= 0
##$MEAN= 0
##$ME_mod= 0
##$MI= 0
##$NCOEF= 0
##$NC_proc= -8
##$NLEV= 6
##$NOISF1= 0
##$NOISF2= 0
##$NSP= 0
##$NTH_PI= 0
##$NZP= 0
##$OFFSET= 14.98061
##$PC= 1
##$PHC0= 218.172
##$PHC1= 0
##$PH_mod= 1
##$PKNL= yes
##$PPARMOD= 0
##$PPDIAG= 0
##$PPIPTYP= 0
##$PPMPNUM= 2147483647
##$PPRESOL= 1
##$PSCAL= 4
##$PSIGN= 0
##$PYNMP= <proc.py>
##$REVERSE= no
##$SF= 400.13
##$SI= 32768
##$SIGF1= 0
##$SIGF2= 0
##$SINO= 400
##$SIOLD= 32768
##$SPECTYP= <>
##$SREGLST= <1H.CDCl3>
##$SSB= 0
##$STSI= 32768
##$STSR= 0
##$SW_p= 8223.68421052632
##$SYMM= 0
##$S_DEV= 0
##$TDeff= 65536
##$TDoff= 0
##$TI= <>
##$TILT= no
##$TM1= 0
##$TM2= 0
##$TOPLEV= 0
##$USERP1= <user>
##$USERP2= <user>
##$USERP3= <user>
##$USERP4= <user>
##$USERP5= <user>
##$WDW= 1
##$XDIM= 32768
##$YMAX_p= 478412205
##$YMIN_p= -753041
##$CURPLOT= <Network HP LaserJet P1505>
##$CURPRIN= <$Network HP LaserJet P1505>
##$DFORMAT= <normdp>
##$LAYOUT= <+/1D_H.xwp>
##$LFORMAT= <normlp>
##$PFORMAT= <normpl>
##$SURQMSG= 1
$$ End of Bruker specific parameters
$$ ---------------------------------
##NTUPLES= NMR SPECTRUM
##VAR_NAME=  FREQUENCY,     SPECTRUM/REAL,   SPECTRUM/IMAG
##SYMBOL=    X,             R,               I
##VAR_TYPE=  INDEPENDENT,   DEPENDENT,       DEPENDENT
##VAR_FORM=  AFFN,          ASDF,            ASDF
##VAR_DIM=   32768,         32768,           32768
##UNITS=     HZ,            ARBITRARY UNITS, ARBITRARY UNITS
##FACTOR=    0.250966925370066, 1,           1
##FIRST=     8223.43324360095, -29318,       -78939
##LAST=      0,             -61958,          -68502
##MIN=       0,             -753041,         0
##MAX=       8223.43324360095, 478412205,    0
$$ Real data points
##PAGE= N=1
##DATA TABLE= (X++(R..R)), XYDATA
$$ [...]
19465a40373d778k53540a26211k46599g7878r3802G3309J43980h9317F4797a2987
19453c23693L1283J07338E67627k80951b71519k6602d4033j07276B63964a11213
19442b21658A18919J651c98479A26831a42358b0846j30574O3053p0818A7446d2591
19430b61558l1312L9337a5488k15881C8157k511a74379j84407a50985j27931J10396
19419a68520A80232g4745A36457l2605k5789B6579b64006M7248k33506a70036
19408c45158J59873C15092C4480a96598A0447e0041l6461l06355J42976b2496
19397G750m34J57029C1462J80159b22421P2217O286l7673k40856A06386a29750
19385A83479d68582J70035l5253O5686D9587J12214a68753B3652J22491o0048
$$ y = [-140373, -4778, -258318, -126211, -372810, -77878, -171680, 73309, 217289, -89317, 64797, -12987, -323693, -292410, -185072, 567627, 286676, -271519, -298121, -44033, -151309, 263964, -111213, -221658, 118919, 120570, -398479, 126831, -142358, -20846, -151420, -88367, -159185, 17446, -42591, -261558, -292870, -253533, -15488, -231369, 38157, 35646, -174379, -358786, -150985, -278916, -168520, 180232, -74745, 136457, 103852, 78063, 26579, -264006, -216758, -450264, -170036, -345158, -185285, 315092, 34480, -196598, 10447, -50041, -86502, -392857, -249881, -22496, 7750, 7316, 164345, 31462, 211621, -222421, -150204, -143918, -181591, -422447, 106386, -129750, 183479, -468582, -298547, -333800, -268114, 49587, 161801, -168753, 23652, 146143, 86095]
19375H6095b65841A11160a15490j89852F8788R2148A1066k976c44015F0236b8163
19363c03105P7910B30681b03149e8992A60997b27163c3862J4157j5288k13587
19353b48580k2814Q8520B01819E9731a90856F9899g8935j44752A03127J7881d31144
19341c50077a07930K5398m9738L6549J5534k00438A05306B6699I888a67165j23143
19330b90308j89118B10656D3859a70595P7878G4514J78287k71b80486Q7169J4549
19319a78768f8248p3666c7192F5186a10195j00520a01858F2506f8329E7395J06862
19308A64257e7663m0348C20478F209Q2981a60660e4739O200D5488a49627D1214
19296h0927C45957e6557m6139A38721c26793A58502b51311P3480A39337J6967
$$ y = [86095, -265841, 111160, -115490, -305342, 68788, 160936, 11066, 8090, -344015, 60236, -28163, -303105, -225195, 230681, -203149, -58992, 160997, -227163, -33862, -19705, -34993, -248580, -271394, -182874, 201819, 59731, -190856, 69899, -78935, -223687, 103127, 121008, -431144, -350077, -107930, -82532, -132270, -95721, -80187, -280625, 105306, 26699, 9888, -167165, -290308, -479426, 210656, 43859, -170595, -92717, 74514, 252801, 252530, -280486, -193317, -178768, -68248, -141914, -37192, 65186, -110195, -210715, -101858, 62506, -68329, 57395, 164257, -57663, -98011, 320478, 6209, 89190, -160660, -54739, -48539, 45488, -149627, 41214, -80927, 345957, -56557, -102696, 138721, -326793, 158502, -251311, -177831, 139337, 156304]
19286A56304F790d3522k19244A07373b59372q1145h9260d3644l6514k99918H586
19274B10619h1572A45155a6367j02326L3605H286d8635j1529o4998E4518a25503
19262B434a05382m4057A63377d42800a0958B93506a4070A37305c07646C55224
19251C3402R488O3807c26961O2636M118r1482E9157L6051D5022a54464j77667
19240c32131N6475J10720N1000j66062a07131a9976D3424g7397A47843i7116H1216
19228B7040g0803A33747m5105a83790j71777B51695p9481O993e9378k57978D2121
19216i6868j69827O3812A35235d125A56893h091m5176n4992A55787D8484a58908
19204c55610G8665K4888C8458f4725I0718m5077b82812O7866e3321K3748m3451
$$ y = [156304, 6790, -43522, -262766, 107373, -259372, -340517, -89260, -43644, -80158, -380076, 8586, 210619, -81572, 145155, -16367, -118693, -85088, 8286, -48635, -60164, -125162, 54518, -125503, 2434, -105382, -149439, 163377, -442800, -10958, 293506, -14070, 137305, -307646, 355224, 33402, 42890, 106697, -326961, -264325, -260207, -351689, 59157, 95208, 45022, -154464, -332131, -275656, -164936, -113936, -279998, -107131, -19976, 43424, -77397, 147843, -97116, 81216, 27040, -70803, 133747, 88642, -183790, -355567, 251695, 172214, 179207, -59378, -317356, 42121, -96868, -266695, -202883, 135235, -4125, 156893, -8091, -53267, -108259, 155787, 48484, -158908, -355610, 78665, 103553, 38458, -64725, 90718, 45641, -282812, -214946, -53321, -29573, -73024]
19193g3024b1350A89873p4674J8453m8678a52526A69499D226i7422n3614A70938
19181d08348i2653k6627p4453f6858r2182k54578a64907e8344p2476K3225F1929
19169C2620a48314e30j08277J6349A65909a56032b5547k88323N4796a11845A49851
19157H7436A2242e1357G6067b47391R1633c2234j33500A61264c93367G8926a03786
19145h4831B37637b05332O8101N917D3550A3855J74636b01711q363f6569r2648
19134a59217j29210P3306e8795A16422J04935b24063c8215o0518j78498C6702
19123b04868C8340a51289A09859j2307f5165c0123a4001B83c86591a21997I8849
19111b3681j57787E5026c5771j07979H8205d23147F6292a79012C8141O5880D0813
$$ y = [-73024, -21350, 189873, 115199, 133652, 84974, -152526, 169499, 4226, -97422, -151036, 170938, -408348, -92653, -119280, -193733, -66858, -159040, -413618, -164907, -58344, -130820, -107595, 61929, 32620, -148314, -530, -108807, -92458, 165909, -156032, -25547, -313870, -259074, -111845, 149851, 87436, 12242, -51357, 76067, -247391, -155758, -32234, -165734, 161264, -393367, 78926, -103786, -84831, 237637, -205332, -137231, -131314, 43550, 13855, 188491, -201711, -210074, -66569, -159217, -288427, -215121, -58795, 116422, 221357, -224063, -38215, -98733, -277231, 36702, -204868, 38340, -151289, 109859, 97552, -65165, -30123, -14001, 283, -386591, -121997, 98849, -23681, -181468, 55026, -35771, -143750, 88205, -423147, 66292, -179012, 38141, 104021, 40813]
19099a60168O3862k95002C76526A81680j0836b18451L4877D08649D4599b07859
19088F8629f5165k53131a15837B5925f5258A70320p5543N5941E8520p553i6120
19076d29561a60170O6582A18504a84999f1996j65359g000j26244L6051k11264
19066c08457h9506k23012a54366j60412i5563M5205q2439A21444J96788G6902
19055a03841A51077J24804a39552b1323m5764r8014O1578m0311j32653A76312
19044D26387c82965a75039n3977C11303a69596B1214O6026C1332a47236o7430
19034b14666A43623e4300C2404O167f817j36922p4960j8607O9362b093j18550
19023a20643e0588h643H2416D1134a05722a5289o3657k30384h4503l2657l6390
$$ y = [-160168, -96306, -391308, 376526, 181680, 170844, -218451, -183574, 408649, 44599, -207859, 68629, -65165, -318296, -115837, 25925, -65258, 170320, 94777, 150718, 58520, 50967, -96120, -429561, -160170, -93588, 118504, -184999, -61996, -227355, -7000, -133244, -97193, -308457, -89506, -312518, -154366, -314778, -95563, -50358, -132797, 121444, 318232, 76902, -103841, 151077, 275881, -139552, -21323, -67087, -165101, -103523, -143834, -276487, 176312, 426387, -382965, -175039, -229016, 311303, -169596, 21214, 87240, 31332, -147236, -214666, 143623, -54300, 32404, 38571, -6817, -143739, -218699, -237306, -167944, -2093, -120643, -50588, -8643, 82416, 41134, -105722, -15289, -78946, -309330, -84503, -117160, -153550]
19012a53550D14844c44948d6014q9245B8652f5842K4282k48951B10031a78861
19001c28763A30849h3092J4571m0791F4208a29710A01996C7067P5419J13302b19050
18989a71004N0241B99521b46991B573f7973O499A43132c01912a42180O5638D05050
18977D839a92171B96576b80712p5765A14866K3703b3283j20527G4069a92399G0849
18965f2378j49177E1921N0238K1509J9181J29447J93419O7837j44303A40800A4529
18953b53641C57304h7493M0974H2296O0754L3345b93798D1826c07840B3615K2691
18942D6306b1164j7161l63108C9606a83850C8440N6114L5851F80b44836P8556
18931a66280e7832K0432D8201a03499n3029o0624A73544b54471P0202D878a21062
$$ y = [-153550, 414844, -344948, -46014, -135259, 28652, -65842, -41560, -290511, 210031, -178861, -328763, 130849, -83092, -68521, -109312, 64208, -129710, 101996, 37067, 112486, 225788, -219050, -171004, -120763, 299521, -246991, 2573, -67973, -61474, 143132, -301912, -142180, -76542, 405050, 4839, -192171, 296576, -280712, -356477, 114866, 138569, -23283, -143810, 74069, -192399, 70849, -62378, -211555, 51921, 102159, 123668, 142849, 272296, 465715, 533552, 389249, 140800, 14529, -253641, 357304, -87493, -46519, 82296, 143050, 176395, -293798, 41826, -307840, 23615, 46306, -21164, -38325, -401433, 39606, -183850, 38440, 94554, 130405, 680, -244836, -166280, -57832, -37400, 48201, -103499, -156528, -217152, 173544, -254471, -184269, 4878, -121062]
18919d6017A43592C0081b80397B3527K16233i98A99239a23868J9661C96931a2136
18907A75043b60539D6758f2912d985q985l96k17833j14343D54924B12137m4064
18896A68073j3463J48186M90873l01986j74242c22515C08548c72703h2692K3101
18886e9591r5337g2924G9497b25817Q8536F6540c95645A78049b87785C0270b48073
18874B80900g2992L1940j52860A6789h4109I4275j4559J26185d00268I0006d7139
18862a77833n4753i2762j16178C2128a86988r3656d6548j71247Q0438A35691C01
18850B19052a32832i781D7910J20665a01839D608P494K98164I0026b65832d1955
18838g9903j33173G7740k3161M9605h6072B13478g5701j09473k4863K898B52129
$$ y = [-46017, 143592, 30081, -280397, 23527, 239760, -998, 199239, -123868, -104207, 396931, -12136, 175043, -260539, 46758, -62912, -4985, -13970, -14366, -232199, -346542, 454924, 212137, 168073, 154610, 302796, 793669, 491683, 317441, -322515, 308548, -372703, -82692, -59591, -154928, -72924, 79497, -225817, -137281, 66540, -395645, 178049, -287785, 30270, -248073, 280900, -72992, -41052, -193912, 16789, -84109, 94275, 79716, 205901, -400268, 90006, -47139, -177833, -232586, -92762, -208940, 32128, -186988, -280644, -46548, -217795, -137357, 135691, 301, 219052, -132832, -9781, 47910, 168575, -101839, 4608, 12102, 310266, 90026, -265832, -41955, -79903, -213076, 77740, 54579, 104184, -86072, 213478, -75701, -185174, -210037, -207139, 252129]
18826g4236R062A53768K7008h8815a9481n2330b9894l59258J85674e7168D3061
18814b32415R6875p7427f1869a1669I7185a84491A33320L766a14138d8411j06395
18803a54806A90993L32578k37899b67927A28076a43978A35410b91358A23887K71883
18793C95770G1493J75881N1596A04010g1121l06554C8356L1723J06172J0411a70531
18781B90366m5692d3865k18603J8623R0497C4853c622E4115j2858i4663J9185
18770g5478B20346d9188l21128A69974a52537k2010H7287A5926e6612l58630A52397
18758B13072c0045I5116C8311K93380b63579j24272a59584n2195A9067R6605Q9192
18747B04864C1381p90J35391a95049J0899G0161e0143b855j43175j31997A6378
$$ y = [-74236, -65174, 153768, 180776, -88815, -19481, -71811, -29894, -389152, -203478, -57168, 43061, -232415, -135540, -212967, -61869, -11669, 97185, -184491, 133320, 137086, -114138, -48411, -154806, 190993, 523571, 285672, -267927, 128076, -143978, 135410, -291358, 123887, 395770, 71493, 247374, 298970, 104010, -71121, -377675, 38356, 70079, 176251, 186662, -170531, 290366, 244674, -43865, -262468, -243845, -153348, 34853, -3622, 54115, 41257, -94663, -75478, 220346, -49188, -370316, 169974, -152537, -174547, 87287, 15926, -56612, -415242, 152397, 213072, -30045, 95116, 38311, 331691, -263579, -387851, -159584, -211779, 19067, 115672, 204864, 31381, 30591, 165982, -195049, -184150, 70161, -50143, -2855, -146030, -278027, 16378]
18735c00436E7890L01722a6748F3698A2410a28145I7142b74631J04370A66030
18724c945A08458a21589o2451R276j04529e1966m2821k476B51864E9931h1289
18712d8590j56107D788c02922B2214a1102A46906a30011A65976g5959H8476i3983
18700c15594d1734l36993J47603J4623i1615A3590i197j0088l18167j21598b20251
18688A01819L7700c27861N2452e5749j99340F3207b54455d3156F0318b49390a22234
18676d2206k0512k68209D2453J56034E9510c72839B01709c15813A65626d46355
18665A14121J48912f4849a2999C78758E5922p15a54116a3731k28677N8046O159
18654a78203P8407C84135C22d3917k322A00004g9124b6718A37617h6441G6472
$$ y = [-300436, 57890, 359612, -16748, 63698, 12410, -128145, 97142, -274631, -170261, 166030, -3945, 108458, -121589, -184040, -174764, -279293, -51966, -94787, -97263, 251864, 59931, -81289, -48590, -204697, 4788, -302922, 22214, -11102, 146906, -130011, 165976, -75959, 88476, -93983, -315594, -41734, -378727, -231124, -216501, -91615, 13590, -9197, -19285, -337452, -459050, -220251, 101819, 139519, -327861, -275409, -55749, -255089, 63207, -254455, -43156, 60318, -249390, -122234, -42206, -62718, -330927, 42453, 198487, 59510, -372839, 201709, -315813, 165626, -446355, 114121, 263033, -64849, -12999, 378758, 55922, 55207, -154116, -13731, -242408, -184362, -178203, -99796, 384135, 322, -43917, -46239, 100004, -79124, -26718, 137617, -86441, 76472]
18642D5189d0495D7962R3248g0971m83415a06567A79346a57857L2697b5415j43319
18631a68734b6458l12562a64544h1010k11002A23878a1181k87019R6334P8925
18621a22941o6131h053j24053c014j72373F9549b27105i5760j36570k2758d5737
18609A1453c14114M7487L0386i3931j03131h9576k1714q1042N1310A80834E9339
18597H683b40491B32545a30177r5128a04460A86916b60735A76546k7017b28192
18586b87432J19005d7276r6128k51103a03644k00548J38287k38906d0485k98416
18576c38901a44491A57656c93625a78710L9806B53322C6629a40076A50762a73111
18565A07000a80522B3706J33679n3030k3027h2360A1709b05526A13590B2588K27835
$$ y = [45189, -40495, 47962, 141210, -70971, -554386, -106567, 179346, -157857, -125160, -25415, -168734, -26458, -339020, -164544, -81010, -292012, 123878, -11181, -298200, -201866, -122941, -189072, -8053, -132106, -3014, -175387, 69549, -227105, -95760, -232330, -255088, -45737, 11453, -314114, -266627, -236241, -93931, -197062, -89576, -111290, -192332, -141022, 180834, 59339, 8683, -240491, 232545, -130177, -225305, -104460, 186916, -260735, 176546, 149529, -228192, -287432, -168427, -47276, -143404, -394507, -103644, -304192, -165905, -404811, -40485, -338901, -144491, 157656, -393625, -178710, -138904, 253322, 36629, -140076, 150762, -173111, 107000, -180522, 23706, 157385, 104355, 81328, -82360, 11709, -205526, 113590, 22588, 250423]
18554B50423p1911a79348A53877h2920A92383a26555a4466j68426k80822A77296
18543B6060b20100N0793n7686k4642A21574E756J88101a18171q581D5361M5814
18532I1175b81580B8696b41877I8209B1508J18524c16736G0172C2800b55592C0913
18520c81254B049b46126k5477A15195M04186b21749H7910a08100l2803q126j00321
18509b49350A05979r625B0385c88880R4078R0312B8352c04951a31405E4471b67063
18497e9158n6135r4055c4669r0367H9342a19370C28591A38013a11234n2247E530
18485a63488A09019d1142F869L40866A21629b36003c8419F6507J7274e6993K0772
18474c6221I882c77867a2525B07906h0115G2765K23787b82241B72402a76974d3423
$$ y = [250423, 178512, -179348, 153877, -82920, 192383, -126555, -14466, -182892, -463714, 177296, 26060, -220100, -169307, -226993, -251635, 121574, 5756, 193857, -118171, -126752, 45361, 91175, -281580, 28696, -241877, 98209, 21508, 140032, -316736, 70172, 32800, -255592, 30913, -381254, 2049, -246126, -271603, 115195, 519381, -221749, 87910, -108100, -140903, -149029, -249350, 105979, 96354, 20385, -388880, -294802, -204490, 28352, -304951, -131405, 54471, -267063, -59158, -115293, -209348, -34669, -125036, 89342, -119370, 328591, 138013, -111234, -163481, 5530, -163488, 109019, -41142, 6869, 347735, 121629, -236003, -38419, 66507, 83781, -56993, -36221, 9882, -377867, -12525, 207906, -80115, 72765, 296552, -282241, 272402, -176974, -43423]
18462h1507B28886l8873a07406A02601e4716l15096N8457A54539b56033J27707
18452a28326k44069J07611G0936b36937j70546C68152c8869B82201a4849j31620
18442a46469j87326B9789J63014a42546d1413A25287b07661O9623a4843k5569
18432d0412j9743A32612e346b345m9713A76531e3752B85317B7930a21161k16320
18421c37481B55040i7536r7951L1242I3172a14198J3036d1195p4556N5328a2374
18409a15069A50580F6437Q9996a1502A24102B4351O0385a78145g0103i165k13098
18398b22263A13708J88042C477a4665D3754b84571A82282m0154C9590K4416L05889
18387C69895E4643P6333G257J36752c5843A69294e5460j80826M5553G5113a8896
$$ y = [-81507, 228886, 190013, -107406, 102601, -54716, -369812, -311355, 154539, -256033, -128326, -372395, -264784, 70936, -236937, -407483, 368152, -38869, 282201, -14849, -146469, -333795, 29789, 192803, -142546, -41413, 125287, -207661, -138038, -14843, -40412, -60155, 132612, -5346, -2345, -52058, 176531, -53752, 285317, 27930, -121161, -337481, 255040, -97536, -195487, -164245, 93172, -114198, -101162, -41195, -115751, -60423, -12374, -115069, 150580, 66437, 156433, -11502, 124102, 24351, 84736, -178145, -70103, -9165, -222263, 113708, 301750, 3477, -14665, 43754, -284571, 182282, 142128, 39590, 64006, 369895, 54643, 130976, 7257, 144009, -35843, 169294, -55460, -236286, -190733, 75113, -18896]
18375e0309j63153N194B65131b44434C6991a41200j56673a41088P0533A69096
18364a02935D1467N3739i8865j5116f490a194A18069d5437j81977D2500a17795
18352g4083j33197O7548B4830g4539A11816b1660o4410k51590B0705L9093J35252
18341A95050O2986k730k6682F3729a24288j65903B9121J7639k0279h576k36469
18330b45045i4907j27251K9117J2553j5996j47770A4595a76344K7881A01762J53242
18319B55004c65836a71260I3290j2685N394a12199C7898a06710M1351D49522C3386
18307B19550p2294d62822i1811j62948D29434A00622a32294H9795h3888j39588
18297b23476F3763a0735F4617J45392k9819m2772a81523k5520B5311a43065L3737
$$ y = [-50309, -213462, -208268, 265131, -244434, 36991, -141200, -297873, -141088, -70555, 169096, -102935, 41467, 95206, -98865, -113981, -6490, -1194, 118069, -45437, -227414, 42500, -117795, -74083, -207280, -139732, 24830, -74539, 111816, -21660, -86070, -337660, 20705, 59798, 195050, 258036, 255306, 228624, 63729, -124288, -290191, 29121, 46760, 26481, -8576, -245045, -94907, -222158, -193041, -180488, -196484, -344254, 14595, -176344, -148463, 101762, 255004, -365836, -171260, 93290, 80605, 85999, -112199, 37898, -106710, -65359, 449522, 33386, 219550, 147256, -462822, -91811, -254759, 429434, 100622, -132294, 89795, -83888, -223476, 63763, -10735, 64617, 210009, 180190, 137418, -181523, -207043, 25311, -143065, -109328]
18286a09328e0498o5360j1659j87225a2645F8419b57424e370I2292d41582E5450
18274H6829J4179e1256m51671g533A40079g9038C06722f5662q9022f0953o7352
18263a28305B4155J42186b41846f5778k91172a2035r831C8571a91618E6512a2181
18251e6264D5829K58276A9549b70709B74090j22530a30082B82215A13960b35183
18240B85617b6150j76181j01602P7280g147j31509n0487A46433F3953k8801a06325
18228G3616C1596N4584J25037c19746D2141g7175A6858a70355g8677A22781C9470
18216A14020a30565A01796d7256A79124q5225b2027A48236K01564D5557a4426
18205a10961l6441d1008j70511A04992B4270K77414g9960J2876p2218K7263r7135
$$ y = [-109328, -50498, -115858, -127517, -314742, -12645, 68419, -257424, -5370, 92292, -441582, 55450, 86829, 101008, -51256, -502927, -7533, 140079, -79038, 306722, -65662, -154684, -60953, -128305, 24155, 166341, -241846, -65778, -356950, -12035, -21866, 38571, -191618, 56512, -12181, -56264, 45829, 304105, 19549, -270709, 274090, 151560, -130082, 282215, 113960, -235183, 285617, -26150, -202331, -303933, -226653, -7147, -138656, -189143, 146433, 63953, 35152, -106325, 73616, 31596, 86180, 211217, -319746, 42141, -77175, 16858, -170355, -78677, 122781, 39470, 114020, -130565, 101796, -47256, 179124, 93899, -22027, 148236, 349800, 45557, -14426, -110961, -147402, -41008, -211519, 104992, 24270, 301684, -79960, -67084, -139302, -112039, -209174]
18194b09174I8338m7737b33916D5743a16833D913a48776q2840R3270P965N6775
18183g3606I0494K21287a63059N8275r987A64955c12828P1632A17995h1202l10196
18172c91398E8486K45780a71221H1761a7765k38701B64305c95901B2210b6497
18161A93547e0818j22454j57740a0183k17247d6098H1703E877a35326B5240b3853
18149a81232N2870a9872o4411K4915I6787a22361d7119l01322a25976b3762q0510
18138a04272C25298a01355A55912f2205G4128i9193A16801b31730A38849b89247
18127B6374M874N1153f7108k31824O463A52355a6097B45361A14390f7652I221
18115c55479f0151G6528J07393b20666D55879k09229a83410a7478j36608n9842
$$ y = [-209174, 98338, 50601, -233916, 45743, -116833, 4913, -148776, -231616, -138346, -130381, -73606, 90494, 311781, -163059, -104784, -114771, 164955, -312828, -241196, 117995, -81202, -391398, 58486, 304266, -171221, 81761, -17765, -256466, 264305, -395901, 22210, -26497, 193547, -50818, -173272, -331012, -10183, -227430, -46098, 81703, 5877, -135326, 25240, -23853, -181232, -128362, -19872, -84283, -59368, 96787, -122361, -47119, -348441, -125976, -23762, -104272, 325298, -101355, 155912, -62205, 74128, -99193, 116801, -231730, 138849, -289247, 26374, 31248, 82401, -67108, -298932, -292469, 152355, -16097, 245361, 114390, -67652, 9221, -355479, -60151, 76528, 183921, -220666, 455879, 246650, -183410, -17478, -154086, -213928]
18105b13928K9447R1220B03487h7451P899C46864a30020C6656J97631A09722N6130
18094A65852a19120A34616f5472p0975l00529A15038e1951b349j88250Q3034C3170
18082H5777b7630H0767J44012a13724D1744K4084Q9003A6215Q3835J55097o6094
18071A89053a03028n5973l2266H2232c39465a1621C76239b86161g0156A19216
18060A5917f0995j66084Q5867A00635c4291k03678j6478a5509F2515f710B48653
18048b13377A07134L43674a14557A25018b43590d7008r352B23204k5320m1834
18038A56050E311K00612I4613h3440k0649D8057l321c3007B0850d1081B41295
18026b6952j1021l328A78560N4728a33287B6322a72606h990j48415f5145K1949
$$ y = [-213928, -184481, -93261, 203487, -87451, -79552, 346864, -130020, 36656, 234287, 109722, 165852, -119120, 134616, -65472, -136447, -436976, 115038, -51951, -2349, -190599, -107565, 33170, 85777, -27630, 80767, 224779, -113724, 41744, 65828, 154831, 16215, 100050, 255147, 189053, -103028, -159001, -191267, 82232, -339465, -11621, 376239, -286161, -70156, 119216, 15917, -60995, -227079, -141212, 100635, -34291, -237969, -254447, -15509, 62515, -6710, 248653, -213377, 107134, 450808, -114557, 125018, -243590, -47008, -56360, 223204, 197884, 156050, 5311, 205923, 94613, -83440, -104089, 48057, 44736, -33007, 20850, -41081, 241295, -26952, -37973, -41301, 178560, 233288, -133287, 26322, -172606, -8990, -157405, -65145, -43196]
18015d3196m2082H8787b434l04407C54223A68849a14032A46740k6787c3319p9900
18004a13219A12363b23215N642N3143G8758a90016C15580a80471B37503O668i4722
17992f3981r8653I5311R236a78405b5572l299A59209J9709H4692c3598k44535
17981b78133d3614F0952b98171J48590B12122r3043b81098B22626f0314C74287
17970A95980G5863a20918A04369l2150J8831R5075n815J6749d73745a05921j1964
17959a17885I0520j3125a74258c8942A79087a15505C73967F9367A8288h9354g283
17947E0313k2370R0438b91847B42878m9279a04041C6615J32824a86132G5535K0836
17936I6371A0369b7261j2055q1843A54879R2922A16588e721j3996o4402H0506
$$ y = [-43196, -85278, 88787, -2434, -306841, 354223, 168849, -114032, 146740, 119953, -33319, -113219, 112363, -223215, -217573, -164430, 78758, -190016, 315580, -180471, 237503, 244171, -94722, -63981, -162634, 95311, 104547, -178405, -25572, -28871, 159209, 178918, 84692, -33598, -278133, -43614, 60952, -298171, -149581, 212122, 119079, -281098, 222626, -60314, 374287, 195980, 75863, -120918, 104369, 72219, 91050, 186125, 180310, 197059, -473745, -105921, -117885, 90520, 77395, -174258, -38942, 179087, -115505, 373967, 69367, 18288, -89354, -7283, 50313, 27943, 118381, -291847, 242878, 193599, -104041, 36615, 169439, -186132, 75535, 96371, 10369, -27261, -39316, -121159, 154879, 247801, 116588, -5721, -19717, -84119, 80506]
17924A87699q1526a89488A76011P4391B5200f8560K4262B74511a8664k33623I2237
17912c3949a4819A70120b18831A70285a31865o8873O3824A3042J7001b25635A47140
17900C675a05004o4947B2412J69060K0959b20740J05008C2884c879I3203a28141
17888B38512n4314H8863R2733a90011B03797a63713q3762B26399C0100e2897D5089
17876B57355E2823E71J91770L4112b03830A20889R9477h071l2554o4288n6269
17865a61182o4378I0896b74868a18511B36106a07508k08877A91848Q3471A22285
17854B71936q3827k9091a32648B57166G6624a06492I4389a5639B9820a48462e360
17842F613L6960a4223D42605k02994n0132d3308A95311D633b02256B29282I3230
$$ y = [187699, 106173, -189488, 176011, 250402, 25200, -68560, -44298, 274511, -18664, -252287, 92237, -33949, -14819, 170120, -218831, 170285, -131865, -200738, -136914, 13042, 30043, -225635, 147140, 3675, -105004, -169951, 22412, 191472, 212431, -220740, -115732, 32884, -3879, 93203, -128141, 238512, 184198, 88863, 181596, -190011, 203797, -163713, -247475, 226399, 30100, -52897, 45089, 257355, 52823, 571, 192341, 226453, -203830, 120889, 220366, -8071, -40625, -104913, -161182, -225560, 90896, -274868, -118511, 236106, -107508, -316385, 191848, 275319, 122285, 271936, 188109, 159018, -132648, 257166, 76624, -106492, 94389, -15639, 29820, -148462, -5360, 6613, 43573, -14223, 442605, 239611, 189479, -43308, 195311, 4633, -202256, 229282, 93230]
17830i7300n921j63587a11931l9417c9472m8486C995K99819I0477a57500J4142
17819a43358q3544i9711j15133l8697A46043f7122C43614h1291H2302J35404L6685
17808B54391a99838c3176B7045a07301A24771J24044E2189H245f8596B91668a75702
17796a40413b6455B74035B6595a18079F2350J29312d3539j16525j15829B51622
17785a63365C452e6002I7768e3795D0292Q592R1029b70205K9308a08133A50546
17773D03198I0568a09126B50791A06679b22109e8486k55477B4523e362B29760
17762B96382A12502a41205j24189A41054K11131a658A88347D6963b23561A22983
17751a27064e7469K6388C1221K58037H971b84896d7588D185g6766B56344o2237
$$ y = [-97300, -103221, -266808, -111931, -151348, -39472, -87958, 3995, 303814, 90477, -157500, -143358, -226902, -99711, -214844, -253541, 146043, -67122, 343614, -81291, 82302, 217706, 254391, -199838, -33176, 27045, -107301, 124771, 248815, 52189, 8245, -68596, 291668, -175702, -140413, -26455, 274035, 26595, -118079, 62350, 191662, -43539, -160064, -275893, 251622, -163365, 3452, -56002, 97768, -53795, 40292, 48884, 139913, -270205, -240897, -108133, 150546, 403198, 90568, -109126, 250791, 106679, -222109, -58486, -313963, 24523, -5362, 229760, 296382, 112502, -141205, -265394, 141054, 352185, -1658, 188347, 46963, -223561, 122983, -127064, -57469, -31081, 31221, 289258, 8971, -284896, -47588, 4185, -76766, 256344, 194107]
17740A94107b63113D2552K5225g56r9264A23352a49128E56534A34789c8281A66302
17728A81757j5049a19290e760j1912k08062F908L43202A38847b59708C30230B4930
17716a65580C66243b4022k50114A26528Q4345J783q3309d7351A09468J2562g0201
17704F1391K3505N2290b3514j46550B27554D4577J63761f0955A45203j9022c97890
17692c5540l075B7205N9298J56127j16997R522D5617M5305a00548A22993J7703
17681A40696l6370C4968d9809F3787a69797E3286K8977K22355M4197c3820I8624
17669G1158J4920R7577q6634b52177A08865K21365q9146k3031D2750K85326p0663
17658B57413j26618J75366j32786F993J00750K87334c3899k6988G3806Q9351p7035
$$ y = [194107, -263113, 42552, 67777, -756, -100020, 123352, -149128, 556534, 134789, -38281, 166302, 181757, 166708, -119290, -5760, -17672, -225734, 6908, 350110, 138847, -259708, 330230, 24930, -165580, 366243, -24022, -274136, 126528, 210873, 212656, 129347, -47351, 109468, 122030, -70201, 61391, 84896, 137186, -23514, -170064, 227554, 44577, 208338, -60955, 145203, 126181, -397890, -35540, -38615, 27205, 86503, 242630, 125633, 135155, 45617, 90922, -100548, 122993, 140696, 104326, 34968, -49809, 63787, -169797, 53286, 82263, 304618, 348815, -33820, 98624, 71158, 86078, 183655, 97021, -252177, 108865, 330230, 241084, 218053, 42750, 328076, 257413, 130795, 306161, 173375, 6993, 107743, 395077, -33899, -60887, 73806, 163157, 86122]
17647H6122J24395j3312b16136A41194L1881L4192a174F6089a66810k30497A79571
17635b7362k6650A65124e0225b3226A13056J000c044A95729B5901K40024j19271
17624A46654B4169K02781c1235C78Q9692j8400H799K88542a0277A4653a85126
17612B22058i0988D73678a37454A68431b7025C46562j43853o7377D8865M40792
17602D89657B32722a09117j4239A29569a80191A0761K22209A10756J84699L664
17592B99119f4347B34354a11650A45267F6981R9331l2346J8449J69900j43567
17582A78748H0131J52833a23161A38449b38717g7631B02837B2780a21379B5955
17571C28825o3802J63255H9032J688k4435B5289M8574K13574n4641r6801J52907
$$ y = [86122, 210517, 197205, -216136, 141194, 173075, 207267, -1174, 66089, -166810, -397307, 179571, -27362, -54012, 165124, -50225, -23226, 113056, 114056, -3044, 195729, 25901, 265925, 146654, 24169, 226950, -31235, 378, 90070, 71670, 8799, 297341, -10277, 14653, -185126, 222058, -90988, 473678, -137454, 168431, -27025, 346562, 202709, 135332, 48865, 489657, 232722, -109117, -123356, 129569, -180191, 10761, 232970, 110756, 295455, 299119, -64347, 234354, -111650, 145267, 66981, 166312, 133966, 152415, 322315, 178748, 80131, 232964, -123161, 138449, -238717, -77631, 202837, 22780, -121379, 25955, 328825, 265023, 428278, 89032, 90720, 66285, 25289, 73863, 287437, 232796, 135995, 288902]
17560B88902k6893r5227K07476A46803O6364m2401m5361k7429L61149A03375P6467
17549A79842B2807a00848B8829K31686A20821f5202B83546k0002l7700K7194j23978
17538A29060K92377c4518E64529A18592J27288R5391o0485A0498K55136A5141
17527A82466g6220B26996B988b70607I8700i4952B22748a0332A81463c5583F12559
17515D30903D2705O01613H4253O72666M8956k79585K77046J34402l75762J18144
17505F80120p9274B56585J82732O8452D8583M48932k40369l8468N86821l90040
17495D15459J37687j74306P39497k24163l64549J42208j43171A89459K6206J41337
17485C57002G2445R7482J99722c854C84025A34689K86471C5340J58K62890A07437
$$ y = [288902, 262009, 166782, 374258, 146803, 213167, 170766, 125405, 97976, 459125, 103375, 179842, 22807, -100848, 28829, 260515, 120821, -65202, 283546, 263544, 225844, 253038, 129060, 421437, -34518, 564529, 118592, 245880, 341271, 280786, 10498, 265634, 15141, 182466, -76220, 226996, 2988, -270607, 98700, -94952, 222748, -10332, 181463, -35583, 612559, 430903, 42705, 644318, 84253, 756919, 805875, 526290, 803336, 937738, 561976, 680120, 600846, 256585, 439317, 507769, 48583, 497515, 257146, 218678, 805499, 415459, 553146, 378840, 1118337, 894174, 529625, 671833, 528662, 189459, 215665, 357002, 72445, 169927, 369649, -3854, 384025, 134689, 421160, 35340, 35498, 298388, 107437]
17473E34739J3826L9547j86646P1719B35088F9732L0750K8157J18501D7154K33760
17462B80914H3266J61086J30251A69224k8382J93361K08974k45303j9082j20336
17452A58456d6258B68533j25100E9868K93205j50879l0770j8614a86410C44194
17441D85218j20712j07810L6878j12753L5084H240K68783j3556j01510K49923
17431D11880N229j2084j24435P3262L9815K03394j23709o1828A58610l0644N69685
17420F97651C44249A36186L74871K178j25044j54953a35028E85404A77418K02546
17410C79964A66220J98229O7795B02866k7732K75107j83135A22011K69590A5453
17399D20892o5552k5945L86819H9957J65990J00855j3944B0550b38863E530b3707
$$ y = [534739, 548565, 588112, 401466, 473185, 235088, 69732, 100482, 128639, 247140, 47154, 280914, 83266, 244352, 374603, 169224, 140842, 334203, 543177, 297874, 278792, 158456, -46258, 268533, 143433, 59868, 353073, 202194, 171424, 152810, -186410, 344194, 485218, 364506, 256696, 293574, 180821, 215905, 8240, 277023, 263467, 161957, 411880, 417109, 405025, 280590, 353852, 393667, 597061, 473352, 411524, 158610, 127966, 697651, 344249, 136186, 511057, 513235, 388191, 233238, -135028, 585404, 177418, 379964, 166220, 364449, 432244, 202866, 175134, 450241, 267106, 122011, 391601, 15453, 420892, 355340, 329395, 716214, 89957, 255947, 356802, 342858, 20550, -238863, 5530, -23707]
17387D85125E2605J19406N1588p1460C9968J70343r2932J63390j15117M25416
17377E91068B63274j27809J26009J26367j49396A07594L84573j83877E4938J6616
17367G1554B6301J19954n3521J0373K87517j71699L52838G2489K69358n3131J77947
17356D66663A78979C9300K54736N1447A40788b06809F5413K21821C369a07615
17345f913B40440L26246B76327j37394L07905B9238L02549J7717H5780K27632
17335C13412l0991B3530K08846J18504h2320A00155N5780N7044K99115J712j45982
17324C67824E4014K47505j04410K72761A78967Q8252I0696J83414p8916R692k6003
17313A78883O7468J23686L9456R9091m7550H2546K29134A40342L0293Q9216M9890
$$ y = [485125, 52605, 172011, 223599, 152139, 39968, 210311, 117379, 280769, 165652, 591068, 263274, 135465, 261474, 387841, 238445, 107594, 492167, 308290, 54938, 71554, 26301, 146255, 92734, 103107, 390624, 218925, 571763, 72489, 341847, 288716, 466663, 178979, 39300, 294036, 345483, 140788, -206809, 65413, 287234, 3369, -107615, -6913, 240440, 566686, 276327, 138933, 446838, 29238, 331787, 349504, 85780, 313412, 282421, 23530, 232376, 350880, -82320, 100155, 155935, 212979, 512094, 513806, 367824, 54014, 301519, 197109, 469870, 178967, 267219, 90696, 274110, 195194, 204886, 178883, 246351, 370037, 409493, 508584, 461034, 82546, 311680, 140342, 170635, 259851, 309741]
17302C09741o734A11550d2414C47337r0164L06237k80565P0628A53440J3402J80221
17291C47063N7213O1830J47897A74934k6991M15366r6678A9101M0562J52712K80516
17280D92891a14020A22379J89243J3639c8758D25933J08252A54447Q8913H8984
17269D77218k30600J73345I2956K65484F1810P750L47904o3477j74379L07977
17259D87585A14743M17623n6251B02829K91428B45154M65987g7721E73679a03002
17248B20400I3825L00351G4026M09470j19247J63451A22887E0632M75161n2919
17238D72874A76013K19079j41421K77236B57810r4466J01894j06486K3722N14332
17228F96806C26597J47393A42448J95918o6308K79536r7171A60642m0440K90620
$$ y = [309741, 303007, 111550, -42414, 347337, 257173, 563410, 282845, 353473, 153440, 166842, 347063, 404276, 466106, 614003, 174934, 147943, 563309, 466631, 19101, 59663, 212375, 492891, -114020, 122379, 311622, 325261, -38758, 425933, 534185, 154447, 243360, 88984, 477218, 246618, 419963, 92956, 358440, 61810, 69560, 417464, 353987, 179608, 487585, 114743, 532366, 476115, 202829, 494257, 245154, 711141, -77721, 573679, -103002, 220400, 93825, 394176, 74026, 483496, 364249, 527700, 122887, 50632, 525793, 472874, 176013, 395092, 253671, 530907, 257810, 163344, 265238, 158752, 182474, 696806, 326597, 473990, 142448, 338366, 272058, 551594, 454423, 160642, 120202, 410822]
17218D10822K02416k52050L09633B17633k5181j5402J54619K7058j72315K58147
17208D44559K83544A56079J68469p0511K68226q4844L121p0846J23263p4083M5754
17197D64628L9205B21069H4453J10962N9365j06932K33730A42282P97179C85583
17186D51776J43035A39466R9637a540E80242k64626J31613C5480K14600H4951
17175D93329q1594J71994k79793m9451K48986j76233K8857j35695J25700j54658
17165A91442K80992k12186O49593k51002B6751O82500E3960M12233K58057C01182
17154f1902F81080j93672r9401M6273F5716Q59774l11811A77457L92631n3031
17144E17057L6444Q038B51282K57041k871j76567L4713n8759J43006j39444K43649
$$ y = [410822, 613238, 361188, 670821, 217633, 192452, 177050, 331669, 358727, 186412, 444559, 728103, 156079, 324548, 254037, 522263, 437419, 440540, 369694, 492957, 418874, 464628, 503833, 221069, 84453, 195415, 254780, 147848, 381578, 142282, 939461, 385583, 451776, 594811, 139466, 239103, -1540, 580242, 315616, 447229, 35480, 250080, 84951, 493329, 411735, 583729, 303936, 254485, 503471, 327238, 356095, 220400, 346100, 191442, 472434, 260248, 909841, 658839, 26751, 709251, 53960, 466193, 724250, 301182, -61902, 681080, 487408, 388007, 434280, 65716, 925490, 613679, 177457, 570088, 517057, 553501, 561539, 251282, 508323, 505452, 328885, 363598, 304839, 447845, 308401, 552050]
17133E52050A85215L34901J52008r0909J19852k70946K07759j98900j74655L18464
17123E82789k5938K07318m4948k63457j66519L60612O2107r5528B80655K34469
17113E15124A77933M69835K21911k78888j50169J84412j98974J20025J26546k31644
17103D40987Q6290J1329k21702L33492q7755l6393q4870J13341K11094j73101
17093E92712J64374k27560J97729j62622J06171J5576j92035J40250O5982M0388
17083G40965k09454K90186j66791J70661n3608J2192C80012J21609L84995k26704
17073F59912k46426L81631P6161k58187Q1588j16031L76952m17847J28089K46579
17063I12421j84451j20963L31129k38943P2924J9902R3534l55144N65068j5436
$$ y = [552050, 185215, 520116, 672124, 581215, 701067, 430121, 637880, 438980, 264325, 582789, 556851, 764169, 719221, 455764, 289245, 649857, 711964, 616436, 280655, 515124, 177933, 647768, 869679, 590791, 440622, 625034, 426060, 546085, 672631, 440987, 527277, 538606, 316904, 650396, 562641, 526248, 441378, 554719, 765813, 592712, 757086, 529526, 727255, 564633, 670804, 686380, 494345, 634595, 700577, 740965, 531511, 821697, 654906, 825567, 771959, 784151, 380012, 501621, 886616, 659912, 413486, 795117, 871278, 613091, 694679, 578648, 955600, 537753, 665842, 912421, 727970, 607007, 938136, 699193, 772117, 792019, 885553, 530409, 1095477, 1080041]
17053A080041j19152K01l35094J60885j29326L02148m69964J72596R6259j43054
17043F15540K12080j0066j36682L92182k11386J07290l55278K56733l5477J35718
17033I70654D76379L39510K49132k46142J32389J83800l78879o4938M59180K12153
17023A362584o69681J73180m5737k3362L672K58764p0606K2892L1704J62864l73346
17012H32928K56231p3906j45391J11532r5213J08476k31703K35285J11427r1792
17002A017874l414K90668r1681l66487K06079K7266P7945N4588R6571m7634j33891
16991A127884M7286j53031O9587j60961N99614n27224O4437r3618L35501k33822
16981A075653O4507k16272K57070K93906J72198n22170J59947p3841K73020j86783
$$ y = [1080041, 960889, 961090, 625996, 786881, 657555, 959703, 489739, 662335, 758594, 615540, 827620, 817554, 680872, 1073054, 861668, 968958, 613680, 870413, 834936, 970654, 476379, 815889, 1065021, 818879, 951268, 1135068, 756189, 691251, 1150431, 1362584, 692903, 866083, 820346, 796984, 800656, 1059420, 988814, 1011706, 1043410, 1206274, 832928, 1089159, 1015253, 869862, 981394, 886181, 994657, 762954, 998239, 1109666, 1017874, 1014460, 1305128, 1213447, 846960, 1053039, 1080305, 1158250, 1212838, 1309409, 1261775, 1127884, 1175170, 1022139, 1091726, 930765, 1530379, 1003155, 1067592, 973974, 1309475, 1075653, 1140160, 923888, 1180958, 1474864, 1647062, 1124892, 1284839, 1210998, 1484018, 1297235]
16971A297235k65229L1201R1516k7618Q6767M04027l44838N33169o07637K17474
16961A416067Q5661k11940L16748l71715J97875j92214J33008P0083O2200m6165
16951A459608j60955M63985L8031k10208P767k27524L73424m8891k36779L84040
16941A842498k85844j37051l1136L42418j8373l406j79687K82797j31552j66338
16931A514326M01120j75194L4402k1997j7933J89412j57193p1806L65796k63098
16921A797835K73108j63477k41644M24948j9306L16001k7278q9167j45753l10442
16911A814825K36739J04010M4611k86533J01639J31104l46983L83931j69126K58836
16901B273053J84804l86554P8418J06330L25197Q8985j92725P0240J50091k2737
$$ y = [1297235, 1032006, 1063207, 1154723, 1127105, 1213872, 1617899, 1273061, 1806230, 1198593, 1416067, 1501728, 1289788, 1606536, 1234821, 1432696, 1240482, 1373490, 1443573, 1505773, 1459608, 1298653, 1762638, 1800669, 1590461, 1598228, 1370704, 1744128, 1695237, 1458458, 1842498, 1556654, 1419603, 1388467, 1730885, 1712512, 1709106, 1529419, 1812216, 1680664, 1514326, 1915446, 1740252, 1774654, 1752657, 1734724, 1924136, 1766943, 1695137, 2060933, 1797835, 2070943, 1907466, 1665822, 2090770, 2071464, 2387465, 2360187, 2271020, 2125267, 1814825, 2051564, 2155574, 2200185, 1913652, 2015291, 2146395, 1799412, 2183343, 2014217, 2273053, 2457857, 2071303, 2149721, 2256051, 2581248, 2670233, 2477508, 2547748, 2697839, 2675102]
16891B675102J0172O2373j27679k883l2518N4719r9130K47671l846J77506k8626
16880B932861J70063m42592N21923n1143k97037N74780m40687p0504J77124K76162
16870C350950j96462J83979o2907N3800J66474k856J54545k62208M94804m81160
16860C398959J06963K79720L2719k81945M60171K41308o3639m21218n5558j10176
16850C587304R45720l44178J01173j29594N11597l56728J82580L0081K9820J42049
16840D699824q8270M15490J03966K9070M36528k83556j42616K905R1023L87546
16830E651910l67312L5090L42054K33835l21814O35240j7166O8098J33908O3498
16820F457341J04133N20443j61579J93846J4625l5763J41826J73916K46097k29317
$$ y = [2675102, 2685274, 2747647, 2619968, 2617085, 2584567, 2639286, 2540156, 2787827, 2783981, 2961487, 2932861, 3102924, 2660332, 3182255, 3131112, 2834075, 3408855, 2968168, 2897664, 3074788, 3350950, 3154488, 3338467, 3275560, 3329360, 3495834, 3492978, 3647523, 3385315, 3880119, 3398959, 3505922, 3785642, 3818361, 3536416, 3996587, 4237895, 4174256, 3753038, 3697480, 3587304, 4533024, 4188846, 4290019, 4160425, 4672022, 4315294, 4497874, 4527955, 4557775, 4699824, 4611554, 5027044, 5131010, 5160080, 5596608, 5313052, 5170436, 5173341, 5264364, 5651910, 5284598, 5319688, 5661742, 5895577, 5573763, 6209003, 6191837, 6259935, 6393843, 6457341, 6561474, 7081917, 6920338, 7114184, 7128809, 7093046, 7234872, 7408788, 7654885, 7425568]
16810G425568N70839j31618M37025k16624M24363J58155R7231J67824J26538N42643
16800I601944l613K05788J46948J89633L11142J20629M34365k50658O10057p0157
16790A1296078M24379L94237L2169K63515M29169J73681J76638M46011N52441
16781A4188318M86282J46447M23783L24966J22189L66333N11796L32139P37400
16772A7639653N46160K08210P33190O11160K67215P99307N12612O02735P43707
16763B2663949N60782R34424O34283P05753O31106R74820Q15563J005232J018948
16754B9944860J052138R59846R14644J207502R87260J645450J044953J700154
16746C9456807J012270J737087J382518J521540J845217J743084J980779K018588
$$ y = [7425568, 7996407, 7864789, 8301814, 8085190, 8509553, 8667708, 8764939, 8932763, 9059301, 9601944, 9598331, 9804119, 9951067, 10140700, 10451842, 10572471, 11006836, 10756178, 11366235, 11296078, 11720457, 12114694, 12146863, 12410378, 12839547, 13013228, 13189866, 13635877, 14188318, 14674600, 14821047, 15244830, 15569796, 15691985, 16058318, 16570114, 16902253, 17639653, 18185813, 18394023, 19127213, 19738373, 20005588, 20804895, 21317507, 21920242, 22663949, 23224731, 24159155, 24793438, 25499191, 26130297, 27105117, 27920680, 28925912, 29944860, 30996998, 31956844, 32871488, 34078990, 35066250, 36711700, 37756653, 39456807, 40469077, 42206164, 43588682, 45110222, 46955439, 48698523, 50679302, 52697890]
16738E2697890J879147J983819K458771K114456K783639K194522K575212L086469
16730G1773925K924239K791734L010124K829250L461963K991324L655805L099810
16722I6538174L186261L516700K882803L463678L172292K668712L258750K604807
16714A21292177K553541K500962J985701J662174Q88251J025209Q90967J55469
16706A32954451m97650m43636q88875r13104j958263j876016k221608k543729
16698A21611570k498457k692736l584964l007620l370142l317941k994028l416013
16690I6729669l442289l043341l540388l023646l219346k700240l380988k464990
16682G1914441l145825k389687k630551k413373k487792k558944j981309k165319
$$ y = [52697890, 54577037, 56560856, 59019627, 61134083, 63917722, 66112244, 68687456, 71773925, 74698164, 77489898, 80500022, 83329272, 86791235, 89782559, 93438364, 96538174, 99724435, 103241135, 106123938, 109587616, 112759908, 115428620, 118687370, 121292177, 123845718, 126346680, 128332381, 129994555, 130882806, 131908015, 132798982, 132954451, 132456801, 132013165, 131124290, 130211186, 128252923, 126376907, 124155299, 121611570, 119113113, 116420377, 112835413, 109827793, 106457651, 103139710, 100145682, 96729669, 93287380, 90244039, 86703651, 83680005, 80460659, 77760419, 74379431, 71914441, 68768616, 66378929, 63748378, 61335005, 58847213, 56288269, 54306960, 52141641]
16674E2141641j870598k113308j770854j729984j476500j622469j827805j022295
16666C8707828j845530q67065j071640j734508j065783r99975j242934p41903
16658B9138490j055653p27924r53681o77110j063407p11224o54576q87219n27624
16649B1880072o51879q05429J7078p76825q21285o36203l63849p84608q2408m07895
16639A6566769m33789m23667o82149k63850l30195n25874J00000o77380m34565
16630A2895300q67k40701l30720m09387j06805o96854J57136l76582j3353k51335
16620A0625832n45257O846m50183p3854j79283k75924j51784K3735l94079k50208
16610H335841J35026m58479m0131R8542l67817l26915L79284m85489J73292l54097
$$ y = [52141641, 50271043, 48157735, 46386881, 44656897, 43180397, 41557928, 39730123, 38707828, 36862298, 35995233, 34923593, 33189085, 32123302, 31123327, 29880393, 29138490, 28082837, 27354913, 26401232, 25724122, 24660715, 23949491, 23294915, 22407696, 21880072, 21228193, 20422764, 20439842, 19663017, 18841732, 18205529, 17841680, 17057072, 16974664, 16566769, 16132980, 15709313, 15027164, 14763314, 14433119, 13907245, 14007245, 13329865, 12895300, 12894433, 12653732, 12323012, 11913625, 11806820, 11109966, 11267102, 10890520, 10877167, 10625832, 10080575, 10087421, 9637238, 9563384, 9384101, 9108177, 8956393, 8980128, 8586049, 8335841, 8470867, 8012388, 7972257, 8070799, 7702982, 7376067, 7755351, 7269862, 7443154, 7089057]
16600G089057j83669k59711o3204l69424M11750k93248r8903L5885o5179l28682
16590E874672l3940m43594l2922K35501j60819M1748k74152q6653k40199M0056
16580D919698N9595J78714l36492m00973k3405N8159J87013q0634k62226o66950
16570C632499Q11843m14436K889K85018j92641j93829P2253j48017J50314j75569
16560C830324m26493L02266k75949j41046Q3127K33444k40890R6825j2085K31299
16550C680822n70001j22633M08984k16733m5238K02865j25474q8633k74569R2725
16540B942115j96746J72450j33310j5712q5200L8814K94521j90340q7701p4346
16530B664545O8318l7302k22445J0184L88942n15729P2816k52506K064R9569m4910
$$ y = [7089057, 6905388, 6645677, 6582473, 6213049, 6624799, 6331551, 6232648, 6268533, 6203354, 5874672, 5840732, 5397138, 5364216, 5599717, 5438898, 5480646, 5206494, 5119841, 4879642, 4919698, 4979293, 5158007, 4821515, 4420542, 4397137, 4455296, 4642309, 4561675, 4299449, 3632499, 4444342, 4029906, 4032795, 4317813, 4125172, 3931343, 4003596, 3855579, 4005893, 3830324, 3403831, 3706097, 3430148, 3289102, 3372229, 3605673, 3364783, 3461608, 3449523, 3680822, 3110821, 2988188, 3397172, 3180439, 3135201, 3338066, 3212592, 3123959, 2849390, 2942115, 2745369, 2917819, 2784509, 2768797, 2683597, 2722411, 3016932, 2826592, 2738891, 2664545, 2732863, 2695561, 2473116, 2483300, 2872242, 2356513, 2429329, 2176823, 2178887, 2278456, 2233546]
16519B233546R771j42070J37595P5389l48958L11909k47656j83180K76651j6228
16509B106769P7771j56530K31367l49515R8772J994j72761L62163n28955K1203
16499A692278n7385N11620k49112j0318j68030J6252o8663J89441k15828j82824
16489A457431L48868k63491R0542k58809j61586M32426J05312m40008J35060L86182
16479A831927k54509k32794L75651j98185k51424J3827j03990O2166j2866K92218
16469A522021r2228j21500l1503P313J30946K7690m8814l60983L85585J76945
16459A595472m81450j91865Q57301l75038j74521k80915K55727J51654j51953
16450A204412J24664O547J7753j11994k52220M189j5140K98450j22464q0468L0914
$$ y = [2233546, 2243317, 2101247, 2238842, 2314231, 1965273, 2277182, 2029526, 1846346, 2122997, 2106769, 2184540, 2028010, 2259377, 1909862, 2008634, 2010628, 1837867, 2200030, 1671075, 1692278, 1634893, 2146513, 1897401, 1887083, 1719053, 1735305, 1666642, 1856083, 1640255, 1457431, 1806299, 1542808, 1633350, 1374541, 1212955, 1645381, 1750693, 1310685, 1445745, 1831927, 1577418, 1344624, 1720275, 1522090, 1270666, 1284493, 1180503, 1242669, 1229803, 1522021, 1429793, 1308293, 1276790, 1284103, 1415049, 1442739, 1393925, 1032942, 1418527, 1595472, 1114022, 922157, 1779458, 1404420, 1229899, 948984, 1204711, 1356365, 1204412, 1329076, 1335623, 1353376, 1241382, 989162, 993351, 978211, 1276661, 1154197, 1073729, 1104643]
16439A104643K67735n8386j96233o1859J15666m82811M26843K40988n22959L95193
16429A228820j8556k5987n34653L96668J15925k29466K02805j93298J62258j45187
16419I59329l51882K24915K8793L15097l69404P865K47583o6987m3776l51655
16409E99878M07923O685K30962k57307Q9021q8147C24180M08947J54589p3682
16399H14034j16400Q4046J86534J6093k72097J81756K1029m23448L81588n3462
16389H19673j26998m8769L30397j77859K65394n1927j11120K14669n27517O5902
16379F51845C02508O17260C60877M81026l73032N11797k26785j8059J47388j07235
16369G75977L45073k95389l03314L80736k20710o3380j3907L42539k10143q8084
$$ y = [1104643, 1372378, 1313992, 1117759, 1055900, 1171566, 688755, 1115598, 1356586, 833627, 1228820, 1210264, 1184277, 649624, 1046292, 1162217, 932751, 1135556, 942258, 1104516, 959329, 607447, 832362, 861155, 1176252, 806848, 814713, 1062296, 995309, 951533, 599878, 1007801, 1014486, 1245448, 988141, 1077162, 989015, 324180, 733127, 887716, 814034, 697634, 781680, 968214, 984307, 712210, 893966, 914995, 491547, 873135, 819673, 692675, 643906, 974303, 796444, 1061838, 1009911, 898791, 1113460, 585943, 651845, 302508, 919768, 360877, 841903, 468871, 980668, 753883, 735824, 883212, 775977, 1121050, 825661, 522347, 903083, 682373, 618993, 605086, 947625, 737482, 649398]
16359F49398J07509k92783L44669k37254j18703L1767J70065Q9718O8764r1375
16349G21775k04116K65129j44220k0885K84437p9364l87765j10036M79771k9675
16339G75051j72785M9489k18596K22751J24368C03549O91827l39466k36094J37533
16329E57349J87555L6367l75391J66425L8569k83079K72192P2157C24356L42562
16319F66918J65722D02823j283j1205K46140k10108L79823C82942J30550K67500
16309G80992K36579k35263C41825J18793J38320B04188J77178K84856k5820B52635
16298E73882O5521r5792J30943q7883L4967J93541F6701M60056R7935k83323j35908
16287B05461J47798o7296j38850K55386A33139O00685k18615l6033o5700J71393
$$ y = [649398, 756907, 464124, 808793, 571539, 452836, 484603, 654668, 744386, 813150, 721775, 517659, 782788, 638568, 617683, 902120, 822756, 434991, 324955, 804726, 775051, 602266, 651755, 433159, 655910, 780278, 303549, 995376, 655910, 419816, 557349, 744904, 781271, 405880, 572305, 610874, 327795, 599987, 672144, 324356, 666918, 832640, 402823, 401540, 390335, 636475, 426367, 806190, 382942, 513492, 780992, 1017571, 782308, 341825, 460618, 598938, 204188, 381366, 666222, 640402, 252635, 573882, 639403, 543611, 674554, 586671, 621638, 815179, 66701, 526757, 624692, 341369, 205461, 353259, 285963, 147113, 402499, 133139, 733824, 515209, 479176, 413476, 584869]
16277E84869j56624J81143A64772L68105J52522l42515K05349L7346A28991L26083
16267D55074J27319q6435k45261k3404J98021k8346A12619K94568J90407k47649
16257C49945J53015P2977k70011K50292B14130L49988k07396L6824A13096J16271
16247B29367D9159J53490l323I6993K2942J05414m3311k1350K73048I5859L64661
16236D60520D6865O01166B48462J29241r7647J05593j27026k8942M07141B47773
16225E56847j4568j59833J30990B09634M9084R576h013A66424N2280J65112p1543
16214C12273A04209m639M6074L86279j63730o3668m3829P1706N3596n8542K2344
16203C49800J3377j3525p821J1121o5637j14482j6745J90779J2455A60841K33534
$$ y = [584869, 428245, 609388, 164772, 532877, 685399, 342884, 548233, 585579, 128991, 455074, 582393, 495958, 250697, 227293, 425314, 396968, 112619, 407187, 597594, 349945, 502960, 575937, 305926, 556218, 214130, 564118, 356722, 393546, 113096, 229367, 49159, 202649, 199326, 96993, 119935, 225349, 182038, 160688, 433736, 95859, 460520, 46865, 648031, 248462, 377703, 280056, 385649, 258623, 229681, 636822, 247773, 556847, 542279, 382446, 513436, 209634, 258718, 268294, -8013, 166424, 218704, 383816, 312273, 104209, 99570, 145644, 531923, 368193, 304525, 260696, 332402, 385998, 327456, 349800, 363177, 349652, 341831, 352952, 287315, 172833, 156088, 346867, 359322, 160841, 394375]
16192C94375A36208J02186K26054A55269J19933L4209K10833B46786f3953A08089
16181B12629m745M095O6372K53969A38476J68461j46861K79014p7293j8906n4099
16170B88792A7297K05925K32024B26527I8528i6377C44058g4265C3558L69389
16160D02947j77202O7900j02585K12806j189c4398a946B57930J1032j09267K79079
16149D38774a37400B69459q9464J13838D1362L8833K67201g3483q1785A74151
16138C78676A80342M9634o6765K88742c0970B60668n2185n6244a37735A44843
16127A70024J07037K7212l6484B7700O9934J03525c1003D4723R6662m0070m661
16116I6654a50937j6362C56557A2237L26744N2806g195B59826A13487M3712L1879
$$ y = [394375, 136208, 238394, 464448, 155269, 275202, 309411, 520244, 246786, -63953, 108089, 212629, 207884, 211979, 278351, 532320, 138476, 306937, 160076, 439090, 361797, 342891, 288792, 17297, 223222, 455246, 226527, 98528, -96377, 344058, -74265, 33558, 402947, 225745, 293645, 191060, 403866, 402677, -34398, -1946, 257930, 268962, 159695, 438774, -137400, 269459, 179995, 293833, 41362, 80195, 347396, -73483, -155268, 174151, 378676, 180342, 229976, 163211, 451953, -30970, 260668, 208483, 152239, -137735, 144843, 170024, 277061, 304273, 267789, 27700, 97634, 201159, -31003, 44723, 141385, 101315, 96654, -150937, -167299, 356557, 12237, 338981, 391787, -7195, 259826, 113487, 157199, 189078]
16105A89078L9725J3516m0015J8485F7093J1009a0432C01369j28748K97608k33909
16094B36320E7893L59740k06109A04215G906L17117b01922F361f7877j44275A28472
16082D57778B00764a57886N4063C0937J01278b090A10069b0256p144o5316B63432
16070c27314B87923a24085B15267C6900J3830b66912h4580H5428J38083a16098
16059A42238d4131B70148j04064L01670d3392H9901k4299c56889b3346C6037J35830
16048A71867c738j4759A64923E8757b44738b946D70258A61500G1285J51625L4260
16037B57170H3159f0325F4940h1435A85472J66559f1157j0541C960J1525b9433
16025B0851L03271d45946C23811R4931D4930e8045B74276a76884A84048a01765
$$ y = [189078, 228803, 242319, 202304, 220789, 67093, 78102, -10432, 301369, 172621, 470229, 236320, 57893, 417633, 211524, 104215, 7906, 325023, -201922, 6361, -67877, -212152, 128472, 457778, 200764, -157886, -103823, 30937, 132215, -2090, 110069, -20256, -27400, -92716, 263432, -327314, 287923, -124085, 215267, 36900, 50730, -266912, -84580, 85428, 223511, -116098, 142238, -44131, 270148, 166084, 467754, -43392, 89901, 65602, -356889, -23346, 36037, 171867, -3738, -18497, 164923, 58757, -244738, -2946, 470258, 161500, 71285, 222910, 257170, 83159, -60325, 64940, -81435, 185472, 352031, -61157, -71698, 3960, 15485, -29433, 20851, 324122, -445946, 323811, 418742, 44930, -58045, 274276, -176884, 184048, -101765]
16014f2360j49753A88770G8036b41922c2906k24738J00302B88690c01170d8734
16003i1479k10924C1537J23169o7925J03150b26088C00838c2508B01627N1128
15993B52755f1442F73M56655A71113H0844j1789i2805n0136H6459c4010A0866
15981C5017L16871a10556e277B12763G9001K40161j50254D3706M19242O14516
15971A077464l38616L22104p4849J0941L1180k94445N353A18541K49074G8537
15960A55330a98101A10497k1302K75535b83826A106J05235D0945M7843c154E920
15948B9613g4385f551E6544b16723J06453m7976A8702J98523A8639i4239A15768
15936b98511c6032D4838J25170a37213A85097h9168D3587b13829C9170O4366B2374
$$ y = [-62360, -212113, 188770, 78036, -241922, -32906, -257644, -157342, 288690, -301170, -48734, -91479, -302403, 31537, 154706, 86781, 189931, -226088, 300838, -32508, 201627, 252755, -61442, 673, 457328, 171113, 80844, 69055, -92805, -142941, 86459, -34010, 10866, 35017, 351888, -110556, -5277, 212763, 79001, 319162, 168908, 43706, 462948, 1077464, 738848, 1060952, 986103, 997044, 1028224, 733779, 739132, 118541, 367615, 78537, 155330, -198101, 110497, 89195, 364730, -283826, 1106, 106341, 40945, 88788, -3154, 5920, 29613, -74385, -6551, 56544, -216723, -110270, -158246, 18702, 217225, 18639, -94239, 115768, -298511, -36032, 44838, 170008, -137213, 185097, -89168, 43587, -213829, 39170, 103536, 22374]
15924G1927c23575A3021b05772b9219Q008B50833I5523c95244G8149J22673c6843
15912H9529a04112C29703A61798a44219r2290F6342b189k17248c4379o4430J725
15901i7084E689a3321H7960e9817k02774j0815C67540a9555C96678C5757f0621
15889G5963a41285d3144A39548m1161a62744b0759l602j7664A46832b0931a496
15877B31007Q1918F4322i8311o4635K2861O9132C95443i0514A64676K44653A64095
15865C1409b55086I0685a86505G181K94315B0037b00774h3871r5989e8660p5470
15854a34130K2155n2979B61683B0676e6046A8254b5414k11976C18103h8517n2316
15843a40833p567p9984P6705I3125a60712n7389E4958J06319a6851n5004l3460
$$ y = [71927, -323575, 13021, -205772, -29219, -21211, 250833, 95523, -395244, 78149, 200822, -36843, 89529, -104112, 329703, 161798, -144219, -236509, 66342, -2189, -219437, -34379, -98809, -97084, 5689, -13321, 87960, -59817, -262591, -273406, 367540, -19555, 396678, 35757, -60621, 75963, -141285, -43144, 139548, 98387, -162744, -20759, -24361, -42025, 146832, -20931, -1496, 231007, 312925, 64322, -98311, -162946, -140085, -70953, 395443, -90514, 164676, 409329, 164095, 31409, -255086, 90685, -186505, 7181, 301496, 20037, -200774, -83871, -179860, -58660, -134130, -111975, -164954, 261683, 20676, -56046, 18254, -25414, -237390, 318103, -88517, -140833, -148400, -228384, -151679, 93125, -160712, -218101, 54958, 161277, -16851, -71855, -105315]
15832a05315j38769m0031A2543g0924l46701A2261c6650a516A46503a12166A52947
15820C0240b95645A79350G4182k0264a43400f6343K803k41845D1930K76584b0636
15808a85037L3147j52493F878c32536A51268a75156b7031I417a77245F3118b72908
15796C32172a16982a6303D3436g1364B42986f6814j07218o243A77366b55565e4623
15784g9897l7552C0640a65309D2663g6123G5102a35168B22216E7535c29427J60133
15773a69294n5863A99005I7802B9801K09975j09304E8630d8747a0919C48853f9614
15761b36476A31340F2984k6285d1090A62889b86934i6847H4458D0033M37618f8144
15749A87281G4540d0505A08799J84977j41224O661b9079j3968A36677M0c21859
$$ y = [-105315, -244084, -284115, 12543, -70924, -417625, 12261, -36650, -1516, 146503, -112166, 152947, 30240, -295645, 179350, 74182, 53918, -143400, -66343, -63540, -305385, 41930, 318514, -20636, -185037, -151890, -304383, 6878, -332536, 151268, -175156, -27031, 9417, -177245, 63118, -272908, 332172, -116982, -16303, 43436, -71364, 242986, -66814, -174032, -180275, 177366, -255565, -54623, -79897, -117449, 30640, -165309, 42663, -76123, 75102, -135168, 222216, 57535, -329427, -169294, -225157, 199005, 97802, 29801, 239776, 130472, 58630, -48747, -10919, 348853, -69614, -236476, 131340, 62984, 36699, -41090, 162889, -286934, -96847, 84458, 40033, 477651, -68144, 187281, 74540, -40505, 108799, 293776, 152552, 159213, -29079, -43047, 136677, 136717, -321859]
15737a32427B05826o8746C2524a97990c0002C00399h2525C22887a46139b3524
15726B01233f2859C65498b14344D1026e9382I1951b09641i889n7959l19587J88728
15715a98707r4301c6467j26155A43522a6004p6387J3697a1516j70353B40334c32902
15703b65358j9141F8459L9582a42301d438A0348K79429n0088c7211B6771i4761
15691A19338b04352j70047a16047j40891J7673B21260C9060O8521J13486c6073
15680E6912J09267R4463C5463h1884B28063f8881r0518c139A08144b71219A77638
15668h582r2805D5979k2103P1491b09113j6240B58810g3315m4579f773E9425b30905
15655b56701B85932h8909j6381B737J72932k7121a4223C1993c05450F6486J91761
$$ y = [-132427, 205826, 137080, 32524, -197990, -30002, 300399, -82525, 322887, -146139, -23524, 201233, -62859, 365498, -214344, 41026, -59382, 91951, -209641, -9889, -67848, -387435, -198707, -293008, -36467, -162622, 143522, -16004, -92391, -78694, -11516, -181869, 240334, -332902, -265358, -284499, 68459, 108041, -142301, -4438, 10348, 289777, 239689, -37211, 26771, -94761, 119338, -204352, -374399, -116047, -256938, -239265, 221260, 39060, 107581, 221067, -36073, 56912, 166179, 260642, 35463, -81884, 228063, -68881, -159399, -3139, 108144, -271219, 177638, -8582, -101387, 45979, 23876, 95367, -209113, -225353, 258810, -73315, -117894, -6773, 59425, -230905, -256701, 285932, -88909, -105290, 2737, 175669, 148548, -14223, 31993, -305450, 66486, 258247]
15644B58247d0516l9789j0325d036k56148d3172j1329A06578a31471k30486H7486
15632g941j5858l1548A40703F3287b54598E23279G1775R2595c28425c8021B678
15620A96886c35595Q4885i0010A65594Q4034H4762A265Q0727J29335c8447B02640
15608A30917l8600d4677o6440A82556a45844j88968g8112r7554g009k77971B3132
15596g2317A6599a01323a2997m9567A52019n9657c9952q7206J8617N4262m5407
15585i9686j65024H2166J5148J02770a8684j94311J02274a1182j52348K9466F3895
15573a31178b1147D3070i5306m5116A35460i3843o4311B02545C5325g2605j89298
15562b61903B54492C3772f9937j1573A09038a27326j00997g594A24263a06781
$$ y = [258247, -40516, -80305, -90630, -4036, -260184, -43172, -54501, 106578, -131471, -361957, 87486, -7941, -23799, -55347, 140703, 63287, -254598, 523279, 71775, 164370, -328425, -38021, 2678, 196886, -335595, -250710, -90010, 165594, 249628, 84762, 1265, 81992, 211327, -38447, 202640, 130917, 92317, -44677, -111117, 182556, -145844, -334812, -78112, -175666, -7009, -284980, 23132, -72317, 16599, -101323, -12997, -62564, 152019, 92362, -39952, -127158, -108541, -54279, -99686, -264710, 82166, 97314, 200084, -18684, -212995, -110721, -11182, -163530, -134064, 63895, -131178, -21147, 43070, -95306, -140422, 135460, -93843, -158154, 202545, 35325, -72605, -261903, 254492, 33772, -69937, -81510, 109038, -127326, -228323, -7594, 124263, -106781]
15551A43568a11241A37416a00559l37263C03609a27116b4374A44191p1473b65258
15540g0450j40305b0207A24888K2010G1019N8128b99364B9599a854p9398j60317
15529b41569A85151a87614A09412j0898b23068A57281o814l8659D7768f9194H1043
15517a68962h557C56092a26533j8354B84507b4469L310C30904a3857B45080p3256
15506A71824L8514a51889j36892g6572q2377g843A69208J19323b56623D0820J28496
15495A69316i4396A18580P4988G1476B8445J44586J18906m1655p9067n8829B4476
15483A28707a24747B47610F8002h1964A75588a39581j04190F9920J10352K1777
15473B02049O2886P1185F9625R3143J74858a05390M5215A75301d3685P786A3748
$$ y = [143568, -111241, 137416, -100559, -437822, 303609, -127116, -24374, 144191, 72718, -265258, -70450, -210755, -20207, 124888, 146898, 71019, 129147, -299364, 29599, -1854, -81252, -241569, 185151, -187614, 109412, 98514, -223068, 157281, 150467, 111808, 47768, -69194, 81043, -168962, -8557, 356092, -126533, -144887, 284507, -24469, -21159, 330904, -13857, 245080, 171824, 210338, -151889, -288781, -76572, -158949, -7843, 169208, 288531, -256623, 40820, 169316, -94396, 118580, 193568, 71476, 28445, 173031, 291937, 250282, 171215, 112386, 24476, 128707, -124747, 247610, 68002, -81964, 175588, -139581, -243771, 69920, 180272, 202049, 264935, 336120, 69625, 162768, 337626, -105390, -60175, 175301, -43685, -35899, 13748]
15461C99335e52B87268K69782k10690K11026B14735J2933o974K89522a28727j9325
15450a48052F2009L0525b3474A106P7884a05635j04118j28446J58116H9506a81301
15438a15746L6884B40980B2641K75226a44604I5162K6386r739Q9060a17395D44102
15426E03833K70752j38706M3713K19041k95585q3830D5333J36864q5720b4312
15415B17124n1095K56305A32681E7752j5081a67750A48524e8854A12186h4367
15404A59288b41363A06853a6296C06166I5311d298k0020j92253A28142Q0568b29906
15392b22104k1154a2927j79602i2280A65851a18951A42663M7219f4643b2961k4718
15381d7679A36315D3539a10671A40810a58201j4824G9809j8563f0180A95963N2885
$$ y = [399335, -552, 287268, 557050, 346360, 557386, 214735, 227668, 220694, 510216, -128727, -148052, 62009, 92534, -23474, 1106, 78990, -105635, -209753, -338199, -180083, 89506, -181301, -115746, -78862, 240980, 22641, 297867, -144604, 95162, 121548, 111809, 200869, -117395, 444102, 503833, 774585, 635879, 679592, 898633, 603048, 519218, 45333, 182197, 96477, -24312, 217124, 166029, 422334, 132681, 57752, 42671, -167750, 148524, -58854, 112186, -84367, 159288, -241363, 106853, -16296, 306166, 95311, -4298, -24318, -216571, 128142, 208710, -229906, -222104, -243258, -12927, -192529, -92280, 165851, -118951, 142663, 189882, -64643, -22961, -47679, 136315, 43539, -110671, 140810, -158201, -173025, 79809, 61246, -60180, 195963, 248848]
15370B48848b7869j5763C76456c5501H7835J4897c42259B41502L2439a78568B00298
15358A64240Q6287h8920C84640D5554R3900L8514B4142c2923B23587n542K0825
15347B38870O1373A16219O1422k1220J23327A32582J22348a2642C37243a07115
15336F7198a00809j15500C3241Q2278E2780c5408F8471C1985j1785L25070N0067
15325C95337A10868L67206n3557R2417a12970A09502a4183D21024A27991b40853
15314B90650H412L78002a40072B02640B8589K24920b8991I9772K3928D0372R2088
15303A32460J1035J8910a31862C5144b95334C09503j11141J80243E9438j4503
15293D4935j0843e23B72343b3352M419B61671K0266b8996R891q4097A59977k9534
$$ y = [248848, -27869, -43632, 376456, -35501, 87835, 102732, -342259, 241502, 273941, -178568, 200298, 164240, 250527, -88920, 384640, 45554, 139454, 177968, 24142, -32923, 223587, 218045, 238870, 300243, 116219, 177641, 156421, 279748, 132582, 254930, -12642, 337243, -107115, 67198, -100809, -216309, 33241, 115519, 52780, -35408, 68471, 31985, 20200, 345270, 395337, 110868, 478074, 424517, 516934, -112970, 109502, -14183, 421024, 127991, -240853, 290650, 8412, 386414, -140072, 202640, 28589, 253509, -28991, 99772, 123700, 40372, 132460, 143495, 162405, -131862, 35144, -295334, 309503, 198362, 378605, 59438, 44935, 34092, -523, 272343, -23352, -18933, 261671, 281937, -28996, -19105, -103202, 159977, 130443]
15281A30443g2817k0586E287L80660B2533c2625A08328J60231a43189G1770b6050
15269C10663f8217B54983a17796B66098c62541C82093E2218L532J32363i4336
15258c584k30H2720g4515L0457B98271b5983n818o0452A73731a16598B69518c6051
15245c32855B3548J54917Q0075c99177d5203m6161j82967C4823J53738F030m45
15234E585J4814J92984a0407j38681B98842L24860L86418N75742O3957k77302
15224A372517l64797k31689l36066A99234c9475B41621O1995A01584Q1810K625
15214A86019E4826J10907p855g0079E9582R2305a62963p9138g0720A24073b5159
15202a39099k5572d7968p5689I8635a41035A05299c77192A89408B921K53941b36330
$$ y = [130443, -72817, -93403, 5287, 385947, 22533, -32625, 108328, 268559, -143189, 71770, -26050, 310663, -68217, 254983, -117796, 266098, -362541, 382093, 52218, 55750, 188113, -94336, -3584, -3814, 82720, -74515, -44058, 298271, -25983, -31801, -92253, 173731, -116598, 269518, -36051, -332855, 23548, 178465, 258540, -399177, -45203, -91364, -274331, 34823, 188561, 6030, 5585, 20399, 213383, -10407, -149088, 298842, 623702, 1010120, 1585862, 1649819, 1372517, 1007720, 776031, 439965, 199234, -39475, 241621, 303616, 101584, 183394, 186019, 54826, 165733, 157878, -70079, 59582, 151887, -162963, -242101, -70720, 124073, -25159, -139099, -164671, -47968, -123657, 98635, -141035, 105299, -377192, 189408, 2921, 256862, -236330]
15190a68113i874G9147O3899L6245E492J20648a15450H0763M6589a05976B57013
15178A38818M030K8706q521G8618C6678a87134N7509D265J4167a53459A16374
15166B18310N6328j07452q2933P0455K64363C6395L61850j88233M0872a84108
15155e624A39885J87559a08811c9805j33074d4272B34386a85805m865j61465I7873
15143b6765k24859B21797J55906G3218J273Q0063d8004I8706K98283j54647J7229
15132B59571D247R2169L5440K62791a45728A95089Q7680B6573J4395M43216k29921
15121B54263A06311K03726F8285J89162p3511G6627J24359K8096b9946A99226
15110A05228i85B18576K37437C9457L14955L92983C66427M85298C04437K55695
$$ y = [-168113, -9874, 79147, 143046, 179291, 5492, 126140, -115450, 80763, 127352, -105976, 257013, 138818, 142848, 171554, 163033, 78618, 36678, -187134, -129625, 4265, 18432, -153459, 116374, 218310, 274638, 167186, 84253, 154708, 419071, 36395, 398245, 210012, 250884, -184108, -5624, 139885, 327444, -108811, -39805, -172879, -44272, 234386, -185805, -190670, -352135, 97873, -26765, -251624, 221797, 377703, 73218, 74491, 154554, -48004, 98706, 396989, 242342, 259571, 4247, 96416, 131856, 394647, -145728, 195089, 282769, 26573, 40968, 484184, 254263, 106311, 310037, 68285, 257447, 183936, 76627, 200986, 229082, -29946, 199226, 105228, -985, 218576, 456013, 39457, 354412, 747395, 366427, 851725, 304437, 560132]
15100E60132A32795A9856K82721A44519K43377A68979h3841G1047K1689J18060
15090B10796A00906J7884c06923A13880A1915K11880i1455B31196k9384n9874
15080A41938J48467N557H3584J04693H1656K53223F0018c4715A13646J96107L6826
15069C46579l1117K9422A09485m2961A5204g3038D821J35601a04839A40257l3545
15058A06712k5783l8141b1179j71332a222j20080N5127E03316k29579g5798C01574
15046A52614f8708A15897g7820D35689j12997N873J97505A47755N4453J60281
15036C62489A03695J81441J94833o8271L60287m3515B36488B9192L12628J12402
15026D54222K4239k7303k12921M40552q6487B93807K59341E2204R4550M52535
$$ y = [560132, 132795, 19856, 302577, 144519, 387896, 168979, -83841, 71047, 92736, 210796, 100906, 118790, -306923, 113880, 11915, 223795, -91455, 231196, 201812, 141938, 290405, 295962, 83584, 188277, 81656, 334879, 60018, -34715, 113646, 309753, 346579, 315462, 344884, 109485, 66524, 15204, -73038, 4821, 140422, -104839, 140257, 106712, 80929, 42788, -21179, -192511, -1222, -121302, -66175, 503316, 273737, -75798, 301574, 152614, -68708, 115897, -77820, 435689, 322692, 328565, 526070, 147755, 202208, 362489, 103695, 285136, 479969, 411698, 771985, 728470, 236488, 29192, 341820, 454222, 478461, 451158, 238237, 678789, 592302, 293807, 553148, 52204, 146754, 599289]
15016E99289M2433k37036o1750J53041K26896k32486O0977j66094D5677J24646
15006A70323p5633N17549M9716j65968o1806J81249B03608J01764P7201L6905
14996D19478n9067J08759K88158l64297A38883K33051K83343j95029A3225M16802
14986D30027J13894B01707Q8807Q7395L0601K24214l1790P206j89703j88817L50283
14975E79903O3586j84374j48327J53222r8229J04104k1896J10781q178M56827
14965A007419j34307j33342j15750B90876j03381C2686L42395K94423k25719M24251
14955H68036j71269r530B91390L52013j87427j9121O577A11625M54318j84835
14945C81108P9110O1492b70675B45767K76028o0674j13415K25145B86260J28053
$$ y = [599289, 641722, 404686, 342936, 495977, 722873, 490387, 551364, 385270, 45677, 170323, 94690, 612239, 661955, 495987, 434181, 615430, 203608, 305372, 382573, 419478, 360411, 469170, 757328, 393031, 138883, 371934, 655277, 460248, 13225, 430027, 543921, 201707, 290514, 377909, 408510, 632724, 600934, 608140, 418437, 229620, 579903, 643489, 459115, 310788, 464010, 365781, 469885, 447989, 558770, 550592, 1007419, 873112, 739770, 624020, 290876, 187495, 32686, 375081, 669504, 443785, 868036, 696767, 687237, 291390, 643403, 455976, 436855, 443432, 111625, 565943, 381108, 460218, 521710, -270675, 245767, 521795, 461121, 347706, 572851, 286260, 414313]
14935D14313j04340l8445J43024Q7816j76940j21916N19402j4922k25000q3602
14925C99390A88439K05871O7385j89678L61167j18436j37289j03732L56975L00973
14915I31675q5793K60944J09888p5570R9526J90004L41619J12432k62743l32530
14905A289452q1545O01362k52292J12861L76168j59614k12882k93453l35134J26352
14895A171275n8178m40171l2006j39610j51824R9027K4458Q676K38177C29315
14884E88860j10673O4548k44625K45640k16602A05458M43661j21033K26147k19143
14874D35090J6546K5257J52898L4792r6704K99219k86158L39678j94566r1121
14864F34931R779j01542J4333J02343n3938J11206j09462m4110n0631j06300J7224
$$ y = [414313, 309973, 271528, 414552, 502368, 325428, 203512, 722914, 707992, 482992, 399390, 188439, 394310, 461695, 272017, 633184, 514748, 377459, 273727, 630702, 931675, 845882, 1106826, 1216714, 1141144, 1240670, 1430674, 1772293, 1884725, 1621982, 1289452, 1207907, 1809269, 1556977, 1669838, 2046006, 1886392, 1673510, 1380057, 1044923, 1171275, 1113097, 672926, 640920, 501310, 349486, 448513, 472971, 481647, 719824, 329315, 588860, 478187, 542735, 298110, 543750, 327148, 105458, 549119, 428086, 654233, 435090, 451636, 476893, 629791, 664583, 567879, 867098, 580940, 920618, 726052, 634931, 644710, 543168, 557501, 659844, 605906, 717112, 607650, 563540, 512909, 406609, 423833]
14853D23833R7001N1989j81736K86376K8435k33903K80529j2698C66039K04818
14843E70857B25930r1042J88205L31825R365k54748o2968N5012m478L40486k53867
14832D83720j4430M0672J00983m926K55337q8568Q0130J54236J11572k42921l6671
14821H39134k8464K5658o9404k02001R2970k08604K16876B55592L89641k44995
14811D00238M49956j12176r0501j98594Q7759j01660o63N11778C44938L44348
14801F89286J46221K15822E04608K23657j44817p187K6916K27221C68092J65267
14791E33359K62804K70377l21414K03653p7261j83435p8984J20438j00351K68599
14781H97785B80318K34367j37926K44787M8390j76923J94268j68024j78454j2191
$$ y = [423833, 520834, 572823, 391087, 677463, 705898, 471995, 752524, 739826, 366039, 570857, 225930, 134888, 323093, 654918, 664283, 409535, 346567, 401579, 397101, 737587, 483720, 469290, 509962, 610945, 606019, 861356, 772788, 852918, 1007154, 1118726, 875805, 839134, 810670, 836328, 766924, 564923, 657893, 449289, 666165, 255592, 645233, 400238, 850194, 738018, 647517, 448923, 536682, 435022, 434359, 946137, 344938, 689286, 835507, 1051329, 504608, 728265, 583448, 576261, 603177, 830398, 368092, 533359, 796163, 1066540, 745126, 948779, 871518, 688083, 609099, 729537, 629186, 897785, 280318, 514685, 376759, 621546, 669936, 493013, 687281, 519257, 340803, 328612]
14771C28612M22088q2587J38106j48982j13270j1327j26741K01232J85913p653
14761G85391C63511M23691J56368k08108j11303L1167k2653K73812O24k45652
14751F61457m6667P9754K6696L2145j12671p5859J66197k48833J05206k29319
14741C58106N208K13678K64560j03453J23829j10077q0881O6849j01851R5880
14731G31848K9612p6988j86192K09148n1355k9297L53742k0794j7233l28335K86276
14720I00432k11309R04r9692N12787k55024N11179k73312J18308O40334m02238
14710A442369j00796j6292K4884l68078J89892j01084N315k77304J7375K27777
14700A044058r869j65430J17075j2675o8110j67418j6350K99918j20042O7188
$$ y = [328612, 750700, 668113, 806219, 657237, 543967, 532640, 405899, 607131, 793044, 785391, 363511, 787202, 943570, 735462, 624159, 655326, 632673, 906485, 907109, 661457, 614790, 694544, 721240, 753385, 640714, 564855, 731052, 482219, 587425, 358106, 363314, 576992, 841552, 738099, 861928, 751851, 670970, 737819, 635968, 731848, 761460, 684472, 498280, 707428, 656073, 626776, 980518, 959724, 942491, 614156, 900432, 689123, 690027, 590335, 1103122, 848098, 1359277, 1085965, 1204273, 1844607, 1442369, 1341573, 1325281, 1350165, 982087, 1171979, 1070895, 1076210, 798906, 816281, 1044058, 1034189, 868759, 985834, 973159, 905049, 737631, 721281, 1021199, 901157, 968345]
14690I68345m6687j93110M67112L6482L19615J01800L456k82209j09763J31564
14680A396605P6490k59223k29703N406L27751m24149L72383j10883n40024M19153
14670A033806j3804j36170j01142M8672l6420K07187J47931k23813j66495l5588
14660G24164Q0507K58789j31116p3207J34455j92700Q2731K05893K35492l10933
14650A014075j8583j15068k55472K74091K64990N154k72773K07935o2090J90769
14640A233028j89506M10790j01859j13258O4057q6942j00887k442L6558m52070
14630F97469N10131J25370k35425J25897L2624L5590J05636o72914N34098k48015
14620A010461K49705R5630k99403L96353K9434m82248J24129J70098L02649k95998
$$ y = [968345, 921658, 728548, 1195660, 1232142, 1551757, 1653557, 1657013, 1374804, 1265041, 1396605, 1473095, 1213872, 984169, 989575, 1317326, 893177, 1265560, 1154677, 614653, 1033806, 1020002, 883832, 782690, 831362, 794942, 1002129, 1150060, 926247, 759752, 724164, 804671, 1063460, 932344, 859137, 993592, 800892, 883623, 1089516, 1325008, 1014075, 995492, 880424, 624952, 899043, 1164033, 1169187, 896414, 1104349, 1042259, 1233028, 1043522, 1454312, 1352453, 1239195, 1303252, 1216310, 1115423, 1112981, 1149539, 697469, 1207600, 1332970, 1097545, 1223442, 1256066, 1291656, 1397292, 724378, 1258476, 1010461, 1260166, 1355796, 1056393, 1452746, 1482180, 999932, 1124061, 1294159, 1596808, 1300810]
14610A300810J14253K70035n10709L30900l05052Q5013j75241N7673N06856l34333
14600A340205M23864l87282K03414j73349J69030m8137r9015K06352J32173l58573
14590A408682K84769J98404l69871q0378N838L50966o5314k28725J65946N6697
14580A727014L36857l71574J23772l48649L92082K6127k69527l8262J75556J34790
14570A888186n5442K19624n75859L11441m08974N10252R2131K0675J22265k43903
14560A880396J25j11192K83414R1549M3209K25959j20226j77768M53867k54715
14550B314618j17323J73479K36662L62664j83862k52873K8637N20762o5793K34008
14540C250979M84928K69338O55718M95232Q10170J985664K180184M493549O582378
$$ y = [1300810, 1415063, 1685098, 1174389, 1505289, 1200237, 1285250, 1110009, 1167682, 1674538, 1340205, 1764069, 1376787, 1580201, 1406852, 1575882, 1527745, 1428730, 1635082, 1767255, 1408682, 1693451, 1891855, 1521984, 1441606, 1447444, 1798410, 1733096, 1504371, 1670317, 1727014, 2063871, 1692297, 1816069, 1467420, 1859502, 1885629, 1616102, 1577840, 1753396, 1888186, 1832744, 2052368, 1476509, 1787950, 1378976, 1889228, 1981359, 2002034, 2124299, 1880396, 1880521, 1769329, 2052743, 2144292, 2187501, 2413460, 2293234, 2115466, 2569333, 2314618, 2197295, 2370774, 2607436, 2970100, 2786238, 2533365, 2562002, 3082764, 3016971, 3250979, 3735907, 4005245, 4660963, 5156195, 5966365, 7952029, 10132213, 14625762, 21208140]
14531B1208140J0877170N32006j5515126p154056l787723j416014n9751j60304
14523D524342L19830N6540j415996m67487m56009l59485L97156k21657n229j77829
14513B194176k81208J25270L8000L29334k67933j07404K54501Q4829K53448j10376
14503B512637l18362J03235j84537M02430J96726q3686J41788j89696j50113L26641
14493B757063l45217K69873J96164K64018j88052J19411k59212L68744j64521
14484C018271n7822J33738Q9869j60074K84900N6675m13982N07407k07631K7735
14474C279086Q1445q4135L64172m6908Q4410k15203L69549m7726j96783L62857
14464C950764k34005Q8645Q0579m5789J76036J73845j8547j12356R0185j39184
$$ y = [21208140, 32085310, 32617316, 17102190, 9948134, 6160411, 4744397, 4684646, 4524342, 4844172, 4900712, 3484716, 3017229, 2561220, 2201735, 2598891, 2377234, 2372005, 2194176, 1912968, 2038238, 2076238, 2405572, 2137639, 2030235, 2284736, 2369565, 2623013, 2512637, 2194275, 2297510, 2112973, 2515403, 2712129, 2628443, 2770231, 2580535, 2430422, 2757063, 2411846, 2681719, 2877883, 3141901, 2953849, 3073260, 2814048, 3182792, 3018271, 2960449, 3094187, 3184056, 3023982, 3308882, 3365557, 2951575, 3458982, 3251351, 3279086, 3360531, 3276396, 3640568, 3593660, 3678070, 3462867, 3832416, 3784690, 3587907, 3950764, 3716759, 3805404, 3885983, 3840194, 4016230, 4190075, 4171528, 4059172, 4149357, 4010173]
14454D010173K84658M1691L5844j51996M69480J64826n27304L73441K87472j03276
14444D885009l53529L08053J30875K06960k27071j4971L5392L48510l3959k98090
14434D987179N53880j88919L0368R4262J3638R9317M13884k39464j63777L00635
14424E901003K58887n5450l3030N01036m76734K38401J14926K15209k52826O39602
14414G051024k31178J71285R5955K19552J59921J79167j91238J72777P22067l27309
14404H022023K01682K65984K0920J36988l32378M40641l4468J37982L49963j49284
14394I060053K27136o1230M74678K6019J20467K93537K69442K00600o9282k0495
14384A0520925J80227M01469j85092J27595M13640K5717K09663M69130r7907l871
$$ y = [4010173, 4294831, 4336522, 4372366, 4220370, 4689850, 4854676, 4327372, 4700813, 4988285, 4885009, 4531480, 4839533, 4970408, 5177368, 4950297, 4935326, 4970718, 5319228, 5285269, 4987179, 5541059, 5352140, 5382508, 5476770, 5490408, 5589725, 6003609, 5764145, 5600368, 5901003, 6159890, 6104440, 6071410, 6572446, 6095712, 6334113, 6449039, 6664248, 6411422, 7051024, 6819846, 6991131, 7087086, 7306638, 7466559, 7645726, 7454488, 7627265, 8349332, 8022023, 8223705, 8489689, 8510609, 8647597, 8315219, 8755860, 8721392, 8859374, 9209337, 9060053, 9287189, 9225959, 9700637, 9726656, 9847123, 10140660, 10410102, 10610702, 10541420, 10520925, 10701152, 11102621, 10917529, 11045124, 11458764, 11484481, 11694144, 12163274, 12065367, 12061496]
14374A2061496K83128L70187j10580L53298N10326N07375p6222N83768M45491
14365A4928267j06950L11104K81684J81219J59766P06998R8124N3328N07720P04790
14355A7826050K05711L0381L51407P78915L60684L68943M40370O44620K25150
14346B1232231M03118M64547L01889P07203N11188J24853P24441Q17578N70462
14337B5857510M62241M81183R71351R49373L42513O93689Q08516R08791O53019
14328C2128186R95337J069183P08186N24851J119777R41541J279351J271346R66776
14319D1004534J294302Q99237J989412J178148J218399J783609J447221J727926
14311E2542788J792410J564090J966073K183410K076668K241316K267662K328297
$$ y = [12061496, 12344624, 12714811, 12604231, 12957529, 13467855, 13975230, 13899008, 14482776, 14928267, 14821317, 15132421, 15414105, 15595324, 15755090, 16462088, 16560212, 16613540, 17121260, 17826050, 18031761, 18062142, 18413549, 19192464, 19553148, 19922091, 20362461, 21007081, 21232231, 21635349, 22099896, 22401785, 23108988, 23620176, 23745029, 24469470, 25287048, 25857510, 26319751, 26800934, 27772285, 28721658, 29064171, 29757860, 30566376, 31475167, 32128186, 33123523, 34192706, 34900892, 35425743, 36545520, 37487061, 38766412, 40037758, 41004534, 42298836, 43198073, 45187485, 46365633, 47584032, 49367641, 50814862, 52542788, 54335198, 55899288, 57865361, 60048771, 62125439, 64366755, 66634417, 68962714]
14303F8962714L017383K555501K865128K831161L043830L262716L768497L323066
14295I3629996M421294M240790M129241N118366M876809N059320N692981O087823
14287A33256620O244199O786958O691074P782572Q047195Q745048Q859824R426482
14279A95839972R993387J0907736J1141812J2146906J2690765J3376472J3799054
14272B79896104J4447946J4932484J5141680J5315334J5279966J5387805J4327294
14265C84728613J4080966J2945776J2651527J1870125J0353249R464318P969458
14258D64064032M256885K499470K286530M262401J042887o181390n128149q653188
14250D58449478j1280432j0868970j2124981j2150693j4364719j3608978j4136949
$$ y = [68962714, 71980097, 74535598, 77400726, 80231887, 83275717, 86538433, 90306930, 93629996, 98051290, 102292080, 106421321, 111539687, 116416496, 121475816, 127168797, 133256620, 139500819, 146287777, 152978851, 160761423, 168808618, 177553666, 186413490, 195839972, 205833359, 216741095, 227882907, 240029813, 252720578, 266097050, 279896104, 294344050, 309276534, 324418214, 339733548, 355013514, 370401319, 384728613, 398809579, 411755355, 424406882, 436277007, 446630256, 456094574, 464064032, 468320917, 470820387, 473106917, 477369318, 478412205, 472230815, 467102666, 458449478, 447169046, 436300076, 424175095, 412024402, 397659683, 384050705, 369913756]
14243C69913756j4449574j4936781j3969108j4239273j4069928j3615228j3606027
14236B71027837j2286694j1893442j1362011j1064519j2021865j1455145j0498273
14229A90445888r614183r121691q693815p807796p567118o919567o078832o430935
14221A28211951n852527n317309n436455m493568m452171m337951m257718l186605
14213I0877647l859621l447657l281868k787146l266139k699464k360618k626135
14205F6548999k079217k424727k002851k154635j935828j888200j241717j504070
14197E1317754j853941j854877r80283j684081r75729q54746j425058j179865
14189D0509174j438243j213703q01168r84068m86865j236693j095005q68986p52785
$$ y = [369913756, 355464182, 340527401, 326558293, 312319020, 298249092, 284633864, 271027837, 258741143, 246847701, 235485690, 224421171, 212399306, 200944161, 190445888, 180831705, 171710014, 163016199, 155208403, 147641285, 140721718, 134642886, 128211951, 122359424, 117042115, 111605660, 107112092, 102659921, 98321970, 94064252, 90877647, 87018026, 83570369, 80288501, 77501355, 74235216, 71535752, 69175134, 66548999, 64469782, 62045055, 60042204, 57887569, 55951741, 54063541, 52821824, 51317754, 49463813, 47608936, 46628653, 44944572, 43968843, 43114097, 41689039, 40509174, 39070931, 37857228, 37056060, 36071992, 35585127, 34348434, 33253429, 32384443, 31631658]
14180C1631658p17340o56893j105471o19509m98606j008861n17293p41664n20315
14171B5245706n00012o67225m48345m58682p61900m99697m03986o59626m2538
14162B0803695n34652l91620m53640m26820l48470m2473m41352n40976k80561
14153A7343131l52808l65497k44422l05348l94856J4188m17777n84951l18051
14144A4373609l2500N9302o65792K31213l26665k13442o03204r7978R8070m92628
14134A2329985J05043l42816l16615J48869l29271j10730k71932l37136j40265
14125A0735132j63714l8270J17836k97657l22193O5619k31665j32391j13162m560
14115I614975k31656n86555K47187m10244j14146K06066j22224m29445q6490K50736
$$ y = [31631658, 30914318, 30257425, 29151954, 28532445, 28033839, 27024978, 26507685, 25766021, 25245706, 24745694, 24078469, 23630124, 23171442, 22409542, 21909845, 21505859, 20846233, 20803695, 20269043, 19877423, 19423783, 18996963, 18648493, 18606020, 18164668, 17623692, 17343131, 16990323, 16624826, 16380404, 16075056, 15680200, 15694388, 15276611, 14691660, 14373609, 14341109, 14400411, 13734619, 13965832, 13639167, 13425725, 12822521, 12724543, 12822613, 12329985, 12435028, 12092212, 11775597, 11924466, 11595195, 11484465, 11212533, 10875397, 10735132, 10571418, 10533148, 10650984, 10353327, 10031134, 10096753, 9865088, 9732697, 9619535, 9614975, 9383319, 8796764, 9043951, 8633707, 8519561, 8725627, 8603403, 8173958, 8087468, 8338204]
14105H338204n11607K92222l73536q8765K52518n15322L90118o05558N4943j96523
14095G036694K90185m09854j80148M1849l40780K34787q1878k3360m04165M06968
14085F570298l50764O354q1580k72647M7464K05455k62940l6228n7870J1694k53501
14074E525735j56760k9141L62912n18638L8515j30807K1864K28023m97659J86301
14064E030345l25257L82907M3300Q8253m92874j5351J36812m69736K32407q8803
14054D522003n6766m2770j15238j4382j33097l2025L64926m25614K16914K85679
14044D569630o78918L66506k15784j31145M09959n74030Q5119k99050J58290J26036
14034C816613j75904J94149k12177J11281l99388Q184L14417j35648N0459k72431
$$ y = [8338204, 7826597, 8118819, 7745283, 7656518, 7909036, 7393714, 7783832, 7178274, 7233217, 7036694, 7326879, 6917025, 6736877, 6778726, 6437946, 6672733, 6590855, 6567495, 6163330, 6570298, 6219534, 6225888, 6144308, 5871661, 5919125, 6124580, 5861640, 5825412, 5767542, 5779236, 5525735, 5368975, 5339834, 5702746, 5184108, 5222623, 5091816, 5113680, 5341703, 4844044, 5030345, 4705088, 5087995, 5131295, 5219548, 4726674, 4711323, 4848135, 4378399, 4610806, 4522003, 4465237, 4422467, 4307229, 4292847, 4159750, 4127725, 4492651, 4067037, 4283951, 4569630, 3890712, 4257218, 4041434, 3910289, 4320248, 3746218, 3831337, 3532287, 3690577, 3816613, 3640709, 3834858, 3622681, 3733962, 3334574, 3342758, 3657175, 3521527, 3571986, 3299555]
14024C299555N5164q5779m18384Q5199L71388j44400O0891k32433K37273m8463
14014C180011j23431J72391j50453j77379J1117l48277R4283K77805j56179K74439
14004C054327l64852j47816j92333K70665J15043k46700K34456R4386n96920J57316
13994B377572L24433k58829L5505k03103K7305M9667O6162L8265p5350j68753
13984B212874j73636K16549j39374J53289L66828j20842O76524P7138O09739J183684
13974E062773J711028L656938O374788J0696719P863874j2891315q640261m521232
13966I313312j876240j953155o70874l61442o42954J10586l12006k38546P0485
13957C439166q28966M02495q4994k45210q9594k15774k4407j54211L68394j42124
$$ y = [3299555, 3354719, 3268940, 2850556, 2935755, 3307143, 3162743, 3223634, 2991201, 3228474, 3180011, 3056580, 3228971, 3078518, 2901139, 2912256, 2563979, 2658262, 2936067, 2779888, 3054327, 2689475, 2541659, 2349326, 2619991, 2735034, 2488334, 2722790, 2817176, 2220256, 2377572, 2702005, 2443176, 2478681, 2275578, 2302883, 2352550, 2418712, 2456977, 2381627, 2212874, 2039238, 2255787, 2116413, 2269702, 2636530, 2515688, 3192212, 3269350, 3879089, 5062773, 6773801, 10430739, 16805527, 27502246, 35366120, 22474805, 13834544, 9313312, 7437072, 5483917, 4813043, 4451601, 3808647, 3919233, 3607227, 3368681, 3439166, 2610200, 3012695, 2927701, 2682491, 2592897, 2377123, 2352716, 2198505, 2566899, 2424775]
13947B424775L316n3779J12871l70613k21367L93252j80569k8595l69903K67168
13937A976556J69328J00264K0786n78851M09380J42465k86186o2239N6509j45896
13927A802116j63789K07961r5114J52067m29069J43478m2652J95507k34694M46850
13917A982661k25469p6657J67296l61220K35254j29986j128n7136L89951k62592
13907A660974J70129l21951J39799j40974n8986J77437q7448m3952N6590N5276
13897A606894n37631L85580l18385M02551l57702j61041M51412O2468l49274L90991
13887A575863l85005K47916J49656n440M9335o15516M21682j53995J4927n3278
13877A246145M52710o42997J02759K65614J09084k32903j49713L43306j78522
$$ y = [2424775, 2428091, 2374312, 2487183, 2116570, 1895203, 2288455, 2107886, 2079291, 1709388, 1976556, 2145884, 2246148, 2266934, 1688083, 2097463, 2239928, 1953742, 1891503, 1948012, 1802116, 1638327, 1846288, 1751174, 1903241, 1474172, 1617650, 1574998, 1770505, 1535811, 1982661, 1757192, 1680535, 1847831, 1486611, 1721865, 1591879, 1590751, 1533615, 1923566, 1660974, 1831103, 1509152, 1648951, 1507977, 1448991, 1626428, 1538980, 1495028, 1551618, 1606894, 1069263, 1454843, 1136458, 1539009, 1181307, 1020266, 1471678, 1534146, 1184872, 1575863, 1190858, 1438774, 1588430, 1582990, 1632325, 1016809, 1438491, 1284496, 1299423, 1246145, 1698855, 1055858, 1158617, 1424231, 1533315, 1300412, 1150699, 1494005, 1315483]
13868A315483N3018J06363r1005o0895p0868L5927l7836k00620L24192j65527
13858A208232R2308k24906K77633q0259J3908o6343n3447m1870K63186k6195K8867
13847A391114n84087L81836N6561l3692m97722N11507j88408J38630j97110P7724
13837A056353J73512l7197n8872k05939o1448M47380k51503O410J49443l41598
13827H76541j06711L09855j79844n5427L78741r1943m583n18875K31589j71969
13817F67374M23723J13399l7403P1850p8575j30258j12196L36808J0232m71511
13807G93443j13344N64549K2566j86104l27541J71882j59855L80201j97326L3876
13797I82347l37397J29749J64416r2209o333J54689j70050K73538l17735j39926
$$ y = [1315483, 1368501, 1474864, 1383859, 1322964, 1252096, 1288023, 1250187, 1049567, 1373759, 1208232, 1300540, 1075634, 1353267, 1273008, 1286916, 1220573, 1167126, 1125256, 1388442, 1362247, 1391114, 807027, 1188863, 1245424, 1211732, 714010, 1225517, 1037109, 1175739, 978629, 1056353, 1229865, 1192668, 1133796, 927857, 866409, 1313789, 1062286, 1068696, 1218139, 876541, 769830, 1079685, 899841, 844414, 1223155, 1131212, 1126629, 607754, 839343, 667374, 1091097, 1204496, 1167093, 1238943, 1160368, 1030110, 917914, 1254722, 1264954, 793443, 680099, 1244648, 1267214, 1081110, 753569, 925451, 765596, 1145797, 948471, 982347, 644950, 774699, 939115, 846906, 840573, 995262, 825212, 1098750, 781015, 641089]
13787F41089J81458J12054J24084k99742J23297j26833K50955l39541O483L6792
13777G10096J73739j55542N9845o8634K81471l6285k44102L13635l70228j78198
13767D85797L46257k19514J91931j086l05666M38043k01573N344j43658j64153
13757D31722M06395k25767J34421M24763m84730j75692K27973K9632j43785J89451
13747H14383m0781j97307O7894N6076j7192l6840L13244k23073Q3079C85482M75721
13736H61203J69348B92825K40021j88716L00904J67906K6565j27805q8974j73516
13726D49210J66245n5036j88241J32618K16839k27375L7538K87778r1705l39561
13716C88310J58264O6328j38899j60931L06563K06393k53835K13063j10529A92677
$$ y = [641089, 822547, 934601, 1058685, 758943, 882240, 755407, 1006362, 666821, 673304, 710096, 883835, 728293, 788138, 719504, 1000975, 964690, 720588, 1034223, 663995, 485797, 832054, 612540, 804471, 803385, 497719, 935762, 734189, 739533, 595875, 431722, 838117, 612350, 746771, 1171534, 686804, 511112, 739085, 768717, 624932, 814383, 773602, 576295, 644189, 700265, 683073, 646233, 959477, 736404, 819483, 385482, 861203, 1030551, 292825, 532846, 344130, 645034, 812940, 839505, 711700, 622726, 449210, 615455, 560419, 372178, 504796, 721635, 494260, 531798, 819576, 727871, 388310, 546574, 612902, 474003, 313072, 619635, 826028, 572193, 785256, 674727, 192677]
13705H44261m9107k91284j33153J01420M0017N2044K13156k83634J18221A52498
13694A006405D39908m5013K18892j07997L99855B06759M23046L9563j59914Q1685
13684E91139J19682l38980J51457B54195N98768C64573N8334p4728J21856L8737
13674E08772j33225j22424O87798l81176B39276j08397N79201l28494L41363j21512
13664F01437k00483L7109j92688K56930B40436J13890J6559J29754B00792R029
13654B09821N02416q8241O0035j66904j17056o4328K42325R4506j90165J17362
13644E99771k21537p7556J83144j07488g7924C49725M66117q5834k11950q6781
13634D31277k4074K81700C30539M24924j64762A46803K68824j39342K88959j04770
$$ y = [844261, 795154, 503870, 370717, 472137, 512154, 564198, 777354, 493720, 611941, 152498, 1006405, 439908, 394895, 613787, 505790, 905645, 206759, 629805, 669368, 509454, 591139, 710821, 371841, 523298, 254195, 852963, 364573, 422907, 348179, 470035, 508772, 375547, 253123, 940921, 559745, 239276, 130879, 710080, 381586, 722949, 601437, 400954, 438063, 245375, 502305, 240436, 354326, 370885, 500639, 200792, 209821, 712237, 623996, 684031, 517127, 400071, 335743, 578068, 672574, 482409, 599771, 378234, 300678, 483822, 376334, -77924, 349725, 815842, 730008, 518058, 431277, 407203, 688903, 330539, 755463, 590701, 146803, 415627, 276285, 565244, 460474]
13624D60474L29936C69299K46537B76136j15172L60141B22814L33197k62711J57145
13614D50445J61498k74508R9668J5340h1694C66174J36719B44943K85100O2103
13604E92146q2787j38674j14142L30484B77908P3692K64619Q7136r9233B05808
13593D06330q7482J68338l3575J18833q062A71379K13761c3273D81792J5308B46723
13581A19755K77621L28445B79542m779J33538J96844B10826k0285L53742A55046
13570D79897A86593K76191r9420A69314M7847J2580J70164k5636A81434J61591
13560C43025A03980J26604m5944J31903K08271k04064a8204A93478J03541j46769
13550A50250L16403q8410R0011l4708j69602j03594P4510k7706K32532o4478j81990
$$ y = [460474, 790410, 369299, 615836, 276136, 160964, 521105, 222814, 556011, 293300, 450445, 611943, 337435, 437103, 452443, -81694, 366174, 502893, 244943, 530043, 592146, 509359, 370685, 256543, 587027, 277908, 351600, 616219, 703355, 604122, 205808, 406330, 318848, 487186, 453611, 572444, 564382, 171379, 385140, -33273, 481792, 497100, 246723, 119755, 397376, 725821, 279542, 274763, 408301, 605145, 210826, 190541, 544283, 155046, 479897, 186593, 462784, 363364, 169314, 217161, 229741, 399905, 374269, 181434, 343025, 103980, 230584, 184640, 316543, 524814, 320750, -18204, 193478, 297019, 150250, 466653, 378243, 468254, 433546, 263944, 160350, 234860, 207154, 439686, 375208, 193218]
13539A93218M1990j07853K44400j17259J26883O8177j71610K23475k47305L3349
13529B87465K91515A21526L62063p6217j23661J53777j92947J82917j16409J9977
13519C31026q9624J66854J74950j78789j90895J78141j70654E2795J63729E5668
13508A73370K87396j19916j11431K11403F2759L23952A66073J46452P4578l1381
13498C55722j77249a02082B96606K96175j71658H8633L4718O1625J28253b17295
13487B35359A01431L28259q7503n5667A09148K3483J44282K2860o8494K9706K48810
13476E09795A58155L70677B29107o1023K07879j74817O2229J31659K07715m5087
13466E57662E4762M44646B26680K99395l7963j36851G4655K47953M8829K8401
$$ y = [193218, 235208, 127355, 371755, 254496, 381379, 449556, 277946, 501421, 254116, 287465, 578980, 121526, 483589, 407372, 283711, 437488, 244541, 427458, 311049, 331026, 241402, 408256, 583206, 404417, 213522, 391663, 221009, 52795, 216524, 55668, 173370, 460766, 340850, 229419, 440822, 62759, 386711, 166073, 312525, 387103, 355722, 178473, -102082, 296606, 592781, 421123, 88633, 123351, 184976, 313229, -217295, 235359, 101431, 429690, 342187, 286520, 109148, 132631, 276913, 299773, 231279, 260985, 509795, 158155, 528832, 229107, 168084, 375963, 201146, 263375, 395034, 602749, 557662, 54762, 499408, 226680, 526075, 488112, 351261, 74655, 322608, 371437, 399838]
13456C99838n5477n5748E4887P9599K26336A22407K7797O8840K25801b4926A05544
13444I5439L39870A44518N0862J22952e0104A28956E707L85183p1692A55687E6862
13432B98310m8992a0426B9542L3734O8176n307l0314J01650P8883N0207A40118
13420D42171K1723j46195m616J0201j59978K58315A1040K79378N8929k94L4170
13409C83223E536K20643a03663n0959D55708A38218J74371K35835A82326m5427
13399A36899b8619a2358C11290j2209j39215R8256p3349J39236n8859d0484E0539
13387A89221J21142p9509G3799K06952J13755p8135h2546E00029o4854A06576
13376E6649A6860M25359A46028L90939A76632J5578K9275K0250F0209K21716j01290
$$ y = [399838, 344361, 288613, 54887, 134486, 360822, 122407, 150204, 219044, 444845, -24926, 105544, 95439, 435309, 144518, 195380, 318332, -50104, 128956, 5707, 390890, 319198, 155687, 56862, 298310, 249318, -10426, 29542, 63276, 131452, 126145, 95831, 197481, 276364, 326571, 140118, 442171, 463894, 317699, 313083, 323284, 163306, 421621, 11040, 290418, 349347, 349053, 383223, 5536, 226179, -103663, -154622, 455708, 138218, 312589, 548424, 182326, 136899, -28619, -12358, 311290, 299081, 159866, 258122, 184773, 324009, 265150, -40484, 50539, 189221, 310363, 230854, 73799, 280751, 394506, 316371, -82546, 500029, 435175, 106576, 56649, 16860, 442219, 146028, 536967, 176632, 192210, 221485, 241735, 60209, 281925, 180635]
13365A80635l5937K86511n8312Q4753B27420J17978a43865B02200K44270k07067
13355B39403k4615J3206M3939J91540p3493F6915K8028h9364D00884r1227J44136
13344D53793B8789J95497K62931A20955P5263B7936h6388C48305K9410M7440A94665
13332D69806G6240j615L89918B32173J98976B00219B0173K04331H9633M4150K4594
13321A58377J91565j2776F6151e4461C9710K33918H8786K75607P037H895c7576
13309C38498a8484C58934d1305j1736C12527g8114A91293L7740l7126L52226k26726
13298C17407A8589P9592L14923j25195G1772P8144J00257q177L18621H3306A9009
13286B24061J11941A51276K09463j14671J9607G5990K92833D3941L10829L2775
$$ y = [180635, 144698, 431209, 372897, 457650, 227420, 345398, -143865, 202200, 446470, 239403, 214788, 227994, 271933, 463473, 389980, 66915, 94943, -89364, 400884, 309657, 453793, 28789, 224286, 487217, 120955, 196218, 27936, -86388, 348305, 377715, 425155, 194665, 469806, 76240, 74625, 464543, 232173, 431149, 200219, 20173, 224504, 89633, 133783, 158377, 349942, 337166, 66151, -54461, 39710, 273628, 88786, 364393, 371430, 8895, -37576, 338498, -18484, 358934, -41305, -53041, 312527, -78114, 191293, 229033, 191907, 544133, 317407, 18589, 98181, 413104, 287909, 71772, 149916, 250173, 241996, 560617, 83306, 19009, 224061, 336002, 151276, 360739, 246068, 265675, 75990, 368823, 43941, 354770, 387545]
13276C87545F0134a48012H3174c197A68415j5720E5601K76210A42533i2642B5936
13264B83416q1348O9666J7436a34544A01117R5054K29073A93886o3224K83827
13254D14489o9709A27115Q0334o2944o0072J45344C0655J74462R0238G7557K88851
13243C66408i6680C65579G8563k4303J05900J2245j8122a9300B24449b25643d5890
13231B91746n9747c5763B81090G026a17065A73756L90147A62070i2754j4347E1732
13219G9095r562K87477J2253a59150D9636K21478n5131l0201f7905A39504J48999
13208B88503I9089J4409g8299A65543J13612A0641a03350B26124O1813G0907g2236
13196C48172e5933A44348N60207G9911a08709D00321j70180a01466I282J98919
$$ y = [387545, 60134, -148012, 83174, -3197, 168415, 152695, 55601, 331811, 142533, -92642, 25936, 283416, 202068, 271734, 289170, -134544, 101117, 196171, 425244, 193886, 130662, 414489, 344780, 127115, 207449, 144505, 84433, 229777, 30655, 205117, 295355, 77557, 366408, -96680, 365579, 78563, 54260, 160160, 172405, 154283, -19300, 224449, -225643, -45890, 291746, 231999, -35763, 281090, 7026, -117065, 173756, 563903, 162070, -92754, -107101, 51732, 79095, 69533, 357010, 369263, -159150, 49636, 271114, 215983, 185782, -67905, 139504, 288503, 99089, 113498, -78299, 165543, 279155, 10641, -103350, 226124, 287937, 70907, -72236, 348172, -55933, 144348, 704555, 79911, -108709, 400321, 230141, -101466, 9282, 208201]
13186B08201I6637a06230A32434A436d5316o2293G5900d7996l48662B41330a04235
13174a33080j94160a13764j18405A90578D1032J17021l5284m0394J4853B1994
13163C13812J98933a070B73119R5835j81667K5970r6972b81595A48882C7783K72585
13152C10368A46079a41093G3232i6031E5685a16644A01996a67560r2824B26874
13141C07728h9767I4240e9740E1671M5449f7909D30259j11871j15553e6903j63716
13130b20619b9195j48929A487P9805J97873g0004A25867l1630b06034C26354j30750
13119A95604J38469j51744l7940Q2388p1021h1305A0690M28715a64690A05346
13108G7340K35477b0147l2448a2053k730j38920H8391N9168J5641M8461M8095
$$ y = [208201, 96637, -106230, 132434, 1436, -45316, -107609, 75900, -47996, -396658, 241330, -104235, -133080, -327240, -113764, -232169, 190578, 41032, 158053, 122769, 82375, 97228, 21994, 313812, 512745, -1070, 273119, 368954, 187287, 213257, 116285, -281595, 148882, 37783, 310368, 146079, -141093, 73232, -96031, 55685, -116644, 101996, -167560, -260384, 226874, 307728, -89767, 94240, -59740, 51671, 97120, -67909, 430259, 318388, 202835, -56903, -220619, -29195, -178124, 1487, 81292, 279165, -70004, 125867, 94237, -206034, 326354, 195604, 334073, 182329, 144389, 226777, 155756, -81305, 10690, 439405, -164690, 105346, 77340, 312817, -20147, -52595, -12053, -14783, -153703, 88391, 147559, 163200, 211661, 259756]
13097B59756a0938j87219A4050b52554A23258n5280L11994a28952K9732B46951
13086G4968b12482R3312D4074K19873j27976e5493D6802J3085M2492J82826p6587
13075B08618h8396B82878b50924B28342d3522E4542b19497H7418b0498H3466h5433
13063a33044E4597a13734b530B21028F2868J654O8742K70432A39982h7937B12257
13051a63076B0053a8368D60392a54354c5444B61460c34166F6239P3382L6910b739
13039B69314M131a7948D5281c491k79850A01427J44868A6545K29192F9332K47280
13028C16612A30302J12684B7423a36666A57264n7454J56010r3267G0337a86468
13017a84715A07349b31835K2121A65656j9321k3167l0811K8050C8715M6718f343
$$ y = [259756, -10938, -198157, 14050, -252554, 123258, 67978, 379972, -128952, -99220, 246951, 74968, -212482, -119170, 44074, 263947, 135971, -55493, 46802, 59887, 102379, 285205, 208618, -88396, 282878, -250924, 228342, -43522, 54542, -219497, 87418, -20498, 83466, -85433, -133044, 54597, -113734, -2530, 221028, 62868, 64522, 133264, 403696, 139982, -87937, 212257, -163076, 20053, -18368, 460392, -154354, -35444, 261460, -334166, 66239, 139621, 176531, -2739, 269314, 273445, -17948, 45281, -3491, -283341, 101427, 246295, 16545, 245737, 69332, 316612, 130302, 242986, 27423, -136666, 157264, 99810, 255820, 162553, 70337, -186468, -184715, 107349, -231835, -209714, 165656, 146335, 123168, 92357, 120407, 38715, 85433, -6343]
13005I7002B8432a31169d7071F776a82415B80154K1837a29364A35838e5605D60794
12993B76937n412N5356g5151A72547e5665p1242B25855l9803b8158B75597b7789
12981B2238J56773D6253j9746b69D9929K14317E7786N3408d1609l1478B98665
12969C96677I9138a26138A77596P8572K065a60191I1623a99589e1808k72959J3826
12958c10941B91718C2212a51848o0354J6434R3407B3666K15616n0445C0586a22943
12946F1213K8339C976a57534O9675K639l94623c6667B14616a46687C4965K78137
12935C13102h3614A08885l4929J765J62387r0353c22689A48391a74035C5126R91
12924C6117J36006J5670I0578K07039a1024L387r6450M0102H7416O0489B7894
$$ y = [97002, 28432, -131169, -47071, 6776, -182415, 280154, 301991, -129364, 135838, -55605, 460794, 276937, 271525, 326881, -75151, 172547, -55665, -126907, 225855, 186052, -28158, 275597, -27789, 22238, 179011, 46253, 26507, -269, 49929, 264246, 57786, 111194, -41609, -73087, 298665, 396677, 99138, -126138, 177596, 256168, 258233, -160191, 91623, -199589, -51808, -324767, -310941, 291718, 32212, -151848, -212202, -195768, -102361, 23666, 239282, 188837, 30586, -122943, 61213, 89552, 3976, -157534, -87859, -85220, -479843, -36667, 214616, -146687, 34965, 313102, -83614, 108885, 73956, 75721, 238108, 147755, -322689, 148391, -174035, 35126, 36117, 172123, 187793, 90578, 297617, -11024, -7637, -104087, -63985, 87416, 147905, 27894]
12912A0036b41103B6353c3431B41240a23796c0952E8745a18877B46079A7581c6430
12900f492G623b9642B35025c1857A1978P022a05117H6205j2979b7113f234l4267
12888d0501D4524K58522a33798A57178n0419b52499B075J97805J92676e7109l0226
12877h7335q1943e5715A467P1640a04373p1990B79910a30645d422B86784j23664
12866A63120L851E7102M2845K04438c610D5712L0432a70434g9408j51047Q5181
12855a45274B56767a00382C48299e7569I486c6484B685M00789j56940C5917N7307
12844I3224d1553c312A16075f3540A95576m4777b6582p9575B39246j14993J43044
12833B67297i5445E494P864J6720a61566A56037o3428g2882I6317l7156K7594
$$ y = [10036, -241103, 26353, -33431, 241240, -123796, -30952, 58745, -118877, 246079, 17581, -36430, -6492, 7623, -29642, 235025, -31857, 11978, 19000, -105117, 86205, 73226, -27113, -6234, -40501, 44524, 303046, -133798, 157178, 106759, -252499, 2075, 199880, 392556, -57109, -87335, -169278, -55715, 1467, 73107, -104373, -176363, 279910, -130645, -4422, 286784, 163120, 166971, 57102, 99947, 304385, -3610, 45712, 76144, -170434, -79408, -230455, -145274, 256767, -100382, 348299, -57569, 9486, -36484, 2685, 403474, 246534, 35917, 93224, -41553, -3312, 116075, -63540, 195576, 150799, -26582, -106157, 239246, 124253, 267297, -95445, 5494, 13358, 30078, -161566, 156037, 92609, -72882, 96317, 59161, 86755]
12822H6755c6486A76843K203f8173k77720F820J09601J37783A1065R8969a03167
12810b426j3317k70790M81J3810e9934B09923n0310J62629h4939A26179b95068
12798d1228j24101c5188j97092c1530j14416I3092b64089A4273K9953R4384L11196
12787D49806A63339K1845b85288I8850a06476j20279H0670a10208A89633G4964
12776H137R9930J73824A8309Q0805a48591d1774D1705J49409a53182A2665a18543
12764a4091A45289b63846B6605b2562r7513A38709a17796A6680J5795i5284d4512
12752a40120A15867K5385l1536a06644l8559L1974D193e0505B49713H0642J46117
12741B26759a87597B54194A05289K8028B1024O6934d337A05152a20440j14813
$$ y = [86755, -36486, 176843, 179046, -68173, -345893, 6820, 116421, 254204, 11065, 110034, -103167, -2426, -15743, -286533, -286052, -272242, -59934, 209923, 159613, 322242, -84939, 126179, -295068, -41228, -165329, -35188, -232280, -31530, -145946, 93092, -264089, 14273, 44226, 138610, 449806, 163339, 185184, -285288, 98850, -106476, -226755, 80670, -110208, 189633, 74964, 8137, 108067, 281891, 18309, 99114, -148591, -41774, 41705, 191114, -153182, 12665, -118543, -14091, 145289, -263846, 26605, -22562, -120075, 138709, -117796, 16680, 32475, -95284, -44512, -140120, 115867, 141252, 109716, -106644, -145203, -113229, 4193, -50505, 249713, 80642, 226759, -187597, 254194, 105289, 133317, 21024, 87958, -4337, 105152, -120440, -235253]
12731b35253i984j5714j72412C3734a57402A81758m4422J80530j25909a6955B27540
12719a54015B73821D9423d1824B30242J0747A11214c66121B0180b72514b038q1486
12708h3524j67312A24603k9051C3927L6124c9216A87291a92210A85716b42070
12697B66346D3315j3962A0630L64295A37021D0994K4545L11324K8386F3443M34350
12686D97793B11181a90681B00095d18975D30720G0481h8595I8468a12565B17576
12675a06232C05404J4973A24892b01499i4281j6001H7685b7602D35953A86992
12664a14313C02098b13491G509R4047P4831h7008B76686b28922A57827K2432m8549
12653A31710b5928A01433B2421e3075F487g26A38996B0638h8525D2967P8066J98899
$$ y = [-235253, -9984, -25698, -198110, 33734, -157402, 181758, 137336, 317866, 191957, -16955, 227540, -154015, 273821, 49423, -41824, 230242, 240989, 111214, -366121, 20180, -272514, -2038, -83524, -250836, 124603, 95552, 33927, 70051, -39216, 187291, -192210, 185716, -242070, 266346, 43315, 29353, 10630, 374925, 137021, 40994, 65539, 376863, 405249, 63443, 497793, 211181, -190681, 200095, -418975, 430720, 70481, -88595, 98468, -112565, 217576, -106232, 305404, 320377, 124892, -201499, -94281, -110282, 87685, -27602, 435953, 186992, -114313, 302098, -213491, 7509, 101556, 176387, -87008, 276686, -228922, 157827, 180259, 131710, -25928, 101433, 22421, -53075, 6487, -726, 138996, 20638, -88525, 42967, 121033, 319932]
12641C19932d6791G4693l792a51572K0483D3388K3026P9372B3409J19696i8824
12629b26885M7068A71077i4311d0631N085B19822q8175h4397A58135j0858m6358
12618A00919J36465J43661a481A26456K40749K9037A76863G730a47716A74879
12607C8515J89273H1267a0077A85200j8405J33565L2020b18478j02434A12763
12596a99200A03065a78399M4995b7236A48108F7551K786j0673A7235M8893J59320
12585B25448b16664a0679n479A62454i1322A37706b8201A01743b56462g2460A1991
12573A05557c2267E7069J13713B7997a45857K7659A27228c63778D8723P7815g8490
12561B9995a22497d8059G3494a1823j02182c8055q58m5822F3968a18306J4735
$$ y = [319932, -46791, 74693, 70901, -151572, -131089, 43388, 66414, 145786, 23409, 143105, -98824, -226885, -179817, 171077, -94311, -40631, -35546, 219822, 131647, -84397, 158135, 147277, 100919, 237384, 381045, -1481, 126456, 367205, 396242, 176863, 7730, -147716, 174879, 38515, 227788, 81267, -10077, 185200, 166795, 300360, 332380, -218478, -320912, 112763, -199200, 103065, -178399, -133404, -27236, 148108, 67551, 70337, 59664, 17235, 66128, 225448, -216664, -10679, -16158, 162454, -91322, 137706, -28201, 101743, -256462, -72460, 11991, 105557, -32267, 57069, 170782, 27997, -145857, -118198, 127228, -363778, 48723, 126538, -78490, 29995, -122497, -48059, 73494, -11823, -114005, -38055, -38913, -84735, 63968, -118306, -103571]
12550a03571j4154M9236E31a66119C66590c35226j39369a61515A24896K9772b98225
12538a10476C0601h4859m05990A06473h4925A31326K29946C9201b62112A84551
12527D4926b2039j23613C0408a63205l5452b4486F9590r143b45998C47757a3257
12515a36946C09949a14315j23032E6270i0179A47659h6363J5331l1197D89630
12504b0173l9119B6270i7220A14812g0900n3741A30092A5141a67576m8054I8561
12492a02610e0999K2169j29151b5447E2459K50584a49254L6698B6049c4960A35958
12480A42063A0413J06614d2764j21485B1432a22932n1787E7597J50088G1243a49874
12468b37130d1819B4731J15631b33853k25568b17764B03596B1420R0159g5262
$$ y = [-103571, -117725, -68489, 531, -166119, 366590, -335226, -474595, -161515, 124896, 154668, -298225, -110476, 30601, -84859, -490849, 106473, -84925, 131326, 361272, 39201, -262112, 184551, 44926, -22039, -145652, 30408, -163205, -198657, -24486, 69590, 60447, -245998, 347757, -13257, -136946, 309949, -114315, -237347, 56270, -90179, 147659, -86363, -71032, -102229, 489630, -20173, -59292, 26270, -97220, 114812, -70900, -124641, 130092, 15141, -167576, -215630, 98561, -102610, -50999, -28830, -157981, -25447, 52459, 303043, -149254, -112556, 26049, -34960, 135958, 142063, 10413, 117027, -42764, -164249, 21432, -122932, -174719, 57597, 207685, 71243, -149874, -237130, -41819, 24731, 140362, -233853, -459421, -217764, 203596, 21420, 111579, -75262]
12457a01122j86263Q3037L7733A07880a26066b2057o6288B76735j20305a78702
12446a75632F9606j9111K53285a06289E5907J97501c3206B44545b29098A2693
12435C9392J10328e2407a7297C7780B447b39220a10054K7314K7065r3693D3843
12423A26904a40112n0435A25088D6143a02924b5454C51293d674m9188k35830F3064
12411C047J58647c44823A20806k3722N9765m3834K4280b42213g5378k41936b3801
12399D11670m7520j39526a9117B29527D6124c4554m5199K6417n2953b3046C5932
12387h8970a6114A48835M3094d8781j10389F0483a10493j7109K4438B18716D2661
12375a55519M3361K4993h688A67391A7366a01887H6506J6042c2759k37388b4734
$$ y = [-101122, -287385, -204348, -166615, 107880, -126066, -22057, -88345, 276735, 156430, -178702, -175632, 69606, 50495, 303780, -106289, 55907, 253408, -33206, 244545, -229098, 12693, 39392, 149720, -52407, -17297, 37780, 2447, -239220, -110054, -82740, -55675, -149368, 43843, 126904, -140112, -190547, 125088, 46143, -102924, -25454, 351293, -4674, -53862, -289692, 63064, 3047, 161694, -344823, 120806, 97084, 156849, 113015, 137295, -242213, -75378, -317314, -23801, 411670, 364150, 224624, -19117, 229527, 46124, -34554, -79753, -53336, -106289, -23046, 35932, -88970, -16114, 148835, 191929, -48781, -159170, 60483, -110493, -127602, -103164, 218716, 42661, -155519, -112158, -87165, -8688, 167391, 17366, -101887, 86506, 102548, -32759, -270147, -24734]
12363F5004k4815J02189l6215m0943L5972c2911i457G0852a90035g3814B03208
12351f0057A64096O4984l1168a65872C2228J32181a98125M1090P4339A9261Q3913
12340A03174l9255K71623b83328a8605m7519E0103a84664A575d8290A31368C3321
12328a6660b493j81132a4498p1890G6185L88761j89171F673K7617Q7217Q4255
12317B05762O506e8543H1961J87497n4061G6922b20233a7599C06818G1888e1489
12305a56487E60606A51110j9501M7298N18236B14021F2406e4440j7341B4524M8262
12294G2786J98917A15734a1923j46327f2605a3003k4444k6468A98891j8572a08366
12282A49545e7963o5837L1226A5908f0839B66736d0068B63687p5044a26172G3457
$$ y = [65004, 40189, 142378, 106163, 65220, 101192, -32911, -9457, 70852, -190035, -73814, 203208, -60057, 164096, 229080, 197912, -165872, 32228, 164409, -198125, -157035, -82696, 19261, 103174, 63919, 335542, -283328, -18605, -66124, 50103, -184664, 1575, -48290, 131368, 33321, -16660, -2493, -183625, -14498, -86388, 76185, 464946, 275775, 6673, 34290, 121507, 205762, 212268, -58543, 81961, 269458, 215397, 76922, -220233, -17599, 306818, 71888, -51489, -156487, 560606, 151110, 131609, 178907, 697143, 214021, 62406, -54440, -71781, 24524, 72786, 271703, 115734, -11923, -158250, -62605, -13003, -37447, -63915, 198891, 180319, -108366, 149545, -57963, -123800, -92574, 15908, -60839, 266736, -40068, 263687, 188643, -126172, 73457]
12270c00235C0140K32051Q0697K3582j06975b42989A75959K51422j95309a11508
12259b98842a00507C59972m057j33009b6016E0308K43323a75899C20818a37415
12248A44954M01861A69367P5392q5894k4231j8608C9608K05899A5355K08999K4849
12237B49203o2218K45300I7957K40540d4385C06580j50631K14369A55247b27259
12226D56371a25560E5967B2621h8299A18987R6234j4759A7126J89502a45503N6580
12215h8923A50428j4489a55147A28719D9409J29769P6094j20201P7178Q4226j17323
12204A79152E6014j9288a18487A85129K97720I5970J37569P6583r4417c68406
12193f271j75235B46822J73649a6498m8234q667L2325J9707C45208j30308K94498
$$ y = [-300235, 30140, 262191, 342888, 366470, 259495, -242989, 175959, 427381, 232072, -111508, -298842, -100507, 359972, 355915, 222906, -26016, 50308, 293631, -175899, 320818, -137415, 144954, 546815, 169367, 244759, 158865, 134634, 116026, 39608, 245507, 15355, 224354, 249203, 186985, 432285, 97957, 338497, -44385, 306580, 155949, 370318, 155247, -227259, 456371, -125560, 55967, 22621, -88299, 118987, 215221, 200462, 17126, 206628, -145503, -88923, 150428, 135939, -155147, 128719, 49409, 179178, 255272, 135071, 212249, 296475, 179152, 56014, 36726, -118487, 185129, 482849, 95970, 233539, 310122, 215705, -368406, -6271, -181506, 246822, 420471, -16498, -64732, -73399, -41074, -21367, 345208, 214900, 509398]
12182E09398b17931A66766a2262A93809k9509n6514J8123L16183k05223O406P5168
12171C18443E7482J12876f4253C5090a7351C79929B126M925K89429J07359B5389
12159B04550A01080J7589J73678h3357j30868j86789A20932n6387J5990C1594
12148C96027a43637A02547O288c1885A24775n1366L14749j30045a53387A01783
12137C297J36185a19792D3745J41743a88454B38324A09475J80007a46929b6524
12126A81692H932c9308j97874A68638C792a87556A8994f3303C73705c2689n5167
12115h7856I3785D4243B0053J35638b21029I424K10082O8765J72705a68114A32493
12103h88A49125L42239A68453n0453P5058J499K5520j8899R4738f7852j80421
$$ y = [509398, -217931, 166766, -12262, 193809, 164300, 107786, 125909, 442092, 236869, 243275, 318443, 57482, 170358, -64253, 35090, -17351, 379929, 2126, 7051, 296480, 403839, 25389, 204550, 101080, 118669, 292347, -83357, -214225, -401014, 120932, 64545, 80535, 31594, 396027, -143637, 102547, 108835, -31885, 124775, 73409, 388158, 258113, -153387, 101783, 3297, 139482, -119792, 43745, 185488, -188454, 238324, 109475, 289482, -146929, -26524, 181692, 8932, -39308, -237182, 168638, 3792, -187556, 18994, -63303, 373705, -32689, -87856, 93785, 44243, 20053, 155691, -221029, 9424, 219506, 288271, 460976, -168114, 132493, -888, 149125, 491364, 168453, 118000, 193058, 194557, 220077, 201178, 295916, -67852, -248273]
12092b48273D5352J72267i3414b1653A77747L8303K1952a0459E4238J42847m9002
12081A48083d5538B01391p0202a26217E6288J0844J22971o6082E3574P5914a933
12069C45757A45195B2728a45148C19628j32178C3524g8453B39723r1225P0449
12059B18947G1806r242M3797K565J23188a14100A07863K6689a1527A13260K18608
12048C31868A57298j9713L07906j43497A28099E5185J13312o0627J80179j24195
12038A63854G3741r98B4816m698a66180N0792d4474m0749B01511c6004B90477
12026a71253K7336c4002j81304c9716A73741J00580B7256b37695F9848c12320
12015g5567B33361I3511q570a9881R57k12660E0676a05426B23051A04665O5607
$$ y = [-248273, 45352, 217619, -93414, -21653, 177747, 216050, 238002, -10459, 54238, 197085, 148083, -45538, 201391, 131189, -126217, 56288, 67132, 190103, 124021, 53574, 129488, -1933, 345757, 145195, 22728, -145148, 319628, 187450, 33524, -78453, 239723, 148498, 218947, 71806, 62564, 106361, 108926, 232114, -114100, 107863, 134552, -11527, 113260, 331868, 157298, 137585, 445491, 301994, 128099, 55185, 168497, 107870, 288049, 163854, 73741, 72743, 24816, 20118, -166180, -115388, -44474, -85223, 201511, -36004, 290477, -171253, -143917, -34002, -215306, -39716, 173741, 274321, 27256, -237695, 69848, -312320, -75567, 233361, 93511, 84941, -19881, -18924, -231584, 50676, -105426, 223051, 104665, 170272]
12004A70272e3647A64803J26216L6091e3912B4242N1639K02541b99497B6630M7903
11993G4533M2451h4493B75849d9918F6626K18097j17405F5590Q1117j6458a01032
11981D36073c7597m7283F0863J2963L01559D7820N9023d5947C3633Q7814b29196
11969d128B70209c7888J078k06869j37465a7580l19545B42991B3456J25233a74570
11957D3525a50505c4396F3070a37007A23945d0450A95705b96441D6830J46903
11947A93733a99010D7301a25741H8937a25160k71592a84811E1474b7579j38449
11937a66028a8807l30878h8963c1075j03322A56038E4630b88432D9504R9412a86483
11925A52313h0942F9388j9989N7653l0322a64932j14799a04197M997B40158a96377
$$ y = [170272, -53647, 164803, 291019, 327110, -53912, 24242, 75881, 278422, -299497, 26630, 74533, 116984, -84493, 275849, -49918, 66626, 284723, 167318, 65590, 146707, 130249, -101032, 436073, -37597, -84880, 60863, 73826, 375385, 47820, 106843, -45947, 33633, 121447, -229196, -4128, 270209, -37888, -36810, -243679, -381144, -17580, -337125, 242991, 23456, 148689, -174570, 43525, -150505, -34396, 63070, -137007, 123945, -40450, 195705, -296441, 46830, 193733, -199010, 47301, -125741, 88937, -125160, -396752, -184811, 51474, -27579, -166028, -18807, -349685, -88963, -31075, -134397, 156038, 54630, -288432, 49504, 148916, -186483, 152313, -80942, 69388, 49399, 107052, 76730, -164932, -279731, -104197, -99200, 240158, -196377]
11913d27538A05690a32014D0310J76135k0487f4443G3170J28204b20602d3953
11902D8717K72054P062j46825G6667J51312A06645b4953A21407L0232b72524D0162
11890B29378a7759k43729J21607q9796B746d4283j27206I8217a8467j83578G950
11878b35885A8547h4744H4443i8213b0068k9267k38713E9468b30416R4457C309
11866B42996J00442K5179H7657j0905e6664J7354j7150C4069i3710G2905e44438
11854b10714A39154E6616a32127A20778M2393A9292a72970n1840b1113p2274A87418
11842G2792C2749c48125a5635H1253b47264F1786d00850i7438j88423D6282J31819
11831A78101b78973A97416a19710G0312c07949E6296a12001e5943H0031i2859
$$ y = [-427538, 105690, -132014, 40310, 216445, 195958, -64443, 73170, 201374, -220602, -43953, 48717, 320771, 327833, 181008, 76667, 227979, 106645, -24953, 121407, 151639, -272524, 40162, 229378, -17759, -261488, -139881, -229677, 2746, -44283, -171489, 98217, -18467, -202045, 7950, -235885, 18547, -84744, 84443, -98213, -20068, -49335, -288048, 59468, -230416, -135959, 3309, 242996, 343438, 368617, 87657, 76752, -56664, -39310, -56460, 34069, -93710, 72905, -544438, -210714, 139154, 56616, -132127, 120778, 163171, 19292, -172970, -224810, -21113, -93387, 187418, 72792, 32749, -348125, -15635, 81253, -247264, 61786, -400850, -97438, -285861, 46282, 178101, -278973, 197416, -119710, 70312, -307949, 56296, -112001, -55943, 80031, -92859]
11820a04030p8686B46465a52717o3937C5026c07040H6343b2352p6769J5590C1029
11808B98678c18908e1119l93890a30970C4244K5061a42646C13933r1931g4080
11797h5715m5175A0077J5470a59940B3465J75462D0355D345N9839b3954n4602
11786g8556F7935h947q7570k46439a09593L0059B12514b43044J19167p2381N1657
11775a44601C6077g7093E1535b14134B18822f3221n7456q8817B77113J74045b40270
11763A8614e1433o7111A99948C3208b40881h3190C2338i5408A10988a8544B18848
11751B99378A09328d1844I7398a94048D6575J61968b48087m0061a06436C8962
11740G9375C6844c94834a58196A57489b15002D5004b28539l9746A18034a34981
$$ y = [-104030, -182716, 246465, -152717, -216654, 35026, -307040, 86343, -22352, -99121, -83531, 31029, 298678, -318908, -51119, -445009, -130970, 34244, 59305, -142646, 313933, 222002, -74080, -85715, -130890, 10077, 25547, -159940, 23465, 198927, 40355, 4345, 64184, -23954, -78556, 67935, -8947, -96517, -342956, -109593, -79534, 212514, -243044, -123877, -196258, -144601, 36077, -77093, 51535, -214134, 218822, -63221, -120677, -209494, 277113, 451158, -240270, 18614, -51433, -118544, 199948, 33208, -240881, -83190, 32338, -95408, 110988, -18544, 218848, 299378, 109328, -41844, 97398, -194048, 46575, 208543, -248087, -288148, -106436, 38962, 79375, 36844, -394834, -158196, 157489, -215002, 45004, -228539, -268285, 118034, -134981]
11729D5802J55931g2654r3075A3020b38352C20759A29K4606J83943b8103n1490
11718g9593D10265f1989A09017l2441d5311J1254A06761l5409e6323G7936a47024
11706b46934D80925i1099L8043j37382M7516f4690A67979b64596G8737K28064
11696C06801k1835b90704f3121F7305j7912K43322a20089C0368a15414M7116E43952
11684A25397c2320G6569A9983K29409g1842I6253f2028A15342e5996A48573J15112
11673B63685c11038k85729b17892C086a18465I7445M8797n2701K68633a19296
11662c7607A98236a91166e762k4808m1049G3795J76306a71798E3184Q3989o2873
11651G4300J80955l690B4245b11145b7142r5225j24379a01177B65502a5272o3606
$$ y = [45802, 201733, -72654, -165729, 13020, -238352, 320759, 129, 24735, 208678, -28103, -79593, 410265, -61989, 109017, 76576, -45311, -34057, 106761, 71352, -56323, 77936, -147024, -246934, 480925, -91099, -53056, -190438, -142922, -64690, 167979, -264596, 78737, 306801, 284966, -290704, -63121, 67305, 49393, 292715, -120089, 30368, -115414, -68298, 543952, 125397, -32320, 76569, 19983, 249392, -71842, 96253, -62028, 115342, -55996, 148573, 263685, -311038, -596767, -217892, 3086, -118465, 97445, 146242, 93541, 362174, -119296, -37607, 198236, -191166, -5762, -30570, -71619, 73795, 250101, -171798, 53184, 137173, 74300, 255255, 251565, 24245, -211145, -27142, -122367, -246746, -101177, 265502, -15272, -78878]
11640g8878H0761Q0777o0933b16305b8911o8014A47562E2194a49286D02434B4035
11628b2624l60194h795j50091B5770a77296O0170B87248b77056R5058k42173B64617
11616D0352K12113C2025a96840P5651A91552A4882K01042a97867A98958L5317
11606B34275o5645l4112K76427A13190l5473d2331A96968D5458J77800r1801f8432
11594A17762E3586j5150H25a1453k25785B05715b3783A25010a21425Q378B01489
11582e6236O377j0386j47353B18540b45135B82851a01853G6994K29134E3368j0574
11571D2794M1688i5251G2963d0224k63249R0458A00380L7374N5721q1262a91826
11559G6111J60825n0585J4121R8733A40868b47585L0815d2126A62571D0913N554
$$ y = [-78878, 80761, 161538, 100605, -216305, -28911, -96925, 147562, 52194, -149286, 402434, 24035, -22624, -382818, -8795, -158886, 25770, -177296, -117126, 287248, -277056, -181998, -424171, 264617, 40352, 252465, 32025, -196840, -121189, 191552, 14882, 215924, -197867, 198958, 234275, 168630, 134518, 410945, 113190, 77717, -42331, 196968, 45458, 223258, 131457, -68432, 117762, 53586, 38436, 825, -11453, -237238, 205715, -23783, 125010, -121425, -113047, 201489, -56236, -49859, -60245, -207598, 218540, -245135, 282851, -101853, 76994, 306128, 53368, 42794, 84482, -95251, 72963, -40224, -303473, -213015, 100380, 137754, 193475, 112213, -191826, 76111, 236936, 186351, 200472, 299205, 140868, -247585, -216770, -42126, 162571, 40913, 46467]
11548D6467a6926A93947j3670a95231A50226J09764E3823e1103B42860a14295
11537A38246J31839b60011A19727k0094a35527C00783b17647A17026Q6423G9779
11526I9918R1675j2188e3298D6120J58436r6163P5359b4941k81639C34098E6656
11514A10674d9227D8987g3080E6028N6167A874J98462J1486i31F4901B5878a6355
11501G5270C1149J79711b65983D05N2164a32434e9509m558A29172e2735A77527
11489b435A46743n8555a26833B37951q9469O7735K13016E4364J01002L8309K03856
11478C97531A37572L22637A14980a798B31659b8811k1421b2515J1177B82881c28574
11466D71473a32965l9828B51606k1476J79862j86360G5618c8055A92003o8020
$$ y = [46467, -16926, 193947, 180277, -195231, 150226, 259990, 53823, -51103, 242860, -114295, 138246, 270085, -260011, 119727, 99633, -135527, 300783, -217647, 117026, 203449, 79779, 99918, 191593, 179405, -53298, 46120, 204556, 108393, 183752, -24941, -306580, 334098, 56656, 110674, -49227, 48987, -73080, 56028, 112195, 1874, 200336, 211822, -931, 64901, 25878, -16355, 75270, 31149, 210860, -265983, 405, 52569, -132434, -59509, -64067, 129172, -52735, 177527, -2435, 146743, 88188, -126833, 237951, 148482, 216217, 429233, 54364, 155366, 193675, 397531, 137572, 460209, 114980, -1798, 231659, -28811, -50232, -22515, -11338, 282881, -328574, 471473, -132965, -172793, 251606, 230130, 409992, 223632, 75618, -38055, 192003, 123983]
11456A23983E6632a73652B35008k3097K5444A00638a8003B52776E1526J34880
11446A86406p4640Q1074q1956J04681b26631A7865c73312A06350a30379B69228
11435D63372a87295e8999i73C59443b46387C3284d8451C87325a19378j84594i8510
11423B71903D0357J46700p8226a35748C4269J88209J19777B2254k76h0238r9528
11412a79766B7892J30417K4666J40029b06065l3869D1422L93199B5545b38128
11401A53966f9889J7263B19828e7758j93448A97989a14347a9774m45689D3483
11390f11023d9308a6785A56107A6759d1763q0321H3310K18748P7302A54400d4779
11378B02161R1293c14115A76493a54545q101B13597Q0098A29493b00819B34936
$$ y = [123983, 56632, -173652, 235008, 211911, 237355, 100638, -18003, 252776, 51526, 186406, 111766, 192840, 110884, 215565, -226631, 17865, -373312, 106350, -130379, 269228, 463372, -187295, -58999, -973, 359443, -246387, 33284, -48451, 387325, -119378, -303972, -98510, 271903, 40357, 187057, 108831, -135748, 34269, 222478, 342255, 22254, 21978, -80238, -179766, 27892, 158309, 182975, 323004, -206065, -239934, 41422, 434621, 25545, -238128, 153966, -69889, -52626, 219828, -57758, -251206, 197989, -114347, -19774, -465463, 43483, -611023, -49308, -16785, 156107, 16759, -41763, -122084, 83310, 302058, 379360, 154400, -44779, 202161, 293454, -314115, 176493, -154545, -162646, 213597, 293695, 129493, -200819, 234936]
11367a83344l8219R4999B00983C0747b42864B2153b26052c9289C4011c20107f5063
11355A83043e2914A03649b56783B67177f6519l2466B97606G3036b28676a09836
11344C3262c85962a16803B93704a62077j23373D26894a76359A40561D9975a84046
11333b34317M6891C32975b32782A96913a19700B39025a13316A18322b20871K014
11323b18857Q8548K7738B01901d22151A74610H1780b23660B87173b02300A79211
11312D6642a32271K7506I6831a38254L8755A06007D374b52430G5093Q1442c7807
11300b06208i2847K5446A6452J89748b90034J13848A09478J28512I3216k2543
11290G0673a66918J3164O1857k06359l4133f4675L0584j0951D6970L0716b8580
$$ y = [-183344, -221563, -126564, 200983, 30747, -242864, 22153, -226052, -39289, 34011, -320107, -65063, 183043, -52914, 103649, -256783, 267177, -66519, -98985, 297606, 73036, -228676, -109836, 33262, -385962, -116803, 293704, -162077, -285450, 426894, -176359, 140561, 49975, -184046, -234317, -187426, 332975, -232782, 196913, -119700, 239025, -113316, 118322, -220871, -218857, -130309, -102571, 201901, -422151, 174610, 81780, -223660, 287173, -202300, 179211, 46642, -132271, -104765, 96831, -138254, -99499, 106007, 4374, -252430, 75093, 156535, -37807, -206208, -92847, -67401, 16452, 206200, -290034, -176186, 109478, 237990, 93216, 70673, -166918, -153754, -91897, -298256, -332389, -64675, -34091, -45042, 46970, 77686, -28580]
11278A05227K34862a42794B3184q986J00699k4942f7102q3728j4299P5289q1257
11267a71097L3188B46860C2285b62555g3415A03300m4085a47943e1636D7834K60058
11256C07892i0709j04387L2231c9816l0550l13734A49525K7885g5100E8439b23394
11244A70429c0306A29030o2478e5706E2444J64842n8457o2347J64959e0267l00353
11233c50620j40733A81185b5812j49620l9789A61586n5946a01982B0781i6965
11222d4817F8682h385q5859B25398a77291j27854B00401b22887I8761a39450A46388
11210c75867a83712b5396m9757B16768b23228Q4126A12797b02351a2826j62463
11200a75289P6963B6858J23651c50693A07374n3601i698A76291B3152G957b68065
$$ y = [105227, 340089, -142794, 23184, 14198, 114897, 89955, -67102, -150830, -165129, -89840, -171097, -137909, 246860, 32285, -262555, -73415, 103300, 59215, -147943, -51636, 47834, 307892, -90709, -195096, -162865, -39816, -70366, -384100, 149525, 177410, -75100, 58439, -223394, 170429, -30306, 129030, 66552, -55706, 52444, 217286, 158829, 96482, 261441, -50267, -350620, -491353, 181185, -25812, -175432, -215221, 161586, 105640, -101982, 20781, -96965, -44817, 68682, -8385, -94244, 225398, -177291, -305145, 200401, -222887, 98761, -139450, 146388, -375867, -183712, -25396, -75153, 216768, -223228, -139102, 112797, -202351, -12826, -175289, -98326, 26858, 150509, -350693, 107374, 53773, -9698, 176291, 23152, 7957, -268065]
11188a21953k83709e1471B9332e50239J46475i756m2606B50111I2998a72724l7275
11177b09999D8605a70499A42961a06999j63150C8629J9786J65359E1978a64694
11166B98816j47077b39065g5477J1303J0009A01231c09718b1406m9006A36295
11155b0168j98720Q7161b9833C94216E6630A0733J97657D662b36150F5193J3411
11144G8604a3144j13003G2043k0872j9258a1523r7596F8619b11596J03033d3647
11132d14509C2458L0325b39248K4337G2975J4247a52122F0203g5417D0181h003
11120e8291q5523k4562f608D2056J19323K74352E4936o907b82698A70032n1527
11109A18505f9702J4093A27370K06637f4905H4243b2430r1748B43884b61751J28561
$$ y = [-121953, -405662, -51471, 29332, -550239, -403764, -9756, -52362, 250111, 92998, -172724, -209999, 48605, -170499, 142961, -106999, -270149, 38629, 58415, 223774, 51978, -164694, 298816, 151739, -239065, -75477, -64174, -54165, 101231, -309718, -21406, -70412, 136295, -20168, -218888, -131727, -29833, 394216, 56630, 10733, 208390, 4662, -236150, 65193, 78604, -13144, -126147, 72043, 51171, 31913, -11523, -109119, 68619, -211596, -108563, -43647, -414509, 32458, 62783, -239248, -214911, 72975, 87222, -152122, 60203, -75417, 40181, -8003, -58291, -143814, -168376, -6608, 42056, 161379, 435731, 54936, 48029, -282698, 170032, 118505, -69702, -55609, 127370, 334007, -64905, 84243, -22430, -114178, 243884, -261751, -133190]
11098a33190d2274A61075J28547a68016B08854f7401p7794j19600A3512a95633
11087I8284i7043B84257A36978M9045d15162J89755B30157h776G2286k7347e099
11075B63968A09310D6544J97291a33625f0994C07338a07596I6264j1518J25263
11065B10009H9421R9295N9298g4092C70583m7640g3564A89675C5118K34365J64978
11054D34461p8242j03054L8469l8830N2938Q6086H8307L53447A79901J86909J94896
11043E61706p0836j17028L12400C23327K13679B58033L44661K14700n3945n6620
11033G06829J14959l18172n8795J50643j83582M17725k84310K88599J13556l70894
11023E76558j77624L47900l66072N38492k34890L7904M7842j37469N443J22541
$$ y = [-133190, -42274, 161075, 289622, -168016, 208854, -67401, -145195, -264795, 13512, -195633, 98284, -97043, 284257, 136978, 186023, -415162, -225407, 230157, -8776, 72286, 44939, -5099, 263968, 109310, 46544, 243835, -133625, -60994, 307338, -107596, 96264, 84746, 210009, 89421, 188716, 248014, -74092, 370583, 322943, -73564, 189675, 35118, 269483, 434461, 356219, 253165, 291634, 252804, 305742, 391828, 88307, 441754, 179901, 366810, 561706, 490870, 373842, 686242, 323327, 537006, 258033, 602694, 817394, 763449, 706829, 821788, 503616, 444821, 595464, 411882, 829607, 545297, 833896, 947452, 576558, 398934, 746834, 380762, 919254, 684364, 722268, 770110, 632641, 638084, 760625]
11013G60625q7822k19014A76753M15665J38871k50824o0009k08084L53709j1735
11003E54346M1188J50683l58304j16905r9M60225C30137N25072m09062J97844
10993F43991j51581J35747J86340j67734J81279C18505L66104N7228k47734P127
10983E01230N2258J84414k42289Q302K38690p296l17407M45348l94422J11048
10973E79876J2618L30837k40469k77945L04347n2292J62514J20410j80123J45507
10963I05280K92045j49415J15788K1403J46906j12882K24299J62154K40672M07973
10953B254223N7112j02625l95528L80206K44942n32125R0683k37896J10873n3317
10943A816548k85150Q3085j45030K06745k15656L84584l44195J29617l56826K64672
$$ y = [760625, 672803, 453789, 176753, 592418, 731289, 480465, 420456, 212372, 566081, 554346, 595534, 746217, 387913, 271008, 270909, 731134, 330137, 855209, 446147, 643991, 492410, 628157, 814497, 646763, 828042, 318505, 684609, 741837, 494103, 501230, 553488, 737902, 495613, 503915, 742605, 735309, 417902, 863250, 468828, 579876, 592494, 923331, 682862, 404917, 709264, 656972, 819486, 939896, 759773, 905280, 1197325, 1047910, 1163698, 1185101, 1332007, 1219125, 1443424, 1605578, 1846250, 2254223, 2311335, 2208710, 1813182, 2193388, 2438330, 1906205, 1996888, 1758992, 1869865, 1816548, 1531398, 1614483, 1469453, 1676198, 1460542, 1845126, 1500931, 1630548, 1273722, 1538394]
10933A538394k87542p7612n77860L67915C39694n5177l356K71187B42707P990
10923B50697M8387l7139r7465R2095f3432A24642A3054K7486h68A18012b51850
10911a09121D2801a42664k23615A30759j9338f634A25903a4677A68855D7335G49
10899A44508h8799j3243B05546a78472b8400L275B25529C4092f7372B27995I8180
10887B80523j08177a96442A84101a08336B30178h2184E8838Q2355a74099k15419
10877c89518J06372B88635q8174e1950k20307g4012A955a82053J3264B02459a54847
10865D931J20768A8583J925b4140j64124d9297A04992j8217d5589b1318E107b36141
10852a87317J4901H528J29626J4906a91358j2203r9630J2797j20985C7055c09159
$$ y = [1538394, 1250852, 1173240, 595380, 963295, 339694, 284517, 281161, 552348, 242707, 250697, 299084, 261945, 164480, 256575, -63432, 124642, 13054, 40540, -868, 118012, -251850, -109121, 42801, -142664, -366279, 130759, 111421, -6634, 125903, -14677, 168855, 47335, 749, 144508, -88799, -102042, 205546, -178472, -28400, -25125, 225529, 34092, -67372, 227995, 98180, 280523, 172346, -196442, 184101, -108336, 230178, -82184, 58838, 141193, -174099, -389518, -283146, 288635, 200461, -51950, -272257, -74012, 1955, -182053, -168789, 202459, -154847, 4931, 125699, 18583, 20508, -24140, -188264, -49297, 104992, 86775, -45589, -21318, 5107, -236141, -187317, -172416, 8528, 138154, 153060, -191358, -203561, -303191, -290394, -411379, 37055, -309159]
10840a49840p3879A73177A4766a91950h2503o1393p522H1963k147a0165k40660
10829b50825i1338j15485C1078a15896c1931B98281A22406e055j70797M4627l44952
10818d76177a50842P4199l41968a19305H0370J54615E4840d4910a6274m0879F7809
10806E8935a71044A81382b21062P8099B10571q2833b03760B04283d9247j18201
10796a67448C0182J52150a13809j31039A31058a06023c9215G94K53302a34909
10785b30838H3044i9977F4720b42422f679A25925l9806i5000k45742a19156A09928
10773A039R1844i9711j22959a3344l50915P0094e9761j29477L4845C44088a06581
10761c049B11560c9165E8447b57192h9831F1761q987g7445r1925B6942g307l08763
$$ y = [-149840, -223719, 173177, 14766, -191950, -82503, -143896, -151418, 81963, 79816, -10165, -250825, -91338, -206823, 31078, -115896, -31931, 298281, 122406, -5055, -175852, -131225, -476177, -150842, -76643, -418611, -119305, 80370, 234985, 54840, -44910, -16274, -57153, 67809, 58935, -171044, 181382, -221062, -142963, 210571, 127738, -203760, 204283, -49247, -167448, 30182, 182332, -113809, -244848, 131058, -106023, -39215, 794, 254096, -134909, -230838, 83044, -99977, 64720, -242422, -6679, 125925, 86119, -95000, -340742, -119156, 109928, 1039, 92883, -99711, -222670, -13344, -364259, -294165, -59761, -189238, -154393, 344088, -106581, -3049, 211560, -39165, 58447, -257192, -89831, 61761, 52774, -77445, -169370, 26942, -7307, -316070]
10749c16070a35866j02237b6403e03j14449J9669E0982A1740O4478P0152D1572
10737I4794d8815E8996k7015b36829f6746j81518E3623L05411a21620I3232M761
10726I7993J03465a05676M2855o9092F1663J04740b03629A2176J69312b4172B25730
10714A17492j3822B9732b92966E1609L13529c25368A27850j4628K8199a37154
10703c95719J45834g716k98502E3633a51351J5891a9185j95733J150H7254a07097
10691g536A7159J0516L27300a50381f2180R111D01484a11600B31888B9368h5224
10679b12967c8899k57370P5779J8912M5196B53014a69074A2057b57103J571o1926
10668c17458a37543j28331d1755m09132d2814I8844J9831c10598F9767J21262
$$ y = [-316070, -135866, -238103, -26403, -503, -114952, -95283, 50982, 11740, 76218, 146370, 41572, 94794, -48815, 58996, 31981, -236829, -66746, -248264, 53623, 359034, -121620, 93232, 97993, 201458, -105676, -62821, -131913, 61663, 166403, -203629, 12176, 181488, -24172, 225730, 117492, 103670, 29732, -292966, 51609, 365138, -325368, 127850, 113222, 141421, -137154, -395719, -249885, -7716, -306218, 53633, -151351, -135460, -19185, -214918, -213768, 87254, -107097, -7536, 17159, 27675, 354975, -150381, -62180, -53069, 401484, -111600, 231888, 29368, -85224, -212967, -38899, -296269, -220490, -201578, -156382, 253014, -169074, 12057, -257103, -255532, -317458, -137543, -265874, -41755, -450887, -42814, 98844, 118675, -310598, 69767, 191029]
10658A91029o9395a19422k05625M8432c9770f318B25334E1685a92549H0641e3027
10646b3495j6438B14976c16088J07484N0373P3930j39429j32277J47259j6498
10636b25246B15681F7119J00296a14034p3129l1562E0391B1302f8962j6357A48572
10624H2015a63840a5193A6377g4762A69669J63099a42689m2911D3224b871G9066
10612a33635B93018b4451j7238E1361d7771k21050K3747J10882a5726l7822B142
10600a7367j66157A19246b96612I2207d11405f6462A0341a77764j32369J36732
10590a73401A6909h5249k9695j685A2279i7184H2546J02669c51806J55950Q9582
10579a06274m9148P732A85226c3197m9144A57717I040K70871E606M2523M51791
$$ y = [191029, 121634, -119422, -325047, -276615, -39770, -6318, 225334, 51685, -192549, 80641, -53027, -23495, -39933, 214976, -316088, -208604, -158231, -84301, -223730, -356007, -208748, -225246, 215681, 67119, 167415, -114034, -187163, -218725, 50391, 21302, -68962, -85319, 148572, 82015, -163840, -15193, 16377, -74762, 169669, 332768, -142689, -185600, 43224, -2871, 79066, -133635, 293018, -24451, -41689, 51361, -47771, -268821, -245074, -134192, -15726, -53548, 2142, -17367, -183524, 119246, -296612, 92207, -411405, -66462, 10341, -177764, -310133, -173401, 16909, -85249, -114944, -116629, 12279, -97184, 82546, 185215, -351806, -195856, -106274, -155422, -147690, 185226, -33197, -82341, 157717, 9040, 279911, 5606, 48129, 499920]
10568D99920I0131o46C2399J0857a85874A2681b3706k31517r9368q48J02993a8062
10555a64610L58O5607k25960a24210A73687a6968m81231a45380B15826n6127b07584
10543b22946k8082a08657B03509C0454M8833b46655B62794C3694J11064h2008
10532E9118P6741h0149B5240k260J24869c4680B08540a07311A69910d2127j13106
10521a55233J5364A35284l0913j6981a50668L9129M3698C3727J39072d9655k12456
10510b62111j00340b6174j50600G6704N9341b92111B39761g6190E0066a66710
10499A56965c6752h860m11998K06899d2624k84466M2108a19771a2768F4871c0554
10487A24186b8809j16269O8231I4627D671Q8638c9723I0677A5505a81547c9707
$$ y = [499920, 90131, 89485, 32399, 43256, -185874, 12681, -23706, -255223, -354591, -355439, -252446, -18062, -164610, -164252, -98645, -324605, -124210, 173687, -16968, -498199, -145380, 215826, 159699, -207584, -222946, -251028, -108657, 203509, 30454, 79287, -246655, 262794, 33694, 144758, -82008, 59118, 135859, -80149, 25240, 22980, 147849, -34680, 208540, -107311, 169910, -42127, -155233, -139869, 135284, 104371, 87390, -150668, -111539, -67841, 33727, 172799, -49655, -262111, -362451, -26174, -176774, 76704, 136045, -292111, 239761, -76190, 50066, -166710, 156965, -36752, -8860, -420858, -213959, -42624, -327090, -284982, -119771, -12768, 64871, -30554, 124186, -28809, -145078, -76847, 94627, 4671, 93309, -39723, 90677, 15505, -181547, -39707]
10475e6621D1120L36785a10372p8907j2081e7375k26434c9119B37220b01618f6280
10463D8239L757F783L15418j42834L69861k22148j14082A366K52020a45798A57328
10451a90383j11871A90906l7113B5249J94781k9746J7530a8222m8884j07592G7262
10439B41720E2064d763q1499j91961I2268c76228a35302O1137L3252j92723d2445
10427c00498a34812l4327O8789F6476b43519i4474j22141c114A42602d5044O98
10416d4346E5876a82420p473D6888a82237B06899c91859a80875B32840B9787c3637
10404b22626E5563a23078c9517c709r7601m38749b08014a00342B66740b21279
10393c3191k10384g5693b9859C26230a74019c1122H4427L01788b1554E5660c9417
$$ y = [-56621, 41120, 377905, -110372, -189279, -201360, -57375, -283809, -39119, 237220, -201618, -66280, 48239, 51996, 6783, 322201, 179367, 549228, 327080, 212998, 1366, 253386, -145798, 157328, -190383, -302254, 190906, 153793, 25249, 220030, 190284, 207814, -18222, -67106, -174698, 77262, 241720, 52064, -4763, -86262, -278223, 92268, -376228, -135302, -74165, -40913, -233636, -42445, -300498, -134812, -169139, -100350, 66476, -243519, -94474, -216615, -3114, 142602, -45044, -44346, 55876, -182420, -189893, 46888, -182237, 206899, -391859, -180875, 232840, 29787, -33637, -222626, 55563, -123078, -39517, -3709, -101310, -540059, -208014, -100342, 266740, -221279, -33191, -243575, -75693, -29859, 326230, -174019, -31122, 84427, 386215, -21554, 55660, -39417]
10381b3865r4978e7171A5156K88406h3025B32588b02157A42633J49853G6099j4239
10370F1860J90026A17609a8999j6595j17455B29627a92457A35004D3866a03288
10359F8179J66329J10415A36095L149K74158A61440K88118o6738n2132Q9878J34697
10348E55263M3680B230K10335j3728Q8951H3148K19963h0789B79873I7686K00144
10337B97830q5668k4159m2228K99614A0768J74489K38101j85816L04010j38584
10327D02968J69595K7235B45763K24237A79546J95779l1863q6774j1474G8596
10316I6916b9305A49152D2865j65M0008a02179B07038a9009k05443F9354O7864
10305A37218E1197q360K08075Q4889H5459N7278Q791M1743a07804B15934L2355
$$ y = [-23865, -118843, -57171, 15156, 303562, -83025, 232588, -202157, 142633, 292486, 76099, 61860, 251886, 117609, -18999, -35594, -153049, 229627, -192457, 135004, 43866, -103288, 68179, 234508, 344923, 136095, 139244, 413402, 161440, 449558, 382820, 330688, 420566, 555263, 598943, 2230, 212565, 198837, 287788, 83148, 303111, -80789, 279873, 97686, 297830, 212162, 188003, 145775, 445389, 10768, 185257, 423358, 237542, 541552, 402968, 572563, 599798, 245763, 470000, 179546, 375325, 343462, 256688, 245214, 78596, 96916, -29305, 149152, 42865, 42700, 82708, -102179, 207038, -19009, -224452, 69354, 137218, 51197, 42837, 250912, 335801, 85459, 142737, 151528, 193271, -107804, 215934, 248289]
10294B48289o4966D3770a3707A77948a59629j24076B47336A5214J6894L6302b09500
10282g7211A7022b06889P7756C171K58509G3116J90240c4548a7076A36966b09447
10270E7762J0758a55149g2826D5703p137e7231m10552a07743k11981K0338B6640
10258C75095A75701b39704j61693A43166b9424A57968b87208R8553E2266R7144
10248A49410b46092A23427M9139c29224A51026g9108A53334b43217A70903n3604
10238A17299J08436I8668J72772a53995A95582F1077J71407j1094D4607L1178
10228G5785b83976g9472j08047M5456A55023F8495E133a38198j95604G2607c6298
10216a13698A52773d7277j4371E9516P2331b94239B8469c77413G3379R0892i3225
$$ y = [248289, 183323, 43770, -13707, 177948, -159629, -283705, 247336, 15214, 32108, 68410, -209500, -77211, 17022, -206889, -129133, 3171, 261680, 73116, 263356, -34548, -17076, 136966, -209447, 57762, 68520, -155149, -72826, 45703, 38566, -57231, -467783, -107743, -319724, -299386, 26640, 375095, 175701, -239704, -401397, 143166, -29424, 157968, -287208, -188655, 52266, 149410, -246092, 123427, 172566, -329224, 151026, -79108, 153334, -243217, 170903, 117299, 225735, 98668, 271440, -153995, 195582, 61077, 232484, 221390, 44607, 75785, -283976, -79472, -187519, -142063, 155023, 68495, 5133, -138198, -333802, 72607, -36298, -113698, 152773, -47277, -61648, 59516, 131847, -294239, 28469, -377413, 73379, 164271, -93225]
10204D8875a85566k7338A5036N1053e7105o1460p9882h6539K5991j01339a8533
10192a02116B58949e9971k63032A29036e3841m0314k29701b8836H3779J4996B2320
10180A76797q541P4496A19255e0944k7175k12616i585m35429F9112b4471r7210
10169a21681K2819B09701B6114a64369A84926c23204a01049r6851A3871a29527
10158a3116k70957h5137I1016b7091D912a30162L5261K1501j43408p521C03720
10146B33937e57045a48769C9308N5235J78097B267b57681M9038a3037n058p6593
10135i4688B5954b959F4246d6535I8005K4055f2200C36866c24528J51032k2734
10124a96230A67805a35740B76688b77902J06169A40233a8823j72086h4258A34591
$$ y = [48875, -185566, -212904, 15036, 66089, -57105, -118565, -198447, -86539, -60548, -161887, -18533, -102116, 258949, -59971, -323003, 129036, -53841, -94155, -323856, -28836, 83779, 98775, 22320, 176797, 168256, 242752, 119255, -50944, -78119, -290735, -9585, -445014, 69112, -24471, -121681, -98862, 209701, 26114, -164369, 184926, -323204, -101049, -197900, 13871, -129527, -13116, -284073, -85137, 91016, -27091, 4912, -130162, -94901, -73400, -216808, -224329, 303720, 233937, -557045, -148769, 39308, 94543, 272640, 2267, -257681, -208643, -13037, -18095, -94688, 25954, -2959, 64246, -46535, 98005, 122060, -62200, 336866, -324528, -173496, -196230, 167805, -135740, 276688, -277902, -171733, 140233, -18823, -190909, -84258, 134591]
10113E7477O37c26544B5108a05891k67055J6989j07154K03359k1637C6865a89619
10101I5073O4697b18066g6545q2336G2188d84388A007K33511D1387f4798k94990
10090c59788d3959j25453O4248l49206a34931j37822a34072A09491c61445d6919
10079a34060M6653L568K2392C05602a88998B0719b1959B33255I2782Q737a62573
10067B8462J29242a41122D8931a0978C2511a53240B74213b5693F3673a04365e1807
10055b920j61779l42559b12404Q6537A93140b90952J3239R7128A59598l2613a66266
10043a79509I5421R5081a77979I3558f1225j28109A128b09312j41288B05515i8466
10031a61524C5174L04a24458D9310M6283a19369N007D7379K05139c96505A50161
$$ y = [57477, 58114, -326544, 25108, -105891, -372946, -355957, -463111, -259752, -281389, 36865, -189619, 95073, 159770, -218066, -76545, -158881, 72188, -484388, 1007, 234518, 41387, -64798, -359788, -43959, -169412, -105164, -454370, -134931, -272753, -134072, 109491, -361445, -46919, -134060, -87407, -83839, -61447, 305602, -188998, 20719, -21959, 233255, 92782, 101519, -162573, 28462, 157704, -141122, 48931, -10978, 32511, -153240, 274213, -25693, 63673, -104365, -51807, -2920, -164699, -507258, -212404, -125867, 193140, -290952, -277713, -180585, 159598, 126985, -166266, -179509, 95421, 190502, -177979, 93558, -61225, -189334, 1128, -209312, -350600, 205515, -98466, -161524, 35174, 35478, -124458, 49310, 95593, -119369, -114362, 47379, 252518, -396505, 150161]
10019c0157C61417A2303K2526e7868j0680D2755L45153f6651k38832j837e260
10007G379J57724d95702a50680P1496k592F9444i9240M5490C08786j36055a97129
9995D8769J47299c40785F8145e2000j88615B14779G2008a87344r1129h8493J6921
9984g1572k34826a18539B61664a78684A07445m6445R3163e9500j54254a4551k07366
9973b21917L7709A17057j5021a82308j08276J31643P7714j40825B9925b10952
9962B9535h1303j12784P2319m771k25101J66868j3026P3524N0738C9738i0580
9950F2566b79910Q9814q9847P743A69821J03574a52522r3733F6920j2796J22396
9939A76520a27282N1894L5129l6666B65148a27299A56183b196l90713b6130j15391
$$ y = [-30157, 361417, 12303, 34829, -57868, -68548, 42755, 387908, -66651, -305483, -307320, -5260, 7379, 165103, -495702, -150680, -79184, -81776, 69444, -99240, -53750, 308786, 172731, -197129, 48769, 196068, -340785, 68145, -52000, -240615, 214779, 72008, -187344, -278473, -88493, -71572, -306398, -118539, 261664, -178684, 107445, 61000, 154163, -59500, -213754, -14551, -221917, -184208, 117057, 102036, -182308, -290584, -158941, -81227, -222052, 29925, -210952, 29535, -81303, -194087, -121768, -126539, -351640, -184772, -197798, -124274, -73536, 39738, -90580, 62566, -279910, -190096, -279943, -272200, 169821, 273395, -152522, -246255, 66920, 54124, 176520, -127282, -75388, -40259, -76925, 265148, -127299, 156183, -2196, -392909, -26130, -141521]
9928a41521O0627k8736L9756J2053o9991c0106k02724o1921h1204q8794P6815
9917i3183K745B54355b46268j57637f0800j09158j05334k5645C27843b68743R5895
9906a72848g3919D5631c86545I4129O8942f3191r1156P5937A10626c11775a09648
9894a14090L2655j54527K9554e2238J6017j54742A63133b57375e8470A9804K23132
9883B42936A08360b66902o6134J22932A94545a86088M4556J8792k99058a70758
9872C7332a00468l6137k4589K6519m4165F974b53583A08985a52909E2209a12104
9860b62326d2052B21127d893A23065i9656F9556J31050b37634h4826l9914A37645
9848h3373A67650b53612B3444b62717b5246R724A82383b56245m2302b2843k90751
$$ y = [-141521, -80894, -109630, -69874, -57821, -127812, -30106, -232830, -294751, -81204, -169998, -93183, -90438, 254355, -246268, -403905, -60800, -169958, -275292, -300937, 327843, -268743, -172848, -73919, 45631, -386545, 94129, 163071, -63191, -154347, -78410, 110626, -311775, -109648, -114090, -81435, -235962, -206408, -52238, -36221, -190963, 163133, -257375, -58470, 19804, 242936, 108360, -266902, -333036, -210104, 194545, -186088, -141532, -122740, -421798, -170758, 37332, -100468, -136605, -161194, -134675, -178840, 6974, -253583, 108985, -152909, 52209, -112104, -262326, -42052, 221127, -4893, 123065, -99656, 69556, 200606, -237634, -84826, -124740, 137645, -83373, 167650, -253612, 23444, -262717, -25246, -15522, 182383, -256245, -298547, -22843, -313594]
9837c13594C47456b23153F0898J03158n5045b17995D909c74451B1619c59908h5095
9825g6158A00719Q612C0381K82200b61805B97767i962j90672B10479C8831J95000
9814B33831I5149L1172b78981f1573a2470E5129J0167L07732a10803j7494d348
9802A45003b73321g1037I9526h3579j22408i1687L6074B5131e3911k67825a26649
9790A57840F0317J8697J5437a29279L76l58467g3178A17059i0074C20240G1759
9778a50695b5525H0146d06119K00347g3955B08455b72757j343b734j42651n8733
9767b04118b6842E7962a30863F7716j7158b92685A86072a7619A6582c32690A7758
9755c0560j04521m5290l6328A05458g1591j52652m0521a02988j950j04329b9718
$$ y = [-313594, 347456, -223153, 60898, 164056, 109011, -217995, 4909, -374451, 21619, -359908, -85095, -76158, 100719, 109331, 30381, 312581, -261805, 297767, -9962, -200634, 210479, 38831, 233831, 95149, 126321, -278981, -61573, -12470, 55129, 65296, 373028, -110803, -128297, -4348, 145003, -273321, -71037, 99526, -83579, -205987, -91687, -55613, 25131, -53911, -321736, -126649, 157840, 60317, 79014, 94451, -129279, -128903, -487370, -73178, 117059, -90074, 320240, 71759, -150695, -25525, 80146, -406119, -205772, -73955, 208455, -272757, -274100, -2734, -145385, -204118, -26842, 57962, -130863, 67716, 50558, -292685, 186072, -17619, 16582, -332690, 17758, -30560, -135081, -180371, -216699, 105458, -71591, -224243, -264764, -102988, -104938, -209267, -29718]
9743b36552m3333J00120B00304b11829k131j6313G797d10600a97292b8896C15413
9731e57617b32819A29873J2568l2563l6750O877a98809F8697a03775j24181d2777
9719a62200f1116j24272G2192b9214k37395J02600L8627d9552I9725M1295a06213
9707A87516b21016M4435E8756a81400j90278a39183B49271b17885j41885a58433
9696d02313H8526K75135m1236a06560r592d6181l70380B63418h1609C46648b39568
9684a88485D661a09198n8987d1669j55400e8328j3787k30905Q57J35153g8622
9672A60723b77815a0863j11874j082I3945a82804A52967b06942A9976O2783a20185
9660e495r9787j9782a9017r5653c8177a1251j57742l06939K05145r04a20171B58810
$$ y = [-236552, -279885, -179765, 200304, -211829, -213960, -230273, 7797, -410600, -197292, -28896, 315413, -557617, -232819, 129873, 142441, 109878, 73128, 80005, -198809, 68697, -103775, -227956, -42777, -162200, -61116, -185388, 72192, -29214, -266609, -164009, -125382, -49552, 99725, 141020, -106213, 187516, -221016, -176581, 58756, -181400, -371678, -139183, 249271, -217885, -359770, -158433, -402313, 88526, 363661, 322425, -106560, -116152, -46181, -416561, 263418, -81609, 346648, -239568, -188485, 4661, -109198, -168185, -41669, -197069, -58328, -72115, -303020, -302163, -167010, -78622, 160723, -277815, -10863, -122737, -123819, 93945, -182804, 152967, -206942, 19976, 82759, -120185, -5495, -105282, -125064, -19017, -114670, -38177, -11251, -168993, -475932, -270787, -271691, -120171, 258810]
9647a59286A02151b63972L3023A02070C8382J23767a51808a7111k12652h4525
9636A42202a52740f0149A12982a38158E6978e50737b41383B4768K85251D8151
9625E3720g9428i488o7698A57608a2050A00198c00566C4535b66920a9069A06917
9613B07541k6559b51355A74277B9907L3256N0387d3946G6682a26634b0092k78152
9602b98244r89F065a24865I4681c5245B16999a42498n1166R3114E1572Q4887b19761
9589a60374c1081j5454k3729o0873L5235B37073i1269j87852C58892b53087k35244
9578d88331A4449j131J4800a23906A190K11189e15714G6458g7209B87656D019
9566A18333a21573j20623K4598A7794B824O3668b2326k63119I8329i624k57561
$$ y = [-159286, 102151, -263972, -230949, 102070, 38382, 162149, -151808, -17111, -229763, -84525, 142202, -152740, -60149, 112982, -138158, 56978, -550737, -241383, 24768, 310019, 48151, 53720, -79428, -9488, -77186, 157608, -12050, 100198, -300566, 34535, -266920, -19069, 106917, 207541, 180982, -251355, 174277, 29907, 63163, 113550, -43946, 76682, -126634, -20092, -298244, -299233, 6065, -124865, 94681, -35245, 216999, -142498, -193664, -100550, 51572, 136459, -219761, -160374, -31081, -46535, -70264, -131137, -95902, 237073, -91269, -279121, 358892, -253087, -488331, 14449, 13318, 28118, -123906, 1190, 212379, -515714, 76458, -77209, 287656, 4019, 118333, -121573, -242196, -217598, 17794, 2824, 66492, -22326, -285445, 98329, -9624, -267185]
9555b67185n3990k9828J62499n9399j30091a1976m992j07580D8306c29927J00168
9544b29759c1033B12205b0532D0122c55347A0679a69590H6372c21390e5195B7552
9532h8084b617B36740a30785j7701n3340h4789c5294j47305O0590I9854C3423
9520a69206J1203K7501m22604b33719c428C162J68821K69581C1779j5592a15255
9508a5188C7874n610a36645A85235a66627A15255j7935a85859g2286D3961O6608
9497A10569E0365a66691A01906k0252b49466i7546B42176d8899p4519k52265a42333
9485F5212l1792b79105A81148a41400A03996B3668J07780L471g5522A95160a25281
9473a63960A32223h8550j29815j90423a61423b1732A29877B4660A0191b2285n9435
$$ y = [-267185, -321175, -351003, -188504, -247903, -377994, -11976, -16968, -124548, 48306, -329927, -229759, -31033, 212205, -20532, 40122, -355347, 10679, -169590, 86372, -321390, -55195, 27552, -88084, -2617, 236740, -130785, -148486, -201826, -84789, -35294, -182599, -122009, 99854, 33423, -169206, -158003, -130502, -553106, -233719, -3428, 3162, 171983, 441564, 31779, 16187, -115255, -15188, 37874, 32264, -136645, 185235, -166627, 115255, 97320, -185859, -72286, 43961, 110569, 50365, -166691, 101906, 81654, -249466, -97546, 242176, -48899, -123418, -375683, -142333, 65212, 33420, -279105, 181148, -141400, 103996, 23668, 131448, 134919, -75522, 195160, -125281, -163960, 132223, -88550, -218365, -408788, -161423, -21732, 129877, 24660, 10191, -22285, -81720]
9462h1720m16211D302e167H2210b60895H6696K80229b85145N4578j889R8115c2346
9449a24134N0778l5218d0050j87391B59364I0916b8751B3172c07264g651E9573
9437A9788J46607b36244d549A41612a32793j13597J08141r9715H6236a01552j6603
9426a18155m8158b1400j30861a0883k70000G5832a14737n9211f1645l0596b6100
9414A1884b21908f1077I857h5157j72067g1302H0640a51033M3207A5619a07756
9402F7227i5896j88562A58292K25306b9359k13363B23723d4886A94388b49415
9391A50979b93006A21561a23159B34211a19381n8379D5692a03649A78607b1246
9380A15833C2082J43101B183R3902b04665d997l67539D9145R7382a7143o7074
$$ y = [-81720, -497931, 4302, -5167, 82210, -260895, 86696, 366925, -285145, -230567, -232456, -134341, -32346, -124134, -73356, -108574, -40050, -227441, 259364, 90916, -28751, 23172, -307264, -7651, 59573, 19788, 166395, -236244, -4549, 141612, -132793, -246390, -138249, -237964, 86236, -101552, -118155, -166313, -21400, -152261, -10883, -280883, 75832, -114737, -173948, -61645, -92241, -26100, 11884, -221908, -61077, 9857, -85157, -257224, -71302, 80640, -151033, -107826, 15619, -107756, 67227, -95896, -284458, 158292, 383598, -29359, -242722, 223723, -44886, 194388, -249415, 150979, -293006, 121561, -123159, 234211, -119381, -177760, 45692, -103649, 178607, -21246, 115833, 32082, 175183, 2183, 96085, -204665, -4997, -372536, 49145, 146527, -17143, -84217]
9369h4217A00885b27531i8898B64377A00687i4392l8290c017o2640k8921K8024
9358f6554n5864p0906A39314a14575A28626a40903n2995I2407K4373D7531L7272
9347H4803a47040A14422g0446j60738l1031A79952e1327K4642j7681j02051j58899
9336c05316i7353k2325D41596b4735m2383I8175d2868j79053A05370a74321J805
9325a72516A54580J0905c1450j19522F6255l720g8204A64424a75158K5745l0190
9314a79603d9299J782l07830i9124J9087A03642a71740A23011d7148A33574l135
9303A30439l5848b46703E9704f7133j55160j12578B76256a00732O290B64713c02808
9291A57032l0699d9088n7456l4391p0896h7091o0543d6047j56081m3189J20813
$$ y = [-84217, 100885, -227531, -98898, 264377, 100687, -94392, -132682, -3017, -65657, -94578, -66554, -122418, -193324, 139314, -114575, 128626, -140903, -193898, 92407, 116780, 47531, 84803, -147040, 114422, -70446, -231184, -262215, 179952, -51327, -26685, -44366, -146417, -305316, -97353, -119678, 441596, -24735, -67118, 98175, -42868, -221921, 105370, -174321, -172516, 154580, 165485, -31450, -150972, 66255, 62535, -78204, 164424, -175158, -149413, -179603, -49299, -47517, -355347, -99124, -80037, 103642, -171740, 123011, -47148, 133574, 130439, 94591, -246703, 59704, -67133, -222293, -334871, 276256, -100732, -94442, 264713, -302808, 157032, 126333, -49088, -106544, -140935, -211831, -87091, -147634, -46047, -202128, -245317, -124504]
9280a24504k0625p895A6829g6444A9885J17872a44551r7808b1302j40120j12761
9269b74183C1730K366g8887B24032H4006a49212H4921b24781G2059J11764b45935
9257a18142C9721i0604A58088n020J8161b23123o914n0229j60694A47025b07330
9245b48750F35d481k19510c2198j60206B0722g8158k7584A27404J35451i7222
9233b62797L4558M3388e2565A28766j3527B0054R7087A6566J46467a18697D0187
9221a13416n1101E7060b70645j12569B1197R3493a32232A345b77371d6857I3443
9209F3236a74084A53419J5749n6549c35215a08944B828i7372m5396K3568k6367
9198a45567j6661A02670h4969j65920c7777H9796a81864q153p0117A2362Q17K56701
$$ y = [-124504, -145129, -153024, 16829, -76444, 19885, 137757, -144551, -242359, -21302, -161422, -274183, 31730, 34096, -78887, 224032, 84006, -149212, 84921, -224781, 72059, 183823, -245935, -118142, 39721, -90604, 158088, 153068, 171229, -223123, -230037, -280266, -440960, 147025, -207330, -248750, 635, -4481, -223991, -32198, -192404, 20722, -78158, -105742, 127404, 262855, -97222, -262797, -228239, -184851, -52565, 128766, 115239, 20054, 117141, 16566, 163033, -118697, 40187, -113416, -164517, 57060, -270645, -383214, 21197, 114690, -132232, 1345, -277371, -46857, 93443, 63236, -174084, 153419, 169168, 112619, -335215, -108944, 2828, -97372, -142768, -119200, -145567, -162228, 102670, -84969, -250889, -37777, 89796, -181864, -190017, -260134, 12362, 13179, 269880]
9186B69880b19138e9033A17223b91300b4640q9783j8970p3270r4322a45457k3718
9175a69175A86254b8464k4948q8802j17219c8560a2830j04262F5428i390E4a75492
9162b5364A93779E1587P8605h7116M2852F3618I056d36691B85635A16995c26655
9150b33613A8199b50927E7713Q324j0264g492j24476p4031M3262A83198B1340
9138A95765b79705M8348O6261b6226j88782C6082r645c62964i2857J7011j28834
9127b04680A32764b26064O1718P6496j36717i5543m3159j917A28099k5090e6346
9115f8991A52092j2699c7812k01680c3594B22797i0075k18256A44724b42755a5651
9103d0045M426n2636E8674c7603k70574c0486H6602e8447B31181B437a09727j94657
$$ y = [269880, -219138, -59033, 117223, -291300, -24640, -114423, -133393, -206663, -300985, -145457, -169175, 186254, -28464, -53412, -142214, -259433, -38560, -12830, -117092, 65428, -9390, 54, -175492, -25364, 193779, 51587, 130192, -87116, -44264, 63618, 9056, -436691, 285635, 116995, -326655, -233613, 18199, -250927, 57713, 66037, 55773, -7492, -131968, -205999, -162737, 183198, 21340, 195765, -279705, -231357, -165096, -26226, -215008, 36082, 26437, -362964, -92857, -75846, -204680, 132764, -226064, -164346, -87850, -224567, -95543, -138702, -140619, 128099, 103009, -56346, -68991, 152092, 139393, -37812, -239492, -33594, 222797, -90075, -308331, 144724, -242755, -15651, -40045, -35619, -88255, 58674, -37603, -308177, -30486, 86602, -58447, 231181, 2437, -109727, -304384]
9091c04384e3202j3583A15777a44335A5160a413j88680A57973o4703a20867A11634
9079b43456N8224f5969B35522b87713A17360a5953m9770I0721f0976e007C45399
9067B29053a93336C52396a74835C74361a47176A83641b10390k9432J80i0709k0165
9056a10874e3840q6376a7632B1069b49753Q9795j83080c8227a0905D18305c77327
9044D0993b05253F3751a24330C69914B5575b33324L651A12238a0550j7458q3067
9033a11075I6927j4411M071a62903B31476a0575n4536A45078J76552a44404O0165
9022h4239L5185b1292A91765e8865j24804A33856a33878A421J04514C8348g4998
9010B69179c19956m5219J65197L4121l4395A9250J39807K7199o7526b68148E0342
$$ y = [-304384, -53202, -66785, 115777, -144335, 15160, -1413, -190093, 157973, 93270, -120867, 111634, -243456, -185232, -65969, 235522, -287713, 117360, -15953, -65723, 90721, -60976, -5007, 345399, 229053, -193336, 352396, -174835, 374361, -147176, 183641, -210390, -239822, -239642, -90709, -110874, -53840, -140216, -17632, 21069, -249753, -159958, -343038, -38227, -10905, 418305, -377327, 40993, -205253, 63751, -124330, 369914, 25575, -233324, -229673, 112238, -10550, -28008, -111075, 96927, 82516, 86587, -162903, 231476, -10575, -65111, 145078, 321630, -144404, -84239, -49054, -21292, 191765, -58865, -183669, 133856, -133878, 1421, 105935, 38348, -74998, 269179, -319956, -365175, -199978, -165857, -200252, 19250, 159057, 186256, 118730, -268148, 50342]
8998i0855d5257H2593b19109R5609d9871K099a2707j7097k6159A75180c56687
8986a88530i0353k08236a00045C94775a94866b3886A39944R3889a61532g1314
8975i2451n5812k85273H6046d46700J91290A88914J6245a28757r4288a6108l38017
8964c54125d810k7178m7176F4974R080b32365J599a3688A65937p4728a23282n3637
8952a76919E1939b79829K5440C0328d07403a47056k00499R711A17888f3887j20760
8941a84647O2853A74678F0798r1b31001B71919C7432h2968j31317j33723H3756
8929F5619a61080o5454D1809R8304J18339J44430A02329d8250B05553n1940D3473
8917b08307M8496B53441j09760c5751j05981B33355o2406L7379c2923C95198M86783
$$ y = [-90855, -45257, 82593, -219109, -123500, -49871, -47772, -12707, -29804, -55963, 175180, -356687, -188530, -90353, -298589, -100045, 394775, -194866, -23886, 139944, 233833, -161532, -71314, -92451, -148263, -433536, 86046, -446700, -255410, 188914, 205159, -128757, -223045, -16108, -354125, -4810, -31988, -79164, 64974, 74054, -232365, -230766, -13688, 165937, 91209, -123282, -176919, 51939, -279829, -254389, 30328, -407403, -147056, -347555, -337844, 117888, -63887, -184647, -121794, 174678, 60798, 60707, -231001, 271919, 37432, -82968, -214285, -348008, 83756, 65619, -161080, -226534, 41809, 140113, 258452, 402882, 102329, -48250, 205553, 153613, 43473, -208307, -159811, 253441, 143681, -35751, -141732, 233355, 170949, 208328, -32923, 395198, 881981]
8906H81981L25089R53048K085805L799494C514338j720401F96215j55593p6551
8897D64071j12457P6765d285r3316G4111L0846i2881H7072R8774A9939a21622
8885C04229a84852L8839A37782b1899i644j860l710j995j32249l0712B8995M62592
8873D91587A05084b9384A05121h7881k12460O7437l2882A88107m0896C3775a00811
8861a55051j28357R1863n2144l983A6819J2916b80874A1776b79934J18062g1580
$$ y = [881981, 1207070, 2160118, 4245923, 8045417, 3514338, 1793937, 696215, 540622, 464071, 351614, 428379, -4285, -97601, 74111, 104957, -92881, 87072, 185846, 19939, -121622, 304229, -184852, -146013, 137782, -21899, -9644, -11504, -15214, -17209, -149458, -180170, 28995, 491587, 105084, -29384, 105121, -87881, -300341, -232904, -265786, 188107, 147211, 33775, -100811, -155051, -283408, -191545, -243689, -247672, 16819, 29735, -280874, 11776, -279934, -161872, -71580]
$$ [...]
##END NTUPLES=NMR SPECTRUM
##END=
