
##TITLE=AC1148_Santa_5874936_UfhBCJFECV
##JCAMPDX= 6.0         $$ Bruker NMR JCAMP-DX V2.0
##DATA TYPE= NMR SPECTRUM
##DATA CLASS= NTUPLES
##ORIGIN= BRUKER
##OWNER= Administrator
$$ 1.72 TOPSPIN		Version 2.1
$$ 2012-03-31 21:03:46.281 -0500  Administrator@TOPSPIN
$$ Compression mode = diff/dup
##.OBSERVE FREQUENCY= 400.13188235
##.OBSERVE NUCLEUS= ^1H
##.ACQUISITION MODE= SIMULTANEOUS (DQD)
##.ACQUISITION SCHEME= undefined
##.AVERAGES= 64
##.DIGITISER RES= 22
##SPECTROMETER/DATA SYSTEM= spect
##.PULSE SEQUENCE= noesygpps1d.comp
##.SOLVENT NAME= COFFEE_meoh
##.SHIFT REFERENCE= INTERNAL, COFFEE_meoh, 1, 14.96834
##AUDIT TRAIL= $$ (NUMBER, WHEN, WHO, WHERE, PROCESS, VERSION, WHAT)
$$ ##TITLE= Audit trail, TOPSPIN		Version 2.1
$$ ##JCAMPDX= 5.01
$$ ##ORIGIN= Bruker BioSpin GmbH
$$ ##OWNER= Administrator
$$ $$ C:\Bruker\TOPSPIN/data/COFFEE/nmr/AC1148_Santa_5874936_UfhBCJFECV/12/pdata/1/auditp.txt
$$ ##AUDIT TRAIL=  $$ (NUMBER, WHEN, WHO, WHERE, PROCESS, VERSION, WHAT)
(   1,<2012-03-31 21:03:40.109 -0500>,<Administrator>,<TOPSPIN>,<go>,<TOPSPIN 2.1>,
      <created by zg
	started at 2012-03-31 20:52:08.484 -0500,
	POWCHK enabled, PULCHK disabled,
       configuration hash MD5:
       1A 1E CE 29 27 FD 77 03 67 4E F0 E3 C4 B2 CB 90
       data hash MD5: 64K
       73 BE D5 38 BB F5 90 13 25 66 AC 68 B4 18 9D 2F>)
(   2,<2012-03-31 21:03:43.390 -0500>,<Administrator>,<TOPSPIN>,<proc1d>,<TOPSPIN 2.1>,
      <Start of raw data processing
       efp LB = 0.3 FT_mod = 6 PKNL = 1 PHC0 = 0 PHC1 = 0 SI = 128K 
       data hash MD5: 128K
       05 CE AC CC BF 4E 2D 53 35 19 8B DC F1 20 B2 3D>)
(   3,<2012-03-31 21:03:45.265 -0500>,<Administrator>,<TOPSPIN>,<proc1d>,<TOPSPIN 2.1>,
      <pk PHC0 = 40.19348 PHC1 = 0 
       data hash MD5: 128K
       3F 3D A3 F2 9B CA 58 49 EF DE 50 02 6B 95 5C 6A>)
(   4,<2012-03-31 21:03:45.843 -0500>,<Administrator>,<TOPSPIN>,<proc1d>,<TOPSPIN 2.1>,
      <abs ABSG = 1 
       data hash MD5: 128K
       B2 A2 D3 6F A1 69 C0 26 00 F2 D8 D9 FB 7E E4 63>)
(   5,<2012-03-31 21:03:45.937 -0500>,<Administrator>,<TOPSPIN>,<proc1d>,<TOPSPIN 2.1>,
      <abs ABSG = 2 
       data hash MD5: 128K
       E6 68 F0 07 00 5E 14 FA 34 F0 55 05 0C C0 7A C7>)
(   6,<2012-03-31 21:03:45.984 -0500>,<Administrator>,<TOPSPIN>,<proc1d>,<TOPSPIN 2.1>,
      <abs ABSG = 3 
       data hash MD5: 128K
       87 D3 FA 5F B1 FC DB 90 A6 5E CD 44 F6 00 38 53>)
(   7,<2012-03-31 21:03:46.062 -0500>,<Administrator>,<TOPSPIN>,<proc1d>,<TOPSPIN 2.1>,
      <abs ABSG = 4 
       data hash MD5: 128K
       FB FB 00 05 ED 12 14 0F 66 D3 E6 A3 F7 1E 0D 34>)
(   8,<2012-03-31 21:03:46.125 -0500>,<Administrator>,<TOPSPIN>,<proc1d>,<TOPSPIN 2.1>,
      <abs ABSG = 5 
       data hash MD5: 128K
       F5 E3 53 24 E3 4E 29 AA 3F 93 AD 40 FF A8 5A 27>)
$$ ##END=
$$ 
$$ $$ hash MD5
$$ $$ FD B4 5B BB E3 F3 A6 13 9C FC A6 6A E1 02 99 39
##$RELAX= 
##$RELAX= 
##$RELAX= 
##$RELAX= 
##$RELAX= 
##$RELAX= 
##$RELAX= 
##$RELAX= 
$$ Bruker specific parameters
$$ [...]
##$TP07= 0
##$TPNAME0= <>
##$TPNAME1= <>
##$TPNAME2= <>
##$TPNAME3= <>
##$TPNAME4= <>
##$TPNAME5= <>
##$TPNAME6= <>
##$TPNAME7= <>
##$TPOAL= (0..7)
0.5 0.5 0.5 0.5 0.5 0.5 0.5 0.5
##$TPOFFS= (0..7)
0 0 0 0 0 0 0 0
##$TUNHIN= 0
##$TUNHOUT= 0
##$TUNXOUT= 0
##$USERA1= <user>
##$USERA2= <user>
##$USERA3= <user>
##$USERA4= <user>
##$USERA5= <user>
##$V9= 5
##$VALIST= <valist>
##$VCLIST= <CCCCCCCCCCCCCCC>
##$VD= 0
##$VDLIST= <DDDDDDDDDDDDDDD>
##$VPLIST= <PPPPPPPPPPPPPPP>
##$VTLIST= <TTTTTTTTTTTTTTT>
##$WBST= 2048
##$WBSW= 25
##$XGAIN= (0..3)
0 0 0 0
##$XL= 0
##$YL= 0
##$YMAX_a= 13134984
##$YMIN_a= -6627679
##$ZGOPTNS= <>
##$ZL1= 120
##$ZL2= 120
##$ZL3= 120
##$ZL4= 120
##$ABSF1= 14.96834
##$ABSF2= -5.58419
##$ABSG= 5
##$ABSL= 3
##$ALPHA= 0
##$AQORDER= 0
##$ASSFAC= 0
##$ASSFACI= 0
##$ASSFACX= 0
##$ASSWID= 0
##$AUNMP= <proc_prof1d_extract.lims>
##$AXLEFT= 0
##$AXNAME= <>
##$AXNUC= <1H>
##$AXRIGHT= 0
##$AXTYPE= 0
##$AXUNIT= <>
##$AZFE= 0.1
##$AZFW= 0.1
##$BCFW= 0
##$BC_mod= 0
##$BYTORDP= 0
##$COROFFS= 0
##$CY= 15
##$DATMOD= 1
##$DC= 0
##$DFILT= <>
##$DTYPP= 0
##$F1P= 0
##$F2P= 0
##$FCOR= 0.5
##$FTSIZE= 131072
##$FT_mod= 6
##$GAMMA= 0
##$GB= 0
##$INTBC= 1
##$INTSCL= 1
##$ISEN= 128
##$LB= 0.3
##$LEV0= 0
##$LPBIN= 0
##$MAXI= 10000
##$MC2= 0
##$MEAN= 0
##$ME_mod= 0
##$MI= 0
##$NCOEF= 0
##$NC_proc= -3
##$NLEV= 6
##$NOISF1= 0
##$NOISF2= 0
##$NSP= 0
##$NTH_PI= 0
##$NZP= 0
##$OFFSET= 14.96834
##$PC= 1
##$PHC0= 40.19348
##$PHC1= 0
##$PH_mod= 1
##$PKNL= yes
##$PPARMOD= 0
##$PPDIAG= 0
##$PPIPTYP= 0
##$PPMPNUM= 2147483647
##$PPRESOL= 1
##$PSCAL= 4
##$PSIGN= 0
##$PYNMP= <proc.py>
##$REVERSE= no
##$SF= 400.130004911622
##$SI= 131072
##$SIGF1= 0
##$SIGF2= 0
##$SINO= 400
##$SIOLD= 131072
##$SPECTYP= <>
##$SREGLST= <1H.CDCl3>
##$SSB= 0
##$STSI= 131072
##$STSR= 0
##$SW_p= 8223.68421052632
##$SYMM= 0
##$S_DEV= 0
##$TDeff= 65536
##$TDoff= 0
##$TI= <>
##$TILT= no
##$TM1= 0
##$TM2= 0
##$TOPLEV= 0
##$USERP1= <user>
##$USERP2= <user>
##$USERP3= <user>
##$USERP4= <user>
##$USERP5= <user>
##$WDW= 1
##$XDIM= 131072
##$YMAX_p= 523435131
##$YMIN_p= -519183862
##$CURPLOT= <Network HP LaserJet P1505>
##$CURPRIN= <$Network HP LaserJet P1505>
##$DFORMAT= <normdp>
##$LAYOUT= <+/1D_H.xwp>
##$LFORMAT= <normlp>
##$PFORMAT= <normpl>
##$SURQMSG= 1
$$ End of Bruker specific parameters
$$ ---------------------------------
##NTUPLES= NMR SPECTRUM
##VAR_NAME=  FREQUENCY,     SPECTRUM/REAL,   SPECTRUM/IMAG
##SYMBOL=    X,             R,               I
##VAR_TYPE=  INDEPENDENT,   DEPENDENT,       DEPENDENT
##VAR_FORM=  AFFN,          ASDF,            ASDF
##VAR_DIM=   131072,        131072,          131072
##UNITS=     HZ,            ARBITRARY UNITS, ARBITRARY UNITS
##FACTOR=    0.0627417313425165, 1,          1
##FIRST=     8223.62146879498, -6198,        -95106
##LAST=      0,             -1991,           -97757
##MIN=       0,             -519183862,      0
##MAX=       8223.62146879498, 523435131,    0
$$ Real data points
##PAGE= N=1
##DATA TABLE= (X++(R..R)), XYDATA
$$ [...]
61761B665351J4025J5666J6048J7218J9624K2235K4982K8726L3142L6983M0461
61750B934461M5292N1953N8794O4486O9717P5779Q2796R0207R7943J06334J15577
61739C793339J25786J36845J47939J58112J67832J79001J92764K08227K24100
61730E333945K40770K59621K80952L03829L28022L54808L85540M20321M58543
61721H366351N00122N45628N95765O51265P12922P81004Q54803R33404J016658
61712A4957922J104537J195441J286034J373003J453789J524717J578687J604977
61704B6079107J590505J520988J382997J168161Q77482N22733J25287k85646o76607
61695C2305007j017344j289034j486527j613417j676432j684236j648382j581927
$$ plain form
61761 2665351 2679376 2695042 2711090 2728308 2747932 2770167 2795149 2823875 2857017 2894000 2934461
61750 2934461 2979753 3031706 3090500 3154986 3224703 3300482 3383278 3473485 3571428 3677762 3793339
61739 3793339 3919125 4055970 4203909 4362021 4529853 4708854 4901618 5109845 5333945
61730 5333945 5574715 5834336 6115288 6419117 6747139 7101947 7487487 7907808 8366351
61721 8366351 8866473 9412101 10007866 10659131 11372053 12153057 13007860 13941264 14957922
61712 14957922 16062459 17257900 18543934 19916937 21370726 22895443 24474130 26079107
61704 26079107 27669612 29190600 30573597 31741758 32619240 33141973 33267260 32981614 32305007
61695 32305007 31287663 29998629 28512102 26898685 25222253 23538017 21889635 20307708
61687B0307708j496135j398961j296041j191898j090062r92910r01886q17859
61679A1121956p41330o72377o10476n54594n03924m58361m17827l81480l48306
61670F433281l18137k90969k65682k40958k17611j98180j83421j70845j57748
61661D389730j44357j32611j23089j14770j07083j00366r4539q8780q2706p6741
61651C324688p1333o6671o3082o0730n8963n6765n3865n0761m7823m5168m3214
61640B706313m2408m2355m2065m1065l9777l8872l8873l9994m1481m1463l8775
61629B259185l4867l2560l2566l2561l0436k7108k4999k4644k4409k3222k1828
61618A949985k0856j9178j5537j1025q383q639r779r410p617o214n952n973n799
$$ plain form
61687 20307708 18811573 17412612 16116571 14924673 13834611 12841701 11939815 11121956
61679 11121956 10380626 9708249 9097773 8543179 8039255 7580894 7163067 6781587 6433281
61670 6433281 6115144 5824175 5558493 5317535 5099924 4901744 4718323 4547478 4389730
61661 4389730 4245373 4112762 3989673 3874903 3767820 3667454 3572915 3484135 3401429 3324688
61651 3324688 3253355 3186684 3123602 3062872 3003909 2947144 2893279 2842518 2794695 2749527 2706313
61640 2706313 2663905 2621550 2579485 2538420 2498643 2459771 2420898 2380904 2339423 2297960 2259185
61629 2259185 2224318 2191758 2159192 2126631 2096195 2069087 2044088 2019444 1995035 1971813 1949985
61618 1949985 1929129 1909951 1894414 1883389 1875006 1866367 1856588 1847178 1839561 1833347 1827395 1821422 1815623
61605A815623o196p560q844q986q518q715r704j0411j0093r056p946p153o917
61592A705524p338q031q302p830o854n676m357k997k076k143l171m304m338k717
61578A635390q8K215L406L827M408N629P095P930P642O665O008O280P217Q284
61564A711908R256R900R662Q349O729N704N150M344L196K064N90k012n481q430
61550A760929r971j0434j0405j0204j0444j1820j3945j5612j6519j7428j8275
61539A615872j7762j5579j3458j2842j2867j1867r743p443n155k556p8J538K535
61526A510595L723N283P104R628J2980J5894J7043J7107J8045K0585K3805K7032
61514A688824L0546L4403L8036M1306M4628M7787M9832N0411N0175M9596M8561
$$ plain form
61605 1815623 1809427 1801867 1793023 1784037 1775519 1766804 1757100 1746689 1736596 1727540 1719594 1712441 1705524
61592 1705524 1698186 1690155 1681853 1674023 1667169 1661493 1657136 1654139 1652063 1649920 1646749 1642445 1638107 1635390
61578 1635390 1635302 1637517 1640923 1644750 1649158 1654787 1661882 1669812 1677454 1684119 1690127 1696407 1703624 1711908
61564 1711908 1721164 1731064 1740726 1749075 1755804 1761508 1766658 1771002 1774198 1776262 1776852 1774840 1769359 1760929
61550 1760929 1750958 1740524 1730119 1719915 1709471 1697651 1683706 1668094 1651575 1634147 1615872
61539 1615872 1598110 1582531 1569073 1556231 1543364 1531497 1521754 1514311 1509156 1506600 1506522 1508060 1510595
61526 1510595 1514318 1519601 1526705 1536333 1549313 1565207 1582250 1599357 1617402 1637987 1661792 1688824
61514 1688824 1719370 1753773 1791809 1833115 1877743 1925530 1975362 2025773 2075948 2125544 2174105
61503B174105M7432M7194M7900M8014M6172M2853L9551L6895L4415L1733K9056
61492B625320K6530K3816K0610J7238J4416J2294R976O215Q31m806q920j0899
61480B732621j1681j2692j4561j6631j7619j6937j5364j4091j3140j1345q074
61469B580486m221r76J791N344J0560J7193K4301L0992L6961M2701M8994N6132
61457B850258O3998P2873Q3332R5147J07259J19267J32061J46390J61740J77353
61447D009678J93498K10836K29269K48214K67259K85625L01852L15007L25412
61438F386650L32939L35238L28911L11888K83597K43696J92524J32684O8638M654
61428H621419n5908j09781j54193j88374k13443k30528k40003k42530k39466k31898
$$ plain form
61503 2174105 2221537 2268731 2316631 2364645 2410817 2453670 2493221 2530116 2564531 2596264 2625320
61492 2625320 2651850 2675666 2696276 2713514 2727930 2740224 2750200 2756415 2757246 2752440 2743520 2732621
61480 2732621 2720940 2708248 2693687 2677056 2659437 2642500 2627136 2613045 2599905 2588560 2580486
61469 2580486 2576265 2575289 2577080 2582424 2592984 2610177 2634478 2665470 2702431 2745132 2794126 2850258
61457 2850258 2914256 2987129 3070461 3165608 3272867 3392134 3524195 3670585 3832325 4009678
61447 4009678 4203176 4414012 4643281 4891495 5158754 5444379 5746231 6061238 6386650
61438 6386650 6719589 7054827 7383738 7695626 7979223 8222919 8415443 8548127 8616765 8621419
61428 8621419 8565511 8455730 8301537 8113163 7899720 7669192 7429189 7186659 6947193 6715295
61418F715295k20290k05385j88516j70778j52631j34386j16221r7710p8465n9340
61408E291573m1942k6704j2364K268J6917L0543M2594N3162O2454P0501P7005
61397E566007Q1436Q3715Q4688Q5321Q5482Q4254Q1323P7454P3614P0381O8092
61386F441767O6788O6034O5420O5104O5274O5304O4229O1740N8012N3016M6991
61375G119679M0993L5783L0445K3617J5770Q778L080l075j1155k0361k8740l5172
61363G179642l9759m3130m5850m7849m8160m5885m1533l6695l2493k9002k6001
61352F743285k3064j9139j3478p245k984k029l386n480p859j0791j4113j7032
61340F616685j8646j8582j7474j6345j4664r871j71J2891K6498M0616N7619P7935
$$ plain form
61418 6715295 6495005 6289620 6101104 5930326 5777695 5643309 5527088 5429378 5350913 5291573
61408 5291573 5249631 5222927 5210563 5212831 5229748 5260291 5302885 5356047 5418501 5489002 5566007
61397 5566007 5647443 5731158 5815846 5901167 5986649 6070903 6152226 6229680 6303294 6373675 6441767
61386 6441767 6508555 6574589 6640009 6705113 6770387 6835691 6899920 6961660 7019672 7072688 7119679
61375 7119679 7160672 7196455 7226900 7250517 7266287 7275065 7278145 7275070 7263915 7243554 7214814 7179642
61363 7179642 7139883 7096753 7050903 7003054 6954894 6909009 6867476 6830781 6798288 6769286 6743285
61352 6743285 6720221 6701082 6687604 6680359 6677375 6675346 6671960 6666480 6658621 6647830 6633717 6616685
61340 6616685 6598039 6579457 6561983 6545638 6530974 6521103 6520932 6533823 6560321 6600937 6658556 6736491
61328F736491R8900J18793J39391J62992J88841K14364K38542K62243K86065L09345
61318H755967L30705L48287L59935L64056L59938L46613L22273K85623K37303
61309A1710700J79480J15005M7539j8705q0468j36384j86068k29243k66100k97229
61299A0838527l22463l40945l52862l59680l62033l59107l51140l40506l28741
61290G721050l14338k95645k74435k54147k35539k16678j96651j76553j56882
61281E600182j36733j16196r7162q0753o5762n0709l5823k1871q491M950J7782
61270E009414K8870L8378M7363N5794O2365O6465O9212P1858P3921P3845P1282
61259E668767O7688O4270O0265N4299M7021M0999L7601L5154L1104K5154J9140
$$ plain form
61328 6736491 6835391 6954184 7093575 7256567 7445408 7659772 7898314 8160557 8446622 8755967
61318 8755967 9086672 9434959 9794894 10158950 10518888 10865501 11187774 11473397 11710700
61309 11710700 11890180 12005185 12052724 12034019 11953551 11817167 11631099 11401856 11135756 10838527
61299 10838527 10516064 10175119 9822257 9462577 9100544 8741437 8390297 8049791 7721050
61290 7721050 7406712 7111067 6836632 6582485 6346946 6130268 5933617 5757064 5600182
61281 5600182 5463449 5347253 5250091 5169338 5103576 5052867 5017044 4995173 4986682 4991632 5009414
61270 5009414 5038284 5076662 5124025 5179819 5242184 5308649 5377861 5449719 5523640 5597485 5668767
61259 5668767 5736455 5800725 5860990 5915289 5962310 6003309 6040910 6076064 6107168 6132322 6151462
61248F151462J4277R816M517j848q970j7042k6293l5824m3996n0275n5972o2476
61236E877376o9201p4273p7232p9778q3229q6299q6574q3602p9211p4927p0555
61225E012495o5504o0143n5180n0555m5645m0075l4029k8326k4278k2721k2930
61214D563109k3321k3377k4022k5904k8302l0050l0454k8977k5192j9690j3896
61203D289924q322k031N503J3244K0240K7240L5494M4943N4843O5408P7326R0207
61191D714019J02827J14630J25747J35810J43993J50052J53914J54200J48371
61182E943563J34830J14039Q7308N5123J7210k5899p1473j14741j50882j77554
61172E811524j95480k06557k11845k11625k06599j98091j87308j75127j62405
$$ plain form
61248 6151462 6165739 6175555 6180072 6178224 6169254 6152212 6125919 6090095 6046099 5995824 5939852 5877376
61236 5877376 5808175 5733902 5656670 5576892 5493663 5407364 5320790 5237188 5157977 5083050 5012495
61225 5012495 4946991 4886848 4831668 4781113 4735468 4695393 4661364 4633038 4608760 4586039 4563109
61214 4563109 4539788 4516411 4492389 4466485 4438183 4408133 4377679 4348702 4323510 4303820 4289924
61203 4289924 4281602 4279571 4285074 4298318 4318558 4345798 4381292 4426235 4481078 4546486 4623812 4714019
61191 4714019 4816846 4931476 5057223 5193033 5337026 5487078 5640992 5795192 5943563
61182 5943563 6078393 6192432 6279740 6334863 6352073 6326174 6254701 6139960 5989078 5811524
61172 5811524 5616044 5409487 5197642 4986017 4779418 4581327 4394019 4218892 4056487
61163D056487j49798j37387j25004j12837j01347r0781q1169p2613o5163n8654
61153C061734n2941m7910m2956l7034k9791k2361j6364j2275r117n569j084L807
61141B788139Q042J1088J3563J6351J9227K0956K0770J8905J5662J1130O108J962
61129B951903j123m515r014j3499j6722j9201k2135k5475k8464l1215l4113l6255
61117B710172l6300l4652l3218l2881l2778l2183l1724l2190l3326l4502l5830
61106B340588l7859m0567m3183m4921m5647m5787m5694m5158m3817m1946m0438
61095A865571l9758l9444l8779l7475l5563l3207l0999k9765k9744l0408l1205
61084A489224l1773l1425k9513k6646k4317k2816k0702j7031j2859r637p331n111
$$ plain form
61163 4056487 3906689 3769302 3644298 3531461 3430114 3339333 3258164 3185551 3120388 3061734
61153 3061734 3008793 2960883 2917927 2880893 2851102 2828741 2812377 2800102 2790985 2785416 2784332 2788139
61141 2788139 2796181 2807269 2820832 2837183 2856410 2877366 2898136 2917041 2932703 2943833 2949941 2951903
61129 2951903 2950780 2946265 2937251 2923752 2907030 2887829 2865694 2840219 2811755 2780540 2746427 2710172
61117 2710172 2673872 2639220 2606002 2573121 2540343 2508160 2476436 2444246 2410920 2376418 2340588
61106 2340588 2302729 2262162 2218979 2174058 2128411 2082624 2036930 1991772 1947955 1906009 1865571
61095 1865571 1825813 1786369 1747590 1710115 1674552 1641345 1610346 1580581 1550837 1520429 1489224
61084 1489224 1457451 1426026 1396513 1369867 1345550 1322734 1302032 1285001 1272142 1262505 1255174 1250063
61072A250063k699KL389O961Q945Q672Q264J0127J3608J5989J6202J5589J5377
61059A370489J5392J5330J5358J5172J4082J2460J1791J2702J4068J4468J3683
61048A524995J2468J1577J1220J0923R911Q047O164M885L664J826o5q45m42J80
61034A604508M06K83j40p22r18o22j028l392p105j0147j1237j0640r297q258q602
61019A533089j0455j2320j2577j1510j0722j0889j1272j1205j0801j0244r659
61008A411435r542j0235j1092j1171j0398r207p682o150n732o790p618o476m241
60995A305101l056k952k120k34J067J264K032M391O889P624O656N491N430P012
60981A344595R905J2758J4058J3700J2954J2967J4222J7059K1247K5241K7473
$$ plain form
61072 1250063 1247364 1247366 1250755 1257716 1266661 1275333 1283597 1293724 1307332 1323321 1339523 1355112 1370489
61059 1370489 1385881 1401211 1416569 1431741 1445823 1458283 1470074 1482776 1496844 1511312 1524995
61048 1524995 1537463 1549040 1560260 1571183 1581094 1589141 1595305 1600190 1603854 1605680 1605615 1604770 1604328 1604508
61034 1604508 1604914 1605197 1605057 1604335 1603417 1602795 1601767 1598375 1591270 1581123 1569886 1559246 1549949 1541691 1533089
61019 1533089 1522634 1510314 1497737 1486227 1475505 1464616 1453344 1442139 1431338 1421094 1411435
61008 1411435 1401893 1391658 1380566 1369395 1358997 1349790 1342108 1335958 1330226 1323436 1315818 1309342 1305101
60995 1305101 1302045 1299093 1296973 1296739 1297806 1299070 1301102 1305493 1312382 1320006 1326662 1332153 1337583 1344595
60981 1344595 1354500 1367258 1381316 1395016 1407970 1420937 1435159 1452218 1473465 1498706 1526179
60970A526179K8417K9929L2648L5651L8499M1695M5037M7571M9483N2146N5909
60959A983164N9497O2065O4187O6592O9618P4059Q0608Q8182R4743J00128J06242
60948B849085J14202J23394J33507J45114J57695J69476J79984J90686K02561
60939D265704K15350K29610K46923K67418K89872L14947L45352L81792M22102
60930F979070M65685N15396N73442O39138P12938P99052R01184J018751J150069
60921A3754725J296034J458393J638977J843867K082236K355744K655451K973522
60913C0058949L299028L572531L647008L342905K597286J571104N81324j00222
60905D8569913l91815l71689j58322J35437L52289K80460k28341j115031k115131
$$ plain form
60970 1526179 1554596 1584525 1617173 1652824 1691323 1733018 1778055 1825626 1875109 1927255 1983164
60959 1983164 2042661 2104726 2168913 2235505 2305123 2379182 2459790 2547972 2642715 2742843 2849085
60948 2849085 2963287 3086681 3220188 3365302 3522997 3692473 3872457 4063143 4265704
60939 4265704 4481054 4710664 4957587 5225005 5514877 5829824 6175176 6556968 6979070
60930 6979070 7444755 7960151 8533593 9172731 9885669 10684721 11585905 12604656 13754725
60921 13754725 15050759 16509152 18148129 19991996 22074232 24429976 27085427 30058949
60913 30058949 33357977 36930508 40577516 43920421 46517707 48088811 48670135 48569913
60905 48569913 48178098 47806409 47648087 47783524 48135813 48416273 48187932 47072901 44957770
60896D4957770k927247l389648l517596l416604l189357k904947k607041k320459
60888B0684871k053070j804430j575606j369849j188234j029442q92552p77240
60880I994448o82205o05326n44308m95968m56138m21559l90940l63525l37926
60871E696553l13061k88977k66036k44404k24797k08431j95588j85283j76632
60862C593344j69282j62268j54069j44477j35105j27280j20502j13554j06064
60853B360743r8324r0553q3024p6162o9974o4013n8287n3512n0123m7659m5315
60842A623797m2563l9198l5383l1692k8576k5935k3614k1754j9968j7104j2959
60831A325051r447q486r292r373p796n690l795j585J103L470N173O620P648P458
$$ plain form
60896 44957770 42030523 38640875 35123279 31706675 28517318 25612371 23005330 20684871
60888 20684871 18631801 16827371 15251765 13881916 12693682 11664240 10771688 9994448
60880 9994448 9312243 8706917 8162609 7666641 7210503 6788944 6398004 6034479 5696553
60871 5696553 5383492 5094515 4828479 4584075 4359278 4150847 3955259 3769976 3593344
60862 3593344 3424062 3261794 3107725 2963248 2828143 2700863 2580361 2466807 2360743
60853 2360743 2262419 2171866 2088842 2012680 1942706 1878693 1820406 1766894 1716771 1669112 1623797
60842 1623797 1581234 1542036 1506653 1474961 1446385 1420450 1396836 1375082 1355114 1338010 1325051
60831 1325051 1315604 1307118 1297826 1288453 1280657 1274967 1271172 1269587 1270690 1274160 1279333 1285953 1293601 1301059
60817A301059O192M927L916K534J175J225K657L580K928J706Q74j08j699l203
60803A327763m383o276q987j0582r767q242q465j0259j1408j0822r236p372n123
60790A216841k462J82K458M144N128O052Q204J1806J5168J6663J6734J6731J6652
60777A334301J5577J3760J2386J1518J0264R152J0359J4599J9246K0830J8893
60766A490885J6179J5260J5815J5532J3088R677P561P601Q656R136Q478P081N517
60753A630466M141K989J747K08j268k255l255n275q354j1485j4302j7515k1106
60740A554736k3424k3208k1501k0292k0118k0280k0487k0790k0506j8929j6877
60729A328324j5700j4966j2846r012n288k997j381O36K804M653O714R249J1085
$$ plain form
60817 1301059 1307251 1312178 1316094 1318628 1319803 1321028 1323685 1327265 1330193 1331899 1332773 1332665 1330966 1327763
60803 1327763 1323380 1317104 1308117 1297535 1287768 1279526 1271061 1260802 1249394 1238572 1229336 1221964 1216841
60790 1216841 1214379 1214561 1217019 1221163 1226291 1232343 1240547 1252353 1267521 1284184 1300918 1317649 1334301
60777 1334301 1349878 1363638 1376024 1387542 1397806 1406958 1417317 1431916 1451162 1471992 1490885
60766 1490885 1507064 1522324 1538139 1553671 1566759 1576436 1583997 1591598 1600254 1609390 1617868 1624949 1630466
60753 1630466 1634607 1637596 1639343 1639551 1638283 1636028 1632773 1627498 1619144 1607659 1593357 1575842 1554736
60740 1554736 1531312 1508104 1486603 1466311 1446193 1425913 1405426 1384636 1364130 1345201 1328324
60729 1328324 1312624 1297658 1284812 1275800 1270512 1267515 1266134 1266770 1269574 1274227 1280941 1290190 1301275
60716A301275J1337J1477J3772J8013K1525K2587K2274K2506K3657K4870K5669
60705A518962K6211K6446K5976K4592K2357J9346J5824J2574J0415R473R342R877
60693A731395J1205J2906J3918J3670J2808J2322J2223J1641J0156Q449P397O896
60681A864986N950L855R38j925m208o015p625r154j0550j1553j1763j1238j1078
60668A790620j2658j5818j8494j8872j7469j6251j6127j6373j6227j5703j4673
60657A611955j2598r674p101n495m098k244m82N60J318K104J935K8k394l526l649
60642A566639m500o203o909n801m463m486n282n230l774j333J712M771O530N976
60628A537647L698J291k92j261k276l943o690j0434j4490j8161k1159k3245k4001
$$ plain form
60716 1301275 1312612 1324089 1337861 1355874 1377399 1399986 1422260 1444766 1468423 1493293 1518962
60705 1518962 1545173 1571619 1597595 1622187 1644544 1663890 1679714 1692288 1702703 1712176 1721518 1731395
60693 1731395 1742600 1755506 1769424 1783094 1795902 1808224 1820447 1832088 1842244 1850693 1858090 1864986
60681 1864986 1870936 1874791 1875729 1873804 1869596 1863581 1855956 1846802 1836252 1824699 1812936 1801698 1790620
60668 1790620 1777962 1762144 1743650 1724778 1707309 1691058 1674931 1658558 1642331 1626628 1611955
60657 1611955 1599357 1589683 1582582 1577087 1572989 1570745 1570263 1570823 1572141 1574245 1576180 1576208 1573814 1570288 1566639
60642 1566639 1562139 1555936 1549027 1543226 1538763 1534277 1528995 1523765 1519991 1518658 1520370 1525141 1531671 1537647
60628 1537647 1541345 1542636 1542344 1541083 1538807 1534864 1528174 1517740 1503250 1485089 1463930 1440685 1416684
60615A416684k3434k2300k1269k0281j9197j8398j7934j6817j4164j0728q053
60604A224109o389m613k241k51M65L71L07J37p52k133l013k914k329j803j145
60589A197806J53J964L423L754L060K131J579J327J042P55Q14J298J863K174K321
60574A225464K773M080O503R602J2265J3582J3868J4438J6170J8560K0442K1409
60562A379156K2191K3839K6687L0006L2509L3523L3905L5359L8425M1526M2540
60551A739666M1096L8566L6125L3680L0766K7329K3216J7918J1515N093n64o166
60539A998240j2922k0736k8175l3896l7299l8242l7124l5168l3491l1757k8603
60528A660827k3571j7955j3598j1413j1036j1138j0165p634m752l065k545k066
$$ plain form
60615 1416684 1393250 1370950 1349681 1329400 1310203 1291805 1273871 1257054 1242890 1232162 1224109
60604 1224109 1217720 1213107 1210866 1210615 1211080 1211451 1211758 1211895 1211143 1209010 1205997 1203083 1200754 1198951 1197806
60589 1197806 1197959 1199923 1203346 1207100 1210160 1212291 1213870 1215197 1216239 1216994 1217808 1219106 1220969 1223143 1225464
60574 1225464 1228237 1232317 1238820 1248422 1260687 1274269 1288137 1302575 1318745 1337305 1357747 1379156
60562 1379156 1401347 1425186 1451873 1481879 1514388 1547911 1581816 1617175 1655600 1697126 1739666
60551 1739666 1780762 1819328 1855453 1889133 1919899 1947228 1970444 1988362 1999877 2004970 2004406 1998240
60539 1998240 1985318 1964582 1936407 1902511 1865212 1826970 1789846 1754678 1721187 1689430 1660827
60528 1660827 1637256 1619301 1605703 1594290 1583254 1572116 1561951 1554317 1549565 1546500 1543955 1541889
60516A541889j446j645k710l321l002l205m972o782o272l254M03L481O475R978
60502A525617J3254J4959J4711J3643J3551J5321J8216K0951K3276K5686K7760
60491A726945K8232K7167K6524K7652K9605L1109L2799L5865L9733M3077M6270
60480B094978N0714N6163O1072O5365P0382P5528P7271P2636O2132M8274L2661
60469B767176J5796j433j7532l1321m2067m9041n1626m9779m4173l6226k7970
60458B431804k0901j4600p187K299J2611K1637K8351L2969L6049L8186M0182M2925
60446B644325M7119N3245O1269P0443Q0129R0977J04438J20781J38576J56713
60436C568015J75911J97557K21775K47468K73515K98975L22830L44817L66265
$$ plain form
60516 1541889 1540443 1538798 1536088 1532767 1529765 1526560 1521588 1514806 1508534 1505280 1505683 1509164 1515639 1525617
60502 1525617 1538871 1553830 1568541 1582184 1595735 1611056 1629272 1650223 1673499 1699185 1726945
60491 1726945 1755177 1782344 1808868 1836520 1866125 1897234 1930033 1965898 2005631 2048708 2094978
60480 2094978 2145692 2201855 2262927 2328292 2398674 2474202 2551473 2624109 2686241 2734515 2767176
60469 2767176 2782972 2781539 2764007 2732686 2690619 2641578 2589952 2540173 2496000 2459774 2431804
60458 2431804 2410903 2396303 2389116 2391415 2404026 2425663 2454014 2486983 2523032 2561218 2601400 2644325
60446 2644325 2691444 2744689 2805958 2876401 2956530 3047507 3151945 3272726 3411302 3568015
60436 3568015 3743926 3941483 4163258 4410726 4684241 4983216 5306046 5650863 6017128
60427F017128L88974M13136M37398M60907M83863N04834N17643N11578M75346
60418A0210807M02052K92238J53704j401j60082l10217m40340n39917o02274o28134
60408H376436o25453o04365n71908n31500m86051m39540l95234l54135l16197
60399D052053k81932k51739k24630j99352j76451j57659j43027j30098j16538
60390B370627j02816r1450q3930p8976p3869o7241o0206n4702n1114m8250m5347
60379A612726m2924m1263l9382l6438l3147l0667k8859k6783k4252k1695j9070
60368A268246j6354j4504j4432j5330j5435j4213j2375j0184p475n159m558n076
60356A133151m539k300j50N22O28J509K834L626M039M769N520N367M120K484J278
$$ plain form
60427 6017128 6406102 6819238 7256636 7717543 8201406 8706240 9223883 9735461 10210807
60418 10210807 10612859 10905097 11058801 11057400 10897318 10587101 10146761 9606844 9004570 8376436
60408 8376436 7750983 7146618 6574710 6043210 5557159 5117619 4722385 4368250 4052053
60399 4052053 3770121 3518382 3293752 3094400 2917949 2760290 2617263 2487165 2370627
60390 2370627 2267811 2176361 2092431 2013455 1939586 1872345 1812139 1757437 1706323 1658073 1612726
60379 1612726 1569802 1528539 1489157 1452719 1419572 1388905 1360046 1333263 1309011 1287316 1268246
60368 1268246 1251892 1237388 1222956 1207626 1192191 1177978 1165603 1155419 1147944 1142785 1138227 1133151
60356 1133151 1128612 1126312 1126162 1126684 1127312 1128821 1131655 1135281 1139320 1144089 1149609 1154976 1159096 1161580 1162858
60341A162858J053J956L477M752N503O111O748P185P470P818P809O943N969O224
60327A241876P312P222N352L675L903M953M634K691P09k76p36j616l247n174o571
60312A264707p127p530q372q755p326m686l037k965k532l50K334L828M406N016
60298A227611N334M943N086P080R879J1169J0433R129Q455Q551R495J1286J3025
60285A341476J3623J3277J3093J3477J3904J3908J3112J0838O975K966P66R58
60273A458373K711M953O691P072O337O067P190Q666R313R792J0985J1645R985
60260A559780O856M737L803J717k466o746r237j0456j1495j1965j1080r400q209
60247A495839q039q688r772j0468r698p460n331m849n834o829o624n090k973j268
$$ plain form
60341 1162858 1163911 1165867 1169344 1174096 1179599 1185710 1192458 1199643 1207113 1214931 1222740 1229683 1235652 1241876
60327 1241876 1249188 1256410 1261762 1265437 1269340 1274293 1278927 1281618 1282327 1282051 1281315 1279699 1276452 1271278 1264707
60312 1264707 1257580 1250050 1241678 1232923 1225597 1220911 1217874 1214909 1212377 1212027 1214361 1218189 1222595 1227611
60298 1227611 1232945 1237888 1242974 1250054 1259933 1271102 1281535 1290664 1299119 1307670 1317165 1328451 1341476
60285 1341476 1355099 1368376 1381469 1394946 1408850 1422758 1435870 1446708 1453683 1456649 1457415 1458373
60273 1458373 1461084 1466037 1472728 1479800 1486137 1492204 1499394 1508060 1517373 1527165 1538150 1549795 1559780
60260 1559780 1566636 1571373 1575176 1576893 1574427 1567681 1558444 1547988 1536493 1524528 1513448 1504048 1495839
60247 1495839 1487800 1479112 1469340 1458872 1449174 1441714 1436383 1431534 1425700 1418871 1412247 1407157 1404184 1402916
60233A402916m13oL98N48K21J72J289L108M469N418O994R193J0684J0883J0801
60218A466675J1328J2069J2373J2238J1729J0845J0477J1981J5028J7383J7800
60207A609926J7833J9557K2750K5701K7857L0048L2761L5731L8978M2878M7252
60196A951272N1494N5644O0292O5434P0380P5018Q0313Q7196R5503J04270J12804
60185B809620J21162J29764J38685J47382J55233J62198J68549J73915J77221
60176D183729J77770J75866J71936J65570J56135J43894J29756J14111R6653P7511
60166E592931N7896L9153K1590M624j1745k6022l6204m1728m3904m4078m1911
60155E470602l6263k7464j7359o913M936J9248L4928M9880O3743P8021R3613J09535
$$ plain form
60233 1402916 1402503 1402497 1402895 1403443 1403664 1403836 1405125 1408233 1412702 1418120 1425114 1434307 1444991 1455874 1466675
60218 1466675 1478003 1490072 1502445 1514683 1526412 1537257 1547734 1559715 1574743 1592126 1609926
60207 1609926 1627759 1647316 1670066 1695767 1723624 1753672 1786433 1822164 1861142 1904020 1951272
60196 1951272 2002766 2058410 2118702 2184136 2254516 2329534 2409847 2497043 2592546 2696816 2809620
60185 2809620 2930782 3060546 3199231 3346613 3501846 3664044 3832593 4006508 4183729
60176 4183729 4361499 4537365 4709301 4874871 5031006 5174900 5304656 5418767 5515420 5592931
60166 5592931 5650827 5689980 5711570 5716194 5704449 5678427 5642223 5600495 5556591 5512513 5470602
60155 5470602 5434339 5406875 5389516 5382603 5387539 5406787 5441715 5491595 5555338 5633359 5726972 5836507
60143E836507J24438J38037J50269J60071J66201J68759J68594J65289J57045
60134G235210J42980J24511J03793Q1660N7950L3101Q071j6924m2150o6537q7532
60123G574133j03448j14991j23586j28899j29098j23243j12483r8929q3991o7785
60113F487680m9655k9187p164J4558L4489N2635O9922Q6592J01559J13130J20018
60102F994577J21910J19531J14023J05881R4725Q0466O4316M8034L2489J7663
60092G793615L893p775j6392k1490k2440j8246q411O371K4787M5861O9021R3723
60080G942517J19512J46537J75441K06471K38927K71793L04761L38142L71752
60071A0115853M04652M36329M67308M97604N25032N46245N59257N63925N60069
$$ plain form
60143 5836507 5960945 6098982 6249251 6409322 6575523 6744282 6912876 7078165 7235210
60134 7235210 7378190 7502701 7606494 7688154 7746104 7779205 7787276 7770352 7728202 7661665 7574133
60123 7574133 7470685 7355694 7232108 7103209 6974111 6850868 6738385 6639456 6555465 6487680
60113 6487680 6438025 6408838 6401674 6416232 6450721 6503356 6573278 6659870 6761429 6874559 6994577
60102 6994577 7116487 7236018 7350041 7455922 7550647 7631113 7695429 7743463 7775952 7793615
60092 7793615 7797508 7789733 7773341 7751851 7729411 7711165 7702754 7709125 7733912 7779773 7848794 7942517
60080 7942517 8062029 8208566 8384007 8590478 8829405 9101198 9405959 9744101 10115853
60071 10115853 10520505 10956834 11424142 11921746 12446778 12993023 13552280 14116205 14676274
60062A4676274N46815N24185M93583M55740M09489L54032K91368K24985J56571
60053A8133042Q5471J1216o4678j39520k10888k76850l35552l85161m24218m51926
60043A5940936m68087m72680m65726m47966m21319l87839l48484l04006k56755
60034A2368074k09763j63766j17173o9836k4790J5083N0023Q1052J06417J22971
60024A2158292J30077J29596J22443J07845Q5927N8710K8188m642l8516p1513
60014A2706407j02437j31076j56879j78870j97222k13312k27778k39873k48991
60005A1009969k55331k58686k58055k52992k44071k31600k15274j95591j74142
59996H924227j51706j27349j00217p1320m2647j5320J0760L6118O1101Q5590J08764
$$ plain form
60062 14676274 15223089 15747274 16240857 16696597 17106086 17460118 17751486 17976471 18133042
60053 18133042 18218513 18229729 18165051 18025531 17814643 17537793 17202241 16817080 16392862 15940936
60043 15940936 15472849 15000169 14534443 14086477 13665158 13277319 12928835 12624829 12368074
60034 12368074 12158311 11994545 11877372 11807536 11782746 11797829 11847852 11928904 12035321 12158292
60024 12158292 12288369 12417965 12540408 12648253 12734180 12792890 12821078 12816436 12777920 12706407
60014 12706407 12603970 12472894 12316015 12137145 11939923 11726611 11498833 11258960 11009969
60005 11009969 10754638 10495952 10237897 9984905 9740834 9509234 9293960 9098369 8924227
59996 8924227 8772521 8645172 8544955 8473635 8430988 8415668 8426428 8462546 8523647 8609237 8718001
59985H718001J29405J46528J59401J67280J69730J66754J57988J42441J20118
59976A0077646R3146O3908L2709j102l6404p0786j03212j33907j61648j83826
59966I576524j99547k10203k16359k16544k10165j99177j85496j68778j48209
59957G822046j24756r9993p4299m7713k1208M473L0047N6352Q2836J08657J33976
59946G870418J58870J82178K02861K21271K37460K49361K54479K52483K44446
59937I873827K30338K09290J81948J50565J16734Q0544M2060K494l6426p3375
59927A0777999j07625j38891j66722j89604k05290k12649k12655k06935j96077
59918I141551j80124j59830j36348j10387q2653n4410k6576J091K8797N5499Q0016
$$ plain form
59985 8718001 8847406 8993934 9153335 9320615 9490345 9657099 9815087 9957528 10077646
59976 10077646 10170792 10234700 10267409 10266307 10229903 10159117 10055905 9921998 9760350 9576524
59966 9576524 9376977 9166774 8950415 8733871 8523706 8324529 8139033 7970255 7822046
59957 7822046 7697290 7597297 7522998 7475285 7454077 7458550 7488597 7544949 7627785 7736442 7870418
59946 7870418 8029288 8211466 8414327 8635598 8873058 9122419 9376898 9629381 9873827
59937 9873827 10104165 10313455 10495403 10645968 10762702 10843246 10885306 10887800 10851374 10777999
59927 10777999 10670374 10531483 10364761 10175157 9969867 9757218 9544563 9337628 9141551
59918 9141551 8961427 8801597 8665249 8554862 8472209 8417799 8391223 8392314 8421111 8476610 8556626
59907H556626J02485J23278J41151J54247J62713J68599J72960J74545J71623
59898I928227J63956J52469J38205J22249J06060R1036P7904O6792N7848N1815
59888A0956561M9992N3419O2002P4835R1432J12156J37364J66976K01115K40098
59878A2145950K83047L27297L70253M11353M51384M90164N25583N54525N73963
59869A6133519N81375N74718N51967N10727M49040L67133K67933J55735L5229
59860A9627376q7792k06189l13333m05011m79003n33677n68056n82954n81058
59851A5870303n65740n40003n06040m65468m20062l72031l22809k72042k19205
59842A2186903j66127j16141p0375k6892J5819N6647R4142J28521J59665J85224
$$ plain form
59907 8556626 8659111 8782389 8923540 9077787 9240500 9409099 9582059 9756604 9928227
59898 9928227 10092183 10244652 10382857 10505106 10611166 10702202 10780106 10846898 10904746 10956561
59888 10956561 11006553 11059972 11121974 11196809 11288241 11400397 11537761 11704737 11905852 12145950
59878 12145950 12428997 12756294 13126547 13537900 13989284 14479448 15005031 15559556 16133519
59869 16133519 16714894 17289612 17841579 18352306 18801346 19168479 19436412 19592147 19627376
59860 19627376 19539584 19333395 19020062 18615051 18136048 17602371 17034315 16451361 15870303
59851 15870303 15304563 14764560 14258520 13793052 13372990 13000959 12678150 12406108 12186903
59842 12186903 12020776 11904635 11834260 11807368 11823187 11879834 11973976 12102497 12262162 12447386
59832A2447386K02971K13179K16036K08318J85865J48907J01874M8153j2139p8896
59822A3681654j49287k18961k83794l39735l83291m13646m33079m44204m47696
59813A0567961m43214m31234m13115l90323l64481l37429l10553k84308k58646
59804G334658k33429k08461j83847j60477j39483j21240j05482r2236q1839p4182
59794E933982o8797o5595o4530o4618o4299o2771o0225n6876n2764m8340m4129
59783E281038l9855l5014l0364k7722k8221l1628l7285m4519n2063n8311o2554
59772D833502o5058o5851o4446o0773n5295m8065l8843k8389j8358r551j416O339
59760D383796J2933J8001K2698K8419L5187M2242M9600N8037O7697P7300Q4760
$$ plain form
59832 12447386 12650357 12863536 13079572 13287890 13473755 13622662 13724536 13772689 13760550 13681654
59822 13681654 13532367 13313406 13029612 12689877 12306586 11892940 11459861 11015657 10567961
59813 10567961 10124747 9693513 9280398 8890075 8525594 8188165 7877612 7593304 7334658
59804 7334658 7101229 6892768 6708921 6548444 6408961 6287721 6182239 6090003 6008164 5933982
59794 5933982 5865185 5799590 5735060 5670442 5606143 5543372 5483147 5426271 5373507 5325167 5281038
59783 5281038 5241183 5206169 5175805 5148083 5119862 5088234 5050949 5006430 4954367 4896056 4833502
59772 4833502 4768444 4702593 4638147 4577374 4522079 4474014 4435171 4406782 4388424 4378873 4377457 4383796
59760 4383796 4396729 4414730 4437428 4465847 4501034 4543276 4592876 4650913 4718610 4795910 4880670
59749D880670Q8566Q8994Q8027Q7530Q7242Q5094P9721P2063O4189N7099N0297
59738E729492M3185L6325L1115K8454K7975K8884L1460L7136M6886O0174P5825
59727F176911R3168J11755J30940J50818J72865J98363K26544K55609K85224L16602
59717H118799L50247L85100M19871M53540M83951N07131N18245N12006M81986
59708A2230876M21875L29636K10673P6709n7920j79316k76355l43285l80863l94001
59698A1638029l87877l66478l34046k95893k56496k17270j77350j36651r7136
59689I368832o0666k6689O710L9797P0845R9012J26155J54891J85854K17671K48899
59678A0431311K79151L09173L40806L76026M14911M55138M94634N34146N76149
$$ plain form
59749 4880670 4969236 5058230 5146257 5233787 5321029 5406123 5485844 5557907 5622096 5679195 5729492
59738 5729492 5772677 5809002 5840117 5868571 5896546 5925430 5956890 5994026 6040912 6101086 6176911
59727 6176911 6270079 6381834 6512774 6663592 6836457 7034820 7261364 7516973 7802197 8118799
59717 8118799 8469046 8854146 9274017 9727557 10211508 10718639 11236884 11748890 12230876
59708 12230876 12652751 12982387 13193060 13269769 13211849 13032533 12756178 12412893 12032030 11638029
59698 11638029 11250152 10883674 10549628 10253735 9997239 9779969 9602619 9465968 9368832
59689 9368832 9308166 9281477 9288187 9327984 9398829 9497841 9623996 9778887 9964741 10182412 10431311
59678 10431311 10710462 11019635 11360441 11736467 12151378 12606516 13101150 13635296 14211445
59669A4211445O21957O71058P22516P75374Q28187Q79831R30476R80118J026297
59660B1647259J064896J093168J110249J114841J104618J078949J040866R95611
59652C0250457R48340R03688Q66065Q39072Q24677Q23004Q32122Q48030Q65771
59643C8001226Q80830Q88899Q84784Q63041Q19973P54203O65761N56463M31384
59634D4746564K98192J64400L6355p9302j75513k47349k93347l13457l07259k75391
59624D3553893k21423j50501o6372K9380J35805K51269L73266M98783O24953P49635
59614D5778688Q70880R85433J088260J173641J235906J268704J264207J213674
59606E4879393J108904R44306P19631M41787J23673k18619n66792q99981j197036
$$ plain form
59669 14211445 14833402 15504460 16226976 17002350 17830537 18710368 19640844 20620962 21647259
59660 21647259 22712155 23805323 24915572 26030413 27135031 28213980 29254846 30250457
59652 30250457 31198797 32102485 32968550 33807622 34632299 35455303 36287425 37135455 38001226
59643 38001226 38882056 39770955 40655739 41518780 42338753 43092956 43758717 44315180 44746564
59634 44746564 45044756 45209156 45245511 45166209 44990696 44743347 44450000 44136543 43829284 43553893
59624 43553893 43332470 43181969 43115597 43144977 43280782 43532051 43905317 44404100 45029053 45778688
59614 45778688 46649568 47635001 48723261 49896902 51132808 52401512 53665719 54879393
59606 54879393 55988297 56932603 57652234 58094021 58217694 57999075 57432283 56532302 55335266
59597E5335266j441869j626744j750706j816672j830735j801907j740003j653863
59589D1672767j552431j446447j347375j265028j207144j179929j186078j220931
59581C1267404j271602j321417j356438j369239j358367j325669j274567j209916
59573B0780189j137480j061873r85072r07755q31669p59358o91980o29204n71423
59564A3204375n20048m74876m33131l92553l54136l20225k91040k64613k39499
59555I914254k15880j94381j75403j59708j48198j40745j36099j33363j32968
59546H477509j35800j41616j48608j54555j58530j61358j64147j66466j66512
59537G079917j62991j56291j47707j38313j28608j18462j07246r4760q2083p0564
$$ plain form
59597 55335266 53893397 52266653 50515947 48699275 46868540 45066633 43326630 41672767
59589 41672767 40120336 38673889 37326514 36061486 34854342 33674413 32488335 31267404
59581 31267404 29995802 28674385 27317947 25948708 24590341 23264672 21990105 20780189
59573 20780189 19642709 18580836 17595764 16688009 15856340 15096982 14405002 13775798 13204375
59564 13204375 12684327 12209451 11776320 11383767 11029631 10709406 10418366 10153753 9914254
59555 9914254 9698374 9503993 9328590 9168882 9020684 8879939 8743840 8610477 8477509
59546 8477509 8341709 8200093 8051485 7896930 7738400 7577042 7412895 7246429 7079917
59537 7079917 6916926 6760635 6612928 6474615 6346007 6227545 6120299 6025539 5943456 5872892
59527E872892n9899m8534l6248k4921j6012q615r68P306J5448K3112L0385L7011
59515E790957M2707M7685N1969N4988N6892N9405O4023O9906P5047P9287Q4794
59504F477660R3583J05793J20294J35742J50856J64970J78921J94601K13007K33219
59494H068646K53602K73606K94053L15956L39266L62590L84102M02944M19656
59485A1114421M34876M47665M55656M57123M52418M43083M29857M12241L89856
59476A5037196L63340L33230K98859K59703K18066J78908J46215J20190R8797
59467A7054504Q1107O8019O0569N9126O3892P4628Q9798J07357J26336J46063
59457A7931399J63599J73582J71351J55128J24762Q0095K1634m8311j26355k09292
$$ plain form
59527 5872892 5812993 5764459 5728211 5703290 5687278 5678663 5677695 5685001 5700449 5723561 5753946 5790957
59515 5790957 5833664 5881349 5933318 5988306 6045198 6104603 6168626 6238532 6313579 6392866 6477660
59504 6477660 6571243 6677036 6797330 6933072 7083928 7248898 7427819 7622420 7835427 8068646
59494 8068646 8322248 8595854 8889907 9205863 9545129 9907719 10291821 10694765 11114421
59485 11114421 11549297 11996962 12452618 12909741 13362159 13805242 14235099 14647340 15037196
59476 15037196 15400536 15733766 16032625 16292328 16510394 16689302 16835517 16955707 17054504
59467 17054504 17135611 17203630 17264199 17323325 17387217 17461845 17551643 17659000 17785336 17931399
59457 17931399 18094998 18268580 18439931 18595059 18719821 18799916 18821550 18773239 18646884 18437592
59447A8437592k93758l75538m50301n14856n67102o05334o28405o36389o30719
59438A3735190o13816n88574n57457n21725m82059m39967l97783l57159l18462
59429I458188k81671k46795k13206j79984j47599j17853r1320o5929l9178j0878
59419H063775J7302M4213O9975R4999J19560J44234J69717J96015K22222K47203
59409I389215K70181K90789L08686L23060L32588L36004L32391L20534K98668
59400A2202116K65691K22172J69306J07748L8975l2925j03054j69272k31887k89586
59390A2179284l38190l74440l98953m14241m21617m21422m14742m03141l87610
59381H604928l69050l48846l27841l05734k82610k60135k39953k21667k03558
$$ plain form
59447 18437592 18143834 17768296 17317995 16803139 16236037 15630703 15002298 14365909 13735190
59438 13735190 13121374 12532800 11975343 11453618 10971559 10531592 10133809 9776650 9458188
59429 9458188 9176517 8929722 8716516 8536532 8388933 8271080 8179760 8113831 8074653 8063775
59419 8063775 8081077 8125290 8195265 8290264 8409824 8554058 8723775 8919790 9142012 9389215
59409 9389215 9659396 9950185 10258871 10581931 10914519 11250523 11582914 11903448 12202116
59400 12202116 12467807 12689979 12859285 12967033 13006008 12973083 12870029 12700757 12468870 12179284
59390 12179284 11841094 11466654 11067701 10653460 10231843 9810421 9395679 8992538 8604928
59381 8604928 8235878 7887032 7559191 7253457 6970847 6710712 6470759 6249092 6045534
59372F045534j84741j65808j47984j32274j18717j05933r2325p8094o5034n3973
59362D900651m3811l3489k3314j3676m246M740J2150J7981K4143L2173M1619N1271
59350D966192N9955O5350O4795N8991N2634M9582M9733N2356N9442P2753R0080
59339E641863J07971J26247J45932J64282J76445J82032J86241J94235K07720
59330G132968K26939K52192K82103L13698L45865L80594M19640M62078N06254
59321A0322331N52075N99889O48754O97130P44164P88944Q29278Q62059Q84169
59312A6928793Q92635Q84972Q60310Q20058P67341P06079O40053N71784N02398
59303B3574423M33242L66894L05286K47451J90843J34425P8598K2209l7939j03974
$$ plain form
59372 6045534 5860793 5694985 5547001 5414727 5296010 5190077 5097752 5019658 4954624 4900651
59362 4900651 4856840 4823351 4800037 4786361 4782115 4786855 4799005 4816986 4841129 4873302 4914921 4966192
59350 4966192 5026147 5091497 5156292 5215283 5267917 5317499 5367232 5419588 5479030 5551783 5641863
59339 5641863 5749834 5876081 6022013 6186295 6362740 6544772 6731013 6925248 7132968
59330 7132968 7359907 7612099 7894202 8207900 8553765 8934359 9353999 9816077 10322331
59321 10322331 10874406 11474295 12123049 12820179 13564343 14353287 15182565 16044624 16928793
59312 16928793 17821428 18706400 19566710 20386768 21154109 21860188 22500241 23072025 23574423
59303 23574423 24007665 24374559 24679845 24927296 25118139 25252564 25331162 25353371 25315432 25211458
59293B5211458j74884k48059l21080l91133m54341n07376n49354n81511o05571
59284B1378149o23084o35845o46051o55721o65651o74739o80740o82097o78733
59275A5435488o70788o57556o38489o14411n86599n55308n20482m83473m46643
59266A0261739m11362l77358l43844l10499k77813k47233k20296j96614j73778
59257G702942j50341j27820j08193r0535p2373n3520l6295k2035r558K793J5480
59246G050545K8296M0999N3205O4963P7206R0384J03094J13699J22678J31540
59236G876609J40048J46623J51066J54398J56122J54280J48495J40625J31908
59227I200174J21822J10396R9476R0774Q4386Q0001P7888P8100Q0211Q4447R1497
$$ plain form
59293 25211458 25036574 24788515 24467435 24076302 23621961 23114585 22565231 21983720 21378149
59284 21378149 20755065 20119220 19473169 18817448 18151797 17477058 16796318 16114221 15435488
59275 15435488 14764700 14107144 13468655 12854244 12267645 11712337 11191855 10708382 10261739
59266 10261739 9850377 9473019 9129175 8818676 8540863 8293630 8073334 7876720 7702942
59257 7702942 7552601 7424781 7316588 7226053 7153680 7100160 7063865 7041830 7032272 7035065 7050545
59246 7050545 7078841 7119840 7173045 7238008 7315214 7405598 7508692 7622391 7745069 7876609
59236 7876609 8016657 8163280 8314346 8468744 8624866 8779146 8927641 9068266 9200174
59227 9200174 9321996 9432392 9531868 9622642 9707028 9787029 9864917 9943017 10023228 10107675 10199172
59216A0199172J00913J11182J21431J31237J38733J41079J37107J27285J10906
59207A1319045Q6048N3129J5933k1838n8639r2819j21295j42344j57322j67727
59197A0712171j72656j71096j64586j55163j42311j24586j03174q1257o0429l9959
59187I496954j9261J053K0369L8568N5029O8588P8681Q5720R0483R3933R7151
59176A0107268J00599J03774J06560J10428J17355J28018J42019J59539J81454
59167A1257014K07905K37819K70061L04190L39699L74894M06824M32248M48611
59158A4279265M54122M46968M24726L84924L26137K48647J54742M8919o3024j76070
59148A6529356k86853l91783m85488n62778o21627o62480o85335o89878o78426
$$ plain form
59216 10199172 10300085 10411267 10532698 10663935 10802668 10943747 11080854 11208139 11319045
59207 11319045 11405093 11458222 11474155 11452317 11393678 11300859 11179564 11037220 10879898 10712171
59197 10712171 10539515 10368419 10203833 10048670 9906359 9781773 9678599 9597342 9536913 9496954
59187 9496954 9477693 9478746 9499115 9537683 9592712 9661300 9739981 9825701 9916184 10010117 10107268
59176 10107268 10207867 10311641 10418201 10528629 10645984 10774002 10916021 11075560 11257014
59167 11257014 11464919 11702738 11972799 12276989 12616688 12991582 13398406 13830654 14279265
59158 14279265 14733387 15180355 15605081 15990005 16316142 16564789 16719531 16768450 16705426 16529356
59148 16529356 16242503 15850720 15365232 14802454 14180827 13518347 12833012 12143134 11464708
59139A1464708o55963o26406n90960n50893n09413m69268m30500l92394l56055
59130F882856l23097k93159k64842k38393k15501j96695j80565j65436j50662
59121D854506j36420j23322j12000j02304r3123q3730p4732o6849n9474n1537
59111C951015m3298l5916k9478k2695j4752o387J257Q021J4581K1368K8173L4616
59099C906505M0689M6701N2846N9022O5099P1079P6817Q2067Q7093R2789R9556
59088D680263J06546J12721J18369J24541J31310J37634J42951J47651J51810
59079E853796J54566J55272J54338J52308J48726J42568J33525J22453J10545
59070G128097R8267Q5304P1735N8909M8236L9394L1177K4441K2312K6230L3647
$$ plain form
59139 11464708 10808745 10182339 9591379 9040486 8531073 8061805 7631305 7238911 6882856
59130 6882856 6559759 6266600 6001758 5763365 5547864 5351169 5170604 5005168 4854506
59121 4854506 4718086 4594764 4482764 4380460 4287337 4203607 4128875 4062026 4002552 3951015
59111 3951015 3907717 3871801 3842323 3819628 3804876 3798489 3799746 3807767 3822348 3843716 3871889 3906505
59099 3906505 3947194 3993895 4046741 4105763 4170862 4241941 4318758 4400825 4487918 4580707 4680263
59088 4680263 4786809 4899530 5017899 5142440 5273750 5411384 5554335 5701986 5853796
59079 5853796 6008362 6163634 6317972 6470280 6619006 6761574 6895099 7017552 7128097
59070 7128097 7226364 7311668 7383403 7442312 7490548 7529942 7561119 7585560 7607872 7634102 7667749
59059G667749M1465N0241O2678P9066R7015J15165J34325J54817J75358J95079
59049H772958K14357K32973K49404K62604K72666K79043K79690K72626K57045
59040A1093366K32681J99516J58356J10328N6088k716o1430j14100j57521j91925
59030A1322643k17848k34886k43729k46798k46067k42293k36696k31028k25520
59021I197778k19427k14208k13213k17158k22653k26676k29880k33964k38287
59012G182312k41147k42371k42546k41187k37475k31698k24591k16335k07137
59003E097825j97535j87467j76552j65612j56008j47190j37394j27155j19128
58994C683784j13551j07295r8844r0820q5579q1627p6976p2767p0524o8497o4296
$$ plain form
59059 7667749 7709214 7759455 7822133 7901199 7998214 8113379 8247704 8402521 8577879 8772958
59049 8772958 8987315 9220288 9469692 9732296 10004962 10284005 10563695 10836321 11093366
59040 11093366 11326047 11525563 11683919 11794247 11850335 11847619 11786189 11672089 11514568 11322643
59030 11322643 11104795 10869909 10626180 10379382 10133315 9891022 9654326 9423298 9197778
59021 9197778 8978351 8764143 8550930 8333772 8111119 7884443 7654563 7420599 7182312
59012 7182312 6941165 6698794 6456248 6215061 5977586 5745888 5521297 5304962 5097825
59003 5097825 4900290 4712823 4536271 4370659 4214651 4067461 3930067 3802912 3683784
58994 3683784 3570233 3462938 3364094 3273274 3187695 3106068 3029092 2956325 2885801 2817304 2753008
58983B753008n9050n5493n3468n0716m6806m2971l9057l3878k8051k3598k1000
58972B298920j9096j7339j5863j3845j0241n754k090K87J967K990L303L755M676
58959B231670M646K809J148J945M052M612L561L386M824N986N889N882O997Q372
58945B295779R188J0119J1979J4310J5960J6011J4088J0888Q408Q280R902J1304
58933B436216J1590J1426J1487J1800J2370J3223J3995J4536J5547J7556J9771
58922B589517K1089K1685K2470K3572K4612K5819K7603K9469L0594L1049L1559
58911B879038L2517L4043L6318L9159M2023M4936M8258N1237N2557N2931N4976
58900C367993N9405O3677O5855O7413P0281P3744P6623Q0173Q5816R1940R6236
$$ plain form
58983 2753008 2693958 2638465 2584997 2534281 2487475 2444504 2405447 2371569 2343518 2319920 2298920
58972 2298920 2279824 2262485 2246622 2232777 2222536 2216782 2214692 2214979 2216946 2219936 2223239 2226994 2231670
58959 2231670 2236316 2239125 2240273 2242218 2246270 2250882 2254443 2257829 2262653 2268639 2274528 2280410 2287407 2295779
58945 2295779 2304967 2315086 2327065 2341375 2357335 2373346 2387434 2398322 2406730 2415010 2424912 2436216
58933 2436216 2447806 2459232 2470719 2482519 2494889 2508112 2522107 2536643 2552190 2569746 2589517
58922 2589517 2610606 2632291 2654761 2678333 2702945 2728764 2756367 2785836 2816430 2847479 2879038
58911 2879038 2911555 2945598 2981916 3021075 3063098 3108034 3156292 3207529 3260086 3313017 3367993
58900 3367993 3427398 3491075 3556930 3624343 3694624 3768368 3844991 3925164 4010980 4102920 4199156
58889D199156R9575J04476J11053J17843J25396J35376J46752J56622J64719J73845
58879E534813J85592J98756K12241K26742K42988K60572K79044K98426L18684
58870G757858L40350L65055L93510M23710M53558M84388N19244N58328N99240
58861A1895241O41296O86213P34332P83402Q31793Q80019R28104R73867J014698
58852A9368965J049069J075351J090717J091703J074420J034334R67649Q73079
58844B7625287P50930O01252M25536K30188K5833j77220l71213n49424p05647
58835B7855522q36026r39288j014697j061846j082869j082783j066833j038571
58827A9732609j000365r54020r01065q44148p87705p35167o85973o37591n90057
$$ plain form
58889 4199156 4298731 4403207 4514260 4632103 4757499 4892875 5039627 5196249 5360968 5534813
58879 5534813 5720405 5919161 6131402 6358144 6601132 6861704 7140748 7439174 7757858
58870 7757858 8098208 8463263 8856773 9280483 9734041 10218429 10737673 11296001 11895241
58861 11895241 12536537 13222750 13957082 14740484 15572277 16452296 17380400 18354267 19368965
58852 19368965 20418034 21493385 22584102 23675805 24750225 25784559 26752208 27625287
58844 27625287 28376217 28977469 29403005 29633193 29659026 29481806 29110593 28561169 27855522
58835 27855522 27019496 26080208 25065511 24003665 22920796 21838013 20771180 19732609
58827 19732609 18732244 17778224 16877159 16033011 15245306 14510139 13824166 13186575 12596518
58818A2596518n46009n06634m70634m37219m07141l80309l55300l31852l11137
58809H850283k92785k74340k54660k35453k18359k02714j87325j72340j58121
58800F854186j44053j29713j15831j03089r1228p9892o9130n8650m7845l6852
58790E977903k6235j5582l925Q391J9968L0544M1334N3136O5659P8648R2011J05005
58778F426857J17045J29061J42285J56204J69683J83472J99286K16821K34440
58769G975154K52468K72973K96263L20487L45002L71284L99897M29332M58709
58760A1121569M89392N23223N60911O02516O47477O94065P40807P88229Q37007
58751A7005196Q84952R28554R66811R99972J024485J033130J020872R87040R30961
$$ plain form
58818 12596518 12050509 11543875 11073241 10636022 10228881 9848572 9493272 9161420 8850283
58809 8850283 8557498 8283158 8028498 7793045 7574686 7371972 7184647 7012307 6854186
58800 6854186 6710133 6580420 6464589 6361500 6270272 6190380 6121250 6062600 6014755 5977903
58790 5977903 5951668 5936086 5932161 5940552 5960520 5991064 6032398 6085534 6151193 6229841 6321852 6426857
58778 6426857 6543902 6672963 6815248 6971452 7141135 7324607 7523893 7740714 7975154
58769 7975154 8227622 8500595 8796858 9117345 9462347 9833631 10233528 10662860 11121569
58760 11121569 11610961 12134184 12695095 13297611 13945088 14639153 15379960 16168189 17005196
58751 17005196 17890148 18818702 19785513 20785485 21809970 22843100 23863972 24851012 25781973
58742B5781973Q49217P38956O00948M38057K54001N5584j46621l42098n23486
58733B7706531o85257q22205r31079j011809j065689j094193j100397j089247
58725A9906655j064995j029913r86249r37192q85126q31140p77027p25380o76968
58716A1992665o30521n85855n44628n07220m71861m37983m07474l81249l57613
58707G668261l35526l16385l00496k84683k66079k46169k28605k14562k02373
58698E273383j90363j77981j65199j52569j41059j30790j20764j10502j00786
58689C983370r2355q5292p9829p5937p2081o6633o0684n6970n5689n4065n0619
58678C233216m6825m3936m1228l8538l7335l7915l8303l7435l6590l6445l5591
$$ plain form
58742 25781973 26631190 27370146 27971094 28409151 28663152 28718736 28572115 28230017 27706531
58733 27706531 27021274 26199069 25267990 24256181 23190492 22096299 20995902 19906655
58725 19906655 18841660 17811747 16825498 15888306 15003180 14172040 13395013 12669633 11992665
58716 11992665 11362144 10776289 10231661 9724441 9252580 8814597 8407123 8025874 7668261
58707 7668261 7332735 7016350 6715854 6431171 6165092 5918923 5690318 5475756 5273383
58698 5273383 5083020 4905039 4739840 4587271 4446212 4315422 4194658 4084156 3983370
58689 3983370 3891015 3805723 3725894 3649957 3577876 3511243 3450559 3393589 3337900 3283835 3233216
58678 3233216 3186391 3142455 3101227 3062689 3025354 2987439 2949136 2911701 2875111 2838666 2803075
58667B803075l3614l2720l4420l7169l9008m0200m1526m2472m2720m3243m4346
58656B371637m4912m4732m5082m5879m5159m2588m0356l9239l7111l3191l0191
58645A923197l0054l0862l0422k9605k9452k8131k4179k0127j9468k1849k4300
58634A634748k5481k5885k5441k3775k1700k0127j8543j6384j4478j3583j2955
58623A416396j1764j0170q045m716j079P51J008K499N867Q011P048N222M660L856
58609A419544J176j668k817l753o078p714o064k582n99n18n55k52n1Q18K830M363
58593A396080M313M585P141J0578J2684J4219J7023K0318K2277K3455K5483K8059
58581A586215L0320L3383L8322M3428M6620M8815N1816N4912N6951N9799O5923
$$ plain form
58667 2803075 2769461 2736741 2702321 2665152 2626144 2585944 2544418 2501946 2459226 2415983 2371637
58656 2371637 2326725 2281993 2236911 2191032 2145873 2103285 2062929 2023690 1986579 1953388 1923197
58645 1923197 1893143 1862281 1831859 1802254 1772802 1744671 1720492 1700365 1680897 1659048 1634748
58634 1634748 1609267 1583382 1557941 1534166 1512466 1492339 1473796 1457412 1442934 1429351 1416396
58623 1416396 1404632 1394462 1386417 1381701 1380622 1381373 1382381 1384880 1390747 1398758 1405806 1411028 1415688 1419544
58609 1419544 1420720 1419052 1416235 1412482 1406404 1398690 1392626 1390044 1389445 1388927 1388372 1388120 1388069 1388887 1391717 1396080
58593 1396080 1400393 1404978 1412119 1422697 1435381 1449600 1466623 1486941 1509218 1532673 1558156 1586215
58581 1586215 1616535 1649918 1688240 1731668 1778288 1827103 1878919 1933831 1990782 2050581 2116504
58570B116504P4110Q1181Q6727R2631R9341J06136J13953J24457J37145J50363
58560C182548J64106J78889J93393K06390K19761K36308K55685K75215K93282
58551E205577L08828L19143L21492L15684L01983K78052K41315J92808J35607
58542G620489P1332J851o7429j30234j84299k29898k65030k86528k95261k95988
58532E939005k92166k84254k72606k58429k42150k24029k05997j89882j74491
58523C795001j57484j39392j22817j08557r5640q4151p4783o6511n8001n0512
58513B837153m6087m3777m0885l7156l4482l3310l2594l2518l3975l6056l7028
58502B429285l7036l7126l6890l5972l6259l9258m2822m4099m4080m5480m7583
$$ plain form
58570 2116504 2190614 2271795 2358522 2451153 2550494 2656630 2770583 2895040 3032185 3182548
58560 3182548 3346654 3525543 3718936 3925326 4145087 4381395 4637080 4912295 5205577
58551 5205577 5514405 5833548 6155040 6470724 6772707 7050759 7292074 7484882 7620489
58542 7620489 7691821 7693672 7626243 7496009 7311710 7081812 6816782 6530254 6234993 5939005
58532 5939005 5646839 5362585 5089979 4831550 4589400 4365371 4159374 3969492 3795001
58523 3795001 3637517 3498125 3375308 3266751 3171111 3086960 3012177 2945666 2887665 2837153
58513 2837153 2791066 2747289 2706404 2669248 2634766 2601456 2568862 2536344 2502369 2466313 2429285
58502 2429285 2392249 2355123 2318233 2282261 2246002 2206744 2163922 2119823 2075743 2030263 1982680
58491A982680m7475m5188m3364m2675m1629m0162l9306l8084l4708l0241k7135
58480A552713k4974k1733j8463j8204k0574k1667j9568j6116j3296j1469j0892
58469A355757j1597j1981j0752r462r902j0320q080m715l871n257n291l111j244
58456A260174o15L81J951K574K576L705N067L861K87k456l252m038n657o879p727
58441A249952r592j1720j1656r547q193q528q739q059p712p890p506p045q085
58428A135680r936j0251q823p402o178m077j977j863l254m122m593n908o813n284
58414A055199k832k511l488k513J8N39j426k720k178j870k588k830k470k841l128
58399A022361j263J709K690J758J825L500N026O656R966J3380J3856J2683J3979
$$ plain form
58491 1982680 1935205 1890017 1846653 1803978 1762349 1722187 1682881 1644797 1610089 1579848 1552713
58480 1552713 1527739 1506006 1487543 1469339 1448765 1427098 1407530 1391414 1378118 1366649 1355757
58469 1355757 1344160 1332179 1321427 1311965 1302063 1291743 1283663 1278948 1275077 1269820 1264529 1261418 1260174
58456 1260174 1259559 1259940 1261891 1264465 1267041 1270746 1275813 1279674 1279961 1277505 1274253 1270215 1264558 1257679 1249952
58441 1249952 1240360 1228640 1216984 1207437 1199244 1190716 1181977 1173918 1166206 1158316 1150810 1143765 1135680
58428 1135680 1125744 1115493 1106670 1099268 1093090 1089013 1087036 1085173 1081919 1077797 1073204 1067296 1060483 1055199
58414 1055199 1052367 1049856 1046368 1043855 1043873 1044412 1042986 1040266 1038088 1036218 1033630 1030800 1028330 1025489 1022361
58399 1022361 1021098 1022807 1025497 1027255 1029080 1032580 1037606 1044262 1054228 1067608 1081464 1094147 1108126
58386A108126J7552J9042J7213J5139J3831J0724N400J031j118l416p012j0153
58374A186359j2096j3985j5293j4239j2028j1769j3039j2564j0204q963r125q019
58362A045035n535m293m283l023p72J98Q84L835O867N567J669J446N588Q514Q235
58347A069932Q767J1579J2882J1369J0823J2711J3527J1920J1373J3441J4980
58336A203304J4388J4015J4479J3300J1040J1707J5172J6238J3362J1026J1422
58325A349453J1028P762M230J553k620p704r221o676m918n514m658j827j823n237
58311A323828n753o76M313M939M613O629Q266P339O939Q825R286O299L843M696
58297A393386N759M679M107N369N104K286J189L302L911Q32j136J151L942M372
$$ plain form
58386 1108126 1125678 1144720 1161933 1177072 1190903 1201627 1207027 1208058 1206940 1203524 1196512 1186359
58374 1186359 1174263 1160278 1144985 1130746 1118718 1106949 1093910 1081346 1071142 1062179 1053054 1045035
58362 1045035 1039500 1035207 1030924 1027901 1027129 1027327 1028211 1032046 1038913 1044480 1046149 1047595 1053183 1061697 1069932
58347 1069932 1078699 1090278 1103160 1114529 1125352 1138063 1151590 1163510 1174883 1188324 1203304
58336 1203304 1217692 1231707 1246186 1259486 1270526 1282233 1297405 1313643 1327005 1338031 1349453
58325 1349453 1360481 1368243 1372473 1374026 1371406 1363702 1354481 1347805 1342887 1337373 1332715 1330888 1329065 1323828
58311 1323828 1318075 1317399 1321712 1326651 1331264 1337893 1346159 1353498 1360437 1369262 1378548 1384847 1388690 1393386
58297 1393386 1399145 1403824 1407931 1413300 1418404 1420690 1421879 1425181 1429092 1429924 1428788 1429939 1433881 1438253
58283A438253N485Q860J0403Q456Q019J1684J4414J2636J0545J1905J3565J2834
58271A567059J3215J6917J9524J8164J7258K0113K2500K0703J8300J8836J9379
58260A771968J7474J6858J9943K2209K0290J8203J9581K1365K0991K1851K5604
58249A996337K7378K4671K2719K4927K6640K4639K3703K7048K9581K7781K6960
58238B282384L1251L5538L5079L4067L6851L9665L8917L8662M2054M4426M2594
58227B701488M1605M4697M6442M3683M2921M8549N4248N4619N4539N8271O0561
58216C251623N7912N7217O3271O9166O9210O9786P6829Q4440Q6857Q9688R7965
58205D073964J05193J06139J08060J17082J26043J28391J31279J41605J52229
$$ plain form
58283 1438253 1443738 1452598 1463001 1471457 1479476 1491160 1505574 1518210 1528755 1540660 1554225 1567059
58271 1567059 1580274 1597191 1616715 1634879 1652137 1672250 1694750 1715453 1733753 1752589 1771968
58260 1771968 1789442 1806300 1826243 1848452 1868742 1886945 1906526 1927891 1948882 1970733 1996337
58249 1996337 2023715 2048386 2071105 2096032 2122672 2147311 2171014 2198062 2227643 2255424 2282384
58238 2282384 2313635 2349173 2384252 2418319 2455170 2494835 2533752 2572414 2614468 2658894 2701488
58227 2701488 2743093 2787790 2834232 2877915 2920836 2969385 3023633 3078252 3132791 3191062 3251623
58216 3251623 3309535 3366752 3430023 3499189 3568399 3638185 3715014 3799454 3886311 3975999 4073964
58205 4073964 4179157 4285296 4393356 4510438 4636481 4764872 4896151 5037756 5189985
58196E189985J56033J60469J73449J87802J94813K00431K12791K26669K35806
58187F938248K47245K67343K87106K97988L08587L28968L52566L70750L90510
58178I789311M19746M50296M74000M99952N36831N74844O05016O38896O88004
58169A4676896P41845P88442Q37470Q99455R62071J012751J064642J133172J207754
58160B3324498J275431J351014J452971J570857J688819J819038J977754K151369
58152C6611751K322693K507693K728830K977189L240984L544789L917887M351957
58144F2203773M834632N392514O052132O795133P608349Q540943R653443J0953270
58136A22034189J2440855J4155907J6092579J8133511K0174135K2262835K4547158
$$ plain form
58196 5189985 5346018 5506487 5679936 5867738 6062551 6262982 6475773 6702442 6938248
58187 6938248 7185493 7452836 7739942 8037930 8346517 8675485 9028051 9398801 9789311
58178 9789311 10209057 10659353 11133353 11633305 12170136 12744980 13349996 13988892 14676896
58169 14676896 15418741 16207183 17044653 17944108 18906179 19918930 20983572 22116744 23324498
58160 23324498 24599929 25950943 27403914 28974771 30663590 32482628 34460382 36611751
58152 36611751 38934444 41442137 44170967 47148156 50389140 53933929 57851816 62203773
58144 62203773 67038405 72430919 78483051 85278184 92886533 101427476 111080919 122034189
58136 122034189 134475044 148630951 164723530 182857041 203031176 225294011 249841169
58129B49841169K7213034L0566865L4795755L9043075M0717587L6525485K5009849
58122D83712819Q222498r346708k3587050l2691381l6983186l7701706l6145513
58115C15479773l3399294l0222207k6998670k3868398k0909175j8179162j5686710
58108A46216157j3427625j1430218r713710q240243o951680n818628m821529l924130
58100H1888394l099081k349320j682012j080991m97128J59643R54944J740748
58092G6035197K056290J403801k58904k366652m163699n234320n614186n530959
58084E6326568n183687m716984m235665l780532l345361k937429k583502k284260
58076B7259148k014929j771490j571719j412366j268518j135093j029273r51688
$$ plain form
58129 249841169 277054203 307621068 342416823 381459898 422177485 458702970 483712819
58122 483712819 491935317 482588609 459001559 426310178 389326992 351625286 315479773
58115 315479773 282080479 251858272 224859602 200991204 180082029 161902867 146216157
58108 146216157 132788532 121358314 111644604 103404361 96452681 90634053 85812524 81888394
58100 81888394 78789313 76439993 74757981 73676990 73179862 73339505 74294449 76035197
58092 76035197 78091487 79495288 79236384 76869732 72706033 67471713 61857527 56326568
58084 56326568 51142881 46425897 42190232 38409700 35064339 32126910 29543408 27259148
58076 27259148 25244219 23472729 21901010 20488644 19220126 18085033 17055760 16104072
58068A6104072q82233q14679p60759p19358o74284o23731n81803n49638n13284
58059I984303m71102m36437m11986l86498l57611l34514l17784k99097k80498
58050F688776k72173k71675k66474k55951k50229k48663k40619k26436k16799
58041D439757k11858k01347j85212j74070j68742j58857j42750j30200j24133
58032B942588j17100j07180j00539r7072q9787p9401p3934p3140o8760o0599n6919
58021B018157n8386n7005n1690m9680n1521m9659m3189l9510l9991l8157l3338
58010A506031l1992l4130l2352k6112k3128k4873k4129j9102j6552j8456j8491
57999A236714j4536j2224j3282j2489q976q654j2400j3499r995q159j0442j1108
$$ plain form
58068 16104072 15221839 14407160 13646401 12927043 12252759 11629028 11047225 10497587 9984303
58059 9984303 9513201 9076764 8664778 8278280 7920669 7586155 7268371 6969274 6688776
58050 6688776 6416603 6144928 5878454 5622503 5372274 5123611 4882992 4656556 4439757
58041 4439757 4227899 4026552 3841340 3667270 3498528 3339671 3196921 3066721 2942588
58032 2942588 2825488 2718308 2617769 2520697 2430910 2351509 2277575 2204435 2135675 2075076 2018157
58021 2018157 1959771 1902766 1851076 1801396 1749875 1700216 1657027 1617517 1577526 1539369 1506031
58010 1506031 1474039 1439909 1407557 1381445 1358317 1333444 1309315 1290213 1273661 1255205 1236714
57999 1236714 1222178 1209954 1196672 1184183 1175207 1166553 1154153 1140654 1130659 1122500 1112058 1100950
57987A100950p593n416p661r593p873n892o063n511l156k653m929n650l192j392
57973A024376j849j260J148J504j057k447j526k142n089o085m165m067p508r921
57959I79912q763p645r085j0274r190q323r343j0156r853j0634j2710j3161j1618
57946H49157j1076j1691j0228o956o170q222q200m584k085l261m271k011R62J872
57932G73236K218L683M748M371M185M702L954J914J455L150L945K617J677K336
57918H18191K565J567J220J747R47j036j248O02J220p17l138n313q539j1505j0899
57903G85664p643o483q318r026p224o569q552r539p480n541o218p377o901o211
57889F82582o544o454n385n160n947n314k942j520j480j1L116M193K009K05J017
$$ plain form
57987 1100950 1093357 1087941 1080280 1070687 1062814 1056922 1050859 1045348 1042192 1039539 1034610 1028960 1025768 1024376
57973 1024376 1022527 1021267 1022415 1023919 1022862 1020415 1018889 1016747 1011658 1005573 1001408 997341 989833 979912
57959 979912 971149 963504 954419 944145 934955 926632 917289 907133 897280 886646 873936 860775 849157
57946 849157 838081 826390 816162 809206 803036 794814 786614 782030 779945 776684 772413 770402 771364 773236
57932 773236 775454 779137 783885 788256 792441 797143 801097 803011 804466 807616 811561 814178 815855 818191
57918 818191 820756 822323 823543 825290 826237 825201 823953 824555 825775 825058 821920 816607 808068 796563 785664
57903 785664 778021 771538 763220 754194 746970 740401 731849 722310 714830 709289 703071 695694 688793 682582
57889 682582 676038 669584 664199 659039 653092 647778 644836 643316 641836 641825 644941 649134 651143 651348 652365
57874F52365J890O74q69j173j636k966l443k966m090o932p897n600l205k819k537
57859F08796j177p91j880j272K466O188P373P577Q176P570N376M599O537Q052
57845F67590O968N797O868P939O054K275n72j650j202P38K629J850j242l278l292
57830F97472l936o011o756n591o108r724j2498j1433r080q594q819p787o670o543
57816E87922n322j657J871K869K841L553L517J412n96l60Q97J734L277N821O667
57801F14446M644K974M114N659M936L665M073M219J614j882l212l269m605o639
57787F30737p304p091p588q229q092q539j0573j2054j0987r172r082r589q378
57774E14059o210n230n252n108n406o737p413o278n298o299p701p632p370q267
$$ plain form
57874 652365 654255 654929 654060 652887 651251 648285 644842 641876 637786 630854 622957 617357 614152 611333 608796
57859 608796 607619 606828 604948 603676 606142 612330 619703 627280 635456 643026 648402 653001 659538 667590
57845 667590 674558 680355 687223 695162 701216 703491 702919 701269 700067 700805 703434 705284 704042 700764 697472
57830 697472 693536 687525 680769 675178 669070 659346 646848 635415 626335 617741 608922 601135 594465 587922
57816 587922 582600 580943 582814 585683 588524 592077 595594 597006 596410 596050 596947 598681 601958 607779 614446
57801 614446 619090 622064 626178 631837 636773 640438 644511 648730 650344 648462 645250 641981 637376 630737
57787 630737 623433 616342 608754 600525 592433 583894 573321 561267 550280 541108 532026 522437 514059
57774 514059 507849 502619 497367 492259 486853 480116 472703 466425 461127 454828 447127 439495 432125 423858
57760D23858q418o246m400n728q092p799n705n110n661m424j618k96j093j820
57746C57448j712j914k200j117P15J088j56j032p62l24J15J561M125O671Q187
57731C70693Q014N803K858J872L456M754L462J050j48m69r83p29R38J764r2k402
57715C99841k132l60j50j400j828j518k213l291k548k24J500K285L321M125L373
57700C98781K249L162N642P091P252Q251J0258J0726Q308M574J489l35q49m31
57686D66168l55j342k074j130O27J674K509M167N438M636K994L102M948O502P359
57671E05223Q523R413Q661P348P983J0418J2100J2320J2947J4791J6274J6234
57659F42235J5469J5116J5552J6978J9167K0918K1633K2716K5399K8237K9097
$$ plain form
57760 423858 415440 409194 404794 399066 390974 383175 377470 372360 366699 362275 360657 360361 359268 357448
57746 357448 355736 353822 351622 350505 351220 352308 352152 351120 350358 350034 350149 351710 355835 362506 370693
57731 370693 378707 384510 387368 389240 392696 397450 400912 401962 401814 401345 400362 399633 400571 402335 402243 399841
57715 399841 397709 397349 397199 395799 393971 392453 390240 386949 384401 384177 385677 387962 391283 395408 398781
57700 398781 401030 404192 409834 416925 424177 432428 442686 453412 461720 466294 467783 467448 466599 466168
57686 466168 465813 464471 462397 461267 461894 463568 466077 470244 475682 480318 483312 486414 491362 497864 505223
57671 505223 513746 523159 531820 539168 547151 557569 569669 581989 594936 609727 626001 642235
57659 642235 657704 672820 688372 705350 724517 745435 767068 789784 815183 843420 872517
57648H72517K8623K9078L0923L3126L5836L9642M3194M4829M5834M8917N4103
57637A306622N9266O4004O9595P5768Q1140Q6504R4137J04001J14051J24081J35737
57626B314906J48922J61977J75397J91396K09388K25879K39584K52863K66979
57617D187291K79523K87684K90628K87118K74251K50607K18435J81027J40038
57608F396602R6305N0693K431n1034j10325j71184k26211k68720k95018l05143
57598E118396l02546k91757k75711k55972k34596k13559j92714j70873j48959
57589C031709j29545j13218r8121q3618p1471o2496n4620m5584l5553k5979j7548
57578B293956j0131l166M532J3828K3689L2204L9365M7070N6245O5935P5469Q5411
$$ plain form
57648 872517 901140 930218 961141 994267 1030103 1069745 1112939 1157768 1203602 1252519 1306622
57637 1306622 1365888 1429892 1499487 1575255 1656395 1742899 1837036 1941037 2055088 2179169 2314906
57626 2314906 2463828 2625805 2801202 2992598 3201986 3427865 3667449 3920312 4187291
57617 4187291 4466814 4754498 5045126 5332244 5606495 5857102 6075537 6256564 6396602
57608 6396602 6492907 6543600 6546031 6494997 6384672 6213488 5987277 5718557 5423539 5118396
57598 5118396 4815850 4524093 4248382 3992410 3757814 3544255 3351541 3180668 3031709
57589 3031709 2902164 2788946 2690825 2607207 2535736 2473240 2418620 2373036 2337483 2311504 2293956
57578 2293956 2283825 2280659 2285191 2299019 2322708 2354912 2394277 2441347 2497592 2563527 2638996 2724407
57566B724407R6027J06847J18077J30487J43586J55850J66903J77430J86870J93442
57556D199926J96456J96190J91325J79107J58415J30155R4478N0661O19n0287
57546E347045r7068j37565j70651j94993k10815k20325k25011k24591k19472k11663
57536C434891k02081j89659j74661j60293j49086j39758j29687j18748j08785
57527B062133j00645r3524q6406p8794p0910o3891n8741n4603m9658m4112m0265
57516A320584l8823l7411l3992k9604k6173k3584k0781j8222j7100j7004j6198
57505A041692j3835j0732q180o696n483l055Q29M082M568L366L829P103J0788
57492A028276J2694J3633J5390J7986K0509K2943K5619K8080K9947L1991L5179
$$ plain form
57566 2724407 2820434 2927281 3045358 3175845 3319431 3475281 3642184 3819614 4006484 4199926
57556 4199926 4396382 4592572 4783897 4963004 5121419 5251574 5346052 5396713 5397332 5347045
57546 5347045 5249977 5112412 4941761 4746768 4535953 4315628 4090617 3866026 3646554 3434891
57536 3434891 3232810 3043151 2868490 2708197 2559111 2419353 2289666 2170918 2062133
57527 2062133 1961488 1867964 1781558 1702764 1631854 1567963 1509222 1454619 1404961 1360849 1320584
57516 1320584 1281761 1244350 1210358 1180754 1154581 1130997 1110216 1091994 1074894 1057890 1041692
57505 1041692 1027857 1017125 1008945 1002249 996766 993711 994540 998622 1003190 1006556 1010385 1017488 1028276
57492 1028276 1040970 1054603 1069993 1087979 1108488 1131431 1157050 1185130 1215077 1247068 1282247
57481A282247L9335M3581M7287N0285N3141N7315O3732P1195P7810Q4089R2415
57470A962432J03100J13401J21297J28045J35761J44572J53365J61375J67594
57461C190942J70246J68265J61873J50626J32526J06337P3512L6825j454l9318
57451D150380p4534j05490j31214j50306j61739j67042j69228j68866j63893j54202
57441B703866j43265j33681j24193j13221j02280r3241q4872p5169o5109n6938
57431A711897n0385m3577l6412k9972k3857j7167j1108p456n006p26N738J1655
57419A503624J5415J8528K3075K9377L6621M3974N0737N6995O4204P3567Q3900
57408B000017R2801R9864J07061J15725J24769J32223J37162J39794J40581J39365
$$ plain form
57481 1282247 1321582 1365163 1412450 1462735 1515876 1573191 1636923 1708118 1785928 1870017 1962432
57470 1962432 2065532 2178933 2300230 2428275 2564036 2708608 2861973 3023348 3190942
57461 3190942 3361188 3529453 3691326 3841952 3974478 4080815 4154327 4191152 4189698 4150380
57451 4150380 4075846 3970356 3839142 3688836 3527097 3360055 3190827 3021961 2858068 2703866
57441 2703866 2560601 2426920 2302727 2189506 2087226 1993985 1909113 1833944 1768835 1711897
57431 1711897 1661512 1617935 1581523 1551551 1527694 1510527 1499419 1491963 1486957 1486231 1491969 1503624
57419 1503624 1519039 1537567 1560642 1590019 1626640 1670614 1721351 1778346 1842550 1916117 2000017
57408 2000017 2092818 2192682 2299743 2415468 2540237 2672460 2809622 2949416 3089997 3229362
57398C229362J34412J22622J01856P3068L9332L205l3851p0082j03081j30861
57388C365982j52263j66656j74319j76828j75875j71984j65292j56948j48340
57379A877477j39420j29449j19022j09567j00930r1397q0695p1239o5424o2623
57369I07711n9905n5309m9637m5093m2696m1315l9239l6173l3122l0549k7854
57358D46819k4844k2502k1481k0859j9390j7275j5773j5542j6168j6794j6566
57347B39625j5110j3118j1745j1018r789p750o180n883n926n522n620p025q286
57334A26653p479n243m040m796o121o510n726m209k678k198l165m321m129k981
57320F3057k652l615m374l695k305j963l566o371q579q768p160D742F10b996l496
$$ plain form
57398 3229362 3363774 3486396 3588252 3661320 3700652 3703857 3670006 3599924 3496843 3365982
57388 3365982 3213719 3047063 2872744 2695916 2520041 2348057 2182765 2025817 1877477
57379 1877477 1738057 1608608 1489586 1380019 1279089 1187692 1106997 1035758 970334 907711
57369 907711 847806 792497 742860 697767 655071 613756 574517 538344 505222 474673 446819
57358 446819 421975 399473 377992 357133 337743 320468 304695 289153 272985 256191 239625
57347 239625 224515 211397 199652 188634 178845 171095 164915 159032 153106 147584 141964 134939 126653
57334 126653 119174 113931 109891 105095 98974 92464 86738 82529 79851 77653 74488 70167 66038 63057
57320 63057 60405 56790 52416 48721 46416 44453 40887 34516 25937 17169 10009 4742 610 -2996 -6492
57305f492m092m877m279j915K34L87m99m35N67J054P89O97Q86R09J422L151M625
57288g868L553N70r66N44a251B158J870k37A799a148k431m11J736B77J962J010
57272C249L25l8m3M40J392K603L717M281M162L766L576L702M195N150N962N387
57256E1826L292J615K232M507O263O654O526O429O102N838O533Q114R372R639
57242A34942R358Q953Q518Q625R901J1612J2210J1507J0890J1160J1720J2099
57230B61495J2688J3580J4250J4810J5985J7414J7813J7308J7832K0213K2580
57219D45968K2867K1413J9888J8943J8209J7649J7448J7266J6702J5846J4603
57208F46802J2135P910K708k182o114q860j0128j0037r392q781q068p250o777
$$ plain form
57305 -6492 -10584 -15461 -19740 -21655 -21421 -21034 -21533 -21968 -21401 -20347 -19558 -18861 -17975 -17066 -15644 -12493 -7868
57288 -7868 -4315 -3745 -4711 -4167 -1251 2158 4028 3791 1799 -1148 -3579 -3990 -2254 277 2239 3249
57272 3249 3574 3536 3493 3933 5325 7928 11645 15926 20088 23854 27430 31132 35327 40477 46439 51826
57256 51826 55118 56733 58965 63472 69735 76389 82915 89344 95446 101284 107817 115931 125303 134942
57242 134942 144300 153253 161771 170396 180297 191909 204119 215626 226516 237676 249396 261495
57230 261495 274183 287763 302013 316823 332808 350222 368035 385343 403175 423388 445968
57219 445968 468835 490248 510136 529079 547288 564937 582385 599651 616353 632199 646802
57208 646802 658937 666847 669555 667373 661259 652399 642271 632234 622842 614061 605993 598743 591966
57195E91966o492n403l436k167k612l308k009J425N202Q108J0484J2957J5663
57182F20378J8797K2804K7706L2814L7234M0241M1455M1133M0015L8418L5736
57171I96731L1374K5887K0800J7504J6559J7505J9118K0404K1734K4308K8271
57160A240195L2325L5618L8843M2599M5849M7193M6891M6365M6191M5745M4465
57149A712279M2377L9752L7184L5686L5703L6372L6584L6327L6060L5324L3123
57138B116771K9507K5843K3752K4264K7237L0682L1710K9383K5959K4087K3664
57127B412859K2826K0964J8850J6721J4385J2616J2082J1361Q563M646K310J492
57115B559675r15o262j2099j6030j8622k0985k2311k1932k1551k3059k5870k8533
$$ plain form
57195 591966 585474 580071 576635 574468 571856 568548 566539 567964 573166 581274 591758 604715 620378
57182 620378 639175 661979 689685 722499 759733 799974 841429 882562 922577 960995 996731
57171 996731 1028105 1053992 1074792 1092296 1108855 1126360 1145478 1165882 1187616 1211924 1240195
57160 1240195 1272520 1308138 1346981 1389580 1435429 1482622 1529513 1575878 1622069 1667814 1712279
57149 1712279 1754656 1794408 1831592 1867278 1902981 1939353 1975937 2012264 2048324 2083648 2116771
57138 2116771 2146278 2172121 2195873 2220137 2247374 2278056 2309766 2339149 2365108 2389195 2412859
57127 2412859 2435685 2456649 2475499 2492220 2506605 2519221 2531303 2542664 2551227 2555873 2558183 2559675
57115 2559675 2558760 2552498 2540399 2524369 2505747 2484762 2462451 2440519 2418968 2395909 2370039 2341506
57103B341506l1322l4943l8096l8709l6702l3538l0127k7104k6040k8106l2198
57092A984621l6403m0586m5738n1825n8340o6096p6254q8276j00909j14347j29313
57081A176534j45040j60559j77089j96444k17699D1536b15719k76858k98416l22381
57071a113374l49762l81324m15438m49710m84453n21927n62828o06830o56143
57062e541789p14741p83954q62116r48430j043751j147883j260056j382254j518284
57053a5203258j669725j836841k023219k234773k474016k740064l034334l361241
57045c4577471l723576m123657m570214n078310n661523o330008p096530p977474
57037g9138763q986960j0135989j1434528j2881107j4445968j6075015j7716833
$$ plain form
57103 2341506 2310184 2275241 2237145 2198436 2161734 2128196 2098069 2070965 2044925 2016819 1984621
57092 1984621 1948218 1907632 1861894 1810069 1751729 1685633 1609379 1521103 1420194 1305847 1176534
57081 1176534 1031494 870935 693846 497402 279703 41536 -215719 -492577 -790993 -1113374
57071 -1113374 -1463136 -1844460 -2259898 -2709608 -3194061 -3715988 -4278816 -4885646 -5541789
57062 -5541789 -6256530 -7040484 -7902600 -8851030 -9894781 -11042664 -12302720 -13684974 -15203258
57053 -15203258 -16872983 -18709824 -20733043 -22967816 -25441832 -28181896 -31216230 -34577471
57045 -34577471 -38301047 -42424704 -46994918 -52073228 -57734751 -64064759 -71161289 -79138763
57037 -79138763 -88125723 -98261712 -109696240 -122577347 -137023315 -153098330 -170815163
57030a70815163j9339380k0915106k2392629k3688013k4724633k5532471k6334773
57023c33742168k7447908k8912676l0118604k9890069k7157365k1694153j4245784
57016e13208727n975135K182588R713550J6326137K1770855K5873215K8631493
57009d14686024L0210724L0851254L0785316L0191599K9180022K7811835K6143025
57002b09512249K4248651K2211910K0108925J8010797J5985208J4084462J2337933
56995h2524363J0760392R359379Q130715P057381O121030N310350M615581M022587
56987b7146948L516886L087403K722354K407440K132265J893415J688028J509376
56979h189781J351532J212853J091615R83339Q85708Q01306P31968d57187A66007
$$ plain form
57030 -170815163 -190154543 -211069649 -233462278 -257150291 -281874924 -307407395 -333742168
57023 -333742168 -361190076 -390102752 -420221356 -450111425 -477268790 -498962943 -513208727
57016 -513208727 -519183862 -517001274 -507287724 -490961587 -469190732 -443317517 -414686024
57009 -414686024 -384475300 -353624046 -322838730 -292647131 -263467109 -235655274 -209512249
57002 -209512249 -185263598 -163051688 -142942763 -124931966 -108946758 -94862296 -82524363
56995 -82524363 -71763971 -62404592 -54273877 -47216496 -41095466 -35785116 -31169535 -27146948
56987 -27146948 -23630062 -20542659 -17820305 -15412865 -13280600 -11387185 -9699157 -8189781
56979 -8189781 -6838249 -5625396 -4533781 -3550442 -2664734 -1863428 -1131460 -457187 166007
56969G42291N31921M87763M43376M00809L60661L21201K82618K47893K18118J91399
56959D228050J67530J48854J35162J23035J11793J04572J01507R7532Q9427P9613
56949E387075P0422O0175M7765L5635K5059J3698R12r948j7371k3775k9322l2219
56937E528106m0872p6687j53909k59222l59261m26959m55434m51190m24242l85286
56927B495044l43712l04005k66531k32014k02101j76593j54355j36784j26437
56918E52512j22193j19157j13578I2239c843q7383q0178p3436o4488n2734m1436
56907d03498l3347k6634j8159q600o62N881J3233K1033K6897L0657L3943L6205
56895c23051L5077L0392K4092J6517O650l873j0862j2457j1065r811r480r146
$$ plain form
56969 742291 1274212 1761975 2205351 2606160 2966821 3288022 3570640 3818533 4036651 4228050
56959 4228050 4395580 4544434 4679596 4802631 4914424 5018996 5120503 5218035 5307462 5387075
56949 5387075 5457497 5517672 5565437 5601072 5626131 5639829 5640741 5630793 5613422 5589647 5560325 5528106
56937 5528106 5487234 5410547 5256638 4997416 4638155 4211196 3755762 3304572 2880330 2495044
56927 2495044 2151332 1847327 1580796 1348782 1146681 970088 815733 678949 552512
56918 552512 430319 311162 197584 92239 -3843 -91226 -171404 -244840 -309328 -362062 -403498
56907 -403498 -436845 -463479 -481638 -490238 -490900 -485019 -471786 -450753 -423856 -393199 -359256 -323051
56895 -323051 -287974 -257582 -233490 -216973 -210323 -214196 -225058 -237515 -248580 -258391 -267871 -277017
56883b77017p525l560K302P637J0677J2700J5818J9617K2442K4746K8160L2348
56871a11655L5680L7979A174L6466K6808J2025k327j3153k1422A1802a8855k9573
56859d8428k6465k3039j9424j6196j4654j4328j3037j0272p750o115l896o64J735
56846b02533K273K483L795N428O135O001N442M304L105L313N251P285P965P540
56832a32213O762N819N154N693P501R554J1410J3669J6329J8043a4623G05J1871
56819A2576Q110N142L896M352O038Q838J2241J4699J5486J6300J9061K2898K5710
56806A75347K7832L1280L5810L9038M0687M3394M8420N3290N4682N1236M2735
56795F43751K9155J2053n050j8931k8105l1892l0223k5056j9574j4938r634k749
$$ plain form
56883 -277017 -284542 -288102 -285800 -278163 -267486 -254786 -238968 -219351 -196909 -172163 -144003 -111655
56871 -111655 -75975 -37996 1174 37640 64448 76473 74146 60993 39571 11802 -18855 -48428
56859 -48428 -74893 -97932 -117356 -133552 -148206 -162534 -175571 -185843 -193593 -199708 -203604 -204268 -202533
56846 -202533 -200260 -197777 -193982 -188554 -182419 -176418 -170976 -166672 -163567 -160254 -155003 -147718 -139753 -132213
56832 -132213 -125451 -119632 -114478 -108785 -101284 -91730 -80320 -66651 -50322 -32279 -14623 705 12576
56819 12576 20686 25828 29724 34076 40114 48952 61193 75892 91378 107678 126739 149637 175347
56806 175347 203179 234459 270269 309307 349994 393388 441808 495098 549780 601016 643751
56795 643751 672906 684959 679909 660978 632873 600981 570758 545702 526128 511190 501556 498807
56783D98807M291J0119J5374K1082K7097L3324M0691M9358N7515O3258O6386O7057
56771I54359O3845N4481L8100J6217p653k9024m4370n2822n5630n4116m9155m2156
56759G92076l4809k7766k0832j4184p930j022P364J5724K1758K5682K9638L4048
56747H19747L7219L8388L7881L3940K3017M835j5524l2075m2480m7389m8056m6034
56735G63469m3027l9367l4353k8723k4593k2081j8613j2752o176o30M313R050
56723E46517J2382J4157J6733K1354K5292K4868J9447J0376j540j4799k5564l0685
56711F18538l1379l1213l1284l0107k7321k4541k2618k0654j8115j5904j4832
56700C50570j4407j3597j1928r650p385n587m179l042k758l819n175n064l500
$$ plain form
56783 498807 503098 513217 528591 549673 576770 610094 650785 700143 757658 820916 887302 954359
56771 954359 1018204 1072685 1110785 1127002 1119349 1090325 1045955 993133 937503 883387 834232 792076
56759 792076 757267 729501 708669 694485 686555 685533 692897 708621 730379 756061 785699 819747
56747 819747 856966 895354 933235 967175 990192 995027 979503 947428 904948 857559 809503 763469
56735 763469 720442 681075 646722 617999 593406 571325 552712 539960 533784 533154 537467 546517
56723 546517 558899 573056 589789 611143 636435 661303 680750 691126 689586 674787 649223 618538
56711 618538 587159 555946 524662 494555 467234 442693 420075 399421 381306 365402 350570
56700 350570 336163 322566 310638 300988 293603 288016 283837 280795 278037 274218 269043 263979 260479
56687B60479k234j959j593r13j411l332m253k465K85J347P04j07r41k522m163
56672B36922m487l667k987k666k029j315j492k459k974k390j329q11j303k321
56658B04692k710j998j561l032n550o355m711k978k978l633l505l259l845m373
56644A54204l776k778k204j261N20J483K74j732k676l145m346n184m011j850q81
56629A22637r24n45l93k051m222l681j30L240M324M339M839N389N270N212O045
56614A49349P075P091O133N479O210P977Q969P637M770K923L119L530K483J170
56600B23915J686L719N305N781N908N923N561N335N763N970N008L855M054N117
56586B92900N337M526L728K954J518N5k24O3p85k619l693l560l532m263n149o026
$$ plain form
56687 260479 258245 256286 254693 253780 252369 249037 244784 242319 242604 243951 244655 244548 243607 241085 236922
56672 236922 232435 228768 225781 223115 221086 219771 218279 215820 212846 210456 209127 208316 207013 204692
56658 204692 201982 199984 198423 195391 189841 183486 178775 175797 172819 169186 165681 162422 158577 154204
56644 154204 150428 147650 145446 144185 144705 146188 146462 144730 142054 138909 134563 129379 125368 123518 122637
56629 122637 121713 121168 120775 118724 114502 110821 110691 113931 118255 122594 127433 132822 138092 143304 149349
56614 149349 156424 163515 169648 175127 181337 189314 198283 205920 210690 213613 216732 220262 222745 223915
56600 223915 225601 229320 234625 240406 246314 252237 257798 263133 268896 274866 279874 283729 287783 292900
56586 292900 298237 302763 306491 309445 310963 311018 310794 310857 310072 307453 303760 300200 296668 292405 287256 281230
56570B81230p258q170p609o033m932m272k793o60M92L12J73O65Q55L21k83r04
56554B41134k076k976j842J104L282L015J325K1j93O53K177L225K873K086K552
56539B56360L728L300Q85j118j120l75l35k60J098L098M157L883K947J758M85
56524B78491k65Q9J244K222K330J779J617K704M418N016M027L283M472O622P635
56509C25684P381P358P949Q196P956Q179R061R916J0795J2306J3917J4366J3689
56496D56753J3049J2657J1755J0497R838R615Q824P576O729N766L362R6j890k105
56482E52522k381l945o005p549q562r143r293r624j0530j0917r782q549r441j1883
56468D34918j3211j2603j1456j0265q311o353o090o776n883l639l157n243o877
$$ plain form
56570 281230 273972 265802 258193 252160 247228 242956 240163 239503 239995 240307 240480 241145 242000 242321 242038 241134
56554 241134 239058 236082 234240 235344 238626 241641 242966 242987 242794 243447 245624 248849 251722 253808 256360
56539 256360 260088 263388 264273 263155 262035 261660 261325 261065 262163 265261 269418 273301 276248 278006 278491
56524 278491 278226 278315 279559 281781 284111 285890 287507 290211 294629 299645 303672 306955 311427 318049 325684
56509 325684 333065 340423 348372 356568 364524 372703 381764 391680 402475 414781 428698 443064 456753
56496 456753 469802 482459 494214 504711 514549 524164 532988 540564 547293 553059 556421 556517 554627 552522
56482 552522 550141 546196 540191 532642 524080 514937 505644 496020 485490 474573 464791 456242 446801 434918
56468 434918 421707 409104 397648 387383 379072 372719 366629 359853 353970 350331 347174 341931 335054
56455C35054o009m269l472k915j973j923l194l734k244m58j96n98j67Q22J566
56440C06290K067J753n06l474l605j0L533L643J557M1r21k561m031l826k617j780
56424B95553q41R65K382K046J103J278J933J674J375K689M752N331M440M157N279
56409C34116O560O928O509N737M967M563M324L617K938M011P171J0217J1056R998
56395D22712Q274O267M481M078M816M588K719J395J915K253P31o53L09J702L05
56380D65892k932m125k237m8J92r96k234k713k016p27p26k780m771m339k245p54
56364D32441j33N49N20j411l712l818k490k904n441p004o002m598m851n614m797
56349C80735k591q09m40j106k083k828k993k451j212M12J397O40j334k428j540
$$ plain form
56455 335054 329045 324776 321304 318389 316416 314493 311299 307565 305321 304863 304667 304069 303902 304724 306290
56440 306290 308357 310110 309604 306130 302525 302515 306048 309691 311248 311289 310368 307807 303776 299950 297333 295553
56424 295553 294712 295677 298059 300105 301208 302486 304419 306093 307468 310157 314909 320240 324680 328837 334116
56409 334116 340676 347604 354113 359850 364817 369380 373704 377321 380259 384270 391441 401658 412714 422712
56395 422712 430986 437253 441734 445812 450628 455216 457935 459330 461245 463498 464229 463576 463885 465587 465892
56380 465892 462960 458835 456598 456550 456742 455746 453512 450799 448783 448056 447330 444550 439779 435440 433195 432441
56364 432441 432308 432857 433377 431966 428254 424436 421946 419042 413601 406597 400595 395997 391146 385532 380735
56349 380735 378144 377335 376895 375789 373706 370878 367885 365434 364222 364634 366031 366671 365337 362909 361369
56334C61369K9P64J064J824K429J949J057P40K50j593l977n089m773m326m333
56319C47384m534n058n952o209m974k918r19J450M415O533O830O919Q553J0410
56305C61930R991P630N740M966M134L389M257O616Q371Q479P940P620P218O549
56291D54830O050N820N580N401N151L977J764J82M87J387J030L6L90K352M657
56276D99094O703Q273Q252O123L813L516M621N265N708P407R798J1148J1693J2931
56262F04345J4474J4801J4476J5317J6859J6970J5759J5488J6620J7208J6378
56251G78695J5459J5339J5527J5874J6575J6552J4548J1815J0799J1298J0859
56240I33340Q828P024O393O219O706R035J2397J4061J3204J1926J1901J2664J3760
$$ plain form
56334 361369 361398 362162 363226 365050 367479 369428 370485 371225 371475 369882 365905 360816 356043 351717 347384
56319 347384 342850 337792 331840 325631 320657 317739 316820 318270 322685 329218 336048 342967 351520 361930
56305 361930 371921 379551 385291 390257 394391 397780 402037 408653 417024 425503 433443 441063 448281 454830
56291 454830 460880 466700 472280 477681 482832 486809 488573 488755 489242 490629 491659 491695 492085 494437 499094
56276 499094 505797 514070 522322 528445 532258 535774 540395 545660 551368 558775 568573 579721 591414 604345
56262 604345 618819 633620 648096 663413 680272 697242 713001 728489 745109 762317 778695
56251 778695 794154 809493 825020 840894 857469 874021 888569 900384 911183 922481 933340
56240 933340 942168 949192 955585 961804 968510 977545 989942 1004003 1017207 1029133 1041034 1053698 1067458
56227A067458J5928J9362K3090K6667L0592L4789L8529M1737M4498M6037M6337
56216A435024M7917N3154O0567O6867P1853P8052Q6114R4341J02445J11956J22705
56205B330995J32681J41878J52805J66619J81881J97374K13064K28212K41958
56196C987467K55842K72095K89139L02440L10227L14560L16349L13267L03498
56187F664884K87724K66308K38165K03689J65349J24304P9702L2531j3170n4326
56177G995160r1153j24391j53085j76140j93454k04729k09869k11015k11304k11131
56167F208889k08585k03755j99409j97051j95730j94960j95382j96148j95073
56158D422796j91934j88334j84455j79320j73931j69914j65365j56760j45046
$$ plain form
56227 1067458 1083386 1102748 1125838 1152505 1183097 1217886 1256415 1298152 1342650 1388687 1435024
56216 1435024 1482941 1536095 1596662 1663529 1735382 1813434 1899548 1993889 2096334 2208290 2330995
56205 2330995 2463676 2605554 2758359 2924978 3106859 3304233 3517297 3745509 3987467
56196 3987467 4243309 4515404 4804543 5106983 5417210 5731770 6048119 6361386 6664884
56187 6664884 6952608 7218916 7457081 7660770 7826119 7950423 8030125 8062656 8049486 7995160
56177 7995160 7904007 7779616 7626531 7450391 7256937 7052208 6842339 6631324 6420020 6208889
56167 6208889 6000304 5796549 5597140 5400089 5204359 5009399 4814017 4617869 4422796
56158 4422796 4230862 4042528 3858073 3678753 3504822 3334908 3169543 3012783 2867737
56149B867737j34975j28060j21328j13482j06659j01059r3608q3802p5390p0116
56139A839258o4909n7677n0878m6745m3640l9879l6859l5701l4692l2524l0360
56128A365394k8680k5983k2393k0305j9691j7321j2490q689p449n569j137K760
56116A198447L370K694L456M969O031P708J0323J1740J1510J2582J6144J9132
56104A308106J9540J9709K1464K2540K1018J8901J8004J6730J4003J2160J2687
56093A504862J3321J2431J1947J3153J4025J3609J4185J6418J7626J7821K1608
56082A671006L0584L9797M5789N2081O2210P3336Q1909Q9987J00348J10585J17609
56071B475241J22939J27679J27393J18422J04976R3765Q5426P7146O9490O4082
$$ plain form
56149 2867737 2732762 2604702 2483374 2369892 2263233 2162174 2068566 1984764 1909374 1839258
56139 1839258 1774349 1716672 1665794 1619049 1575409 1535530 1498671 1462970 1428278 1395754 1365394
56128 1365394 1336714 1310731 1288338 1268033 1248342 1231021 1218531 1209842 1202393 1196824 1195687 1198447
56116 1198447 1201817 1204511 1207967 1212936 1218967 1226675 1236998 1248738 1260248 1272830 1288974 1308106
56104 1308106 1327646 1347355 1368819 1391359 1412377 1431278 1449282 1466012 1480015 1492175 1504862
56093 1504862 1518183 1530614 1542561 1555714 1569739 1583348 1597533 1613951 1631577 1649398 1671006
56082 1671006 1701590 1741387 1787176 1839257 1901467 1974803 2056712 2146699 2247047 2357632 2475241
56071 2475241 2598180 2725859 2853252 2971674 3076650 3170415 3255841 3332987 3402477 3466559
56061C466559N8073M7375L2709J7046M44j7156l1679l9603m3831m9419n6601o3426
56049C320491p1484q2901r4756j02527j06461j08937j08597j02746r2920q2643
56039B366519p2206o0693n0181m2852l6834k9732k3138j9215j6384j2978j1100
56028A991206j2201j3121j1391r845j0900j1365q395n334n652o332l524L85J857
56015A895388L048O923J0752J1349J1557J4593J7396J6726J6187J9682K3694K3864
56003B071159K3270K5957K8543K7068K5853K9985L5107L4750L2020L3479L7005
55992B404196L6737L4818L6918M0704M0290L7808L9168M2570M2758M2438M7498
55981B845903N4778N6717N4569N5151N8081N8375N7981O2322O8820P1284P2155
$$ plain form
56061 3466559 3524632 3572007 3604716 3621762 3622206 3605050 3573371 3533768 3489937 3440518 3383917 3320491
56049 3320491 3249007 3166106 3071350 2968823 2862362 2753425 2644828 2542082 2449162 2366519
56039 2366519 2294313 2233620 2183439 2140587 2103753 2074021 2050883 2031668 2015284 2002306 1991206
56028 1991206 1979005 1965884 1954493 1944648 1933748 1922383 1913988 1908654 1903002 1896670 1893146 1893531 1895388
56015 1895388 1898436 1905359 1916111 1927460 1939017 1953610 1971006 1987732 2003919 2023601 2047295 2071159
56003 2071159 2094429 2120386 2148929 2175997 2201850 2231835 2266942 2301692 2333712 2367191 2404196
55992 2404196 2440933 2475751 2512669 2553373 2593663 2631471 2670639 2713209 2755967 2798405 2845903
55981 2845903 2900681 2957398 3011967 3067118 3125199 3183574 3241555 3303877 3372697 3443981 3516136
55970C516136P7949Q6255R0230R2228R9425J09412J14016J14409J18543J26556
55960D545159J32448J37100J45654J55278J59832J63233J73658J88128J97769
55951E998259K04321K15895K30567K40669K49144K64600K83968K97713L08362
55942H293498L25844L48480L67264L84755M10214M40272M64781M87568N20123
55933A2042799N59236N93258O26096O71235P26015P76488Q23800Q80078R42154
55924A8641159R96634J047525J110687J184493J255379J328517J421735J532992
55916B8519121J646983J769720J920771K095396K273088K460362K684060K945564
55908D6315065L226100L534944L904920M342279M831935N389829O054306O828605
$$ plain form
55970 3516136 3594085 3680340 3770570 3862798 3962223 4071635 4185651 4300060 4418603 4545159
55960 4545159 4677607 4814707 4960361 5115639 5275471 5438704 5612362 5800490 5998259
55951 5998259 6202580 6418475 6649042 6889711 7138855 7403455 7687423 7985136 8293498
55942 8293498 8619342 8967822 9335086 9719841 10130055 10570327 11035108 11522676 12042799
55933 12042799 12602035 13195293 13821389 14492624 15218639 15995127 16818927 17699005 18641159
55924 18641159 19637793 20685318 21796005 22980498 24235877 25564394 26986129 28519121
55916 28519121 30166104 31935824 33856595 35951991 38225079 40685441 43369501 46315065
55908 46315065 49541165 53076109 56981029 61323308 66155243 71545072 77599378 84427983
55900H4427983P694377Q680023R846295J1206022J2734743J4455462J6422525
55893A65467430J8631324K1058584K3782215K6910803L0390669L4051130L7757320
55886C58049475M1043915M2337061L9040401K9245076J3719203m017802j9815477
55879D99601852l1150476l7657744m0201732l9912442l7831086l4816214l1432818
55872B46599340k7965797k4585439k1437488j8596452j6060242j3831749j1938306
55865A12183867j0363831r038253p910629o972671o202924n549733m981928m502050
55857E6661848m097722l729362l377902l059717k783254k531793k298813k100203
55849C2683082j939494j796066j658246j535991j432095j332225j232259j145773
$$ plain form
55900 84427983 92122360 100802383 110648678 121854700 134589443 149044905 165467430
55893 165467430 184098754 205157338 228939553 255850356 286241025 320292155 358049475
55886 358049475 399093390 441430451 480470852 509715928 523435131 519417329 499601852
55879 499601852 468451376 430793632 390591900 350679458 312848372 278032158 246599340
55872 246599340 218633543 194048104 172610616 154014164 137953922 124122173 112183867
55865 112183867 101820036 92781783 84871154 77898483 71695559 66145826 61163898 56661848
55857 56661848 52564126 48834764 45456862 42397145 39613891 37082098 34783285 32683082
55849 32683082 30743588 28947522 27289276 25753285 24321190 22988965 21756706 20610933
55841B0610933j075745j006665r32870q67949q18135p71804p23086o81302o49099
55832A3084278o14710n73967n38070n11854m85261m53568m25821m06032l85279
55823H689716l59484l36706l20415l03242k83188k68479k60714k50402k34721
55814F072365k22675k17354k10091j97697j88588j85930j81279j71081j63393
55805D334277j61962j59351j52113j47260j47174j43357j32128j21676j16434
55796C052822j08976r5101q2964p9125p8510p6098p5895q0125q1643p5742o8603
55785B150040o5949o3528n6765m9722m6676m4066l8371l3313l2097l0835k6288
55774A662430k2074k1105j9959j6500j4939j7713k0447k0345k1383k5963k9773
$$ plain form
55841 20610933 19535188 18528523 17595653 16727704 15909569 15137765 14414679 13733377 13084278
55832 13084278 12469568 11895601 11357531 10845677 10360416 9906848 9481027 9074995 8689716
55823 8689716 8330232 7993526 7673111 7369869 7086681 6818202 6557488 6307086 6072365
55814 6072365 5849690 5632336 5422245 5224548 5035960 4850030 4668751 4497670 4334277
55805 4334277 4172315 4012964 3860851 3713591 3566417 3423060 3290932 3169256 3052822
55796 3052822 2943846 2848745 2765781 2686656 2608146 2532048 2456153 2376028 2294385 2218643 2150040
55785 2150040 2084091 2020563 1963798 1914076 1867400 1823334 1784963 1751650 1719553 1688718 1662430
55774 1662430 1640356 1619251 1599292 1582792 1567853 1550140 1529693 1509348 1487965 1462002 1432229
55763A432229l0164l1116l4569l5562l1593k8165k9017k9400k5314k1119k1303
55752A114907k2394j9991j6716j6401j6985j5636j4576j5618j5140j0483n441
55741I45526l714k894l92J033p93k262n30Q47j542m746n524o500j0356j3800j3471
55726H80882j2255j3599j4998j3283j1079j1633j2281r518n906n457o619o184
55714G58070o080r700j5091j8033j8767j9796k0162j7588j3652j1515j0891r723
55702E87072q238p264n718l580l748p024r215p376m883n805q489r375q924q915
55688D88518q029n357m232p145j0642j0772r752j1401j3709j2340q517o776p159
55675C72687o131l539k440l087k829j305p11j487k196k864m435n885n831n678
$$ plain form
55763 1432229 1402065 1370949 1336380 1300818 1269225 1241060 1212043 1182643 1157329 1136210 1114907
55752 1114907 1092513 1072522 1055806 1039405 1022420 1006784 992208 976590 961450 950967 945526
55741 945526 941812 938918 938526 939559 938766 936504 935974 936821 935279 930533 925009 918509 908153 894353 880882
55726 880882 868627 855028 840030 826747 815668 804035 791754 782236 776330 770873 764254 758070
55714 758070 751990 742290 727199 709166 690399 670603 650441 632853 619201 607686 596795 587072
55702 587072 578834 571570 565852 562272 558524 551500 542285 534909 530026 524221 515732 506357 497433 488518
55688 488518 480489 475132 470900 463755 453113 442341 432589 421188 407479 395139 386622 379846 372687
55675 372687 366556 363017 360577 357490 354661 353356 352645 351158 348962 346098 341663 335778 329947 324269
55661C24269p338r146q093m834k600k285k259j843j338J48L213N574M511J090
55647B99069j175q42R81L465O321Q215P800N538K644n41l439m452l266j789j065
55632C17464K75K663L824K711J988L801O266P067P265Q267Q358N967L408L427
55618C82751M599L962J825K17r42k411k943j732j020k450l593k062k21j250l259
55603C71471k379N07J387j51j045m81l96q81P2K385L741L514L110K706J196r01
55587C83855j939k193l196m628n067n147o691r256j0738j0916j1230j1587j0548
55574B90719q395p078p302q094q889r697r850q848p659p156o385m437k672k740
55560A91517l811m107l688l455l003j958j641k836l683k465o88o08j597j761j358
$$ plain form
55661 324269 316931 307785 299692 294858 292258 289973 287714 285871 284533 284681 287894 293468 297979 299069
55647 299069 297894 297052 298033 301498 307819 316034 323834 329372 332016 331475 328036 323584 320318 318529 317464
55632 317464 317739 320402 324226 326937 328925 332726 338992 346059 353324 361591 369949 375916 379324 382751
55618 382751 387350 391312 393137 393354 392412 390001 387058 385326 384306 381856 378263 376201 375980 374730 371471
55603 371471 369092 369599 370986 370835 369790 369309 368913 368032 368104 370489 374230 377744 380854 383560 384756 383855
55587 383855 381916 379723 376527 371899 366832 361685 354994 345738 335000 324084 312854 301267 290719
55574 290719 282324 275246 267944 259850 250961 241264 231414 222566 214907 207751 201366 196929 194257 191517
55560 191517 187706 183599 179911 176456 173453 171495 169854 167018 163335 160870 160182 159574 157977 156216 154858
55545A54858j673k327k531l070m216l945j210J288Q55j019j629j496k152k172
55531A29561J58K489J399k042m083l963l336j951J193L874K997l6j022O99K102
55516A28039J762O90j031l716n016k409J876L315J896J484K939L306J799J123
55502A36057K196K787K258K702M274M087J150j878l085l602m298m115k854j987
55488A33692j666m86J050N65j786k746r64J094J363R08J169J797K441L639M879
55473A44949M717L583L470M335M096K754K785M683N856N130M635N718O453M998
55459B08162K408N38k39n2R95J454n16l927n769n809p140j0887j3990j3941j2185
55444A39102j0953r899q205p099p772q955q822p604o510n755n165n050n148m321
$$ plain form
55545 154858 153185 150858 148327 145257 141041 137096 135886 137174 138029 137010 135381 133885 131733 129561
55531 129561 129719 132208 133607 131565 127482 123519 120183 118232 119425 123299 126296 126260 125238 125937 128039
55516 128039 129801 130491 129460 125744 120728 118319 120195 123510 125406 126890 129829 133135 134934 136057
55502 136057 138253 141040 143298 146000 150274 154361 155511 153633 150548 146946 142648 138533 135679 133692
55488 133692 132026 131540 132590 133155 131369 128623 127659 128753 130116 131024 132193 133990 136431 140070 144949
55473 144949 149666 153249 156719 161054 165150 167904 170689 175372 181228 186358 190993 196711 203164 208162
55459 208162 210570 211108 210869 210817 211812 213266 212750 208823 203054 197245 190105 179218 165228 151287 139102
55444 139102 128149 118250 110045 102946 95174 86219 77397 69793 63283 57528 52363 47313 42165 37844
55430C7844k415q15l01j45M7l32j025p03N72Q84n47j997j848n25R30K145K566
55413C4335J392q36k429k731k302j072J201K817J684r55j623kM83j682l736l422
55397B1122k364k552k812j384O89J422J111J249J815J674N07j209k874l442j978
55382A0974N70J919J539J190J784K087J395R43J309R60j107l355l867k675q41
55367A2825Q97J702R63j31L80J991K069J87r81o6R24M07k19K39L36r61j778m79
55349A8305J296J525J304K518M101L603J150j005j769j641q91L93J205N63j055
55334B9602k500l266k983j099J652L047K068K78p24j335k101j987l13J453J842
55319B3634J561J655J390L5j083p49l69j717l424k590P38L315K740j66k858l360
$$ plain form
55430 37844 35429 34614 34313 34168 34215 33883 32858 32155 32727 33611 33064 31067 29219 28694 29624 31769 34335
55413 34335 35727 34891 32462 29731 27429 26357 27558 30375 32059 31104 29481 29479 29962 28280 24544 21122
55397 21122 18758 16206 13394 12010 12699 14121 15232 16481 18296 19970 20477 19268 16394 12952 10974
55382 10974 11544 13463 15002 16192 17976 20063 21458 22401 23710 24670 23563 20208 16341 13666 12825
55367 12825 13722 15424 16387 16256 16636 18627 20696 20883 19902 19836 20760 21167 20948 21187 21523 20562 18784 18305
55349 18305 19601 21126 22430 24948 29049 32652 33802 32797 31028 29387 28496 28889 30094 30657 29602
55334 29602 27102 23836 20853 19754 21406 24453 26521 26799 26075 24740 22639 20652 20339 21792 23634
55319 23634 25195 26850 28240 28275 27192 26443 26074 24357 20933 18343 19081 22396 25136 24970 22112 18752
55303A8752j379J463K708J446p31j870j810j459j049l13N92J372J983J975O20
55288B2300j559k662j752p0Q96J106R01j09j881l041k411n01J217J607K14k124
55272A2131k940n21L067L740Q24k004j987n43M2M2N20Q68M61L87J370J960R51
55255A8368m05p30q57j699j925l06J523J276n04j655j648j387j015k55K80N4k74
55238H841l27r13j861j076K070M643M002J749J040J750J468k05j596k152k501
55223A4932k106O0K837L694K203M60J60J092K267K764K014N48j35L50N68k69q61
55206C0578k91J27n58p21J067L027K709P86m34o98j138j564j481k196m663o620
55190A7930n289j834K90L93M64J055J059Q97K074L745L448J240m09q81j967l892
$$ plain form
55303 18752 17373 18836 21544 22990 22259 20389 18579 17120 16071 15758 16350 17722 19705 21680 22300
55288 22300 20741 18079 16327 16257 17153 18259 19160 19051 17170 14129 11718 11217 12434 14041 14255 12131
55272 12131 9191 8670 11737 15477 16301 14297 12310 11767 11809 11851 12371 13239 13700 14087 15457 17417 18368
55255 18368 17963 17233 16376 14677 12752 12446 13969 15245 14741 13086 11438 10051 9036 8781 9061 9115 8841
55238 8841 8514 7601 5740 4664 6734 11377 15379 17128 18168 19918 21386 21181 19585 17433 14932
55223 14932 12826 12886 15723 19417 21620 22080 22240 23332 25599 28363 30377 30925 30790 31140 31708 31439 30578
55206 30578 30287 30414 29856 29135 30202 33229 35938 36724 36290 35592 34454 32890 31409 29213 24550 17930
55190 17930 12641 10807 11097 11490 11954 13009 14068 14965 17039 20784 24232 25472 25063 24182 22215 18323
55174A8323m383k426J92J861K774L017J935K06j65J182K301J829L04j683m050
55159B1217n651m730j734Q35J921K768L772L373J097r22r77j11m9o61r40q14n76
55142A7818J96J773L306L803L385K830K350J414n57l284n136m241r18K008K438
55127B7185J489J251J364Q2k217l234k195n33P49J988L053L021J938Q82J03q62
55111C4064j393l82J286J365m29j923j771r09l48J97Q29Q06J21j24M28P64K99
55094C2880l18o04q17r54p29o41j333k008j286M67J654K021K486K644J119j513
55078C3068k822k006q05m94m48k03l57p30j15J355J906Q92l42r79j655k326j878
55061B2061n96l62j343j232J037L439M043L580L378L201K747K846L637L658K409
$$ plain form
55174 18323 13940 11514 11706 13567 16341 19358 21293 21499 21334 22516 24817 26646 26950 25267 21217
55159 21217 15566 10836 9102 9937 11858 14626 18398 21771 22868 21946 20969 20858 20809 20148 19208 18394 17818
55142 17818 18014 19787 23093 26896 30281 33111 35461 36875 36318 33034 27898 23657 22739 24747 27185
55127 27185 28674 29925 31289 31371 29154 25920 23725 23192 23941 25929 28982 32003 33941 34823 34926 34064
55111 34064 32671 32289 33575 34940 34511 32588 30817 29908 29560 29757 30586 31392 31513 31389 31817 32581 32880
55094 32880 32562 31958 31141 30187 29458 28817 27484 25476 24190 24657 26311 28332 30818 33462 34581 33068
55078 33068 30246 28240 27435 26941 26493 26290 25933 25203 25088 26443 28349 29241 28899 27920 26265 23939 22061
55061 22061 21465 21103 19760 18528 19565 23004 27047 30627 34005 37206 39953 42799 46436 50094 52503
55046E2503J563K030K090L62j607j816q75m09k91J94R3j661l621l311p04J914
55030D6454L066L244L300L454L603L431K481R92L2O7K81J70M59J558K250J369
55014G6211k71r24p1J425K438K026j09k709l711k828j955k132j920j64J481Q28
54998F7615j431k710k046n54Q10J914K290J351l39j537j988k299k456j897q40
54983E5883j24J92Q36J860K351J715L65r66j907k369k450k363k054r91J098L472
54967E4548M771M159J950n45j774j111M45J270R24L69L81O45O68O36R79J725K611
54950G2651L158K610P95r45p71J345L343L415J673o73k538l220k675j893j870
54935G4405k074j320o8k6j197j499l3J373J059j6j43M71N44l1m32n01n43l18M35
$$ plain form
55046 52503 54066 56096 58186 58548 56941 55125 54250 53841 53550 53744 53837 52176 48555 45244 44540 46454
55030 46454 49520 52764 56064 59518 63121 66552 69033 70025 70057 70124 70405 70575 71034 72592 74842 76211
55014 76211 75940 75016 74945 76370 78808 80834 80725 78016 74305 71477 69522 67390 65470 65306 66787 67615
54998 67615 66184 63474 61428 60874 61684 63598 65888 67239 66900 65363 63375 61076 58620 56723 55883
54983 55883 55759 55951 56787 58647 60998 62713 63078 62112 60205 57836 55386 53023 50969 49978 51076 54548
54967 54548 59319 63478 65428 64883 63109 61998 62443 63713 64637 65006 65387 66032 66700 67336 68315 70040 72651
54950 72651 75809 78419 79214 78269 77498 78843 82186 85601 87274 86601 84063 80843 78168 76275 74405
54935 74405 72331 71011 70943 70917 69720 68221 68188 69561 70620 70604 70461 70932 71476 71445 71013 70512 69969 69651 70086
54916G0086J127J099O85N27N38M94Q17J798K703K654J894J423J852L190N005O285
54900A02177N946M102K225J614K367L911N477N990M878L372L627O103R171J1542
54886A72502J3423J4963J5442J4759J3964J3513J2711J1371J0099Q328M442j124
54874C04393n375o789p469r710j2728j4750j6003j7247j7337j4972j1520r398
54862A61095q655p497n395l291j550J00J154R11Q7K1Q47J971L566N753P227O698
54846A63042N175M833O105P709R036J0618J2504J3970J4734J5010J4492J2564
54834B89792R191M648j019p187j2130j4638j5363j5504j5186j4335j3691j3422
54822A81156j2142r203o614o495p818p956o513n203m660l924k686j665r46o3M74
$$ plain form
54916 70086 71213 72312 72997 73524 74062 74556 75373 77171 79874 82528 84422 85845 87697 90887 95892 102177
54900 102177 108123 112225 114450 116064 118431 122342 127819 133809 138687 142059 145686 151789 160960 172502
54886 172502 185925 200888 216330 231089 245053 258566 271277 282648 292747 301075 305517 304393
54874 304393 299018 292229 284760 275050 262322 247572 231569 214322 196985 182013 170493 161095
54862 161095 152440 144943 139548 136257 134707 134807 135961 136872 136959 136980 137827 139798 143364 149117 156344 163042
54846 163042 168217 173050 179155 186864 195900 206518 219022 232992 247726 262736 277228 289792
54834 289792 298983 303631 302612 295425 283295 268657 253294 237790 222604 208269 194578 181156
54822 181156 169014 159811 153197 146702 138884 130928 124415 119212 114552 110628 107942 106277 105331 105268 105742
54807A05742j91j412j796j406j340j523j018m1M27N34R42Q55q83l094l230j040
54791I1526J177J909J709J149J9j239j715j882k912m019l148o43O09n45j795j097
54775G9103M01N47o95j867k128j480k13Q59P76j07l93J29J47o75p21J064L342
54758G8089M283L838K969K055J205R34J293J328N44m5O43K176L483M358N098N536
54742A17787N488N457N866O214N942N570O083P546R149J0384J1445J2689J4187
54729B23807J5688J6765J7066J6617J5598J3933J1436Q202M440K25m008p190q767
54716C23812r746j1468j3550j4241j2808j0403q413p131o192n304m241l032k225
54703B15058k168k240j729j209j658k457j754R44M037N961O777P282P854Q685
$$ plain form
54807 105742 105551 104139 102343 100937 99597 98074 97056 97015 97442 97976 98918 99773 98890 95796 92566 91526
54791 91526 92703 94612 96321 97470 97489 96250 94535 92653 89741 85722 82574 81931 82540 81995 80200 79103
54775 79103 79504 80051 79356 77489 75361 73881 73668 74527 75303 75196 74803 74932 75079 74404 73683 74747 78089
54758 78089 82372 86210 89179 91234 92439 93373 94666 95994 96538 96493 97136 99312 102795 107153 112251 117787
54742 117787 123275 128732 134598 140812 146754 152324 158407 165953 175102 185486 196931 209620 223807
54729 223807 239495 256260 273326 289943 305541 319474 330910 339112 343552 343777 339769 332579 323812
54716 323812 314066 302598 289048 274807 261999 251596 243183 236052 229860 224556 220315 217283 215058
54703 215058 212890 210650 208921 207712 206054 203597 201843 202787 206824 212785 219562 226844 234698 243383
54689B43383R988J1613J3133J4486J5662J5990J4948J3414J2665J2253J0536P245
54677C95316L767O75l023p707j2082j5046j6917j8064j7934j6328j4244j2568
54665B65845j1211j0178r985j0367j0099q939q233q689r110q313o833n569m216
54652A54103k314n29L18M26J49p91k165k763k203j783k166j857L12K675K894J488
54636A45794Q53J564K008J421Q96J245J882K187K270K116J380M37K18P08R98J016
54620A66993J687K964L337K152R30J345K905L934L926L664L589L389K997K767
54606B06579K719K704L308N277P789Q682P150N088M691N668O082N273M299L753
54592B79062K904J278m46j657k508k827j849J48J420J074M63R74J739J217n2k47
$$ plain form
54689 243383 253371 264984 278117 292603 308265 324255 339203 352617 365282 377535 388071 395316
54677 395316 399083 399758 396735 389028 376946 361900 344983 326919 308985 292657 278413 265845
54665 265845 254634 244456 234471 224104 214005 205066 196833 188144 179034 170721 163888 158319 154103
54652 154103 151789 151260 151578 152004 152153 151362 149197 146434 144231 142448 140282 138425 138737 141412 144306 145794
54636 145794 146647 148211 150219 151640 152536 153781 155663 157850 160120 162236 163616 164053 164271 164979 165977 166993
54620 166993 168680 171644 174981 177133 178063 179408 182313 186247 190173 193837 197426 200815 203812 206579
54606 206579 209298 212002 215310 220587 228376 237058 244208 249296 253987 259655 265737 271010 275309 279062
54592 279062 281966 283244 282798 281141 278633 275806 273957 274105 275525 276599 277062 278036 279775 280992 280940 280693
54576B80693R82K369L193L611L444K578K350M222P112Q179O580M282K774J266
54562C33635j094l408m783o018q060j0081j0583r473p855o559n863n855o070n472
54548B42461l712j726m15M81J533K561L294M029M706M225J942q61k342k507l007
54533B50662m629o227o398n385m749n540p159q174q026p533p502p443o393m624
54519A60880l494l644m397m989n252m896l348r72O02K95r36j210m1J152Q09r28
54503A29631k304j979o38j1l61j95J058J732N65r01n67P83P37p77j600j170j184
54486A22819k142k326j126l60r77j258kR77k05k294k883j943r95k23J138K632
54470A10832L222L394M337N568N578M493M035M906O103O736O772N966L838R82
$$ plain form
54576 280693 281675 284044 287237 290848 294292 296870 299220 303442 310554 318733 325313 329595 332369 333635
54562 333635 332541 329133 324350 318332 310272 300191 289608 280135 272280 265721 259858 254003 247933 242461
54548 242461 238749 237023 236608 237089 238622 241183 244477 248506 253212 257437 259379 258518 256176 253669 250662
54533 250662 246033 239806 233408 228023 223274 217734 210575 202401 194375 186842 179340 171897 165504 160880
54519 160880 157386 153742 149345 144356 139104 134208 130860 129888 130490 130785 129849 128639 128598 129750 130559 129631
54503 129631 127327 125348 124710 124699 124338 124143 125201 126933 127498 126597 126030 126813 127550 126773 125173 124003 122819
54486 122819 120677 118351 117225 116865 115888 114630 114628 115605 115400 113106 110223 108280 107285 107062 108200 110832
54470 110832 114054 117448 121785 127353 132931 137424 141459 146365 152468 159204 165976 171942 175780 176762
54456A76762j157k166k937l798l784k399q34o02j665k709k915k761l173m264n171
54441A36427n055m042k895k069j562j421j657j710r90l5N2m92K1K206M223L971
54425A24972J843J92N04K037L011K428P79o01r64q66j115j387p85M79J319J617
54409A33463K315L378L384J782Jm63K95J473K538K594N73k721m392k839L8J320
54393A42739O05m52q20p09m12j43m23j415k485l230l916m137k724j08R67j080
54377A22257m016m638k923j200m06K93R81O94m51j114p71j44L59R35J285Q72J21
54360A12134p9K13N56J464L411N025M377J906J02K36J212J739J787J670J350J113
54344A38216J562K648L723M552N174N210M606M529N872P353P103N879O366R003
$$ plain form
54456 176762 175605 173439 170502 166704 162920 160521 159687 159085 157420 154711 151796 149035 145862 141598 136427
54441 136427 131372 127330 124435 122366 120804 119383 117726 116016 115026 114991 115043 114551 114572 116778 121001 124972
54425 124972 126815 127007 127511 129548 132559 134987 135766 135165 134201 133335 132220 130833 130048 130527 131846 133463
54409 133463 135778 139156 142540 144322 144323 143860 144155 145628 148166 150760 151333 148612 144220 141381 141419 142739
54393 142739 143344 142892 142072 141363 140951 140808 140385 138970 136485 133255 129339 125202 122478 122370 123337 122257
54377 122257 118241 113603 110680 109480 109074 109367 110348 111042 110591 109477 108706 108562 108921 109856 111141 112013 112134
54360 112134 112055 112268 112824 114288 117699 122724 127101 129007 129109 129345 130557 132296 134083 135753 137103 138216
54344 138216 139778 142426 146149 150701 155875 161085 165691 170220 176092 183445 190548 196427 202793 211796
54330B11796J0928R793O698M324L765M287M889M829L501Q56k232m661n987o461
54316B46325o528o430o061n420n147n919o949o361l859j687j750l146m074m662
54302A78332n783o403m878k110o03o90o01k6m05j396n45K518M658L606J092j21
54286A66645J51P84J927L979N662N737N466O913R423J0209Q354O004N282N758
54272B42294N658M301K478J146M97J18m64j429k568l400l519l161l330m848p053
54257B26720q164p423o173o102p148q084q470q717q679p720o060m763m279m158
54243A30780m131m233m025k968j619j045j098o85K44M61n17j796k723l519l885
54228I9241k758k96J418P99j138k084j053R78K351K033K72j484j896j108k95K7
$$ plain form
54330 211796 222724 232517 239215 243539 247304 251591 256480 261309 264810 265666 263434 258773 252786 246325
54316 246325 239797 233367 227306 221886 216739 210820 203871 197510 193651 191964 190214 187068 182994 178332
54302 178332 172549 166146 161268 159158 158555 157865 157264 157238 156833 155437 154892 157410 162068 165674 166766 166645
54286 166645 166796 167580 169507 173486 179148 184885 190351 197264 206687 216896 225250 231254 236536 242294
54272 242294 247952 252253 254731 255877 256374 256492 256028 254599 252031 248631 245112 241951 238621 233773 226720
54257 226720 218556 211133 204960 198858 191710 183626 175156 166439 157760 150040 143980 139217 134938 130780
54243 130780 126649 122416 118391 115423 113804 112759 111661 110976 111220 111681 111164 109368 106645 103126 99241
54228 99241 96483 96187 97605 98404 97266 95182 94129 95107 97458 99491 99763 98279 96383 95275 94980 95007
54212I5007K68N06L27m8J93Q62P19n97j788j654n47N07J071J181J004J148K237
54195A00396L691L899K124n44k473k850j585R42L526M590L604J524l89j560k000
54180A12895k094k379k735k172l90J154J118M09P40J827K230K196K921L399J383
54165A20502k332m076k604p85p02o56R21K012L72k206k289K38K634L426L224K352
54149A20031N98j131j369l23L99J52l09m43m18l06j72n49j558k170j578o59p26
54132A09469j618k378k961l595l346j196J846L476K810J023l58n94K88J275P70
54117A04911j360k833j639R96K032M82j938l473l756k793p32J192J392R1p39K3
54101I1856J415J991J373m7j647k481j790k7J366J475N14r19k236k694j857k78
$$ plain form
54212 95007 95275 95781 96108 96060 96253 97115 97834 97237 95449 93795 93248 93755 94826 96007 97011 98159 100396
54195 100396 104087 107986 110110 109566 107093 104243 102658 103600 107126 111716 115320 116844 116455 114895 112895
54180 112895 110801 108422 105687 103515 103125 104279 105397 105806 106546 108373 110603 112799 115720 119119 120502
54165 120502 118170 114094 111490 110705 110003 109347 110268 112280 112652 110446 108157 108395 111029 114455 117679 120031
54149 120031 120629 119498 118129 117806 118205 118357 118048 117605 117187 116881 116709 116160 114602 112432 110854 110195 109469
54132 109469 107851 105473 102512 98917 95571 94375 96221 99697 102507 103530 103172 102578 102866 104141 104911
54117 104911 103551 100718 99079 100075 102107 102589 100651 97178 93422 90629 89897 91089 92481 92572 91833 91856
54101 91856 93271 95262 96635 96588 94941 92460 90670 90643 92009 93484 93998 93079 90843 88149 86292 86014
54085H6014J061J876K399K502J890Q02m40k004l564l576j216J606K156O10k55
54070H9861P97J836R97q04j545r75l57m03p54r58r10n68N7P60J348J639J210k13
54052I1018j978k864k514j757j217m96P36J726J516L24p55j064q07l50J69O68
54036H2355J053J367J610J490P66o0M7J406K867K875J260n09j083o51j41K94J094
54019I6040J930J726L01j017r63J82J109R42j57j296j478m58P42Q85J36j08Q01
54002I9317J959K413K354K235J814Q31k47q43q68j93J411L199L566K112N32N03
53986A20095J705K952M049N197N669M700L058K294K850L997N039N506M942L763
53972A75816L527N038O914P346O524N896N917O114O489P092O962N405L803M138
$$ plain form
54085 86014 87075 88951 91350 93852 95742 96544 96104 94100 90536 86960 85744 87350 89506 90116 89861
54070 89861 90658 92494 93491 92687 91142 90167 89810 89407 88653 87695 86785 86217 86274 87034 88382 90021 91231 91018
54052 91018 89040 86176 83662 81905 80688 80192 80928 82654 84170 84494 83739 82675 81868 81518 81687 82355
54036 82355 83408 84775 86385 87875 88641 88581 88628 90034 92901 95776 97036 96527 95444 94793 94652 94946 96040
54019 96040 97970 99696 99997 98980 98017 98199 99308 100250 100093 98797 97319 96861 97603 98488 98624 98516 99317
54002 99317 101276 103689 106043 108278 110092 110923 110676 109833 108965 108772 110183 113382 116948 119060 119592 120095
53986 120095 121800 124752 128801 133998 139667 144367 147425 149719 152569 156566 161605 167111 172053 175816
53972 175816 179343 184381 191295 198641 205165 211061 216978 223092 229581 236673 243635 249040 252843 256981
53958B56981N989P128O756O109N829N011L282J790J482J846J972J605Q06k28q41
53943C05517n14J96N19R39K214L292K286l68j839o22J495J950L13k162m291n395
53927C03530n175m233l876m718o086p137p666p718p265o571n964n248m236l583
53913B24054l860m123l027j136k59n08j49J378K495K133J203M79o94k407l007
53898B12572j544L24P44N40J775M399O356O433N337M133L189K640K699L195L671
53883B56463L987M500N572P132Q548Q948Q069O697N820N541N633O559Q541R928
53869C51938Q376M080M6j505j357j324j778k230k666l031k639j345k24R8N03J630
53853C48572K408J800Q52J313L096M802N977P042P612O737M720L031K388K236
$$ plain form
53958 256981 262970 270098 276854 282963 288792 293803 297085 298875 300357 302203 304175 305780 306586 306358 305517
53943 305517 305003 305199 305718 306657 308871 312163 314449 314081 312242 311620 313115 315065 315378 313216 308925 303530
53927 303530 298355 294122 290246 285528 279442 272305 264639 256921 249656 243085 237121 231873 227637 224054
53913 224054 220194 216071 213044 211908 211649 211141 210992 212370 214865 216998 218201 218680 217986 215579 212572
53898 212572 211028 211352 212096 212636 214411 218810 225166 231599 236936 241069 244258 246898 249597 252792 256463
53883 256463 260450 264950 270522 277654 286202 295150 303219 309916 315736 321277 326910 333469 342010 351938
53869 351938 360314 364394 364440 362935 361578 360254 358476 356246 353580 350549 347910 346565 346341 346439 346942 348572
53853 348572 350980 352780 353632 354945 358041 362843 368820 375862 383474 390211 394931 397962 400350 402586
53839D02586K209K635L294L011J121j387k855k757k152k333l299l906l612l499
53825C89056m756o689p499o925o573p363q363q678q771q955q364o704n421n548
53811B88447n805m683l226l505n201o033n267m502m879n539n404m808m627m893
53797B20075m985m516l675l088l302l949l778k260o17l72j325k072k122k155k494
53782A79365k659k449k221k002j541j229j776k771k785j254P93K122K439J864
53768A65896L33j867l741m337l502j685M87K269L071K931K388J854J415J129J040
53753A67681Q92M58rj19J47P27J919L700N038M794L309K061J833K069K137K239
53737A98876K895M136N492O227N686M077K806L263N198O882O960N611L967K984
$$ plain form
53839 402586 404795 407430 410724 413735 414856 413469 410614 407857 405705 403372 400073 396167 392555 389056
53825 389056 384300 377611 370112 363187 356614 349251 340888 332210 323439 314484 306120 299416 293995 288447
53811 288447 282642 277959 274733 271228 266027 259994 254727 250225 245346 239807 234403 229595 224968 220075
53797 220075 215090 210574 206899 203811 200509 196560 192782 190522 189905 189533 188208 186136 184014 181859 179365
53782 179365 176706 174257 172036 170034 168493 167264 165488 162717 159932 158678 159471 161593 164032 165896
53768 165896 166229 164362 160621 156284 152782 151097 151584 153853 156924 159855 162243 164097 165512 166641 167681
53753 167681 168573 169031 169022 168903 169050 169777 171696 175396 180434 185228 188537 190598 192431 194500 196637 198876
53737 198876 201771 205907 211399 217626 223312 227389 230195 233458 238656 245538 252498 258109 262076 265060
53723B65060K829K778J884J91j048q84J47J062J886K952L500K475M32j086j912
53708B80266l257n190n913m297j720m40j223l234n278o342n781l842j611MP77
53693B32919O18n76k213l099k713j672o62K57R89J085M60l27r25j466j711j038
53677B19926L86J497J832K041K502K694K486K632L325L714L671M413O276P507
53663B64902O834N714O027O853N852L165J395J828K935K970K005Q07n96k316l813
53648C04562m519m484m062l595l523l824l391j233J585K642J250n61p72L25J343
53633B81743J916K309K090P37q89j255j49J289K435L819N652O815O148M104K404
53618C19168K180K928L383L083K750L177M119M604M202L562L625M665O084O855
$$ plain form
53723 265060 267889 270667 272551 272742 271694 270810 270957 272019 273905 276857 280357 282832 283264 282178 280266
53708 280266 277009 271819 265906 261609 259889 259449 258226 254992 249714 243372 237591 233749 232138 232142 232919
53693 232919 233537 232961 230748 227649 224936 223264 222602 222859 223848 224933 225393 225066 224141 222675 220964 219926
53677 219926 220312 221809 223641 225682 228184 230878 233364 235996 239321 243035 246706 251119 257395 264902
53663 264902 271736 277450 283477 290330 296182 299347 300742 302570 305505 308475 310480 311287 310691 308375 304562
53648 304562 300043 295559 291497 287902 284379 280555 277164 275931 277516 280158 281408 280847 280075 280400 281743
53633 281743 283659 285968 288058 288795 287906 286651 286502 287791 290226 294045 299697 306512 312660 316764 319168
53618 319168 321348 324276 327659 330742 333492 336669 340788 345392 349594 353156 356781 361446 367530 374385
53604C74385O211M324K325J172N19o73k405l514l464l226l819m818n223m998m780
53589C52016m613m124l665m055n171n859n385m172k944j990j485j678k352k743
53575C01780k363j493o38n7P3l78j071j214m21Q86K030K612K438J593P51Q39K007
53558C07374L474M610N495O121N856M383K569J698K023K688K915K818L119M278
53544C59421N890O949O964O620O820P328P265O750O748P091O224L655J272J170
53530D40167L159N486O886O836N059K324P25J365K533K035N29L74J697K227J086
53515D82488J26P80J995K290J758Q71p56k908l863k579n07M08L53N74R52P02O11
53498D83295K165M678N519L632J108N53K322M911O910P752P486O629N896N568
$$ plain form
53604 374385 380596 384920 387245 388417 388936 388263 385858 382344 378880 375654 371835 367017 361794 356796 352016
53589 352016 347403 343279 339614 335559 330388 324529 319144 314972 312028 310038 308553 306875 304523 301780
53575 301780 299417 297924 297286 297229 297302 296924 295853 294639 294218 295104 297134 299746 302184 303777 304528 305367 307374
53558 307374 310848 315458 320953 327074 332930 337313 339882 341580 343603 346291 349206 352024 355143 359421
53544 359421 365311 372260 379224 385844 392664 399992 407257 414007 420755 427846 434070 437725 438997 440167
53530 440167 443326 448812 455698 462534 467593 469917 470642 472007 474540 476575 477104 477478 479175 481402 482488
53515 482488 482614 483394 485389 487679 489437 490308 489552 486644 482781 480202 479695 480103 480456 481030 481982 482684 483295
53498 483295 485460 490138 495657 499289 500397 500950 503272 508183 515093 522845 530331 536960 542856 548424
53484E48424N424N476O156P565R089J0213J1134J2203J3216J3768J4016J4484
53472F71168J5186J5453J4800J3690J3207J3948J5507J7066J8312J9455K0458
53461H48250K0814K0327J9655J9652K0408K1377K2187K2829K3177K2986K2555
53450A084217K2754K4064K5890K7200K7642K7742K8038K8565K9196L0060L1258
53439A386626L2617L4110L6271L9474M2858M4834M4867M3948M3032M1972M0608
53428A831217L9803M0229M0943M0699M0151M0995M3093M4323M3709M2854M3350
53417B291366M4384M4210M2868M1833M1591M1052L9315L6953L5206L4449L3666
53406B726893L1397K7464K3542K1386K0444J8290J3728Q182L536j07l493o390
$$ plain form
53484 548424 553848 559324 565480 573045 582134 592347 603481 615684 628900 642668 656684 671168
53472 671168 686354 701807 716607 730297 743504 757452 772959 790025 808337 827792 848250
53461 848250 869064 889391 909046 928698 949106 970483 992670 1015499 1038676 1061662 1084217
53450 1084217 1106971 1131035 1156925 1184125 1211767 1239509 1267547 1296112 1325308 1355368 1386626
53439 1386626 1419243 1453353 1489624 1529098 1571956 1616790 1661657 1705605 1748637 1790609 1831217
53428 1831217 1871020 1911249 1952192 1992891 2033042 2074037 2117130 2161453 2205162 2248016 2291366
53417 2291366 2335750 2379960 2422828 2464661 2506252 2547304 2586619 2623572 2658778 2693227 2726893
53406 2726893 2758290 2785754 2809296 2830682 2851126 2869416 2883144 2891326 2894862 2894755 2891262 2884872
53394B884872q219r669j2019j5182j7919j9729k1133k2251k2618k2616k3652k6313
53382B663552k9356l1137l1379l1064l1176l1913l2795l3172l2861l2290l1952
53371B314457l1873l1776l1362l0092k7380k3609k0325j8481j7115j4805j1938
53360B055701j0204r993r849q609o709m955l264j234J053L451O217R403J2545
53347B033553J5499J8862K2878K6560K8759K9740L0889L3030L5679L8047M0160
53336B353656M2804M6561N1079N5288N8324O0274O1994O4175O6763O9134P0817
53325C000869P2017P3469P5634P8057P9800Q0477Q0442P9869P8455P6293P4277
53314C849659P2956P1663O9548O6875O4354O1758N8300N3934M9101M3356L5828
$$ plain form
53394 2884872 2876653 2866984 2854965 2839783 2821864 2802135 2781002 2758751 2736133 2713517 2689865 2663552
53382 2663552 2634196 2603059 2571680 2540616 2509440 2477527 2444732 2411560 2378699 2346409 2314457
53371 2314457 2282584 2250808 2219446 2189354 2161974 2138365 2118040 2099559 2082444 2067639 2055701
53360 2055701 2045497 2035504 2025655 2017046 2010337 2005382 2002118 2000884 2001937 2005388 2011605 2021008 2033553
53347 2033553 2049052 2067914 2090792 2117352 2146111 2175851 2206740 2239770 2275449 2313496 2353656
53336 2353656 2396460 2443021 2494100 2549388 2607712 2667986 2729980 2794155 2860918 2930052 3000869
53325 3000869 3072886 3146355 3221989 3300046 3379846 3460323 3540765 3620634 3699089 3775382 3849659
53314 3849659 3922615 3994278 4063826 4130701 4195055 4256813 4315113 4369047 4418148 4461504 4497332
53303D497332K7115J9330J3542Q333J619o875j5677k3419k9893l5545m0678m5261
53291D369923m9257n3016n7053o1110o3991o5005o5362o6995o9906p1852p1136
53280C675240o8777o7111o6919o6904o5684o3481o1656o1090o1303o1062n9615
53269B971638n7170n4279n1196m8014m4984m2288l9919l8184l7644l7884l7089
53258B482987l4066l0132k7553k6390k4712k1974k0228k1049k3058k3768k2670
53247B207387k1044j9649j8195j6551j4880j2751r536n780k880j077J003M140
53235B090187O954P555O289N712P685J1320J4362J6090J8026K1764K6877L1500
53223B264321L4482L6328L8126M0290M2361M3453M2901M1006L9177L8610L8783
$$ plain form
53303 4497332 4524447 4543777 4557319 4565652 4567271 4560396 4544719 4521300 4491407 4455862 4415184 4369923
53291 4369923 4320666 4267650 4210597 4149487 4085496 4020491 3955129 3888134 3818228 3746376 3675240
53280 3675240 3606463 3539352 3472433 3405529 3339845 3276364 3214708 3153618 3092315 3031253 2971638
53269 2971638 2914468 2860189 2808993 2760979 2715995 2673707 2633788 2595604 2557960 2520076 2482987
53258 2482987 2448921 2418789 2391236 2364846 2340134 2318160 2297932 2276883 2253825 2230057 2207387
53247 2207387 2186343 2166694 2148499 2131948 2117068 2104317 2094781 2089001 2086121 2085044 2086047 2090187
53235 2090187 2097141 2104696 2110985 2116697 2124382 2135702 2150064 2166154 2184180 2205944 2232821 2264321
53223 2264321 2298803 2335131 2373257 2413547 2455908 2499361 2542262 2583268 2622445 2661055 2699838
53212B699838L7937L5363L2332L0189K8422K5487K1137J6825J3745J1350Q128
53201B960753L382k112o941j0228j2261j4202j7121k1027k4895k7849l0168l2773
53189B764558l5659l7495l7299l6175l6481l9125m2396m3861m2810m0581l8937
53178B333739l8652l9201l9276l7899l5441l3330l2444l2204l1649l0613k9367
53167A953663k7689k5268k2600k0539j9213j8173j7283j6623j5792j4265j2273
53156A743945j0518r141p899p139p483q631r493r648r723j0228j0957j1590j2016
53143A619479j1990j1383j0817j1127j2104j2707j2633j2564j2769j2565j1588
53132A487232j0579j0463j1420j3164j5285j7097j8033j8434j9159k0172k0501
$$ plain form
53212 2699838 2737775 2773138 2805470 2835659 2864081 2889568 2910705 2927530 2941275 2952625 2960753
53201 2960753 2964135 2962023 2955082 2944854 2932593 2918391 2901270 2880243 2855348 2827499 2797331 2764558
53189 2764558 2728899 2691404 2654105 2617930 2581449 2542324 2499928 2456067 2413257 2372676 2333739
53178 2333739 2295087 2255886 2216610 2178711 2143270 2109940 2077496 2045292 2013643 1983030 1953663
53167 1953663 1925974 1900706 1878106 1857567 1838354 1820181 1802898 1786275 1770483 1756218 1743945
53156 1743945 1733427 1724286 1716387 1709248 1701765 1693134 1683641 1673993 1664270 1654042 1643085 1631495 1619479
53143 1619479 1607489 1596106 1585289 1574162 1562058 1549351 1536718 1524154 1511385 1498820 1487232
53132 1487232 1476653 1466190 1454770 1441606 1426321 1409224 1391191 1372757 1353598 1333426 1312925
53121A312925j9780j8782j8143j7666j7290j7670j9139k0937k1986k1834k0595
53110A099103j8826j7711j8268k0109k1757k2434k2511k2152k1002j9547j9239
53099H75547k0536k2130k2776k2580k1798j9993j7404j5699j5945j6921j6816
53088F62949j5605j4376j3338j2014j0741j0282j0325r846q801q191q396q641
53076E32393q210p300o583o517p192q309r187r140p935o050m596m614n718n916
53062D35126l893j196o74k767n086n806n458m782l227q58M79l63j871k199j852
53047C95573k106k338j205P78K228L438N446P316P021M771K995K989L763M150
53033D34819L951K991J150n51r60q95k276n100p373q192q554q960q663p909q291
$$ plain form
53121 1312925 1293145 1274363 1256220 1238554 1221264 1203594 1184455 1163518 1141532 1119698 1099103
53110 1099103 1080277 1062566 1044298 1024189 1002432 979998 957487 935335 914333 894786 875547
53099 875547 855011 832881 810105 787525 765727 745734 728330 712631 696686 679765 662949
53088 662949 647344 632968 619630 607616 596875 586593 576268 566422 557621 549430 541034 532393
53076 532393 524183 516883 510300 503783 496591 488282 479095 469955 462020 455970 451374 446760 441042 435126
53062 435126 431233 430037 429363 426596 421510 415704 410246 405464 402237 401379 401858 401495 399624 397425 395573
53047 395573 393467 391129 389924 390702 392930 396368 401814 409130 416151 420922 423917 426906 430669 434819
53033 434819 438770 441761 442911 442360 441400 440505 438229 433129 425756 417564 409010 400050 391387 383478 375187
53018C75187r882j0475q896o934o470o786o409n799o077o586n851m136l005k919
53004B84962l038l019l224l394k774j546q37j081j574j716j731j947k184k097
52990B54800j601q97m89q66j641j497J82K022K086M53q71p33k14p63k055k687
52974B45229k267j705j641j650j198o15o70j480k244j989m89J385K259J475k18
52959B34182j477j831j893k111k066j458r80j361k162k434k118j725j038M71K106
52944B14105K385J191K2k72l17l94L58J874K209K93j842j495J051L179L538K963
52928B28848K441K163K498L771M993M547K477N10m05r34j479j221K28J830K645
52913B52912L086L806M378M064L013J850Q47K19M91J678K774K899K620L315N382
$$ plain form
53018 375187 365305 354830 345934 339000 332530 325744 319335 313536 307459 300873 295022 290886 287881 284962
53004 284962 281924 278905 275681 272287 269513 267967 267130 266049 264475 262759 261028 259081 256897 254800
52990 254800 253199 252302 251813 250947 249306 247809 247991 250013 252099 252552 251681 250948 250734 249971 247916 245229
52974 245229 242962 241257 239616 237966 236768 236153 235483 234003 231759 229770 229281 230666 232925 234400 234182
52959 234182 232705 230874 228981 226870 224804 223346 222366 221005 218843 216409 214291 212566 211528 211999 214105
52944 214105 216490 217681 217703 217431 217114 216720 217078 218952 221161 221454 219612 218117 219168 222347 225885 228848
52928 228848 231289 233452 235950 239721 244714 249261 251738 252248 251843 250909 249430 248209 248437 250267 252912
52913 252912 255998 259804 264182 268246 271259 273109 273956 274175 274666 276344 279118 282017 284637 287952 293334
52898B93334P682Q751Q279P295P044P634Q093P898P869Q887J0305J0666R635Q049
52884D11421O204L606N92j369j676j673k850m894o344o387n276l735k718l129
52870C81772m855o452o668n896n438n627n471m158k171o30P0N63J454K315K071
52855C40879M55j525k787l329l564l213j763K61J567J597R27K52j89k78J4L93
52839C29697P69J728L445M524L457J043k71L14J079O07l36n46k26K8N76J650K122
52822C49660R15j065j873j002L07Q98P78N31O24J146J707J730J185O94N49L43
52806C57127n8q2M56P48L30Q9Q35J749J533N87N00J633K606K374J550J266J627
52789C74870J958J913J870K393L632N087N925N674M657L607K951K597K324K201
$$ plain form
52898 293334 301016 309767 318046 325341 332385 340019 348112 356010 363879 372766 383071 393737 403372 411421
52884 411421 417625 421231 421823 420454 418778 417105 414255 409361 403017 396630 391354 387619 384901 381772
52870 381772 376917 370465 363797 357901 352463 346836 341365 337207 335036 334406 334476 335039 336493 338808 340879
52855 340879 341334 339809 337022 333693 330129 326916 325153 325414 326981 328578 329505 329757 329568 329290 329304 329697
52839 329697 330466 332194 335639 340163 343620 344663 344392 344706 345785 346392 346056 345510 345284 345312 345888 347538 349660
52822 349660 350575 349510 347637 346635 346942 347840 348618 349149 349773 350919 352626 354356 355541 356235 356784 357127
52806 357127 357069 356987 357443 358191 358521 358610 359445 361194 362727 363314 363814 365447 368053 370427 371977 373243 374870
52789 374870 376828 378741 380611 383004 386636 391723 397648 403322 407979 411586 414537 417134 419458 421659
52775D21659K568L625M994N885N900N506N340N347N003M137K888J192q38k383
52761D70823k753k599l084m001m143l577l793n173o090n392m207m104m884n462
52747D11561n734o059n992n129m433n069o448o940o240n506n403n345m690l465
52733C35108k007q28o89j736k855k951k499k593k951k383j140r38k341l837m137
52718C01223m011m772o014o040m127j418L02J65j190k245j981q66l25j147k632
52703B64922l457k958j496K7P64L67q23k043k647k431j651r36j007k076l541m562
52687B36452m881m855m749m406l589k454j535j325j816k505k999l487m305n065
52673A88481m924l799k685k420k795l231l653m083m000k871j076M52J256J511
$$ plain form
52775 421659 424227 427852 432846 438731 444631 450137 455477 460824 465827 469964 472852 474044 473206 470823
52761 470823 468070 465471 462387 458386 454243 450666 446873 441700 435610 430218 426011 421907 417023 411561
52747 411561 405827 399768 393776 388647 384214 379145 372697 365757 359517 354011 348608 343263 338573 335108
52733 335108 333101 332273 331584 329848 326993 324042 321543 318950 315999 313616 312476 311538 309197 305360 301223
52718 301223 297212 292440 286426 280386 276259 274841 275143 275308 274118 271873 269892 269026 268701 267554 264922
52703 264922 261465 258507 257011 257038 257802 258169 257346 255303 252656 250225 248574 247638 246631 244555 241014 236452
52687 236452 231571 226716 221967 217561 213972 211518 209983 208658 206842 204337 201338 197851 193546 188481
52673 188481 183557 179758 177073 174653 171858 168627 164974 160891 156891 154020 152944 153396 154652 156163
52659A56163J367Q19J11k99k05K20O24N10n20k126l194k990k143j868k352k483
52643A41634j225J077K916L064J729K76k87k51k98j52R82K875M362M973N328N581
52627A72584M951L333K099K385L693N065O499Q164R302R178Q222P098N428K784
52613B50785N7j505k016k402k853l245m286o425q294q160o663o126p121p723o489
52598A77534m340k929k626k779k774k223j192o45j589l441m370l605k262j575
52584A41184j486j494j658k007k082j795j750j966j212J343M434N808M817L087
52570A45223K590L540M281L029l13l950n821n349l482j464k6O95J105J785K501
52555A44344J931o91l850m865k874K34K063J962Q02n20j664k417k449j642n15
$$ plain form
52659 156163 157530 158349 158460 158161 157956 158176 158800 159310 158790 156664 153470 150480 148337 146469 144117 141634
52643 141634 140409 141486 144402 147466 149195 149471 149184 148933 148635 148483 149465 152340 156702 161675 167003 172584
52627 172584 177535 180868 182967 185352 189045 194110 200609 208773 218075 227253 235475 242573 248001 250785
52613 250785 250842 249337 247321 244919 242066 238821 234535 228110 219816 211656 204993 198867 191746 184023 177534
52598 177534 173194 170265 167639 164860 162086 159863 158671 158026 156437 152996 148626 145021 142759 141184
52584 141184 139698 138204 136546 134539 132457 130662 128912 126946 125734 127077 131511 137319 142136 145223
52570 145223 147813 151353 155634 158663 158350 154400 148579 143230 139748 138284 138258 138953 140058 141843 144344
52555 144344 146275 145584 141734 136869 133995 134229 136292 138254 139056 138536 136872 134455 132006 130364 129849
52540A29849j07q60j651p76J693L422K572Q6j698j784o24J377L739N017M186K534
52524A46975K121K605J848l57j665o92J170K270K715K930K413J235P94J698K500
52509A68560K033J341J786K805L091K622J933Q30m90n05J376L033K400P96R37
52494A92548K562K923J375L08J074J924J134k50l31P23J370J139P83P85J080J900
52478B11047L571N578O681O125M237J951J85n20k52L21N23J48o40j526j888r27
52462B34614J471M086N160M076J953M33J09L93O92J082J696J970J185l40j278
52447B57302p16Q60K232K657K153R71n26j620j505j61J340J736Q42k67n06l1L4
52430B64795r06k192k821k616k013j122K29J672K361K055J529J594K182K593K339
$$ plain form
52540 129849 129742 128882 127231 126455 128148 131570 134142 134228 132530 130746 130122 131499 135238 140255 144441 146975
52524 146975 149096 151701 153549 153192 151527 150835 152005 154275 156990 159920 162333 163568 164362 166060 168560
52509 168560 170593 171934 173720 176525 179616 182238 184171 185001 184511 184006 185382 188415 190815 191611 192548
52494 192548 195110 198033 199408 199716 200790 202714 203848 203598 203267 203990 205360 206499 207282 208067 209147 211047
52478 211047 214618 220196 226877 233002 237239 239190 239375 238855 238603 238924 239447 239595 238955 237429 235541 234614
52462 234614 236085 240171 245331 249407 251360 251793 251902 252295 252987 254069 255765 257735 258920 258580 257302
52447 257302 256586 257446 259678 262335 264488 265459 264933 263313 261808 261647 262987 264723 265565 265298 264792 264761 264795
52430 264795 263889 261697 258876 256260 254247 253125 253354 255026 257387 259442 260971 262565 264747 267340 269679
52415B69679J533Q04Q44J798K899L099K097N69n53p81k57L59M14P5K95J464K549
52398B86887K363J272O10P23Q39P75J271K379K996K482J569J085R00Q21J287K294
52382C10553K719J837O86Q13K178L268K954J482J5k51R37K307K191O79k74M55
52366C32549J528J237L5n02k44k94o67j92J286K415K439K204K424K304Q52j313
52350C46061k503j838J79K519M416N431N478M991M738N257O403P420P490O457
52336D02499N075M441N039O295P073O578M794K287j73j815k187j821k171l925
52322D31989n534m676j605N21l18k254k527j767k642m944n389k768l9J25r01n04
52306C96767R26J154j4p29k63M07R11K003L619M409L760K709K503L349M757O027
$$ plain form
52415 269679 271212 272016 272860 274658 277557 280656 282753 283322 282769 281988 281731 282090 282504 282579 282874 284338 286887
52398 286887 289250 290522 291132 291855 292694 293469 294740 297119 300115 302597 304166 305251 306151 306972 308259 310553
52382 310553 313272 315109 315795 316608 318786 322054 325008 326490 326505 326254 327191 329498 331689 332368 332094 332549
52366 332549 334077 335314 335349 334847 334603 334309 333642 333450 334736 337151 339590 341794 344218 346522 347374 346061
52350 346061 343558 341720 341899 344418 348834 354265 359743 364734 369472 374729 381132 388552 396042 402499
52336 402499 407574 412015 417054 423349 430422 437000 441794 444081 443908 442093 439906 438085 435914 431989
52322 431989 426455 421779 420174 420695 420377 418123 415596 413829 411187 406243 400854 398086 398047 398172 397271 396767
52306 396767 397693 398847 398833 398104 397841 398248 399159 401162 404781 409190 412950 415659 418162 421511 426268 432295
52290D32295O257N022L266K500L079M093M923N735O451O511N951N628N952O318
52276E03981O154N829O027O760P356P129O008M741M383N267O736P981Q670Q494
52262E95516P213N744O064Q726J1495J1926J0646J0321J1904J3764J4403J4187
52250G21909J4138J4717J6123J8309K0327K1100K1117K1967K3959K5661K6282
52239I45609K6833K8221K9807L0705L1283L2190L2993L2838L1821L0721K9963
52228A282984K9541K9580L0299L1765L3743L5458L5562L3382L0204K8212K7912
52217A628642K7717K6326K4281K2670K1513K0156J8251J5819J3151J0980R826
52206A839332R003P450N545M556M228K935P62P9J986M379N085M761M926N153M555
$$ plain form
52290 432295 438552 443574 446840 449340 452419 456512 461435 467170 473621 480132 486083 491711 497663 503981
52276 503981 510135 515964 521991 528751 536107 543236 549244 553985 558368 563635 570371 578352 587022 595516
52262 595516 602729 608473 614537 623263 634758 646684 657330 667651 679555 693319 707722 721909
52250 721909 736047 750764 766887 785196 805523 826623 847740 869707 893666 919327 945609
52239 945609 972442 1000663 1030470 1061175 1092458 1124648 1157641 1190479 1222300 1253021 1282984
52228 1282984 1312525 1342105 1372404 1404169 1437912 1473370 1508932 1542314 1572518 1600730 1628642
52217 1628642 1656359 1682685 1706966 1729636 1751149 1771305 1789556 1805375 1818526 1829506 1839332
52206 1839332 1848335 1855785 1861330 1865886 1870114 1873049 1873811 1873890 1875876 1880255 1885340 1890101 1895027 1900180 1904735
52191A904735M297N827P754P562N834N847Q957J3063J5968J7851J9789K2039K4526
52178B064049K7255K9504L0213K9761K9749L0466L0291K8308K5763K3902K2047
52167B371308J9050J5325J1946Q877N498K089o56k956n384p520q608r249j0916
52154B388804j3727j6075j6876j7106j8382k0773k2778k3194k2446k2001k2829
52143B172617k4580k6086k6460k5613k3926k1689j8991j6040j3513j2330j2719
52132A950670j3484j2881j0598q270p395p438o908n706m990n012m817m302m749
52119A854120o622q418q872q790r364r844q649o038l865l091l189l737m838n947
52105A762856o049n390n427o600p593p482p118p484q005p666o836o600o854o409
$$ plain form
52191 1904735 1909032 1914859 1922613 1930175 1936009 1941856 1950813 1963876 1979844 1997695 2017484 2039523 2064049
52178 2064049 2091304 2120808 2151021 2180782 2210531 2240997 2271288 2299596 2325359 2349261 2371308
52167 2371308 2390358 2405683 2417629 2426506 2432004 2434093 2433437 2430481 2425097 2417577 2408969 2399720 2388804
52154 2388804 2375077 2359002 2342126 2325020 2306638 2285865 2263087 2239893 2217447 2195446 2172617
52143 2172617 2148037 2121951 2095491 2069878 2045952 2024263 2005272 1989232 1975719 1963389 1950670
52132 1950670 1937186 1924305 1913707 1905437 1898042 1890604 1883696 1877990 1873000 1867988 1863171 1858869 1854120
52119 1854120 1847498 1839080 1830208 1821418 1812054 1802210 1793561 1787523 1783658 1780567 1777378 1773641 1768803 1762856
52105 1762856 1756807 1751417 1745990 1739390 1731797 1724315 1717197 1709713 1701708 1694042 1687206 1680606 1673752 1667343
52091A667343m835l230k978m303o030o514n143l135k318k886l169k161j117j656
52077A617868l230l951l386k909l326l803l460k674k146j805j282o97k37M07J504
52062A586873K558K775K114J453J713K955M228M492L828L483M258N344N530N237
52048A636841O185Q984J2206J4216J4924J5340J6383J8562K1895K5483K8022K9393
52036A848434L0877L3221L5438L6469L7068L8742M1360M3130M2790M0835L8651
52025B267015L7328L7236L7826L7755L5907L2418K8329K4440K0931J7750J4623
52014B591558J0964O556K180j160l421n282p011q404r607j0998j2375j3211j3803
52001B525986j5094j7114j8515j8132j6274j4047j1996r956p884o243n590n894
$$ plain form
52091 1667343 1662508 1659278 1656300 1651997 1645967 1639453 1634310 1631175 1628857 1625971 1622802 1620641 1619524 1617868
52077 1617868 1614638 1610687 1607301 1604392 1601066 1597263 1593803 1591129 1588983 1587178 1585896 1585199 1584962 1585369 1586873
52062 1586873 1589431 1592206 1594320 1595773 1597486 1600441 1604669 1609161 1612989 1616472 1620730 1626074 1631604 1636841
52048 1636841 1643026 1652010 1664216 1678432 1693356 1708696 1725079 1743641 1765536 1791019 1819041 1848434
52036 1848434 1879311 1912532 1947970 1984439 2021507 2060249 2101609 2144739 2187529 2228364 2267015
52025 2267015 2304343 2341579 2379405 2417160 2453067 2485485 2513814 2538254 2559185 2576935 2591558
52014 2591558 2602522 2609078 2611258 2610098 2606677 2601395 2594384 2585980 2576373 2565375 2553000 2539789 2525986
52001 2525986 2510892 2493778 2475263 2457131 2440857 2426810 2414814 2404858 2396974 2390731 2385141 2379247
51989B379247o251n510l388p87J289K794M260N803P149Q258R153R567R560J0060
51975B431204J1564J2670J1346P887N020M579N314M827K542j78k076l092l876
51962B487731n180p575j1013j4691j7642j9378j9906j9638j9551k0730k3217k5851
51950B283359k7685k8990l0356l1463l1693l1475l2048l3993l6821l9976m3187
51939A915672m5743m6416m4857m2468m1151m1324m1810m1716m1521m2017m2718
51928A443931m2323m0603l8905l8385l8528l8052l6632l4908l3280l1756l0805
51917A039754l1070l1993l1767k9259k5281k1511j8830j7311j7019j7876j8904
51906G78933j8678j6764j4273j2662j2238j2039j1108r569q324p902p950p937
$$ plain form
51989 2379247 2372996 2367486 2364098 2363311 2364600 2367394 2371654 2377457 2384606 2392864 2402017 2411584 2421144 2431204
51975 2431204 2442768 2455438 2466784 2474671 2479691 2484270 2489584 2494411 2496953 2496775 2494699 2491607 2487731
51962 2487731 2482551 2474976 2463963 2449272 2431630 2412252 2392346 2372708 2353157 2332427 2309210 2283359
51950 2283359 2255674 2226684 2196328 2164865 2133172 2101697 2069649 2035656 1998835 1958859 1915672
51939 1915672 1869929 1823513 1778656 1736188 1695037 1653713 1611903 1570187 1528666 1486649 1443931
51928 1443931 1401608 1361005 1322100 1283715 1245187 1207135 1170503 1135595 1102315 1070559 1039754
51917 1039754 1008684 976691 944924 915665 890384 868873 850043 832732 815713 797837 778933
51906 778933 760255 743491 729218 716556 704318 692279 681171 671602 663278 655376 647426 639489
51894F39489p808p736p676p547p537p716p819p836q257r164r767r720j0081j1642
51880E19183j2894j1559q021n305n221o423o966o880o956o676n114k877j452j150
51866D31689j187j389k275l647m443m108l104k008j067o01q94j577j964k081k565
51851C98779l484m054l701k747j913j732k483m087n820o752o580n697m515l303
51837C41911k536k643l223l317k720k392l086m122m143k750q92L81R64J361J688
51822C14481J480N95r6M79K156L470L270J894L33j100k497l205k094P01L265L669
51806C26801J886m79j985k302j654j95J730L242L506K667J610P54l20j662k159
51791C31440q10J496K651J825M49L19J539K869L427L403L472M039M923N392M865
$$ plain form
51894 639489 631681 623945 616269 608722 601185 593469 585650 577814 569557 560393 550626 540906 530825 519183
51880 519183 506289 494730 486709 481404 476183 469760 462794 455914 448958 442282 437168 434291 432839 431689
51866 431689 430502 429113 426838 423191 418748 414640 411536 409528 408461 407860 406966 405389 403425 401344 398779
51851 398779 395295 391241 387540 384793 382880 381148 378665 374578 368758 362006 355426 349729 345214 341911
51837 341911 339375 336732 333509 330192 327472 325080 321994 317872 313729 310979 310087 310468 311432 312793 314481
51822 314481 315961 316556 316460 316939 319095 322565 325835 327729 328062 326962 324465 321260 319166 319867 323132 326801
51806 326801 328687 328208 326223 323921 322267 322072 323802 327044 330550 333217 334827 335581 335261 333599 331440
51791 331440 330630 332126 334777 336602 337051 337370 338909 341778 345205 348608 352080 356119 361042 366434 371299
51776C71299L661K631J890O97j098k452k662k574l202l919l332j638o73j541l333
51761C53754m541m729m372l849l160k218j052J05P98P80M77N63J098J510J393
51746C36557P87k13j377j898r33J075K451K173J065N76R70J456J545J310N47j204
51730C44887l445m552l551j582p45j592k562k039j92J574K340K150J253j26j349
51715C30469j683j241r02r32o07M10J152O19o67j326r82m50j94L02J439K642L078
51698C31127K685K046J610J428J420J492J432J030M42L27J389L622O074P540P583
51683C71247O644N259L629K120J554K450M202N627O237O551P213Q210R093R590
51669D49626R935J0614J1800J3007J3554J3471J3584J4452J5503J5641J4455J2392
$$ plain form
51776 371299 374960 377591 379481 380178 379080 376628 373966 371392 368190 364271 360939 359301 358628 357087 353754
51761 353754 349213 344484 340112 336263 333103 330885 329833 329938 330736 331516 331993 332556 333654 335164 336557
51746 336557 337344 337131 335754 333856 332923 333998 336449 338622 339687 340263 341233 342689 344234 345544 346091 344887
51730 344887 341442 336890 333339 331757 331012 329420 326858 324819 324627 326201 328541 330691 331944 331818 330469
51715 330469 328786 327545 326643 325711 325104 325514 326666 327285 326618 325292 324310 323860 323666 323968 325407 328049 331127
51698 331127 333812 335858 337468 338896 340316 341808 343240 344270 344712 345039 346428 350050 356124 363664 371247
51683 371247 377891 383150 386779 388899 390453 392903 397105 402732 408969 415520 422733 430943 440036 449626
51669 449626 459561 470175 481975 494982 508536 522007 535591 550043 565546 581187 595642 608034
51657F08034J0025P583N230L263J935J198O42k92j817l436m389m527m288l704
51643F15457k267j97J122Q71K36R13K574L258K288J317J936L491M192L593K896
51628F41680L183M194M933M811M129L829M750O796Q791R523Q989Q151P555O559
51614G27873M355J263j484l052l536l295k505j528r62q09k93R79K257K735K796
51599G24794L184L580L250K720L280M743N396M489L236K528J240j993o379r678
51585G44390j0768j0470j0259j0955j2227j2799j1810j0384j0756j3215j5212
51574F15535j4725j3058j2592j3023j2099r523p557p456p686o506m593l923n111
51561D97683o931p862p396o215n429n383n230m170k845k647l723m819m993m490
$$ plain form
51657 608034 618059 625642 630872 634135 636070 637268 637910 637618 635801 632365 627976 623449 619161 615457
51643 615457 613190 612993 614115 614986 615222 616135 618709 621967 624255 625572 627508 630999 635191 638784 641680
51628 641680 644863 649057 653990 658801 662930 666759 671509 678305 687096 696619 705608 713759 721314 727873
51614 727873 732228 733491 732007 728955 725419 722124 719619 718091 717129 716320 716027 717006 719263 721998 724794
51599 724794 727978 731558 734808 737528 740808 745551 750947 755436 758672 761200 762440 760447 754068 744390
51585 744390 733622 723152 712893 701938 689711 676912 665102 654718 643962 630747 615535
51574 615535 600810 587752 575160 562137 550038 540515 532958 525502 517816 511310 506717 502794 497683
51561 497683 490752 482890 475494 469279 463850 458467 453237 449067 446222 443575 439852 435033 430040 425550
51547D25550l746k767j840j706k445l082k815j873p66M31J488J650O07p72j342
51532D06572j023o54p65r02j18J858L851M022K046M2L36K543M140L960L564M675
51516D34147O851Q717J0171J1898J3493J3668J2221J0426R329Q617P591O400N668
51503E59197N186L733M22m092q103j0496j1492j1767j1452j0442r080p877o869
51490D76868n855m915m046k686n39J489K257K173K809M702O658P529P613P866
51476E01923Q640R678J0619J1135J1079J0746J0432R667P608M234M96k667m684
51463E88906n011l686k178k357m209n719n367l638j884r26j112k264l071j897
51449E45587J001L322L559K674K251K333K179J957K332L106L446K890J388q67
$$ plain form
51547 425550 421804 419037 417197 415491 413046 409964 407149 405276 404510 404941 406429 408079 408686 407914 406572
51532 406572 405549 404895 404130 403228 403110 404968 408819 412841 414887 414929 415265 417808 421948 425908 429472 434147
51516 434147 440998 449715 459886 471784 485277 498945 511166 521592 530921 539538 547129 553529 559197
51503 559197 564383 568116 568538 564446 556343 545847 534355 522588 511136 500694 491614 483737 476868
51490 476868 471013 466098 462052 459366 458827 460316 462573 464746 467555 472257 478915 486444 494057 501923
51476 501923 510563 520241 530860 541995 553074 563820 574252 583919 591527 595761 596257 593590 588906
51463 588906 583895 580209 578031 575674 571465 565746 560379 556741 554857 553931 552819 550555 547484 545587
51449 545587 546588 549910 553469 556143 558394 560727 562906 564863 567195 570301 573747 576637 578025 577158
51435E77158k997l869l667l996n616p400q367r145j0198j0342q816p249p321p649
51421D80526n638j760P31K97j217j651r84j13O74J217J148R53J859L916N495N513
51405D90966M872M810N143N211N423O609Q537J0251J1404J2316J3034J3249J3044
51392F04869J2990J3508J4489J5358J5270J3670J1043Q723P601P360P274O993
51380G39148O172M099P27k381l358k328j376j937l084k975j273O86J801K388L384
51365G39693M975O500P358P650P961Q696R530R443P602M449J609L28J40m69k222
51350H13243m392n994p067q362j0133j1512j1271r203o781o010p400r350r957
51337G05811q933p225n488m008l584m909o971p656o396m820m254l996k978j687
$$ plain form
51435 577158 574161 570292 566625 562629 557013 549613 541246 532101 521903 511561 502745 495496 488175 480526
51421 480526 474888 473128 473859 474156 472939 471288 470304 470191 470865 472082 473230 474183 476042 479958 485453 490966
51405 490966 495838 500648 505791 511002 516425 523034 531571 541822 553226 565542 578576 591825 604869
51392 604869 617859 631367 645856 661214 676484 690154 701197 709920 717521 724881 732155 739148
51380 739148 745320 749419 750146 747765 744407 742079 740703 738766 735682 732707 731434 732120 733921 736309 739693
51365 739693 744668 751168 758526 766176 774137 782833 792363 801806 809408 813857 815466 815794 815934 815465 813243
51350 813243 808851 802857 795790 787428 777295 765783 754512 745309 738528 732518 725118 715768 705811
51337 705811 696878 689653 684165 680157 676573 671664 664693 657037 650641 645821 641567 637571 634593 632906
51323F32906j139j022l64P35J470J941K804L681L414J946N30j73r16k381m025
51308F39407n138o298q826j2938j7060j9195j8856j7454j6699j6801j6706j5855
51296D67581j4790j3922j2744j1021r722r825j0674j0725r423p410n277l369k462
51283C46217l257n017n976n403m312l774l595l101k414k159k495l067l564l716
51269B94367l008j097J364K897K551R69k80m22p3J5L2L46L78m45j161k88J589
51252B97734K217J178R05K956N335N402L858L424M599N467N305N621P271R057
51238C60329R959J0614J1535J1747J0424Q478P235O513N291L423J526j07j494
51225D45473k389k774l473n335q008j0292j1505j1824j1589j0967j0273r960j0185
$$ plain form
51323 632906 631767 630745 630381 631116 632586 634527 637331 641012 644426 646372 646902 646729 645813 643432 639407
51308 639407 634269 627971 619145 606207 589147 569952 551096 533642 516943 500142 483436 467581
51296 467581 452791 438869 426125 415104 405382 395557 384883 374158 364735 357325 352048 348679 346217
51283 346217 342960 337943 331967 326564 322252 318478 314883 311782 309368 307209 304714 301647 298083 294367
51269 294367 291359 290262 291626 294523 297074 298043 297763 297341 297268 297283 297315 297661 298039 297594 296433 296145 297734
51252 297734 299951 301129 302034 304990 310325 315727 319585 323009 327608 333075 338380 344001 351272 360329
51238 360329 370288 380902 392437 404184 414608 423086 430321 436834 442125 445548 447074 446967 445473
51225 445473 443084 440310 436837 431502 423494 413202 401697 389873 378284 367317 357044 347084 336899
51212C36899j0553j0387r176p136n329m771n192n083l421r66N23J30j462k884
51198B71192l368l182l025l150l169k758k201j945j909j773j711k193l097l600
51184B34111l048j495O19K653L826L743L044K793L093L041K252J602J943K769
51170B60946K856J824M63l65n97p15r86j210j041m86R3L23K1q69k137l011k632
51153B52477r95J030K832M406N343M617K353N96R17K016J449o80j808p85M42j97
51137B74013j991k792k030r69o43q30r52r52j114j503j807j594q16m9L5n72j187
51120B54247j142k33J218K309J888l29l026m390l864k381j145q29j566k693k899
51105B35165j630o6M03K30P50J551P99j566l085k056K74J806K314K763L234L114
$$ plain form
51212 336899 326346 315959 306783 299647 294318 289547 284355 279272 275851 274885 275408 275538 274076 271192
51198 271192 267824 264642 261617 258467 255298 252540 250339 248394 246485 244712 243001 240808 237711 234111
51184 234111 231063 229568 230187 232840 236666 240409 243453 246246 249339 252380 254632 256234 258177 260946
51170 260946 263802 265626 266089 265724 265127 264412 263426 262216 261175 260689 260782 261105 261126 260257 258120 255109 252477
51153 252477 251482 252512 255344 259750 265093 269710 272063 272659 273576 275592 277041 276361 274553 273768 274210 274013
51137 274013 272022 269230 267200 266231 265588 264758 263806 262854 261740 260237 258430 256836 256020 255971 256006 255434 254247
51120 254247 253105 252872 254090 256399 258287 257958 254932 250542 246678 244297 243152 242323 240757 238064 235165
51105 235165 233535 233469 233872 234102 234852 236403 237202 235636 232551 230495 230769 232575 234889 237652 240886 244000
51089B44000K483J886J174j15j516j951j159j06Q7q20k099k711k355j946k577
51074B32275m024m928m422k742m21J858K753J344r46j397L47J624P76l03P71L150
51058B25715M304L814L239L127K764K383K992L956L345J132k26P93K747L705L962
51043B67752M797N808N310K888L2j823k716l377l895l773k915j904j219o14L85
51028B64736J596K232J859Q79K5k11K98J163J402L10j387j903l64K219M219M864
51012B81937M199K561Q32K66J170K388K808K716K797K646J466l16j361j199o20
$$ plain form
51089 244000 246483 248369 249543 249428 247912 245961 244802 244696 244783 243963 241864 239153 236798 234852 232275
51074 232275 228251 223323 218901 216159 215738 217596 220349 221693 220747 219350 219697 221321 222097 221794 222565 225715
51058 225715 230019 233833 237072 240199 242963 245346 248338 252294 255639 256771 256545 257338 260085 263790 267752
51043 267752 272549 278357 283667 286555 286587 284764 282048 278671 274776 271003 268088 266184 264965 264351 264736
51028 264736 266332 268564 270423 271302 271327 271116 271414 272577 273979 274289 272902 270999 270635 272854 277073 281937
51012 281937 286136 288697 289529 289795 290965 293353 296161 298877 301674 304320 305786 305470 304109 302910 302290
$$ [...]
##END NTUPLES=NMR SPECTRUM
##END=
