
##TITLE=AC1149_Santander_5874516_JumfjW18IU
##JCAMPDX= 6.0         $$ Bruker NMR JCAMP-DX V2.0
##DATA TYPE= NMR SPECTRUM
##DATA CLASS= NTUPLES
##ORIGIN= BRUKER
##OWNER= Administrator
$$ 1.72 TOPSPIN		Version 2.1
$$ 2012-03-31 15:36:19.500 -0500  Administrator@TOPSPIN
$$ Compression mode = diff/dup
##.OBSERVE FREQUENCY= 400.13188235
##.OBSERVE NUCLEUS= ^1H
##.ACQUISITION MODE= SIMULTANEOUS (DQD)
##.ACQUISITION SCHEME= undefined
##.AVERAGES= 8
##.DIGITISER RES= 22
##SPECTROMETER/DATA SYSTEM= spect
##.PULSE SEQUENCE= zg30
##.SOLVENT NAME= COFFEE_meoh
##.SHIFT REFERENCE= INTERNAL, COFFEE_meoh, 1, 14.98061
##AUDIT TRAIL= $$ (NUMBER, WHEN, WHO, WHERE, PROCESS, VERSION, WHAT)
$$ ##TITLE= Audit trail, TOPSPIN		Version 2.1
$$ ##JCAMPDX= 5.01
$$ ##ORIGIN= Bruker BioSpin GmbH
$$ ##OWNER= Administrator
$$ $$ C:\Bruker\TOPSPIN/data/COFFEE/nmr/AC1149_Santander_5874516_JumfjW18IU/10/pdata/1/auditp.txt
$$ ##AUDIT TRAIL=  $$ (NUMBER, WHEN, WHO, WHERE, PROCESS, VERSION, WHAT)
(   1,<2012-03-31 15:36:08.234 -0500>,<Administrator>,<TOPSPIN>,<go>,<TOPSPIN 2.1>,
      <created by zg
	started at 2012-03-31 15:35:01.656 -0500,
	POWCHK enabled, PULCHK disabled,
       configuration hash MD5:
       1A 1E CE 29 27 FD 77 03 67 4E F0 E3 C4 B2 CB 90
       data hash MD5: 64K
       DC 6D 12 AB 77 1B 0C 65 03 8B DC 73 B8 92 A5 4F>)
(   2,<2012-03-31 15:36:12.750 -0500>,<Administrator>,<TOPSPIN>,<proc1d>,<TOPSPIN 2.1>,
      <Start of raw data processing
       efp LB = 0 FT_mod = 6 PKNL = 1 PHC0 = 0 PHC1 = 0 SI = 32K 
       data hash MD5: 32K
       C6 04 66 07 5E 0D B1 DA 84 E1 F6 26 F4 E0 25 F6>)
(   3,<2012-03-31 15:36:13.125 -0500>,<Administrator>,<TOPSPIN>,<proc1d>,<TOPSPIN 2.1>,
      <pk PHC0 = 216.8591 PHC1 = 0 
       data hash MD5: 32K
       20 B2 4A 46 43 2A 42 58 15 AD 1B 8E 63 7C 8B 3B>)
(   4,<2012-03-31 15:36:13.296 -0500>,<Administrator>,<TOPSPIN>,<proc1d>,<TOPSPIN 2.1>,
      <abs ABSG = 1 
       data hash MD5: 32K
       7E BC 37 CB 36 41 62 52 67 2F 97 6F 4C 55 A2 A4>)
(   5,<2012-03-31 15:36:13.562 -0500>,<Administrator>,<TOPSPIN>,<proc1d>,<TOPSPIN 2.1>,
      <abs ABSG = 2 
       data hash MD5: 32K
       F1 59 F8 A6 49 27 F5 43 33 4E D9 C3 70 DF 76 63>)
(   6,<2012-03-31 15:36:13.750 -0500>,<Administrator>,<TOPSPIN>,<proc1d>,<TOPSPIN 2.1>,
      <abs ABSG = 3 
       data hash MD5: 32K
       10 B3 30 9B 51 04 61 38 F7 CD 8D 7C A6 37 59 8B>)
(   7,<2012-03-31 15:36:13.890 -0500>,<Administrator>,<TOPSPIN>,<proc1d>,<TOPSPIN 2.1>,
      <abs ABSG = 4 
       data hash MD5: 32K
       AD 7C 1F 90 7E 9F 44 BF D6 31 87 4A 9E A6 8F 6B>)
(   8,<2012-03-31 15:36:13.921 -0500>,<Administrator>,<TOPSPIN>,<proc1d>,<TOPSPIN 2.1>,
      <abs ABSG = 5 
       data hash MD5: 32K
       27 E9 4C 46 8B 1A 14 37 3D 40 53 64 C4 80 19 F3>)
$$ ##END=
$$ 
$$ $$ hash MD5
$$ $$ 1E CC FF 44 56 D6 C0 B5 32 F8 59 C7 5C C0 37 8E
##$RELAX= 
##$RELAX= 
##$RELAX= 
##$RELAX= 
##$RELAX= 
##$RELAX= 
##$RELAX= 
$$ Bruker specific parameters
$$ --------------------------
$$ [...]
150 150 150 150 150 150 150 150
##$TP07= 0
##$TPNAME0= <>
##$TPNAME1= <>
##$TPNAME2= <>
##$TPNAME3= <>
##$TPNAME4= <>
##$TPNAME5= <>
##$TPNAME6= <>
##$TPNAME7= <>
##$TPOAL= (0..7)
0.5 0.5 0.5 0.5 0.5 0.5 0.5 0.5
##$TPOFFS= (0..7)
0 0 0 0 0 0 0 0
##$TUNHIN= 0
##$TUNHOUT= 0
##$TUNXOUT= 0
##$USERA1= <user>
##$USERA2= <user>
##$USERA3= <user>
##$USERA4= <user>
##$USERA5= <user>
##$V9= 5
##$VALIST= <valist>
##$VCLIST= <CCCCCCCCCCCCCCC>
##$VD= 0
##$VDLIST= <DDDDDDDDDDDDDDD>
##$VPLIST= <PPPPPPPPPPPPPPP>
##$VTLIST= <TTTTTTTTTTTTTTT>
##$WBST= 2048
##$WBSW= 25
##$XGAIN= (0..3)
0 0 0 0
##$XL= 0
##$YL= 0
##$YMAX_a= 530550
##$YMIN_a= -629829
##$ZGOPTNS= <>
##$ZL1= 120
##$ZL2= 120
##$ZL3= 120
##$ZL4= 120
##$ABSF1= 14.98061
##$ABSF2= -5.57192
##$ABSG= 5
##$ABSL= 3
##$ALPHA= 0
##$AQORDER= 0
##$ASSFAC= 0
##$ASSFACI= 0
##$ASSFACX= 0
##$ASSWID= 0
##$AUNMP= <proc_prof1d_extract_pilot.lims>
##$AXLEFT= 0
##$AXNAME= <>
##$AXNUC= <1H>
##$AXRIGHT= 0
##$AXTYPE= 0
##$AXUNIT= <>
##$AZFE= 0.1
##$AZFW= 0.1
##$BCFW= 0
##$BC_mod= 0
##$BYTORDP= 0
##$COROFFS= 0
##$CY= 15
##$DATMOD= 1
##$DC= 0
##$DFILT= <>
##$DTYPP= 0
##$F1P= 0
##$F2P= 0
##$FCOR= 0.5
##$FTSIZE= 32768
##$FT_mod= 6
##$GAMMA= 0
##$GB= 0
##$INTBC= 1
##$INTSCL= 1
##$ISEN= 128
##$LB= 0
##$LEV0= 0
##$LPBIN= 0
##$MAXI= 10000
##$MC2= 0
##$MEAN= 0
##$ME_mod= 0
##$MI= 0
##$NCOEF= 0
##$NC_proc= -8
##$NLEV= 6
##$NOISF1= 0
##$NOISF2= 0
##$NSP= 0
##$NTH_PI= 0
##$NZP= 0
##$OFFSET= 14.98061
##$PC= 1
##$PHC0= 216.8591
##$PHC1= 0
##$PH_mod= 1
##$PKNL= yes
##$PPARMOD= 0
##$PPDIAG= 0
##$PPIPTYP= 0
##$PPMPNUM= 2147483647
##$PPRESOL= 1
##$PSCAL= 4
##$PSIGN= 0
##$PYNMP= <proc.py>
##$REVERSE= no
##$SF= 400.13
##$SI= 32768
##$SIGF1= 0
##$SIGF2= 0
##$SINO= 400
##$SIOLD= 32768
##$SPECTYP= <>
##$SREGLST= <1H.CDCl3>
##$SSB= 0
##$STSI= 32768
##$STSR= 0
##$SW_p= 8223.68421052632
##$SYMM= 0
##$S_DEV= 0
##$TDeff= 65536
##$TDoff= 0
##$TI= <>
##$TILT= no
##$TM1= 0
##$TM2= 0
##$TOPLEV= 0
##$USERP1= <user>
##$USERP2= <user>
##$USERP3= <user>
##$USERP4= <user>
##$USERP5= <user>
##$WDW= 1
##$XDIM= 32768
##$YMAX_p= 474239977
##$YMIN_p= -712530
##$CURPLOT= <Network HP LaserJet P1505>
##$CURPRIN= <$Network HP LaserJet P1505>
##$DFORMAT= <normdp>
##$LAYOUT= <+/1D_H.xwp>
##$LFORMAT= <normlp>
##$PFORMAT= <normpl>
##$SURQMSG= 1
$$ End of Bruker specific parameters
$$ ---------------------------------
##NTUPLES= NMR SPECTRUM
##VAR_NAME=  FREQUENCY,     SPECTRUM/REAL,   SPECTRUM/IMAG
##SYMBOL=    X,             R,               I
##VAR_TYPE=  INDEPENDENT,   DEPENDENT,       DEPENDENT
##VAR_FORM=  AFFN,          ASDF,            ASDF
##VAR_DIM=   32768,         32768,           32768
##UNITS=     HZ,            ARBITRARY UNITS, ARBITRARY UNITS
##FACTOR=    0.250966925370066, 1,           1
##FIRST=     8223.43324360095, -130054,      -133129
##LAST=      0,             -22060,          -192885
##MIN=       0,             -712530,         0
##MAX=       8223.43324360095, 474239977,    0
$$ Real data points
##PAGE= N=1
##DATA TABLE= (X++(R..R)), XYDATA
$$ [...]
$$ plain form
19482 198434 -301526 -107358 163352 -192249 -176836 -199377 -120772 -293106 270571 -272439
19471 216172 -212272 -24201 -35286 162042 54776 -48968 -97718 -130392 183153 377067 -245178
19459 138166 -190371 -78644 -190006 -481547 -186313 -269063 -80187 -196132 -172435 -15375
19448 226877 2189 -316474 71888 137366 53847 -200689 -66869 -97748 -45996 -2177 -76932
19437 -76932 274985 -214471 -198588 141344 -51778 -93390 -104765 58453 83425 -107196 222911
19425 -25758 -104884 429433 20997 -279940 -43249 -352412 -118141 -165971 -170545 -13285 36616
19413 340728 -49668 -431597 -258581 8487 -218632 169342 85659 233203 -22696 34119 56661
19402 56661 -130635 -46245 -181982 -34528 61968 17737 -182240 -96545 140896 42093 -42375
$$ packed form
19482A98434c01526a07358A63352a92249J5413k2541P8605j72334B70571b72439
19471B16172b12272b4201j1085A62042E4776d8968m8750l2674A83153J93914b45178
19459A38166a90371g8644j11362k91541a86313q2750h0187j15945K3697a5375
19448B26877B189c16474G1888O5478E3847b00689f6869l0879d5996b177p4755
19437g6932B74985b14471J5883A41344e1778m1612j1375E8453K4972a07196B22911
19425b5758p9126D29433B0997b79940d3249l09163a18141m7830m574a3285C6616
19413C40728d9668l81929J73016H487b18632A69342q3683J47544b2696C4119K2542
19402E6661a30635d6245j35737c4528F1968A7737a82240Q5695A40896D2093d2375
$$ plain form
19390 269403 -265053 -235576 -260484 98952 -77589 -156065 -70003 258789 -204840 247795 -22896
19378 -315423 162650 -28366 -81683 43400 143369 -239046 173043 -100301 98640 -166580
19367 110517 30589 -21562 -175764 -186860 171998 -308390 -371601 -269727 171435 86297
19357 86297 92907 -143212 -79576 -373287 -86305 -33052 -134833 127310 -149584 -19194 161065
19345 216921 -125102 -272509 -398355 -177485 -250332 86594 -174629 -265777 52497 121535
19335 121535 84723 -269801 163020 31267 97666 68530 -138737 47717 20611 -195894 -14721
19323 277475 -111658 146539 -193139 -267904 46589 -26817 45849 -213177 63635 -26069 -149744
19312 -149744 -98973 -206938 -44718 6048 -53980 -182961 -3436 -147462 -206891 -45959 -93471
$$ packed form
19390B69403b65053K9477k4908I8952g7589p8476g0003B58789b04840B47795b2896
19378c15423A62650b8366n3317D3400R9969b39046A73043a00301I8640a66580
19367A10517C0589b1562j54202j1096A71998c08390o3211J01874A71435q5138
19357H6297O610a43212O3636k93711h6305c3052j01781A27310a49584a9194A61065
19345B16921a25102j47407j25846a77485p2847H6594a74629r1148E2497O9038
19335A21535l6812b69801A63020C1267O6399k9136a38737D7717B0611a95894a4721
19323B77475a11658A46539a93139p4765D6589b6817D5849b13177F3635b6069j23675
19312a49744N0771j07965d4718F048e3980j28981c436j44026n9429d5959m7512
$$ plain form
19301 -93471 37780 71772 -246307 42273 -100823 48647 -370482 -284472 -327426 -63490 -333801
19290 -333801 168960 9667 161303 -60071 -257880 -237948 -322723 24480 -64864 -162717 -431449
19279 -431449 223593 35321 -300329 -212190 -166189 -38783 78203 56245 -246546 61336 1141
19267 165995 51166 -380895 -2631 -134121 9280 -264767 -300263 149318 -192172 178473 25734
19255 -85996 -212114 -308668 -383665 -141880 -262296 -13949 11167 -298178 107950 -228393
19244 -143301 -182054 39989 -149524 53528 -22507 -67765 -51827 124021 -230463 -159730 63258
19232 22202 -224740 -206416 88070 -228568 59584 -92762 162404 -148939 -156592 -289723 -232159
19221 -232159 77628 -288898 -220683 -34697 -191868 102201 -275484 108796 124026 -30093
$$ packed form
19301i3471C7780L3992b46307D2273a00823D8647c70482Q6010m2954f3490k70311
19290c33801A68960I667J51636f0071j97809J9932q4775B4480f4864r7853k68732
19279d31449B23593C5321c00329Q8139M6001c8783G8203k1958b46546F1336A141
19267A65995E1166c80895b631j31490I280b64767l5496A49318a92172A78473B5734
19255h5996j26118r6554p4997a41880j20416a3949A1167b98178A07950b28393
19244a43301l8753C9989a49524E3528b2507m5258J5938A24021b30463P0733F3258
19232B2202b24740J8324H8070b28568E9584i2762A62404a48939p653j33131N7564
19221b32159G7628b88898O8215c4697j57171A02201b75484A08796J5230c0093
$$ plain form
19210 192626 -263348 -155954 -197512 -51494 -302532 -203825 -20679 -81966 176459 -99836 59082
19198 -160528 -76960 -388604 81644 -38027 -67447 -206448 76491 -63320 -59263 60325 -283032
19186 -204096 55200 51939 -118899 53516 -377890 59532 -189778 6622 -153207 -29451 100796
19174 68702 -86717 175991 -188425 -112242 -207246 -26984 -344571 -214480 101251 214946
19164 214946 39947 -67138 -88975 -197076 -153237 -164342 -131974 -357453 -168133 3752 -167705
19152 248894 -251056 -126659 -189434 -13283 254029 -25775 32307 -102724 -198388 -193778 -121480
19141 -121480 -6908 -193912 -107687 3922 -106953 -32800 85244 -38963 -101872 -259960 76236
19129 -79545 -121428 26408 185225 -187660 -114185 -120378 -114960 -187019 118615 -161553 54959
$$ packed form
19210A92626b63348J07394m1558e1494k51038R8707b0679o1287A76459i9836E9082
19198a60528g6960l11644H1644c8027k9420j39001G6491f3320M057F0325b83032
19186b04096E5200l261a18899E3516c77890E9532a89778F622a53207b9451A00796
19174F8702h6717A75991a88425P6183r5004b6984l17587J30091A01251J13695
19164B14946C9947f7138k1837j08101M3839j1105L2368k25479a68133C752a67705
19152B48894b51056J24397o2775a3283B54029b5775C2307a02724r5664M610P2298
19141a21480f908j87004Q6225C922a06953c2800H5244c8963o2909j58088G6236
19129g9545m1883B6408J58817a87660P3475o193N418p2059A18615a61553E4959
$$ plain form
19117 -126855 127471 -66654 -171828 185458 168348 101043 79498 5169 31052 -50574 -186536
19106 -186536 -53789 191789 -166675 63532 247719 17549 6514 -172197 201262 -205454
19095 53694 438164 -85121 -178985 -369380 -403124 -249833 -132081 -169515 -221770 20143 56038
19084 56038 -256937 -205547 87814 -73642 -65651 292214 243282 -248763 181258 67535 84362
19073 84362 -787 138180 -379395 -353078 98426 64271 201818 112365 -227848 -430342 -332842
19062 -332842 -363435 236596 -270406 -39510 -210543 -347084 -18782 -43540 -77123 64135 183904
19051 183904 198876 -183422 -125079 -25830 -258813 127526 67059 -371219 -53762 159980
19040 -42281 -249181 48147 -68114 -126048 -212785 26822 -29662 56807 -332499 -108117 154004
$$ packed form
19117a26855A27471f6654j05174A85458j7110o7305k1545E169K5883e0574j35962
19106a86536e3789A91789a66675F3532J84187A7549F514a72197B01262b05454
19095E3694L84470h5121r3864j90395l3744J53291J17752l7434n2255B0143L5895
19084E6038b56937N1390H7814g3642P991B92214m8932b48763A81258F7535J6827
19073H4362g87A38180c79395K6317I8426l4155J37547q9453b27848k02494R7500
19062c32842l0593B36596b70406c9510j71033j36541a8782k4758l3583F4135J19769
19051A83904J4972a83422N8343b5830k32983A27526o0467c71219e3762A59980
19040d2281k06900D8147f8114n7934q6737B6822b9662E6807c32499a08117A54004
$$ plain form
19028 -283794 -322 439246 -192240 -126591 42729 46886 -184819 -216368 -114234 -31632 -366527
19017 -366527 164744 -52363 64736 107579 54717 -80696 -119420 -88145 -172163 49722 42150
19006 42150 259074 50538 -85402 333691 124807 80656 115354 -166811 56621 -9163 -53790
18995 -53790 -130600 -270106 130372 420935 -171574 -150238 -115739 -261702 -177772 -182154 -340810
18984 -340810 75708 -354122 -369029 -344091 48151 -70491 -314224 159292 -87007 50536 -88588
18972 -164670 166054 -71188 -84463 62283 16280 -389790 271927 60288 166395 -167970
18961 -181280 -440594 333829 90377 410422 505811 295402 136420 322072 249169 -121102
18950 42662 -185134 -164089 -188392 -3186 206069 -256449 -81408 -126177 -299 37545 -24255 -162942
$$ packed form
19028b83794c22D39246a92240O5649D2729M157a84819l1549J02134c1632l34895
19017c66527A64744e2363F4736M2843n2862h0696l8724L1275q4018D9722p572
19006D2150K16924E0538h5402C33691A24807m4151L4698a66811E6621i163m4627
18995e3790p6810j39506A30372K90563a71574K1336L4499j45963Q3930m382j58656
18984c40810G5708c54122j4907K4938D8151g0491k43733A59292h7007E0536h8588
18972a64670A66054g1188j3275F2283A6280c89790B71927F0288J06107a67970
18961a81280k59314C33829I0377L20045R5389k10409A36420J85652p2903a21102
18950D2662a85134K1045k4303c186B06069b56449h1408m4769b99C7545b4255j38687
$$ plain form
18938 -162942 -179500 -45866 -177086 95369 -98407 -57662 -25801 583403 -121775 322227 315076
18927 315076 -102524 331543 -327387 149322 -89379 212654 -22120 -74267 -128555 -4616 84603
18915 47556 203508 -66869 332584 -51024 -118372 147719 -305823 57224 -288096 -219399 116756
18903 90723 -202399 -61269 -99918 307595 85698 34472 71068 197115 450491 485407 600119
18892 600119 113536 131353 218876 -15684 58905 -188444 38364 4912 -16204 -102057 -360847
18881 -360847 156988 288616 -27939 -364750 6777 -50894 -206246 -217682 178689 139938 -73254
18869 -19448 182543 111935 -206937 -64990 77543 49658 -87912 -189383 41776 -205627 -56368
18857 97262 184316 -229703 -217252 -207871 -108732 -23769 20775 27956 339383 -313593 111304
$$ packed form
18938a62942j6558d5866j31220I5369i8407M0745b5801E83403a21775C22227p151
18927C15076a02524C31543c27387A49322h9379B12654b2120n2147n4288d616H4603
18915D7556J55952f6869C32584e1024o7348A47719c05823E7224b88096O8697A16756
18903I0723b02399f1269l8649C07595H5698C4472L6596J26047K53376L4916J14712
18892F00119A13536J7817Q7523a5684E8905a88444C8364D912a6204q5853k58790
18881c60847A56988J31628b7939l36811F777e0894j55352j1436A78689l8751g3254
18869a9448A82543p0608b06937f4990G7543k7885h7912j01471D1776b05627e6368
18857I7262Q7054b29703J2451R381R9139b3769B0775P181L11427c13593A11304
$$ plain form
18845 -110064 -63590 -215142 156807 17967 -97020 -134256 -77796 -242601 -84658 -326169 -155698
18833 80415 -19753 -250056 33478 50335 -96268 -179692 -321370 -313997 -190757 -170250 255657
18821 202322 -162975 -248133 -194085 -191926 24300 -138638 231440 -113963 -290588 -132650
18810 -454191 57859 129369 180432 75240 172332 -210245 58834 -23252 -217524 102606 189463
18799 189463 -2810 56332 169627 -276564 230587 456317 27266 27499 -60383 -237322 347014
18787 31919 270595 -141846 198437 127561 23437 37043 -156640 -108477 2812 30305 -77906
18775 -11417 -107427 113789 -93137 -14888 -370819 80561 92993 131826 6731 -205488 -321809
18764 -321809 -179005 -52432 -364270 -121269 262463 -44880 -93920 213361 307817 116782
$$ packed form
18845a10064M6474j51552A56807A7967i7020l7236N6460j64805h4658k41511a55698
18833H0415a9753k30303C3478J6857i6268q3424j41678P373J23240K0507B55657
18821B02322a62975q5158N4048K159B4300a38638B31440a13963j76625a32650
18810d54191E7859P1510N1063G5240R7092b10245E8834b3252j94272A02606Q6857
18799A89463b810E6332J13295b76564B30587K25730B7266K33f0383j76939C47014
18787C1919K38676a41846A98437p0876B3437J3606a56640M8163B812K7493g7906
18775a1417r6010A13789i3137a4888l55931H0561J2432L8833F731b05488j16321
18764c21809J42804e2432l11838a21269B62463d4880m9040B13361R4456A16782
$$ plain form
18753 111414 -120629 -217538 -304736 -413463 -15652 -340475 -98276 -81472 -298784 -329182 104398
18741 -435902 29187 -91042 -144833 -339175 -40397 44538 -122924 -196225 193602 78724 194663
18730 194663 370169 85547 -195294 188532 268726 -178418 204938 932 120109 -712530
18719 -230161 -56216 -227623 -117189 -78451 -415711 -140319 25117 -75284 -290388 240668
18708 236234 -237137 76663 -50903 47368 -340580 -137076 155368 -61722 -75713 -269213
18698 -269213 -254975 -52604 -146425 -134099 -32888 -791 127480 -16574 -43333 -283649 -35413
18686 -34511 26764 134552 5199 -235015 -126762 -148016 132077 -168352 -109383 -198413 -344992
18675 -344992 67276 -421555 29986 -100452 -264102 -105292 81487 -329271 -147347 -248761
$$ packed form
18753A11414a20629r6909q7198j08727a5652l24823i8276J6804k17312l0398A04398
18741d35902B9187i1042n3791j94342d0397D4538a22924p3301A93602G8724J15939
18730A94663J75506H5547a95294A88532Q0194a78418B04938I32J19177g12530
18719b30161e6216j71407J10434L8738l37260a40319B5117g5284k15104B40668
18708B36234b37137G6663e0903D7368c40580a37076A55368f1722j3991j93500
18698b69213J4238e2604r3821J2326c2888g91A27480a6574k6759k40316c5413
18686c4511B6764J07788E199b35015J08253k1254A32077a68352N8969q9030j46579
18675c44992F7276d21555B9986a00452j63650a05292H1487c29271a47347j01414
$$ plain form
18665 -248761 -240646 230607 91331 -156174 -190286 -108290 53539 165840 -50020 -119011 -404319
18654 -404319 -151554 -434363 -17011 75926 -122770 246049 245398 -79282 -103425 203443 -208253
18642 49496 -226190 -83658 69104 -173572 -96895 -122717 -109122 -74188 371323 -238304 -20356
18630 -8149 57646 -94978 -340946 -39333 -110516 -161682 -210407 194254 156659 -216776 29947
18618 -330798 -370512 62555 -56276 -116987 219360 73859 -42696 -144858 7631 -34263 -158864
18607 -158864 64485 -438431 98742 100043 -345638 -476399 88479 178885 -123241 -15171 -181447
18596 -181447 -244122 -26719 122125 -129856 -342473 94395 -351403 -316668 225806 -117572
18585 -144673 -349767 -250244 -248854 -234715 -33459 10179 -253630 -59854 32853 -86414 -62198
$$ packed form
18665b48761Q115B30607I1331a56174l4112Q1996E3539J12301e0020o8991k85308
18654d04319a51554k82809a7011G5926a22770B46049o51g9282k4143B03443b08253
18642D9496b26190h3658F9104a73572P6677k5822J3595L4934C71323b38304b0356
18630h149E7646i4978k45968c9333p1183n1166m8725A94254l7595b16776B9947
18618c30798l9714F2555e6276o0711B19360G3859d2696j02162G631c4263j24601
18607a58864F4485d38431I8742J301c45638j30761H8479R0406a23241a5171j66276
18596a81447o2675b6719A22125a29856k12617I4395c51403L4735B25806a17572
18585a44673k05094R9523J390J4139c3459A0179b53630e9854C2853h6414K4216
$$ plain form
18574 -62198 194462 -95928 -115159 107871 20801 69865 -87215 66928 -274337 80188 -65101
18562 142564 -324484 -35979 144970 391499 282651 34974 -99852 -502755 -125727 -36870
18551 83806 -116558 29624 -245271 -51728 210182 -160309 199800 -4346 116893 -188689
18540 -158942 106758 -81791 -34851 -288376 -36346 85617 221984 217149 -104105 3889 173692
18529 173692 134177 68950 -472753 -197994 156983 65113 -329655 -94889 -89760 -134169 118208
18517 42576 -23741 -77787 107237 -256430 -399587 143492 222248 -109512 -42491 -77458 123628
18505 -268619 -38236 42940 53002 -3103 -93881 44169 -31325 -121275 8972 -142783 47894 214862
18493 214862 -9164 210423 187454 -3942 -196316 -100271 -231883 51211 -104828 32953 -23069
$$ packed form
18574f2198A94462i5928j9231A07871B0801M9064h7215F6928b74337H0188f5101
18562A42564c24484c5979A44970K46529j08848C4974i9852m02903a25727c6870
18551H3806a16558B9624b45271e1728B10182a60309A99800d346A16893a88689
18540a58942A06758h1791c4851k53525c6346H5617J36367m835a04105C889J69803
18529A73692l9515o5227d72753a97994A56983F5113c29655i4889N129m4409A18208
18517D2576b3741n4046A07237b56430j43157A43492P8756a09512d2491l4967A23628
18505b68619c8236D2940J0062c103r0778D4169c1325q9950H972a42783D7894J66968
18493B14862i164B10423k2969c942j92374R6045j31612E1211a04828C2953b3069
$$ plain form
18481 -350254 -163545 14662 268533 -164391 -124548 164467 -346398 216590 -225826 -249300
18471 -249300 -103619 23917 -35914 -133494 -280059 8660 -98602 -335682 -339433 -88083 -420592
18460 -420592 -211001 273447 114859 101423 -212365 -43009 -234895 177837 20955 -4012
18449 -118875 96209 -110899 -129575 -81235 -17421 123992 -124618 -224933 -129126 -186324 -210550
18438 -210550 67556 136102 40228 101959 -82848 -180133 111464 49593 -78664 -133717 259046
18426 -80623 6690 -251996 -3587 -76718 -212397 187665 181807 -64961 33288 -1649 -41834 -41096
18414 -41096 -370567 -212650 151568 134403 -239321 -434536 56491 184034 -66098 -197921
18404 -197921 146350 -154532 -277220 89291 50554 169991 -118000 45256 185567 -314355
$$ packed form
18481c50254a63545A4662K53871a64391L9843A64467c46398B16590b25826k3474
18471b49300a03619B3917c5914r7580j46565H660i8602k37080l751h8083l32509
18460d20592K09591B73447A14859j3436b12365d3009j91886A77837B0955d012
18449a18875I6209a10899j8676M8340a7421A23992a24618j00315R5807n7198k4226
18438b10550F7556O8546D0228O1731h2848r7285A11464D9593g8664n5053B59046
18426h0623F690b51996c587p3131j35679A87665n858f4961C3288a649m0185P38
18414d1096l29471J57917A51568j7165b39321j95215E6491J27543f6098j31823
18404a97921A46350a54532j22688H9291l8737J19437a18000D5256J40311c14355
$$ plain form
18393 -105620 -245777 -27282 -93887 166937 -357235 30290 108544 -8404 222835 278606 -313919
18381 74444 102835 -257219 66391 -152590 -51251 87728 121826 -40191 76758 198494 146095
18370 146095 -208103 23885 73239 -231582 -260002 -13812 -65835 -203759 102876 -115290
18359 -130506 112308 66920 233837 -157480 139342 121858 -12187 138686 83381 -145354
18348 239610 145349 135627 203228 -4657 114121 -343573 -381621 43828 -194842 199975 66918
18336 -138032 64696 -197080 -245838 -44684 -466229 -33787 -351750 -223832 3401 113662 -302781
18324 -86187 -55192 -120936 -228192 23320 119223 239943 407181 -63004 154243 -382469 60450
18312 86169 -9385 -118370 73317 51284 81994 236161 212435 52786 -13756 162976 -220155
$$ packed form
18393a05620j40157b7282o6605A66937c57235C0290P8254h404B22835N5771c13919
18381G4444K8391b57219F6391a52590e1251H7728L4098d0191G6758J21736n2399
18370A46095b08103B3885M9354b31582k8420a3812n2023j37924A02876a15290
18359a30506A12308m5388J66917a57480A39342j7484a2187A38686n5305a45354
18348B39610r4261r722O7601d657A14121c43573l8048D3828a94842A99975F6918
18336a38032F4696a97080m8758d4684m21545c3787l17963J27918C401J10261c02781
18324h6187L0995o5744j07256B3320R5903J20720J67238f3004A54243c82469F0450
18312H6169i385j08985G3317k2033L0710J54167k3726E2786a3756A62976b20155
$$ plain form
18300 -134160 144537 298938 76794 -40889 16067 137814 -495336 -307814 -30089 95841
18289 -225773 -229721 -23629 30623 272278 -129626 -71555 17057 -19730 -176749 8009 201238
18278 201238 228049 -331936 -16537 -101559 -153963 -225607 -40973 50784 -188068 84403 250425
18267 250425 -88454 119356 169344 -73502 -20566 105567 -179471 62685 54374 -101369 38333
18255 -41105 -119178 94254 -18663 -149276 9098 46259 -201542 -299478 -63555 -21935 226408
18243 -117373 134281 -38724 37367 -32814 163849 28106 138448 -299620 120453 -66508
18232 -238126 101802 -79835 300316 -335563 -20065 -141921 -72296 -146106 -238656 -107243
18221 -82253 -92226 -68974 -74006 -241561 -89274 -233247 -89850 -221553 208242 49583 161540
$$ packed form
18300a34160A44537J54401G6794d0889A6067J21747d95336J87522c0089I5841
18289b25773l948b3629C0623K41655a29626N8071A7057a9730j57019H009J93229
18278B01238K6811c31936a6537q5022n2404p1644d0973E0784a88068H4403J66022
18267B50425h8454A19356M9988g3502b0566A05567a79471F2685q311a01369C8333
18255d1105p8073I4254a8663j30613I098L7161b01542r7936f3555b1935B26408
18243a17373A34281c8724C7367c2814A63849B8106J10342b99620A20453f6508
18232b38126A01802g9835C00316c35563b0065j21856O9625p3810r2550a07243
18221h2253r973K3252n032j67555h9274j43973h9850j31703B08242D9583J11957
$$ plain form
18210 161540 19691 47527 78474 419447 223104 -119348 -50912 -118916 -101434 -144948 -381131
18199 -381131 -91292 -71957 108519 229959 270045 -139341 24424 -76694 147771 -236338
18188 889 4488 12006 152786 -309860 -327130 -197381 120932 -205643 -120553 162401 -421765
18176 79349 143193 140541 -349794 69250 -114042 123815 -70356 -365316 -15957 -109792 -84237
18165 -84237 -307212 -122048 -56271 86473 186304 -21772 19278 369087 -301048 241046 -125874
18153 -187716 -127153 107039 159151 55240 -127010 -482731 300522 -301058 -36239 49162
18142 -114185 -33290 -82131 -205850 -448998 167832 112133 54195 241646 236326 188420 -204399
18130 -34558 -76163 -126801 -325081 -99760 399809 132278 151428 69364 -33926 24722 -122450
$$ packed form
18210A61540A9691K7836L0947L40973j96343a19348e0912o8004J7482m3514k36183
18199c81131i1292J9335A08519J21440M0086a39341B4424g6694A47771b36338
18188H89L599P518J40780c09860j7270J29749A20932b05643Q5090A62401d21765
18176G9349O3844k652c49794F9250a14042A23815g0356k94960a5957r3835K5555
18165h4237k22975a22048e6271H6473R9831b1772A9278L49809c01048B41046a25874
18153a87716O0563A07039N2112E5240a27010l55721C00522c01058c6239D9162
18142a14185c3290m8841j23719k43148A67832n5699E4195J87451n320m7906b04399
18130c4558m1605n0638j98280i9760C99809A32278J9150F9364c3926B4722a22450
$$ plain form
18118 -66622 -427674 99403 -511671 85371 85140 -7354 310647 -112628 -194776 -158292 41835
18106 -42349 -69976 -77418 54542 -117062 199143 -321927 208146 109655 -349464 31057 -227395
18094 249356 -118894 101612 -98885 207854 108065 -53814 -102915 3152 -16788 -11122 -16244
18083 -16244 -451516 -89362 111550 -245827 80750 237612 -79102 29198 -3789 -68033 -220609
18072 -220609 8232 -132816 -64959 -146195 -100595 -27881 -178659 272559 -167446 27491 -278482
18060 241621 -50158 -198273 46481 3873 76977 27848 196296 -116956 -609070 178497 51074
18048 -278550 -143259 -117427 1410 -163114 -331562 -42830 69297 63987 231746 -145531 199449
18036 65442 -172684 101232 96005 16857 122902 228083 -37504 261810 189172 49254 181935
$$ packed form
18118f6622l61052I9403e11671H5371k31g354C10647a12628q2148L6484D1835
18106d2349k7627p442E4542a17062A99143c21927B08146r8491c49464C1057b27395
18094B49356a18894A01612i8885B07854r9789e3814m9101C152a6788N666n122
18083a6244m35272h9362A11550b45827H0750J56862g9102B9198c789o4244j52576
18072b20609H232a32816f4959q1236M5600b7881j50778B72559a67446B7491b78482
18060B41621e0158j48115D6481C873P3104B7848J68448a16956m92114A78497E1074
18048b78550J35291K5832A410a63114j68448d2830F9297n310J67759a45531A99449
18036F5442a72684A01232n227A6857J06045J05181c7504B61810p2638D9254J32681
$$ plain form
18025 181935 79147 40594 -21691 -210536 -174289 138197 1976 183491 36500 267402 90622
18013 258464 20139 157905 81195 -106300 -252116 107525 -87394 -370049 -308509 138555
18002 -20353 343695 -218251 -191975 73314 75623 321498 153990 27928 113127 370432 -81258
17990 -80300 -156202 286164 -368438 -76525 174027 9177 -121147 261060 312454 -172653 17702
17978 -238139 317048 -196616 153923 -69809 144206 128270 -80224 278223 41540 -121159
17967 -10810 -163423 119458 -215029 397506 -187722 90978 196588 -176755 -101576 161145
17956 289994 -239774 -82646 -197738 143527 -125119 141948 -253203 155272 100498 221899
17946 221899 -20261 16159 -357628 93792 -176043 -44815 91392 -66039 -329643 144000 48177
$$ packed form
18025A81935G9147l8553b1691j88845L6247A38197A976J81515C6500K30902I0622
18013B58464B0139J37766p6710a06300j45816A07525h7394k82655O1540A38555
18002b0353C43695b18251K6276G3314K309K45875A53990B7928Q5199K57305h1258
17990h0300p5902B86164c68438g6525A74027I177a21147B61060N1394a72653A7702
17978b38139C17048a96616A53923f9809A44206j5936h0224B78223D1540a21159
17967a0810j52613A19458b15029C97506a87722I0978J05610a76755P5179A61145
17956B89994b39774h2646j15092A43527a25119A41948b53203A55272n4774J21401
17946B21899b0261A6159c57628I3792a76043d4815I1392f6039k63604A44000D8177
$$ plain form
17934 -413979 71241 316928 155923 -237629 -351306 -85669 127829 -179426 -166281 -223133
17924 -223133 -115971 43572 -173408 110921 81989 -73089 -225477 120300 18541 -124423
17913 -113947 47898 143519 -183853 -21203 64939 35347 -36738 -37588 -89333 -1021 184088 312392
17901 312392 -71806 142954 237647 97155 79845 -146076 -309589 24464 -133 -18085 -28244
17890 -28244 -91789 -37766 -38985 -157616 -271159 -55152 39317 247548 -44214 -57707 -5667
17878 120536 516251 195857 134292 -147408 68979 -52079 69850 7096 7680 -85426 42525
17866 137741 82370 -63907 -99078 180823 191110 81086 -84013 61271 -301344 -77959 -18647
17854 -164733 -12172 -104150 -315604 148244 370575 173719 224036 261264 132280 257537
$$ packed form
17934d13979G1241K45687A55923b37629j13677h5669A27829a79426J3145n6852
17924b23133J07162D3572a73408A10921k8932g3089j52388A20300A8541a24423
17913a13947D7898R5621a83853b1203F4939k9592c6738q50n1745a021A84088J28304
17901C12392g1806A42954R4693I7155j7310a46076j63513B4464a33j7952j0159
17890b8244o3545c7766j219j18631j13543e5152C9317K08231d4214j3493e667
17878A20536L95715A95857o1565a47408F8979e2079F9850G096N84h5426D2525
17866A37741n5371f3907l5171A80823J0287H1086h4013F1271c01344g7959a8647
17854a64733a2172r1978k11454A48244K22331A73719N0317L7228j28984J25257
$$ plain form
17844 257537 -81284 70787 408541 -360340 223176 356970 83254 -117153 13085 -4346 17770
17832 -267414 -269315 332420 142970 -44706 -178957 68901 19862 133402 -41690 66489 90527
17821 90527 -29125 -4683 -49633 204428 208170 117151 101339 299169 298758 -198545 -63643 72233
17808 -48692 -23775 71684 33224 -43504 -68500 125028 -352776 196594 58783 186609 53928
17796 117858 80270 135349 95425 -128016 -51320 96910 132213 426269 -134488 156256 -61230
17784 220590 66347 -256604 359231 128372 -207831 322705 150039 -54100 -364992 132703
17773 221720 -289909 -211719 93896 -38553 124242 78872 -243333 63394 198390 -242584
17762 -37587 -121289 154639 162278 106459 -247278 -8485 253907 226151 77067 -55929 89729
$$ packed form
17844B57537h1284G0787L37754c60340B23176J33794H3254a17153A3085d346A7770
17832b67414j901C32420A42970d4706j34251F8901A9862J13540d1690F6489K4038
17821I0527b9125d683m4950B04428L742r1019j5812J97830m11a98545f3643G2233
17808d8692b3775G1684C3224d3504k4996A25028c52776A96594E8783J27826E3928
17796A17858l7588N5079l9924a28016e1320I6910L5303K94056a34488A56256f1230
17784B20590F6347b56604C59231A28372b07831C22705A50039e4100l10892A32703
17773B21720b89909P8190I3896c8553A24242m5370b43333F3394J34996b42584
17762c7587q3702A54639P639n5819b47278h485B53907k7756G7067e5929H9729
$$ plain form
17750 -43369 319214 47443 29014 80358 -163306 -81914 181542 404022 112398 -15838 152249
17738 -111443 -12171 -58898 303539 177829 -22388 16338 247836 -43255 -118625 260205 35415
17726 111390 36413 165092 -60912 71940 350336 104612 263751 199052 203049 -246168 303488
17714 201952 87485 47625 -57864 38269 -24936 -141633 209084 289091 158458 159192 -175513
17702 -120500 50324 -175435 -181821 118929 340755 -255709 -59713 78630 47965 -44815 -126345
17691 -126345 -127610 43812 -1949 -30285 -226873 258942 241546 179174 55920 253215 917 429689
17679 429689 -19851 139398 87548 -258200 -8320 17025 456503 28254 85852 -134161 70339
17667 -79103 406 136388 -180349 -61653 -44667 415475 -127770 58964 230435 241170 119
$$ packed form
17750d3369C19214D7443j8429N1344a63306Q1392A81542K22480A12398a5838A52249
17738a11443a2171m6727C03539j25710b2388A6338K31498d3255p5370B60205C5415
17726A11390C6413J28679f0912G1940K78396A04612J59139o4699L997b46168C03488
17714B01952H7485l9860e7864C8269b4936j16697B09084Q0007j30633P34a75513
17702a20500E0324a75435o386A18929K21826b55709e9713G8630l0665d4815q1530
17691a26345j265D3812a949k8336j96588B58942j7396o2372E5920J97295I17M28772
17679D29689a9851A39398n1850b58200h320A7025M39478B8254N7598a34161G0339
17667g9103D06J35982a80349f1653J6986D15475a27770E8964J71471J0735A19
$$ plain form
17655 217963 100796 39518 411733 73741 -255092 92896 -119042 17791 393993 4505 -175852
17643 -58503 -10046 444785 270079 412546 80390 184769 -118723 144356 -136500 154359
17632 596777 -17941 77326 -112377 245553 336913 5286 191421 173952 44321 -66735 -187926
17621 -187926 30294 172595 -327443 139982 25823 63103 -60577 81844 -30754 -54323 -60586
17610 -60586 170410 243557 454102 410663 91521 26825 102542 357366 -263476 323545 188367
17599 188367 -32951 61954 -51529 86166 375898 160967 -96163 -175846 231770 378249 248272
17588 248272 117296 24836 300482 -251207 -39839 126037 10379 42717 89945 -56816 10764
17576 -121739 21260 230978 165956 -181810 172750 -108712 75445 263333 228863 -75714
$$ packed form
17655B17963A00796C9518L72215G3741b55092I2896a19042A7791L76202D505a75852
17643e8503a0046D44785j74706J42467H0390J04379a18723A44356a36500A54359
17632E96777a7941G7326a12377B45553R1360E286J86135j7469D4321f6735j21191
17621a87926C0294J42301c27443A39982B5823L7280f0577H1844c0754k3569o263
17610f0586A70410P3147K10545m3439I1521B6825P5717K54824b63476C23545j35178
17599A88367c2951F1954e1529H6166K89732A60967i6163p9683B31770J46479j29977
17588B48272A17296B4836K75646b51207c9839A26037A0379L2338M7228e6816A0764
17576a21739B1260K09718o5022a81810A72750a08712G5445J87888l4470g5714
$$ plain form
17565 -77391 -528428 258376 -93603 -58304 -70129 21629 -68685 261363 355916 8557 506540
17554 506540 -392172 79765 -29698 305804 220877 109522 125117 310255 172910 125357
17544 125357 -85 104962 -87355 311213 191046 -217251 96501 372261 -54410 -16229 222438
17532 19325 -237318 271307 247060 539080 114276 272593 58236 392802 297008 138356
17521 15934 422411 314536 -205553 23801 265003 464578 317424 248809 500454 643743
17511 643743 577743 893206 972783 781540 635936 634469 479295 727119 184859 360467
17501 360467 432125 365170 516884 798222 769749 1082281 1000144 718140 901681 751316
17491 751316 693736 594835 484856 376491 -62940 473448 145500 -83474 165935 266108
$$ packed form
17565g7391m51037B58376i3603L5299j1825B1629f8685B61363R4553H557M97983
17554E06540c92172G9765b9698C05804q4927A09522J5595J85138j37345m7553
17544A25357h5A04962h7355C11213j20167b17251I6501K75760e4410a6229B22438
17532A9325b37318B71307k4247K92020A14276J58317E8236L34566r5794A38356
17521A5934M06477j07875b05553B3801K41202J99575j47154o8615K51645J43289
17511F43743o6000L15463P9577j91243j45604j467j55174K47824A84859J75608
17501C60467P1658o6955J51714K81338k8473L12532q2137k82004J83541j50365
17491G51316n7580r8901j09979j08365f2940D73448A45500h3474A65935J00173
$$ plain form
17481 266108 60017 217437 202668 72025 354944 437805 335662 -74952 239202 156405 266224
17470 266224 422271 277484 511989 138833 64154 389089 106235 293903 124196 190691
17460 190691 229512 327136 296783 49689 135142 -69999 309388 99351 175811 264651 72284
17448 15198 74857 348951 71775 264020 355677 392008 100091 345853 4776 186142 315311
17437 315311 618221 420885 369045 280744 514879 471036 658008 352748 228703 9631
17426 618551 142400 321553 260997 481716 70948 306880 415241 396415 500025 694354
17416 694354 331378 235788 352857 218521 253731 430721 575067 112651 282513 600344
17406 600344 340722 389442 379440 177559 314735 473476 186044 522078 377731 243433
$$ packed form
17481B66108F0017J57420j4769G2025K82919Q2861j02143g4952B39202q2797J09819
17470B66224J56047j44787K34505A38833F4154L24935A06235J87668A24196O6495
17460A90691L8821R7624l0353D9689Q5453f9999C09388I9351P6460Q8840G2284
17448A5198N9659K74094G1775J92245R1657L6331A00091K45762D776J81366J29169
17437C15311L02910j97336n1840q8301K34135m3843J86972l05260j24045I631
17426F18551A42400J79153o0556K20719G0948K35932J08361j8826J03610J94329
17416F94354C31378r5590J17069j34336L5210J76990J44346A12651J69862L17831
17406F00344k59622M8720j0002A77559J37176J58741A86044L36034j44347j34298
$$ plain form
17396 243433 133495 299273 477867 269236 -55830 214056 154374 407612 251182 393907
17386 393907 115430 68140 370398 176630 274288 -78759 558746 426221 101673 243066
17376 243066 10375 67758 173851 286386 66559 50918 94572 224366 64719 415614 517642
17365 517642 132687 220617 98712 93484 284531 212277 379423 436746 191413 42678 212578
17354 212578 341106 94473 451785 449800 216712 27381 272727 332211 234205 219528 88215
17342 54198 15010 10540 162655 -110026 189574 244604 285044 212529 629146 30336 220961
17331 220961 272185 135094 278828 -84027 524610 232734 197147 301080 242679 228063
17321 228063 -121199 44420 69657 129312 520244 -16659 92047 157814 17288 388342 -62409
$$ packed form
17396B43433j09938J65778J78594k08631e5830B14056n9682K53238j56430J42725
17386C93907A15430m7290L02258A76630R7658g8759E58746j32525A01673J41393
17376B43066A0375N7383J06093J12535F6559j5641M3654J29794F4719L50895J02028
17365E17642A32687Q7930I8712n228J91047p2254J67146N7323A91413D2678J69900
17354B12578J28528I4473L57312j985B16712B7381K45346N9484r8006j4677H8215
17342E4198A5010m470J52115a10026A89574N5030M0440p2515M16617C0336J90625
17331B20961N1224A35094J43734h4027E24610B32734l5587J03933n8401j4616
17321B28063a21199D4420K5237N9655L90932a6659I2047O5767A7288L71054f2409
$$ plain form
17309 322640 252391 363418 251216 328959 174374 670591 444911 67146 192086 541163
17299 541163 390756 338121 228709 338944 544010 302403 -21843 82923 113951 328359
17289 328359 179777 211185 330513 510713 328339 108704 147059 270491 415568 -85991
17278 327317 293326 136888 267394 455581 352000 387574 359574 170935 344564 109065
17267 396759 272675 183265 478947 162766 538991 235525 480338 377017 502864 318266
17257 318266 367796 551940 413583 207633 197068 113310 338475 -71844 234610 282220
17247 282220 436440 199868 268838 297051 269329 87305 328595 290268 617468 233029
17236 484332 694750 271584 320581 517730 -103173 513633 593785 29956 323839 299210
$$ packed form
17309C22640p0249J11027j12202P7743j54585M96217k25680F7146J24940L49077
17299E41163j50407n2635j09412J10235K05066k41607b1843H2923L1028K14408
17289C28359j48582L1408J19328J80200j82374A08704L8355J23432J45077h5991
17278C27317l3991A36888J30506J88187j03581L5574k8000A70935J73629A09065
17267C96759j24084q9410K95682A62766L76225B35525K44813j03321J25847j84598
17257C18266M9530J84144j38357k05950j0565q3758K25165g1844B34610M7610
17247B82220J54220A99868O8970K8213k7722H7305K41290l8327L27200B33029
17236D84332K10418B71584M8997J97149a03173E13633Q0152B9956K93883k4629
$$ plain form
17226 299210 368006 159097 326475 72599 357190 330894 405231 470520 218703 603099
17216 603099 377942 731168 389427 -65221 307245 256641 484070 635233 477751 232730
17205 518297 148152 601068 171670 475666 601388 520457 612547 314554 177235 480492
17195 480492 131235 610917 486673 559234 700145 95189 488201 585655 262398 326914
17185 326914 490897 611127 528536 558525 408733 629248 385782 171491 200431 380808
17175 380808 202917 430885 421745 364642 485763 375869 298129 653089 323217 286813
17165 286813 437245 437591 146972 538560 318016 337141 157612 733725 562156 455413
17155 455413 411452 459511 616599 513482 588548 470096 335363 173197 630279 610190
$$ packed form
17226B99210O8796A59097J67378G2599K84591k6296P4337O5289B18703L84396
17216F03099k25157L53226l41741f5221C07245n0604K27429J51163j57482B32730
17205E18297A48152M52916A71670L03996J25722q0931R2090k97993j37319L03257
17195D80492A31235M79682j24244P2561J40911I5189L93012R7454B62398O4516
17185C26914J63983J20230q2591K9989j49792K20515k43466A71491K8940J80377
17175C80808j77891K27968r140n7103J21121j09894p7740L54960C23217l6404
17165B86813J50432L46A46972L91588k20544J9125A57612N76113j71569j06743
17155D55413m3961M8059J57088j03117P5066j18452j34733j62166M57082k0089
$$ plain form
17145 610190 249180 681933 326041 426860 701209 547518 405972 368248 379097 836560
17135 836560 543574 430584 235219 561993 623852 444920 589918 762265 451995 606325
17125 606325 559373 655527 691861 356187 442205 502903 554239 648817 548458 421945 752898
17114 752898 525936 709869 323683 193165 381406 506937 706186 878429 457133 302912
17104 302912 575611 539391 608399 497591 664765 690104 637436 677117 521601 741717
17094 741717 463219 858043 314917 307835 806708 878133 702621 452756 655036 626137
17084 626137 689417 571606 631658 627976 692613 997153 639910 661851 977375 524247 379607
17073 379607 846884 931180 804154 735576 581268 460077 697251 784706 763176 363184
$$ packed form
17145F10190B49180M32753C26041J00819K74349j53691j41546l7724J0849M57463
17135H36560k92986j12990j95365L26774O1859j78932J44998J72347l10270J54330
17125F06325m6952R6154L6334l35674Q6018O0698N1336R4578j00359j26513L30953
17114G52898k26962J83933C23683j30518J88241J25531J99249J72243m21296j54221
17104C02912K72699l6220O9008j10808J67174K5339n2668L9681j55516K20116
17094G41717k78498L94824C14917p082M98873P1425j75512k49865K02280k8899
17084F26137O3280j17811O0052l682O4637L04540l57243K1941L15524m53128j44640
17073C79607M67277Q4296j27026o8578j54308j21191K37174Q7455k1530C63184
$$ plain form
17062 537336 818052 824437 425762 660050 664501 650423 673180 715483 443540 925929 510456
17051 510456 489517 938538 668987 1009617 959977 495057 943829 737076 778682 703871
17041 703871 888623 820028 845874 687930 745600 997148 990488 873353 777680 805205 770442
17030 770442 790292 816971 710440 687421 1102432 925474 935067 814556 821616 1075284 831124
17019 831124 885041 1051873 878954 903281 930658 785439 1183189 1158349 921259 1385981
17009 1385981 1371530 1315846 1054942 1142771 1036454 1088317 1125205 1110681 1243676 1345516
16999 1345516 846030 1018749 1162228 1102176 1112715 1321334 691903 1017711 904897 914860
16989 914860 1039034 939794 1179941 1145249 847105 1176963 1173405 1519604 1105702 1073289
$$ packed form
17062E37336K80716O385l98675K34288M451j4078K2757M2303k71943M82389m15473
17051E10456k0939M49021k69551L40630m9640m64920M48772k06753M1606p4811
17041G03871J84752o8595K5846j57944N7670K51548o660j17135r5673K7525l4763
17030G70442J9850K6679j06531k3019M15011j76958R593j20511P060K53668k44160
17019H31124N3917J66832j72919K4327K7377j45219L97750k4840k37090M64722
17009A385981j4451n5684k60904Q7829j06317N1863L6888j4524J32995J01840
16999A345516m99486J72719J43479o0052J0539K08619o29431L25808j12814R963
16989I14860J24174r9240K40147l4692k98144L29858l558L46199m13902l2413
$$ plain form
16979 1073289 1628877 1671202 1189500 1293472 1113648 1381568 930388 1393658 1279825 1071285
16969 1071285 1197575 1276010 1143785 1237657 1312038 1556930 1256175 1309107 1270643 1237759
16959 1237759 1504014 1409726 1225993 1413713 1411034 1195167 1248929 1262534 1258723 1541787 1754492
16948 1754492 1520539 1282931 1562732 1509855 1422183 1927286 1540764 1877470 1617004 1713571
16938 1713571 1496989 1438570 1673315 1685781 1664055 1835453 1691801 1590114 1743435 1505284
16928 1505284 1676081 1702844 1991365 1820550 1665814 2037214 1978259 1749583 1681729 1803570
16918 1803570 2161129 1998066 1718063 1756964 2126233 1967627 1720876 2236349 2029091 2457692
16908 2457692 2245753 2288374 2174089 1763515 2472656 2265282 2311582 2260845 2767707 2356004
$$ packed form
16979A073289N55588M2325m81702J03972j79824K67920m51180M63270j13833k08540
16969A071285J26290P8435j32225R3872P4381K44892l00755N2932l8464l2884
16959A237759K66255r4288j83733J87720k679k15867N3762J3605l811K83064K12705
16948A754492k33953k37608K79801n2877q7672N05103l86522L36706k60466R6567
16938A713571k16582n8419K34745J2466k1726J71398j43652j01687J53321k38151
16928A505284J70797K6763K88521j70815j54736L71400n8955k28676o7854J21841
16918A803570L57559j63063k80003L8901L69269j58606k46751N15473k07258M28601
16908B457692k11939M2621j14285m10574P09141k07374M6300n0737N06862m11703
$$ plain form
16898 2356004 2525495 2493165 2373672 2476833 2380361 2767474 2409120 2328529 2674498 2154287
16888 2154287 2861448 2696324 2626138 2784575 2386794 2568106 2947828 2720689 3089068 2714805
16878 2714805 2871480 2906892 2962872 3140434 2873907 3324422 2774415 2998569 3475172 3023429
16868 3023429 3203711 3423205 3366020 3537936 2954831 3674791 3317408 3588023 3842137 3286876
16858 3286876 3735555 3763579 3728631 3670722 3922367 4024702 4067524 3968203 4317244 4074744
16848 4074744 4255301 4545424 4209430 4382520 4417012 4606598 4720353 4763683 4689004 4793926
16838 4793926 4803173 4952217 5185520 4919680 5246234 5082652 5416392 5351685 5376353 5610267
16828 5610267 5805347 5718021 6111174 5834459 5563909 5808326 6104207 6291029 6735974 6582523
$$ packed form
16898B356004J69491l2330j19493J03161r6472L87113l58354q0591L45969n20211
16888B154287P07161j65124p0186J58437l97781J81312L79722k27139L68379l74263
16878B714805J56675L5412N5980J77562k66527M50515n50007K24154M76603m51743
16868C023429J80282K19494n7185J71916n83105P19960l57383K70615K54114n55261
16858C286876M48679K8024l4948n7909K51645J02335M2822r9321L49041k42500
16848D074744J80557K90123l35994J73090L4492J89586J13755M3330p4679J04922
16838D793926R247J49044K33303k65840L26554j63582L33740o4707K4668K33914
16828E610267J95080q7326L93153k76715k70550K44417K95881J86822M44945j53451
$$ plain form
16818 6582523 6672978 6905097 6668439 6898507 7077573 7370960 7281875 7515810 7678046 7832853
16808 7832853 8176913 8065826 8022521 8542692 8363997 8874911 8754489 9122659 9223678 9587117
16798 9587117 9659973 10021618 10054711 10162068 10358182 10863195 11056511 11083335 11556626 11637064
16788 11637064 12222525 12161621 12451231 12819132 13009841 13344088 13615169 14374819 14450104 14929546
16778 14929546 15223614 15854796 16001747 16285667 16557010 16793270 17581721 18327058 18466136
16769 18466136 19136654 19708928 19922342 20463105 21218905 21698857 22539169 23016695 24133039
16760 24133039 24846597 25243634 26237041 27217153 27954153 28621602 29759863 30482817 31858916
16751 31858916 32727131 33947830 35354386 36539354 37724851 39047745 40524329 42120847
$$ packed form
16818F582523R0455K32119k36658K30068J79066K93387q9085K33935J62236J54807
16808G832853L44060j11087m3305N20171j78695N10914j20422L68170J01019L63439
16798I587117P2856L61645L3093J07357J96114N05013J93316K6824M73291Q0438
16788A1637064N85461o0904K89610L67901J90709L34247K71081P59650P5285M79442
16778A4929546K94068O31182J46951K83920K71343K36260P88451P45337J39078
16769A8466136O70518N72274K13414N40763P55800M79952Q40312M77526J116344
16760B4133039P13558L97037R93407R80112P37000O67449J138261P22954J376099
16751C1858916Q68215J220699J406556J184968J185497J322894J476584J596518
$$ plain form
16743 42120847 43739086 45352036 46989667 48829975 50789920 52980872 54753110 56860375
16735 56860375 59297601 61442757 64333009 66731161 69269121 72183671 75102945 77897411
16727 77897411 80963147 84068913 87262427 90421300 93702952 97132353 100536486 104135754
16719 104135754 107568667 110873057 113962478 117016324 119959140 122695617 125399342 127532213
16711 127532213 129655088 131427971 132701956 133965675 134386699 134574691 134188967 133712745
16703 133712745 132980945 131309474 129787688 127593406 125129701 122504229 119522706 116615236
16695 116615236 113713093 110186891 107006192 103513296 99801548 96515957 92963487 89575797
16687 89575797 86344268 83123938 79542089 76848989 73492545 70720489 68048700 65472631
$$ packed form
16743D2120847J618239J612950J637631J840308J959945K190952J772238K107265
16735E6860375K437226K145156K890252K398152K537960K914550K919274K794466
16727G7897411L065736L105766L193514L158873L281652L429401L404133L599268
16719A04135754L432913L304390L089421L053846K942816K736477K703725K132871
16711A27532213K122875J772883J273985J263719M21024J87992l85724m76222
16703A33712745p31800j671471j521786k194282k463705k625472k981523k907470
16695A16615236k902143l526202l180699l492896l711748l285591l552470l387690
16687H9575797l231529l220330l581849k693100l356444k772056k671789k576069
$$ plain form
16679 65472631 62667094 59878547 57553312 55570270 53282680 51202326 49168439 47356784
16671 47356784 45408083 43805438 42330256 40664571 39284391 37544424 36398164 35154724
16663 35154724 34055223 32631013 31736976 30307252 29095512 28453807 27793512 26859953 25448349
16654 25448349 25017631 24200141 23350683 22915385 22147196 21308258 21026494 19694349 19716788
16645 19716788 18766625 18624832 17854730 17153886 16682862 16380657 16058961 15575719 15317836
16636 15317836 14836797 14306556 14497095 13584293 13445316 13253160 12463253 12149331 12002431
16627 12002431 11971077 11361579 11210704 11187081 10947757 10722048 10507247 10079295 9693307 9254825
16617 9254825 9296483 9408560 8850673 9035115 8696117 8593089 8003294 7979035 8198297 7959850
$$ packed form
16679F5472631k805537k788547k325235j983042k287590k080354k033887j811655
16671D7356784j948701j602645j475182j665685j380180j739967j146260j243440
16663C5154724j099501j424210q94037j429724j211740o41705o60295r33559j411604
16654B5448349m30718q17490q49458m35298p68189q38938k81764j332145K2439
16645A9716788r50163j41793p70102p00844m71024l02205l21696m83242k57883
16636A5317836m81039n30241J90539r12802j38977j92156p89907l13922j46900
16627A2002431l1354o09498j50875k3623k39324k25709k14801m27952l85988m38482
16617I254825M1658J12077n57887J84442l38998j03028n89795k4259K19262k38447
$$ plain form
16607 7959850 7837817 7840373 7461840 7385689 7159341 7327621 7297425 6944810 6571849 6614770
16597 6614770 6136152 6405202 6171856 5966260 6125067 6102939 5579385 5677149 5563816 5366912
16587 5366912 5497930 5394857 5228263 5165048 5105361 5063133 4779097 4722997 4738741 4981030
16577 4981030 4652495 4504329 4816006 4366539 4310285 4163653 4528399 3992569 4343020 3842505
16567 3842505 3977629 3834421 3840548 3849259 3718476 3432349 3687264 3834841 3590729 3608346
16557 3608346 3153591 3713002 3470257 3327708 3421641 3177844 3207279 3177338 3384262 3335970
16547 3335970 3039046 3291417 2979167 2670658 2809238 2839658 2630160 2806933 3127966 2906139
16537 2906139 2608947 2516679 2460661 2863240 2711181 2468530 2375420 2376945 2706601 2674060
$$ packed form
16607G959850j22033K556l78533p6151k26348J68280l0196l52615l72961M2921
16597F614770m78618K69050k33346k05596J58807k2128n23554R7764j13333j96904
16587E366912J31018j03073j66594o3215n9687m2228k84036n6100J5744K42289
16577D981030l28535j48166L11677m49467n6254j46632L64746n35830L50451n00515
16567C842505J35124j43208O127Q711j30783k86127K54915J47577k44112J7617
16557C608346m54755N59411k42745j42549R3933k43797K9435k9941K06924m8292
16547C335970k96924K52371l12250l08509J38580L0420k09498J76773L21033k21827
16537B906139k97192r2268n6018M02579j52059k42651r3110J525L29656l2541
$$ plain form
16527 2674060 2437327 2293098 2129215 2202342 2300062 2058055 2484379 2324494 2265291 2067241
16517 2067241 1915477 2126172 2226959 2092651 2053456 1975698 2198268 1578514 2027610 1991105
16507 1991105 1832813 2022576 1900251 1863968 1643807 1932873 1622420 1703553 1726209 1872829
16497 1872829 1935609 1821692 1976651 1475604 1749660 1741471 1797376 1483445 1442113 1787429
16487 1787429 1612772 1339661 1602815 1665156 1601246 1586041 1742831 1666177 1659023 1530128
16477 1530128 1282843 1297483 1141543 1749037 985656 1412649 1560292 1568976 1462019 1333362
16467 1333362 1451640 985773 1262463 1388314 1440342 1390853 1492607 1507085 1206522 1227908
16457 1227908 1285616 1505278 1298370 1173914 1049563 1268277 1490730 1390068 1362230 1131874
$$ packed form
16527B674060k36733j44229j63883P3127R7720k42007M26324j59885n9203j98050
16517B067241j51764K10695J00787j34308l9195p7758K22570o19754M49096l6505
16507A991105j58292J89763j22325l6283k20161K89066l10453Q1133K2656J46620
16497A872829O2780j13917J54959n01047K74056q189N5905l13931m1332L45316
16487A787429j74657k73111K63154O2341o3910j5205J56790p6654p154j28895
16477A530128k47285J4640j55940O07494p63381M26993J47643Q684j06957j28657
16467A333362J18278m65867K76690J25851N2028m9489J01754J4478l00563K1386
16457A227908N7708K19662k06908j24456j24351K18714K22453j00662k7838k30356
$$ plain form
16447 1131874 890571 991589 1076526 863736 1330091 868685 996463 902701 965182 1316307
16437 1316307 1231221 1004288 819972 1030243 652864 1060617 1248246 990028 812783 711768
16427 711768 1042422 847789 716710 820302 1263648 807273 1348857 790895 734064 899062
16417 899062 685902 860781 921613 1234157 1233473 666896 952654 627864 855890 970697
16407 970697 779929 1018857 1311447 534438 917751 787971 1027503 857615 648592 935185
16397 935185 678058 1020616 644580 820473 797536 1007698 883985 591492 732937 936065
16387 936065 566307 770811 739452 972816 729845 556362 763492 747939 1038978 515286
16376 1084434 814494 714890 879858 624542 569192 950797 611540 765361 736050 886493
$$ packed form
16447A131874k41303J01018Q4937k12790M66355m61406J27778r3762O2481L51125
16437A316307q5086k26933j84316K10271l77379M07753J87629k58218j77245j01015
16427G11768L30654j94633j31079J03592M43346m56375N41584n57962n6831J64998
16417H99062k13160J74879O0832L12544o84n66577K85758l24790K28026J14807
16407I70697j90768K38928K92590E34438L83313j29780K39532j69888k09023K86593
16397I35185k57127L42558l76036J75893k2937K10162j23713k92493J41445K03128
16387I36065l69758K04504l1359K33364k42971j73483K07130j5553K91039E15286
16376A084434k69940r9604J64968k55316n5350L81605l39257J53821k9311J50443
$$ plain form
16366 886493 504992 649988 613392 699025 792098 669553 587314 692923 565950 666462
16356 666462 800838 608753 632977 558142 506706 556168 739814 581692 550111 585249 626742
16345 626742 758103 559235 554354 392945 445091 412016 454974 592628 827458 675550
16335 675550 782327 472410 417221 645686 439283 664142 391504 492055 683884 768328
16325 768328 335866 788481 281735 727369 521193 570956 546754 780406 785046 651831
16315 651831 251760 649211 492805 269341 599289 641959 395819 406892 309589 431102
16305 431102 90821 875098 558479 -46940 326653 263719 534480 574060 213757 483526
16295 483526 239656 394151 638831 187766 426065 379983 335729 507067 355920 542984
$$ packed form
16366H86493l81501J44996l6596Q5633R3073j22545q2239J05609j26973J00512
16356F66462J34376j92085K4224p4835n1436M9462J83646j58122l1581L5138M1493
16345F26742J31361j98868m881j61409N2146l3075M2958J37654K34830j51908
16335F75550J06777l09917n5189K28465k06403K24859k72638J00551J91829Q4444
16325G68328C35866M52615B81735M45634k06176M9763k4202K33652M640j33215
16315F51831B51760L97451j56406k23464L29948M2670k46140J1073r7303J21513
16305D31102I0821P84277l16619d6940C26653o2934K70761L9580B13757K69769
16295D83526B39656J54495K44680A87766K38299m6082m4254J71338j51147J87064
$$ plain form
16285 542984 271212 731828 250798 660482 341318 333798 402390 317685 494344 412528
16275 412528 280273 238635 165493 286759 412242 546064 298791 491629 325433 382020
16265 382020 389823 372362 170480 311628 442785 260953 190176 501912 640887 255749
16254 507316 197933 303249 377408 196810 577783 546509 389624 196245 354039 540302
16244 540302 327793 394026 440085 177072 388428 496247 438487 108962 378678 423274
16234 423274 179087 465144 559121 212964 273306 221776 157878 379595 446481 382206 242123
16223 242123 303675 271053 275522 226400 413453 320790 307829 311745 196469 328104 236383
16212 236383 452632 416454 496620 422060 -130507 581026 181741 95197 -36973 216382
$$ packed form
16285E42984B71212M60616B50798M09684l19164p520O8592q4705J76659q1816
16275D12528j32255m1638p3142J21266J25483J33822k47273J92838j66196N6587
16265C82020P803j7461A70480J41148J31157j81832p0777L11736J38975B55749
16254E07316A97933J05316P4159j80598L80973l1274j56885j93379J57794J86263
16244E40302k12509O6233M6059A77072K11356J07819n7760A08962K69716M4596
16234D23274A79087K86057R3977B12964O0342n1530o3898K21717O6886o4275j40083
16223B42123O1552l2622M469m9122J87053r2663j2961L916j15276J31635r1721
16212B36383K16249l6178Q0166p4560a30507E81026A81741q6544c6973B16382
$$ plain form
16201 29483 31618 -23221 -5151 173865 578321 108463 -86261 -71065 405841 172479 -124605
16189 220662 327711 158320 282600 1723 440210 406330 258163 364046 311454 259181
16179 259181 -92220 180930 209381 -86168 168873 -190930 -133407 263412 141001 149816 46121
16167 179430 562237 183634 81069 181650 370311 218951 214961 304556 285336 171946
16157 171946 360916 20647 135696 25197 -232310 29150 128830 295857 55201 359819
16147 359819 161716 26090 158556 -135253 158179 37293 -9285 170421 97700 364909
16137 364909 116752 395208 223223 69458 212533 326716 147272 169189 284667 287834
16127 287834 -36805 29307 92438 22906 -134164 188800 336684 -69594 130211 262761
$$ packed form
16201B9483K135b3221e151A73865M04456A08463h6261J5196D05841A72479a24605
16189B20662J07049A58320J24280A723M38487l3880j48167J05883n2592n2273
16179B59181i2220A80930K8451h6168A68873a90930N7523B63412j22411Q815D6121
16167A79430L82807A83634H1069J00581J88661j51360l990Q9595j9220j13390
16157A71946J88970B0647J15049B5197b32310B9150R9680J67027E5201L04618
16147C59819A61716B6090J32466a35253A58179C7293i285A70421p2721K67209
16137C64909A16752K78456j71985F9458J43075J14183A47272K1917J15478L167
16127B87834c6805B9307O3131B2906a34164A88800J47884f9594A30211J32550
$$ plain form
16117 262761 78715 141043 145801 -158944 165511 -117402 21402 151721 87514 298028 -83660
16105 173334 -318746 366824 -19565 -24787 13000 499681 156505 98113 252095 177714 26040
16093 232044 296102 -170953 189139 -65846 102430 -21536 61474 146969 133457 175731 158873
16082 158873 265939 1034 184469 -334605 238975 16684 198849 62514 526221 231954
16071 78113 -75971 185175 262210 253233 91829 -19194 -92590 -130221 -107547 28246 -75657 -17391
16058 -184991 -373512 134850 325183 146493 42326 411605 -13596 440239 101677 -10633
16047 -147743 116930 231217 359063 -95181 -391353 129198 24477 240153 -60804 -182997
16037 -182997 43032 -287382 -37617 81649 74960 189151 -142999 -12300 -250949 -29032 -77094
$$ packed form
16117B62761G8715O2328M758a58944A65511a17402B1402J30319o4207K10514h3660
16105A73334c18746C66824a9565n222A3000M86681A56505n8392J53982p4381B6040
16093B32044O4058a70953A89139f5846A02430b1536F1474Q5495j3512M2274j6858
16082A58873J07066A034J83435c34605B38975A6684J82165F2514M63707B31954
16071G8113g5971A85175P7035q977I1829a9194p3396l7631K2674B8246g5657a7391
16058a84991j88521A34850J90333A46493D2326L69279a3596D40239A01677a0633
16047a47743A16930J14287J27846i5181k96172A29198B4477K15676f0804j22193
16037a82997D3032b87382c7617H1649o689J14191a42999a2300k38649b9032m8062
$$ plain form
16026 -77094 72641 274793 -27983 -194741 -39545 290681 -152859 -71318 155507 166302 -35117
16014 482300 -336997 -175704 -156297 105908 -16194 151722 115690 121890 19039 -49583 286857
16002 -233343 95129 -10182 -141800 177036 250269 -195502 101751 274902 -10958 348775
15991 -140338 104280 -16305 -72184 166401 -101976 53 -80895 -349707 122084 -11894 226249
15979 63164 -59 -25108 74876 120168 193667 447102 440927 360527 606672 590687 783074 708104
15967 708104 827893 127882 674547 75160 365032 -26212 26034 130835 -144661 119874
15956 114713 -45478 143414 159855 -4236 -29706 58100 -13567 -69512 -374490 212849 52318
15944 135060 49799 223432 192327 -169962 144936 -105261 -181581 -256133 48609 53555 -131093
$$ packed form
16026g7094G2641K02152b7983j66758c9545B90681a52859g1318A55507J0795c5117
16014D82300c36997J61293J9407A05908a6194A51722l6032O200A9039d9583B86857
16002b33343I5129a0182j31618A77036P3233a95502A01751J73151a0958C48775
15991a40338A04280a6305n5879A66401a01976E3h0895k68812A22084a1894B26249
15979F3164e9k5049G4876M5292P3499K53435o175q0400K46145j5985J92387p4970
15967G08104J19789A27882N46665G5160K89872b6212B6034J04801a44661A19874
15956A14713d5478A43414J6441d236k5470E8100a3567n5945l04978B12849E2318
15944A35060D9799J73633l1105a69962A44936a05261p6320p4552D8609M946a31093
$$ plain form
15932 -189533 -204396 -243184 170086 510185 147094 268647 19584 388928 104238 -24968
15921 89724 -58352 -279936 -17192 258650 75008 -104595 -192976 101037 231785 104362
15910 19758 3590 65145 309425 -181999 106808 516684 -335732 -53219 -53196 32077 -235971
15898 -96406 -147414 203938 365767 90582 -46788 28208 50636 86607 -108912 452642 226754
15887 226754 -155245 249681 -39613 -15227 -25337 176383 -238785 321817 212117 68005
15876 240382 92568 -85455 166110 -88449 -102463 -65524 -17642 -42634 225890 81223 -190744
15864 -26534 -4623 67784 11060 20483 -39438 -511843 272402 -89919 -189992 76615 7186 -131143
15851 98420 -275965 -117169 -140965 -203784 1305 -296028 -239297 249754 -251466 -284301 -7342
$$ packed form
15932a89533j4863l8788A70086L40099A47094J21553A9584L69344A04238b4968
15921H9724e8352k21584a7192B58650G5008a04595q8381A01037J30748A04362
15910A9758C590O1555K44280a81999A06808M09876c35732e3219K3C2077b35971
15898i6406n1008B03938J61829I0582d6788B8208K2428L5971a08912D52642k25888
15887B26754a55245B49681c9613a5227j0110A76383b38785C21817j09700F8005
15876B40382I2568h5455A66110h8449j4014L6939a7642k4992B25890H1223a90744
15864b6534d623F7784A1060R423c9438m72405B72402h9919j00073G6615G186a31143
15851I8420b75965a17169k3796o2819A305b96028N6731B49754b51466l2835g342
$$ plain form
15839 159009 -4754 -76535 201317 -259793 -115050 84406 69943 52401 98654 -105806 -242801
15828 -242801 51572 -221432 189317 96676 -155886 -111552 40626 127516 96141 -211193 54186
15816 -259172 -184489 64711 -265077 58922 86907 100459 28945 -134251 12765 -370366 25155
15804 -199734 58605 76731 8555 47523 20746 -184682 -216440 148414 -21305 263822 108988
15792 -432199 -157054 -29924 138493 -51894 -121907 -19039 102546 -439205 -15274 51975 76149
15781 76149 171920 -41284 176244 147371 83124 -67379 17159 -217359 -277201 -324643 -278386
15770 -278386 -51435 -39894 -49668 -55887 164432 -15394 40041 4323 -165900 -33815 298863
15758 -90838 7354 75833 -107632 -154309 -463324 194287 144186 58593 -253282 178483 142075
$$ packed form
15839A59009d754p1781B01317b59793a15050H4406j4463j7542M6253a05806j36995
15828b42801E1572b21432A89317r2641a55886M4334D0626Q6890l1375b11193E4186
15816b59172P4683F4711b65077E8922K7985J3552B8945a34251A2765c70366B5155
15804a99734E8605J8126H555L8968B0746a84682l1758A48414b1305B63822A08988
15792d32199a57054b9924A38493e1894p0013a9039A02546d39205a5274E1975K4174
15781G6149R5771d1284A76244k8873o4247f7379A7159b17359n9842m7442M6257
15770b78386e1435J1541r774o219A64432a5394D0041D323a65900c3815B98863
15758i0838G354O8479a07632m6677l09015A94287n0101E8593b53282A78483l6408
$$ plain form
15747 142075 -68757 -149153 83308 -44070 -228803 389357 -190617 -1202 -170824 83134 -147228
15735 27603 -222562 259540 -191290 36971 -174059 330211 56841 197863 91204 30780
15724 199967 37762 -67396 45929 -307043 -20660 -155611 -66896 126371 85399 -49462 243748
15712 -201046 -145925 -7165 -283310 -236926 -142186 -360391 16503 -296550 -297079 187699 -65337
15700 70486 -133454 -102694 -222187 -66742 -76797 420637 -8192 -29308 -172914 22362 -24187
15688 107651 -463781 65744 2282 498 -340194 186521 -91533 62416 216809 -50655 226191
15676 282793 -219863 179531 161800 -193951 167507 -173530 305334 112078 206116 -58024
15665 -5045 -35053 -209498 -139501 300432 30567 -192286 -144017 -465439 125273 -405056 46273
$$ packed form
15747A42075f8757q0396H3308d4070j84733C89357a90617a202j69622H3134a47228
15735B7603b22562B59540a91290C6971a74059C30211E6841J41022I1204C0780
15724A99967C7762f7396D5929c07043b0660j34951f6896A26371m0972d9462B43748
15712b01046N5121g165k76145M6384R4740k18205A6503b96550n29A87699f5337
15700G0486a33454L0760j19493f6742j0055D20637h192k1116j43606B2362b4187
15688A07651d63781F5744B282D98c40194A86521i1533F2416J54393e0655B26191
15676B82793b19863A79531j7731a93951A67507a73530C05334A12078R4038e8024
15665e045l0008j74445O9997C00432C0567a92286M8269l21422A25273d05056D6273
$$ plain form
15653 77141 -371214 114551 -12401 -11748 -36444 -231559 40617 44198 -82041 -9781 183311 19065
15640 114473 -98755 195158 139355 -216135 128594 71865 -17672 77243 -18511 43547 -153944
15628 128212 290655 246252 -145519 -32315 316251 157015 -122876 35107 -85520 -368948
15618 -368948 81732 -118473 -262206 -6084 29703 -55747 66195 -278072 246845 -74592 82692
15606 -117083 99684 5229 -202680 207648 -146238 81721 -51528 129562 -352479 89263 123111
15595 123111 254506 -78382 -24858 -122311 5086 270165 199938 155994 130903 -296676 -294842
15584 -294842 -72793 -279498 -277962 192125 268844 -70500 -330156 -214172 66597 -326279 -37034
15572 -141995 308855 126274 174243 118639 128918 -64281 146571 -154441 -131304 106568
$$ packed form
15653G7141c71214A14551a2401O53k4696j95115D0617L581h2041i781A83311A9065
15640A14473i8755A95158n5803b16135A28594n6729a7672G7243a8511D3547a53944
15628A28212J62443m4403a45519c2315C16251A57015a22876C5107h5520k83428
15618c68948H1732a18473j43733f084B9703e5747F6195b78072B46845g4592H2692
15606a17083I9684E229b02680B07648a46238H1721e1528A29562c52479H9263L3848
15595A23111J31395g8382b4858r7453E086K65079p0227m3944k5091b96676J834
15584b94842g2793k06705J536A92125P6719g0500k59656J15984F6597c26279c7034
15572a41995C08855A26274M7969n5604J0279f4281A46571a54441K3137A06568
$$ plain form
15561 -110528 -290170 -77147 -394479 415323 283006 234677 -61314 268176 -180876 201332
15550 74429 -233920 66787 -5124 -109734 -164682 255032 4827 -112292 50260 -142613 -213416
15539 -213416 -52938 228508 -125718 313564 40095 38107 137785 112892 369668 232320 -101276
15527 -233159 -192021 9404 -116675 -113057 211684 179537 337689 -38764 -90167 166689 -25195
15515 -95592 -264769 -202177 -149187 34264 43225 224323 126463 -10940 225333 423982 -107915
15503 -163035 17189 364312 181506 -22573 407129 363359 39913 247997 -92115 39820 237675
15492 237675 230581 355367 108056 131896 118848 -87948 -163047 256766 -41016 547333 -144045
15480 253799 226946 277905 -21547 361336 321974 170830 -18286 246037 -109516 274588
$$ packed form
15561a10528j79642g7147l17332D15323j32317m8329f1314B68176a80876B01332
15550G4429b33920F6787e124j04610n4948B55032D827a12292E0260a42613p0803
15539b13416e2938B28508a25718C13564D0095j988R9678k4893K56776j37348a01276
15527b33159M1138I404a16675L618B11684l2147J58152c8764n1403A66689b5195
15515i5592j69177O2592N2990C4264Q961J81098r7860a0940B25333J98649a07915
15503a63035A7189L47123A81506b2573D07129m3770C9913K08084i2115C9820J97855
15492B37675p094J24786A08056K3840j3048h7948p5099B56766d1016E47333a44045
15480B53799k6853N0959b1547C61336l9362j51144a8286B46037a09516B74588
$$ plain form
15469 -98618 -91073 -87845 149780 26125 419502 268896 -4888 422473 236569 228162 91818
15457 373322 748331 205341 394287 -48963 470688 93360 -107871 -27174 105930 207093
15447 207093 -149202 548759 -6860 -12648 -6137 -95995 -189871 -332401 13875 298809 -100399
15435 301384 30679 -357748 38439 177862 -7242 419575 211185 48320 492176 799169
15425 799169 735166 866575 702326 614706 180323 179181 120953 388957 342835 203788 164628
15414 164628 -42073 312810 21778 -111210 -419859 34245 267256 144785 -10105 -139155
15404 -139155 308540 226539 -110500 -17512 125065 109430 -35634 -43588 -65831 -175040 -32617
15392 55555 194146 38951 -5206 -197752 129807 91042 222725 -244013 -140931 -153011 12835
$$ packed form
15469i8618P545L228A49780B6125L93377j50606d888D22473j85904q407I1818
15457C73322L75009B05341J88946d8963D70688I3360a07871b7174A05930J01163
15447B07093a49202E48759f860n788f137q9858r3876j42530A3875K84934a00399
15435C01384C0679c57748C8439J39423g242D19575k08390D8320M43856L06993
15425G99169o4003J31409j64249q7620A80323j142n8228K68004m6122j39047l9160
15414A64628d2073C12810B1778a11210l08649C4245K33011j22471a0105j29050
15404a39155C08540q2001a10500a7512A25065j5635c5634p954k2243j09209c2617
15392E5555J38591C8951e206j92546A29807l8765J31683b44013J03082j2080A2835
$$ plain form
15380 -159260 -45194 165629 -528636 -44619 111657 -156040 193415 51318 -161462 123035
15369 -167755 -92483 258868 407888 135397 -103062 94187 101464 -18568 6205 125656 116723
15358 116723 -65815 308962 160451 336124 185602 494171 357520 497967 91279 111335
15348 111335 70223 287464 29301 239929 -92261 384584 295899 488306 141039 82010
15338 82010 -87219 99951 123938 -68793 238635 56507 122449 67481 -9843 293763 59006
15326 135771 65794 345794 177078 227450 229387 -22373 90307 133424 -272350 226897 183820
15315 183820 157996 77535 108040 -172889 462126 449753 165127 10172 2985 269634 216493
15304 216493 38580 -41690 269514 121333 -114861 170779 125070 93288 104618 164354 11960
$$ packed form
15380a59260d5194A65629e28636d4619A11657a56040A93415E1318a61462A23035
15369a67755P5272B58868J49020A35397a03062I4187P277a8568F205J19451q933
15358A16723f5815C08962j48511J75673j50522L08569j36651J40447I1279K0056
15348A11335m1112K17241B9301K10628i2261C84584q8685J92407A41039n9029
15338H2010h7219I9951K3987f8793B38635E6507O5942n4968i843B93763E9006
15326A35771F5794K80000j68716N0372J937b2373I0307M3117b72350B26897m3077
15315A83820k5824G7535L0505a72889D62126j2373A65127A0172B985K66649n3141
15304B16493C8580d1690B69514A21333a14861A70779m5709l1782J1330N9736A1960
$$ plain form
15292 -11342 87406 260879 164993 214181 -190274 -101811 168135 -55980 -11280 215185 59692
15280 -13423 222311 90248 176491 177634 274570 75754 264107 -99901 367803 32073 -138213
15268 217807 -53811 -63213 -107022 -372972 1333 39594 10490 251458 304613 62120 39407
15257 39407 -68222 139867 -209338 -187376 87682 -116079 -212647 -110184 193464 -143607
15246 -169775 90804 77343 -89291 176117 212985 170131 98237 31529 96223 226031 -82794
15234 65227 228017 169909 52125 -61208 364124 547638 519756 1499479 1603014 1134988
15224 1134988 1336980 1289676 638712 255149 112329 292984 -36182 -142654 52790 134486
15214 134486 -212828 -63573 179731 -91818 47968 240030 64257 79085 40518 220645 259391
$$ packed form
15292a1342H7406J73473r5886M9188a90274Q8463A68135e5980a1280B15185E9692
15280a3423B22311I0248Q6243J143R6936G5754J88353i9901C67803C2073a38213
15268B17807e3811r402m3809k65950A333L8261A0490K40968N3155F2120k2713
15257C9407f8222A39867b09338K1962H7682a16079r6568J02463A93464a43607
15246a69775I0804j3461h9291A76117L6868m2854p1894C1529O4694J29808h2794
15234F5227J62790n8108E2125f1208C64124J83514k7882R79723J03535m68026
15224A134988K01992m7304F38712B55149A12329J80655c6182j06472E2790Q1696
15214A34486b12828f3573A79731i1818D7968J92062F4257J4828l8567J80127L8746
$$ plain form
15203 259391 219619 -119280 168789 115431 -45413 274745 26115 224090 -163852 207423
15192 -325908 54664 -158505 182257 -79698 35978 -8529 324414 46547 -153619 251669 -7970
15180 -181848 135122 144216 81970 -70269 -89550 -24127 -136512 -142052 121521 -50982 75541
15168 186458 261072 -301002 107061 -59850 263824 -47246 -327116 -23938 96355 61887 -10969
15156 52165 -23117 98526 138318 246593 -73003 167362 129102 177710 200616 122859 -12750
15144 149725 223498 140292 286106 161323 282501 362446 -64756 95036 96469 456632 98
15132 43257 -112084 337550 69602 367773 59853 113887 235362 206653 -43515 -75588 190154
15120 392054 113592 143856 22431 20997 272730 294676 101574 -3664 -9938 161476 236624
$$ packed form
15203B59391l9772a19280A68789n3358d5413B74745B6115J97975a63852B07423
15192c25908E4664a58505A82257g9698C5978h529C24414D6547a53619B51669g970
15180a81848A35122R094o2246g0269j9281b4127j12385n540A21521e0982G5541
15168A86458P4614c01002A07061e9850B63824d7246k79870b3938I6355l4468a0969
15156E2165b3117I8526L9792J08275g3003A67362l8260M8608K2906p7757a2750
15144A49725P3773q3206J45814j24783J21178P9945f4756I5036J433L60163I8
15132D3257a12084C37550F9602K98171E9853N4034J21475k8709d3515l2073A90154
15120C92054A13592L0264B2431j434K51733K1946A01574c664o274A61476P5148
$$ plain form
15109 236624 199972 50975 112010 373226 507751 160239 287582 328650 -34798 562095
15098 220254 96165 169959 43955 206757 88923 188579 180692 -302372 378515 -10886 276786
15086 22235 175689 235978 121009 -34218 -14025 13491 16508 135564 249945 71627 393650
15075 393650 194707 5726 299780 343701 47911 110974 340847 146336 81189 355435 107204
15063 171348 109209 -70606 259466 -49857 603003 308806 234696 308539 126226 112143 442661
15052 442661 -212713 240205 239281 279796 539317 268470 81901 247656 237133 232232 321181
15041 321181 85858 398986 381942 18793 279349 10741 508541 534992 289742 451055
15031 451055 359545 214577 104261 433438 327801 129837 327660 326971 250432 159561 459965
$$ packed form
15109B36624l6652E0975O1035K61216J34525A60239J27343M1068c4798E62095
15098B20254I6165P3794D3955J62802H8923R9656p887c02372C78515a0886B76786
15086B2235J53454O0289j14969c4218a4025A3491L017J19056J14381G1627L22023
15075C93650A94707E726K94054M3921D7911O3063K29873A46336o5147K74246A07204
15063A71348o2139g0606B59466d9857F03003k94197p4110P3843A26226j4083L30518
15052D42661b12713B40205r24M0515K59521B68470H1901J65755j0523m901Q8949
15041C21181H5858L13128j7044A8793K60556A0741M97800K6451k45250J61313
15031D51055r1510j44968A04261L29177j05637A29837J97823o89p6539r0871L00404
$$ plain form
15020 459965 140827 -105980 310031 255440 805532 348669 670260 208284 515065 531428
15010 531428 470532 575819 458657 198877 907769 657073 722252 128434 -84030 344931
14999 200161 493356 182444 170509 445168 129628 612253 564989 431451 303926 216610
14989 216610 460015 155283 507140 250054 329777 496519 559489 551915 570424 522911 495217
14978 495217 310556 451119 558172 220271 339014 666505 391949 513304 586299 458208
14968 458208 718958 503517 912932 791379 422853 457167 643165 720826 590920 425544
14958 425544 545147 451178 381627 292483 627051 270871 26916 255960 344370 283398 690914
14947 690914 479665 527205 147052 572045 265760 369321 340445 247219 299025 510223
$$ packed form
15020D59965A40827a05980C10031n4591N50092C48669L21591B08284L06781J6363
15010E31428o0896J05287j17162A98877P08892k50696O5179A28434h4030C44931
14999B00161K93195A82444j1935K74659A29628M82625m7264j33538j27525q7316
14989B16610K43405A55283L51857B50054P9723J66742O2970p574J8509m7513k7694
14978D95217j84661J40563J07053B20271J18743L27491k74556J21355P2995j28091
14968D58208K60750k15441M09415j21553l68526L4314J85998P7661j29906j65376
14958D25544J19603r3969o9551q9144L34568B70871B6916K29044Q8410o0972M07516
14947F90914k11249M7540A47052M24993B65760J03561k8876r3226N1806K11198
$$ plain form
14937 510223 -21978 -95662 271247 438627 436192 259850 337890 291486 394259 567154 673132
14926 673132 538364 346623 483192 542733 471052 408296 375078 697368 474225 561346
14916 561346 786409 1032033 840141 1101613 1101499 1519250 1534926 1258327 1347818 1294458 1567740
14905 1567740 1588626 1238374 1612324 1599994 2108027 1907689 1748776 1511735 1173742 1401475
14895 1401475 856098 1138031 498599 450666 229118 756012 460906 325105 324973 557346
14885 557346 510871 354429 408738 698429 188819 188430 355099 314614 298994 496870 330554
14874 330554 356745 440485 491249 543165 548890 746356 454942 474864 668937 964499 577038
14863 577038 783413 571632 765022 550606 538310 925128 373852 648959 465733 597563
$$ packed form
14937E10223b1978p3684B71247J67380k435j76342P8040m6404J02773J72895J05978
14926F73132j34768j91741J36569N9541p1681o2756l3218L22290k23143Q7121
14916E61346K25063K45624j91892K61472j14M17751J5676k76599Q9491n3360K73282
14905A567740K0886l50252L73950j2330N08033k00338j58913k37041l37993K27733
14895A401475n45377K81933D98599m7933k21548N26894k95106j35801j32K32373
14885E57346m6475j56442N4309K89691A88819l89J66669m0485j5620J97876j66316
14874C30554K6191Q3740N0764N1916N725J97466k91414J9922J94073K95562l87461
14863E77038K06375k11781J93390k14416j2296L86818C73852K75107j83226J31830
$$ plain form
14853 597563 807837 901733 689001 555091 941927 670116 832803 333167 663326 633711
14843 633711 466431 43662 380524 562211 367720 385823 406093 551931 280804 618632
14833 618632 250211 647775 614028 901942 670270 760409 954470 1004692 1028593 897402
14823 897402 824187 1028521 1148512 798882 981788 773216 651303 660223 871079 698125
14813 698125 514061 576829 920377 547809 692177 410629 533466 699503 605052 576225
14803 576225 750658 891712 792655 697008 690910 391196 341145 504111 880689 883878 779567
14792 779567 967689 939999 900942 1000046 937928 1305673 320430 877894 577119 1124260
14782 1124260 297619 579160 407864 470552 626100 741463 529357 534824 612761 599912
$$ packed form
14853E97563K10274R3896k12732j33910L86836k71811J62687C33167L30159k9615
14843F33711j67280D3662L36862J81687j94491J8103K0270J45838k71127L37828
14833F18632B50211L97564l3747K87914k31672R0139J94061N0222K3901j31191
14823H97402p3215K04334J19991l49630J82906k08572j21913Q920K10856j72954
14813F98125j84064O2768L43548l72568J44368k81548J22837J66037r4451k8827
14803E76225J74433J41054r9057r5647o098k99714n0051J62966L76578L189j04311
14792G79567J88122k7690l9057R9104o2118L67745C20430N57464l00775N47141
14782A124260B97619K81541j71296O2688J55548J15363k12106N467P7937j2849
$$ plain form
14772 599912 579983 563785 324585 624508 592408 759842 830673 748405 816397 846374 1014635
14761 1014635 800607 793006 745843 901256 505311 650541 738223 916800 912587 889016 386187
14749 356763 314880 773352 503389 435273 718853 574596 817416 577490 359753 238769
14739 238769 957901 602606 930236 719552 848522 571784 419717 664945 568079 1062333
14729 1062333 1119665 812962 447365 568548 819111 741499 870277 934105 895127 497877
14719 497877 702759 1212739 975219 1196221 1180956 1123444 1461267 1173014 1697602 1525938
14709 1525938 1685827 1578351 1276791 841228 849360 1002371 1015318 893157 902922 897070 1041896
14698 1041896 679601 815713 1026568 1095854 1006066 875566 1161663 1368616 1073924 1220146
$$ packed form
14772E99912j9929j6198k39200K99923l2100J67434P0831q2268O7992K9977J68261
14761A014635k14028p601m7163J55413l95945J45230Q7682J78577m213k3571C86187
14749C56763m1883M58472k69963o8116K83580j44257K42820k39926k17737j20984
14739B38769P19132l55295L27630k10684J28970k76738j52067K45228r6866M94254
14729A062333N7332l06703l65597J21183K50563p7612J28778O3828l8978l97250
14719D97877K04882N09980k37520K21002j5265n7512L37823k88253N24588j71664
14709A525938J59889j07476l01560m35563Q132J53011J2947j22161R765n852J44826
14698A041896l62295J36112K10855O9286q9788j30500K86097K06953k94692J46222
$$ plain form
14688 1220146 1121738 1430941 1769356 1676448 1445263 1494290 1429200 1439793 1174687 1292328
14678 1292328 894175 1079970 831302 1052681 1001345 1085748 1106635 947059 881943 788531
14668 788531 971589 984606 434677 711327 879460 1033132 523659 900683 921188 814591
14658 814591 1190225 830196 766908 1192468 999176 995572 921840 1414971 972893 1095574
14648 1095574 829043 1182949 1098206 926127 1211092 1024419 1112134 709088 1083429 1001282
14638 1001282 1359496 1334435 1353859 1394979 1088858 1485115 1440388 1314396 999736 1250747
14628 1250747 1424272 1464314 936736 1372525 996972 1266432 1125790 1460460 1104154 1267489
14618 1267489 1132543 1561422 1451164 1202532 1231521 961171 1220493 1335618 1305553 1250222
$$ packed form
14688A220146r8408L09203L38415r2908k31185M9027o5090J0593k65106J17641
14678A292328l98153J85795k48668K21379n1336Q4403K0887j59576o5116r3412
14668G88531J83058J3017D34677K76650J68133J53672n09473L77024K0505j06597
14658H14591L75634l60029o3288M25560j93292l604p3732M93131m42078J22681
14648A095574k66531L53906q4743j72079K84965j86673Q7715m03046L74341q2147
14638A001282L58214k5061J9424M1120l06121L96257m4727j25992l14660K51011
14628A250747J73525M0042n27578M35789l75553K69460j40642L34670l56306J63335
14618A267489j34946M28879j10258k48632K8989k70350K59322J15125l0065n5331
$$ plain form
14608 1250222 1194131 1372332 1301138 1477589 1218325 1431227 1496872 1538705 1655282 1524661
14598 1524661 1048948 1566803 1181631 1452077 2026722 1443050 1344727 1333865 1633998 1579059
14588 1579059 1643749 1266807 1846613 1498354 1744117 1934616 1428130 1812352 1453770 1974577
14578 1974577 1775449 1844524 2048224 1847531 1765322 1835862 1737254 1832349 1771485 1884762
14568 1884762 1706886 2029165 1729194 1812241 1759449 2133718 2044499 1909635 1997685 2018013
14558 2018013 1951445 2102620 2510613 1945015 2469708 2501457 2387579 2343190 2362754 2421591
14548 2421591 2490844 2915070 2673699 2804666 2984358 3001153 3390659 3601487 3606820 4224025
14538 4224025 4569212 5064477 6200633 7536591 10230468 13934161 21341586 33368539
$$ packed form
14608A250222n6091J78201p1194J76451k59264K12902O5645M1833J16577j30621
14598A524661m75713N17855l85172K70446N74645n83672r8323j0862L00133n4939
14588A579059O4690l76942N79806l48259K45763J90499n06486L84222l58582N20807
14578A974577j99128O9075K03700k00693q2209P0540r8608R5095o0864J13277
14568A884762j77876L22279k99971Q3047n2792L74269q9219j34864Q8050K0328
14558B018013o6568J51175M07993n65598N24693L1749j13878m4389J9564N8837
14548B421591O9253M24226k41371J30967J79692J6795L89506K10828N333O17205
14538D224025L45187M95265J136156J335958K693877L703693P407425J2026953
$$ plain form
14530 33368539 30887590 17572083 10377898 6623967 4613840 3842228 3914680 4087439
14522 4087439 5164367 3901600 2885565 2351990 2192237 2241773 2429330 2645417 2116862
14513 2116862 2494308 2128935 2488671 2186333 2279839 2326553 2441451 2246196 2304130 2658008
14503 2658008 2559735 2958264 2391251 2509909 2617949 2688950 2546012 2758412 3036742 2803999
14493 2803999 2847812 2627032 3024527 3262392 3119677 3327325 2854183 2901424 3012108 3209330
14483 3209330 3200179 3237041 3114372 3115317 3006090 3259121 3176304 3361245 3485289 3610439 3564417
14472 3564417 3597999 3742456 3851094 3570687 3839647 3439421 3677752 4000016 3838966 3855191
14462 3855191 3739098 3978407 3793430 4164386 4132568 4208313 4292977 4275809 4358506 4378926
$$ packed form
14530C3368539k480949j3315507p194185l753931k010127p71612P2452J72759
14522D087439J076928j262767j016035n33575j59753M9536J87557K16087n28555
14513B116862L77446l65373L59736l02338R3506M6714J14898j95255N7934L53878
14503B658008r8273L98529n67013J18658J08040P1001j42938K12400K78330k32743
14493B803999M3813k20780L97495K37865j42715K07648m73142M7241J10684J97222
14483C209330r151L6862j22669R45j09227K53031q2817J84941J24044J25150m6022
14472C564417L3582J44457J08638k80407K68960m00226K38331L22264j61050J6225
14462C855191j16093K39309j84977L70956l1818P5745Q4664j7168Q2697K0420
$$ plain form
14452 4378926 4572642 4371144 4252769 4314406 4686004 4605756 4307810 4920488 4832720 5177578
14442 5177578 4952339 4649092 4854037 4958326 5183562 5250089 5303245 5548455 5342202 5937652
14432 5937652 5598784 5607034 5922644 5901190 6111208 5542522 5989508 5723864 6260432 6093835
14422 6093835 6183633 6369682 6389571 6506141 6671627 6922891 6849944 7120972 6879569 7179808
14412 7179808 7642857 7292147 7393438 7596018 7727449 7865069 7771505 8288241 8396470 8352734
14402 8352734 8792357 8339618 8418552 8238510 8802658 9056580 8977757 9094033 9366469 9471981
14392 9471981 9550224 10097693 10166979 10158717 10635896 10525219 11136188 10706083 10954143 10719970
14382 10719970 11046999 11215429 11560575 11527942 11508273 12007767 12059839 12334198 12445006 13056941
$$ packed form
14452D378926J93716k01498j18375O1637L71598q0248k97946O12678q7768L44858
14442E177578k25239l03247K04945J04289K25236O6527N3156K45210k06253N95450
14432E937652l38868Q250L15610k1454K10018n68686M46986k65644N36568j66597
14422F093835Q9798J86049J9889J16570J65486K51264p2947K71028k41403L00239
14412G179808M63049l50710J01291K02580J31431J37620r3564N16736J08229m3736
14402H352734M39623m52739P8934j80042N64148K53922p8823J16276K72436J05512
14392I471981P8243N47469O9286q262M77179j10677O10969m30105K48060k34173
14382A0719970L27029J68430L45146l2633j9669M99494N2072K74359J10808O11935
$$ plain form
14372 13056941 13241589 13501719 13762197 13997653 13863815 14561668 14927875 15292839 15354923
14363 15354923 15794138 15888140 16293531 16296051 16617384 17053202 17428425 18061194 17999318 18339955
14353 18339955 19061000 19392761 20148676 20078571 20797050 20954372 21541573 22061165 22303591
14344 22303591 22903145 23386297 23844311 24425258 24889590 25564767 26350992 26775442 27639903
14335 27639903 28161484 28688668 29576712 29785020 30952038 31887278 32802348 33759753 34545919
14326 34545919 35352627 36232157 37467878 38463912 39475190 40611734 41677164 43135704
14318 43135704 44359844 45493047 47337427 48374597 50214550 51965928 53643385 55494158
14310 55494158 57121292 59115755 61463309 63749952 65475451 67965135 70340312 73158873
$$ packed form
14372A3056941J84648K60130K60478K35456j33838O97853L66207L64964O2084
14363A5354923M39215R4002M05391K520L21333M35818L75223O32769o1876L40637
14353A8339955P21045L31761P55915p0105P18479J57322N87201N19592K42426
14344B2303591N99554M83152M58014N80947M64332O75177P86225M24450Q64461
14335B7639903N21581N27184Q88044K08308J167018R35240R15070R57405P86166
14326C4545919Q06708Q79530J235721R96034J011278J136544J065430J458540
14318D3135704J224140J133203J844380J037170J839953J751378J677457J850773
14310E5494158J627134J994463K347554K286643J725499K489684K375177K818561
$$ plain form
14302 73158873 76027723 78775708 82114159 85048029 88160422 91772122 95866988 99931670
14294 99931670 103952959 108635496 113558631 118345052 124125806 129833986 135800675 142583311
14286 142583311 149573524 156622531 164194130 172415865 180939308 189862153 199672271 209811704
14278 209811704 220682829 232060071 243966840 256595396 269522592 283834944 297823868
14271 297823868 312296278 326872207 341453455 356309425 370604444 384914047 398535181
14264 398535181 411089324 423416433 434536933 444777568 453945347 461834142 466651307
14257 466651307 468686401 471201719 474239977 471417180 465116466 459500580 453086235 444136173
14249 444136173 433129489 420559864 407592303 393414855 380065092 366814393 351202878
$$ packed form
14302G3158873K868850K747985L338451K933870L112393L611700M094866M064682
14294I9931670M021289M682537M923135M786421N780754N708180N966689O782636
14286A42583311O990213P049007P571599Q221735Q523443Q922845R810118J0139433
14278B09811704J0871125J1377242J1906769J2628556J2927196J4312352J3988924
14271B97823868J4472410J4575929J4581248J4855970J4295019J4309603J3621134
14264C98535181J2554143J2327109J1120500J0240635R167779P888795M817165
14257D66651307K035094K515318L038258k822797o300714n615886o414345q950062
14249D44136173j1006684j2569625j2967561j4177448j3349763j3250699j5611515
$$ plain form
14242 351202878 335788738 320534212 306608320 292867603 279411471 266219836 253205727
14235 253205727 240442830 228260685 217128807 206295649 195620860 185576236 176287984
14228 176287984 167734916 160052488 152044715 144789850 138164296 131848297 125935684 120144967
14220 120144967 115175606 109964501 105392781 100912520 97052571 92980917 89131908 85636340
14212 85636340 82258020 79108873 76731382 73457980 70709147 68423491 65774358 63515326
14204 63515326 61482909 59349476 57843636 55614674 54165373 52336564 51002088 49252377
14196 49252377 47647124 45952312 44814146 43783552 42765355 41450818 40113209 38972074
14188 38972074 37520256 36758663 35922299 35263183 34085482 33189810 32275992 31489923 30643350
$$ packed form
14242C51202878j5414140j5254526j3925892j3740717j3456132j3191635j3014109
14235B53205727j2762897j2182145j1131878j0833158j0674789j0044624r288252
14228A76287984q553068p682428q007773p254865o625554o315999n912613n790717
14220A20144967m969361n211105m571720m480261l859949m071654l849009l495568
14212H5636340l378320l149147k377491l273402k748833k285656k649133k259032
14204F3515326k032417k133433j505840k228962j449301j828809j334476j749711
14196D9252377j605253j694812j138166j030594j018197j314537j337609j141135
14188C8972074j451818p61593q36364o59116j177701q95672r13818p86069q46573
$$ plain form
14179 30643350 29867143 29142136 28520695 27663940 26981078 26125199 25815917 25350010 24617917
14170 24617917 23901696 23329028 22918976 22403311 21935226 21655903 21268889 20598765 20459713
14161 20459713 19880269 19693405 18900942 18878883 18454465 17867025 17750601 16985659 17152908
14152 17152908 16560642 16436643 16254047 15766162 15559512 15194959 15070502 15018899 14716490
14143 14716490 14092885 14204749 14010472 13476494 13440151 13220307 13114425 12983407 12225428
14134 12225428 12212372 12040135 11947989 11314006 11769852 11786986 11128044 11163424 10841028 10754022
14124 10754022 10308584 10223732 10051132 10164110 9731234 9587292 9674639 9456858 9127626 8980535
14114 8980535 8719942 8889734 8882553 8828344 8469337 8364766 8132400 8356608 8534177 8128473
$$ packed form
14179C0643350p76207p25007o21441q56755o82862q55879l09282m65907p32093
14170B4617917p16221n72668m10052n15665m68085k79323l87014o70124j39052
14161B0459713n79444j86864p92463k2059m24418n87440j16424p64942J67249
14152A7152908n92266j23999j82596m87885k06650l64553j24457n1603l02409
14143A4716490o23605J11864j94277n33978l6343k19844j05882j31018p57979
14134A2225428j3056j72237r2146o33983M55846J7134o58942L5380l22396q7006
14124A0754022m45438q4852j72600J12978m32876j43942Q7347k17781l29232j47091
14114H980535k60593J69792p181n4209l59007j04571k32366K24208J77569m05704
$$ plain form
14104 8128473 8162939 7786022 7802426 7654934 7330748 7312107 7298017 7195186 7030973 6920272
14094 6920272 6957207 6877510 6970242 6504372 6964910 6506241 6662958 6018525 6160164 6013917
14084 6013917 5823591 5938999 5921380 5772555 5639303 5864978 5821957 5621588 5441821 5564413
14074 5564413 5830322 5419466 5522855 5600580 5398663 5312639 4901471 5165455 5034875 5258349
14064 5258349 4664058 4747269 4897239 4599895 4946231 5147629 4385781 4479321 4832522 4618804
14054 4618804 4664832 4687174 4404512 4405527 4216954 4147165 4357349 4242570 4329575 4602198
14044 4602198 4277970 4452409 4161844 4462562 3883857 3832770 3932720 3885502 3494276 3675703
14034 3675703 3865149 3403848 3514595 3359177 3178016 3225183 3393247 3579875 3242956 3112332
$$ packed form
14104H128473L4466l76917J6404j47492l24186j8641j4090j02831j64213j10701
14094F920272L6935p9697R2732m65870M60538m58669J56717o44433J41639j46247
14084F013917j90326J15408j7619j48825j33252K25675m3021k00369j79767J22592
14074E564413K65909m10856J03389P7725k01917q6024m11168K63984j30580K23474
14064E258349n94291Q3211J49970k97344L46336K01398p61848R3540L53201k13718
14054D618804M6028K2342k82662J015j88573o9789K10184j14779Q7005K72623
14044D602198l24228J74439k90565L00718n78705n1087R9950m7218l91226J81427
14034C675703J89446m61301J10747j55418j81161M7167J68064J86628l36919j30624
$$ plain form
14024 3112332 3613688 3625055 3300671 3433794 3103253 2929551 3018710 2971263 3111096 3265865
14014 3265865 3184035 3047353 3203075 2888703 3171209 2784854 3132929 2834711 2660503 2758615
14004 2758615 2854805 2950773 2809226 2610001 2627681 2356359 2657739 2713822 2330665 2397548
13994 2397548 2740431 2411630 2669715 2601411 2534138 2280027 2384672 2306086 2100339 2369597
13984 2369597 2449470 2246586 2296443 2397161 2554281 2333485 2936356 3148356 3825147 4926940
13974 4926940 6419846 9806068 16024685 28306641 34736279 21717639 14350664 9717392
13966 9717392 7690946 5933626 5179571 4116020 3762392 3558357 3078558 3203423 2855327
13957 2855327 2812360 3047383 2810652 2681031 2681288 2615744 2683543 2460267 2365030 2249483 2481648
$$ packed form
14024C112332N01356J1367l24384J33123l30541j73702Q9159m7447J39833J54769
14014C265865q1830j36682J55722l14372K82506l86355L48075k98218j74208R8112
14004B758615R6190R5968j41547j99225J7680k71322L01380N6083l83157O6883
13994B397548L42883l28801K58085o8304o7273k54111J04645p8586k05747K69258
13984B369597P9873k02884M9857J00718J57120k20796O02871K12000O76791J101793
13974D926940J492906L386222O218617J2281956O429638j3018640p366975m633272
13966I717392k026446j757320p54055j063551l53628k04035m79799J24865l48096
13957B855327m2967K35023k36731j29621K57o5544O7799k23276r5237j15547K32165
$$ plain form
13946 2481648 2081340 2274864 2205580 2126285 2069115 2163679 2111910 2069572 2103068 2058031 2449732
13935 2449732 1861170 1979118 1917146 1710980 2172612 1883088 1842817 1685999 2168660 2001931
13925 2001931 1975751 1686286 1913397 1989614 1813717 1911857 1837805 1663389 1764720 1770792
13915 1770792 1730334 1667853 1318688 1550854 1811129 1489660 1503495 1574017 1570672 1672517
13905 1672517 1847568 1479794 1660092 1481748 1731175 1882856 1788509 1639584 1556789 1100146
13895 1100146 1456119 1405374 1568111 1189232 1501519 1436901 1485375 1672217 1250213 1326860
13885 1326860 1488165 1409153 1473193 1512783 1199352 1231319 1370452 1214921 1206394 1296908 1431852
13874 1431852 1235681 1344823 1283831 1483948 1340835 1193557 1376607 1227337 1615601 1189087
$$ packed form
13946B481648m00308J93524o9284p9295n7170R4564n1769m2338L3496m5037L91701
13935B449732n88562J17948o1972k06166M61632k89524m0271j56818M82661j66729
13925B001931k6180k89465K27111P6217j75897R8140p4052j74416J01331O072
13915A770792m0458o2481l49165K32166K60275l21469J3835P0522l345J01845
13905A672517J75051l67774J80298j78344K49427J51681r4347j48925q2795m56643
13895A100146L55973n0745J62737l78879L12287o4618M8474J86842m22004P6647
13885A326860J61305p9012O4040L9590l13431L1967J39133j55531q527R0514J34944
13874A431852j96171J09142o0992K00117j43113j47278J83050j49270L88264m26514
$$ plain form
13864 1189087 1058775 1143896 1425297 1115869 1327353 1150381 1129543 1276639 1168311 1004980
13854 1004980 1415117 868441 1254271 1257277 989576 1329639 868446 745260 1096329 1222624
13844 1222624 1280197 1118476 1218989 1224371 1304860 1244141 1183134 933521 617449 851327
13834 851327 1470919 1016812 1040877 912563 1117523 1172727 740657 1337505 815452 773399
13824 773399 755227 1087937 698550 941384 1335256 1057777 1167284 1088848 1058085 1105347
13814 1105347 1056511 836069 1124741 741814 748149 923190 1095602 1146521 1161740 762079
13804 762079 1329251 835414 667687 859734 1044572 682765 661722 835399 838823 1072193
13794 1072193 933017 631875 610412 700335 1012968 504734 670752 828057 921307 444423
$$ packed form
13864A189087j30312Q5121K81401l09428K11484j76972k0838J47096j08328j63331
13854A004980M10137n46676L85830L006k67701L40063m61193j23186L51069J26295
13844A222624N7573j61721J00513N382Q0489o0719o1007k49613l16072K33878
13834H51327O19592m54107K4065j28314K04960N5204m32070N96848n22053m2053
13824G73399j8172L32710l89387K42834L93872k77479J09507p8436l0763M7262
13814A105347m8836k20442K88672l82927O335J75041J72412N0919J5219l99661
13804G62079N67172m93837j67727J92047J84838l61807k1043J73677L424K33370
13794A072193j39176l01142k1463Q9923L12633E04734J66018J57305R3250D44423
$$ plain form
13783 403992 697760 978012 590732 911407 608424 1010008 952273 974214 707886 634206
13773 634206 1113681 470766 848113 779617 664646 718362 411634 899996 638122 543947
13763 543947 879383 598595 763589 707475 637967 598582 453469 823059 602856 361181
13753 361181 1006672 600393 739068 691582 746367 671046 326535 817066 467833 747973
13743 747973 785586 1112137 370193 1051617 466672 711922 370190 591868 595392 655118
13733 655118 575428 618862 696315 792672 515688 630845 660572 879372 679921 232171
13722 442851 339108 794055 802118 314210 541968 328469 435022 590758 894936 463993
13712 463993 715446 789740 753406 648997 739525 744531 675167 597175 657740 767669 819823
$$ packed form
13783D03992K93768K80252l87280L20675l02983M01584n7735K1941k66328p3680
13773F34206M79475D70766L77347o8496j14971N3716l06728M88362k61874r4175
13763E43947L35436k80788J64994n6114o9508l9385j45113L69590k20203k41675
13753C61181O45491m06279J38675m7486N4785p5321C26535M90531l49233K80140
13743G47973L7613L26551C70193O81424D66672K45250l41732K21678L524N9726
13733F55118p9690M3434P7453R6357k76984J15157K9727K18800j99451B32171
13722D42851j03743M54947Q063C14210K27758k13499J06553J55736L04178m30943
13712D63993K51453P4294l6334j04409R0528N006o9364p7992O0565J09929N2154
$$ plain form
13701 819823 253016 200407 445775 717190 640830 687244 711275 573258 692282 917048
13691 917048 593057 754520 647457 507030 436039 378022 363590 514691 73487 332739
13681 332739 498103 46610 263279 473444 522360 632025 764318 666186 614676 384356
13671 384356 482786 471382 526780 360038 610039 396671 205668 -12517 539904 464249
13661 464249 323647 560061 198481 327150 492400 386824 57437 427828 565932 443224
13651 443224 268254 202689 521313 389813 411753 445650 455282 584200 99972 472754 328655
13640 328655 521667 374016 463070 243315 628888 800816 380001 206848 531521 597026
13630 597026 389386 569951 134844 659846 787504 -33490 501225 10732 129245 165217
$$ packed form
13701H19823B53016n2609K45368K71415p6360M6414K4031j38017J19024K24766
13691I17048l23991J61463j07063j40427p0991n8017j4432J51101G3487K59252
13681C32739J65364D6610K16669K10165M8916J09665J32293r8132n1510k30320
13671C84356R8430j1404N5398j66742K50001k13368j91003a2517E39904p5655
13661D64249j40602K36414A98481J28669J65250j05576E7437L70391J38104j22708
13651D43224j74970o5565L18624j31500K1940L3897R632J28918I9972L72782j44099
13640C28655J93012j47651Q9054k19755L85573J71928C80001j73153L24673O5505
13630E97026k07640J80565A34844N25002J27658c3490E01225A0732J18513L5972
$$ plain form
13620 165217 465315 336330 161974 602085 156075 418060 606398 126186 337442 323759
13610 323759 493439 367260 254429 184281 513658 161703 370224 353803 346379 390503
13600 390503 458522 433415 319775 392810 397957 365447 203390 500471 309290 472234 507962
13589 507962 228508 443893 380529 360410 319677 629242 204994 75197 271972 255874
13579 255874 616282 146834 369366 418903 95092 75155 418573 100266 77576 526664
13569 526664 380958 279298 337285 653446 426146 482444 465388 93501 92651 93508 363802
13558 363802 481007 214509 473000 532475 277797 581740 754356 371903 269812 660040
13548 660040 298823 451161 -91569 532876 452171 521376 431324 462447 218038 480705
$$ packed form
13620A65217L00098j28985A61974M40111A56075K61985J88338A26186K11256j3683
13610C23759J69680j26179j12831p0148L29377A61703K08521j6421p424M4124
13600C90503O8019k5107j13640P3035N147l2510j62057K97081j91181J62944L5728
13589E07962B28508K15385o3364k0119m0733L09565B04994G5197J96775j6098
13579B55874L60408A46834K22532M9537I5092j9937L43418A00266k2690M49088
13569E26664j45706j01660N7987L16161k27300N6298j7056I3501q50Q57K70294
13558C63802J17205B14509K58491N9475k54678L03943J72616C71903j02091L90228
13548F60040B98823J52338i1569E32876q0705O9205r0052L1123B18038K62667
$$ plain form
13538 480705 99419 189924 405706 548009 310657 550909 31129 146610 286797 148129
13528 148129 143653 330451 414540 519149 449045 53920 32564 182755 500896 103398 375792
13517 375792 56300 374848 601813 359401 117491 246588 -162635 5556 179390 419824
13507 419824 425716 341979 186623 516605 222777 101863 89183 607484 135473 160054
13497 160054 377091 407044 132987 -34157 113329 25034 471850 246300 469702 217571
13486 472758 318838 556740 619667 132895 173374 2230 555823 181470 -43210 475624
13475 266796 154144 313265 193182 99145 273393 291840 216175 335933 489672 -130012
13464 165818 467618 -33722 283756 242038 121922 293262 410276 -42299 271603 176152
$$ packed form
13538D80705I9419R0505K15782J42303k37352K40252C1129J15481J40187j38668
13528A48129m476J86798Q4089J04609p0104E3920k1356J50191L18141A03398K72394
13517C75792E6300L18548K26965k42412A17491J29097a62635E556J73834K40434
13507D19824N892q3737j55356L29982B22777A01863j2680N18301A35473K4581
13497A60054K17037K9953A32987c4157A13329B5034M46816k25550K23402B17571
13486D72758j53920K37902O2927A32895M0479B230N53593A81470d3210D75624
13475B66796j12652J59121j20083r4037J74248J8447p5665J19758J53739a30012
13464A65818L01800c3722B83756m1718j20116J71340J17014d2299B71603r5451
$$ plain form
13454 176152 237046 443483 -185556 183101 -117182 120810 274704 361462 393863 288926
13444 288926 376271 -9757 191950 130586 269598 -115211 244933 144029 175439 338916
13434 338916 202535 498765 179655 70549 130519 194921 190691 139130 103976 -70343 -73603
13423 -73603 1831 400793 18196 320118 -41651 187138 334442 215857 332454 -182495
13412 -143724 518192 200161 -109863 -231747 104937 190557 243670 78480 -100082 -135065
13402 -135065 132495 288895 80031 -70944 262670 100049 80023 123360 374294 -54637
13391 393095 292161 -20569 318010 305343 108989 233619 355233 311047 -175457 -10430
13380 89708 90257 498308 283593 377445 308124 164150 248621 51004 130651 163735 262160
$$ packed form
13454A76152O0894K06437a85556A83101a17182A20810J53894Q6758L2401j04937
13444B88926Q7345i757A91950o1364J39012a15211B44933j00904L1410J63477
13434C38916j36381K96230A79655G0549N9970O4402m230n1561l5154g0343l260
13423g3603A831L98962A8196L01922d1651A87138J47304j18585J16597a82495
13412a43724E18192B00161a09863j21884A04937Q5620N3113G8480a00082l4983
13402a35065A32495J56400H0031g0944B62670A00049k0026M3337K50934e4637
13391C93095j00934b0569C18010j2667A08989J24630J21614m4186a75457a0430
13380H9708N49M08051k14715R3852o9321j43974Q4471E1004P9647L3084R8425
$$ plain form
13369 262160 179944 63460 -28094 -61061 60292 348876 287157 353563 -1907 472562 54409
13357 692610 103351 176804 695541 178048 218249 -68202 204695 109519 293618 345532
13347 345532 118079 176644 153706 -27887 236741 82945 -71799 300739 -47586 138623 482651
13336 482651 235118 94245 134837 239396 295218 52102 236067 214742 298123 165563 38009
13324 206488 273448 566475 378808 172055 260205 34874 177030 187437 285494 387268
13314 387268 44590 -464 201696 209893 -23523 -59094 178654 216670 118850 337726 106801
13302 808218 90235 234758 182771 253257 252242 286327 53371 15736 260241 -15033 508813
13290 247039 170352 206900 241825 -117692 173782 95199 185237 44546 -77145 213971 367481
$$ packed form
13369B62160q2216F3460b8094l2967F0292K88584o1719O6406a907D72562E4409
13357F92610A03351P3453N18737A78048M0201f8202B04695r5176J84099N1914
13347C45532A18079N8565k2938b7887B36741H2945g1799C00739d7586A38623L44028
13336D82651B35118I4245M0592J04559N5822E2102J83965k1325Q3381j32560C8009
13324B06488O6960K93027j87667A72055Q8150C4874J42156J0407R8057J01774
13314C87268D4590d64B01696Q197b3523l5571A78654L8016r7820K18876A06801
13302H08218I0235J44523n1987P0486j015L4085E3371A5736K44505a5033E08813
13290B47039p6687L6548L4925a17692A73782p8583R0038D4546g7145B13971J53510
$$ plain form
13279 367481 422306 449293 83336 -129547 76922 -45070 235826 122345 187720 25691 399659
13268 399659 186790 17628 -33279 59459 153556 422812 -115478 177938 47739 361862
13258 361862 293852 155405 44384 235981 302216 70190 4773 72943 260089 10742 133571
13247 133571 -35724 67126 -130917 -68456 -60824 37378 262259 252596 88421 28325 234787
13236 234787 199394 386764 360858 389953 -182331 211198 60820 263729 -185587 -223247
13226 -223247 175609 111957 69704 -96400 68252 -145378 401951 62092 294058 -56513 357255
13214 280045 -136463 333754 165370 70284 118544 316365 198347 188904 24144 -47307 38147
13202 107352 -296340 325079 -122898 194006 -41059 67474 73847 400628 129777 152044
$$ packed form
13279C67481N4825K6987H3336a29547G6922d5070B35826j13481O5375B5691L73968
13268C99659A86790A7628c3279E9459R4097K69256a15478A77938D7739L14123
13258C61862o8010j38447D4384J91597O6235G0190D773O8170J87146A0742J22829
13247A33571c5724F7126a30917O2461P632C7378K24881r663H8421B8325K06462
13236B34787l5393J87370k5906K9095a82331B11198F0820K02909a85587l7660
13226b23247A75609o3652m2253i6400F8252a45378D01951F2092K31966e6513C57255
13214B80045a36463C33754A65370G0284M8260J97821j18018r443B4144d7307C8147
13202A07352b96340C25079a22898A94006d1059F7474O373L26781A29777K2267
$$ plain form
13192 152044 -150933 184132 563978 134972 92966 19125 80154 163451 400947 193606
13181 23990 199568 89658 163263 24954 4968 92526 -81942 29988 -99414 -96365 103413 105135
13169 105135 309878 -26801 93977 196786 356168 29436 22757 191743 352096 317382 88837
13157 129974 -73308 -112739 -197252 -101088 -208460 36772 96830 -178290 72733 189516 -70659
13145 49942 -75346 -142997 221115 -202841 -300327 247301 146315 139091 106399 154772 -24734
13133 129141 308517 -104509 -91471 -253903 72824 129209 -27986 323815 96822 176 -68346
13121 -107322 381983 -299567 14034 241698 82305 222006 119599 -260857 -77162 -61744
13111 -61744 158142 -127932 45366 200965 98056 -2791 -199675 243050 -185552 41137 103464
$$ packed form
13192A52044a50933A84132L79846A34972m2006A9125O1029Q3297K37496A93606
13181B3990J75578H9658P3605B4954D968Q7558h1942B9988i9414L049A03413J722
13169A05135K04743b6801I3977J02809J59382B9436o679J68986J60353l4714H8837
13157A29974g3308l9431q4513R6164j07372C6772O0058a78290G2733J16783g0659
13145D9942g5346o7651B21115b02841r7486B47301j00986p224l2692M8373b4734
13133A29141J79376a04509J3038j62432G2824N6385b7986C23815I6822A76f8346
13121a07322C81983b99567A4034K27664H2305J39701j02407b60857g7162J5418
13111f1744A58142a27932D5366J55599I8056b791j96884B43050a85552D1137O2327
$$ plain form
13100 103464 48753 143144 53366 -232152 227333 28282 -27080 -20596 97781 16143 249307
13089 249307 68440 256041 -5454 -110790 104852 51058 -16286 166115 -357983 300531
13078 63950 -130057 174065 190250 -314428 152457 74840 -58083 11442 -115146 -155477 -101269
13067 -101269 253266 -32615 -146758 186615 -304086 -214086 143782 237920 79212 49227
13057 49227 -197761 59361 99211 -272558 -6813 124076 342181 186245 59191 97311 145376
13046 145376 -65383 118929 245637 11912 5667 329616 280917 466874 -216123 190484
13035 362383 193476 -64332 86765 24510 199255 157920 -16613 -73636 171625 -250765 17662
13023 238242 -1173 140010 128488 187261 229359 -113363 94475 71680 301114 -8942 379620
$$ packed form
13100A03464D8753R4391E3366b32152B27333B8282b7080O484I7781A6143K33164
13089B49307F8440J87601e454j05336A04852E1058a6286A66115c57983C00531
13078F3950a30057A74065J6185c14428A52457G4840e8083A1442a15146m0331N4208
13067a01269B53266c2615j14143A86615c04086R0000A43782R4138G9212k9985
13057D9227a97761E9361L9850b72558f813A24076K18105j55936E9191L8120M8065
13046A45376f5383A18929J26708A1912E667L23949m8699J85957b16123A90484
13035C62383j68907f4332H6765B4510J74745m1335a6613n7023A71625b50765A7662
13023B38242a173A40010j1522N8773M2098a13363I4475k2795K29434h942C79620
$$ plain form
13011 -35454 -235771 16681 95648 -32057 -157493 -55793 85173 -158713 234974 -101774 -105948
13000 -105948 158757 178464 249743 101090 -47606 -24258 170945 336064 227295 49453
12989 171127 -77698 148688 -21830 -4447 -338955 136667 -97747 189196 60247 19954 131393
12978 131393 -189439 106099 714 -183112 151651 -67281 47752 -112727 60616 94687 -129390
12966 248356 31948 60031 -45956 57182 110535 -258585 70597 -73830 -204174 5471 -423447
12954 88093 -121311 -108940 -201247 79010 2549 -28030 -77655 -7924 260387 350061 353159 317271
12942 317271 -15067 119751 154086 -180747 -6646 -375026 198379 205246 -75300 94402 -215119
12930 -276599 105983 251175 351285 53894 -24177 -133347 -292315 99697 -86144 128393
$$ packed form
13011c5454k00317A6681P8967c2057j25436e5793H5173a58713B34974a01774m174
13000a05948A58757J9707P1279A01090d7606K3348A70945J65119j08769D9453
12989A71127g7698A48688b1830d447l34508A36667i7747A89196F0247A9954J11439
12978A31393a89439A06099G14a83112A51651f7281D7752a12727F0616L4071a29390
12966B48356C1948K8083d5956E7182N3353b58585G0597g3830j30344E471d23447
12954H8093a21311J2371r2307G9010B549b8030m9625g924B60387Q9674L098l5888
12942C17271a5067A19751L4335a80747f646l68380A98379O867g5300I4402b15119
12930b76599A05983J45192J00110E3894b4177j09170j58968I9697h6144A28393
$$ plain form
12919 -180335 -10532 67045 37438 29893 52438 183773 330474 243082 146321 -190139 -42393
12907 -19407 207823 98191 -64837 -137917 -157581 -12877 221471 -58567 35318 305663 350178
12896 350178 76694 111371 -17661 248140 -96556 78024 -37064 50761 122996 124019 -17507
12884 -203610 83715 23804 -126422 26548 -100083 -264998 -93286 528732 -12326 -117399
12874 -117399 135676 -38090 89246 99663 -275716 56655 235495 32060 -192759 -168369 -181790
12863 -181790 -72367 -86392 91380 52283 79353 135935 82593 148821 636488 -100129 -93165
12852 -93165 24814 -39375 -50144 8148 -251239 -49267 69908 -1224 208462 189228 -257878
12840 -81129 85878 -34052 -8207 -155140 -222223 -26431 -294300 90095 -3221 -208904 -91141
$$ packed form
12919a80335a0532F7045k9607p545K2545J31335J46701q7392r6761a90139d2393
12907a9407B07823I8191f4837p3080j9664a2877B21471e8567C5318K70345M4515
12896C50178G6694L4677a7661B48140i6556G8024c7064E0761P2235J023a7507
12884b03610H3715B3804a26422B6548a00083j64915i3286E28732a2326j05073
12874a17399A35676c8090H9246J0417b75716E6655J78840C2060a92759K4390j3421
12863a81790g2367j4025I1380l9097K7070N6582n3342O6228M87667a00129O964
12852i3165B4814c9375j0769H148b51239d9267F9908a224B08462j9234b57878
12840h1129H5878c4052h207j46933o7083b6431k67869I0095c221k05683i1141
$$ plain form
12828 328858 -252157 124116 181530 75310 212710 122315 -105253 -75389 -29214 151866
12817 145157 -83083 213558 -54087 407325 262650 -163246 243230 -67530 -40064 -27079
12807 -27079 -149228 -177096 -13064 86494 -341122 -193747 20409 80339 60271 115475 -273856
12795 56263 -6311 265783 280816 -16514 -168395 150307 -136595 212617 141289 -168813 151591
12783 156141 -233194 220183 312682 -136514 -255444 -515944 182206 -317360 -75440 136749
12772 -34943 98321 -169357 42093 -147198 100268 112296 -31466 214376 -55243 -69800 -103725
12761 -103725 -57890 53212 -113419 -6774 102310 -39593 -113100 -26948 45013 -22566 8209
12749 -241854 36518 -155316 -94657 -12556 257748 82997 8129 -5471 -180658 249661 -141893
$$ packed form
12828C28858b52157A24116N7414G5310J37400r0395a05253K9864b9214A51866
12817A45157h3083B13558e4087D07325j44675a63246B43230f7530K7466J2985
12807b7079j22149k7868a3064H6494c41122J47375B0409N9930k0068N5204b73856
12795E6263f311B65783J5033a6514j51881A50307a36595B12617p1328a68813A51591
12783A56141b33194B20183R2499a36514j18930k60500A82206c17360g5440A36749
12772c4943I8321a69357D2093a47198A00268J2028c1466B14376e5243j4557l3925
12761a03725M5835E3212a13419f774A02310c9593p3507b6948D5013b2566H209
12749b41854C6518a55316O0659a2556B57748H2997H129e471j75187B49661a41893
$$ plain form
12737 -79594 210567 10048 -88849 154073 -77305 -36 61281 -93384 -6120 195962 219747 -273673
12724 -148319 59759 525244 -160379 -158305 -18310 196119 173847 360904 153365 153764 159756
12713 159756 92888 -20848 -127951 -233773 -158176 -281322 186702 151803 -151220 103191
12702 -14163 -198433 164305 138066 -246558 128613 172898 2426 298838 270127 79410 130195
12691 130195 222169 -60525 249424 18410 83816 -79770 54610 -36763 57186 34313 11124
12679 -15696 -88430 -107106 248966 -162604 -160784 -101942 409882 258843 68246 166561 296052
12668 296052 95110 -211992 -58601 45786 -192 28963 104954 195227 110065 83748 162499 -71887
12655 126163 -90780 -234502 147070 288431 2479 303852 224359 -81479 199668 -7584 -95571
$$ packed form
12737g9594B10567A0048h8849A54073g7305c6F1281i3384f120A95962K3785b73673
12724a48319E9759M65485a60379K074a8310A96119k2272J87057A53365L99N992
12713A59756o6868b0848j07103j05822P5597j23146A86702l4899a51220A03191
12702a4163j84270A64305k6239b46558A28613M4285B426K96412k8711G9410N0785
12691A30195R1974f0525B49424A8410O5406g9770E4610c6763E7186k2873A1124
12679a5696p2734j8676B48966a62604J820N8842D09882j51039F8246R8315J29491
12668B96052I5110b11992e8601D5786a92B8963P5991R0273q5162k6317P8751g1887
12655A26163i0780j43722A47070J41361B479L01373p9493h1479A99668g584q7987
$$ plain form
12644 -95571 15241 106067 -120215 -297561 -181385 -226507 100160 133783 136042 -20311 -39281
12633 -39281 46069 4381 -25773 78056 169575 -62934 -112394 -153126 6933 -188340 -21188 -98353
12621 -98353 80027 254615 -117270 28018 152528 286540 11583 299600 404891 153460
12610 53068 19859 81909 -244177 52066 48058 -286764 287192 -19833 130853 -19016 -138177
12599 -138177 -59664 237894 44604 -173323 43851 -140375 212731 243998 87191 -56367 124637
12587 247675 -60610 191069 90095 -99831 -129585 380021 62303 17137 -107581 124218 288830
12576 288830 -74198 211861 391518 -5677 34154 -175847 -201803 -273277 -117144 60043 206094
12565 206094 -38132 -155588 74010 341626 99980 -229942 124191 -128114 345196 -25944
$$ packed form
12644i5571A5241R0826a20215j77346J16176m5122A00160L3623K259b0311j8970
12633c9281D6069D381b5773G8056R1519f2934m9460m0732F933a88340b1188p7165
12621i8353H0027J74588a17270B8018J24510J34012A1583K88017J05291A53460
12610E3068A9859O2050b44177E2066m008b86764B87192a9833A30853a9016j19161
12599a38177e9664B37894D4604a73323D3851a40375B12731L1267H7191e6367A24637
12587B47675f0610A91069I0095i9831k9754C80021F2303A7137a07581A24218J64612
12576B88830g4198B11861J79657e677C4154a75847k5956p1474a17144F0043J46051
12565B06094c8132j17456G4010K67616I9980b29942A24191a28114C45196b5944
$$ plain form
12554 26756 -68475 -196676 56781 -157571 -197475 218540 -60373 161800 -18020 74418 306981
12543 306981 -1014 -180010 -11288 -58397 31853 -21924 205990 -50034 88767 -14533 21537
12531 -78663 -223113 84607 94678 23692 128528 -198590 -239067 -260707 -43913 113232 -182067
12519 153596 -158770 -8064 -194511 -304437 170734 -142894 -195021 -76476 -126980 -194242 75422
12507 29509 141902 -65598 14267 32028 -219127 -116545 -95437 -69859 128445 251810 -370443
12495 135848 29948 48092 223999 76570 -78181 -13705 -146327 90039 -144293 -3166 51664
12483 -4568 -128888 -165695 93538 -333797 -168762 -61857 156273 2121 -27764 -136185 135951
12471 142873 -47722 -36587 866 36683 -78922 -130465 216504 -53683 78925 -58437 -9149 65239
$$ packed form
12554B6756f8475j28201E6781a57571l9904B18540f0373A61800a8020G4418K32563
12543C06981a014j78996a1288m7109C1853b1924B05990e0034H8767a4533B1537
12531g8663j44450H4607J0071B3692J04836a98590m0477k1640d3913A13232a82067
12519A53596a58770h064j86447j09926A70734a42894n2127g6476n0504o7262G5422
12507B9509J12393f5598A4267J7761b19127J02582K1108K5578A28445J23365c70443
12495A35848B9948J8144J75907G6570g8181a3705j32622I0039a44293c166E1664
12483d568j24320l6807I3538c33797J65035f1857A56273B121b7764j08421A35951
12471A42873d7722J1135H66L5817g8922n1543B16504e3683G8925e8437i149F5239
$$ plain form
12458 -21339 57227 -172674 -213542 217122 55668 170876 -340760 275786 -130684 141222
12447 35506 -22598 -298415 134448 88889 -111039 -224567 -127697 187158 835 -49598 57286
12435 10334 7516 121820 103952 -37055 -68829 -10417 -133149 173923 -159038 17772 -10316
12423 -199965 -23507 194858 -480363 17830 195223 -295417 67703 -89425 -124158 -170141 -158695
12412 -158695 -174689 -104659 130185 -9106 -274196 -67859 40103 43678 -87443 105730 -10277
12400 -72157 231684 113360 356758 -436579 205032 -117043 -218100 -270344 654935 -31039
12389 -441184 -116825 -88997 109505 -139950 -120874 57574 -250772 -288566 -28575 -35988 139971
12377 -69543 164915 241469 74728 -121637 155970 -40239 148417 -14354 -4230 413492 87952
$$ packed form
12458b1339E7227a72674m0868B17122E5668J15208c40760B75786a30684A41222
12447C5506b2598k75817A34448m5559a11039j13528R6870A87158H35d9598E7286
12435A0334k818J14304j7868c7055l1774a0417j22732A73923a59038A7772a0316
12423a99965b3507A94858d80363A7830J77393b95417F7703h9425l4733m5983J1446
12412a58695j5994P0030A30185i106k65090f7859D0103L575h7443A05730a0277
12400g2157B31684A13360K43398d36579B05032a17043j01057n2244F54935c1039
12389d41184a16825K7828A09505a39950J9076E7574b50772l7794b8575p413A39971
12377f9543A64915P6554G4728a21637A55970d0239A48417a4354d230D13492H7952
$$ plain form
12365 -69557 9736 187472 161156 27960 267488 148915 119675 129870 163420 299413 -190405
12353 -85986 -212662 -209840 -93720 70023 93926 -20812 25318 -122277 111646 91192 -104013
12341 -119446 -87692 -315149 30055 -255995 -319203 -45498 -100382 102649 -22102 207308 40558
12329 -133624 -28232 10832 30585 50366 -130234 23926 68809 77635 63097 -199482 227480
12317 65520 109338 -178758 126749 209809 287557 297178 291834 136081 -181836 -157806 222832
12305 578423 176317 405781 319235 249132 71884 -97569 307800 225460 6153 318024 -25116
12293 120577 178082 132453 -151185 -161245 121441 38495 73880 342799 136203 257055
12283 257055 -34241 298321 129701 -158870 2835 -272987 -104861 6090 144014 186080 31813
$$ packed form
12365f9557I736J77736k6316B7960K39528j18573k9240J0195L3550J35993a90405
12353h5986j26676K822i3720G0023K3903b0812B5318a22277A11646k0454a04013
12341a19446L1754k27457C0055b55995o3208d5498n4884A02649b2102B07308D0558
12329a33624b8232A0832J9753J9781a30234B3926M4883Q826j4538a99482B27480
12317F5520M3818a78758A26749Q3060P7748R621n344A36081a81836K4030B22832
12305E78423A76317K29464q6546p0103G1884i7569C07800q2340F153L11871b5116
12293A20577N7505m5629a51185j0060A21441C8495L5385K68919A36203J20852
12283B57055c4241B98321A29701a58870B835b72987a04861F090J37924M2066C1813
$$ plain form
12271 87815 103083 -84768 -120471 96386 125529 90580 159067 84787 38117 205789 107117
12260 107117 349724 -113564 -302983 106405 32129 315786 338625 69717 95690 276897
12250 276897 -96654 259052 94775 -27840 134849 159581 171523 429950 -51282 72099 161235
12239 161235 35781 74984 342530 390520 391413 268608 205747 29271 76559 -85980 204234
12227 269039 -143509 360310 145295 190978 -31630 -52320 -121291 176751 82231 25503 126766
12216 126766 21527 164738 269800 -212097 15057 -237738 41958 30535 138751 171330
12206 171330 385627 -45512 464941 265727 36088 147141 48850 53714 204347 311838
12196 311838 220009 234007 24847 178231 -44642 -112293 104231 -288622 23737 -216426 294892
$$ packed form
12271H7815J5268h4768l5703I6386K9143l4949O8487p4280C8117J67672r8672
12260A07117K42607a13564j89419A06405C2129K83657K2839F9717K5973J81207
12250B76897i6654B59052I4775b7840A34849K4732J1942K58427e1282G2099Q9136
12239A61235C5781L9203K67546M7990Q93j22805o2861B9271M7288h5980B04234
12227B69039a43509C60310A45295M5683c1630k0690o8971A76751H2231B5503J01263
12216A26766B1527J43211J05062b12097A5057b37738D1958j1423J08216L2579
12206A71330K14297d5512D64941j99214C6088J11053D8850M864J50633J07491
12196C11838r1829J3998B4847J53384d4642o7651A04231b88622B3737b16426B94892
$$ plain form
12184 -18464 161953 215880 -321759 175632 20661 383473 150766 -179298 117221 -1720
12173 100696 213455 313701 148024 108287 -76605 -71664 147584 197583 202033 41809 141853
12162 141853 334364 339848 161263 323912 206555 1240 206949 152090 100654 -196567 151810
12150 147257 183926 294196 445140 243860 467311 343537 60704 36819 69329 -48897
12139 238220 250355 195073 222159 298631 56659 -56799 -2422 67958 -203703 -30587 25187
12127 -281912 -30500 382643 -15030 238834 -146633 153528 212191 -41383 59663 -73694 163100
12115 105912 65692 -79929 175632 -10705 149736 -118018 210345 -95139 473310 120876
12104 395638 63707 31325 345119 160501 98855 353052 -167506 -234218 299427 -34244
$$ packed form
12184a8464A61953N3927c21759A75632B0661L62812A50766a79298A17221a720
12173A00696J12759J00246A48024l9737g6605M941A47584M9999M450D1809J00044
12162A41853J92511N484A61263J62649j17357A240K05709n4859n1436a96567A51810
12150A47257L6669J10270J50944k01280K23451j23774F0704k3885L2510d8897
12139B38220J2135n5282K7086P6472E6659e6799b422F7958b03703c0587B5187
12127b81912c0500C82643a5030B38834a46633A53528N8663d1383E9663g3694A63100
12115A05912m0220g9929A75632a0705A49736a18018B10345i5139D73310A20876
12104C95638F3707C1325L13794A60501o1646K54197a67506o6712B99427c4244
$$ plain form
12093 109645 177710 -282882 88363 13550 -243209 131857 24617 188570 -206859 -14839
12082 -46224 -40271 -356816 -107272 259761 -122492 34622 168104 -117947 6029 138193 104239
12071 104239 205052 103288 -90461 153436 24887 253997 71886 13639 190650 242894
12061 242894 16930 325915 299528 -78629 54778 504499 257071 111853 314737 29344
12050 274947 148660 365740 262290 87438 20417 137586 -59160 68094 797 -72413 -70045
12039 -70045 -119970 104850 488206 -13865 209991 25160 288078 144556 -148983 34510
12028 126187 -32541 355771 296205 -254070 -310626 -121662 -120406 -106592 -121528 -135239 -84631
12017 -84631 -46041 -18353 178692 14846 69066 186105 -129503 273971 155736 -196307
$$ packed form
12093A09645O8065b82882H8363A3550b43209A31857B4617J63953b06859a4839
12082d6224N953l16545a07272B59761a22492C4622J33482a17947F029J32164l3954
12071A04239J00813j01764i0461A53436B4887K29110G1886A3639J77011N2244
12061B42894A6930L08985k6387g8629E4778M49721k47428A11853K02884B9344
12050B74947j26287K17080j03450H7438B0417J17169e9160F8094G97g2413K368
12039g0045m9925A04850L83356a3865B09991B5160K62918j43522a48983C4510
12028A26187c2541C55771n9566b54070n6556a21662J256J3814j4936j3711N0608
12017h4631L8590a8353A78692A4846N4220J17039a29503B73971j18235a96307
$$ plain form
12006 -102563 215960 309679 337674 141365 190877 241431 29984 -102251 301506 123542
11995 256825 -455571 82493 -129658 -98571 197788 196605 61097 213312 -51176 33536 148418
11984 148418 14957 32659 -326538 -54927 -70154 -340376 48868 365435 45262 118129 334836
11973 334836 92442 76385 -163439 -239310 85783 -215255 42445 208132 -32492 32325 33466
11962 33466 154178 -146194 198126 118347 -101902 154032 -284339 35563 -456341 32665
11951 -37914 77429 115801 162849 100957 59650 -106941 194762 -316735 209745 106849 -98062
11939 -9158 2414 160307 120933 54059 169721 -131820 -99018 91339 -265758 -280010 11626
11927 154269 9712 67300 -248754 -98335 171472 216156 -13658 -194542 124894 509565 -244169
$$ packed form
12006a02563B15960R3719K7995A41365M9512N0554B9984a02251C01506A23542
11995B56825d55571H2493a29658L1087A97788j183F1097J52215e1176C3536J14882
11984A48418A4957J7702c26538e4927j5227k70222D8868L16567D5262P2867K16707
11973C34836I2442j6057a63439p5871H5783b15255D2445J65687c2492C2325J141
11962C3466J20712a46194A98126p9779a01902A54032b84339C5563d56341C2665
11951c7914G7429L8372M7048o1892m1307a06941A94762c16735B09745j02896i8062
11939i158B414J57893l9374E4059J15662a31820L2802I1339b65758j4252A1626
11927A54269I712N7588b48754i8335A71472M4684a3658j80884A24894L84671b44169
$$ plain form
11915 78151 -241212 -52422 -70044 -259037 39472 -172456 -206523 52730 -325632 -74307 373118
11903 147515 43733 -110334 184309 -84723 -53866 -317390 -89091 1979 113359 60931 103853
11892 103853 212153 43274 43973 -208032 -343435 -190058 -247704 -7010 -159406 -324443 -145177
11880 -58158 -131728 -324729 -24778 34262 -46354 3192 -80208 -123025 163372 -160195 113015
11868 -128599 112552 136088 -100244 145238 77667 69850 -103078 -398337 -198354 192999
11857 248911 -226966 -102181 -153535 3414 -360067 17007 742 -160481 45417 -315857 -141831
11845 75541 122153 21418 191479 -151872 202729 -344207 331002 -24239 35827 36227 -180819
11833 -26171 180119 -284440 -196613 200964 317171 -42682 -239565 -1781 -175749 53976 24607
$$ packed form
11915G8151b41212e2422j7622j88993C9472a72456l4067E2730c25632g4307C73118
11903A47515D3733a10334A84309h4723L0857k63524h9091A979J11380n2428M2922
11892A03853J08300D3274O99b08032j35403J53377n7646g010j52396j65037a45177
11880e8158p3570j93001b4778C4262d6354C192h0208m2817A63372a60195A13015
11868a28599A12552K3536a00244A45238o7571p817a03078k95259a98354A92999
11857B48911b26966a02181n1354C414c60067A7007G42a60481D5417c15857a41831
11845G5541M6612B1418J70061a51872B02729c44207C31002b4239C5827M00a80819
11833b6171A80119b84440Q7827B00964J16207d2682j96883a781j73968E3976B4607
$$ plain form
11821 222937 -150407 58707 51056 -248454 236499 -100759 320163 253982 44707 -337248
11810 -202446 -372324 -308850 52103 252926 -348496 -47850 -105205 -10553 -258669 235362
11799 -52680 -26855 -406 -143904 -211582 43730 -231695 -265839 135461 -232665 23533 -230559
11787 71627 -57313 -54870 84905 -129993 -42777 111553 6182 -70941 8027 58233 393076 -102996
11774 264620 162018 -120171 -53682 -183332 -329621 -207908 -169590 -111622 -27144 -48094
11764 -48094 28030 -122432 18554 67651 -185975 93509 214879 -99640 -120095 -35843 -83398
11753 -83398 -51967 -197617 86940 -55433 42125 770 -141942 -14583 -450075 -269792 -134176
11741 -13960 248686 260245 -162680 -68724 -379869 280924 -71011 -41110 63490 -245259 -159455
$$ packed form
11821B22937a50407E8707p651b48454B36499a00759C20163o6181D4707c37248
11810b02446j69878O3474E2103K00823c48496d7850n7355a0553k48116B35362
11799e2680K5825d06j43498o7678D3730b31695l4144A35461b32665B3533b30559
11787G1627e7313K443H4905a29993d2777A11553F182g0941H027N0206L34843a02996
11774B64620j02602a20171e3682j29650j46289J21713L8318N7968b7144k0950
11764d8094B8030a22432A8554M9097a85975I3509J21370i9640k0455c5843m7555
11753h3398L1431j45650H6940e5433D2125G70a41942a4583m35492J80283a34176
11741a3960B48686J1559a62680f8724l11145B80924g1011K9901F3490b45259Q5804
$$ plain form
11730 -159455 -45996 -347446 -119284 209466 -150885 66755 -38598 258729 41245 -141431
11719 -155341 -152167 69423 -170963 77732 -156023 344952 180332 100898 44834 -10536 -151728
11708 -151728 53832 149956 -206100 -168020 -252557 -95766 156002 296305 205063 -68859 314451
11696 88768 124755 -74847 67927 19397 -167637 200588 76557 -152958 165679 -186791 40792
11684 383962 -126657 19865 256059 179192 82225 432130 100828 164269 -5274 45760 -151290
11672 -62450 -266979 54405 -457225 52050 -207876 49416 -97302 23228 143385 171431 -139057
11660 448705 -82218 -63667 152971 261788 -226545 -17443 -73101 48117 -82717 -138320 -132079
11649 -132079 219567 -112880 -304123 156572 61633 136744 -8217 -79990 -132271 -50855 -74890
$$ packed form
11730a59455d5996l01450a19284B09466a50885F6755c8598B58729D1245a41431
11719a55341L174F9423a70963G7732a56023C44952j64620p9434D4834a0536j41192
11708a51728E3832R6124b06100L8080q4537i5766A56002J40303r1242f8859C14451
11696H8768L5987g4847F7927A9397a67637B00588G6557a52958A65679a86791D0792
11684C83962a26657A9865K36194p6867H2225L49905A00828O3441e274D5760a51290
11672f2450k04529E4405d57225E2050b07876D9416i7302B3228J20157K8046a39057
11660D48705h2218J8551A52971J08817b26545a7443n5658D8117h2717n5603O241
11649a32079B19567a12880j91243A56572F1633P5111h217p1773n2281e0855k4035
$$ plain form
11638 -74890 270751 -263781 274858 260666 4950 -142285 148164 224356 290554 -80402 349859
11626 323191 50014 -158604 -79630 -394006 7516 297393 -142642 -19283 59768 67922 -133742
11614 -88537 78204 181179 -96948 316679 -39142 62976 13003 -72551 72586 -294056 168240
11602 -279875 -78982 127395 -257428 130397 372865 -269468 -149342 60827 65289 -377932
11591 -2579 -101755 342522 -13921 36832 -8084 172313 4955 90298 267545 -115785 177632
11579 261642 -32637 68596 380225 26535 -18899 23429 10089 -73377 -291320 -10241 76590
11567 101115 -63937 89946 337668 -5648 -17961 37193 206383 87766 32846 -91619 154890
11555 -232631 21679 344787 -255840 -217707 -22443 216520 276726 322356 196423 -15221 4099
$$ packed form
11638g4890B70751b63781B74858j4192D950a42285A48164P6192O6198h0402C49859
11626C23191E0014a58604P8974l14376G516K89877a42642a9283E9768Q154a33742
11614h8537G8204J02975i6948C16679c9142F2976A3003g2551G2586b94056A68240
11602b79875g8982A27395b57428A30397K42468b69468J20126F0827M462c77932
11591b579r9176C42522a3921C6832h084A72313D955Q5343J77247a15785A77632
11579B61642c2637F8596L11629B6535a8899B3429A0089g3377k17943a0241G6590
11567A01115f3937H9946K47722e648j2313C7193J69190H7766C2846i1619A54890
11555b32631B1679L23108b55840L8133b2443B16520O0206M5630j25933a5221D099
$$ plain form
11543 141939 -197176 103488 40125 -345948 111201 -150154 -76779 -108263 99171 325460
11533 325460 203795 156163 120393 -36042 -50106 -166724 -58003 45079 274561 -74885 -125850
11522 -125850 -100856 -157767 127236 -465277 264529 -206335 52916 -261164 -229862 270734
11511 -20715 110678 -13058 -124666 128055 173114 127870 -3866 -68357 -128214 123282 50831
11499 199934 153412 191521 -249590 31173 122566 227357 118156 246718 120602 -5915 -16293
11488 -16293 412532 -113364 74498 312653 24908 138442 -126731 117948 166392 183594
11478 183594 189131 103500 119650 68159 165418 -164471 -175038 367879 23398 -151214 94943
11466 50967 243529 -2156 -99097 192643 210568 -69291 -72094 272838 -78163 67794 226437
$$ packed form
11543A41939a97176A03488D0125c45948A11201a50154P3375l1484I9171K26289
11533C25460j21665m7632l5770c6042j4064j16618e8003D5079K29482g4885n0965
11522a25850K4994n6911A27236d65277B64529b06335E2916b61164L1302B70734
11511b0715A10678a3058j11608A28055M5059m5244c866o4491n9857A23282E0831
11499A99934m6522L8109b49590C1173R1393J04791j09201J28562A20602e915j0378
11488a6293D12532a13364G4498K38155B4908J13534a26731A17948M8444J7202
11478A83594N537q5631J6150n1491R7259a64471j0567C67879B3398a51214I4943
11466E0967J92562b156r6941A92643J7925f9291k803B72838g8163F7794J58643
$$ plain form
11455 226437 19097 271051 -302074 10202 106898 159105 -106404 54567 -106282 231722
11444 142465 70663 -2186 37298 -99275 -124050 144592 -92350 -174916 230402 181501 87573
11432 240646 389918 -68147 -179494 135965 -63800 -21258 145920 279480 -77564 -152351
11422 -152351 93740 -311363 34927 -18035 178860 -68614 -99232 5086 -93153 140842 -61184
11410 -43365 261192 -343206 -318529 55018 -64788 25728 -115017 201537 -252894 259455
11399 -10747 -16445 202360 -26496 -63203 8742 -189311 -341761 163490 -107343 58102 4057
11387 -47831 25299 -208530 -3563 -27146 20432 56258 159160 1293 -308909 -53646 275238
11375 114761 -15322 341568 47547 -142763 179632 -227164 272792 121740 1983 -15311
$$ packed form
11455B26437A9097K51954c02074A0202R6696N2207a06404E4567a06282B31722
11444A42465G0663b186C7298i9275k4775A44592i2350q2566B30402m8901H7573
11432B40646J49272f8147j11347A35965f3800b1258A45920J33560g7564p4787
11422a52351I3740c11363C4927a8035A78860f8614l0618E086i3153A40842f1184
11410d3365B61192c43206K4677E5018f4788B5728a15017B01537b52894B59455
11399a0747n698B02360b6496l6707H742a89311j52450A63490a07343E8102D057
11387d7831B5299b08530c563k3583B0432L5826J02902A293c08909e3646B75238
11375A14761a5322C41568D7547a42763A79632b27164B72792A21740A983a5311
$$ plain form
11364 -72732 -117327 189017 252462 61853 107420 -78743 62909 -33691 236443 130763 95881
11353 95881 -22749 -56613 25122 -506247 67366 113611 181754 -5230 -12873 8828 -172406 155291
11340 204246 -235816 -324590 -213072 68154 -277470 -96051 92982 -177234 164131 144121
11330 144121 -93123 213589 73207 61666 24990 -176741 -15321 94883 -110096 179809 -270275
11318 77026 -133626 345708 -18443 75580 -276531 -40573 240932 227000 -24967 132301 -242412
11306 -85544 63510 59175 222125 245868 182890 38000 -11800 -188269 33028 229744 -303897
11294 -97067 -97221 -79490 -156821 122987 90427 -198939 -99314 -161141 -169321 -66899 349432 -147841
11281 -406914 246409 126058 -173157 -21326 -117616 -462057 -72085 161691 -150817 67263
$$ packed form
11364g2732m4595A89017O3445F1853M5567g8743F2909c3691B36443j05680l4882
11353I5881b2749l3864B5122e06247F7366M6245O8143e230p643H828a72406A55291
11340B04246b35816q8774J11518F8154b77470i6051I2982a77234A64131k0010
11330A44121i3123B13589G3207j1541B4990a76741a5321I4883a10096A79809b70275
11318G7026a33626C45708a8443G5580b76531d0573B40932j3932b4967A32301b42412
11306h5544F3510m335J62950K3743o2978C8000a1800j76469C3028J96716c03897
11294i7067j54J7731p7331A22987l2560a98939i9314o1827q180f6899C49432a47841
11281d06914B46409j20351a73157b1326r6290l44441g2085A61691a50817F7263
$$ plain form
11270 270957 -78139 64458 -190319 153291 227525 36073 -201245 -211167 -297994 -103333 197249
11258 -69942 48836 -133599 -84897 221857 -23775 60011 -34824 16466 428894 -120086 -89711
11247 -89711 -245029 216832 -260516 28803 -176483 124636 284700 -159450 -52657 62640
11236 -42859 236389 -62653 170769 -80419 -217366 -151375 -10922 -14299 -440112 133040 -196477
11224 -396027 204512 -45994 -95211 35692 -67707 -182802 -2232 -328307 -186569 -80687 4588
11212 -152139 -44180 -19314 -125168 59989 -79885 -51502 -405314 -149927 -247239 -218903 -80766
11200 180693 137143 -60356 -174111 -162520 -387845 -90953 -461978 -11042 147710 -48357 -214836
11189 -214836 -350118 -107671 401768 -102641 35201 -41024 -149401 -11493 -19151 -381205
$$ packed form
11270B70957g8139F4458a90319A53291P4234C6073b01245r922q6827a03333A97249
11258f9942D8836a33599M8702B21857b3775F0011c4824A6466M12428a20086L0375
11247h9711j55318B16832b60516B8803a76483A24636J60064a59450e2657F2640
11236d2859B36389f2653A70769h0419j36947O5991a0922l377m25813A33040a96477
11224c96027B04512d5994m9217C5692f7707j15095b232l26075J41738h0687D588
11212a52139d4180a9314j05854E9989g9885K8383l53812a49927r7312K8336h0766
11200A80693m3550f0356j13755J1591k25325i0953l71025a1042A47710d8357j66479
11189b14836j35282a07671D01768a02641C5201d1024j08377a1493p658l62054
$$ plain form
11179 -381205 -143706 -251688 174880 -269763 -195580 68119 48270 -107485 68336 -211984
11168 -49111 -271022 -151822 287933 -108725 29615 319748 123611 287183 65128 53396
11158 53396 -267323 -130315 -148346 -314956 -22221 -74566 -341808 -100326 -227461 90193
11147 -11625 145563 -40792 257233 238066 226971 -51970 19172 -141235 -106660 -43213 59913
11135 181261 113156 240264 163619 -319549 -79277 102429 -232123 127144 442494 85506
11124 -259163 128383 154710 -60648 124 75910 215564 5435 -79647 42507 360991 -4715 -82311
11112 -82311 66503 -370582 -33453 80582 10307 122425 -73291 150597 132640 192453 -19785
11100 -58111 12012 -24781 243683 -66035 180213 -205129 -40705 -136937 -248572 -112930 -133725
$$ packed form
11179c81205a43706j07982A74880b69763P4183F8119j9849a07485F8336b11984
11168d9111k21911J19200B87933a08725B9615K90133A23611J63572F5128j1732
11158E3396b67323a30315j8031j66610b2221n2345k67242a00326j27135I0193
11147a1625A45563d0792B57233j9167j1095e1970A9172a41235L4575d3213E9913
11135A81261o8105J27108p6645c19549g9277A02429b32123A27144L15350H5506
11124b59163A28383K6327f0648A24P5786J39654E435g9647D2507L18484d715p7596
11112h2311F6503c70582c3453H0582A0307J12118g3291A50597j7957N9813a9785
11100e8111A2012b4781B43683f6035A80213b05129d0705r6232j11635a12930k0795
$$ plain form
11089 -133725 -161916 134956 30618 100588 115214 -346784 48624 -114312 4383 -175785 -131047
11078 -131047 -5115 96375 93562 19868 -167375 88691 463507 190860 344852 203219 211828
11067 211828 114808 131847 200921 184935 222893 -48779 -137264 360898 554095 89406 221433
11056 221433 -157569 143969 350850 157505 464782 435077 336550 75344 508198 384967
11046 384967 98248 57429 169497 572463 455594 301567 269197 79191 511544 422234
11036 422234 612497 737779 691386 617030 601394 479224 640043 553699 429636 449905
11026 449905 657771 791094 551040 429835 922857 704524 433539 540884 487564 582141
11016 582141 560925 500278 384645 468776 789605 353690 711605 822345 808772 292944
$$ packed form
11089a33725k8191A34956C0618O9970J4626c46784D8624a14312D383a75785M4738
11078a31047e115I6375k813A9868a67375H8691L74816A90860J53992j41633Q609
11067B11828r7020J7039O9074j5986L7958d8779q8485C60898J93197H9406J32027
11056B21433a57569A43969K06881A57505L07277k9705r8527G5344M32854j23231
11046C84967I8248m0819J12068M02966j16869j54027l2370G9191M32353q9310
11036D22234J90263J25282m6393p4356j5636j22170J60819q6344j24063K0269
11026D49905K07866J33323k40054j21205M93022k18333k70985J07345n3320R4577
11016E82141k1216o0647j15633Q4131L20829C53690L57915J10740j3573B92944
$$ plain form
11005 776638 537229 285172 510818 474645 646837 473896 506017 311041 168564 426132
10995 426132 535784 723978 672305 793075 311812 282910 428286 355102 284853 728134
10985 728134 614745 634455 485599 98351 477666 525469 708342 528167 346701 334683
10975 334683 361979 624259 546690 631081 648151 645105 620041 797762 717265 665468 824874
10964 824874 644968 793178 962968 1217658 1287852 1354804 1353876 1696391 1505107 1905247
10954 1905247 2147447 1851956 2253008 2094519 1963589 1942999 1801892 1365596 1392642 1390494
10944 1390494 1287995 1345520 1272286 1292801 1799383 1551378 1584246 1537542 1487121 1509246 1261194
10933 1261194 1173977 1318660 1207960 690905 515577 349347 793364 416033 211438 124486
$$ packed form
11005G76638k39409k52057K25646l6173J72192j72941L2121j94976j42477K57568
10995D26132J09652J88194n1673J20770C11812k8902J45376p3184p0249M43281
10985G28134j13389J9710j48856I8351L79315M7803J82873j80175j81466j2018
10975C34683K7296K62280p7569Q4391J7070l046k5064J77721q0497n1797J59406
10964H24874j79906J48210J69790K54690P0194O6952r28L42515j91284M00140
10954A905247K42200k95491M01052j58489j30930k0590j41107m36296K7046k148
10944A390494j02499N7525p3234K0515N06582k48005L2868m6704n0421K2125k48052
10933A261194q7217J44683j10700n17055j75328j66230M44017l77331k04595q6952
$$ plain form
10923 124486 269896 437098 73479 -27091 -17920 -51234 -208585 100606 113725 256957 167348
10912 167348 41279 -181781 14897 326228 -96113 50558 -52716 404801 -142700 -402534
10902 -402534 -75744 -257101 -220867 -273184 -346777 230388 -433065 3060 -213949 7460 238143
10891 238143 93293 -151801 37444 188370 -98828 -24933 2737 -216786 27643 -187642 -245760
10880 -245760 -264005 105808 35328 406439 -57200 -95642 110773 254574 -98128 10355 126507
10869 126507 156957 112820 -25338 -58591 -222065 -234658 -87533 -147550 -113023 -300480 78760
10857 -109320 169041 -60260 139802 -28177 38931 31516 240822 -82001 241235 108082 221499
10846 221499 -12423 -102319 166236 -211077 184360 7809 -53921 133733 -16752 -167465 -201403
$$ packed form
10923A24486J45410J67202G3479b7091R171l3314j57351A00606J3119J43232q9609
10912A67348D1279a81781A4897L11331i6113E0558e2716D04801a42700k59834
10902d02534g5744j81357L6234n2317p3593B30388d33065C060b13949G460K30683
10891B38143I3293a51801C7444J50926i8828b4933B737b16786B7643a87642n8118
10880b45760j8245A05808C5328L71111e7200l8442A10773J43801i8128A0355J16152
10869A26507L0450m4137b5338l3253j63474j2593h7533o0017L4527j87457G8760
10857a09320A69041f0260A39802b8177C8931p415K09306h2001B41235A08082J13417
10846B21499a2423q9896A66236b11077A84360G809e3921A33733a6752j50713l3938
$$ plain form
10835 -201403 -4481 -155395 74056 31248 190824 -179526 -53222 -262239 108122 46550 61840
10824 61840 -5078 33595 -308098 -184251 -345729 -211504 -183845 -345679 -49777 114481 -262897
10812 154954 3834 -85923 -190856 -123926 -764 60566 -50037 -483436 -26078 148859 64580
10800 -292094 -220735 -117623 34867 -263193 13260 -376298 -9854 253865 158610 185233 -418056
10788 -22770 98489 -20125 32323 38815 -169462 143697 -227895 273189 -224542 82587 36856
10776 -117464 -19487 31502 -286582 -19561 -182577 -180608 101828 -283040 -60778 53645 -5115
10764 157247 207585 -206589 -265537 -231475 35303 159989 61625 -116008 -192703 111278 165596
10753 165596 219607 161532 38035 -112925 153908 -132899 -191111 -54576 -51202 -184022 140655
$$ packed form
10835b01403d481j50914G4056C1248J59576a79526e3222k09017A08122D6550J5290
10824F1840e078C3595c08098J23847j61478J34225K7659j61834d9777A14481b62897
10812A54954C834h5923j04933O6930g64F0566e0037m33399b6078A48859F4580
10800b92094P1359J03112C4867b63193A3260c76298i854B53865r5255K6623d18056
10788b2770I8489b0125C2323O492a69462A43697b27895B73189b24542H2587C6856
10776a17464a9487C1502b86582a9561j63016J969A01828b83040f0778E3645e115
10764A57247N0338b06589n8948L4062C5303J24686F1625a16008p6695A11278N4318
10753A65596N4011n8075C8035a12925A53908a32899n8212e4576L374j32820A40655
$$ plain form
10741 -116685 89135 -227143 -115159 -381184 300129 -871 -31204 -285532 206267 146306 -80034
10729 147041 -154524 -53109 -10116 -200108 48025 -271856 187910 45285 -226335 108986
10718 28185 -75237 184495 6462 -187650 -21632 -138076 325948 -107712 186474 133769 -97638
10706 -382880 332543 -265875 91395 -41608 -356239 55627 -31660 92791 61440 -152256 153335
10694 -202163 78314 -80265 -202702 75493 -206166 -157735 -328713 67796 -454822 -147146
10683 180882 -106591 -384723 17159 -162857 -63861 34490 -186912 96876 -34616 114743
10672 160714 63807 -18366 24440 -18054 172219 77146 361000 -37865 -83323 -64637 -284915
10661 -284915 -10901 -231066 -279014 -378590 -22813 -151941 -21679 12991 -205013 -13900 -58680
$$ packed form
10741a16685H9135b27143J11984k66025C00129h71l0333k54328B06267n9961h0034
10729A47041a54524e3109a0116j89992D8025b71856A87910D5285b26335A08986
10718B8185g5237A84495F462a87650b1632j16444C25948a07712A86474n2705i7638
10706c82880C32543b65875I1395d1608l14631E5627c1660I2791l1351a52256A53335
10694b02163G8314h0265j22437G5493b06166M8431j70978F7796d54822a47146
10683A80882a06591k78132A7159a62857f3861C4490a86912I6876c4616A14743
10672A60714F3807a8366B4440a8054A72219G7146K83854c7865m5458J8686k20278
10661b84915a0901k20165m7948r9576b2813j29128b1679A2991b05013a3900m4780
$$ plain form
10650 -58680 -102518 -119796 -319326 -435511 354189 -52048 -172222 117568 197667 -297648
10639 -252264 -125357 41716 27205 -131585 -137960 -255856 -25912 -207713 -332018 -135584
10628 -26537 -78152 -25999 134173 -400579 194813 -225831 -240305 -143803 -103490 141676 -168649
10616 -42182 112040 -196081 66308 -68823 147455 12700 -206722 -107938 -281311 -109063
10605 -69206 -263747 56933 3424 -124959 150490 -323531 -99910 -286268 -448360 101443
10594 -219898 -152536 -107281 -257476 -388234 71554 -12718 57316 -60841 -48461 -20654 -213563
10583 -213563 -357128 180311 -81010 -57634 9115 -64787 -30067 70256 78876 289183 74395
10571 -147543 -474264 201505 -175323 -91085 -291716 1700 129466 -26306 108564 -242985
$$ packed form
10650e8680m3838j7278j99530j16185C54189e2048j20174A17568Q0099b97648
10639b52264a25357D1716j4511a31585o375j17896b5912j81801j24305a35584
10628b6537n1615b5999A34173d00579A94813b25831j4474R6502M0313A41676a68649
10616d2182A12040a96081F6308f8823A47455A2700b06722R8784j73373a09063
10605f9206j94541E6933C424a24959A50490c23531i9910j86358j62092A01443
10594b19898O7362M5255j50195j30758G1554a2718E7316f0841J2380b0654j92909
10583b13563j43565A80311h1010K3376I115f4787c0067G0256Q620K10307G4395
10571a47543l26721B01505a75323Q4238k00631A700J27766b6306A08564b42985
$$ plain form
10560 12447 26506 220190 48356 -104466 -358706 71584 46862 -112559 -269868 -106829
10549 -335980 -18833 -71855 135095 -277304 -172803 -294601 -227933 -361627 202528 -157525
10538 -105964 121131 -201595 -48434 -130312 -331272 -281704 -149625 -264404 472046 -209482
10527 197891 -16631 -27485 -367880 -179175 -258893 -13168 199002 15810 142226 33124 75263
10516 75263 -84572 252518 79802 -61684 -347442 26873 -212567 -224236 -190488 -63881 -40125
10505 -40125 -403692 -59842 163237 -20915 -34808 -68436 -16691 -174764 -176653 -135418 -832 -152988
10493 -152988 -216561 -64011 239352 133143 -112902 -207820 -6062 -488439 213854 -45305 130694
10481 -10732 357746 -92433 152996 121141 165403 233906 151555 -72689 188991 -318879 55019
$$ packed form
10560A2447J4059J93684D8356a04466k54240G1584k4722a12559j57309a06829
10549c35980a8833n3022A35095b77304J04501j21798O6668j33694B02528a57525
10538a05964A21131b01595d8434q1878k00960M9568J32079j14779D72046b09482
10527A97891a6631j0854l40395a79175p9718a3168A99002A5810J26416C3124M2139
10516G5263h4572B52518G9802f1684k85758B6873b12567j1669L3748f3881K3756
10505d0125l63567e9842A63237b0915j3893l3628a6691j58073j889M1235h32j52156
10493a52988o3573f4011B39352j06209a12902r4918f062m82377B13854d5305A30694
10481a0732C57746i2433A52996l1855M4262O8503q2351g2689A88991c18879E5019
$$ plain form
10469 -27704 -215990 130237 142567 -84042 181388 -4735 346804 -732 397423 330543 607339
10458 607339 144232 232842 444105 6062 -75946 212558 -244421 199998 245068 143967
10448 143967 360046 345629 29297 -29690 -9267 -17170 295941 -221841 9153 20494 81818
10437 81818 -48680 184514 196555 -493487 280084 -83673 -58886 -137273 29909 32954 18737
10426 18737 -205016 -147004 -283006 -3964 -76114 -309370 -160071 -127249 -58417 28712 -327955
10414 -79708 -126187 41691 -305139 250120 -104798 -66078 -279813 102377 -203253 -205693 -28403
10402 -48240 30468 65129 99535 -521671 -315947 -243826 46233 165191 -213863 117559 -52607
10390 -93190 -32559 -117436 38574 -209653 62666 -166067 21143 -71163 -209531 -107110 -136432
$$ packed form
10469b7704j88286A30237J2330h4042A81388d735C46804g32C97423o6880K76796
10458F07339A44232Q8610K11263F062g5946B12558b44421A99998M5070j01101
10448A43967K16079j4417B9297b9690i267p903B95941b21841I153J1341O1324
10437H1818d8680A84514J2041d93487B80084h3673K4787p8387B9909L045j4217
10426A8737b05016N8012j36002c964p2150k33256J49299L2822e8417B8712c27955
10414g9708m6479D1691c05139B50120a04798L8720k13735A02377b03253k440b8403
10402d8240C0468L4661L4406e21671K05724P2121D6233J18958b13863A17559e2607
10390i3190c2559q4877C8574b09653F2666a66067B1143g1163j38368J02421k9322
$$ plain form
10379 -136432 22354 -38534 -48253 60523 221357 -126335 -78029 -28540 -261657 -75823 49348
10367 -96231 -330589 261817 -35042 -222949 -126695 70013 181235 104847 -327344 211669
10356 34899 436327 256554 23682 176517 228395 122492 19533 323679 230214 432914
10346 432914 71698 253548 155607 134860 235850 175560 338924 226644 140183 161404 276020
10335 276020 525962 277144 290610 583358 159189 425122 578052 144764 300236 123396
10324 268178 394490 405821 231888 -172930 -201161 241768 2091 -73832 2284 -193593 -103725
10313 -103725 254085 59751 -24531 321113 -117112 119712 -27037 -15245 112982 134110
10303 134110 12497 -90237 135424 74237 -289177 -133422 295347 62636 34340 267459
$$ packed form
10379a36432B2354c8534r719F0523J60834a26335M8306b8540k33117g5823D9348
10367i6231k34358B61817c5042j87907R6254G0013J11222p6388c27344B11669
10356C4899M01428j79773B3682J52835N1878j05903A9533L04146r3465K02700
10346D32914G1698J81850r7941k0747J00990o0290J63364j12280q6461K1221J14616
10335B76020K49942k48818J3466K92748A59189K65933J52930A44764J55472A23396
10324B68178J26312J1331j73933a72930k8231B41768B091g3832B284a93593Q9868
10313a03725B54085E9751b4531C21113a17112A19712b7037J1792A12982K1128
10303A34110A2497i0237A35424o1187b89177a33422B95347F2636k8296K33119
$$ plain form
10293 267459 -15461 -162571 231231 -33199 -207539 -220699 -27775 -67260 71684 -263983 -585890
10282 -585890 52985 -41043 -102692 -146070 74705 34511 22148 -9338 -1140 255324 -225783
10270 51565 165763 160185 -407442 173963 76682 280654 -107269 90187 5497 5557 93559 -150639
10257 -359868 -146355 -60622 -63610 98265 147401 239498 -279243 -34984 256999 189464 125653
10246 125653 -10719 -556740 270065 -527074 -122477 -161668 227347 -146816 -143539 -15012
10235 398426 143420 -409641 102934 171837 -208735 -169860 93886 -41359 -197764 63292
10224 -1110 -5715 -239722 -69090 -47953 -143651 -268061 -161136 -167684 -134023 -120653 -36788 59440
10211 -118701 75749 -131813 323390 -86610 -9618 49403 -108817 138723 185849 -231456 -364208
$$ packed form
10293B67459a5461j47110B31231c3199j74340j3160b7775l9485G1684b63983l21907
10282e85890E2985d1043o1649m3378G4705C4511j2363i338a140B55324b25783
10270E1565J14198n578d07442A73963G6682K03972a07269I0187E497O0Q8002a50639
10257c59868a46355f0622k988I8265M9136R2097b79243c4984B56999o7535o3811
10246A25653a0719n46021B70065e27074a22477l9191B27347a46816L277a5012
10235C98426A43420d09641A02934O8903b08735L8875I3886d1359j56405F3292
10224a110m605k34007f9090K1137r5698j24410J06925o548L3661J3370c6788E9440
10211a18701G5749a31813C23390h6610i618D9403a08817A38723M7126b31456j32752
$$ plain form
10200 -364208 -27150 -129244 15857 97668 42454 -349667 -26087 -120329 -147451 -275920 41297
10188 -40540 -109907 -121917 74907 129967 -279383 51898 184830 39575 -98405 172007 -79950
10176 99497 14105 361658 70556 -142745 -156515 -141194 -299948 213538 -366741 -320622 -238408
10165 -238408 -48779 -118321 85830 -401285 -7483 -152931 30286 65988 -57867 121599 -131638
10153 -98478 -245234 -63658 39151 -36087 -119630 -316380 81823 -101272 116261 70289 16517
10141 -124692 -91967 89923 52580 -46613 -60740 -229929 144436 -82180 -215510 160951 -192630
10129 -158328 314162 -481730 -377192 -242926 58204 -11422 -98191 58042 -36187 -564344
10119 -564344 -338233 96522 -25948 -444752 -340001 -79543 7762 -91449 -313969 31879 -382529
$$ packed form
10200c64208b7150j02094A5857Q1811D2454c49667b6087r4242k7122j28469D1297
10188d0540o9367j2010G4907N5060b79383E1898J32932C9575i8405A72007g9950
10176I9497A4105L47553G0556a42745j3770J5321j58754B13538c66741M6119Q2214
10165b38408d8779o9542H5830d01285g483j45448C0286L5702e7867A21599a31638
10153i8478j46756f3658C9151c6087q3543j96750H1823a01272A16261m5972A6517
10141a24692L2725H9923l7343d6613j4127j69189A44436h2180j33330A60951a92630
10129a58328C14162d81730J04538J34266E8204a1422q6769E8042c6187n28157
10119e64344K26111I6522b5948m18804J04751g9543G762i1449k22520C1879c82529
$$ plain form
10107 -136642 -242644 121436 79446 193896 -10253 11013 -79772 215696 -350074 -427453
10097 -427453 -32043 -209722 123067 -193437 -91774 192284 -202098 16406 -65330 -141061
10087 -141061 16554 -196494 111418 -202286 55528 -217549 107636 36550 -139782 41084
10076 -264135 -22028 146580 115493 173154 -125492 -155675 -23294 217884 -35980 -14422 120542
10064 -214843 -55086 -329811 -4723 24207 124147 -214708 76633 111741 -282260 -14491 -92269
10053 -92269 214007 -210144 130619 -89176 -130855 -171111 32531 -194435 157165 126300 -68332
10041 -76141 -171921 147194 -292834 -189654 -209104 417346 135137 264283 281217 -275145
10030 -41834 -83585 -217937 24378 -52232 -61323 105320 -71502 -39706 -50786 21614 316826
$$ packed form
10107a36642j06002A21436m1990J14450a0253A1013g9772B15696c50074p7379
10097d27453c2043j77679A23067a93437i1774A92284b02098A6406f5330p5731
10087a41061A6554a96494A11418b02286E5528b17549A07636C6550a39782D1084
10076b64135b2028A46580l1087N7661a25492l0183b3294B17884c5980a4422A20542
10064b14843e5086k74725d723B4207R9940b14708G6633L5108b82260a4491p7778
10053i2269B14007b10144A30619h9176m1679m0256C2531a94435A57165l0865f8332
10041g6141r5780A47194b92834J03180j9450D17346A35137J29146J6934b75145
10030d1834m1751j34352B4378e2232r091A05320g1502L1796j1080B1614K95212
$$ plain form
10019 316826 -105044 9453 -179778 -86103 101712 -454205 119995 32389 -155982 14978
10008 -210679 55670 222523 -128233 -106126 -374015 -48401 -227871 70033 95587 101317 112254
9997 112254 -106585 194316 101943 17980 32955 -266542 287395 9311 130001 -63479 131531
9985 31868 94617 -79199 148544 -308617 -141593 -127169 -325713 128137 -236649 -87302 1337
9973 -77197 85000 -217539 -50214 227483 41941 25064 -193935 26988 147624 -299382 156113
9961 141579 264380 -49804 236805 -256475 -13272 32504 -36036 -149295 146300 73621 -341041
9949 -163523 -25875 146358 -51693 20926 -195505 -230943 -77806 56206 -337874 -333772 10721
9937 138114 34783 -158541 -166243 13913 83868 -207728 44847 -137082 -146554 -181631 289954
$$ packed form
10019C16826a05044I453a79778h6103A01712d54205A19995C2389a55982A4978
10008b10679E5670J66853a28233K2107k67889d8401j79470G0033K5554N730J0937
9997A12254a06585A94316r2373A7980J4975b66542B87395I311J20690f3479A31531
9985C1868O2749g9199A48544c08617a41593J4424j98544A28137b36649h7302A337
9973g7197H5000b17539e0214B27483D1941j6877a93935B6988J20636b99382A56113
9961A41579J22801d9804B36805b56475a3272C2504c6036j13259A46300p2679c41041
9949a63523b5875A46358e1693B0926a95505l5438g7806E6206c37874M102A0721
9937A38114C4783a58541p702A3913O9955b07728D4847a37082r472l5077B89954
$$ plain form
9925 -81470 -137529 -548243 -172231 -415808 -269349 -987 -342383 -53718 -64591 107451 -106411
9913 -565942 49538 72273 -123253 55562 22502 1770 -264328 -147992 217053 50664 -277968
9901 144092 45989 -136856 -83899 117081 102391 -145073 -212743 -62222 -72043 -165635 -68779
9889 154508 72369 3457 -31112 -551989 -181943 -45230 -364791 -199704 -55804 -402511 -210441
9878 -210441 -295749 -469766 -69380 -65708 -266363 -473869 136696 182977 -206283 -68035 -200924
9867 -200924 165370 -201549 -381478 -132715 -140030 -127887 26049 -21044 -79157 -190781 -15625
9855 -136494 200175 23458 -303616 -201747 -83865 -373902 92172 194032 -381489 113765
9844 306383 -266858 -37010 -4647 268828 -58622 -410855 -133142 -236412 41491 155082 209820
$$ packed form
9925h1470n6059m10714a72231k43577J46459i87l41396e3718j0873A07451a06411
9913e65942D9538K2735a23253E5562B2502A770b64328J16336B17053E0664b77968
9901A44092D5989a36856N2957A17081j4690a45073o7670f2222r821r3592f8779
9889A54508G2369C457c1112n20877a81943d5230l19561J65087e5804l46707J92070
9878b10441q5308j74017f9380L672k00655k07506A36696M6281b06283f8035j32889
9867b00924A65370b01549j79929a32715p315J2143B6049b1044n8113j11624a5625
9855a36494B00175B3458c03616J01869h3865k90037I2172J01860c81489A13765
9844C06383b66858c7010d647B68828e8622l52233a33142j03270D1491J13591N4738
$$ plain form
9833 209820 -362981 -40625 48176 98154 -102286 -144787 203073 -60304 -140999 -51041 -56055
9822 -56055 -59115 -319738 55144 225302 -3942 307226 2134 -270987 143320 -176522 -255259
9811 -255259 -9682 -144187 -37309 -107645 355425 43022 -32419 144201 -268357 -193524 5947
9799 -95610 -154028 -123408 -46326 107547 46713 -196064 29230 -217378 52696 -7636 48189
9787 37192 -75624 -105585 10541 289916 -234363 -109920 -190118 -199325 -108833 -102836 207639
9775 -47382 -157561 -286475 -234400 -72261 -162133 153707 -252286 -179986 -6621 -25502 -71359
9764 -71359 -211216 186244 -287950 -171159 66362 -200788 114118 -122771 -211889 -60697
9753 -131321 -420688 -169812 57954 -149430 118106 -11181 -55820 -64449 -210495 -189742 -145855
$$ packed form
9833B09820c62981d0625D8176M9978a02286m2501B03073f0304q0695e1041n014
9822e6055l060k60623E5144J70158c942C07226B134b70987A43320a76522p8737
9811b55259i682j34505c7309p0336C55425D3022c2419A44201b68357P4833E947
9799i5610n8418L0620d6326A07547D6713a96064B9230b17378E2696g636D8189
9787C7192g5624k9961A0541K79375b34363a09920q0198r207R0492N997B07639
9775d7382j10179j28914N2075g2261q9872A53707b52286P2300f621j8881m5857
9764g1359j39857A86244b87950J16791F6362b00788A14118a22771q9118f0697
9753a31321k89367a69812E7954a49430A18106a1181m4639q629j46046K0753M3887
$$ plain form
9742 -145855 24141 -253774 -32631 -46474 48132 -17905 -118958 -89188 -214229 140290 -358921
9730 -71396 408426 39426 -25123 -534244 -151059 -252964 144543 98564 -281445 219666
9719 -317590 15986 10838 -136916 246418 -286445 -166603 -176987 -76162 -118705 -119996 80670
9707 260840 -347169 -20455 89849 -72722 185000 -163336 -211102 -133691 -420813 -48341 326707
9695 331917 57184 -92484 289899 -233934 -127028 126044 -140494 -109904 86148 -375600
9684 -245623 -258955 -46685 5796 -168931 -27474 -142476 86694 34837 146954 -58098 74315
9672 -121967 -351780 -407296 -53339 -130095 83651 92631 -180602 -134288 -189903 -54200 -26053
9660 -45279 40607 264418 -18840 -593726 111880 16691 -224524 -283497 -93830 -190936 156536
$$ packed form
9742a45855B4141b53774c2631j3843D8132a7905j01053K9770j25041A40290c58921
9730g1396D08426C9426b5123n09121a51059j01905A44543m5979b81445B19666
9719c17590A5986n148a36916B46418b86445J19842j0384g6162m2543j291H0670
9707B60840c47169b0455H9849g2722A85000a63336m7766P7411k87122d8341C26707
9695C31917E7184i2484B89899b33934J06906A26044a40494L0590H6148c75600
9684b45623j3332d6685E796a68931b7474j15002H6694C4837J12117e8098G4315
9672a21967k29813n5516e3339p6756H3651Q980a80602M6314n5615e4200b6053
9660d5279D0607K23811a8840n74886A11880A6691b24524n8973i3830r7106A56536
$$ plain form
9648 210888 334298 22213 -251757 30412 -62275 -93514 51919 -153257 -243891 -17206 4961
9636 -152402 -210596 -39051 108837 1725 -106349 -773 -108056 297524 -71586 -18371 -153119
9625 -153119 220216 -117100 -53050 170113 -364541 12333 85847 -225888 91897 -137304
9614 -131128 -174606 249711 66517 -178269 -303960 -31258 -174295 -233825 -94594 -24062 128135
9602 -366637 -215751 -58204 137849 70046 -275991 -182551 82755 296635 -604845 -270474
9591 -119699 -196357 204678 36751 116889 203966 -271373 6095 -392687 107599 -149198 -234824
9580 -234824 -125199 -362328 -278546 -149971 -151719 -286205 -68667 -286218 27008 104350 -149569
9568 -92126 -126062 -340753 92206 -197355 -138943 -64402 -167190 -233169 -139941 -194269 -148662
$$ packed form
9648B10888J23410B2213b51757C0412f2275l1239E1919a53257r0634a7206D961
9636a52402n8194c9051A08837A725a06349g73j07283B97524g1586a8371j34748
9625a53119B20216a17100e3050A70113c64541A2333P3514b25888I1897a37304
9614a31128m3478B49711F6517a78269j25691c1258j43037n9530i4594b4062A28135
9602c66637J50886e8204A37849o7803b75991R3440H2755K13880f04845b70474
9591a19699p6658B04678C6751Q0138Q7077b71373F095c92687A07599a49198q5626
9580b34824J09625k37129Q3782J28575j748j34486f8667k17551B7008P7342a49569
9568i2126l3936k14691I2206a97355N8412f4402j02788o5979R3228n4328M5607
$$ plain form
9557 -148662 193375 22242 1795 -165215 -388458 -117299 -283215 -426799 96397 -39203 -392569
9546 -392569 23609 15040 -362970 281505 199546 -239925 -85972 51554 -2929 -39570 86351
9534 -416176 68449 151014 -174762 -181215 -150582 104166 -69214 45369 -133297 -41359 -391832
9523 -391832 -7328 -206192 -180137 190801 -60264 49207 -96322 49522 323457 12789 -424720
9511 -186376 -452748 -292223 40766 -300227 -97242 3251 -339806 -169318 187365 -319635
9500 -496490 138619 -156901 84122 163084 51060 50384 -92420 -50966 -115854 222381 173428
9489 173428 -1818 12931 59715 13888 1948 86495 -298949 300158 -112237 -75158 -60572
9478 -60572 182580 88150 -82422 -131946 -257437 42386 46383 126883 -266261 -35947 154717
$$ packed form
9557a48662A93375B2242A795a65215k23243a17299j65916j43584I6397c9203l53366
9546c92569B3609q569c62970B81505q1959b39925h5972E1554b929l6641H6351
9534d16176F8449Q2565a74762o453L0633A04166f9214D5369a33297d1359l50473
9523c91832g328j98864K6055A90801f0264D9207i6322D9522K73935A2789d24720
9511a86376k66372J60525D0766c00227i7242C251c39806a69318A87365c19635
9500d96490A38619a56901H4122P8962E1060o76i2420M1454o4888B22381m8953
9489A73428a818A2931M6784A3888A948Q4547b98949C00158a12237L7079J4586
9478f0572A82580H8150h2422m9524j25491D2386L997Q0500b66261c5947A54717
$$ plain form
9466 60867 39006 27485 257791 -116675 -166511 -87739 -111806 -49154 70666 -203729 -2717
9454 24405 -255300 -108956 -208864 -14563 -92448 328799 -220529 -271405 -485777 -188697 -74086
9442 -57768 -212055 109747 -177316 -19079 -21136 -731 9359 -103507 4754 -341085 -206482 -134823
9430 -134823 132211 -379677 128745 -125794 -201083 52992 -105363 -46839 73215 -194672
9419 -143859 -287981 -64179 -539981 -187557 -179775 71180 92725 146642 -186111 -147876 -258757
9408 -258757 121602 135354 218415 37203 -126036 21009 -214333 -188965 -15326 -265062 20440
9396 100475 -156939 74457 -289376 -137166 -240762 10538 52518 -98462 88474 74624 -293403
9384 214565 176257 -222776 -110242 -258675 -43372 66012 -232416 -105699 -9222 -119804 57390
$$ packed form
9466F0867k1861j1521K30306a16675m9836P8772k4067d9154G0666b03729b717
9454B4405b55300a08956r9908a4563p7885C28799b20529n0876k14372a88697g4086
9442e7768j54287A09747a77316a9079k057g31I359a03507D754c41085J34603P1659
9430a34823A32211c79677A28745a25794p5289E2992a05363d6839G3215a94672
9419a43859j44122f4179m75802a87557P782G1180K1545N3917a86111L8235j10881
9408b58757A21602J3752Q3061C7203a26036B1009b14333K5368a5326k49736B0440
9396A00475a56939G4457b89376a37166j03596A0538M1980i8462H8474j3850b93403
9384B14565l8308b22776a10242j48433d3372F6012b32416a05699i222j10582E7390
$$ plain form
9372 -237606 115940 -127005 37061 -92034 -417901 -413631 -410813 99111 -254152 227266 -368888
9360 -33214 -142898 60706 67791 -47801 137078 188434 80691 -47580 -123565 -99551 60881 -199312
9347 46594 -147184 -178869 16558 29179 153872 -140247 -177035 -280699 73859 60879 -283342
9335 -229153 114096 -176392 -276203 10106 94782 169326 -40682 -233495 -142807 -326675 -95699
9323 -229388 -176158 92445 -31465 128100 -186895 -283204 -123886 120700 -78098 -187508 176865
9311 -204504 293175 -41479 49990 15637 -76757 5750 -34977 258736 92227 -452194 52177
9299 -35893 -465271 -99224 -242530 390310 305695 22090 -217402 -65413 107406 -46468 106916
9287 -112595 -447973 89978 144886 -334992 168040 12615 -29891 102585 21433 61958 -168080
$$ packed form
9372b37606A15940a27005C7061i2034l25867M270K818I9111b54152B27266c68888
9360c3214j09684F0706P085d7801A37078N1356H0691d7580p5985K4014F0881a99312
9347D6594a47184l1685A6558J2621J24693a40247l6788j03664G3859j2980b83342
9335b29153A14096a76392r9811A0106Q4676P4544d0682j92813R0688j83868i5699
9323b29388N3230I2445c1465A28100a86895r6309a23886A20700g8098j09410A76865
9311b04504B93175d1479D9990A5637g6757E750c4977B58736I2227d52194E2177
9299c5893m29378i9224j43306C90310q4615B2090b17402f5413A07406d6468A06916
9287a12595l35378H9978N4908c34992A68040A2615b9891A02585B1433M0525a68080
$$ plain form
9275 16838 -315453 -5085 -63115 -315047 -269520 155759 69193 28776 -100010 -103762 -196762
9264 -196762 30522 -127598 179249 -14888 -227382 318713 -180998 154981 -73249 199322
9253 -296007 -319644 -63304 -10377 -28786 -113492 -150552 22957 -2023 -24704 62334 -348895 188704
9240 -399753 -116352 -241908 -61444 -349215 1999 63806 199395 -292320 -130373 -261976
9230 -261976 39542 135803 -93198 98241 -178839 -120213 -83214 -167677 260012 98567 18369
9218 -161271 -191383 268203 -152384 -71874 106323 -157295 -434048 -122235 250519 12087
9207 -57510 12026 264133 51250 -1656 -132331 -64553 -448699 40046 80530 104410 -43614
9195 -94463 135687 -93546 -257557 -167754 -160335 -299665 2863 129527 -201809 -258963 95225
$$ packed form
9275A6838c15453e085n8030k51932M5527A55759F9193B8776a00010l752r3000
9264a96762C0522a27598A79249a4888k12494C18713a80998A54981g3249A99322
9253b96007k3637f3304a0377j8409q4706l7060B2957b023k2681F2334c48895A88704
9240c99753a16352j25556f1444k87771A999O1807J35589b92320a30373j31603
9230b61976C9542R6261i3198I8241a78839N8626L6999q4463B60012I8567A8369
9218a61271l0112B68203a52384g1874A06323a57295k76753a22235B50519A2087
9207e7510A2026K52107E1250a656j30675f4553l84146D0046M0484K3880d3614
9195i4463A35687i3546j64011Q9803P419j39330B863J26664b01809n7154I5225
$$ plain form
9183 189851 -109243 10748 33821 -335426 -261793 -140187 -327 85848 -5591 34095 95168 13855
9170 -49755 -168260 59991 -178696 -240695 52383 -56619 -77376 -92257 -314715 -230254 -45673
9158 -379917 -92539 237060 -246074 -155663 -68186 -544865 -73706 25807 -190423 -352804 159475
9146 18037 -85696 215417 97472 -274948 84394 -84461 -268746 20014 196065 6286 49882
9135 49882 94606 332320 51946 24887 -2639 132109 177325 -22142 -526320 77180 -54074
9123 134222 -24709 -95624 -284290 -297001 -191499 113197 -354993 -106418 -351705 -36249
9112 8440 287653 -38391 -241480 -148444 -54563 -467339 -49619 -120466 -194964 61066 -63572
9100 -75271 38668 -29983 203391 -195994 131187 -115543 44877 -14408 199384 154796 53057
$$ packed form
9183A89851a09243A0748K3073c35426P3633J21606c27H5848e591C4095O1073A3855
9170d9755j18505E9991a78696o1999E2383e6619k0757j4881k22458Q4461d5673
9158c79917i2539B37060b46074R0411f8186m76679g3706B5807a90423j62381A59475
9146A8037h5696B15417I7472b74948H4394h4461j84285B0014J76051F286M3596
9135D9882M4724K37714E1946B4887b639A32109M5216b2142n04178G7180e4074
9123A34222b4709p0915j88666j2711J05502A13197c54993a06418k45287c6249
9112H440K79213c8391k03089R3036e4563m12776d9619p0847p4498F1066f3572
9100g5271C8668b9983B03391a95994A31187a15543D4877a4408A99384m4588E3057
$$ plain form
9088 -201261 -299400 173429 -198305 -292906 -70472 -10008 -276445 -118039 101186 31703 5723
9076 222531 -469843 -90371 258332 -173151 -88809 -103832 -295217 78973 -460824 -297581
9066 -297581 -61337 4608 180509 -138528 39073 -13582 -56520 -817 9538 -96425 106195 -131667
9053 -388651 247268 -40118 296715 18306 355886 -191105 38744 -78901 95722 50605 -334944
9041 -55388 -161499 162381 53352 105128 -22332 -329298 -235850 22657 -338458 -327160 72868
9029 -354899 125437 355653 -264331 67136 -159608 -336185 41151 -230008 -147473 -104618
9019 -104618 -267717 69123 -8225 -116992 32611 141246 -239047 186398 451202 -151876
9008 -136805 -199612 -264312 59327 104521 -208906 213676 45986 225286 192859 -358310 56479
$$ packed form
9088b01261r8139A73429a98305r4601g0472a0008k66437a18039A01186C1703E723
9076B22531d69843i0371B58332a73151Q4342j5023j91385G8973d60824J63243
9066b97581f1337D608J75901a38528C9073a3582m2938h17I538i6425A06195a31667
9053c88651B47268d0118B96715A8306L37580a91105C8744g8901I5722m5117c34944
9041e5388j06111A62381E3352N1776b2332l06966R3448B2657c38458J1298G2868
9029c54899A25437K30216b64331F7136a59608j76577D1151b30008Q2535M2855
9019a04618j63099F9123h225j08767C2611J08635b39047A86398K64804a51876
9008a36805o2807o4700E9327M5194b08906B13676D5986J79300l2427c58310E6479
$$ plain form
8996 -88510 170388 -254101 -209176 284347 -199043 -242170 -250077 -93457 199246 -189490 80470
8984 -51764 11883 -45532 26760 -29980 -329785 -419734 -169522 -133532 -151476 252149 137822
8973 137822 -98108 -83276 -32231 -137869 -28787 -63249 -101135 -391609 -20480 -123769 -323694
8962 -323694 142301 119356 -101834 -30216 297664 64399 336229 -30277 -303472 -10215 -40011
8951 -40011 -162221 290875 -5456 99312 -171101 -191775 305906 251697 -86700 256454 -9614
8939 -215764 -301898 -197033 208177 146253 156751 -134227 -107912 -216355 222203 107099
8928 -265340 -22170 85169 -12765 -275609 36068 -307700 -32899 51095 -194895 -149078 -144973
8917 -144973 -118240 185863 12730 -49240 13859 278118 -127847 388385 182290 413671
$$ packed form
8996h8510A70388b54101M4925B84347a99043m3127p907i3457A99246a89490H0470
8984e1764A1883d5532B6760b9980k99805q9949a69522L5990j7944B52149j14327
8973A37822i8108J4832c2231j05638b8787l4462l7886k90474b0480j03289j99925
8962c23694A42301k2945a01834c0216B97664F4399K71830c0277k73195a0215k9796
8951d0011j22210B90875e456I9312a71101k0674C05906n4209h6700B56454i614
8939b15764q6134J04865B08177o1924J0498a34227K6315j08443B22203A07099
8928b65340b2170H5169a2765k62844C6068c07700c2899E1095a94895M5817M105
8917a44973K6733A85863A2730d9240A3859K64259a27847C88385A82290K31381
$$ plain form
8907 413671 913723 1099736 1823829 3480147 7724858 3904068 1738202 1116762 812133
8898 812133 527068 406491 172824 178861 338928 280567 -54695 77973 -54991 -56930 27121
8886 -133283 -92966 143575 150382 -29003 64509 -7223 -114032 -420248 3640 -267884 -47318
8874 72905 -175372 -44537 -240064 153182 -147985 136277 -34804 -340335 65684 -189097
8863 110663 -78695 45362 49310 -322461 34935 167033 -74745 -236189 147245 173701 -4765
8851 62400 -236443 154777 -9741 -2692 -83091 34928 150936 -10571 -87692 -103587 -29370 -106467
$$ packed form
8907D13671N00052J86013P24093J656318M244711l820790A738202o21440l04629
8898H12133k85065j20577A72824O037J60067n8361e4695G7973e4991j939B7121
8886a33283M0317A43575O807b9003F4509g223j06809l06216C640b67884d7318
8874G2905a75372d4537j95527A53182a47985A36277c4804l05531F5684a89097
8863A10663g8695D5362L948c22461C4935J32098g4745j61444A47245K6456d765
8851F2400b36443A54777i741b692q0399C4928J16008a0571p7121j5895b9370p7097
$$ [...]
##END NTUPLES=NMR SPECTRUM
##END=
