
##TITLE=AC1150_Santander_5874980_3X255EQHRe
##JCAMPDX= 6.0         $$ Bruker NMR JCAMP-DX V2.0
##DATA TYPE= NMR SPECTRUM
##DATA CLASS= NTUPLES
##ORIGIN= BRUKER
##OWNER= Administrator
$$ 1.72 TOPSPIN		Version 2.1
$$ 2012-03-31 20:24:16.187 -0500  Administrator@TOPSPIN
$$ Compression mode = diff/dup
##.OBSERVE FREQUENCY= 400.13188235
##.OBSERVE NUCLEUS= ^1H
##.ACQUISITION MODE= SIMULTANEOUS (DQD)
##.ACQUISITION SCHEME= undefined
##.AVERAGES= 64
##.DIGITISER RES= 22
##SPECTROMETER/DATA SYSTEM= spect
##.PULSE SEQUENCE= noesygpps1d.comp
##.SOLVENT NAME= COFFEE_meoh
##.SHIFT REFERENCE= INTERNAL, COFFEE_meoh, 1, 14.96818
##AUDIT TRAIL= $$ (NUMBER, WHEN, WHO, WHERE, PROCESS, VERSION, WHAT)
$$ ##TITLE= Audit trail, TOPSPIN		Version 2.1
$$ ##JCAMPDX= 5.01
$$ ##ORIGIN= Bruker BioSpin GmbH
$$ ##OWNER= Administrator
$$ $$ C:\Bruker\TOPSPIN/data/COFFEE/nmr/AC1150_Santander_5874980_3X255EQHRe/12/pdata/1/auditp.txt
$$ ##AUDIT TRAIL=  $$ (NUMBER, WHEN, WHO, WHERE, PROCESS, VERSION, WHAT)
(   1,<2012-03-31 20:24:10.906 -0500>,<Administrator>,<TOPSPIN>,<go>,<TOPSPIN 2.1>,
      <created by zg
	started at 2012-03-31 20:12:39.125 -0500,
	POWCHK enabled, PULCHK disabled,
       configuration hash MD5:
       1A 1E CE 29 27 FD 77 03 67 4E F0 E3 C4 B2 CB 90
       data hash MD5: 64K
       8C 92 DB 61 99 F3 D5 2E A9 EA CB 43 A2 AA 8F 81>)
(   2,<2012-03-31 20:24:13.859 -0500>,<Administrator>,<TOPSPIN>,<proc1d>,<TOPSPIN 2.1>,
      <Start of raw data processing
       efp LB = 0.3 FT_mod = 6 PKNL = 1 PHC0 = 0 PHC1 = 0 SI = 128K 
       data hash MD5: 128K
       12 A0 A7 77 8F AA C7 54 F3 02 2C 87 F8 B7 95 2E>)
(   3,<2012-03-31 20:24:15.265 -0500>,<Administrator>,<TOPSPIN>,<proc1d>,<TOPSPIN 2.1>,
      <pk PHC0 = 35.40344 PHC1 = 0 
       data hash MD5: 128K
       73 6D 2F 84 3E 44 A2 C0 29 A7 95 1E 43 4C 7D 5C>)
(   4,<2012-03-31 20:24:15.812 -0500>,<Administrator>,<TOPSPIN>,<proc1d>,<TOPSPIN 2.1>,
      <abs ABSG = 1 
       data hash MD5: 128K
       1A F1 92 D0 2E 57 27 39 E4 30 05 EC 66 41 A0 0E>)
(   5,<2012-03-31 20:24:15.921 -0500>,<Administrator>,<TOPSPIN>,<proc1d>,<TOPSPIN 2.1>,
      <abs ABSG = 2 
       data hash MD5: 128K
       BC A8 18 C9 12 66 67 78 B9 A4 1F 36 64 AB E1 2A>)
(   6,<2012-03-31 20:24:15.968 -0500>,<Administrator>,<TOPSPIN>,<proc1d>,<TOPSPIN 2.1>,
      <abs ABSG = 3 
       data hash MD5: 128K
       8D 6A 53 23 A2 1E A0 E1 86 CC 70 AB AB 0C 8F 7A>)
(   7,<2012-03-31 20:24:16.046 -0500>,<Administrator>,<TOPSPIN>,<proc1d>,<TOPSPIN 2.1>,
      <abs ABSG = 4 
       data hash MD5: 128K
       3A C8 4A 2A 7E 82 A4 49 39 4D D2 7B 3F 2E 3E 98>)
(   8,<2012-03-31 20:24:16.093 -0500>,<Administrator>,<TOPSPIN>,<proc1d>,<TOPSPIN 2.1>,
      <abs ABSG = 5 
       data hash MD5: 128K
       EA 17 2E E1 8A 61 B8 C6 5E 78 EA E4 AE 0B EB 23>)
$$ ##END=
$$ 
$$ $$ hash MD5
$$ $$ FE 4E F8 EB 71 41 84 08 7F 37 77 9F 2F 18 15 28
##$RELAX= 
##$RELAX= 
##$RELAX= 
##$RELAX= 
##$RELAX= 
##$RELAX= 
##$RELAX= 
##$RELAX= 
$$ Bruker specific parameters
$$ [...]
##$TP07= 0
##$TPNAME0= <>
##$TPNAME1= <>
##$TPNAME2= <>
##$TPNAME3= <>
##$TPNAME4= <>
##$TPNAME5= <>
##$TPNAME6= <>
##$TPNAME7= <>
##$TPOAL= (0..7)
0.5 0.5 0.5 0.5 0.5 0.5 0.5 0.5
##$TPOFFS= (0..7)
0 0 0 0 0 0 0 0
##$TUNHIN= 0
##$TUNHOUT= 0
##$TUNXOUT= 0
##$USERA1= <user>
##$USERA2= <user>
##$USERA3= <user>
##$USERA4= <user>
##$USERA5= <user>
##$V9= 5
##$VALIST= <valist>
##$VCLIST= <CCCCCCCCCCCCCCC>
##$VD= 0
##$VDLIST= <DDDDDDDDDDDDDDD>
##$VPLIST= <PPPPPPPPPPPPPPP>
##$VTLIST= <TTTTTTTTTTTTTTT>
##$WBST= 2048
##$WBSW= 25
##$XGAIN= (0..3)
0 0 0 0
##$XL= 0
##$YL= 0
##$YMAX_a= 12594199
##$YMIN_a= -6219281
##$ZGOPTNS= <>
##$ZL1= 120
##$ZL2= 120
##$ZL3= 120
##$ZL4= 120
##$ABSF1= 14.96818
##$ABSF2= -5.584351
##$ABSG= 5
##$ABSL= 3
##$ALPHA= 0
##$AQORDER= 0
##$ASSFAC= 0
##$ASSFACI= 0
##$ASSFACX= 0
##$ASSWID= 0
##$AUNMP= <proc_prof1d_extract.lims>
##$AXLEFT= 0
##$AXNAME= <>
##$AXNUC= <1H>
##$AXRIGHT= 0
##$AXTYPE= 0
##$AXUNIT= <>
##$AZFE= 0.1
##$AZFW= 0.1
##$BCFW= 0
##$BC_mod= 0
##$BYTORDP= 0
##$COROFFS= 0
##$CY= 15
##$DATMOD= 1
##$DC= 0
##$DFILT= <>
##$DTYPP= 0
##$F1P= 0
##$F2P= 0
##$FCOR= 0.5
##$FTSIZE= 131072
##$FT_mod= 6
##$GAMMA= 0
##$GB= 0
##$INTBC= 1
##$INTSCL= 1
##$ISEN= 128
##$LB= 0.3
##$LEV0= 0
##$LPBIN= 0
##$MAXI= 10000
##$MC2= 0
##$MEAN= 0
##$ME_mod= 0
##$MI= 0
##$NCOEF= 0
##$NC_proc= -3
##$NLEV= 6
##$NOISF1= 0
##$NOISF2= 0
##$NSP= 0
##$NTH_PI= 0
##$NZP= 0
##$OFFSET= 14.96818
##$PC= 1
##$PHC0= 35.40344
##$PHC1= 0
##$PH_mod= 1
##$PKNL= yes
##$PPARMOD= 0
##$PPDIAG= 0
##$PPIPTYP= 0
##$PPMPNUM= 2147483647
##$PPRESOL= 1
##$PSCAL= 4
##$PSIGN= 0
##$PYNMP= <proc.py>
##$REVERSE= no
##$SF= 400.130004975834
##$SI= 131072
##$SIGF1= 0
##$SIGF2= 0
##$SINO= 400
##$SIOLD= 131072
##$SPECTYP= <>
##$SREGLST= <1H.CDCl3>
##$SSB= 0
##$STSI= 131072
##$STSR= 0
##$SW_p= 8223.68421052632
##$SYMM= 0
##$S_DEV= 0
##$TDeff= 65536
##$TDoff= 0
##$TI= <>
##$TILT= no
##$TM1= 0
##$TM2= 0
##$TOPLEV= 0
##$USERP1= <user>
##$USERP2= <user>
##$USERP3= <user>
##$USERP4= <user>
##$USERP5= <user>
##$WDW= 1
##$XDIM= 131072
##$YMAX_p= 468864731
##$YMIN_p= -482878577
##$CURPLOT= <Network HP LaserJet P1505>
##$CURPRIN= <$Network HP LaserJet P1505>
##$DFORMAT= <normdp>
##$LAYOUT= <+/1D_H.xwp>
##$LFORMAT= <normlp>
##$PFORMAT= <normpl>
##$SURQMSG= 1
$$ End of Bruker specific parameters
$$ ---------------------------------
##NTUPLES= NMR SPECTRUM
##VAR_NAME=  FREQUENCY,     SPECTRUM/REAL,   SPECTRUM/IMAG
##SYMBOL=    X,             R,               I
##VAR_TYPE=  INDEPENDENT,   DEPENDENT,       DEPENDENT
##VAR_FORM=  AFFN,          ASDF,            ASDF
##VAR_DIM=   131072,        131072,          131072
##UNITS=     HZ,            ARBITRARY UNITS, ARBITRARY UNITS
##FACTOR=    0.0627417313425165, 1,          1
##FIRST=     8223.62146879498, 2711,         -93863
##LAST=      0,             5261,            -92946
##MIN=       0,             -482878577,      0
##MAX=       8223.62146879498, 468864731,    0
$$ Real data points
##PAGE= N=1
##DATA TABLE= (X++(R..R)), XYDATA
$$ [...]
65489 98934 99634 99689 99575 99255 98228 96625 95337 94747 94190 93081 91828 91100 90918 91125 92057 93884 95806
65472 95806 96885 97399 98430 100220 101974 103286 104769 106949 109391 111350 112685 113683 114510 115252 116090 117039
65456 117039 117788 118166 118450 118991 119797 120750 121955 123624 125873 128771 132184 135395 137367 137836 137742 138086 138669
65439 138669 138523 137447 136542 137180 139835 143946 148468 152374 154918 155820 155380 154412 153882 154271 155240 156133 156880
65422 156880 158071 160078 162522 164811 166746 168285 169176 169313 169143 169221 169655 170458 172025 174489 176823 177465
65406 177465 175968 173338 170617 167815 164380 160032 154868 149399 144808 142368 141896 141415 139204 135792 133024
65391 133024 131433 129670 126670 123219 120786 119620 118944 118504 118771 119550 119451 117327 113742 110370 108147 106613
65375 106613 104996 103318 102217 102113 102850 103921 104766 105046 104954 105117 105963 107210 108263 108967 109589 110079 109845
65358 109845 108521 106714 105637 106079 107947 110702 113869 116991 119401 120394 119800 118317 117244 117733 120095
65343 120095 123583 126930 129310 130827 131908 132340 131426 129365 127832 128378 130461 131979 131915 131418 131834 132728
65327 132728 132939 132857 134207 137649 142015 146213 150541 155440 160186 163970 167401 171637 176511 180976 185274
65312 185274 191039 198833 206905 213190 217588 221488 225931 231273 237880 245723 253461 259378 263633 268605
65298 268605 276385 286434 296104 303048 306835 308629 309716 310128 308606 304103 297277 289942 283109 276317
65284 276317 269043 261742 254926 248136 240752 233190 226224 219500 211885 203270 194956 188053 182300 176679
65270 176679 170462 163448 156035 149408 144986 143054 142327 141201 139144 136687 134529 132921 131464 129244
65256 129244 125660 121400 118073 116455 115611 114127 111678 108882 106264 104120 102924 102832 102879 101690 99215
65241 99215 97029 96541 97468 98516 99128 99922 101454 103103 103608 102525 100750 99429 98691 97891 96889 96439
65225 96439 97176 98757 100287 101143 101123 100351 99554 99946 102131 105206 107470 107971 107008 105466 104241 104095 105204
65208 105204 106635 106911 105551 103810 103630 105874 109578 112775 114101 113867 113668 114877 117535 120628 123106
65193 123106 124504 125065 125594 126892 128870 130554 131335 131751 132409 132660 131389 128963 127242 127312 128117 127830 125872
65176 125872 123028 120148 117481 115069 113199 112319 112606 113526 113807 112281 109049 105539 103092 101687 100340
65161 100340 98485 96541 95118 94154 93117 91888 90971 90544 89652 87019 82874 79289 78121 78994 80024
65146 80024 80275 80635 82203 84702 86834 87583 86822 85243 84182 84962 87687 90793 92314 91641 89810 88199
65130 88199 87351 87091 87317 88267 90012 92082 93849 95069 95584 94702 91746 87574 84635 84662 86762 88628
65114 88628 89210 89166 89081 88615 87595 86667 86411 86699 87336 88382 89496 90010 90233 91607 94715 97919 98947
65097 98947 97323 94529 92374 91963 93568 96472 99230 100917 101874 102681 103080 102771 102507 103179 104216 104274 103352
65080 103352 102803 103134 103238 102299 101223 101341 102532 103451 103246 102350 101907 102907 105572 109076 111957 113270
65064 113270 113372 113377 113922 114649 114875 114496 114044 113914 113906 113765 113887 114884 116443 117332 116881 115845 115489 116407 118602
65045 118602 121850 125240 127198 127173 126845 128473 132194 136091 138830 141011 143819 147554 151938 156916 162607
65030 162607 169027 176051 183189 189542 194821 200211 207105 214981 221786 226570 230207 233171 234375 233199
65016 233199 231033 229348 227426 223645 218259 213113 209001 204938 199984 194252 188008 181210 174297 168199
65002 168199 162946 157259 150172 142425 135657 130680 127030 123824 120591 117499 115084 113686 113034 112539 111886
64987 111886 111049 109868 108132 106126 104532 103646 103118 102508 101600 100037 97443 94315 92179 92106 93306 93885
64971 93885 92978 91606 91348 92711 95135 97983 100791 102591 101929 98255 93011 88629 86467 86226 87222 89212
64955 89212 91663 93350 93640 93542 94383 95793 96140 94896 93308 92419 91548 89455 86234 83238 81516 80998
64939 80998 81002 80991 80838 80615 80070 78383 75088 71453 70176 72806 77783 81863 83381 83361 83544 84434 85688
64922 85688 87400 89924 92726 94406 94150 92625 91115 90245 89897 89961 90503 91196 91293 90507 89499 89045 89004 88570
64904 88570 87434 86214 85743 86332 87739 89412 90654 91018 90736 90463 90450 90325 89800 89116 88534 87932 87323 87301
64886 87301 88361 90038 91370 92022 92258 91928 90383 87687 85112 83837 83617 83314 82429 81422 80713 80148
64870 80148 79587 79256 79082 78298 76391 74183 73148 73613 74338 74139 73342 73202 74418 76750 79641 82520 84775
64853 84775 86304 88028 90945 94449 96553 96210 94659 93786 93743 93060 90812 87732 85175 83718 83027 82623
64837 82623 82491 83158 85203 88496 91959 94359 95280 95040 93893 91856 89327 87205 86051 85446 84533 83142
64821 83142 82247 83215 86379 90175 92114 91183 89069 88375 89700 91246 91238 89746 87810 85967 84486 84137
64805 84137 85393 87115 87327 85644 84021 84609 87404 90432 91872 91466 90104 88645 87336 86105 85008
64790 85008 84247 83895 83803 83791 83788 83751 83678 83738 84062 84255 83524 81669 79751 79300 80880 83721 86614 88759 89844
64771 89844 89945 89577 89424 89554 89064 86924 83325 80005 79001 80905 84397 87532 89413 90428 91032 90889
64755 90889 89483 87114 84866 83779 84336 86450 89378 91810 92613 91597 89396 86833 84703 83748 84119
64740 84119 85044 85733 86403 87680 89174 89780 89501 89785 91562 93905 95218 94865 93055 90168 87162 85738
64724 85738 86778 89023 90434 90576 90570 91076 91745 92628 94500 97276 99421 99738 98832 97970 97315 96282 95059
64707 95059 94620 95273 96029 95584 93495 90469 88026 87759 90242 94333 97876 99366 98931 97834 97212 97178 96762
64690 96762 94715 90674 85680 81425 79123 79215 81737 86242 91319 95041 96468 96433 96433 97039 97774 98231 98568
64673 98568 98862 98697 97748 96401 95359 94832 94436 93823 93123 92830 93401 94786 96162 96422 95374 94290 94610
64656 94610 96156 97291 97098 96624 97426 99459 101263 101954 102005 101857 100872 98474 95786 94942 96512 98413 98132
64639 98132 95714 93748 94238 96311 97636 97475 97269 98273 99834 100610 100515 100463 100708 100602 100004 99819 100720 102182
64621 102182 103355 104369 105976 108041 109147 108039 105163 102327 100737 99748 97994 95611 94587 96479
64607 96479 100367 103853 105769 106907 108046 108417 106797 103418 100008 98207 98460 100181 102292 103696 103868
64592 103868 103230 102682 102711 103147 103714 104419 105311 106119 106384 105931 105150 104744 105069 105690 105740 104800 103266 101821 100798
64573 100798 100282 100502 101689 103491 104936 105168 104226 102964 102219 102092 102143 102199 102630 103586 104350 104037 102803 101629
64555 101629 100847 99734 97974 96700 97213 99133 100801 101398 101690 102503 103352 103153 101876 100816 101202 102867
64539 102867 104511 105205 105367 106018 107372 108769 110040 111988 114840 116951 116212 112701 108894 107055 107218
64524 107218 107909 107956 107054 105468 104085 104293 106758 110181 112010 110700 107031 103124 100550 99479 99229 99153
64508 99153 99056 99164 99950 101808 104577 107292 108671 108058 105913 103355 101447 100946 102293 105339 109170 112645
64492 112645 115161 116680 117160 116414 114581 112306 110261 108700 107532 106579 105824 105650 106726 109183 111951
64477 111951 113548 113704 113678 114737 116815 118948 120452 121172 121071 120160 118644 116666 114120 111200 108905 108373
64461 108373 109696 111765 113325 113823 113329 112136 110612 109127 107895 106928 106120 105377 104768 104650 105419 106946
64445 106946 108506 109481 109876 109851 109147 107521 105507 104053 103392 102900 102125 101315 100773 100361 100022 100195 101141 102165
64427 102165 102182 100994 99533 98833 99142 100018 100874 101242 100953 100408 100474 101688 103529 104868 105236 105343 106109 107454
64409 107454 108436 108460 107899 107522 107744 108498 109423 109953 109637 108549 107101 105334 103018 100732 100034 101783 104827
64392 104827 107308 108945 110848 113164 114322 113186 110887 109614 110179 111577 112492 112384 111396 110121 109471
64377 109471 110011 111151 111559 110635 109189 108460 108827 109778 110782 111719 112449 112518 111731 110929 111610 114345 117794
64360 117794 119911 120205 120209 121460 123601 125022 124925 124011 123266 122910 122684 122485 122284 121893 121198 120374 119534 118430
64342 118430 116901 115385 114537 114356 114162 113559 113068 113491 114864 116354 117122 116980 116178 114965 113620 112553
64326 112553 111922 111310 110308 109415 109680 111189 112574 112557 111519 110820 110877 110804 110021 109241 109478 110706 112092 113177
64308 113177 114265 115783 117739 119821 121778 123630 125567 127532 128896 128895 127562 125876 124699 123873 122805
64293 122805 121651 121302 122214 123801 125256 126613 128695 132031 136044 139427 141317 141937 141827 140691 137729
64278 137729 133265 129215 127256 127128 127557 128279 129932 132213 133699 133930 134293 136083 138755 140996 142645
64263 142645 144391 146204 147307 147474 147315 147461 148346 150437 153556 156229 157128 157182 158829 162813 167077 169387
64247 169387 169729 169382 169031 168985 170110 172924 176245 178173 178216 177335 176278 175206 174716 175688 177960 180506 183256
64230 183256 187342 193064 198952 203673 207663 211785 215409 217257 217708 218739 221455 224852 227402 228962
64216 228962 230531 232635 234642 235618 235375 234472 233414 232269 231062 230005 228928 226983 223751 220370 218464
64201 218464 217879 216689 213840 210528 208154 206230 203624 200896 199594 199646 199340 197986 196936 197426 198909
64186 198909 200282 201476 202874 204246 205408 207231 210673 215170 219157 222155 225239 229287 233758 237708
64172 237708 241331 245738 251326 256913 260712 261959 261425 260534 260372 261553 264333 268232 271873 273951 274335
64157 274335 273560 271458 267333 261695 256546 253198 250621 246980 242205 238031 235770 235062 234762 234130 232994
64142 232994 231543 230315 229966 230740 232352 234417 236738 239294 242203 245494 248612 250488 250636 249969 249892 250705
64126 250705 251560 251845 251868 252099 252523 252975 253536 254328 255406 257044 259578 262714 265519 267426 268904 270832
64110 270832 273542 276647 279561 281991 284214 286971 290808 295523 300558 305792 311406 317085 322191 326961
64096 326961 332787 340809 350676 360997 370667 379622 388835 399650 412378 425366 436372 445278 454480
64083 454480 465902 478514 489650 497933 503707 507212 507849 505269 499932 492356 482794 471968 461194
64070 461194 451265 441793 432169 422761 414723 408805 404650 401143 397305 392972 388684 384962 381892 379528
64056 379528 378233 378125 378454 378183 377151 376157 375922 376467 377514 378978 380982 383777 387662 392604 398049 403665
64040 403665 410133 418610 429402 441803 455179 469380 483978 498100 511411 524430 537271 548907
64028 548907 558540 567138 576497 586851 596399 603498 608526 612968 617009 618843 616641 610805 603704 597174
64014 597174 590796 582912 572892 561854 551471 542713 535651 529816 524648 520139 517114 516331 517291 518576
64000 518576 519465 520544 522598 525815 530397 536949 545476 554681 563252 571621 581671 594767 610635 628001
63986 628001 645755 663457 681209 699211 717415 735737 754585 774687 796182 818353 840485
63975 840485 862351 883438 902387 917972 930269 940344 949259 957919 967109 976656 985118 991573 997460
63962 997460 1005385 1016127 1028075 1039689 1051169 1063275 1075874 1088419 1100796 1112652 1122703 1129962
63950 1129962 1135521 1142099 1151632 1163763 1176806 1189821 1203604 1219703 1238588 1259067 1279964 1302153
63938 1302153 1328205 1359876 1396685 1437208 1480904 1528058 1578721 1632769 1690727 1753670 1822318
63927 1822318 1896850 1977561 2065080 2159848 2261833 2370742 2486250 2608312 2737809 2876653
63917 2876653 3026488 3187263 3357752 3537558 3727930 3930558 4146611 4377506 4625897
63908 4625897 4894902 5186608 5502197 5843761 6215480 6622765 7070519 7562539 8102535
63899 8102535 8695644 9348849 10069695 10864127 11735129 12683014 13706459 14802643 15966132
63890 15966132 17187846 18455426 19754704 21070810 22387901 23687850 24949015 26146079
63882 26146079 27251330 28237081 29078288 29754488 30250767 30558034 30672549 30594307 30324834
63873 30324834 29866381 29223794 28407648 27435600 26330864 25119621 23829301 22487407 21119726
63864 21119726 19748481 18392082 17066536 15786571 14565041 13411563 12332229 11330741
63856 11330741 10409532 9569642 8809663 8125177 7509585 6955893 6458047 6010924 5609465
63847 5609465 5248301 4922496 4628495 4363799 4125353 3908532 3708354 3521928 3349155
63838 3349155 3190524 3044440 2907339 2776424 2651587 2534285 2424949 2322002 2223241 2127606
63828 2127606 2035438 1947332 1863039 1781514 1701945 1624641 1550974 1482469 1419896 1362932 1310477
63817 1310477 1261375 1215091 1171639 1130796 1091767 1054050 1018382 986088 957422 931230 906369
63806 906369 882688 860340 839122 819210 801785 787839 776675 766473 756175 745902 735845
63795 735845 725901 716497 708611 702555 697645 693446 690370 688426 686329 682769 677987 673198 668803 664039
63781 664039 658111 650733 641669 630594 617529 602745 586278 568337 550200 533707 519352 505607
63769 505607 490685 474486 458290 443071 428891 415699 403850 393664 384947 377185 369933 362895
63757 362895 355782 348226 339893 330909 322285 315393 310517 306281 301277 295975 291981 289373 286177 281136
63743 281136 275694 271898 269306 265729 260725 256303 253785 251834 248634 244479 240771 237710 234712 232381
63729 232381 232026 233369 234566 234713 234509 234106 232340 229185 227105 228223 231181 232623 231171 228241 225358
63714 225358 222686 220348 219257 219786 220863 221266 220898 220088 218570 216068 213211 210867 208942 206747 204284
63699 204284 202393 201673 201978 202920 204316 206083 208089 210063 211332 211074 209508 208579 210523 215508 221325
63684 221325 225604 227776 228779 229663 231004 233075 235811 238768 241596 244383 247210 249700 251567 253431
63670 253431 256390 260701 265447 269673 273338 276920 280621 284445 288717 293799 299253 303735 305906 305283
63656 305283 302294 297992 293945 291877 292703 295692 298865 300406 299836 298103 296772 296835 297790 297881 295752 292012
63640 292012 288638 286605 284711 281272 276409 271793 268412 265648 262754 260180 258840 258762 259191 259632 259980
63625 259980 259929 259088 257710 256619 256297 256674 257904 260601 265005 270595 277024 284832 294430 304645 313122
63610 313122 318369 321008 322946 325667 329332 333030 335638 336646 336221 334400 330482 323879 315585 308058
63596 308058 303075 300105 297298 293698 289827 286315 282989 279675 277184 276765 278681 281861 285058 288042
63582 288042 291545 296205 301732 307161 311971 316861 323186 331503 340962 350397 359731 369734 380581 391564
63568 391564 402627 415359 431470 450541 470244 489010 507656 528095 551133 576082 602000
63557 602000 628668 656627 686752 719427 753567 786893 817942 847461 876797 905061 929146
63546 929146 946815 958655 966470 970825 971045 966821 958752 947790 935137 922388 910758 900160 889671
63533 889671 878672 866780 853076 836623 817849 798298 778714 758422 737065 716016 697266
63522 697266 681511 668040 656037 645203 635393 626442 618463 611786 606447 602030 598119 594726 592230
63509 592230 591043 591424 593614 598072 605311 615301 627219 640064 653442 667638 683325 701617 723812
63496 723812 750112 778724 807172 834578 861859 889829 918269 946881 975539 1002932 1026475
63485 1026475 1044665 1058511 1069499 1077171 1080065 1078360 1074113 1069319 1064987 1061518 1058315 1053164 1043767
63472 1043767 1030144 1014244 996959 976879 952305 923190 890648 855815 819880 784178 749484
63461 749484 715886 683753 653947 626638 600951 576376 553584 533073 514010 495454 478056
63450 478056 463414 452049 442911 434685 426856 419632 413444 408503 404528 401025 397947 395623 393978 392665
63436 392665 392273 394366 399558 406348 412695 418018 422849 427533 432639 439840 450519 463512 475821 485814
63422 485814 494334 502297 508715 512094 512820 512969 513993 515363 515341 512585 507024 499660 491696 483803 476193
63407 476193 469173 463235 458505 454445 450359 446150 442499 440297 439859 440692 442133 444116 446974 450570 454236
63392 454236 457755 461770 466807 472635 479086 486744 495986 505993 515754 525668 537013 550083 564016
63379 564016 578401 593880 611076 630079 651189 675059 701748 730543 760936 792853 825808
63368 825808 859131 893576 931325 973467 1018363 1063337 1107152 1150002 1192010 1232815 1271900
63357 1271900 1308011 1338747 1362067 1378050 1388047 1392388 1390277 1381965 1369496 1354766 1338061 1319276
63345 1319276 1299472 1279930 1260153 1237997 1211852 1181754 1148322 1111769 1072802 1033695 997194
63334 997194 964194 933399 903458 874548 847434 822094 798373 777369 760729 748525 739050 730962
63322 730962 724544 720516 718882 719784 724412 733776 746887 761336 775734 790817 808030 827674 848832
63309 848832 870881 894787 922670 955878 993552 1033415 1073827 1114485 1155248 1195251 1233529
63298 1233529 1269569 1302622 1331231 1354167 1371252 1382614 1387882 1386979 1380972 1371069 1357381 1339821
63286 1339821 1319736 1299163 1278623 1256973 1233321 1207702 1179895 1149326 1116634 1083744 1051495
63275 1051495 1018510 983455 947287 912090 878556 845995 814258 784119 755920 729179 703756
63264 703756 680316 659403 640960 625097 612332 602411 593651 584353 574636 566111 559783 554895 549942
63251 549942 544283 538573 534079 531941 532625 535379 538246 539258 538014 535794 533905 532250 529804 526118
63237 526118 521816 517789 514511 512216 511102 510964 510949 510071 508044 505493 503357 502038 501052 499569 497491
63222 497491 495827 495678 496930 498404 499410 500688 503454 507855 512768 517046 520608 524233 528659 534079
63208 534079 540422 547751 556103 564976 573340 580475 586745 593283 600901 609459 618310 627147 636352 646650
63194 646650 658488 671662 685532 699657 714127 729259 745182 761924 779733 798992 819931
63183 819931 842636 867148 893252 920383 948299 977691 1009468 1043334 1077767 1111817 1146477
63172 1146477 1183870 1225293 1270174 1316500 1361975 1405256 1446634 1487379 1528135 1568267 1607040
63161 1607040 1644860 1682539 1719640 1754546 1786374 1815894 1844105 1870551 1893662 1912204 1925612
63150 1925612 1933141 1933622 1926245 1910947 1887844 1857014 1819239 1776337 1730084 1681269 1630493 1579566
63138 1579566 1531091 1486593 1445853 1408212 1373781 1343162 1316986 1296188 1281794 1273566 1269534 1267846
63126 1267846 1268557 1272591 1279434 1287382 1296195 1307983 1324606 1345008 1365991 1385265 1403012 1420653
63114 1420653 1438788 1456712 1473724 1490367 1507771 1525702 1542031 1554812 1564292 1571880 1577522 1579480
63102 1579480 1576713 1569961 1559920 1545755 1526438 1502549 1475695 1446987 1417194 1387526 1358727 1329803
63090 1329803 1299333 1268185 1239497 1215496 1195462 1177309 1160113 1144361 1130568 1118570 1107837
63079 1107837 1097718 1087615 1077461 1067885 1059550 1052548 1046731 1042149 1038638 1035410 1031924 1029044 1028455
63066 1028455 1030624 1033998 1036662 1038413 1040763 1045156 1051557 1058640 1064941 1069879 1074117 1079051 1085682 1093754
63052 1093754 1102137 1110083 1117891 1126214 1135040 1143773 1152210 1160934 1170489 1180401 1189431 1196842 1203203 1209881
63038 1209881 1217928 1227579 1238476 1249892 1260739 1270051 1277923 1285697 1294646 1304596 1314291 1322958 1330816
63025 1330816 1338160 1344890 1351402 1359147 1369588 1382940 1398394 1415123 1432544 1450158 1467946 1486590
63013 1486590 1506580 1527582 1549566 1574063 1602900 1635764 1670422 1705678 1742824 1783636 1828191
63002 1828191 1875503 1925233 1977689 2032836 2090517 2151326 2216246 2285572 2358928 2436068 2516765
62991 2516765 2600169 2685324 2772436 2862628 2955988 3050476 3143262 3232836 3319478 3403960 3486296
62980 3486296 3565834 3642253 3716027 3787710 3857158 3923977 3988513 4051400 4111735 4166516 4212652
62969 4212652 4249014 4275731 4291882 4294894 4282236 4252992 4207753 4147778 4074616 3990098 3896414
62958 3896414 3796186 3692238 3586913 3481846 3378837 3280555 3189620 3107091 3032558 2965650
62948 2965650 2906678 2855901 2813243 2779009 2753869 2737510 2728067 2723682 2724222 2730767 2743675 2761723
62936 2761723 2782937 2805617 2828587 2851142 2873062 2894403 2915037 2934490 2952282 2968227 2982226
62925 2982226 2993797 3002006 3005884 3004693 2997552 2982965 2959250 2925608 2882534 2831018 2771781 2705554
62913 2705554 2633666 2557829 2479565 2400160 2320794 2242140 2164202 2087253 2012759 1942580 1877352
62902 1877352 1816462 1759510 1706824 1658437 1613701 1572414 1535365 1502957 1473997 1446742 1420799
62891 1420799 1397119 1376257 1357402 1339274 1321475 1304713 1289965 1277562 1266973 1257289 1247764 1237968
62879 1237968 1227904 1218245 1209927 1202748 1194719 1183891 1170854 1158225 1147371 1136958 1125440 1113610
62867 1113610 1103388 1094898 1086346 1076499 1065807 1055114 1044667 1034686 1025699 1017748 1010198 1002933 997025
62854 997025 993556 992289 992031 991892 991671 991309 990527 988951 986409 983282 980557 979058 978458 977641 976329 975739
62838 975739 977016 979541 981513 981907 981148 980031 978814 977475 976149 974962 973834 972543 970692 967690 963333
62823 963333 958440 954205 950612 946249 940175 933415 927831 923843 920090 915337 909981 905421 902485 900822
62809 900822 899600 898433 897553 897129 896478 894237 889608 883286 876788 870950 865492 860018 854884 850805 847954
62794 847954 845735 843292 840185 836763 833887 832109 831271 831230 832597 835964 840492 844350 846768 848633 850600
62779 850600 851896 851997 852430 855297 860426 865552 869356 872957 877999 884498 891226 897382 903154 909136 915703
62764 915703 922686 929390 935288 940745 946532 952647 958437 964105 971135 980680 992172 1004038 1015057
62751 1015057 1024604 1032585 1040112 1049405 1061698 1075572 1088637 1100725 1114073 1130182 1147864 1165086
62739 1165086 1181793 1199978 1221525 1246894 1275719 1307777 1343099 1381566 1422750 1466186 1511906
62728 1511906 1560832 1614477 1673855 1738597 1807311 1878937 1953731 2033083 2118652 2211630 2312263
62717 2312263 2419636 2532117 2648517 2768858 2893633 3022257 3152588 3281904 3407713
62708 3407713 3527306 3637257 3734113 3815334 3878974 3922791 3944601 3943678 3921105 3878473 3816654
62697 3816654 3736067 3637794 3524401 3399996 3269225 3135390 2999420 2861466 2723552 2589556
62687 2589556 2462071 2340404 2222670 2109079 2001938 1902891 1811613 1727333 1650195 1580386
62677 1580386 1516838 1457896 1403090 1353434 1309763 1271251 1235962 1202710 1171951 1144761 1121310
62666 1121310 1100837 1082943 1068212 1057253 1049538 1043621 1038320 1033401 1029337 1026852 1026667 1029282 1034724
62653 1034724 1042485 1051782 1062048 1073374 1086390 1101544 1118650 1137526 1158854 1183832 1213020 1246231
62641 1246231 1283504 1325190 1370844 1419128 1469544 1523325 1581657 1643720 1707598 1772602 1839343
62630 1839343 1907613 1975447 2040516 2101358 2156765 2204966 2244233 2273919 2294174 2304632 2303806 2290004
62618 2290004 2262867 2223968 2175817 2120218 2057828 1989264 1916141 1840712 1764869 1689827 1616347
62607 1616347 1544779 1475217 1408079 1344232 1284096 1227180 1173145 1122854 1077582 1037498 1001742
62596 1001742 969594 940549 913509 887111 861043 836206 813528 793332 775667 760214 745903
62585 745903 731769 718258 706462 695987 684996 672793 660893 650754 641789 632795 624299 618042
62573 618042 614563 612530 610333 607472 604444 602057 600920 601139 602399 604457 607247 610419 613349 615925
62559 615925 618753 622249 626172 630547 636266 644098 653659 664079 675171 687261 700441 714832 731125
62546 731125 749945 771038 793851 818503 845274 873727 903610 936393 974408 1018096 1065216
62535 1065216 1113244 1161795 1212288 1266093 1323584 1384416 1448013 1513801 1581205 1649337 1716597
62524 1716597 1780703 1839041 1888983 1928535 1957300 1976333 1986105 1984924 1970516 1943252 1906563 1863854
62512 1863854 1816099 1762960 1705025 1643928 1581104 1517644 1454973 1394431 1336248 1279935 1225880
62501 1225880 1175622 1130123 1088417 1048667 1010355 974894 943985 917650 894126 871630 849933
62490 849933 830042 812564 796880 781941 767282 752841 738222 722938 707466 693343 681765
62479 681765 672395 664029 656225 649730 645278 642620 641084 640612 641588 643888 646806 650013 654018 659457 666449
62464 666449 674834 684573 695616 707882 721752 738084 757308 778931 802335 827507 854427 882392
62452 882392 910873 940565 972593 1006939 1042636 1079206 1116575 1153670 1188624 1220684 1250376
62441 1250376 1277134 1298342 1312008 1319245 1322576 1322387 1316584 1303524 1283797 1259069 1230606 1199459
62429 1199459 1167015 1134417 1101922 1069393 1037177 1006092 976792 949538 924474 901784 881526
62418 881526 863547 847659 833837 822102 812107 803000 794073 785537 778223 772371 767226 762170 757756
62405 757756 755099 754580 755712 757956 760996 764439 768020 772055 777113 783338 790776 800040 811603 824411
62391 824411 836366 846592 856258 866724 877899 889093 900422 912245 923828 933724 941198 946254
62379 946254 948473 947000 941792 933896 924109 912066 897034 879090 859177 838419 817729 797797
62367 797797 779136 762122 746997 733712 721959 711600 702785 695260 687984 680282 673211 668746 667374
62354 667374 667408 667156 666894 668080 671431 676700 683745 692611 702596 712317 721130 729883 739893 751546 764186
62339 764186 777014 789692 802130 814085 825161 835158 844201 852456 859907 866555 872555 877703 881021
62326 881021 881636 880256 879075 879784 882237 885454 889252 894075 899724 905312 910617 916862 925950 939174
62312 939174 956538 977073 1000154 1026808 1059089 1097543 1139978 1183757 1228823 1277334 1330793
62301 1330793 1389079 1452059 1520007 1591710 1663927 1734005 1801952 1868772 1933675 1994110 2047684
62290 2047684 2092665 2127202 2149628 2159610 2158095 2146347 2125926 2099004 2067156 2029776 1985029 1932651
62278 1932651 1874749 1813792 1751174 1688134 1626637 1568279 1513106 1460404 1410117 1362823 1318867
62267 1318867 1278239 1240753 1205580 1171129 1136360 1102129 1070488 1042689 1018444 996856 977314
62256 977314 959478 943222 928803 916616 906657 898712 892976 889741 888353 887370 886305 886467 889241 893820
62242 893820 897515 898261 896117 892313 887757 882984 878931 876723 876553 877275 877399 876367 874885 874289 875665
62227 875665 879246 884379 890140 896242 903354 912484 924090 937855 953131 969367 986137 1003105 1020305
62214 1020305 1038389 1058315 1080608 1104962 1130792 1158115 1187674 1220112 1255405 1293386 1334496
62203 1334496 1379422 1428056 1479471 1533102 1589419 1649098 1712028 1777446 1844412 1911365 1975510
62192 1975510 2033551 2083290 2124004 2155273 2176107 2185610 2184002 2172465 2152065 2123120 2085609 2040054
62180 2040054 1987901 1930966 1870467 1806895 1741041 1674879 1610907 1550700 1494608 1442731 1395482
62169 1395482 1353008 1314972 1281360 1252834 1229560 1210191 1192848 1176905 1163101 1152036 1143477
62158 1143477 1137143 1133205 1131486 1130861 1130115 1129129 1128779 1129895 1132633 1136528 1140686 1144174 1146758 1149212 1152470
62143 1152470 1156656 1161399 1166862 1173656 1181694 1190052 1198342 1207550 1218943 1232701 1248171 1264952 1282948
62130 1282948 1301751 1320958 1340977 1362556 1385407 1408275 1430704 1453926 1479468 1507399 1536369
62119 1536369 1564805 1591654 1616678 1640824 1666017 1693932 1725070 1759353 1796990 1838086 1881883
62108 1881883 1927511 1975345 2026534 2080857 2135913 2188837 2238220 2283893 2325346 2361095 2389527
62097 2389527 2410020 2423243 2430546 2433070 2431242 2424959 2413946 2397899 2376685 2350921 2322255 2292638
62085 2292638 2263348 2235005 2208251 2183741 2161531 2141210 2122897 2107452 2095315 2085520 2076201 2065851
62073 2065851 2054035 2041337 2028916 2017794 2008283 2000250 1993943 1990170 1989546 1991983 1997015 2004209 2013113
62060 2013113 2023381 2035217 2049243 2065724 2084417 2105319 2128848 2154889 2182403 2210609 2239981
62049 2239981 2271430 2305009 2340227 2377164 2416401 2458096 2502025 2548423 2597875 2650327 2705040
62038 2705040 2761603 2820081 2879769 2938512 2993963 3045505 3094893 3145225 3199129 3257235 3318044
62027 3318044 3379482 3440637 3501740 3562822 3623340 3683306 3743776 3805587 3868289 3931092 3994344
62016 3994344 4059186 4126028 4194355 4264088 4336029 4410516 4486420 4562199 4637634 4713921 4792320
62005 4792320 4873212 4956191 5040183 5123247 5202915 5277222 5345216 5406533 5461147 5509873 5554342
61994 5554342 5595666 5633454 5666830 5696151 5722786 5747429 5769641 5789237 5807101 5824255 5841071
61983 5841071 5857964 5875960 5895854 5917487 5940670 5966173 5994760 6025667 6057100 6088052 6118589
61972 6118589 6148592 6177517 6205676 6234414 6264351 6294159 6321809 6346469 6368571 6388480 6405839
61961 6405839 6420031 6430790 6438425 6443799 6447929 6451258 6453407 6453816 6452407 6449401 6444878 6438950 6432187 6425418
61947 6425418 6419140 6413431 6408356 6404085 6400607 6397732 6395540 6394614 6395648 6398770 6403228 6407738 6411348 6414150
61933 6414150 6416970 6420092 6422448 6422483 6419811 6415469 6410383 6404172 6396066 6386634 6377688 6370209 6363156 6354866
61919 6354866 6345117 6334946 6324631 6312857 6298136 6280294 6260061 6237912 6213976 6188579 6162005
61908 6162005 6133831 6103356 6070803 6037371 6003797 5969363 5932768 5893777 5853789 5814790 5777631
61897 5777631 5741023 5702416 5660450 5616685 5574425 5535716 5499913 5465266 5431173 5398413 5367806
61886 5367806 5339507 5313535 5290366 5270817 5255539 5244585 5237159 5231926 5227940 5225526 5226238 5231964 5243922
61873 5243922 5262095 5285372 5312526 5343439 5379196 5420628 5467055 5517145 5571092 5631274 5700446
61862 5700446 5779691 5868466 5966181 6073072 6189835 6317332 6457072 6611296 6781960 6969953
61852 6969953 7176014 7402344 7652585 7930142 8237302 8576264 8950169 9362339 9815004
61843 9815004 10309609 10847912 11431635 12060892 12733688 13446655 14194641 14968445 15753135
61834 15753135 16528421 17269256 17945221 18521017 18960768 19234470 19322297 19215629 18917395
61825 18917395 18443035 17819839 17082659 16267659 15407632 14530273 13658150 12808876 11995326
61816 11995326 11226139 10506304 9837513 9218690 8647227 8120578 7636899 7194267 6789741
61807 6789741 6419745 6081309 5772443 5491251 5235185 5001445 4787697 4592158 4413460
61798 4413460 4250727 4103372 3970390 3850079 3740726 3641125 3550097 3466147 3388318 3316852
61788 3316852 3252033 3192703 3137157 3085473 3039561 3000403 2966360 2935018 2905758 2879495 2856618
61777 2856618 2836519 2818913 2804261 2792664 2783397 2775987 2770857 2768307 2767617 2767915 2769406 2772971 2778895
61764 2778895 2786923 2797350 2810913 2827318 2844910 2862505 2881035 2902698 2928822 2959054 2992314
61753 2992314 3027949 3066269 3108637 3156966 3212357 3274215 3341294 3413607 3492627 3579679 3675068
61742 3675068 3779003 3892236 4015091 4146827 4287045 4437223 4599683 4775233 4962966
61733 4962966 5162441 5374915 5602032 5844480 6102809 6378804 6674801 6991760 7329323
61724 7329323 7688488 8073626 8491144 8946352 9442288 9981545 10568432 11208917 11908987
61715 11908987 12673560 13506520 14410986 15389502 16444364 17577414 18788470 20073481 21424277
61706 21424277 22829188 24271700 25726745 27157917 28518171 29752685 30801954 31606128
61698 31606128 32112179 32282256 32099806 31572159 30729945 29622892 28311870 26859930 25326043
61689 25326043 23761948 22210150 20702598 19261248 17899976 16625899 15440353 14341329
61681 14341329 13326503 12393802 11539578 10758107 10043765 9392503 8800356 8261715 7770469
61672 7770469 7322288 6914551 6544294 6207341 5899444 5617352 5358617 5121032 4902517
61663 4902517 4701254 4515820 4345246 4188613 4044412 3910695 3786147 3670457 3563213
61654 3563213 3463079 3368696 3279869 3196960 3119486 3046219 2976529 2910731 2849048 2791018 2736010
61643 2736010 2683677 2633828 2586439 2541771 2499776 2459310 2418632 2377005 2335303 2294860 2256144
61632 2256144 2218724 2182010 2145748 2110009 2074892 2040237 2005910 1972613 1941839 1914298 1888774
61621 1888774 1863533 1838590 1815478 1794828 1775625 1757180 1740319 1725783 1712652 1699541 1686439
61610 1686439 1674125 1662469 1650708 1639047 1628451 1618850 1608957 1598257 1588067 1580009 1574211 1569459
61598 1569459 1564416 1558160 1550288 1541314 1532660 1525428 1519267 1512928 1505882 1498923 1493206 1489146 1486315 1483966
61584 1483966 1481457 1478435 1474913 1471238 1467934 1465599 1464755 1465472 1467008 1468206 1468619 1469173 1471377 1475680 1480943
61569 1480943 1485685 1489623 1493629 1498373 1503535 1508457 1513000 1517423 1521839 1526313 1531201 1536645 1541614 1544151
61555 1544151 1543103 1539325 1534735 1530328 1525578 1519716 1513011 1506421 1500284 1493853 1486254 1477581 1468847 1460965
61541 1460965 1454067 1447742 1441622 1435588 1429706 1424290 1419898 1416907 1415083 1413877 1413154 1413302 1414576 1416934
61527 1416934 1420787 1427318 1437220 1449295 1461242 1472144 1483669 1498400 1517393 1539681 1563708 1588712
61515 1588712 1615015 1643654 1675754 1711729 1751007 1792786 1836856 1883213 1931169 1979651 2028398
61504 2028398 2078014 2128609 2179301 2229380 2278939 2327619 2373798 2416226 2455869 2494704 2532955
61493 2532955 2569027 2602130 2633192 2662493 2688160 2708438 2724405 2738707 2751925 2761805 2766204 2765348
61481 2765348 2760693 2752902 2742096 2729374 2716777 2705632 2695613 2685670 2675440 2665697 2657884 2653414
61469 2653414 2653047 2656601 2663415 2673395 2687557 2707442 2734057 2767489 2807329 2853199 2905122 2963764
61457 2963764 3030313 3105680 3189901 3282839 3385513 3499997 3627627 3768071 3920878 4087445
61447 4087445 4270406 4471164 4688939 4922380 5171270 5436279 5717591 6014054 6322852
61438 6322852 6639230 6956698 7267986 7565754 7842269 8088686 8295126 8451824 8551078 8589453
61428 8589453 8568940 8495739 8377570 8222131 8037446 7832016 7613500 7387850 7160377 6936886
61418 6936886 6722641 6520639 6331949 6157586 5999092 5857618 5733712 5628030 5541084 5472001
61408 5472001 5418703 5379803 5355519 5346319 5351596 5370262 5401764 5445682 5500890 5565795 5638933 5718590
61396 5718590 5802364 5888041 5974836 6062927 6151754 6239483 6324338 6405863 6484507 6560378 6632954
61385 6632954 6702075 6768756 6834503 6899711 6963114 7023154 7079516 7132707 7182390 7227208 7266514
61374 7266514 7301296 7332653 7359911 7381001 7394409 7400101 7398915 7391755 7379323 7361946 7339608 7312582
61362 7312582 7281968 7249184 7215043 7179833 7144174 7109142 7075526 7043653 7014190 6988496 6967638
61351 6967638 6951225 6937614 6925261 6913627 6902727 6892058 6880408 6866919 6852073 6837044 6822112
61340 6822112 6806344 6789075 6771106 6754138 6739914 6730670 6729678 6740085 6763265 6799361 6849461 6916261
61328 6916261 7002444 7109432 7238077 7389514 7564585 7763100 7984471 8228720 8496178 8786167
61318 8786167 9096198 9422051 9758207 10098362 10435740 10762648 11069750 11346519 11583065
61309 11583065 11771420 11905236 11979541 11992034 11944388 11841371 11688663 11491957 11257427 10991441
61299 10991441 10699236 10384781 10052566 9708893 9360631 9012987 8669145 8331927 8004945
61290 8004945 7691736 7394244 7112859 6848110 6601854 6376411 6172737 5989891 5826283
61281 5826283 5680882 5553033 5441811 5346284 5266226 5202047 5154062 5122092 5105431 5102546 5111042
61270 5111042 5128842 5155589 5192218 5238875 5293855 5354849 5420469 5489825 5561096 5631437 5698492
61259 5698492 5761577 5821244 5877896 5930869 5978752 6020621 6056857 6088360 6114961 6135377 6149218
61248 6149218 6158284 6164763 6168220 6165353 6152989 6130577 6099647 6061799 6017984 5969015 5915773 5858813
61236 5858813 5798213 5733772 5665162 5592364 5516525 5440094 5365372 5292973 5222222 5152897 5085854
61225 5085854 5021986 4961518 4904658 4852144 4804554 4761627 4722760 4687721 4656246 4627388 4599892
61214 4599892 4573016 4546305 4518927 4490187 4460731 4432375 4406448 4382960 4361642 4343066 4328310
61203 4328310 4318224 4313604 4315569 4324988 4341897 4366189 4398637 4440430 4491908 4552884 4624259 4708072
61191 4708072 4805181 4913775 5031126 5156185 5289223 5428941 5571130 5710527 5843051 5965437
61181 5965437 6073213 6159928 6218544 6243350 6230889 6179920 6091142 5967131 5812467 5633634
61171 5633634 5438180 5233419 5025526 4819480 4619217 4427519 4245917 4075028 3914938
61162 3914938 3765469 3626713 3499584 3385219 3283292 3191518 3107608 3031260 2963337 2903524
61152 2903524 2850113 2802115 2760231 2725294 2696866 2673873 2655577 2641264 2630068 2622026 2618445 2620189
61140 2620189 2626317 2635414 2647437 2662826 2680343 2697435 2712699 2726459 2738707 2747960 2752696 2752711 2748437
61127 2748437 2740000 2727735 2712752 2696096 2677781 2657261 2634306 2608938 2581145 2551365 2520723
61116 2520723 2490137 2459640 2429190 2399478 2370975 2342574 2312297 2279420 2245015 2210391 2175811
61105 2175811 2140903 2105401 2068966 2030890 1990737 1949199 1907842 1867879 1829449 1792210 1756399
61094 1756399 1722890 1692042 1662875 1633895 1604665 1575859 1547674 1518883 1488060 1455297 1422168
61083 1422168 1390263 1360300 1332332 1306082 1281142 1257585 1236491 1219289 1206303 1196331 1187899 1180611
61071 1180611 1175124 1172110 1171524 1172808 1175570 1180012 1186627 1195483 1205907 1216893 1227631 1237662 1246978
61058 1246978 1256242 1266457 1277936 1289866 1301349 1312618 1324634 1337654 1350805 1363007 1373765
61047 1373765 1383138 1391650 1400282 1409817 1419763 1428354 1433915 1436045 1435543 1433702 1431739 1430308 1429181 1427647
61033 1427647 1425303 1422207 1418428 1414115 1409961 1406738 1404138 1400955 1396831 1392996 1390673 1389454 1387854 1384770
61019 1384770 1379700 1372488 1364086 1356958 1353179 1351990 1350474 1346858 1342106 1338032 1335088 1332672 1330494 1328582
61005 1328582 1326367 1322779 1317322 1310714 1304648 1301131 1301481 1305340 1310797 1315887 1319865 1322928 1325398 1327765
60991 1327765 1330939 1335571 1341379 1347993 1356216 1367447 1381831 1398002 1414869 1432629 1451574 1470983
60979 1470983 1490058 1509350 1530301 1553683 1579276 1606879 1636796 1669306 1704333 1741840 1782060
60968 1782060 1825167 1871220 1920656 1974512 2033723 2098253 2167170 2239724 2316323 2398313 2486766
60957 2486766 2581760 2683077 2791237 2907250 3031563 3164220 3306225 3459741 3626289 3805430
60947 3805430 3995649 4195641 4404313 4621064 4847617 5088702 5349196 5631114 5935061
60938 5935061 6263883 6622514 7014524 7442035 7910264 8429768 9012613 9668321 10405229
60929 10405229 11233655 12165194 13210416 14380312 15689593 17156366 18799996 20643283
60921 20643283 22715852 25046525 27639900 30448204 33353582 36168468 38658745 40596308
60913 40596308 41835563 42380163 42392974 42131425 41842721 41677772 41656752 41676928 41542256 41013969
60903 41013969 39888549 38081693 35668863 32851177 29870375 26930904 24167363 21651118
60895 21651118 19409008 17438303 15717982 14218655 12909719 11763000 10754692 9866489
60887 9866489 9084860 8398360 7795014 7261752 6786178 6359056 5975127 5631083 5322635
60878 5322635 5043966 4789875 4557427 4344980 4150295 3970207 3801601 3642059 3489904
60869 3489904 3344065 3203610 3067219 2933865 2804452 2681926 2568755 2464606 2367156 2274667
60859 2274667 2186964 2104404 2027095 1955042 1887919 1824472 1763068 1703300 1646510 1594374 1547353
60848 1547353 1504666 1465276 1428594 1394497 1362964 1333624 1305653 1278394 1252012 1227332 1205036
60837 1205036 1185300 1167954 1152402 1137420 1121804 1105718 1090911 1079097 1070269 1063058 1056464 1050732
60825 1050732 1046499 1043732 1041894 1040801 1040811 1042219 1044840 1048215 1051827 1055093 1057630 1059822 1062617 1066277
60811 1066277 1069703 1071628 1072317 1073435 1076180 1080105 1083823 1086332 1087537 1088003 1088490 1089296 1089942 1089822 1089185 1088914
60795 1088914 1089268 1089464 1088714 1087051 1084934 1082710 1080839 1080040 1080768 1083155 1087848 1096095 1108220 1122441 1136033
60780 1136033 1147430 1156701 1164428 1170987 1176805 1182507 1188508 1194853 1201504 1208564 1216155 1224138 1231875 1238412
60766 1238412 1243396 1247805 1253169 1259988 1267626 1275811 1285108 1295504 1305794 1315185 1324383 1333926 1342487
60753 1342487 1348316 1351644 1354066 1356036 1356792 1356622 1357298 1359674 1362231 1362621 1359677 1353641 1345559 1336849 1328342
60738 1328342 1319133 1307322 1292418 1276189 1260649 1246168 1232061 1217996 1203990 1189892 1175967
60727 1175967 1163518 1154058 1147995 1144554 1142541 1140728 1138244 1135551 1134672 1137425 1143359 1150133 1156078 1161915
60713 1161915 1169802 1181065 1195119 1210434 1226177 1242581 1259765 1276978 1293649 1310663 1329428
60702 1329428 1349640 1369146 1386419 1402094 1417411 1432112 1444884 1455277 1464119 1472317 1480168 1487743
60690 1487743 1495175 1502482 1509729 1517361 1525801 1534633 1542692 1549114 1554026 1558130 1561853 1564944 1566728 1566699
60676 1566699 1564914 1561819 1557851 1553342 1548600 1543533 1537352 1529327 1519940 1510574 1501882 1493224 1483932 1474166
60662 1474166 1464020 1452796 1440125 1427071 1415144 1404740 1395595 1388155 1383141 1379882 1376426 1371572
60650 1371572 1365898 1360660 1356665 1354454 1354465 1356312 1358620 1360245 1361268 1362263 1362975 1362386 1360032 1356731 1353830
60635 1353830 1351944 1350703 1349680 1349181 1349648 1350501 1350451 1349269 1348328 1348573 1348720 1346623 1341993 1336443 1331009 1325087
60619 1325087 1318026 1310131 1301288 1290062 1275493 1258961 1242875 1227927 1212948 1197320 1182148 1168770
60607 1168770 1157356 1147565 1139664 1134059 1130142 1126556 1122679 1119308 1117699 1118286 1120459 1123215 1125742 1127575
60593 1127575 1128622 1129241 1130195 1132329 1136023 1140666 1144750 1146941 1147428 1147912 1149721 1152089 1152916 1151280 1148470
60578 1148470 1146366 1145622 1145940 1147291 1149803 1152864 1155518 1157893 1161343 1166845 1173888 1181223 1188175 1194955
60564 1194955 1202196 1210517 1220207 1231108 1243179 1257229 1274524 1295438 1319038 1344271 1370940 1399041
60552 1399041 1427842 1456384 1484546 1512809 1541013 1567950 1592165 1612638 1628759 1640112 1646427
60541 1646427 1647563 1643703 1635769 1625107 1612152 1595879 1575514 1552582 1530119 1509717 1490536 1471647
60529 1471647 1454100 1439724 1428775 1419949 1412293 1405832 1400435 1395311 1390042 1385349 1382383 1381708 1383143
60516 1383143 1385945 1388787 1390086 1388934 1385638 1381287 1377070 1373916 1372097 1370992 1369895 1369396 1371123 1375624
60502 1375624 1381366 1386811 1392814 1401715 1414314 1429018 1444047 1459192 1475061 1491920 1510185 1531201
60490 1531201 1556409 1585962 1618838 1654054 1691107 1729489 1768630 1808501 1849813 1893422 1939662
60479 1939662 1988199 2038220 2088663 2138217 2184858 2225418 2256243 2274943 2281387 2276751 2262067 2238363
60467 2238363 2207955 2174569 2141840 2112081 2086602 2066485 2052478 2044520 2042029 2044749 2053027 2067207
60455 2067207 2087000 2111620 2140419 2173192 2209801 2249662 2291844 2335842 2382377 2433610 2492559
60444 2492559 2561887 2642710 2734694 2837780 2953804 3085839 3235790 3403293 3587379 3788633
60434 3788633 4009105 4250393 4512371 4793579 5092394 5408096 5741399 6093796 6465451
60425 6465451 6852928 7248113 7638117 8005320 8328137 8583407 8749741 8810330 8755269 8583948
60415 8583948 8306301 7941071 7511809 7043179 6558547 6077896 5616076 5182635 4782921
60406 4782921 4418787 4088898 3790174 3519896 3276158 3056749 2859227 2682517 2526733
60397 2526733 2390305 2268617 2156998 2054301 1962049 1880660 1808212 1742649 1683262 1629466
60387 1629466 1579725 1532704 1488516 1447842 1410423 1375337 1342396 1312274 1285254 1260618 1237536
60376 1237536 1215971 1196328 1178564 1162224 1147311 1134467 1123754 1113616 1101890 1088106 1074160
60365 1074160 1062217 1052439 1043402 1034261 1025634 1018362 1012399 1007285 1002993 999785 997630 996292 995855 996786
60351 996786 999539 1004138 1009901 1015543 1020116 1024161 1029398 1036747 1045066 1052432 1058202 1062965 1066870 1069424
60337 1069424 1071171 1074199 1080041 1087921 1096079 1104072 1112470 1120763 1127290 1131604 1135381 1140193 1145455 1149500
60323 1149500 1151812 1153062 1153628 1153373 1152660 1152311 1152483 1152607 1152468 1152300 1151760 1149991 1147015 1143879 1140897 1137039
60307 1137039 1131927 1127323 1125391 1126076 1127515 1128681 1130379 1133761 1139060 1145939 1154082 1163070 1172454 1182233
60293 1182233 1192697 1203677 1214610 1225500 1237039 1249460 1261971 1273770 1285059 1296553 1308395
60282 1308395 1319918 1330132 1338121 1343408 1346404 1348226 1349709 1350795 1351172 1351067 1350959 1350855 1350493 1350197 1351051
60267 1351051 1354086 1359423 1365993 1371831 1374970 1374640 1371762 1367968 1364179 1360233 1355681 1350534 1345259 1340347
60253 1340347 1335906 1331495 1326608 1321608 1317870 1316396 1316415 1316037 1314458 1312835 1312681 1313909 1314946 1314423 1312236
60238 1312236 1309146 1305986 1303402 1301953 1302038 1303662 1306402 1309701 1313284 1317297 1321976 1327284 1333038 1339422
60224 1339422 1347063 1356430 1367355 1379354 1392128 1405379 1418377 1430441 1442093 1455155 1471149 1489837
60212 1489837 1509800 1530198 1551230 1572783 1593625 1612662 1630636 1649808 1671980 1697315 1724991
60201 1724991 1754375 1785429 1818534 1854238 1892820 1934114 1978201 2026242 2079719 2138627 2201506
60190 2201506 2267928 2339916 2419754 2507130 2599905 2697442 2801599 2914303 3035705 3165248
60180 3165248 3303175 3450044 3605721 3769642 3941102 4118198 4297221 4474402 4648067
60171 4648067 4818117 4983593 5141601 5288363 5420429 5535115 5630892 5707633 5765804 5805400
60161 5805400 5826342 5829780 5818156 5794113 5760281 5720115 5677708 5636364 5598127 5564897 5538996
60150 5538996 5522395 5516555 5523573 5546189 5585610 5640357 5708466 5790139 5886858 5998377 6122168
60139 6122168 6255968 6399397 6552442 6713253 6878032 7042373 7201985 7352506 7489517
60130 7489517 7609041 7707923 7783772 7834901 7860588 7861422 7839045 7795130 7730628 7646429 7544901
60119 7544901 7430360 7307869 7182089 7057485 6938701 6829652 6732479 6648405 6579736 6530134
60109 6530134 6502554 6497421 6513176 6548130 6601385 6672241 6759195 6859669 6970526 7088523 7210019
60098 7210019 7330439 7444798 7549327 7642287 7722834 7789713 7841907 7880244 7907296 7925605 7936824
60087 7936824 7942710 7946091 7950648 7960593 7980813 8016206 8070094 8143835 8238685 8357310 8502658 8675845
60075 8675845 8876254 9103590 9359053 9644434 9960818 10308257 10686097 11093363 11529067
60066 11529067 11991961 12479405 12986506 13506949 14034688 14564142 15088553 15598955 16085400
60057 16085400 16538825 16951391 17315545 17623693 17869006 18046305 18152315 18185515 18145763 18033790
60047 18033790 17851200 17601476 17290979 16928462 16523591 16086431 15628328 15162126 14700479
60038 14700479 14253906 13830674 13437868 13081629 12766490 12495200 12269168 12088421 11951379
60029 11951379 11855707 11799574 11781210 11797109 11841738 11909474 11995640 12094850 12199393 12300520 12390896
60018 12390896 12464926 12517534 12544337 12543078 12513563 12455907 12369898 12256309 12117649 11957005 11776864
60007 11776864 11579446 11367275 11142666 10907246 10662868 10412907 10162252 9916179 9679403
59998 9679403 9455785 9248288 9059040 8889497 8740620 8613196 8508379 8427845 8372962 8343971
59988 8343971 8340483 8362532 8410270 8482635 8577292 8692080 8825414 8974675 9135085 9300854
59978 9300854 9466728 9627676 9777817 9910810 10021337 10105668 10161109 10185631 10178076 10138273
59968 10138273 10066947 9965730 9837074 9683983 9510151 9320467 9120722 8916450 8712585
59959 8712585 8514463 8328135 8158636 8008367 7877875 7767807 7679430 7613965 7572657 7557264
59949 7557264 7569241 7608333 7672970 7762268 7876815 8017209 8182611 8371035 8580303 8808018
59939 8808018 9050725 9303389 9559631 9812462 10055032 10280899 10483831 10658027 10799066
59930 10799066 10904361 10972304 11001360 10990743 10941723 10857398 10741078 10595564 10424189 10232100
59920 10232100 10026453 9815660 9608159 9410947 9228862 9065358 8923808 8807601 8719193
59911 8719193 8659648 8628947 8626089 8649251 8696971 8769356 8867075 8988666 9129520 9283955 9447773
59900 9447773 9618506 9794000 9971507 10147831 10319747 10484339 10639190 10782210 10911451
59891 10911451 11025715 11125677 11213966 11293755 11367467 11437051 11505229 11576266 11655585 11748602 11859604
59880 11859604 11991805 12148820 12335692 12557636 12817757 13116887 13455603 13835098 14255296
59871 14255296 14712897 15201868 15714937 16243535 16776845 17302024 17805184 18271301 18683562
59862 18683562 19024337 19277866 19432272 19479885 19417297 19246211 18974125 18613657 18181076 17694888
59852 17694888 17174294 16636954 16097006 15565050 15050214 14561946 14109249 13698154 13330705
59843 13330705 13007047 12728162 12496074 12311952 12175197 12084517 12038723 12035918 12072792 12145525
59833 12145525 12250797 12384876 12541934 12714117 12893398 13072631 13244483 13399683 13526709
59824 13526709 13613524 13650228 13630702 13552034 13412708 13212085 12952137 12639219 12283342 11895464
59814 11895464 11485402 11061568 10631506 10202373 9781182 9374455 8986997 8621096 8277708
59805 8277708 7958609 7666532 7402793 7165663 6952006 6760203 6590576 6443192 6316352
59796 6316352 6207563 6114916 6036725 5970432 5912935 5861841 5815368 5770952 5725221 5676251 5625211
59785 5625211 5574982 5527452 5482878 5441319 5403352 5369136 5337837 5308354 5279726 5250202 5216688
59774 5216688 5176131 5127464 5071965 5012150 4950894 4891110 4835158 4784023 4737306 4694180 4654280
59763 4654280 4617915 4585842 4559031 4538533 4525527 4521320 4526847 4541821 4564547 4592957 4625857 4663227
59751 4663227 4705799 4754794 4811723 4877631 4952213 5033930 5121137 5212852 5308352 5406253 5504233
59740 5504233 5599547 5689688 5772676 5847166 5912784 5970545 6022576 6070966 6116916 6161268 6205725
59729 6205725 6253062 6306201 6367725 6440346 6527027 6630122 6750907 6890548 7051086 7234904
59719 7234904 7443583 7678062 7939762 8230790 8552875 8906611 9291791 9707824 10153197
59710 10153197 10624247 11113898 11610678 12098153 12555065 12956344 13275458 13488671 13580606
59701 13580606 13548584 13403183 13165034 12860010 12514829 12153841 11797160 11460030 11152802
59692 11152802 10881300 10647969 10453750 10299135 10183559 10104709 10059688 10047042 10066985 10119647
59682 10119647 10203990 10318722 10463476 10638610 10844575 11082138 11352681 11657406 11996314
59673 11996314 12368628 12774377 13215224 13693863 14213071 14775281 15382481 16036264 16738241
59664 16738241 17490427 18294709 19151474 20059017 21014538 22015361 23058474 24138680 25247441
59655 25247441 26373406 27503649 28624762 29724154 30791655 31820349 32806304 33748674
59647 33748674 34650993 35521722 36371855 37211089 38045961 38880304 39715092 40546631 41365665
59638 41365665 42158899 42910832 43603987 44219332 44739112 45150557 45447252 45628223 45697365
59629 45697365 45663968 45542707 45352362 45114323 44851414 44586526 44341288 44135536 43987114
59620 43987114 43911118 43919310 44020983 44224328 44536179 44960561 45498276 46147827 46905569 47764623
59610 47764623 48714367 49740694 50824906 51941197 53055969 54130238 55121880 55985185
59602 55985185 56670673 57129388 57320434 57216654 56806306 56093105 55096556 53851401 52404427
59593 52404427 50809072 49119540 47385952 45651407 43950935 42311185 40749891 39275712
59585 39275712 37889244 36584303 35348027 34160545 32996632 31830088 30638999 29409989
59577 29409989 28140813 26840657 25527353 24222540 22947476 21720784 20556932 19464741
59569 19464741 18447396 17504808 16636118 15839754 15112022 14447180 13839397 13284157 12777784
59560 12777784 12316457 11896261 11513752 11166063 10850591 10564775 10305930 10071148 9857756
59551 9857756 9663889 9488009 9327421 9177820 9034881 8895993 8759829 8624583 8487480
59542 8487480 8346075 8199212 8046546 7888019 7724607 7559305 7396580 7240435 7092906
59533 7092906 6954193 6823869 6701861 6588669 6485240 6392943 6313282 6246819 6192250 6147253
59523 6147253 6110812 6084258 6069367 6065829 6071382 6084212 6104161 6131480 6165537 6205409 6251089 6303299
59511 6303299 6362222 6426812 6495260 6566136 6639459 6716801 6800021 6889970 6987006 7092560 7209052
59500 7209052 7337842 7478458 7630641 7796233 7977913 8176796 8392545 8625443 8876827
59491 8876827 9147435 9436818 9745020 10073729 10424719 10797374 11188282 11593075 12008207
59482 12008207 12431011 12858378 13285596 13706482 14114611 14504333 14870731 15209114 15515001
59473 15515001 15784606 16015394 16206706 16360291 16479835 16569323 16631828 16670151 16688395 16692446
59463 16692446 16688992 16684300 16683600 16691307 16712121 16752112 16817908 16913791 17039618 17191854 17365743
59452 17365743 17555244 17751130 17940557 18108925 18241641 18324597 18344854 18292343 18161079 17948852
59442 17948852 17656440 17287439 16848548 16349841 15804887 15229777 14640511 14050469 13470267
59433 13470267 12909302 12376190 11877603 11417695 10998757 10621466 10284466 9985196 9721952
59424 9721952 9494441 9302108 9143104 9015544 8918758 8852479 8815642 8806984 8826251 8873937 8950046
59413 8950046 9053590 9182926 9336320 9512925 9713531 9939205 10188286 10455484 10734795
59404 10734795 11022568 11316567 11612471 11902306 12175938 12423147 12634713 12802834 12920991
59395 12920991 12983216 12984008 12919890 12791047 12601126 12355864 12062360 11728827 11363781 10975433
59385 10975433 10572232 10163123 9756032 9356368 8967914 8594563 8239926 7905616 7591419
59376 7591419 7297147 7023090 6768909 6533798 6317885 6121790 5944385 5782782 5635524
59367 5635524 5504252 5390872 5294199 5210826 5138573 5077563 5028236 4989895 4961459 4942409 4932448
59356 4932448 4930899 4937001 4950548 4971886 5001409 5039109 5084257 5135046 5188281 5239672 5285294 5323868
59344 5323868 5358213 5394257 5438108 5493641 5562331 5644618 5740960 5851520 5974876 6107229 6243740
59333 6243740 6381761 6523098 6672691 6835177 7013411 7210023 7428685 7672814 7943960
59324 7943960 8242778 8571204 8932413 9328656 9760278 10227283 10731150 11274696 11860742
59315 11860742 12491261 13167204 13888268 14652471 15455792 16291809 17151401 18023066 18894073
59306 18894073 19751524 20582486 21373824 22113192 22791319 23403796 23950517 24433283 24853921
59297 24853921 25214235 25516455 25762490 25952488 26084658 26156497 26165475 26108273 25980146 25775863
59287 25775863 25491399 25125012 24677953 24155227 23565313 22917996 22222133 21485719 20717343
59278 20717343 19926353 19121593 18311142 17503357 16706767 15928245 15172335 14443172 13745982
59269 13745982 13085568 12464057 11881481 11338104 10834706 10370773 9944149 9552992 9196845
59260 9196845 8875152 8585840 8326211 8094382 7888922 7707750 7548493 7409699 7290828
59251 7290828 7191132 7109291 7043978 6994063 6958258 6935349 6924939 6927520 6943719 6973849 7018053
59240 7018053 7076230 7147648 7231104 7325746 7431501 7548690 7677431 7817351 7967546 8126831
59230 8126831 8294214 8468860 8649292 8833131 9018244 9203833 9389611 9574253 9755722
59221 9755722 9932971 10106093 10274689 10437316 10593003 10741882 10883496 11015528 11135393
59212 11135393 11242348 11336984 11419235 11488048 11542541 11581933 11604110 11605404 11582299 11532931 11457007
59201 11457007 11355291 11229706 11083375 10920162 10744479 10561576 10377215 10196298 10022004
59192 10022004 9856652 9703121 9564933 9445006 9344883 9265305 9206988 9170360 9154801 9158867
59182 9158867 9181450 9222256 9280810 9355495 9444067 9544702 9655793 9775144 9900488 10030996
59172 10030996 10167262 10309498 10456752 10608570 10766558 10933484 11111440 11301844 11506872
59163 11506872 11729941 11974715 12244185 12540412 12864334 13215575 13592468 13991680 14407109
59154 14407109 14829314 15246527 15645888 16013270 16332713 16587618 16763093 16847174 16830799 16708425
59144 16708425 16479525 16148990 15725824 15221833 14651383 14031181 13379113 12712550 12046806
59135 12046806 11394091 10763449 10161811 9594717 9065575 8574788 8120837 7702392 7318687
59126 7318687 6968062 6647449 6353761 6084976 5839584 5615843 5412125 5227232 5059818
59117 5059818 4908102 4770599 4646604 4535500 4436132 4347202 4267693 4196486 4132283 4074599
59107 4074599 4024310 3982500 3949009 3922614 3902263 3887568 3878460 3875150 3878350 3888958 3907367 3933275
59095 3933275 3966025 4004918 4049513 4099980 4156912 4220452 4289881 4364459 4444315 4530056 4621808
59084 4621808 4719285 4822712 4932891 5050111 5173436 5301404 5433211 5569018 5709258 5853980
59074 5853980 6002941 6155984 6312731 6471543 6629118 6781733 6927144 7064951 7195175
59065 7195175 7317009 7429285 7531740 7625265 7710822 7788441 7857581 7918704 7974369 8028280 8083030
59054 8083030 8139393 8198361 8263157 8338062 8425555 8525846 8639128 8766673 8909278 9066356
59044 9066356 9237635 9424362 9627108 9843053 10066784 10293231 10518128 10735814 10938417
59035 10938417 11117749 11266826 11379173 11448314 11469506 11441810 11367860 11251970 11099214 10915971
59025 10915971 10710128 10489871 10262113 10032035 9803773 9580938 9366077 9159807 8960945
59016 8960945 8767655 8578251 8390991 8203836 8014974 7823347 7628419 7429916 7228178
59007 7228178 7024078 6817758 6607977 6393887 6177432 5962926 5754024 5551889 5356369
58998 5356369 5167674 4986285 4812287 4645900 4488097 4339670 4200013 4067841 3943010
58989 3943010 3826457 3718096 3615847 3517500 3422951 3333819 3251180 3174458 3102405 3034206 2969322
58978 2969322 2906999 2846692 2788664 2733550 2681435 2631985 2585489 2543197 2506308 2474967 2448356
58967 2448356 2425441 2405478 2388290 2374388 2364444 2358258 2354391 2351044 2347081 2342132 2336320 2330364 2325461
58954 2325461 2322273 2320173 2318024 2315541 2313345 2311991 2311719 2313041 2316604 2322271 2329155 2336848 2345812 2356090
58940 2356090 2366342 2374883 2381301 2386529 2391724 2397605 2404456 2411967 2419258 2425818 2432471 2440772 2451449
58927 2451449 2464037 2478041 2493587 2510699 2528808 2547606 2567774 2590040 2613872 2637957 2661924
58916 2661924 2686753 2713367 2741571 2770803 2801300 2833931 2869194 2906983 2947107 2989468 3033681
58905 3033681 3079039 3125054 3171741 3219338 3268132 3318681 3371787 3427835 3486302 3546323 3607751
58894 3607751 3671463 3738637 3810022 3885967 3966833 4053021 4144662 4241589 4343780 4451625 4565659
58883 4565659 4686306 4814196 4950530 5096596 5252934 5419415 5596257 5784413 5984681
58874 5984681 6197030 6421353 6658479 6909881 7176798 7460441 7762766 8085887 8430505
58865 8430505 8795977 9182602 9593203 10031754 10500940 11001776 11535380 12104151 12711046
58856 12711046 13358309 14047238 14778775 15553738 16372259 17233006 18132921 19067583 20031569
58847 20031569 21018134 22018326 23020296 24009229 24967424 25874188 26706089 27438264 28046565
58838 28046565 28509570 28810046 28936102 28882187 28649645 28246643 27687682 26992776 26185877
58829 26185877 25292375 24336738 23341665 22328423 21316388 20321060 19352830 18418733 17525325
58820 17525325 16678784 15882168 15134301 14432602 13776214 13165261 12598002 12070506 11579056
58811 11579056 11121232 10694411 10294922 9919661 9567539 9238252 8930287 8641104 8369151
58802 8369151 8114811 7879358 7663359 7466047 7285806 7121070 6970895 6834824 6712587
58793 6712587 6604122 6509519 6428313 6359101 6300645 6253270 6218361 6196418 6186555 6188015 6201154
58782 6201154 6226545 6264172 6314026 6376538 6451808 6539390 6639532 6753545 6881913 7023042
58772 7023042 7175291 7339620 7518784 7714242 7925383 8151785 8394657 8655690 8935757
58763 8935757 9235523 9556509 9900871 10270535 10667009 11091590 11545411 12029793 12546977
58754 12546977 13100222 13692711 14326407 15002013 15719601 16478925 17279336 18119671 18997748
58745 18997748 19909104 20845806 21796652 22748693 23688110 24598879 25460548 26248158 26935433
58736 26935433 27498631 27917961 28177001 28262971 28168932 27895910 27453163 26856954 26128680 25292460
58726 25292460 24372714 23392909 22375294 21340258 20305213 19284515 18290288 17332102 16415497
58717 16415497 15542155 14712632 13928302 13190214 12497335 11847262 11237940 10667595 10133752
58708 10133752 9633800 9166292 8730480 8324807 7947013 7595325 7268192 6962975 6676507
58699 6676507 6407303 6155932 5922633 5705537 5501768 5309636 5129251 4961639 4807621
58690 4807621 4667008 4538292 4419164 4307411 4201338 4099947 4003498 3913636 3831929 3757917
58680 3757917 3689140 3623176 3559206 3497682 3439166 3383556 3329925 3277071 3224710 3174030 3126488
58669 3126488 3082167 3039831 2998282 2956978 2915633 2874237 2833342 2793281 2753013 2710731 2665828
58658 2665828 2619375 2572448 2524844 2475810 2425373 2374644 2325281 2278633 2234783 2192474 2150617
58647 2150617 2109753 2071247 2035321 2000987 1967747 1935954 1905434 1875284 1845682 1818448 1794799
58636 1794799 1773490 1752095 1729444 1705978 1682382 1658866 1635479 1612364 1589751 1568037 1547648
58625 1547648 1528634 1510811 1494466 1480293 1468353 1457715 1447601 1438545 1432001 1429057 1429597 1432329
58613 1432329 1435695 1439328 1444553 1452751 1463345 1474236 1484122 1493211 1501549 1508053 1511714 1512661 1511410 1508133
58599 1508133 1503268 1497754 1491882 1484928 1476806 1469121 1463627 1460534 1459420 1460970 1466379 1475437 1486549 1498716
58585 1498716 1512502 1528942 1548333 1570295 1594549 1621432 1651666 1685511 1722192 1760730 1801389
58574 1801389 1845579 1894077 1946228 2001295 2059628 2121859 2187908 2257714 2332271 2413005 2500661
58563 2500661 2595588 2698502 2810093 2930494 3060080 3200222 3352230 3516108 3691546 3879732
58553 3879732 4082831 4301585 4534462 4779219 5034339 5298799 5571184 5849115 6128692
58544 6128692 6404074 6667804 6911360 7125119 7298680 7422808 7491793 7503765 7459127 7359714
58534 7359714 7209569 7015643 6787103 6533964 6266023 5992005 5718784 5451152 5192246
58525 5192246 4944271 4709130 4488557 4283490 4093346 3916612 3752599 3602182 3466418
58516 3466418 3344970 3236374 3139256 3052578 2975125 2905546 2842681 2785315 2732083 2682267 2636122
58505 2636122 2593492 2552630 2511565 2470469 2431400 2395647 2362363 2329932 2297495 2264713 2231197
58494 2231197 2197047 2163232 2130424 2097615 2062698 2024585 1984273 1943575 1903154 1862282 1820589
58483 1820589 1779444 1741008 1706052 1673398 1641669 1610914 1582199 1556257 1533122 1512556 1494052
58472 1494052 1476517 1458653 1439862 1420674 1402377 1386275 1372852 1361312 1350162 1338535 1326806
58461 1326806 1315883 1306256 1297839 1290193 1282710 1275061 1267601 1260753 1253978 1246343 1238468 1232758 1230958 1232229
58447 1232229 1234455 1236634 1239032 1241646 1243717 1244658 1244549 1243641 1241867 1238745 1233572 1226090 1217212 1208407 1200055
58432 1200055 1191189 1181234 1170978 1161201 1151490 1141374 1131549 1122771 1114421 1105585 1096954 1090219 1085892
58419 1085892 1082970 1080384 1077540 1073801 1068831 1063332 1058237 1053304 1047658 1041582 1036559 1033514 1032024 1031186
58405 1031186 1030199 1028184 1024631 1020136 1015808 1011898 1007855 1003619 999982 997748 997388 999180 1002610 1005899
58391 1005899 1007463 1007982 1009881 1014547 1020994 1027387 1032970 1038311 1044513 1052543 1062802 1075185 1089644
58378 1089644 1106094 1123220 1138181 1148694 1154999 1158733 1160383 1159169 1155124 1149689 1144014 1137750 1129844
58365 1129844 1119807 1108302 1097113 1088227 1082065 1076954 1071080 1064387 1057721 1051108 1044318 1038350 1034667
58352 1034667 1033371 1033657 1035541 1039446 1044602 1049716 1054879 1060904 1067262 1072943 1079108 1088208 1100153 1111895
58338 1111895 1121516 1130394 1140344 1150927 1160962 1170859 1181869 1194230 1207348 1220852 1234415 1247466
58326 1247466 1259914 1272410 1285374 1298655 1312431 1327117 1341893 1354714 1364548 1372473 1379877 1386738
58314 1386738 1392345 1396641 1400059 1402872 1405239 1407132 1408024 1407667 1407319 1409019 1413502 1419974 1427850 1437041 1446542
58299 1446542 1454786 1461921 1469818 1479141 1488226 1495618 1501864 1507897 1513585 1519117 1526105 1535776 1547251 1558842
58285 1558842 1569965 1580813 1591329 1601508 1611605 1621141 1628934 1634980 1641070 1648690 1657613 1667348 1678480
58272 1678480 1691505 1705734 1720525 1736376 1753805 1772391 1791867 1812818 1835304 1858261 1881357
58261 1881357 1905870 1932441 1959490 1985476 2011399 2039243 2068808 2097858 2125039 2151354 2179027
58250 2179027 2209744 2243422 2278040 2311323 2343135 2375438 2409534 2444705 2480036 2516120 2554045
58239 2554045 2593983 2635636 2678954 2723710 2769569 2817178 2867794 2921241 2975786 3030677 3087212
58228 3087212 3146529 3208094 3271169 3336076 3403150 3472169 3543648 3618936 3698075 3779291 3861442
58217 3861442 3945287 4031827 4121356 4214569 4312163 4412610 4513015 4613069 4715525 4821997
58207 4821997 4931501 5044275 5163376 5290456 5423252 5559629 5701151 5850165 6006219
58198 6006219 6168029 6336459 6512828 6696548 6887110 7086355 7296328 7516785 7746861
58189 7746861 7987082 8238016 8499592 8773655 9064243 9373418 9700124 10045398 10415047
58180 10415047 10814542 11244935 11706717 12203738 12739845 13315360 13930604 14589402 15295476
58171 15295476 16049142 16851541 17708489 18626208 19607198 20654602 21776402 22980534 24269905
58162 24269905 25647327 27121574 28703465 30399826 32216187 34160803 36240382 38456308
58154 38456308 40810763 43311947 45968059 48782769 51764662 54936903 58332170 61986067
58146 61986067 65944932 70274994 75057704 80385949 86374706 93164106 100897194 109701701
58138 109701701 119704050 131044477 143852635 158209742 174148365 191683761 210852142
58131 210852142 231787918 254846133 280619955 309654490 341883884 376089197 409684311
58124 409684311 438961089 459814099 468864731 464616336 448007046 421960762 390226876
58117 390226876 356256908 322633465 291011080 262273142 236729889 214320639 194783443
58110 194783443 177762663 162889500 149867287 138517699 128744819 120466005 113583384
58103 113583384 107985424 103525014 99986242 97095947 94571895 92140792 89515469 86403703
58095 86403703 82593319 78053690 72957219 67597679 62269509 57186106 52465062 48155085
58087 48155085 44264852 40777169 37657714 34867244 32370537 30135197 28128288 26319911
58079 26319911 24687830 23213956 21877781 20657209 19534474 18497560 17537074 16644936
58071 16644936 15814862 15040860 14315978 13634691 12994870 12395135 11832228 11303289 10808277
58062 10808277 10347203 9917177 9515061 9140556 8793132 8467840 8157621 7858337 7568753
58053 7568753 7287734 7014969 6752602 6502397 6262601 6030915 5808926 5599838 5403224
58044 5403224 5215929 5037114 4868282 4708801 4555421 4406378 4262544 4124373 3990880
58035 3990880 3861980 3738921 3621928 3509775 3401938 3298936 3200439 3105164 3012722 2923689
58025 2923689 2838094 2755742 2677503 2604175 2534514 2466627 2400840 2338828 2280353 2223446 2167702
58014 2167702 2114743 2065279 2018160 1972752 1929920 1890142 1852734 1817533 1785478 1756825 1730369
58003 1730369 1705086 1681288 1659678 1640312 1622734 1606097 1589118 1571031 1552585 1535115 1518818
57992 1518818 1502921 1487165 1471943 1457407 1443686 1431596 1421859 1413893 1406457 1398853 1390395 1379705
57980 1379705 1366212 1351630 1338239 1326404 1315429 1305839 1298563 1292531 1285599 1277547 1269789 1262463 1254471
57967 1254471 1246399 1240363 1236300 1231239 1223398 1214596 1207130 1200440 1192661 1183888 1175897 1169485 1163758 1157631
57953 1157631 1150747 1143101 1134772 1126052 1117293 1108675 1100183 1091597 1082540 1073090 1064223 1056887 1050687 1044313
57939 1044313 1037389 1031038 1026463 1023818 1022757 1023252 1025353 1028557 1031723 1033499 1032948 1030093 1025615 1019816
57925 1019816 1012373 1003532 994631 986521 978186 968125 956649 945645 936503 929514 924822 922336 920700
57912 920700 917852 912924 906602 899677 892434 885421 879359 873954 867964 860882 853586 847040 841204 835451
57898 835451 829317 822735 816176 810507 805956 801475 795952 789637 783393 777215 770941 765898 763883 764537
57884 764537 765569 765868 766524 768318 770117 770657 770297 769928 769456 768573 767995 768664 770272 771531 771553 770276 767934
57867 767934 764688 760483 755028 748295 741095 734551 729025 724350 720961 719631 719891 720020 719246 718882 720536
57852 720536 723949 727312 729216 729852 730848 734229 740758 748892 755984 760922 764909 769446 774437 778767 781858
57837 781858 783946 785317 785918 785501 783843 781059 777697 774163 770151 765162 759345 753054 745950 737599 728796
57822 728796 721055 714826 709468 704881 701548 698732 694482 688317 682398 679132 678715 679850 681539 683166
57808 683166 684095 684595 686316 690624 697003 703998 710953 717778 723883 728706 732766 736879 740609 742683 742822
57793 742822 742075 741325 740270 737956 733649 727230 719261 710563 701388 691319 680414 669874 660869 653170
57779 653170 645713 638219 631394 625770 621184 617333 614083 611176 608319 605619 603384 601367 598706 594769
57765 594769 589630 583607 576718 568912 560643 552811 545856 538965 530670 520674 510835 503671 499760 497160
57751 497160 493592 488658 483729 480235 478563 478327 479114 480787 483175 485736 488001 490452 494265 499523 504268
57736 504268 506330 505859 505044 505588 507663 511215 516609 523400 529784 534284 537177 539577 541855 543660 544880
57721 544880 545893 547306 549708 553002 555696 555795 552975 548987 545420 542028 537920 533315 529074 525317 521655
57706 521655 518305 515883 514359 513149 512038 511270 510949 511068 511985 514266 518049 522944 528417 534031 539630
57691 539630 545419 551532 557533 563018 568646 575664 584200 593049 601360 609344 616977 623554 629344 636150
57677 636150 644860 653670 660257 664856 669612 675510 681634 687205 692744 699109 706553 714890 723690 732312
57663 732312 740556 749261 759608 772046 786502 803137 821887 841556 860444 878000 895309 914113
57651 914113 935836 961099 989268 1018680 1048010 1077331 1107563 1139543 1174104 1212142 1253702
57640 1253702 1297715 1343563 1392114 1444248 1499385 1556763 1617245 1682166 1751039 1822317 1896168
57629 1896168 1974769 2060016 2152772 2254350 2366696 2490644 2625721 2772453 2933397 3111062
57619 3111062 3305851 3516690 3742672 3983503 4239340 4510840 4798259 5099443 5408874
57610 5408874 5718913 6021138 6305896 6561282 6773322 6927335 7009845 7011335 6929443 6770639
57600 6770639 6548953 6282547 5989847 5686533 5384237 5091046 4812504 4551898 4310349
57591 4310349 4087719 3883549 3696995 3526742 3372049 3233514 3111771 3005760 2913369 2833470
57581 2833470 2766081 2710593 2665128 2627760 2597439 2573945 2558121 2551836 2556033 2568651 2586054 2606881
57569 2606881 2633098 2667125 2709631 2760693 2821267 2892309 2973600 3064422 3164495 3273647 3391767
57558 3391767 3519858 3659895 3812645 3976624 4149932 4331631 4520018 4710644 4897534
57549 4897534 5075370 5238778 5380205 5490660 5562953 5593198 5579507 5521171 5419931 5280982
57539 5280982 5111669 4919369 4710733 4492229 4270314 4050452 3835951 3628143 3428140
57530 3428140 3238292 3061344 2898167 2747165 2606219 2474552 2352288 2239214 2134991
57521 2134991 2040037 1954940 1878955 1809927 1745851 1685846 1629631 1576987 1528239 1484485 1446406
57510 1446406 1412948 1381974 1352384 1324947 1300690 1279258 1259731 1242487 1228910 1219183 1211830 1205963
57498 1205963 1202509 1202129 1203253 1203843 1204303 1206807 1212104 1218912 1226582 1236462 1249929 1266521 1284943 1304928
57484 1304928 1327291 1352683 1380868 1410878 1441838 1474102 1509359 1548752 1591217 1634914 1680224
57473 1680224 1729904 1786165 1849019 1917734 1992298 2072847 2159122 2251330 2350400 2456800 2570264
57462 2570264 2691158 2820640 2958668 3103098 3251457 3402142 3552899 3699446 3836540
57453 3836540 3959121 4061584 4137725 4183128 4196583 4177979 4126417 4042438 3931059 3800332
57443 3800332 3657051 3505374 3349073 3192954 3041583 2897822 2762846 2636738 2519089
57434 2519089 2409830 2309571 2218809 2137360 2064994 2001741 1946861 1898591 1856030 1820310 1792712
57423 1792712 1772487 1757801 1747906 1742823 1741715 1743450 1748453 1758395 1774240 1795879 1823224 1856176
57411 1856176 1893985 1936303 1984579 2040747 2104740 2174961 2251069 2334664 2427233 2529046 2639977
57400 2639977 2759650 2886565 3018564 3154176 3291927 3428358 3558450 3678036 3783748
57391 3783748 3870356 3930560 3958583 3952494 3912428 3838768 3733654 3602807 3453863 3293121 3124683
57380 3124683 2951915 2778618 2609064 2447344 2296099 2155437 2023805 1900370 1785804
57371 1785804 1680584 1583781 1494173 1411462 1335577 1265754 1201199 1141910 1088016 1038993 994255
57360 994255 953754 917153 883090 850195 818443 788754 761684 737188 715093 695083 676626
57349 676626 659625 644695 632002 620286 607877 594605 581905 571022 561737 553019 544406 536367
57337 536367 529439 523390 517491 511522 505979 501041 495954 490035 483792 478233 473441 468783 464280 460613
57323 460613 457724 454585 450591 446317 442652 440016 438472 437788 437356 436923 437236 438833 440459 440167 437982
57308 437982 435827 434720 434027 433836 435786 440421 445731 449819 453340 457807 463085 468439 474623 482857 492666
57293 492666 502845 513849 527026 541880 556268 569319 582160 595555 608767 621320 634194
57282 634194 648428 663731 679299 695195 712239 731047 751470 772504 792652 811017 828094
57271 828094 844847 861170 876024 889033 900854 912015 922562 933148 945189 959268 974275
57260 974275 988871 1003046 1017505 1032164 1046278 1059872 1074213 1090658 1109459 1129738 1150289
57249 1150289 1170344 1189817 1209075 1228531 1248320 1268186 1287688 1306835 1326621 1348540 1373125
57238 1373125 1399225 1425217 1450920 1477888 1507805 1541050 1576916 1614750 1654559 1696722 1741546
57227 1741546 1789187 1839801 1893417 1949468 2006686 2063934 2121411 2180770 2243762 2310720 2380226
57216 2380226 2449974 2517970 2583304 2645895 2705245 2759489 2806123 2843707 2872352 2892520 2904137
57205 2904137 2907142 2902163 2890172 2872114 2849397 2824061 2797769 2771114 2744533 2719397 2697375 2678932
57193 2678932 2663131 2648726 2635023 2622170 2611277 2603889 2600641 2600711 2603311 2609307 2620357 2636628 2656405
57180 2656405 2678105 2701767 2728270 2757800 2789518 2822338 2855663 2889488 2923855 2958167 2991270
57169 2991270 3022536 3052675 3083108 3114726 3147608 3181739 3217523 3255735 3297435 3343719 3395005
57158 3395005 3450577 3509253 3570476 3634515 3701847 3772790 3847504 3925799 4006965 4090161 4174905
57147 4174905 4261024 4348413 4437208 4527842 4620409 4714010 4806997 4897712 4984990 5068581 5149460
57136 5149460 5229161 5308277 5386103 5462155 5537450 5613683 5691786 5771963 5854506 5939729 6027582
57125 6027582 6118149 6212111 6309918 6410932 6514036 6618380 6722538 6823635 6918702 7006735
57115 7006735 7088476 7164607 7235324 7301141 7362405 7417674 7463645 7496881 7514822 7515486 7497721 7462244
57103 7462244 7411587 7348654 7275696 7194177 7104516 7005991 6897884 6780670 6655255 6521408
57093 6521408 6378143 6225526 6064852 5897039 5721982 5539469 5349659 5152724 4949143
57084 4949143 4740090 4526192 4306088 4077536 3839811 3593592 3338942 3075286 2803299
57075 2803299 2524583 2238946 1943565 1635010 1310066 964148 591096 185465 -256534
57065 -738685 -1265001 -1837622 -2456940 -3125428 -3849689 -4637852 -5497377 -6437232 -7470084
57056 -7470084 -8610289 -9871610 -11269405 -12823512 -14556179 -16487814 -18637218 -21025573
57048 -21025573 -23678246 -26623918 -29895683 -33534744 -37592593 -42130841 -47222522 -52955971
57040 -52955971 -59437992 -66794693 -75171504 -84731454 -95648073 -108094808 -122238981 -138240533
57032 -138240533 -156238978 -176315516 -198452370 -222537484 -248423479 -275964649 -304934647
57025 -304934647 -334840564 -364794858 -393596811 -419983375 -442846679 -461277528 -474499347
57018 -474499347 -481851621 -482878577 -477445558 -465802903 -448591556 -426802929 -401672708
57011 -401672708 -374504234 -346485332 -318581365 -291520633 -265820612 -241807656 -219626537
57004 -219626537 -199257204 -180550218 -163284494 -147240795 -132265839 -118296668 -105340105
56997 -105340105 -93432263 -82604895 -72865851 -64189929 -56519226 -49772479 -43857451 -38680219
56989 -38680219 -34150633 -30185514 -26709704 -23655921 -20965540 -18589443 -16486023 -14617529
56981 -14617529 -12949525 -11453624 -10108145 -8894711 -7795521 -6794616 -5880015 -5043323
56973 -5043323 -4278474 -3581849 -2952043 -2387493 -1884153 -1435632 -1034598 -673551 -345589
56964 -345589 -45740 228997 481579 715882 935095 1140333 1332230 1513297 1687437 1857555
56954 1857555 2024613 2188383 2347819 2501028 2646305 2783509 2913686 3037591 3155683
56945 3155683 3269298 3379666 3483722 3570731 3624373 3630178 3583125 3489808 3364126 3220649
56935 3220649 3070735 2922229 2779886 2644928 2515448 2388785 2263513 2138899 2013541
56926 2013541 1886064 1757048 1629224 1505601 1387957 1276695 1170880 1068247 966336
56917 966336 864295 763129 664114 567685 474132 384498 300091 221529 148767 81833 21145
56905 -32766 -79599 -119445 -152826 -180355 -202438 -219481 -232115 -240655 -244437 -242556 -235571 -225902 -216360
56892 -216360 -208877 -204762 -205061 -209658 -216538 -222934 -227240 -229408 -229836 -228552 -225340 -219951 -212017 -201219
56878 -201219 -187649 -171791 -154173 -135170 -114805 -92413 -66883 -37922 -7057 22952 49523 70681
56866 70681 84647 90086 87121 77555 63827 48021 31765 16334 2452 -9554 -19171 -25724 -29331
56853 -29331 -31290 -32922 -34210 -34094 -31969 -28383 -24121 -19146 -12894 -5509 1685 7253 10970 13991 17881
56838 17881 23749 32002 42256 53415 64486 75539 87304 99626 111166 121202 130892 141850
56826 141850 154091 166455 178459 190171 200303 206086 205800 200423 192210 182584 172163 162031 153930
56813 153930 149375 149173 153536 162101 173979 188185 204136 221881 242197 266241 294355 325208
56801 325208 357066 389930 425128 462239 497645 526994 548068 560389 563467 557357 544474 529050
56789 529050 514624 502960 495009 491337 491662 495454 503308 516405 534439 555586 579028 606112 638321
56776 638321 675516 717194 764060 816560 872173 925383 970147 1001665 1016599 1013551 993991 961858
56764 961858 921787 877973 834297 794175 759589 730944 708307 692275 683172 680127 681754 687564
56752 687564 698041 713436 733261 757136 785478 818623 855200 891534 922699 944194 952961 947590
56740 947590 928354 897502 859124 817892 777251 738721 702830 670229 641561 616892 596234
56729 596234 580529 571000 567186 566696 567728 571119 578933 591582 607395 624610 642241 658859 672042
56716 672042 679701 680944 675168 661684 641367 617610 594092 571913 550056 528275 508076 490960
56704 490960 477118 466108 457363 449489 440483 429840 419665 412410 407830 403363 397548 391919 388902
56691 388902 388537 388157 385250 379975 374599 371005 369304 368584 368071 367294 365883 363999 362574 362402 363093 363604
56675 363604 363612 363598 363622 362991 361355 359215 356943 354186 350902 348102 346595 345535 343337 339778 336117 333185
56659 333185 330569 327976 326179 325784 325853 324850 322733 321206 321811 324399 327519 329759 330485 329863 328552 327206
56643 327206 325968 324587 323104 322168 322403 323535 324299 323255 319860 314978 310274 306694 303516 299403 294377
56628 294377 289950 286872 283636 278181 270678 263591 259198 258025 259540 262986 267002 269638 269842 268587
56614 268587 267802 268443 270125 272329 275190 278991 283383 287533 291038 294522 298948 304262 309188 312823 315784
56599 315784 318880 321176 320830 317948 315085 314308 315089 315850 316199 316462 316175 314623 312333 310629 309961 309674
56583 309674 308981 307167 303576 298789 295208 294792 296471 297469 296924 296279 296127 295048 292401 290124 290331 292541
56567 292541 294753 296128 297109 297758 297496 296125 293830 290603 286832 284063 283686 284885 285131 282961 279291
56552 279291 275787 273045 270865 269439 269407 270972 273562 276334 278773 280837 282689 284395 285937 287495 289398
56537 289398 291521 293124 293793 294335 296008 298828 301356 302512 302915 303915 305779 307630 308899 309889 310793
56522 310793 311070 310380 309442 309176 309417 309439 309600 311312 315104 319777 324056 328122 332579 336725 339309 340861
56506 340861 343770 349479 356578 362465 366266 369265 372829 376848 380419 383294 386141 389663 394036 399223
56492 399223 405256 411818 417876 422362 425287 427735 430600 433711 436282 437800 438281 438140 438058 438480 438934 438184
56476 438184 435384 430691 424688 417953 411458 406382 402841 399576 395754 392310 390532 390117 389851 389580 389941
56461 389941 390359 389019 385103 379772 374577 370004 365896 362146 358469 354479 350568 347997 347565 348629 349731
56446 349731 349747 348442 346540 345249 345018 344904 344019 343302 344552 347752 350770 351966 351652 350550 348383 344936
56430 344936 341295 339047 339001 341290 345544 350174 352675 351920 349520 347945 347979 348941 350590 353568 358205 363891
56414 363891 369560 374375 378331 382568 388410 395602 402274 407189 411159 415663 421176 427738 435948 445958
56400 445958 456289 465177 472627 479816 486930 493062 498017 502714 507694 512456 516421 519495 521585 522565
56386 522565 522834 522934 522421 520104 515785 510959 507375 505388 504010 502054 498868 494274 488156 480309 470886
56371 470886 461016 452399 445861 440606 435222 429081 422484 416127 410957 407829 406438 405028 402042 397867
56357 397867 394222 392284 392150 393615 396334 399317 401341 401930 401307 399623 397098 394649 393234 392479 390995
56342 390995 388290 385501 383874 383262 382612 381431 380247 379812 380175 380616 380433 379707 379089 378926 379148 379987 382046
56325 382046 385229 388388 390625 392360 394455 396922 399233 401332 403425 405205 406173 406443 406513 406628 407055 408471
56309 408471 411142 414142 416284 417537 418729 420268 422007 423855 425498 426054 425231 424528 425995 429881 434562
56294 434562 438656 442157 445611 449391 453814 459018 464594 470098 475719 481517 486348 488743 488950 489024 490800
56279 490800 494464 498979 502941 505224 505876 506440 508608 512665 517859 523765 530324 537134 543933 551393 560177
56264 560177 569682 578924 588015 597245 605524 611829 617822 626626 638833 651856 663584 674555 686135
56251 686135 698798 712945 729177 746603 762766 776504 789307 802679 815841 827438 838013
56240 838013 849149 861236 873641 886232 899298 912541 925427 938024 950568 962813 974707
56229 974707 986926 999874 1013028 1026359 1041481 1060066 1081738 1104932 1129448 1156808 1188226
56218 1188226 1223403 1261467 1302114 1345623 1392360 1442503 1495980 1552693 1612997 1677722 1747623
56207 1747623 1823304 1905880 1997025 2097701 2207235 2324222 2448218 2580319 2722315 2875478
56197 2875478 3039802 3214301 3398198 3591676 3794910 4006626 4224238 4445053 4666406
56188 4666406 4884916 5096909 5299432 5489360 5661550 5809843 5930652 6024132 6091169 6130862
56178 6130862 6141972 6125375 6083823 6020584 5939640 5845956 5743641 5634077 5517006 5392989
56168 5392989 5263735 5130670 4994499 4855847 4715200 4572432 4427309 4280218 4131586
56159 4131586 3981109 3828670 3675681 3524325 3375423 3228145 3082057 2938622 2800285
56150 2800285 2668578 2543501 2424517 2311734 2205962 2107774 2016896 1932705 1854882 1783179
56140 1783179 1717055 1656289 1601469 1552885 1509262 1468800 1431259 1397657 1367961 1340629 1314676
56129 1314676 1290631 1268948 1249014 1230456 1214141 1201072 1191216 1183934 1178441 1173509 1168179 1163302
56117 1163302 1160950 1161650 1163739 1166127 1169901 1176283 1184805 1194750 1206689 1220996 1236317 1251292 1266668
56104 1266668 1284023 1303436 1324096 1346316 1371163 1398598 1427453 1456750 1485852 1514018 1541044
56093 1541044 1567603 1593881 1618773 1641669 1663889 1686965 1710808 1735466 1763526 1798238 1839582
56082 1839582 1884464 1931107 1981587 2039965 2109538 2192034 2287738 2395485 2513152 2638359 2768175
56071 2768175 2898458 3024486 3142465 3250133 3346514 3431945 3508073 3577059 3640695 3699990
56061 3699990 3754225 3799688 3830691 3843213 3837272 3815436 3780375 3734527 3680206 3618079 3546419
56050 3546419 3463443 3369604 3266459 3154751 3035730 2913571 2794265 2682154 2578758 2484256
56040 2484256 2398454 2320842 2251456 2191497 2141768 2101073 2067522 2040748 2021219 2008008 1999034
56029 1999034 1993162 1990314 1989775 1990092 1990575 1991420 1992384 1992684 1992167 1991475 1991191 1991821 1994177 1998749 2005086 2012698
56013 2012698 2022018 2033572 2047129 2062626 2080939 2102551 2126512 2151923 2179170 2208354 2237982
56002 2237982 2267055 2297074 2329857 2364502 2398820 2433005 2469556 2509960 2553547 2599258 2646622
55991 2646622 2695180 2744738 2796099 2850268 2907301 2966806 3028613 3091807 3154519 3216241 3279144
55980 3279144 3345550 3415536 3488549 3565484 3647118 3732214 3819508 3909877 4004050 4099923 4195002
55969 4195002 4290158 4388250 4490459 4596824 4708851 4828329 4954560 5085735 5222042 5364646
55959 5364646 5512919 5665779 5824579 5991546 6166559 6348486 6538359 6738072 6947269
55950 6947269 7164743 7391556 7629598 7878753 8138869 8412694 8703343 9010877 9335211
55941 9335211 9680080 10049926 10445317 10866236 11317406 11804868 12329318 12888510 13484416
55932 13484416 14122163 14803749 15529208 16302651 17130828 18017086 18963269 19976096 21064534
55923 21064534 22231965 23478392 24809895 26238658 27774078 29420689 31183660 33068714
55915 33068714 35077557 37211249 39477409 41887217 44448432 47171072 50078349 53203344
55907 53203344 56579228 60245382 64261451 68704788 73660122 79228238 85539913 92739288
55899 92739288 100951087 110281262 120847337 132785213 146227439 161303602 178166514
55892 178166514 196990226 217942203 241194402 266946586 295316439 326043017 358162808
55885 358162808 389843737 418412282 440594281 453116816 453692269 441949301 419653107
55878 419653107 390004861 356513118 322127630 288914783 258108639 230294592 205612613
55871 205612613 183934314 164980773 148395994 133818350 120945010 109548840 99451396
55864 99451396 90499153 82560349 75519822 69266811 63696679 58725115 54288687 50329041
55856 50329041 46785358 43601615 40729742 38123741 35740290 33547446 31525186 29656242
55848 29656242 27923312 26314809 24824638 23444736 22164531 20977915 19883041 18874003
55840 18874003 17939316 17069395 16258744 15499867 14782219 14099368 13451482 12838911 12258566
55831 12258566 11708143 11188529 10699881 10239490 9805011 9395707 9009356 8641967 8291863
55822 8291863 7960412 7647878 7352172 7072377 6809748 6564334 6333930 6116773 5911932
55813 5911932 5716923 5528786 5347946 5177308 5017042 4863890 4715964 4574386 4439599
55804 4439599 4309977 4185058 4066579 3955069 3848317 3743816 3639631 3532575 3419288
55795 3419288 3300358 3180472 3063603 2950747 2842547 2740578 2645100 2554631 2468691 2387991
55785 2387991 2311407 2236090 2161691 2091349 2027392 1968981 1914907 1865572 1820942 1779569 1741131
55774 1741131 1707283 1678671 1653646 1631072 1611664 1595271 1579628 1563414 1547948 1534182 1520410
55763 1520410 1504616 1486855 1467566 1445652 1420058 1391496 1361038 1328775 1295304 1262638 1232027
55752 1232027 1202593 1173612 1146367 1122146 1100080 1078747 1058452 1040210 1023845 1008820 995757
55741 995757 985376 976924 969136 961936 955788 950325 945053 940570 937613 935512 932822 928866 923559 916458
55727 916458 907394 897645 889175 882644 876869 870149 861685 852082 842947 835688 830306 825425 819408 811015
55713 811015 799318 784034 766087 747034 727938 709431 692452 677673 664414 651588 639659
55702 639659 630140 623061 616568 609295 601555 593831 585789 577443 569735 563227 557424 551777 545945 538711
55688 538711 528464 515513 502302 490405 478913 466693 454544 443740 433885 423806 413586 404164
55676 404164 395611 387241 379130 372340 367662 364770 362494 359651 355988 352351 349376 346205 341457 335290
55662 335290 329128 323373 317061 310136 304249 300573 298455 296952 295990 294982 292150 286772 280838 277012
55648 277012 275977 276980 279660 283702 287756 290511 292338 294385 296542 297694 297425 296039 293298 288679
55634 288679 282834 277575 274355 273664 275574 279732 284886 289527 293175 296390 299667 303140 307303 313054
55620 313054 320677 329220 337085 343104 347173 350052 352322 353484 352519 349435 345488 341576 337275 332110
55606 332110 326946 323143 320760 318572 315763 312896 311148 311008 311680 311727 310626 309726 311078 315045 319772
55591 319772 323372 325851 328318 331030 333063 333533 332329 329784 326227 321903 317050 312042 307366 303062
55577 303062 298356 292454 285683 279073 272857 266381 259576 253201 247149 239837 230252 219534 209479 200295
55563 200295 191177 182623 176686 174573 174839 174393 171111 165409 159456 154938 151654 148243 143800 138365 132443
55548 132443 127020 123609 122993 123907 124143 123039 121622 120357 118508 116103 114653 115021 116080 116583 116896 117685
55532 117685 118338 118207 118298 120003 122863 125141 126050 125959 124935 122719 119985 118030 117076 116149 114860 114202 115107
55515 115107 117005 118364 118429 118161 119444 123201 128350 132981 136526 140109 144713 149939 154864 159138 162679
55500 162679 165101 166072 165637 163835 160732 156982 153273 149030 143066 135893 129699 125339 121212 116199 111745
55485 111745 109415 108183 106257 104123 103412 103730 103085 100927 98428 96057 93260 90530 89523 90693 92622
55470 92622 94059 95038 95727 95881 95901 96910 99227 101905 104080 105659 106617 107035 107966 110716 114762 117739
55454 117739 118017 116122 113200 109402 104526 99190 94548 91385 89860 89510 89316 88423 86851 84822 81763
55439 81763 77098 71777 67498 64356 60814 56288 52144 49579 47942 45917 43137 39927 36624 33901
55425 33901 32605 32485 32142 30932 29781 29397 28976 27775 26752 27192 28475 28677 27023 24525 22499 21506
55409 21506 21575 22356 23076 23102 22538 21704 20247 17419 13162 8431 4559 2545 2465 3156 3037 1834 916 1330
55391 1330 2261 2457 2473 4029 7257 10067 10617 9368 8132 8059 9074 10494 11427 11129 9817 8915 9741
55374 9741 11966 13842 13849 11721 8128 4145 1090 0 672 1616 1461 139 -1523 -2884 -3571 -3071 -1146 1418
55355 3437 4804 6648 9802 13821 17723 20875 22830 23134 22032 20791 20719 22106 24382 26636 27624 26179
55339 26179 22527 18650 16506 16199 16501 16503 15928 14480 12121 9722 8358 8008 7782 7274 6823 6667 6773
55322 6773 7276 8111 8431 7541 6357 6685 8817 10886 10974 9020 6381 4338 3334 3017 2653 1891 1017
55305 1017 99 -1614 -4525 -7421 -8653 -8327 -7892 -7583 -6005 -2582 1224 3844 5254 5877 5277 3251
55289 3251 1185 875 2399 4159 4800 4266 3298 2538 1892 363 -3067 -7951 -12370 -14925 -16166 -17439
55273 -17439 -18878 -19340 -17989 -15222 -12125 -9550 -7679 -6327 -5667 -6431 -8802 -11325 -11912 -10145 -7623
55258 -7623 -5793 -4608 -3688 -3477 -4266 -5240 -5582 -5659 -6012 -6098 -5301 -4403 -4463 -4793 -3820 -1826 -1041 -2617 -4999
55239 -4999 -6030 -5546 -5095 -5850 -7617 -9494 -10748 -11186 -11088 -10773 -10066 -8421 -5767 -3016 -1409 -1430 -2477
55222 -2477 -3645 -4704 -6097 -7870 -8822 -7241 -2733 3064 7826 10396 11093 10630 9384 7679 6207
55207 6207 5789 6727 8467 9913 10253 9571 8618 8061 8081 8544 9144 9404 9015 8269 7757 7496 6817 5283 3342
55188 3342 1870 1383 1728 2141 1564 -523 -3406 -5779 -7198 -8304 -9560 -10581 -11001 -11218 -11743 -12412 -12619
55171 -12619 -11779 -9309 -4990 184 4422 6949 8705 10615 12256 13081 13932 15927 18449 19637 18667 16376
55155 16376 13767 11172 8920 7654 7584 8158 8809 9476 10329 11435 12678 13606 13547 12478 11540 11986 13787
55138 13787 15934 17847 19662 21377 22675 23627 24599 25354 25164 23954 22547 21540 20687 19598 18276 16718
55122 16718 14744 12563 10878 10055 9705 9377 9086 8922 8758 8733 9393 10877 12383 12932 12357 11136 9582
55105 9582 7660 5395 2954 349 -2530 -5428 -7563 -8267 -7892 -7765 -8802 -10148 -9775 -6756 -2510 666
55088 1902 2083 2310 2878 3561 4061 3992 3167 2066 1522 1780 2361 2943 3854 5506 7787 10144 11935 12712
55070 12712 12546 12026 11538 10721 9155 7353 6276 6005 5841 5777 6851 9643 13261 16325 18267 19232 19367
55053 19367 18890 18460 18840 20306 22663 25619 28974 32722 36978 41450 45070 46774 46736 46119 45586 44943
55037 44943 44379 44829 46500 48073 48369 48050 48643 50328 51807 52190 52050 52575 54338 57000 59664 61488
55021 61488 62206 62060 61133 59235 56732 54855 54522 55315 56336 57520 59228 60981 61789 61786 62398 64524 67324
55004 67324 69157 69105 67246 64060 60063 55781 51782 48783 47488 47823 48435 47713 45510 43249 42152 41979
54988 41979 41813 41408 41257 41722 42614 43368 43292 41976 39777 37630 36049 34722 33390 32538 32575 32908 32777 32752
54970 32752 34260 37363 40029 40217 38059 35360 33509 32651 32579 33423 35233 37638 40330 43337 46410 48624
54954 48624 49311 49196 49776 51377 52559 51995 50440 50070 51977 55062 57595 59173 60606 62392 64120 65328
54938 65328 66092 66372 65505 63088 60142 58539 59005 60209 60154 58051 54516 50508 46840 44484 44232 45653
54922 45653 47053 47068 45929 44798 44349 44629 45822 48174 51172 53750 55492 56871 58073 58489 57976 57825
54906 57825 59593 63364 67858 71892 74950 76669 76923 76527 76926 78835 81767 85033 88495 92152 95852
54891 95852 99800 104671 110697 117229 123686 130392 137992 146684 156638 168451 182329 197345 212453
54878 212453 227764 243688 259083 271608 280057 285169 287806 287443 283083 274795 263636 250660 236761
54865 236761 223032 210450 199173 188604 178172 167849 158059 149296 141849 135837 131511 129156 128289
54852 128289 127239 124333 119680 115168 112591 112350 114043 117399 122137 127693 133710 140380 147907 156205
54838 156205 165572 176953 190812 206234 221798 236898 251427 264523 274456 279693 279610 274486 265507
54825 265507 254497 242886 230781 217400 202212 185406 167893 151480 138357 129305 122606 115651
54813 115651 107555 99442 92537 87157 83442 81652 81282 80998 80082 79205 79227 79895 80247 79728 78400 76605
54797 76605 74966 74283 74830 76045 77298 78580 80022 81216 81703 81831 82325 82909 82084 78622 72978 66836
54781 66836 61491 57127 53627 51407 50846 51137 50568 48352 45615 44108 44216 44723 44344 43015 41783 41853
54765 41853 43633 46340 48640 49867 50363 50517 50175 49539 49850 52226 56193 60268 63616 66160 67621 67889
54749 67889 68130 69886 72938 75592 77438 80130 84750 89953 93760 95952 97570 99283 101631 105834 112694
54734 112694 121120 129184 136491 144376 154076 165827 179419 194259 209020 222577 235466 249213
54722 249213 263985 278032 289677 298758 305581 309530 309453 304816 296084 284596 272479 261821 253185
54709 253185 245391 237322 229430 222873 217725 212909 207677 202347 197581 193635 190454 187990 186168 184837
54695 184837 183992 183885 184839 187077 190701 195647 201589 208073 214944 222758 232783 246358 263820 283905
54681 283905 304474 324004 342159 358843 373272 384557 392774 398599 401777 400853 394917 385007 373046
54668 373046 359588 343413 323602 301496 280140 261900 246921 233890 221819 210616 200147
54657 200147 189617 178570 168060 159871 154434 150329 146108 141778 137985 134676 131505 128848 127130
54644 127130 125538 122838 119474 117392 117471 118506 119290 120240 121963 123467 123252 121416 119307 117526 115750
54629 115750 114367 114689 117207 120713 123662 125645 127132 128397 129111 128691 126991 124978 124551 126948 131333
54614 131333 135647 138931 142033 145883 149942 152952 154709 156501 159831 164925 170463 174932 178384 182517
54600 182517 188675 196172 203234 209064 214048 218308 221366 223350 225290 227781 230243 231893 232608 232567 231897
54585 231897 230994 230294 229399 227452 224821 223378 224452 227500 231444 236309 242623 250081 257982 266495 276554
54570 276554 288790 303175 319153 335386 350006 362013 371873 379920 384794 384629 379447 371219 361731
54557 361731 351414 340163 328240 316139 304261 292897 282074 271572 261604 253125 246730 241628
54545 241628 236601 231748 228256 226535 225641 224606 223196 221035 217138 211038 203697 196538 189937 183187
54531 183187 175782 168331 162283 158770 157367 155923 152095 145454 137859 131531 127101 123796 121010 118942
54517 118942 117662 116374 114220 111431 108962 107018 104743 101586 98081 94713 90920 86390 82663 81749
54503 81749 83154 83924 82138 78946 76521 75505 75524 76819 79680 82909 84539 84084 82958 82640 83264 83976
54487 83976 83903 82781 81183 80128 80248 81605 84260 88127 92044 94265 94554 94510 95041 95155 94572 95689 100684
54470 100684 107832 113313 116080 118325 121478 124706 127730 132150 138805 146087 152260 157651 163223 168618
54456 168618 172946 176175 178385 178874 177333 174874 172562 169820 165492 159723 153568 147580 141993 137543
54442 137543 134703 132538 129544 125347 120606 115713 110684 105893 101802 98199 94742 91981 90797 90908
54428 90908 90955 90039 88397 86641 85235 84708 85358 86498 86661 84981 82130 79762 79238 80712 83163 85306
54412 85306 86688 87807 89265 91278 94046 97819 102174 105858 107866 108196 107241 105310 103238 102388 103121
54397 103121 104075 104028 103670 104291 105419 105362 103690 101542 99516 97033 94129 92258 92443 93819 94828 94944
54381 94944 94446 93359 91615 89735 88460 87998 88233 89169 90354 90375 88065 84329 81689 81568 82763 83132
54365 83132 82154 80957 80250 79409 77884 76357 75727 75749 75716 75998 77543 79925 81525 82214 84324 89716 96910
54348 96910 102661 105940 108746 112990 118158 122659 126255 130053 134683 139546 143908 147912 152217 157026
54334 157026 162009 167152 173085 180145 187425 193473 197966 201894 205798 208709 209410 208003 205295 201272
54320 201272 195513 188940 183729 180921 179139 176352 172232 168071 164858 162252 159393 156069 152940 150869
54306 150869 150087 149783 148562 145686 141998 139293 138481 138511 137424 134426 130502 127005 124354 122581 122388 124519
54290 124519 128307 132014 134840 137485 140368 142539 143307 143930 146431 151143 156637 161883 167266 173323 179470
54275 179470 184419 187407 188798 189827 191602 193867 194957 193497 189915 185592 180948 175475 169503 164499
54261 164499 161108 158046 153716 148175 142638 137688 132945 128345 124685 122598 121482 119955 117280 114008
54247 114008 111072 108498 105476 101804 98610 97024 96408 94716 90761 85665 81773 80390 80663 80545 78767
54232 78767 75948 73576 71960 69894 66717 63831 63142 64477 65774 65674 64704 63838 63251 62911 63169 63939
54216 63939 64237 63368 61998 61305 61608 62430 63401 64442 65527 66909 69129 72132 74763 75839 75478 74847
54200 74847 74855 75667 77027 78348 78750 77836 76362 75468 75319 75178 74698 74354 74568 75134 75796 76786 78335 79959
54182 79959 80597 79414 76492 72833 69667 67529 66072 64896 64342 65095 67113 69435 71091 71969 72766 74319
54166 74319 76838 79480 80951 80868 80409 81135 83333 86077 88657 91084 93201 94373 94525 94551 94951 94819 93187
54149 93187 90914 89953 90689 91239 89976 87848 87231 88885 91011 91414 89803 87567 85779 84099 81703 78712
54133 78712 76284 75334 75567 76027 76277 76573 76981 77044 76623 76350 76627 76672 75544 73902 73614 75323 77364 77568
54115 77568 75358 71607 67413 63854 62044 62205 63076 63397 63686 65322 68026 69706 69110 67348 66292 66543
54099 66543 67534 68581 69028 68205 66177 63916 62023 59861 56771 53487 51310 50444 50291 51013 53370 56877
54083 56877 59509 59906 59053 59071 60717 62630 62881 60973 58481 57697 59323 61521 61719 59440 56805 56051
54067 56051 57142 58248 58014 56644 55036 53684 52707 52313 52612 53063 52703 51285 49901 49977 51691 53837
54051 53837 55379 56603 58388 60813 63098 64605 65219 64897 63633 62001 60913 60538 60101 59178 58502 58857
54035 58857 59741 60158 60483 62313 66002 69339 69663 66996 64123 63567 65294 67584 69183 69852 69541 68300
54019 68300 67040 67268 69550 72856 75737 77503 77865 76330 72890 68876 66215 65942 68000 72007 77143
54004 77143 81642 83884 84411 85697 89193 93400 95619 94963 92896 91245 90571 90433 90519 91287 93552 97385
53988 97385 101547 104547 106327 108198 110847 113470 115589 118638 124353 132155 139626 145484 150592 155926
53974 155926 161144 165789 170523 176200 182697 189672 197590 206728 215716 222513 226877 230739 235914 242412
53960 242412 249254 256052 263016 269828 275259 278070 278131 276572 274886 273848 273352 273191 273574 274566 275287 274219
53944 274219 270451 264503 258010 252569 248509 244553 239129 232294 225772 220619 215770 209958 204323 201284
53930 201284 200838 199806 195544 188972 182941 178842 176121 174167 172967 172145 170935 169405 168622 169133 169998
53915 169998 169703 167631 164584 162290 162309 164765 168083 170551 172207 174545 178236 181905 183571 182752 180800
53900 180800 179519 179794 181134 182190 181950 180741 179961 180771 183376 187545 193154 199748 206027 210473 212422
53885 212422 212219 210583 208420 207105 208103 211787 216912 221713 225465 228669 231902 235104 238200 241761 246296
53870 246296 251195 255240 258309 261609 265768 269566 271422 271571 271736 272899 274560 276295 278861 283114 288591
53855 288591 293957 298627 303338 309063 315658 321783 326284 329699 334016 340543 348304 355153 360248 364562
53841 364562 369004 373050 375673 376727 376792 376272 375341 374239 372853 370324 365866 359903 353777 348315 343174
53826 343174 337582 331138 323703 315035 305040 294347 284229 275667 268526 261960 255660 250238 246057 242165
53812 242165 237096 230515 223352 216446 209978 204259 199921 196820 193717 189790 185726 182485 179704 176345
53798 176345 172535 169579 168027 166733 164250 160599 157229 155391 154871 154266 152346 148903 144248 138401 131462
53783 131462 124696 120273 119406 121229 123830 125897 127013 127115 126414 125512 125039 125186 125734 126126 125473 123347
53767 123347 120819 119700 120211 120633 120119 120614 124468 130999 137104 140874 142910 144306 145255 145940 147107 148903
53751 148903 150282 150298 149264 148195 147895 148910 151515 155268 159263 163210 167644 172862 178365 183566 188314
53736 188314 192558 196421 200771 206623 213534 219648 223941 227519 232048 237795 243947 249883 255094 258577
53722 258577 259589 258864 258230 259012 261262 264141 266366 266536 263821 258598 252227 246287 241931 239280 237086
53707 237086 233614 228465 223092 219100 216554 214469 212393 210729 209764 209015 207518 204611 200738 197497 196128
53692 196128 195773 194239 190986 188159 187799 189203 190324 190857 192371 195885 200773 205728 209435 210599 208906
53677 208906 205932 203686 202434 201356 200956 202567 205284 205913 203113 199462 197777 197205 195145 191763 189894
53662 189894 190616 191452 189792 186319 183849 183843 185300 186590 187233 187839 189143 191404 194324 197278 199793 202019
53646 202019 204516 207323 209515 210269 210275 211286 213904 216690 218239 219435 222345 227166 231857 235110 238128
53631 238128 242632 248362 253819 258672 263974 270298 276931 282910 287728 290955 292276 292303 292451 293530 295018
53616 295018 296078 296666 297259 298062 298896 299418 298986 296802 292729 287780 283285 279767 276995 274897 273796 273789
53600 273789 274344 274695 274396 273426 271994 270248 268013 264888 260868 256826 254027 253034 253286 253869 254430 255152
53584 255152 256055 256743 256935 257009 257748 259534 261950 264272 266267 268285 270646 273227 275760 278251 280847 283413
53568 283413 285615 287408 289194 291431 294247 297420 300537 303200 305386 307617 310503 314017 317549 320787
53554 320787 324146 328058 332293 336472 340865 345979 351427 356008 359199 362018 366088 372227 380128 388808
53540 388808 396847 402831 406490 409322 413268 418719 424458 429590 434567 439970 445183 449132 451742 453703
53526 453703 455082 455256 454349 453818 455135 458443 462814 467231 470903 473308 474624 475817 477610 479581 480929
53511 480929 481870 483374 485488 486893 486627 485507 485217 486429 488458 490431 491987 492891 492889 492437 492977 495817
53495 495817 500683 505781 509427 511502 513309 516225 520534 525392 529704 533128 536413 540711 546419 552699
53481 552699 558376 563313 568594 575315 583527 592636 602324 612641 623503 634828 647116 661168 676936
53468 676936 693195 708617 722794 735980 748282 759614 770230 780951 792964 807423 824814
53457 824814 844399 864629 884453 904027 924054 945033 967463 991942 1018175 1044463 1069402
53446 1069402 1094057 1121250 1152390 1185914 1219320 1251884 1284713 1318874 1354435 1391077 1428641
53435 1428641 1466691 1504101 1539644 1573136 1605869 1639709 1675586 1712731 1749470 1784699 1818456
53424 1818456 1851201 1883075 1914201 1945396 1977964 2012439 2047697 2081692 2113294 2143189 2172730
53413 2172730 2202152 2230501 2257272 2283149 2308553 2332189 2351989 2367282 2379163 2388875 2396793 2403094
53401 2403094 2408362 2412945 2416279 2417306 2415239 2409707 2400707 2388685 2374249 2357546 2338376 2317038 2294353
53388 2294353 2270593 2245202 2218150 2190817 2164734 2139852 2114800 2088514 2060970 2032676 2004340
53377 2004340 1976883 1950958 1926316 1902189 1878254 1854816 1832251 1810971 1791800 1775611 1762451
53366 1762451 1751657 1742888 1736269 1731323 1726690 1721628 1717280 1715679 1717606 1721999 1727479 1733837 1741807 1751894
53352 1751894 1763991 1777977 1793944 1811566 1829892 1848480 1868501 1891856 1919081 1948891 1979988
53341 1979988 2012504 2047155 2083842 2122028 2162015 2204784 2250636 2298894 2349037 2401343 2456198
53330 2456198 2513453 2572764 2634056 2697306 2762131 2827827 2893639 2959015 3023829 3088393 3152951
53319 3152951 3217191 3280392 3341815 3400608 3455829 3507309 3556238 3603942 3649972 3692277 3729423
53308 3729423 3761732 3789945 3813817 3832691 3846546 3855411 3858270 3853719 3841835 3824534 3803724 3779501
53296 3779501 3750333 3714826 3673248 3627543 3579878 3531063 3480467 3427457 3372559 3316906 3260903
53285 3260903 3203967 3145557 3086117 3027041 2969965 2915906 2864727 2815493 2767620 2721391 2676850
53274 2676850 2632491 2586135 2537543 2489331 2444553 2403725 2364963 2326753 2289643 2255134 2223965
53263 2223965 2196149 2171907 2151478 2134042 2117746 2101065 2083673 2065856 2047689 2029212 2010968
53252 2010968 1993778 1978018 1963417 1949481 1935954 1923041 1911340 1901416 1893397 1887266 1883444 1882382
53240 1882382 1883388 1884743 1885662 1887445 1891817 1898720 1906850 1915972 1927171 1940717 1955175 1969381 1984229
53227 1984229 2001621 2022366 2046008 2072136 2100707 2131125 2161996 2192125 2221388 2250365 2279367
53216 2279367 2307865 2334617 2358285 2378172 2394655 2408875 2421833 2433478 2442667 2448234 2450250 2449907
53204 2449907 2447905 2443391 2435087 2423188 2409352 2394788 2379052 2360870 2339511 2315196 2288813 2261533
53192 2261533 2234126 2206245 2176804 2145262 2112167 2078457 2044914 2012352 1981446 1952004 1923216
53181 1923216 1894900 1867607 1841138 1814222 1786463 1759441 1734665 1711383 1687829 1664038 1641762
53170 1641762 1622007 1604259 1588182 1574239 1562145 1550247 1537350 1524174 1512143 1501600 1492123
53159 1492123 1483902 1477570 1472831 1468179 1462249 1454885 1446708 1437980 1428189 1416695 1403545 1389481 1375153
53146 1375153 1360614 1345704 1330630 1315825 1301573 1288152 1275887 1264321 1251594 1235779 1217114
53135 1217114 1198113 1181030 1165942 1151756 1138127 1125272 1112263 1096940 1078072 1056963 1036172
53124 1036172 1016804 997623 976891 954600 932552 912615 895333 880012 865326 849711 832019
53113 832019 812480 792700 774194 757140 740895 725221 710427 696709 683959 671871 659587
53102 659587 645804 630239 614674 601380 590569 580463 569728 558571 547402 535922 524134
53091 524134 512920 502860 493456 484186 475318 466955 458434 449682 442137 436961 433014 427978 421184 414083
53077 414083 408160 403578 399803 396360 392798 388861 384999 382033 380187 379028 378182 377403 376005 373157 368944
53062 368944 364372 360198 356341 352471 348353 343559 337764 331612 326392 322378 318281 313005 307326 302987
53048 302987 300464 298382 295144 290495 285333 280624 276965 274994 275407 278026 281205 283010 283135 282998 283703
53033 283703 284731 285161 285295 286144 287983 290566 294242 299489 305539 310909 315423 320363 326472 333147 339893
53018 339893 346891 353435 357449 357836 356124 354408 352545 348925 343427 337944 333912 330627 326332 320126
53004 320126 312583 305089 298708 293279 287621 280936 273757 267133 261351 256049 251143 246921 243430 240367
52990 240367 237315 233644 228788 223253 218650 215786 213486 210524 207846 207201 208044 207899 205822 203388 201814
52975 201814 200289 198165 196731 197258 198730 199326 199087 199259 199698 198948 196775 194793 194244 194609 194886 195039 195545
52958 195545 196332 196794 196368 194672 191565 187462 183303 179976 178021 177782 179217 181413 183014 183587 184098 185635
52942 185635 188027 190261 191872 193180 194140 193721 191061 187053 184118 184009 186047 187938 188289 187811 187906 188712
52926 188712 189114 188333 186834 185676 185614 186953 189553 192538 194407 194133 192231 190321 189510 189483 189410 189353 190182
52909 190182 192089 193930 194537 194176 193955 194156 194219 194308 195635 198716 202340 205046 206846 208668 210910 213632
52893 213632 217441 222712 228264 232337 234959 237888 241936 245883 248681 251229 254822 258905 261935 263987
52879 263987 267077 272829 280924 290043 299306 308202 315890 321579 325622 329532 334478 339983 344539 347433
52865 347433 349394 351214 352431 352058 350188 347901 345718 343161 339960 336642 333476 329809 325128 319926
52851 319926 314729 309057 302463 296131 292117 290942 290987 290507 289350 288228 286984 284424 279902 274593 270821
52836 270821 269968 271245 272742 273493 273986 274799 275651 276225 276898 277920 278572 278138 277180 276798 276974 276822 276304 276432
52818 276432 277700 279505 281264 282908 283988 283664 282219 281373 282223 283883 285044 285809 286780 287267 286075 283729
52802 283729 282222 282348 282674 281596 279304 277120 275841 275483 275997 277382 279377 281664 284219 287056 289826
52787 289826 292129 294026 295886 297874 299977 302288 304757 306819 307824 307938 308066 308925 310684 313570 317985
52772 317985 323455 328065 329835 328639 326205 324270 323351 323273 323985 325334 326628 327181 327149 327315 328146 329539
52756 329539 331397 333853 336804 339728 342231 344383 346273 347586 348035 347950 348002 348332 348310 347166 344582 340683
52740 340683 335831 330634 325909 322253 319634 317441 314849 311071 305597 298657 291359 284818 279052 273255
52726 273255 267451 263123 261434 261236 259953 256520 252380 249205 246619 242997 237765 231876 226371 221484
52712 221484 217125 213311 209987 207127 205094 204238 204106 203800 203156 202626 201855 199573 195543 191587 189612 189238
52696 189238 188432 186056 182715 179267 175798 172314 169443 167718 166614 164804 161220 155752 149313 143413
52682 143413 139311 137225 136364 135797 135161 134613 134439 134758 135259 135133 133619 130787 127491 124416 121527 118660
52666 118660 116264 115058 115073 115433 115210 114350 113730 114381 116605 119706 122493 124004 123880 122353 120063 117656
52650 117656 115212 112233 108636 105586 104667 106092 108337 109751 109861 108859 106701 103574 100666 99386 99858
52635 99858 101016 102156 103481 105039 106117 106239 106031 106362 107092 107380 107064 107070 108447 111395 115248 119017 121925
52618 121925 123828 125298 127077 129377 131864 134247 136538 138824 141200 144158 148464 154074 159347 162071
52604 162071 161645 160001 159978 162862 167716 172831 177211 180535 182434 182645 181788 181183 181453 181629 179998 175736
52588 175736 169643 163579 159417 158047 158686 159191 157666 154038 149797 146039 142234 137198 130887 124679 119982
52573 119982 117048 115255 114063 113290 112744 112102 111201 110148 108958 107375 105299 103271 102150 102232 102884 103164
52557 103164 102666 101635 100390 98907 97062 95163 93914 93658 93868 93798 93625 94411 96665 99534 101878 103533
52541 103533 104677 104526 102121 98534 96715 98296 101578 103708 104044 104255 105796 108697 112506 116855 120843
52526 120843 123156 123370 122310 120852 119244 117925 117930 119696 122233 124258 125573 126647 127453 127689 127842 129015
52510 129015 131529 134357 136199 136802 137060 137987 139634 141013 141220 140602 140488 141795 144347 147603 151243 154642
52494 154642 156579 156360 154878 153693 153296 153001 152487 152528 153906 156191 158006 158344 157435 156494 156696 158275 160552
52477 160552 162650 163986 164183 163145 161598 161071 162787 166580 171082 174722 176540 176677 176444 177402 179760
52462 179760 182065 182878 182319 181512 181212 181602 182713 184169 185131 185464 186416 188960 192015 193734 194245 195437
52446 195437 197981 200290 200962 200707 200995 201906 202314 201470 199560 197269 195434 194708 195024 195779 196710 197987 199344
52429 199344 200045 200070 200322 201127 201442 200179 197520 194359 191431 189656 190226 193214 196793 198978 199591 199633 199539
52412 199539 199274 199411 200533 201815 201748 200377 199528 200522 202833 205221 207135 208551 209400 209793 210208 210962 211934
52395 211934 213090 214815 217381 220506 223719 226747 229261 230622 230398 229146 228413 229601 232466 234787 234205
52380 234205 230825 227578 227444 230644 234999 238432 240233 240381 239023 236899 235313 235168 236379 238224 239769
52365 239769 240172 239360 238355 238096 238098 237223 235603 234526 234258 233558 231902 230635 230941 231953 232236 232201 233456
52348 233456 236290 239349 241732 243887 246306 248617 250342 251494 251934 251183 249520 248417 248953 250380 251221
52333 251221 251552 253168 257336 263212 268869 273313 276967 280579 284379 288244 292030 295493 298288 300408
52319 300408 302357 304619 307179 309863 312867 316381 319757 321650 321268 319267 317154 315937 315422 314649 312947
52304 312947 310741 309422 310225 313076 316555 319010 319721 319232 318906 320061 323115 327280 331210 334038 335849
52289 335849 337379 339580 343241 348513 354654 360613 365925 370779 375303 379323 382895 386538 390735 395722
52275 395722 401898 409763 418995 428152 435921 442372 448447 454585 460591 466652 473630 482124 491780 501750
52261 501750 511430 520629 529607 539261 550806 564669 579843 594893 609507 624610 640947 658256
52249 658256 676197 695479 717245 741485 766767 791692 815977 840075 864580 890365 918346
52238 918346 948173 977826 1005698 1032799 1061637 1092997 1125139 1156503 1187660 1219616 1251347
52227 1251347 1280501 1306211 1330001 1353790 1377935 1401303 1422500 1440755 1456275 1470105 1483211
52216 1483211 1495425 1505609 1513109 1518695 1523681 1528342 1531648 1532620 1531544 1529603 1527539 1525126 1522014 1518564
52202 1518564 1515456 1512801 1510290 1508180 1507445 1508755 1511879 1516406 1522410 1529914 1538267 1546789 1555785 1566264
52188 1566264 1578767 1593071 1608925 1626361 1645148 1664565 1683975 1703235 1722419 1741514 1760553
52177 1760553 1779549 1798084 1815352 1830960 1845371 1859218 1872347 1883804 1892604 1898286 1900903 1900844
52165 1900844 1898510 1893872 1886420 1875968 1863465 1850507 1837750 1824160 1808276 1789943 1770311 1750117
52153 1750117 1728702 1705161 1679933 1654533 1629836 1605448 1581045 1557584 1536518 1518077 1500974
52142 1500974 1483800 1466175 1448425 1430688 1412852 1395284 1379148 1365678 1355138 1346679 1339300 1332693
52130 1332693 1326851 1321165 1314694 1307614 1301639 1298212 1296602 1294618 1291209 1287486 1284844 1282924 1280170 1275928
52116 1275928 1271066 1266590 1262432 1257864 1252514 1246510 1240004 1232986 1225357 1216908 1207531 1198009 1190259 1185922
52102 1185922 1184477 1183465 1180938 1177093 1173152 1169464 1165620 1161803 1158630 1155641 1151355 1145464 1139963 1137084
52088 1137084 1136666 1136444 1134629 1131261 1127231 1123148 1119571 1117340 1116819 1117091 1116701 1115183 1113396 1112329 1112161
52073 1112161 1112707 1114107 1116491 1119298 1121778 1124260 1128052 1133596 1139357 1143205 1144669 1145143 1146145 1148230
52059 1148230 1151624 1156958 1164813 1174948 1186502 1198773 1211618 1225314 1240269 1256663 1274332 1293208
52047 1293208 1313800 1336861 1362543 1390395 1420209 1452228 1486267 1521283 1556292 1591268 1626698
52036 1626698 1662514 1697900 1732024 1764720 1796643 1828762 1861267 1892882 1921787 1947342 1970305
52025 1970305 1991217 2009490 2024514 2036716 2046762 2054434 2059134 2060922 2060151 2056605 2049962 2040793 2030173
52012 2030173 2018441 2005157 1990076 1973441 1955597 1937119 1919010 1901924 1885509 1869381 1854340
52001 1854340 1841525 1830740 1820896 1811946 1804998 1800523 1797916 1797062 1798821 1803426 1809696 1816537 1824079 1832640
51987 1832640 1841700 1850733 1860150 1870553 1881790 1893497 1905756 1918325 1930058 1940087 1948972 1957686
51975 1957686 1965913 1972308 1976104 1977487 1976738 1974013 1969768 1964452 1957826 1949357 1939196 1927806 1914649
51962 1914649 1898155 1877401 1853138 1826867 1799417 1770819 1741200 1711282 1681877 1653003 1623672
51951 1623672 1592769 1560184 1526889 1493915 1461561 1429588 1397625 1365216 1332093 1298867 1266900
51940 1266900 1237037 1208756 1180857 1152367 1122437 1090318 1056485 1023120 992225 963393 934520
51929 934520 904729 875472 848636 824571 802333 780880 759480 737674 715639 694303 674526
51918 674526 656279 639008 622613 607611 594188 581390 567667 552404 536751 522591 510732
51907 510732 500543 491286 483027 475872 469140 462067 454871 448339 442642 437323 432233 427696 423941 421042
51893 421042 419182 418145 416764 413838 409588 405328 401757 398472 395098 391793 388568 385164 381862 379323
51879 379323 377341 374780 371118 366989 362842 358325 353617 350159 349089 349836 351074 352081 352266 350516 346509
51864 346509 341989 339227 338380 337645 335718 332728 328855 323559 316740 309646 304048 300939 300114 300377 300102
51849 300102 298390 295822 293544 291642 289174 285752 282069 278643 275092 271188 267736 265674 264828 264228 263287
51834 263287 262127 261060 260320 260089 260239 260126 259116 257341 255600 254462 253638 252344 250271 248098 246936
51819 246936 247163 248041 248630 248723 248570 248158 247491 247243 248185 249980 251554 252834 254964 258337 261529 263063 263498
51802 263498 264784 267953 272362 276788 280270 282066 281886 280537 279720 280843 284224 289192 294550 299102 302400
51787 302400 304954 307250 308750 308628 307381 306793 307921 309843 310851 310380 309335 308895 309413 310372 311041 311236
51771 311236 311377 311528 310572 307121 301529 296249 293544 293295 293730 293972 294882 297342 300630 303047 303715 303166
51755 303166 302280 301252 299892 298540 298198 299570 302283 305204 307363 308336 308023 306552 304478 302611 301398
51740 301398 300702 300260 300031 299946 299766 299531 299760 300673 301472 301131 299962 299641 301229 303726 305193 305002 304197 303747
51722 303747 303457 303071 303462 305651 309042 311894 313598 315231 317447 319101 318972 317877 317752 319113 320821
51707 320821 322154 323612 325554 327440 328962 330766 333392 336448 339438 342436 345227 346887 347194 347566 349366
51692 349366 352049 354339 356680 360840 367134 373701 379021 383814 389723 396999 404218 409815 413422 416051
51678 416051 419296 424002 429627 435226 440923 447634 455488 463640 471911 481345 492398 503567 512802 519665
51664 519665 525196 530251 534954 539319 543214 545865 546525 545678 544582 543508 541404 537591 532862 528505 525093
51649 525093 522799 522106 523367 526038 529006 531385 532520 531726 528910 525238 522326 520792 520266 520631 522275
51634 522275 524987 527737 530039 532621 536028 539432 541685 542966 544402 546667 550124 555769 564316 574246
51620 574246 582500 587712 591254 594326 595689 593737 589543 585860 583657 581651 579273 578074 579435 582304
51606 582304 584162 583407 580205 576014 573080 573414 576960 581096 582955 582158 580467 579064 577170 573448 567710
51591 567710 560768 553318 545699 538373 531824 525904 519884 513424 507109 501585 496439 490434 482888 474398
51577 474398 466189 459240 454065 450540 447504 443229 437045 430204 424492 420278 416589 412689 408638 404498
51563 404498 399950 394869 389501 384061 378867 374720 372151 370418 368376 366378 365928 367114 367937 367029 365711
51548 365711 366177 368590 371115 372159 371427 369373 366811 364746 363555 362479 360732 358714 357380 356970 357408
51533 357408 359311 363278 368436 373097 376791 380412 384428 388409 392506 397904 405093 412915 420118 427000
51519 427000 434673 443339 452056 459867 466476 472071 476942 481146 484375 486323 487132 486990 485371 481470 475587
51504 475587 469282 463750 458816 454005 449714 446344 442826 437302 429530 421830 417183 416589 418499 420557
51490 420557 421657 422401 423926 426642 430124 433888 437957 442790 448818 455858 462873 468747 473687 479205
51476 479205 485978 492180 495183 494845 493848 494371 495561 494966 491611 486731 482153 478951 477433 477446 478521 480224
51460 480224 482455 485060 487314 488378 488432 488974 491624 496600 502543 507879 512227 516148 519636 521571 521117
51445 521117 519004 516680 514613 512418 510269 508852 507802 505612 501578 496679 492002 487470 482799 478449
51431 478449 474598 470358 465295 460811 458484 457707 456635 455039 454475 455526 456656 456285 454598 452694 451161
51416 451161 450251 450451 451977 454275 456760 459523 462821 466512 470639 475976 483142 491510 499896 508240 517777
51401 517777 529395 542432 555386 567318 578205 588207 597136 604769 611304 617126 622246 626401 629797
51388 629797 633179 636809 639720 640588 639206 636599 633815 631131 628363 625229 621391 616912 612942 611214
51374 611214 612369 615279 618411 621416 624968 629463 634474 639187 642878 645181 646297 646742 646554 645087 641994
51359 641994 637980 633954 629860 625069 619614 614027 608021 600541 591462 582193 574008 566582 558904 550879
51345 550879 543078 535474 527707 520497 515463 513065 511724 509698 507138 505443 504995 504581 503124 501100 499763
51330 499763 499515 499666 499608 499553 499917 500519 500842 500979 501809 504036 507277 510284 511857 511402 508843 504450 498682
51313 498682 491814 483627 473811 462730 451403 440478 429612 418190 406380 395081 384921 375690
51301 375690 366696 357294 347196 336739 327052 319590 315124 313102 312031 310489 307886 304501 300950 297654
51287 297654 294705 291984 289130 285509 280734 275367 270649 267155 264153 260758 257340 255068 254230 253820 253003
51272 253003 252295 252791 254454 255584 254177 249908 244809 241668 241462 242636 243190 242911 243006 244155 246087 248826
51256 248826 252973 258547 264840 271791 280073 289017 295834 298429 298333 299378 303740 310431 317433 323831 329712
51241 329712 335400 341493 348630 356393 363009 366923 368358 368648 368282 366286 361528 354123 345402 336853 329227
51226 329227 322276 315059 306750 297523 288661 281348 275261 268756 260785 252285 245288 240887 238590 237414
51212 237414 236725 235914 234145 231022 227099 223244 219739 216322 212775 209113 205483 202228 199830 198548 198265
51197 198265 198787 199845 200722 200538 199285 197910 196959 195836 194065 192572 192735 194644 197229 199733 202029
51182 202029 203704 204159 203779 203902 205260 207292 209262 211147 212924 213914 213585 212487 211662 211494 211862 213083
51166 213083 215801 219697 223008 223921 222344 219984 218759 219431 221733 225171 229181 232866 235379 236611 236966
51151 236966 236485 235006 233261 232747 234008 235914 237326 238488 239900 240773 240016 238226 237242 237855 239219 240476
51135 240476 241646 242778 243480 243625 243564 243428 243126 243060 243661 244086 242707 239314 235606 233025 231432 230419 230358
51118 230358 231008 230440 227007 221749 217387 215211 214104 212434 209759 206727 204340 203375 203769 204440 204390 203956
51102 203956 204384 206194 208597 210490 211387 211381 210856 210426 210514 210709 209960 207726 204687 202029 200267 199024 197857
51085 197857 196906 196510 196364 195567 193728 191608 190125 188959 186857 183383 179717 177506 177420 178991 181240 183246
51069 183246 184682 186165 188581 191751 194313 195199 194661 193613 192758 192813 194711 198666 203466 207516 210390
51054 210390 212930 216219 220855 226584 231984 235118 235298 233864 232674 232417 232927 234130 235487 235291 232218
51039 232218 227424 223697 222420 222584 222943 223746 225843 229145 232695 235558 237223 237737 237903 238778 240598 242695
51023 242695 244594 246522 248528 249972 250434 250588 251456 253106 254638 255297 255095 254440 253644 252952 252748 253386 254714
51006 254714 256005 256728 257337 258780 261115 263337 264945 266756 269310 271327 271097 269000 267062 266040 264643
50991 264643 262085 259711 259010 259297 258804 257344 256465 257133 258542 259335 259178 258858 259417 261433 264743 268661
50975 268661 272547 276083 279029 281255 283428 287087 293132 300319 306135 309353 311028 312668 314121 313973
50961 313973 311732 308844 307340 307868 309265 309885 309236 308527 309773 314101 320653 327231 332299 336303 340849
50946 340849 346844 353888 361279 368759 376035 382409 387681 393060 400458 410689 422611 433992 443238
50933 443238 450802 459186 470985 486416 503294 519880 537024 556587 578447 600590 622178 645053
50921 645053 671565 701781 733554 764949 796184 829439 866965 909108 954158 1000420 1048330
50910 1048330 1100234 1158422 1223851 1296238 1374319 1456299 1541203 1629806 1723187 1820444 1919249
50899 1919249 2018789 2120460 2224859 2329476 2430293 2524688 2611802 2691115 2761830 2822993
50889 2822993 2873223 2910977 2936117 2950566 2956245 2952916 2939204 2915337 2883638 2846596 2805723 2762243
50877 2762243 2717613 2672963 2628783 2585246 2542196 2498888 2454621 2409659 2364726 2319563 2272827
50866 2272827 2223534 2171706 2117412 2060046 1999063 1934816 1868279 1800387 1732025 1664230 1597862
50855 1597862 1533183 1470008 1408380 1349071 1293426 1242490 1196138 1153443 1114178 1079509 1050568
50844 1050568 1026579 1005122 984230 963738 944720 928265 914917 904693 897257 892145 888808 886471
50832 886471 884481 883119 883562 886528 891483 897747 905622 915459 926306 936929 947779 960418 974946
50819 974946 989707 1003919 1018948 1036213 1055309 1075356 1096982 1121541 1148974 1177882 1207524
50808 1207524 1238651 1272398 1309277 1349355 1392800 1440087 1492028 1549461 1612552 1680672 1753387
50797 1753387 1831404 1916159 2008823 2110197 2221165 2342448 2474024 2615589 2767678 2931607
50787 2931607 3108087 3296427 3495354 3704018 3921534 4145613 4372297 4597546 4819021
50778 4819021 5035795 5245983 5444993 5626710 5786320 5921392 6030317 6110815 6160674 6179371
50768 6179371 6168274 6129759 6067055 5984727 5888242 5782508 5671120 5557093 5443764 5334532
50758 5334532 5231681 5135519 5044513 4956278 4868627 4779862 4688374 4592416 4490401 4381247 4264377
50747 4264377 4139727 4007790 3869119 3723669 3571359 3413808 3254885 3098752 2947605
50738 2947605 2801845 2661887 2528823 2403545 2286338 2177566 2077899 1987521 1905703 1831506
50728 1831506 1764517 1704743 1652128 1606291 1566343 1530993 1499239 1470915 1446158 1424589 1405736
50717 1405736 1389894 1377415 1367128 1356796 1345659 1335367 1327660 1322190 1317563 1313551 1310866 1309235
50705 1309235 1307119 1303451 1298637 1293701 1289318 1285855 1283529 1282274 1282064 1283639 1288268 1296439 1307206 1319226
50691 1319226 1332128 1346742 1364303 1385695 1411157 1440480 1473574 1510877 1552984 1599894 1650992
50680 1650992 1705802 1764513 1827743 1896144 1970230 2050268 2136334 2228845 2328844 2437157 2553235
50669 2553235 2675456 2802623 2934425 3070234 3208263 3346239 3482098 3613504 3737543
50660 3737543 3851776 3954948 4045722 4121096 4177219 4211757 4224605 4216416 4187542 4138897 4073106
50649 4073106 3994183 3906315 3813146 3717785 3622967 3531177 3444607 3364838 3292455 3226956 3166929
50638 3166929 3110290 3054933 2999617 2943944 2886991 2826431 2759797 2686339 2606827 2521874 2431806
50627 2431806 2338307 2244747 2154025 2066888 1982921 1902249 1825516 1753100 1685560 1624369 1571021
50616 1571021 1525459 1486196 1451814 1421620 1395159 1372226 1353485 1340100 1332285 1328825 1328310 1330419
50604 1330419 1335787 1345101 1358523 1375503 1394776 1414874 1435012 1455533 1477471 1501886 1529432 1560010
50592 1560010 1592708 1626505 1661329 1698251 1738495 1782430 1829518 1878982 1930599 1985209 2044419
50581 2044419 2109270 2179008 2251573 2325395 2400304 2476506 2553342 2629713 2705407 2781255 2857649
50570 2857649 2933207 3005211 3071464 3131481 3185700 3233692 3273795 3304840 3327784 3344939 3357735
50559 3357735 3365822 3368324 3365391 3358578 3350431 3343710 3340123 3339335 3339819 3340991 3343955 3349769 3357649 3365496
50545 3365496 3371701 3375761 3377339 3375283 3367475 3351407 3325307 3289134 3244106 3190934 3129021 3057819
50533 3057819 2978254 2892019 2800200 2703813 2605327 2508182 2414491 2324230 2236936 2153139 2073691
50522 2073691 1998713 1928049 1862160 1801841 1747419 1698822 1655992 1618578 1585494 1555504 1528348
50511 1528348 1504840 1485983 1472255 1463551 1459211 1458134 1459407 1463058 1470002 1481070 1496265 1514920
50499 1514920 1536354 1560184 1586146 1613812 1642654 1672502 1703925 1737946 1775222 1815509 1857963
50488 1857963 1901860 1947026 1993670 2041793 2090616 2138704 2185103 2230437 2276597 2325268 2377104
50477 2377104 2432205 2490570 2551787 2615204 2681211 2751904 2829720 2915853 3010595 3114376 3227031
50466 3227031 3346401 3469624 3596430 3729737 3871954 4021631 4174659 4327771 4479621
50457 4479621 4629084 4774228 4913063 5043873 5164082 5269679 5356674 5423097 5469226 5495890
50447 5495890 5502783 5488463 5452015 5394664 5319525 5229818 5127893 5016335 4899400 4782479 4670257
50436 4670257 4565937 4471884 4390027 4321547 4266963 4226663 4200713 4187995 4186262 4193087 4205980
50425 4205980 4221427 4234782 4241537 4237936 4220153 4184193 4127721 4051437 3957721 3848466 3725088
50414 3725088 3590147 3447772 3302319 3157271 3015242 2878136 2747082 2622606 2504948
50405 2504948 2394169 2290493 2195011 2109392 2034042 1967048 1905993 1850539 1802091 1761167 1726472
50394 1726472 1696735 1672074 1652936 1638812 1628875 1623235 1622729 1627789 1637935 1652088 1669069 1688269
50382 1688269 1710129 1735518 1764377 1795498 1827887 1861622 1897050 1933884 1971743 2010830 2051130
50371 2051130 2091345 2129624 2165506 2200561 2236845 2274773 2312250 2345822 2373364 2396159 2417991
50360 2417991 2441683 2466796 2491070 2513480 2535182 2558036 2583249 2611260 2641901 2674527 2708838
50349 2708838 2745816 2787202 2833769 2884639 2938320 2993703 3049735 3104927 3157853 3207714 3253881
50338 3253881 3295194 3330349 3358762 3380205 3393354 3395324 3383328 3356694 3316876 3265618 3203714
50327 3203714 3131769 3051530 2965754 2876901 2786512 2695899 2606926 2521971 2443484 2373585 2313497
50316 2313497 2263204 2222105 2190186 2168045 2155535 2150917 2151650 2155499 2160676 2165565 2168809 2169123 2164561
50303 2164561 2152570 2131401 2101134 2063015 2018486 1969264 1917340 1863858 1808686 1752146 1696465
50292 1696465 1644106 1595094 1547565 1500962 1457123 1417927 1383240 1351829 1323134 1297353 1274500
50281 1274500 1254103 1235579 1218660 1203819 1192144 1184103 1178608 1174244 1171281 1171185 1174148 1178648 1183813
50268 1183813 1190469 1199018 1208097 1216794 1226786 1240363 1257137 1274553 1291301 1308442 1327285 1347874
50256 1347874 1369867 1393308 1417827 1442128 1465048 1486539 1507089 1526662 1544588 1560192 1573416
50245 1573416 1585100 1596472 1607807 1617839 1625242 1630480 1635140 1639545 1642288 1642389 1640589 1637837 1633637
50232 1633637 1626905 1617660 1606761 1594536 1580802 1565963 1550916 1535719 1519233 1500416 1479481 1457576
50220 1457576 1435728 1414260 1392829 1370931 1348564 1326471 1305538 1286019 1267503 1249419 1231288
50209 1231288 1212900 1194832 1178574 1165328 1154659 1145074 1135961 1128039 1121588 1115267 1107632 1099202 1092059
50196 1092059 1087586 1085403 1084370 1083617 1082417 1079993 1076151 1071693 1067683 1064392 1061167 1057038 1051260 1043687
50182 1043687 1035088 1026798 1019549 1012783 1005534 997828 990575 984103 977600 970417 963363 957906 954310 951268
50168 951268 947610 943710 940855 939699 939887 940854 942135 942955 942521 941223 940811 942618 945963 949065 951238
50153 951238 953341 956109 958962 960682 960633 959048 956692 954432 952608 950565 947232 942222 935768 927712 917675
50138 917675 906486 896174 887692 879694 870610 861116 853344 848169 844468 840726 836236 830990 825617 821312
50124 821312 818721 816852 814030 809797 804970 800166 795529 791639 789063 786915 783469 778645 774363 771885
50110 771885 770226 767885 764821 761915 759816 759118 760322 762459 762952 760158 754966 748673 740415 728436
50096 728436 713224 697625 684086 673122 664078 655911 647450 638351 629783 622954 617220 611037 604540
50083 604540 599583 597155 596418 596488 597428 598906 599565 598767 597758 598069 599704 601835 604272 607140 609805 611398
50067 611398 612113 613034 614912 617946 622556 629314 637989 647390 656526 665506 675036 685336 695865 706094
50053 706094 716279 727262 739462 752304 764856 776800 788472 800159 811798 823317 834740
50042 834740 845951 856837 867697 879062 890987 902930 914328 924820 933893 940967 946056 949916
50030 949916 953350 956706 960065 963352 966196 968273 970006 972443 976245 981202 986832 992919 999410 1006457
50016 1006457 1014678 1024837 1037073 1051069 1066956 1085154 1105079 1125003 1143836 1162363 1182156
50005 1182156 1203865 1227062 1251056 1275131 1298532 1320890 1342348 1362804 1381495 1397829 1412072
49994 1412072 1424653 1435328 1443653 1449831 1454409 1457556 1459242 1459666 1458787 1455861 1450130 1441708 1431180 1418807
49980 1418807 1404802 1389905 1374801 1359221 1342452 1324554 1306332 1288393 1270959 1254442 1239388
49969 1239388 1225944 1214023 1203838 1195592 1188874 1182994 1177696 1172879 1167959 1162329 1156160 1149955 1143686
49956 1143686 1137347 1131928 1128609 1127073 1125819 1124050 1122013 1119540 1115716 1110382 1104553 1098804 1092462 1085097
49942 1085097 1077590 1070750 1063796 1055306 1045138 1034472 1024281 1014576 1005054 995828 987525 980894 976218
49929 976218 973148 971545 972373 976942 984955 994183 1002538 1009850 1017180 1025209 1033947 1043251 1052683 1061263
49915 1061263 1068269 1074220 1080413 1087547 1095108 1101875 1106810 1109816 1111956 1114544 1117733 1120415 1121554 1120719
49901 1120719 1116944 1108261 1093401 1073295 1049904 1024155 996041 966123 935598 905097 874734 845344
49889 845344 818393 794378 772264 750939 730481 711665 694874 679818 665925 652785 640557
49878 640557 629920 621216 613849 607106 601302 597226 594534 591740 588079 584528 582640 583017 585194 588266
49864 588266 591225 593281 594300 594481 593549 590988 587330 584312 583160 583374 583818 584405 585955 588769 592164
49849 592164 595313 598009 600592 603419 606316 608386 608690 607292 605231 603278 601283 599068 597222 596350 596027
49834 596027 595355 594319 593900 594956 597619 601607 606529 611962 617801 624534 632676 642085 652278 663162
49820 663162 674783 686511 697348 707269 717601 729787 744150 759951 776271 792903 810914 832237
49808 832237 857963 886865 916303 944752 972783 1001391 1030342 1058689 1086061 1112546 1137939
49797 1137939 1162154 1186084 1210924 1236398 1260609 1282100 1301474 1320480 1339802 1358301 1374225
49786 1374225 1386491 1394489 1397103 1392737 1380722 1362386 1340161 1315601 1288711 1259261 1228002 1195951
49774 1195951 1163008 1128241 1091744 1055367 1021066 988877 957146 924772 892815 863716 839159
49763 839159 818862 801201 784570 768010 750965 733162 715051 698081 683955 673423 665872 660116
49751 660116 655309 650978 646537 641312 635182 628810 622918 617511 612123 606664 601574 597125 593102 589317
49737 589317 585957 583112 580402 577534 574894 573047 571919 570921 569658 567886 565125 561221 557193 554587
49723 554587 553765 553706 553677 554078 555256 556454 556654 555765 554352 552934 552201 553120 555834 559069 561516 563323 565368
49706 565368 567729 570031 572702 576511 581240 586180 591646 598376 605526 611221 615519 621023 629744 640841
49692 640841 652421 664142 676915 691264 707382 725873 746976 769540 792037 814233 836794
49681 836794 859671 882019 903422 924086 944053 963273 982270 1001644 1020967 1039028 1055080
49670 1055080 1069014 1080752 1090609 1100038 1110559 1121752 1131504 1138462 1143010 1145407 1144242 1137542 1124698
49657 1124698 1106669 1084921 1060763 1035178 1008727 981835 955396 930566 907828 886818 867285
49646 867285 849562 833818 819650 806817 795736 786722 779322 772813 766821 761112 755474 750196 745994
49633 745994 742893 739889 736372 733298 732209 733536 736396 739546 741936 742936 742925 743234 744725 746775 748390
49618 748390 749882 752368 755879 759043 760814 761664 762780 764655 766744 768238 769115 770506 773667 778335 782613
49603 782613 784948 785626 785696 785306 784265 783665 785291 789272 793751 797179 799767 802317 804835 806879 808095
49588 808095 807685 804565 799149 794115 792012 792442 792722 791148 788423 785928 783988 782327 781141 780686 780374
49573 780374 779382 778128 778092 779750 781480 781368 779636 778378 778959 780777 782796 785036 787703 789966 791061
49558 791061 792174 795635 802145 810132 818112 826261 835073 843882 851924 859887 868946 878737 887798 896138
49544 896138 905943 919071 934749 950561 965252 979664 995105 1011725 1028940 1046712 1065476 1084929
49532 1084929 1103935 1122173 1141096 1162454 1186217 1210852 1235470 1260713 1287563 1316355 1347304
49521 1347304 1380933 1417275 1455374 1494339 1534460 1576671 1621305 1668101 1717096 1768752 1823214
49510 1823214 1880034 1938658 1998804 2060473 2123926 2189582 2257695 2328245 2401229 2476715 2554467
49499 2554467 2634096 2715849 2800512 2887925 2976207 3063307 3148953 3234176 3319211 3402819 3483637
49488 3483637 3561202 3635391 3705534 3770343 3828354 3878310 3919506 3951775 3974986 3988962 3994276
49477 3994276 3992536 3985043 3971577 3951565 3926093 3897480 3866901 3833864 3798330 3762017 3727084 3694745
49465 3694745 3665856 3641564 3622285 3606876 3594048 3584078 3578198 3576894 3579984 3587981 3601999 3622207
49453 3622207 3647389 3676267 3708390 3743453 3780612 3819085 3859109 3901743 3947580 3995700 4043877
49442 4043877 4089893 4132767 4172581 4209164 4241347 4267720 4287594 4300744 4306482 4303486 4290319 4265863
49430 4265863 4229625 4182142 4124659 4057989 3982246 3898345 3809017 3717051 3622788 3524646 3422183
49419 3422183 3317391 3212765 3109506 3008176 2909717 2814620 2721982 2630792 2541921 2457682
49409 2457682 2379357 2305916 2235321 2166542 2100164 2037499 1979318 1925244 1874334 1826181 1781089
49398 1781089 1739027 1699108 1660773 1625030 1593534 1566415 1541843 1517978 1494670 1473030 1453920
49387 1453920 1437262 1422221 1407457 1391594 1374238 1356672 1341028 1328564 1318785 1310255 1301953 1293791
49375 1293791 1286246 1279898 1275315 1272942 1272832 1274560 1277495 1281135 1285139 1289345 1294029 1299994 1308022 1318278
49361 1318278 1330525 1344668 1360409 1376469 1391112 1403929 1416350 1429725 1443458 1455785 1465850
49350 1465850 1474080 1480988 1487070 1493852 1503432 1516116 1529588 1541500 1552351 1564831 1580678 1599129
49338 1599129 1618337 1637345 1656392 1675993 1696139 1716138 1735147 1753096 1771132 1790670 1811805
49327 1811805 1832930 1852141 1868830 1883780 1898080 1912359 1926985 1942560 1959712 1978396 1997600
49316 1997600 2016070 2033353 2050066 2067263 2085819 2106391 2129389 2154590 2180992 2207412 2233300
49305 2233300 2259014 2285746 2315299 2349154 2387005 2426524 2465567 2504658 2546534 2593051 2643316
49294 2643316 2695136 2747480 2800915 2856292 2913972 2974146 3037109 3103017 3171929 3244205 3320402
49283 3320402 3400546 3483856 3569589 3658049 3750421 3847532 3948913 4053272 4159890 4269325
49273 4269325 4382472 4499055 4617569 4736922 4857735 4981505 5108744 5238517 5369696
49264 5369696 5501926 5635099 5768688 5902329 6036589 6172198 6308337 6442498 6572437
49255 6572437 6697694 6818639 6934423 7042584 7140609 7227282 7302524 7366479 7418975 7459363
49245 7459363 7486764 7500985 7503404 7496363 7481281 7457894 7425767 7385989 7340912 7292899 7244188 7197238
49233 7197238 7153787 7113571 7075264 7039045 7007198 6981764 6962662 6948797 6940078 6937430 6941388 6951663
49221 6951663 6967779 6989342 7015897 7047197 7083464 7124682 7169830 7217418 7266654 7317473 7369532
49210 7369532 7421826 7473167 7522338 7567821 7607990 7641551 7667240 7683258 7687926 7680993 7663385 7635458
49198 7635458 7596392 7545657 7484082 7412684 7331190 7238761 7136011 7025551 6910417 6792438
49188 6792438 6672051 6549248 6424539 6299214 6174774 6052132 5931586 5813598 5699262
49179 5699262 5589752 5485653 5386924 5293129 5203489 5117283 5034675 4956655 4883688 4814945 4749569
49168 4749569 4688105 4631635 4579778 4530837 4484076 4440688 4401953 4367417 4335546 4305459 4277251
49157 4277251 4251229 4227690 4207044 4189261 4173303 4157848 4142467 4127406 4112341 4096280 4078819
49146 4078819 4060699 4042763 4025063 4007292 3989454 3971594 3953452 3935051 3917279 3901159 3886649
49135 3886649 3872780 3859070 3846265 3835541 3827175 3820235 3813571 3807104 3802010 3799405 3798952 3799304 3799873 3801345
49121 3801345 3804157 3807525 3810926 3815629 3823312 3833555 3844277 3854667 3866028 3879319 3893517 3907486
49109 3907486 3922185 3939770 3961287 3986401 4014652 4045654 4078578 4112873 4149325 4189183 4232333
49098 4232333 4277567 4324602 4374450 4427608 4483203 4540423 4599611 4661254 4724832 4789405 4854587
49087 4854587 4920257 4986083 5052129 5119273 5188110 5257771 5326549 5393326 5457625 5518767 5576128
49076 5576128 5630298 5683057 5735774 5788270 5839404 5888342 5935017 5979719 6022653 6063930 6103786
49065 6103786 6142468 6179693 6214472 6246103 6275379 6304145 6333323 6361983 6388752 6413475 6436782
49054 6436782 6458681 6478575 6496520 6513613 6531086 6549574 6569098 6589025 6608219 6626060 6643324
49043 6643324 6661304 6680092 6698685 6716807 6735469 6755300 6775488 6795062 6814294 6833838 6853206
49032 6853206 6871314 6888239 6905255 6923027 6940787 6957721 6974422 6992373 7012214 7032994 7053102
49021 7053102 7071820 7089918 7108668 7128331 7147917 7166604 7184933 7204042 7224057 7244078 7263705
49010 7263705 7283456 7303207 7321192 7335563 7346580 7356214 7365668 7374304 7381175 7386513 7390964 7394034 7394311
48997 7394311 7390943 7384089 7373995 7360567 7344044 7325195 7304327 7280772 7254008 7224724 7194021 7161988
48985 7161988 7128076 7092776 7057808 7024200 6990985 6956454 6920240 6883661 6848431 6815641 6785575
48974 6785575 6757634 6730415 6702614 6674164 6646243 6620222 6596933 6576801 6559892 6545593 6532900
48963 6532900 6521459 6511956 6505217 6501364 6500054 6500890 6503130 6505719 6508417 6512349 6518541 6526295 6534087 6541683
48949 6541683 6550030 6559049 6567131 6573258 6578105 6582243 6584645 6584160 6581272 6576917 6570408 6560232 6546444 6530592
48935 6530592 6513420 6494247 6472494 6448075 6420196 6387833 6352079 6316183 6282017 6247882 6210891
48924 6210891 6170253 6126980 6081725 6034585 5986248 5937394 5887309 5834625 5779294 5722454 5664619
48913 5664619 5605491 5545473 5485747 5426632 5367353 5307839 5249349 5192851 5138063 5084752 5033694
48902 5033694 4985492 4939475 4894770 4851830 4812090 4776699 4746169 4720454 4698510 4678566 4659904
48891 4659904 4643935 4632574 4626038 4623264 4624012 4629198 4639149 4652831 4669102 4687690 4708519 4730982
48879 4730982 4754565 4779569 4806579 4835592 4866210 4898398 4932443 4968324 5005627 5044042 5083524
48868 5083524 5123927 5164922 5206419 5248704 5291963 5336023 5380844 5427039 5475484 5526473 5579598
48857 5579598 5634295 5690067 5746307 5802796 5860636 5921861 5987385 6055815 6124933 6193930 6263378
48846 6263378 6333585 6404239 6475581 6548563 6623354 6698678 6773088 6846011 6917090 6985528 7050940
48835 7050940 7114063 7175693 7235333 7291682 7343998 7392197 7436072 7475351 7510265 7541186 7567858
48824 7567858 7589687 7606483 7618121 7623895 7623332 7617556 7608654 7597448 7582866 7563681 7539823 7511671
48812 7511671 7479212 7442596 7402620 7359831 7313702 7263480 7209383 7152299 7092680 7030510 6966106
48801 6966106 6900211 6833256 6765103 6695550 6624705 6552898 6480584 6408271 6336274 6264755 6194337
48790 6194337 6126330 6061723 6000085 5940220 5882018 5826996 5776715 5731214 5689375 5650319 5613886
48779 5613886 5580103 5548946 5520754 5496373 5476558 5461419 5450510 5443169 5438629 5436184 5435771 5438305
48767 5438305 5444979 5455998 5470204 5486099 5503013 5521139 5540784 5562038 5585085 5610280 5637675
48756 5637675 5666707 5696562 5726605 5756214 5784596 5811326 5837095 5863369 5891070 5920026 5949865
48745 5949865 5980915 6013615 6047363 6080709 6112719 6143517 6173518 6202994 6232650 6263615 6296121
48734 6296121 6328844 6360500 6391693 6424237 6458894 6494763 6530730 6566394 6601545 6635935 6669908
48723 6669908 6704125 6738224 6770911 6801974 6832945 6864753 6895829 6923855 6948575 6971332 6992322
48712 6992322 7010090 7023765 7034162 7042180 7047326 7048468 7045044 7036862 7023404 7003939 6977908 6944996
48700 6944996 6905446 6860600 6812346 6761571 6707806 6650753 6591278 6530294 6467586 6402794 6336965
48689 6336965 6271849 6207794 6143543 6078387 6013663 5951667 5893631 5839236 5787647 5738473 5691972
48678 5691972 5648961 5610634 5577972 5550883 5528072 5508086 5490557 5476309 5466420 5461609 5462374 5468976
48666 5468976 5480889 5496903 5516227 5538929 5564700 5592016 5619615 5648315 5679940 5714466 5749658
48655 5749658 5783861 5817748 5852686 5888658 5924730 5960516 5995949 6030280 6062516 6092650 6121500
48644 6121500 6149509 6176406 6201836 6225643 6247779 6268548 6288633 6308335 6327270 6345554 6364720
48633 6364720 6386430 6410630 6436000 6461938 6488945 6517262 6546472 6576650 6608729 6643401 6680647
48622 6680647 6720695 6764450 6812565 6864920 6921413 6982342 7047574 7116333 7188491 7265238 7347751
48611 7347751 7435896 7528881 7626370 7728033 7832672 7939043 8047223 8158059 8271249 8384953
48601 8384953 8497416 8608087 8716822 8822668 8923791 9018130 9103812 9179351 9243792 9296460
48591 9296460 9336189 9360909 9368342 9357322 9328416 9283186 9222813 9147590 9057897 8955316 8842228
48580 8842228 8720224 8589604 8450792 8305581 8156353 8004463 7850194 7694201 7538232
48571 7538232 7384259 7233491 7086469 6943635 6805466 6672342 6544473 6421904 6304487
48562 6304487 6192042 6084579 5982250 5885231 5793927 5709084 5631046 5558788 5490246 5423993 5360303
48551 5360303 5300284 5244275 5191384 5140327 5090431 5042023 4996339 4954925 4918531 4886198 4855525
48540 4855525 4824134 4791075 4756975 4722877 4688984 4654605 4619300 4583800 4549489 4517010 4485749
48529 4485749 4454845 4424395 4395272 4367858 4341256 4313946 4285255 4256148 4228412 4202973 4179238
48518 4179238 4156317 4134513 4114971 4098000 4082635 4068052 4054390 4041639 4028804 4015351 4002793
48507 4002793 3993302 3986843 3981227 3975326 3970690 3969139 3970017 3971167 3971778 3972705 3974264 3975344 3975122 3974469 3974980
48492 3974980 3977320 3981182 3986358 3993217 4002310 4013944 4027972 4043651 4059933 4076283 4093107 4111142
48480 4111142 4130552 4150958 4172216 4194740 4218921 4244322 4269567 4293169 4314775 4335549 4356952
48469 4356952 4379032 4400444 4420487 4440423 4461975 4484849 4506856 4526694 4545618 4565839 4588006
48458 4588006 4611097 4634178 4657225 4680245 4702747 4724650 4746942 4770646 4795442 4820007 4843613
48447 4843613 4866778 4890416 4915132 4941571 4970765 5003430 5039186 5076930 5115782 5155366 5195628
48436 5195628 5237081 5281137 5329415 5382523 5439865 5500644 5564546 5631488 5701479 5775121 5853626
48425 5853626 5937928 6028031 6123368 6223179 6326215 6430880 6536428 6643497 6752597 6862319
48415 6862319 6969916 7073542 7173059 7268613 7359274 7443317 7519098 7585315 7641022 7685886 7720128
48404 7720128 7743988 7757508 7760814 7754052 7736987 7709531 7673074 7630517 7584276 7534772 7481567 7425318
48392 7425318 7367417 7308005 7245784 7180158 7112353 7043566 6972804 6897679 6817090 6732104 6644091
48381 6644091 6552829 6456891 6355279 6248195 6136529 6021299 5903647 5785006 5667028 5551345
48371 5551345 5439179 5330990 5226737 5126906 5033063 4946790 4868074 4795325 4727142 4663335 4603915
48360 4603915 4548057 4495141 4446390 4404147 4369267 4340106 4314436 4291516 4271656 4254492 4238783
48349 4238783 4223853 4210288 4198974 4190062 4183263 4178630 4176434 4176466 4178077 4180987 4185524 4191846 4199407 4207683
48335 4207683 4217056 4228397 4241851 4256691 4272428 4289360 4307692 4326731 4345587 4364438 4384584
48324 4384584 4407197 4432186 4458125 4483115 4505962 4526779 4546365 4565201 4583580 4602541 4623388
48313 4623388 4645655 4666686 4684295 4699186 4713535 4727986 4741614 4754327 4767212 4780290 4792087
48302 4792087 4802348 4813372 4827211 4842760 4857275 4870184 4883782 4900264 4919408 4939410 4958877
48291 4958877 4977520 4995457 5012533 5028496 5043819 5060027 5078691 5100040 5123022 5146776 5171240
48280 5171240 5196148 5220523 5243920 5267416 5292461 5319222 5346762 5374235 5401109 5426909 5451901
48269 5451901 5477682 5505877 5536274 5567146 5597354 5627242 5657505 5688078 5718346 5747845 5776702
48258 5776702 5805738 5835768 5866314 5895585 5922578 5948490 5974971 6001629 6026643 6049321 6070290
48247 6070290 6089416 6105704 6119535 6132912 6146675 6159314 6169607 6178653 6187884 6196534 6202897 6207251
48235 6207251 6211765 6217926 6225482 6233687 6242198 6250866 6259851 6270070 6282489 6296928 6312391 6328668 6346939
48222 6346939 6368875 6395802 6428501 6466721 6508716 6552139 6596018 6641585 6690878 6744583 6801059
48211 6801059 6857164 6910243 6959728 7006733 7051879 7093864 7130382 7159801 7181248 7193588 7195349
48200 7195349 7185791 7165294 7134647 7094387 7044779 6985976 6918273 6842550 6760115 6671791 6577759
48189 6577759 6478926 6377700 6276322 6174935 6072548 5969550 5867751 5767977 5669335 5571314
48179 5571314 5475071 5381697 5290398 5199523 5108669 5018818 4930893 4845196 4762057 4682283 4606797
48168 4606797 4535967 4468935 4403502 4337413 4270263 4203649 4138952 4075540 4011712 3946843 3881838
48157 3881838 3817831 3755230 3693937 3633807 3574772 3516780 3459619 3402698 3345474 3288324 3232485
48146 3232485 3178647 3126094 3073808 3021837 2970802 2920458 2869793 2818576 2767975 2719404 2673305
48135 2673305 2629231 2586628 2545364 2505786 2468416 2433423 2400557 2369737 2341273 2314992 2289592
48124 2289592 2263592 2236930 2210991 2187140 2165799 2146810 2129840 2114362 2099954 2086778 2075096
48113 2075096 2064232 2052930 2041081 2030280 2022080 2016284 2011580 2007348 2004075 2002280 2001793 2002115 2002961 2004311
48099 2004311 2006308 2009273 2013668 2019926 2028238 2038265 2049019 2059348 2068925 2078639 2089729 2102572 2116570
48086 2116570 2131237 2147002 2164633 2183957 2203587 2222305 2240493 2259575 2279952 2300379 2319828
48075 2319828 2339159 2359923 2382104 2404423 2426632 2449762 2473641 2495907 2514716 2531341 2548790
48064 2548790 2568582 2590114 2612478 2635380 2658444 2681150 2703618 2726280 2748644 2769571 2789015
48053 2789015 2808332 2828537 2849427 2870792 2893172 2916619 2939922 2962146 2984056 3006843 3030139
48042 3030139 3052657 3074307 3096316 3119389 3143204 3167893 3194642 3224203 3255845 3288450 3321854
48031 3321854 3356353 3391630 3427195 3463690 3502831 3545777 3591906 3639287 3686157 3732106 3778146
48020 3778146 3825555 3874467 3923748 3972371 4020427 4068229 4114894 4158863 4199996 4240221 4281495
48009 4281495 4323653 4364836 4403626 4439941 4474039 4505560 4533999 4559521 4582821 4604313 4623846
47998 4623846 4641034 4655561 4667219 4676070 4682603 4687471 4690933 4692803 4693070 4692297 4691189 4689916 4688139 4685632
47984 4685632 4682628 4679531 4676554 4673668 4670604 4666761 4661478 4654773 4647655 4641313 4636019 4631186 4626452 4621940
47970 4621940 4616759 4607411 4588311 4554404 4503692 4437972 4361811 4280689 4199063 4119164 4041133 3964215
47958 3964215 3887812 3811854 3736866 3663949 3594235 3527805 3463213 3398444 3332497 3266064 3200857
47947 3200857 3138334 3078794 3021364 2965024 2909867 2857179 2808088 2762347 2718671 2676057 2634406
47936 2634406 2594156 2555816 2519724 2485750 2453275 2421994 2392644 2366266 2342620 2320015 2297071
47925 2297071 2274176 2252840 2234019 2217460 2202305 2187832 2173749 2160203 2147515 2135719 2124434
47914 2124434 2113282 2102207 2091276 2080445 2069759 2059542 2050145 2041571 2033398 2024881 2015216 2004242
47902 2004242 1993043 1983290 1975617 1968977 1961907 1953934 1945419 1936558 1927082 1916521 1904308 1890133 1874810
47889 1874810 1860272 1847932 1837403 1827539 1818185 1809802 1801789 1792585 1781569 1769588 1757264 1744002
47877 1744002 1729363 1714547 1701593 1691489 1683584 1676502 1669217 1661614 1654444 1648564 1644112 1640635 1637893
47864 1637893 1635952 1634630 1633693 1633666 1635352 1638340 1641175 1643477 1646603 1651341 1656150 1658971 1659911 1660755 1662350
47849 1662350 1663923 1664646 1664370 1662769 1659122 1653295 1646021 1638021 1629662 1621512 1614202 1607544 1600624 1592943
47835 1592943 1584724 1576181 1567495 1559527 1553301 1548464 1543488 1537880 1533029 1530230 1528951 1527872 1526674 1525900
47821 1525900 1525958 1527249 1530514 1535936 1542481 1549199 1556582 1565507 1575385 1584755 1593401 1602392 1612040 1621379
47807 1621379 1629979 1638873 1649064 1660242 1671631 1683062 1694420 1704821 1713234 1719430 1723630 1725793
47795 1725793 1726028 1725195 1724142 1722501 1718998 1712748 1703623 1691683 1677247 1661503 1645966 1630911 1615002
47782 1615002 1596878 1576627 1555324 1533654 1511556 1489042 1466880 1446384 1428572 1413375 1399560
47771 1399560 1385658 1371177 1356857 1343798 1332686 1323903 1317764 1314150 1312165 1310724 1309584 1309468 1311093
47758 1311093 1314254 1317863 1320726 1322285 1322738 1322554 1322027 1321382 1321101 1321541 1322142 1321568 1319091 1315450 1311952 1309105
47742 1309105 1306564 1304028 1301397 1298355 1294589 1290417 1286348 1281979 1276224 1268870 1261147 1254453 1249303 1245849
47728 1245849 1244391 1244645 1245357 1245694 1246542 1249393 1254251 1259732 1265233 1271918 1281332 1293917 1309325 1327372
47714 1327372 1347947 1370313 1393265 1416231 1439941 1465729 1493970 1523341 1552023 1579730 1608021
47703 1608021 1638180 1669383 1699664 1728229 1755731 1782370 1807057 1828935 1848721 1867712 1886052
47692 1886052 1902671 1916536 1927296 1935113 1940650 1945043 1949101 1952371 1953582 1952047 1948179 1942682 1935969
47679 1935969 1928617 1921599 1915246 1908230 1898482 1885446 1871050 1858206 1848634 1842265 1838109 1835071 1832205
47666 1832205 1829162 1826648 1825921 1827641 1831810 1838844 1849661 1864064 1879875 1894694 1908092 1921178 1934530
47653 1934530 1947742 1960766 1974260 1988314 2001971 2014388 2025524 2035270 2042844 2047546 2049341 2048262
$$ [...]
##END NTUPLES=NMR SPECTRUM
##END=
