
##TITLE=AC1151_Tolima_5874892_ognMuTUcEZ
##JCAMPDX= 6.0         $$ Bruker NMR JCAMP-DX V2.0
##DATA TYPE= NMR SPECTRUM
##DATA CLASS= NTUPLES
##ORIGIN= BRUKER
##OWNER= Administrator
$$ 1.72 TOPSPIN		Version 2.1
$$ 2012-03-31 21:29:35.703 -0500  Administrator@TOPSPIN
$$ Compression mode = diff/dup
##.OBSERVE FREQUENCY= 400.13188235
##.OBSERVE NUCLEUS= ^1H
##.ACQUISITION MODE= SIMULTANEOUS (DQD)
##.ACQUISITION SCHEME= undefined
##.AVERAGES= 8
##.DIGITISER RES= 22
##SPECTROMETER/DATA SYSTEM= spect
##.PULSE SEQUENCE= zg30
##.SOLVENT NAME= COFFEE_meoh
##.SHIFT REFERENCE= INTERNAL, COFFEE_meoh, 1, 14.98061
##AUDIT TRAIL= $$ (NUMBER, WHEN, WHO, WHERE, PROCESS, VERSION, WHAT)
$$ ##TITLE= Audit trail, TOPSPIN		Version 2.1
$$ ##JCAMPDX= 5.01
$$ ##ORIGIN= Bruker BioSpin GmbH
$$ ##OWNER= Administrator
$$ $$ C:\Bruker\TOPSPIN/data/COFFEE/nmr/AC1151_Tolima_5874892_ognMuTUcEZ/10/pdata/1/auditp.txt
$$ ##AUDIT TRAIL=  $$ (NUMBER, WHEN, WHO, WHERE, PROCESS, VERSION, WHAT)
(   1,<2012-03-31 21:29:26.906 -0500>,<Administrator>,<TOPSPIN>,<go>,<TOPSPIN 2.1>,
      <created by zg
	started at 2012-03-31 21:28:20.234 -0500,
	POWCHK enabled, PULCHK disabled,
       configuration hash MD5:
       1A 1E CE 29 27 FD 77 03 67 4E F0 E3 C4 B2 CB 90
       data hash MD5: 64K
       FB E7 E2 85 B1 F8 B1 92 1B D8 A3 4E 2F F4 FA A6>)
(   2,<2012-03-31 21:29:30.531 -0500>,<Administrator>,<TOPSPIN>,<proc1d>,<TOPSPIN 2.1>,
      <Start of raw data processing
       efp LB = 0 FT_mod = 6 PKNL = 1 PHC0 = 0 PHC1 = 0 SI = 32K 
       data hash MD5: 32K
       9D B1 C7 4D A5 D5 61 31 FE 71 08 EC F7 7C BF 59>)
(   3,<2012-03-31 21:29:30.921 -0500>,<Administrator>,<TOPSPIN>,<proc1d>,<TOPSPIN 2.1>,
      <pk PHC0 = 217.8479 PHC1 = 0 
       data hash MD5: 32K
       93 9B 93 48 5D 38 92 9E 1D C8 A5 F2 1D 46 10 FC>)
(   4,<2012-03-31 21:29:31.000 -0500>,<Administrator>,<TOPSPIN>,<proc1d>,<TOPSPIN 2.1>,
      <abs ABSG = 1 
       data hash MD5: 32K
       7F F1 A8 37 C0 68 C0 4D DE 93 10 1F FE 04 C3 7C>)
(   5,<2012-03-31 21:29:31.046 -0500>,<Administrator>,<TOPSPIN>,<proc1d>,<TOPSPIN 2.1>,
      <abs ABSG = 2 
       data hash MD5: 32K
       5C E3 38 31 EB 66 34 79 87 6F 24 DE 7E CF 0F 59>)
(   6,<2012-03-31 21:29:31.078 -0500>,<Administrator>,<TOPSPIN>,<proc1d>,<TOPSPIN 2.1>,
      <abs ABSG = 3 
       data hash MD5: 32K
       04 A7 C7 48 8E C6 CA FF 08 F3 8B 12 21 9D 10 64>)
(   7,<2012-03-31 21:29:31.109 -0500>,<Administrator>,<TOPSPIN>,<proc1d>,<TOPSPIN 2.1>,
      <abs ABSG = 4 
       data hash MD5: 32K
       FA 89 B5 C4 DC 70 B3 E9 DA F3 2C 92 23 B5 1F 79>)
(   8,<2012-03-31 21:29:31.140 -0500>,<Administrator>,<TOPSPIN>,<proc1d>,<TOPSPIN 2.1>,
      <abs ABSG = 5 
       data hash MD5: 32K
       28 4F 22 15 DD 10 21 DF 48 19 6A 54 7C 20 D1 95>)
$$ ##END=
$$ 
$$ $$ hash MD5
$$ $$ 01 17 5F C6 E2 EB F6 5B 15 BD F8 05 7C 42 05 94
##$RELAX= 
##$RELAX= 
##$RELAX= 
##$RELAX= 
##$RELAX= 
##$RELAX= 
##$RELAX= 
$$ Bruker specific parameters
$$ --------------------------
$$ [...]
150 150 150 150 150 150 150 150
##$TP07= 0
##$TPNAME0= <>
##$TPNAME1= <>
##$TPNAME2= <>
##$TPNAME3= <>
##$TPNAME4= <>
##$TPNAME5= <>
##$TPNAME6= <>
##$TPNAME7= <>
##$TPOAL= (0..7)
0.5 0.5 0.5 0.5 0.5 0.5 0.5 0.5
##$TPOFFS= (0..7)
0 0 0 0 0 0 0 0
##$TUNHIN= 0
##$TUNHOUT= 0
##$TUNXOUT= 0
##$USERA1= <user>
##$USERA2= <user>
##$USERA3= <user>
##$USERA4= <user>
##$USERA5= <user>
##$V9= 5
##$VALIST= <valist>
##$VCLIST= <CCCCCCCCCCCCCCC>
##$VD= 0
##$VDLIST= <DDDDDDDDDDDDDDD>
##$VPLIST= <PPPPPPPPPPPPPPP>
##$VTLIST= <TTTTTTTTTTTTTTT>
##$WBST= 2048
##$WBSW= 25
##$XGAIN= (0..3)
0 0 0 0
##$XL= 0
##$YL= 0
##$YMAX_a= 534403
##$YMIN_a= -626978
##$ZGOPTNS= <>
##$ZL1= 120
##$ZL2= 120
##$ZL3= 120
##$ZL4= 120
##$ABSF1= 14.98061
##$ABSF2= -5.57192
##$ABSG= 5
##$ABSL= 3
##$ALPHA= 0
##$AQORDER= 0
##$ASSFAC= 0
##$ASSFACI= 0
##$ASSFACX= 0
##$ASSWID= 0
##$AUNMP= <proc_prof1d_extract_pilot.lims>
##$AXLEFT= 0
##$AXNAME= <>
##$AXNUC= <1H>
##$AXRIGHT= 0
##$AXTYPE= 0
##$AXUNIT= <>
##$AZFE= 0.1
##$AZFW= 0.1
##$BCFW= 0
##$BC_mod= 0
##$BYTORDP= 0
##$COROFFS= 0
##$CY= 15
##$DATMOD= 1
##$DC= 0
##$DFILT= <>
##$DTYPP= 0
##$F1P= 0
##$F2P= 0
##$FCOR= 0.5
##$FTSIZE= 32768
##$FT_mod= 6
##$GAMMA= 0
##$GB= 0
##$INTBC= 1
##$INTSCL= 1
##$ISEN= 128
##$LB= 0
##$LEV0= 0
##$LPBIN= 0
##$MAXI= 10000
##$MC2= 0
##$MEAN= 0
##$ME_mod= 0
##$MI= 0
##$NCOEF= 0
##$NC_proc= -8
##$NLEV= 6
##$NOISF1= 0
##$NOISF2= 0
##$NSP= 0
##$NTH_PI= 0
##$NZP= 0
##$OFFSET= 14.98061
##$PC= 1
##$PHC0= 217.8479
##$PHC1= 0
##$PH_mod= 1
##$PKNL= yes
##$PPARMOD= 0
##$PPDIAG= 0
##$PPIPTYP= 0
##$PPMPNUM= 2147483647
##$PPRESOL= 1
##$PSCAL= 4
##$PSIGN= 0
##$PYNMP= <proc.py>
##$REVERSE= no
##$SF= 400.13
##$SI= 32768
##$SIGF1= 0
##$SIGF2= 0
##$SINO= 400
##$SIOLD= 32768
##$SPECTYP= <>
##$SREGLST= <1H.CDCl3>
##$SSB= 0
##$STSI= 32768
##$STSR= 0
##$SW_p= 8223.68421052632
##$SYMM= 0
##$S_DEV= 0
##$TDeff= 65536
##$TDoff= 0
##$TI= <>
##$TILT= no
##$TM1= 0
##$TM2= 0
##$TOPLEV= 0
##$USERP1= <user>
##$USERP2= <user>
##$USERP3= <user>
##$USERP4= <user>
##$USERP5= <user>
##$WDW= 1
##$XDIM= 32768
##$YMAX_p= 474241805
##$YMIN_p= -784461
##$CURPLOT= <Network HP LaserJet P1505>
##$CURPRIN= <$Network HP LaserJet P1505>
##$DFORMAT= <normdp>
##$LAYOUT= <+/1D_H.xwp>
##$LFORMAT= <normlp>
##$PFORMAT= <normpl>
##$SURQMSG= 1
$$ End of Bruker specific parameters
$$ ---------------------------------
##NTUPLES= NMR SPECTRUM
##VAR_NAME=  FREQUENCY,     SPECTRUM/REAL,   SPECTRUM/IMAG
##SYMBOL=    X,             R,               I
##VAR_TYPE=  INDEPENDENT,   DEPENDENT,       DEPENDENT
##VAR_FORM=  AFFN,          ASDF,            ASDF
##VAR_DIM=   32768,         32768,           32768
##UNITS=     HZ,            ARBITRARY UNITS, ARBITRARY UNITS
##FACTOR=    0.250966925370066, 1,           1
##FIRST=     8223.43324360095, -175414,      -207219
##LAST=      0,             6230,            -62557
##MIN=       0,             -784461,         0
##MAX=       8223.43324360095, 474241805,    0
$$ Real data points
##PAGE= N=1
##DATA TABLE= (X++(R..R)), XYDATA
$$ [...]
19475b47476j46618J94017A54851c921j72892O8073B63659B91b33943c6870B48771
19463g2849r8707A46097K13277H1985b29283k94865a03942j8663A9100b92372
19452i538A05738a079H0825a78423L847C9649c00404A08488b48211a2650A50746
19440c9753A79593d44332B4120J5527b05362C7525i1556F7479b62162A96107a63495
19428A28435k7175c85228O164A65938L5209b6401p0577j09456g3730A06322c1398
19416A07264a54416B94026a62787k16381C01355a6047A682c04210B23232a13434
19405g9009K628b5330j47610N676C79819I0896a04166k58447L822C28509f621
19393i237B54011j16304i8941j14089F0533h2249n8968K124N1889K8774B14099
$$ y = [-247476, -394094, -200077, 154851, -3921, -176813, -108740, 263659, 291, -233943, -36870, 248771, -72849, -171556, 146097, 359374, 81985, -229283, -524148, -103942, -122605, 19100, -292372, -9538, 105738, -1079, 80825, -178423, -174576, 39649, -300404, 108488, -248211, -12650, 150746, -39753, 179593, -444332, 24120, 39647, -205362, 37525, -91556, 67479, -262162, 196107, -163495, 128435, 101260, -385228, -379064, 165938, 201147, -26401, -96978, -206434, -73730, 106322, -31398, 107264, -154416, 294026, -162787, -379168, 301355, -16047, 1682, -304210, 223232, -113434, -79009, -76381, -25330, -172940, -167264, 379819, 90896, -104166, -362613, -358791, 328509, -6621, -9237, 254011, 137707, -98941, -213030, 60533, -82249, -141217, -139093, -87204, -58430, 214099]
19381h4582q9100B4321j2042M0246c07913k533B8754K19991a93619J1411B62103
19369b80820A6150c7218k11070J17279A55105a86970A56030a12116k39755a04618
19358b77612i1589m60585a38317a0781j28011a476q7520q2544J2610B3180g5597
19346b05332R2823K0264A44829b07410l7643h1161J0437B61713f2308p8310n8185
19335a98803C1445a63228E1692d03011a11406o9853h6469q0218P2693j73731e9069
19323A93922F9826a35518o4389P1457e7230C57523a17510k7513a6088j06462B57217
19311a92241k05739g5345G2577L020h5299K1790E8244i7431l21404C5588b63309
19299d3683l1127A85119J39128a03308L9206b2543k46793O6734D2574j8260K09164
$$ y = [-84582, -173682, 24321, 12279, 52525, -307913, -310446, 28754, 248745, -193619, -182208, 262103, -280820, 16150, -37218, -248288, -131009, 155105, -186970, 156030, -112116, -351871, -104618, -277612, -91589, -552174, -138317, -10781, -138792, -1476, -88996, -171540, -158930, 23180, -75597, -205332, -112509, -92245, 144829, -207410, -245053, -81161, -70724, 261713, -62308, -140618, -198803, 31445, -163228, 51692, -403011, -111406, -181259, -86469, -166687, -93994, -267725, -59069, 193922, 69826, -135518, -199907, -128450, -57230, 357523, -117510, -145023, -16088, -122550, 257217, -192241, -397980, -75345, 72577, 75597, -85299, -63509, 58244, -97431, -418835, 35588, -263309, -43683, -74810, 185119, 324247, -103308, -64102, -22543, -269336, -202602, 42574, 24314, 233478]
19288B33478e5546B24551b15770L7444A388i2697p946A47897m6188b72715E3229
19276b8707j59142N690M9972M1969E3875a00848Q156A18563D9073a63295a9563
19264a90444B2368a28145M189A54021a64963c5775B9474j3285e8795j32848A61217
19252a58167A22578b21167A22952h7747j03692f286B79385a64556j57554e9302
19241g6868J6216k12738i3298j27604B20817c84503J12451O6073j2456A57963
19230b40161A6791f1681b2342r7359r0914B37154a97300j74658E0819a41329d824
19218a9695n0385k73083a21773k63038J23266C28897c86595d8930A09214m6835
19208F2379a17013j26523B8213b37272B10127m8915b42083J15247e5236A25373
$$ y = [233478, -55546, 224551, -215770, -178326, 1388, -92697, -100643, 147897, 101709, -272715, 53229, -28707, -187849, -182159, -132187, -90218, 53875, -100848, -92692, 118563, 49073, -163295, -19563, -190444, 22368, -128145, -123956, 154021, -164963, -35775, 29474, 16189, -58795, -191643, 161217, -158167, 122578, -221167, 122952, -87747, -191439, -6286, 279385, -164556, -322110, -59302, -76868, -60652, -273390, -93298, -220902, 220817, -384503, -272052, -205979, -218435, 157963, -240161, 16791, -61681, -22342, -119701, -210615, 237154, -197300, -371958, 50819, -141329, -4824, -19695, -70080, -343163, -121773, -384811, -261545, 328897, -386595, -48930, 109214, 62379, -117013, -243536, 28213, -237272, 210127, 161212, -242083, -126836, -55236, 125373]
19197c66136A74034q2409a36128d2022r2651b5889A48745c51689J10829O3009
19187a77851F3924b27797A12282C8503J06590a15847C9060a45131e0897r8850
19177a49747e5919B179a44976K6078A21352N8332G0183d3008q9313j29524C530
19165f46831C9361c3966A17666b45872J9282q0937a29495E1800d9620P808p2771
19154a14583k1183A7414J06766h4219F1627P1214R2341G4269K74574i6195r5803
19143a91998E0905J82410G1746a98145d4051j53820e9868B34705g6004C6252M2693
19132G8945a62978H5047C4098a26716A03391J5688F319L3309c0466A55117c5845
19120d9291j01476E3428J22701a81718b1539o6124j14307e4893I4200g736j22890
$$ y = [-366136, 174034, 91625, -136128, -42022, -134673, -25889, 148745, -351689, -240860, -177851, 63924, -227797, 112282, 38503, 145093, -115847, 39060, -145131, -50897, -149747, -55919, 2179, -144976, -118898, 121352, 179684, 70183, -43008, -132321, -261845, 3530, -646831, 39361, -33966, 117666, -245872, -226590, -307527, -129495, 51800, -49620, -41812, -114583, -135766, 17414, 124180, -84219, 61627, 132841, 225182, 74269, 348843, -96195, -191998, 50905, 233315, 71746, -198145, -44051, -197871, -59868, 234705, -76004, 36252, 78945, -162978, 85047, 34098, -126716, 103391, 119079, 6319, 39628, -30466, 155117, -35845, -49291, -150767, 53428, 176129, -181718, -21539, -87663, -201970, -54893, 94200, -7736, -130626]
19109a30626j49150g7795a2680D3691J14775M2301H5143b9279A4776b21729B61790
19097c33241G6188a92785q2749I5668a19307o365c5640j05914a9831E4964b2123
19085b50348b3400A55364i4102B32634g0739m1903p2720a1730G6529b58854a23740
19073B48032A01833f4511A12323B0588O2744e8006l7274F6137Q6359C6011b98525
19061c8070A59667a40813m684k1366a3646m7138j03824f5705l5206a3007k3722
19050c6729l98192d0001n7954B62461A2160c05811J51554G0640b94574A90570
19039a64750C3743f2028C2816J67002c8577H8325i6881c8973k04109f2917C3998
19027a7753l42716E4615c2427n9898d843j58793j15269A44933b31677f5294j78713
$$ y = [-130626, -279776, -77795, -12680, 43691, 158466, 200767, 85143, -29279, 14776, -221729, 261790, -333241, 76188, -192785, -275534, 95668, -119307, -125672, -35640, -141554, -19831, 54964, -22123, -250348, -23400, 155364, -94102, 232634, -70739, -112642, -185362, -11730, 76529, -258854, -123740, 248032, 101833, -64511, 112323, 20588, 83332, -58006, -95280, 66137, 152496, 36011, -298525, -38070, 159667, -140813, -145497, -166863, -13646, -60784, -164608, -65705, -100911, -13007, -36729, -434921, -40001, -97955, 262461, 12160, -305811, -154257, 70640, -294574, 190570, -164750, 33743, -62028, 32816, 199818, -38577, 88325, -96881, -38973, -243082, -62917, 33998, -17753, -360469, 54615, -32427, -92325, -4843, -163636, -278905, 144933, -231677, -65294, -244007]
19016b44007C0125M08537j75321a35270B07983n2611L8101m2605a36352f0880
19005D6503a16340k34573G2768a45808C69883i0207j19437f3715k2802B7671e6644
18993A35017g6263b8039j96434c3813j26387B04647h7636I7540J13536l5829b07416
18981D9434b13133J00622n7162j07306j05109A16487J80505b76348E8680a46118
18970B09532A0661d74719K36204c1183j26895k13259B0418a49065I1017C1872
18959C13466I1599J47700J25231j35059J32687a4487A27690j3197J65562a97868
18948C5580b46612a03369D2773P8934g7381A68239e6766E8093b07686D283b46635
18936a05057J9456A02298a36409O6269p0304N2474d2040j5149k80642K2510A46708
$$ y = [-244007, 30125, 438662, 263341, -135270, 207983, 155372, 193473, 150868, -136352, -60880, 46503, -116340, -350913, 72768, -145808, 369883, -90207, -209644, -63715, -86517, 27671, -56644, 135017, -76263, -28039, -224473, -33813, -160200, 204647, -87636, 97540, 211076, 175247, -207416, 49434, -213133, -112511, -169673, -276979, -382088, 116487, 296992, -276348, 58680, -146118, 209532, 10661, -474719, -238515, -31183, -158078, -371337, 20418, -149065, 91017, 31872, 313466, 91599, 239299, 364530, 229471, 362158, -14487, 127690, 114493, 280055, -197868, 35580, -246612, -103369, 42773, 121707, -77381, 168239, -56766, 58093, -207686, 4283, -246635, -105057, -85601, 102298, -136409, -70140, -140444, -87970, -42040, -57189, -337831, -315321, 146708]
18924c43492J56682Q9326F1695a50423A81317i9265A74950C3518a36577B1389
18913a6150m06263G6122J01363a08451a2317k01531c7614J5469m03600A48024
18902E7775Q5347K0924a79579A43161b59887D10103B4607L42257K12575h933A04904
18890I6483J49159b14729A26144g6616k8972L8094A20713a44852c4126l3871A78487
18878a69866e1038k61091P2773l7195D3391J53215h2900K7689j83363F9119a16767
18866b26121P4444j12655a27879n3630E2859g0760p400L1539k660A73943a11784
18854F5873d8404A65305a11092a8688A2131b15864c0941B08014d867n12557B72341
18842c26026A15203K27306A29293A1746J32297a21877A74027K05068b60978a2322
$$ y = [-343492, -186810, -97484, 61695, -150423, 181317, -99265, 174950, 33518, -136577, 21389, -16150, -422413, 76122, 177485, -108451, -12317, -213848, -37614, -22145, -425745, 148024, 57775, 143122, 164046, -179579, 143161, -259887, 410103, 24607, 366864, 579439, -8933, 104904, 96483, 245642, -214729, 126144, -76616, -105588, -67494, 120713, -144852, -34126, -67997, 178487, -169866, -51038, -312129, -239356, -276551, 43391, 196606, -82900, -55211, -238574, 69119, -116767, -226121, -151677, -264332, -127879, -181509, 52859, -70760, -78160, -46621, -49281, 173943, -111784, 65873, -48404, 165305, -111092, -18688, 12131, -215864, -30941, 208014, -4867, -517424, 272341, -326026, 115203, 342509, 129293, 11746, 144043, -121877, 174027, 379095, -260978, -12322]
18831a21161k85820i8293j16446J04971A39706a61479E105c54231e1716l4567
18821h6283r0651A71195Q8342A15221M45079a6123l33398J30518N9352A09548
18810b55612E9961a17315f351A45831a39261O1509B8874b02498K1954M5471A58968
18798C5504b39896P6765B21327H4963k2208P023a88519d1577B18027b83308G6397
18786a67786A28012b57262B9056L02283G6809b92896A23814a53866k25975J06648
18776b73193B4528E489N3008h9275B1518R8708a08029k34296G5941P2409O0860
18765B09210I8012Q9989f8376r2524L2624l66862a03129j98525h9934q390J1295
18754h7029m208k3388b8351j02360j85056A68193a1196I5698D7603A1765K34871
$$ y = [-121161, -406981, -98293, -214739, -109768, 139706, -161479, 5105, -354231, -51716, -86283, -176934, 171195, 259537, 115221, 560300, -16123, -349521, -219003, -159651, 109548, -255612, 59961, -117315, -6351, 145831, -139261, -77752, 28874, -202498, -180544, -135073, 158968, 35504, -239896, -163131, 221327, 84963, 62755, 69778, -188519, -41577, 218027, -283308, 76397, -167786, 128012, -257262, 29056, 331339, 76809, -292896, 123814, -153866, -379841, -273193, 24528, 5489, 58497, -89275, 21518, 120226, -108029, -342325, 75941, 148350, 209210, 98012, 188001, -68376, -160900, -128276, -495138, -103129, -301654, -89934, -98324, -87029, -91237, -114625, -28351, -130711, -315767, 168193, -11196, 95698, 47603, 11765, 246636]
18743B46636a30616D87730A54092c09911P6423J03116j24358f7671k1081E4910
18732B22060A01974a81670A23202a18049L0445B589f6757n6780b3997j47145f7825
18720C4302Q5939b80473J39371m2081j65681i5966l09843a59431P6284j67168
18710b50315R2698M1282n1410B4168a10795j99539R4714k01301e4937m9974l57195
18699d62106H0681j0519h4945A3002b26172c7362m35838b15211E6623f5603k23886
18688b89489O5718F6865a76950o4387e0883A14985h9380I0007c68052f9126C7343
18676D1136O8009b13664b1486j73497I6160b60439Q4881P7229J9561F0606a53020
18664D61057b32009Q5214C6473K12338K3583A35328m4001K03224B8554b46441
$$ y = [246636, -130616, 487730, 154092, -309911, -233488, -130372, -254730, -67671, -88752, 54910, 222060, 101974, -181670, 123202, -118049, -87604, 2589, -66757, -123537, -23997, -171142, -67825, 34302, 120241, -280473, -141102, -183183, -348864, -95966, -405809, -159431, -83147, -250315, -157617, -116335, -167745, 24168, -110795, -310334, -215620, -416921, -54937, -104911, -462106, 80681, 70162, -84945, 13002, -226172, -37362, -473200, -215211, 56623, -65603, -289489, -223771, 66865, -176950, -241337, -50883, 114985, -89380, 90007, -368052, -69126, 37343, 41136, 109145, -213664, -21486, -194983, 96160, -260439, -175558, -98329, -78768, 60606, -153020, 461057, -232009, -146795, 36473, 248811, 272394, 135328, 91327, 294551, 28554, -246441]
18653a47747l58889A22637b20598G4331J78071b6285D3800K38047P3542b8551
18642G4337N3263K4073a24849H7009N8404b17198M1512C9892O2444d0642j22045
18631a62687a4794n2697C38438j52832h3089l9197j40290B1527b13604a7270j42415
18620a59685j66934J07986K659A20964a44708A6003c2519l63197B29529a64885
18609f5575A37661f3957E1686K98657j55849C8789f5845E7920b7051a1126l66339
18598c77465D2016K79853a96597F0864b97545A33037g7140l29763B422f1728B5345
18586d8334r8482j71743H9805d2569J6411A32145l2457e4699j7338O928j67229
18575b32338E0574a41411k0240B3984a61886L5864c8176B00735a2761k13582A19116
$$ y = [-147747, -506636, 122637, -220598, 74331, 252402, -26285, 43800, 281847, 355389, -28551, 74337, 127600, 151673, -124849, 87009, 145413, -217198, -175686, 39892, 102336, -40642, -162687, -14794, -67491, 338438, 185606, -83089, -122286, -262576, 21527, -213604, -17270, -159685, -326619, -218633, -215974, 120964, -144708, 16003, -32519, -395716, 229529, -164885, -65575, 137661, -63957, 51686, 350343, 194494, 38789, -65845, 57920, -27051, -11126, -377465, 42016, 321869, -196597, 60864, -297545, 133037, -77140, -406903, 2422, -61728, 25345, -48334, -146816, -318559, 89805, -42569, -26158, 132145, 99688, -54699, -72037, -65109, -232338, 50574, -141411, -161651, 23984, -161886, -126022, -38176, 200735, -12761, -226343, 119116]
18563a65163K9301d6841k25356C27206g976E6004e2530k04082B86142C8207b10835
18551i99m8573a2576k40833F3616P4907O2347G9721g582B79261H4148b99716H3359
18538a41214j11631e9774k10551f5692l0193E0046F231c94140J38524a16277N2679
18527f3598D9501d1451k25051i5389H444a92812A47643c74330k67401b21405i1425
18515A60998a845m99436a31220B04569a39898f51k09977E5187B4253J40719O9287
18504B34259b59675O8292C5769K15692i3672l25793a40909a5209k18973k213G7338
18492b28628G7024N9349p085D5561c56796D8762Q8307e71162a75184A84489a6624
18480b93455F0388b82115i8668e472m4154p0752D9979a35223j17890C11031a3946
$$ y = [-165163, -135862, -46841, -272197, 327206, -7976, 56004, -52530, -256612, 286142, 38207, -210835, -999, -49572, -12576, -253409, 63616, 138523, 200870, 79721, -7582, 279261, 84148, -299716, 83359, -141214, -252845, -59774, -270325, -65692, -95885, 50046, 6231, -394140, -255616, -116277, -63598, 49501, -41451, -266502, -95389, 8444, -192812, 147643, -374330, -641731, -221405, -91425, 160998, -1845, -501281, -131220, 204569, -139898, -651, -210628, 55187, 24253, 164972, 234259, -259675, -191383, 35769, 251461, -93672, -419465, -140909, -15209, -234182, -236395, 77338, -228628, 77024, 136373, 129288, 45561, -356796, 48762, 137069, -571162, -175184, 184489, -16624, -293455, 60388, -282115, -98668, -5472, -49626, -120378, 49979, -135223, -253113, 311031, -13946]
18468A79288a1852m77239b4121C7068c23190g5865B13407e0967j20974k53180
18458d25121J65051q6585M8457A4003e3135l23907J53446C20077a38615A78467
18447B3925J97206b28780C04862a17164R272B25396h9510r0314A02094a95563
18436c1816j41040D7850J81154a68035A82310b25830B17239p03e6517j87481c5631
18424H1865A4766K06224a48539C0947b32768A06255j1374b96931r128J03184i6651
18412a74611h2443n6179b4922j0207l396a3151m3093E4051G26b71753l5307h9669
18399g659k7478C7556N4900A528J8570h4829B58958A08772b69749a5913n3528
18388f9441E9926J32114l0916b1937m9133I331c7587l33351a29640e1602o3169
$$ y = [179288, -11852, -489091, -24121, 37068, -323190, -75865, 213407, -50967, -171941, -425121, -260070, -346655, -298198, 14003, -53135, -377042, -223596, 320077, -138615, 178467, 23925, 221131, -228780, 304862, -117164, -107892, 225396, -89510, -179824, 102094, -195563, -31816, -172856, 47850, 229004, -168035, 182310, -225830, 217239, 216536, -56517, -243998, -35631, 81865, 14766, 220990, -148539, 30947, -232768, 106255, 94881, -296931, -306059, -202875, -96651, -174611, -82443, -138622, -24922, -35129, -38525, -13151, -56244, 54051, 726, -271753, -307060, -89669, -7659, -35137, 37556, 92456, 1528, 20098, -84829, 258958, 108772, -269749, -15913, -69441, 59926, 192040, 161124, -21937, -71070, 9331, -37587, -370938, -129640, -51602, -114771]
18377a14771q347F5117b23704J06462A69434M2344b79048e0805j01897C36259
18366A11849a56355F2883I778a5260p3602j04226n2123i3268j4309A34344K0263
18355A54607b22327C0899K98948A2099f452j18382N0213C26828a87232A56969
18344a85300k19075a99350A27348J63648A28506c52887j7590b1038B86169b10807
18333a7391j239q1799j27179A30651b80309E2876N5643J51468P8231b18265C6961
18321a5075j17127D704e8826A6809L77627A3980b62861n394c3067j07545M5844
18310i4768j15624j38143A42413n3937j2913j6417i3335B46576B8951e8752o7767
18299a26519G3918c33452a0543o7090a4453A78598b46164N3607A51195j8217c15742
$$ y = [-114771, -123118, 65117, -223704, -117242, 169434, 211778, -279048, -50805, -152702, 336259, 111849, -156355, 62883, 9778, -15260, -88862, -193088, -245211, -93268, -107577, 134344, 154607, -222327, 30899, 329847, 12099, -6452, -124834, -74621, 326828, -187232, 156969, -185300, -404375, -199350, 127348, 290996, 128506, -352887, -370477, -21038, 286169, -210807, -17391, -18630, -100429, -227608, 130651, -280309, 52876, 108519, 259987, 338218, -218265, 36961, -15075, -132202, 4704, -58826, 16809, 394436, 13980, -262861, -268255, -33067, -140612, -94768, -210392, -348535, 142413, 88476, 75563, 59146, -93335, 246576, 28951, -58752, -126519, 73918, -333452, -10543, -77633, -14453, 178598, -246164, -192557, 151195, 132978, -315742]
18287H7829b22778A92277a20333A32230L6692E0255c94632C8468d7278k05724
18277b53002B35243B1020J42302a13066A60356C3679J4693J388M0102c040j34304
18266a37344K1284A18389P7727a67549l1118q1224e6447B49747A9074d0607Q806
18255c1801k7628B3489f7254H3477L8823a40692j10420J2551H4180J09007D2345
18243B14708d3352A38341b39361H0553c7379C0445J51175L05342d389F5950b06233
18231c89571g3333r8323p2622d9624B1430N8619a06329K95J6340b5568A84112
18219c4535o7332k58183Q7238H0667a70945j27239N5948J13465e210l74234a6623
18207f4190M51D02815a33j48960B33383b01197e0466q4888A41722Q4172C192J59014
$$ y = [87829, -222778, 192277, -120333, 132230, 168922, 50255, -394632, 38468, -47278, -253002, 235243, 21020, 163322, -113066, 160356, 33679, 48372, 49760, 89862, -3040, -137344, -116060, 118389, 196116, -167549, -198667, -279891, -56447, 249747, 19074, -40607, -31801, -59429, 23489, -67254, 83477, 122300, -140692, -251112, -238561, 84180, 193187, 42345, 214708, -43352, 138341, -239361, 80553, -37379, 30445, 181620, 486962, -4389, 65950, -206233, -389571, -73333, -171656, -244278, -49624, 21430, 80049, -106329, -106034, -89694, -25568, 184112, -34535, -101867, -360050, -272812, 80667, -170945, -298184, -242236, -128771, -5210, -379444, -16623, -64190, -63739, 402815, -133, -149093, 233383, -201197, -50466, -135354, 141722, 225894, 3192, 162206]
18195A62206f1294K9776B3399c15566a04969K4613j47150A7896b91033b751k19535
18184b22286G3457a50136b4263C0011b81546P6726d9889k24880A96267b50763
18173b83044A17422L2125a41060a8361E5533a21641B52964G0464b89382B6025
18162b72060f4148p0102m9910e4855J6712k52192B58784c5449m27107b2874A84687
18150E2289M36420e11987A79290e6599j29563I2419g4780r2443O7431A08513J54658
18139B63171i8812k01000C41909b46524A62244g339H3746c1945C93794A0932g1825
18127i072A33566a47331b9950k03301j92070A45180a11671D1820f4536G854R6230
18116A04084a44592f7739j66344a04597j25572N8679O7583j91808a28405H2091
$$ y = [162206, -61294, -31518, 23399, -315566, -104969, -80356, -227506, 17896, -291033, -2751, -222286, 73457, -150136, -24263, 30011, -281546, -204820, -49889, -274769, 196267, -250763, -283044, 117422, 149547, -141060, -18361, 55533, -121641, 252964, 70464, -289382, 26025, -272060, -64148, -134250, -184160, -54855, -38143, -290335, 258784, -35449, -462556, -22874, 184687, 52289, 488709, -511987, 179290, -56599, -186162, 92419, -74780, -167223, -99792, 108513, 263171, -98812, -299812, 341909, -246524, 162244, -7339, 83746, -31945, 393794, 10932, -71825, -9072, 133566, -147331, -29950, -233251, -425321, 145180, -111671, 41820, -64536, 7854, 104084, -144592, -67739, -234083, -104597, -230169, -171490, -103907, -295715, -128405, 82091]
18105I2457l9106c20460b6970j4435L01r336A52101M7717q9968K594B5086b35040
18092a37397A18435B4064d6792H2245a5529q9235E1593J88267a33129e7330C7089
18080C675K69048r8440a3254k91611B62142D9134b21086A1218K733J24812K7026
18069A65789Q9171f962k48660l27950a73115O2458A02891C6109c20593B96158
18058C8359M1714d0826A17405f6599q8970A41548M8803b42422A26292a15658G4665
18046A84421r1616J46950D4636J28707p9566J50644G1857b41665B8449e41382
18035f3917A45174c5733C2785O2666a09099D387J59466p3956b87741k386H9542
18023D3216M6709a3345A99143b2058n20826K26082b0255j54540f1868n0689F4931
$$ y = [92457, 53351, -320460, -26970, -41405, -41104, -50440, 152101, 199818, 109850, 112444, 25086, -235040, -137397, 118435, 24064, -46792, 82245, -15529, -104764, 51593, 239860, -133129, -57330, 37089, 3675, 272723, 174283, -13254, -304865, 262142, 49134, -221086, 11218, 13951, 138763, 165789, 254960, -6962, -255622, -583572, -173115, -110657, 102891, 36109, -320593, 296158, 38359, 80073, -40826, 117405, -66599, -155569, 141548, 190351, -242422, 126292, -115658, 74665, 184421, 92805, 239755, 44636, 173343, 93777, 244421, 71857, -241665, 28449, -541382, -63917, 145174, -35733, 32785, 95451, -109099, 4387, 163853, 89897, -287741, -290127, 89542, 43216, 89925, -13345, 199143, -22058, -542884, -316802, -20255, -174795, -61868, -112557, 64931]
18011G6573b37457p9116A03363p297A0996b07505E688L43259A1303a40674J7728
18000a22946A8173c7502P934k96340i0805A27185l1317a03183G5296f9541A06343
17988A9039J43923e4780j36950A93643E9625a37943p5592N5991P1526d2421A396
17976A92331p9396B3941J57071d6866D2178J1005g8940q5162A49889G4204C6178
17964e4169L975C865J32188i5940B9906L798J19186d5755D9674j9956e2027A75559
17951A7154d2630A84082H596b37299B39396f5022B19212j03168J64973a24645
17940B30948J67277e5577B59654q767a55451A35187B4017J36377a72514H2014
17929e0170l40359J26187J29012A72447b07913A93375b76760H3728a78318A32206
$$ y = [76573, -237457, -316573, 103363, 96066, 10996, -207505, 5688, 348947, 11303, -140674, -122946, 18173, -37502, -29568, -325908, -90805, 127185, 95868, -103183, 75296, -69541, 106343, 19039, 162962, -54780, -191730, 193643, 59625, -137943, -213535, -157544, -86018, -42421, 1396, 192331, 112935, 23941, 181012, -46866, 42178, 53183, -78940, -164102, 149889, 74204, 36178, -54169, -50194, 3865, 136053, -95940, 29906, 33704, 152890, -45755, 49674, 29718, -52027, 175559, 17154, -42630, 184082, 8596, -237299, 239396, -65022, 219212, 116044, 281017, -124645, 230948, 398225, -55577, 259654, 250887, -155451, 135187, 24017, 160394, -172514, 82014, -50170, -390529, -264342, -135330, 172447, -207913, 193375, -276760, 83728, -178318, 132206]
17918b79099P487G0814B4806A0433J61989i2333G2804B6419b91678C82402c3735
17906A46780a18446d5949D015J20439B1932L25982a81472k60663K15738h8958
17895I0086d5572a5397B0800K12364d6465A59858b3847E8884g1357B0636a43239
17883A04942C9591i314D651e8494j49137Q1127A39197P2596l2669d00968E8314
17871a08638C30685A33733O6074D4994J81641b45847J04434A3669a75247j51873
17861c27120C55257d6167A54543A680N6246d2770j74431A10097C6270c7800H8081
17849A79052q2387K09794j30056b01587B96833n9819I3837g1851A83822a47705
17838a33657C2722J27907b89860f4906B84220Q3922c5414I3598b12856C6756f3339
$$ y = [-279099, -271612, 70814, 24806, 10433, 172422, -92333, 72804, 26419, -291678, 382402, -33735, 146780, -118446, -45949, 4015, 124454, 21932, 347914, -181472, -442135, -226397, -88958, 90086, -45572, -15397, 20800, 233164, -46465, 159858, -23847, 58884, -71357, 20636, -143239, 104942, 39591, -9314, 4651, -58494, -207631, -126504, 139197, 211793, 179124, -400968, 58314, -108638, 330685, 133733, 199807, 44994, 226635, -245847, -141413, 13669, -175247, -327120, 355257, -46167, 154543, 1680, 57926, -42770, -217201, 110097, 36270, -37800, 88081, 179052, 96665, 306459, 176403, -201587, 296833, 237014, 93837, -71851, 183822, -147705, -133657, 32722, 160629, -289860, -64906, 284220, 368142, -35414, 93598, -212856, 36756, -63339]
17826d55445B05501i8617b9263E7316a40188A90063c1821B33969J40585C4564
17815c3520l83054I0436a14389B5122a06997G2717J94844K11955A48002k9152
17805A18850J28341D0406J29188O6584r7474m0843K55995b27665a596m8469B0514
17793B63467j06846D0114J92659b68621F10566H9050j2422B788J66743O1278b492
17781A73379c29411M5751D8905c40545e2252A00638b14282D54505a03176B18617
17770a29473G7410d56F8334M6885b5553B5579f08972C85780c00967C40406A32712
17758e7147l16441A34076k0929k7166d6253m3945G1279M0062K16104a36905a7781
17746a13955C0479i682I3978L6611i0995E9624a54953I9724j0294j2445b64044
$$ y = [-455445, 205501, -98617, -29263, 57316, -140188, 190063, -31821, 233969, 374554, 34564, -33520, -416574, 90436, -114389, 25122, -106997, 72717, 267561, 479516, 148002, 118850, 247191, 40406, 169594, 236178, 138704, 97861, 353856, -227665, -1596, -50065, 20514, 263467, 156621, 40114, 232773, -268621, 610566, 89050, 76628, 2788, 169531, 230809, -2492, 173379, -329411, -283660, 48905, -340545, -52252, 100638, -214282, 454505, -103176, 218617, -129473, 77410, -456, 68334, 115219, -25553, 25579, -608972, 385780, -300967, 340406, 132712, -57147, -373588, 134076, 113147, 85981, -46253, -90198, 71279, 111341, 327445, -136905, -17781, -113955, 30479, -9682, 93978, 130589, -90995, 59624, -154953, 99724, 89430, 76985, -264044]
17734C2219a52709G4341c9757J2024G1224L723l2273K7165B8064J62329I3977
17722a69038J0640e7000J2064B30843d0792B60680b0992A59286F9133B0741J82387
17711B03128J14208C8777a00961M5322b0444A22272k3006b246B23693L99q4137
17700A39955a8199j85068a5759G4732O5530M1598e0337k8573B1497J78987J43282
17689C43766A64708N5752l7996a81305B90290d8855B87994j25211E3793M8011
17679A01804O9484P4320r9881a7835d474j65778j376B60462j0291i2991A02585
17667B58799F390M04755f9129k94192e8388l1815l5037F8033M25336a14509M1062
17656g3447b0200e119A3790L8635K51862j11140h9032B27340b7639C0748e5419
$$ y = [32219, -152709, 74341, -39757, -27733, 71224, 74947, 42674, 69839, 28064, 190393, 93977, -169038, -158398, -57000, -44936, 230843, -40792, 260680, -20992, 159286, 69133, 20741, 203128, 317336, 38777, -100961, -55639, -20444, 122272, 99266, -2246, 223693, 224092, 139955, -18199, -203267, -15759, 74732, 140262, 181860, -50337, -78910, 21497, 200484, 343766, 164708, 220460, 182464, -181305, 290290, -48855, 287994, 162783, 53793, 101804, 171288, 245608, 145727, -17835, -4474, -170252, -171628, 260462, 250171, -92991, 102585, 258799, 6390, 411145, -69129, -363321, -58388, -90203, -125240, 68033, 493369, -114509, -73447, -20200, -5119, 13790, 52425, 304287, 193147, -89032, 227340, -27639, 30748, -55419]
17644A73743L3648a00477j75731e937n40217g7326E2593b94783e758K346B48652
17632i5908B48497g26J76I2662N8362l6493a24765B7956f8678F0811M43749A51035
17619c08764Q2674A71438p5238J57129C112L35529J092d013A45607P9561E412
17607B97554c62818C03678b08442I9715b5249E5086A573J69080B7292b312r4077
17596i6389A92641G2612a22614H2185R606K9798J92492p6969L45820a34685M0744
17585i3941C13147H0911o68J06746H8905l9063K5454h764k13691C18552q6975
17574B31577A03116P8366J71413G2911d4476A05116K2068C7536a1267G0605K89756
17563C60361j22946G5360l7272h7751A14964m0412J8949C376K25585e1137B64339
$$ y = [173743, 207391, -100477, -276208, -5937, -546154, -77326, 52593, -294783, -5758, -3412, 248652, -95908, 248497, -726, -550, 92662, 151024, 114531, -124765, 27956, -68678, 60811, 504560, 151035, -308764, -226090, 171438, 96200, 253329, 3112, 338641, 339733, -4013, 145607, 225168, 5412, 297554, -362818, 303678, -208442, 99715, -25249, 55086, 1573, 170653, 27292, -2312, -96389, 192641, 72612, -122614, 82185, 91791, 121589, 314081, 237112, 582932, -134685, -93941, 313147, 80911, 80243, 186989, 88905, 49842, 75296, -8764, -222455, 318552, 231577, 103116, 181482, 352895, 72911, -44476, 105116, 127184, 37536, -11267, 70605, 360361, 237415, 75360, 38088, -87751, 114964, 74552, 93501, 3376, 228961, -51137, 264339]
17551C26071a04811A08019m1942i0090A08519a57297D8520L99313j99718a16825
17540C03840j50902l8175m986g1782B05311O5564O6742j62480m3321J85710J6135
17529C33661m4881m2290q1565K43241C1950L52163E5314L43213N1562j96809K56933
17518E10213j45057J7040e574H2065M12790I4919N59378j36447k21725L99496
17508F95621k0731L48427q7935D43915L81878k71142G1211K14113A9098L62851
17498C81949L6073A51317J78472M94804j38635J51671J80932l14277j97007k5713
17488D81564P6829J53340G3958K43029a82113E37546H0735K72586P4200B04796
17477A31611f2121B02905k6034M0288M439J65507A08576b2888A792K50188r1677
$$ y = [326071, -104811, 108019, 66077, -90090, 108519, -157297, 48520, 447833, 248115, -116825, 303840, 152938, 114763, 109777, -71782, 205311, 270875, 337617, 175137, 131816, 317526, 333661, 288780, 246490, 164925, 408166, 31950, 384113, 55314, 398527, 450089, 253280, 510213, 365156, 382196, -5574, 82065, 494855, 94919, 654297, 517850, 296125, 695621, 674890, 1023317, 935382, 443915, 825793, 554651, 71211, 285324, 19098, 381949, 418022, 151317, 329789, 824593, 685958, 837629, 1018561, 704284, 507277, 481564, 558393, 711733, 73958, 316987, -182113, 537546, 80735, 353321, 427521, 204796, 131611, -62121, 202905, 176871, 217159, 221598, 387105, 108576, -22888, 1792, 251980, 160303]
17466A60303N8361K78908A16073J16624L3624l690K60352q9327H023a3279A09816
17454C80092c73518I3410R7513k3336J45224A22840L9973K377J00935K3807m620
17443B85312J64417D8682J77008N21852B91365n8539L39808B22313j7661D5546
17432D84300o1175j60558a79167B98534J92258k33373N9675k2372K5173m3262
17422B76633J43255m6499I8879J80411g217B71067r7882L59643B45806L11344
17412E57150p0499A72816R0723A11685B5850J43314J15504N3989D7429K15041
17402B62470r3833J31556J93481j87259c0542C06235l3259C3606K03045p467k8945
17391B00239C0046K56757C0884M32385n5646f431A87198D3181L05463B2765f2792
$$ y = [160303, 218664, 497572, 116073, 232697, 266321, 262631, 522983, 433656, 8023, -13279, 109816, 380092, -373518, 93410, 190923, 167587, 312811, 122840, 162813, 165190, 266125, 289932, 285312, 449729, 48682, 225690, 747542, 291365, 232826, 572634, 222313, 204652, 45546, 484300, 423125, 262567, -179167, 298534, 490792, 257419, 317094, 294722, 319895, 276633, 419888, 373389, 98879, 279290, -7217, 271067, 173185, 532828, 245806, 557150, 486651, 172816, 263539, 111685, 25850, 169164, 284668, 338657, 47429, 262470, 168637, 300193, 493674, 306415, -30542, 306235, 272976, 33606, 236651, 229184, 200239, 30046, 286803, 30884, 463269, 407623, -6431, 187198, 43181, 348644, 22765, -62792]
17379B04011M2806o4131k6387J63037r3661n2778M2635L5702m9111a34656A31453
17367A56018g680E80829C9966L75431j69291j09489a0446B96118F9386J03956
17357A73342F0974J76004k4983I1895J26402K23822j56363K83562j11879j09659
17347C47780b0624A49136M4165J16401m3403A15833J95533A08988D6116K92775
17337C38891j67761j0847M9787L041J74089q5760j26244F1558R8114n0441k268
17326A06963J10199K39562k20430M819k8724L99639k92850D7901J34091p3358
17316A08634L6767K04353J26084B2217K01120q8569J04787Q7849A38341Q9339
17306B27680J36687l4908R3188r0734A47253j6933M74786C9962J56845A9086Q5285
$$ y = [204011, 246817, 182686, 156299, 319336, 225675, 172897, 215532, 251234, 202123, -134656, 131453, 156018, -7680, 580829, 39966, 415397, 246106, 136617, -10446, 296118, 69386, 173342, 60974, 236978, 211995, 91895, 218297, 442119, 285756, 569318, 457439, 347780, -20624, 149136, 193301, 309702, 266299, 115833, 311366, 108988, 46116, 338891, 171130, 160283, 210070, 213111, 387200, 301440, 175196, 61558, 159672, 109231, 106963, 217162, 456724, 236294, 241113, 212389, 612028, 319178, 47901, 181992, 108634, 145401, 349754, 475838, 22217, 223337, 134768, 239555, 327404, 138341, 227680, 364367, 329459, 422647, 331913, 147253, 130320, 605106, 39962, 196807, 19086, 104371]
17295A04371K22179J06027A50674a4548I3947J56682K5828N1375Q195A42859L84218
17284E27077j14416j98128M09875A17908L94679A95428M8903j06615m254j2626
17274A20836N28093k57300A14220P6424O4550j22745K2582K08887L0594q4778
17264C09734J56760A10499J47914N6930K51593B17438B2333K52043A12789J74870
17254B87659m9176n000F6262L91965k05931K65352J22975A23236K76894j7114
17244C83016j15351B3213J85523r1344J91540O0243B4826K72938j09974k1519
17234A66271J32992f2211C39444o4813J00716l5863G1369K84500j73158R8612
17224B81323j10936J76808j26318J81532J08570B03134L62687D3950M83791j15362
$$ y = [104371, 326550, 432577, 150674, -14548, 93947, 250629, 276457, 327832, 336027, 142859, 527077, 412661, 214533, 624408, 117908, 512587, 195428, 244331, 137716, 133462, 120836, 648929, 391629, 114220, 190644, 255194, 132449, 155031, 363918, 394512, 309734, 466494, 110499, 258413, 315343, 566936, 217438, 22333, 274376, 112789, 287659, 238483, 233483, 66262, 458227, 252296, 517648, 640623, 123236, 400130, 383016, 267665, 23213, 208736, 117392, 308932, 369175, 24826, 297764, 187790, 166271, 299263, -62211, 339444, 274631, 375347, 339484, 71369, 355869, 182711, 281323, 170387, 347195, 220877, 402409, 510979, 203134, 565821, 43950, 527741, 412379]
17214D12379L7146n6640f7803D83953J00682k70959J41587j11406L12907C23979
17203E17718k11210j8799K2961j11235K55331j87782J80540j47478j22494M50676
17193F28228j23982l7799o439a08645C62453j10489K5030K9266O9555K0682j1615
17182C84882A05847J43428j13654N01954k60986n338A21895J90703J14544m0681
17172C86461K57030J8068k04071m5843A77516K88121j06589J81899j61957J9880
17162C98870L26678k57758l7727j95344O0456l8274P5714K95430A19579K66276
17152C85855j37008r2879F8104P31237l66952J01159B19960J96685J77830j74373
17142D20102j53317J26453R4168j63945k6192J67703J93974j48702j4548B07948
$$ y = [412379, 449525, 392885, -67803, 483953, 584635, 313676, 455263, 343857, 656764, 323979, 517718, 306508, 287709, 310670, 199435, 454766, 266984, 447524, 300046, 177552, 628228, 504246, 466447, 460008, -108645, 362453, 251964, 276994, 306260, 375815, 396497, 384882, 105847, 249275, 135621, 637575, 376589, 371251, 121895, 312598, 427142, 386461, 643491, 661559, 457488, 411645, 177516, 465637, 359048, 540947, 378990, 398870, 725548, 467790, 430063, 234719, 295175, 256901, 332615, 628045, 119579, 385855, 248847, 155968, 68104, 799341, 432389, 533548, 219960, 416645, 594475, 420102, 266785, 393238, 487406, 323461, 297269, 464972, 658946, 510244, 495696, 207948]
17131C53450P3477A53767L79258R1167k72392p0114K57399j61363F9402O07860
17121F77262B89749P3669K4970K28023k66976K36609j87331J49797M8889j58772
17111D38627L4624j21095M3913J88875k6809j92832J73615A04121J96563L28634
17101F29318J03705j06781k79629J50125k23853L46688k68467K12144A69799P44146
17091I13945D11456P1717r2115J9535P8491j9238r0869J14817J18202J44608j57497
17080E99107k43969J24139R7350l1662J85197m4804l08556o8116M47846k5627
17070G30905j30959B90653L36230q4497K981J31543k83860K02610P9782J04532
17060G79974C78822J83469J17065p2150B70238M73488L7912j04327q5446j8815
$$ y = [353450, 426927, 153767, 533025, 624192, 351800, 281686, 539085, 377722, 69402, 677262, 289749, 363418, 388388, 616411, 349435, 586044, 398713, 548510, 597399, 438627, 473251, 352156, 396069, 584944, 558135, 365303, 538918, 104121, 300684, 629318, 733023, 626242, 346613, 496738, 272885, 619573, 351106, 563250, 169799, 913945, 411456, 483173, 391058, 410593, 489084, 469846, 378977, 493794, 611996, 756604, 599107, 355138, 479277, 576627, 544965, 730162, 685358, 376802, 308686, 756532, 730905, 599946, 290653, 626883, 542386, 545367, 676910, 393050, 595660, 675442, 779974, 378822, 562291, 679356, 607206, 270238, 743726, 781638, 677311, 591865, 573050]
17050E73050l9644j12040M08659q2812J73552o3785j26819J36942l49880L03427
17040H20650k13857J6981J21523k38580J44480J92758o4918j12078O9264p6753
17030F59470K67945k83406O3144J07072o886k42597K44393K38571P9290j49319
17020I77677l382J2493K7843K6315k92854l0224K65984n8582n9701j43186O2553
17009G84936R8768J78995l27988J89588L22724n7345n04366L1590J34348J05307
16999I56557j43129J23209P1723J07290j09165k66511J05575K94662j68046K85695
16989A257860m37017J26068J76752P6735m51100L49936O7126k09360j2612N6366
16979A000754J8253L10944j52194J45223j43050J32804M9843l27263R1702j65117
$$ y = [573050, 533406, 421366, 830025, 747213, 920765, 856980, 730161, 867103, 517223, 820650, 606793, 623774, 745297, 506717, 651197, 843955, 779037, 666959, 736223, 659470, 927415, 644009, 707153, 814225, 807339, 564742, 809135, 1047706, 1126996, 977677, 974295, 986788, 1014631, 1040946, 748092, 717868, 983852, 925270, 865569, 722383, 784936, 883704, 1062699, 734711, 924299, 1247023, 1189678, 685312, 716902, 851250, 956557, 813428, 936637, 1008360, 1115650, 1006485, 739974, 845549, 1140211, 972165, 1257860, 820843, 946911, 1123663, 1200398, 749298, 1099234, 1166360, 957000, 944388, 1000754, 1019007, 1329951, 1177757, 1322980, 1179930, 1312734, 1362577, 1035314, 1127016, 961899]
16969I61899J70377k42998J89248o8690N1094K48811j4607K60423m15202k51791
16959H88564O08660j98170J92258l47589L54735o8564O0929j80722m2855J93853
16949A461099J20347m14259K94855k04871J49380j75977M38628J825k07346q8189
16939A375492O5662Q2065k25100L03999m0565p9228o2530j00410K78398j77489
16929A420294M7434o1690L2105K53313m2236L3350J36026l42337M9353J18051
16919A643663J42843r9831K40961j11523n0166J95710j29641k16554M71820l66542
16909A720740K23923k7044j6908K76893k19995J21520j08959M3114j61004j11857
16899A740423J48635K51418J6456k18486R9655n780m0257M30403l67765n4248
$$ y = [961899, 1132276, 889278, 1078526, 1009836, 1060930, 1309741, 1295134, 1555557, 1140355, 888564, 1497224, 1299054, 1491312, 1143723, 1498458, 1429894, 1490823, 1310101, 1267246, 1461099, 1581446, 1167187, 1462042, 1257171, 1406551, 1230574, 1669202, 1671027, 1463681, 1375492, 1441154, 1523219, 1298119, 1602118, 1561553, 1482325, 1419795, 1319385, 1597783, 1420294, 1467728, 1406038, 1438143, 1691456, 1649220, 1682570, 1818596, 1476259, 1525612, 1643663, 1786506, 1686675, 1927636, 1816113, 1765947, 1961657, 1832016, 1615462, 2087282, 1720740, 1944663, 1917619, 1900711, 2177604, 1957609, 2079129, 1970170, 2013284, 1852280, 1740423, 1889058, 2140476, 2156932, 1938446, 2038101, 2032321, 1992064, 2422467, 2054702, 2000454]
16889B000454M11424j18657J07452Q3758l57921K37511m4049L05228r2884j1752
16879B520564J14360L5662J20991o8335K14773k17972k20528K40885p7073J19020
16869B782347J25423j2586J47921q6690N48912n97108J70190j44537J48029j53324
16859B928577K19311p0744O64160k08201p637j79320O25116j96950j71948J14749
16849C717113p2361K30661J19679j46333m4438J23283k04557J24169N73248m56927
16839C963537M65113J06569j19191P4212J5741o5131K19728j36452P5310O22491
16829E221927n8505k38282M79274j92430R5153j3673J98976k46500L28463P8315
16819E652718K66857n20181L40909K72579M7831L2966O90800p46554M86185K89165
$$ y = [2000454, 2411878, 2293221, 2400673, 2484431, 2126510, 2364021, 2319972, 2625200, 2532316, 2520564, 2634924, 2670586, 2791577, 2723242, 2938015, 2720043, 2499515, 2740400, 2663327, 2782347, 2907770, 2895184, 3043105, 2956415, 3505327, 2908219, 3078409, 2933872, 3081901, 2928577, 3147888, 3077144, 3741304, 3533103, 3525466, 3346146, 3971262, 3774312, 3602364, 3717113, 3644752, 3875413, 3995092, 3848759, 3804321, 3927604, 3723047, 3847216, 4420464, 3963537, 4428650, 4535219, 4416028, 4490240, 4505981, 4440850, 4660578, 4524126, 4599436, 5221927, 5163422, 4925140, 5404414, 5211984, 5307137, 5293464, 5492440, 5245940, 5574403, 5652718, 5919575, 5399394, 5740303, 6012882, 6060713, 6093679, 6784479, 6037925, 6524110, 6813275]
16809F813275k35560L92285L53647n0525M86577j94416J32561J80922J2345L45079
16799H236190J97147J43461K37067J22268L34772L7447L88441n5244K07280K06367
16789A0055196J85481N34824M42113l45525L62570L61633N89835n2612K37867
16780A2371382R8959O21391M02452K40643P91316j0957K66875P53753J15973M04179
16770A6055966L44270L55891O98573M94387O47675N06632M65518M37566P72558
16761B0779036Q14841M05123Q05963Q02236R01518O97961Q23939J038816P07541
16752B7776974J029274R89011J037247J531027J073760J051020J374903J078551
16744C6941767J357734J642837J783522J193143K537937J238766K163910K184560
$$ y = [6813275, 6577715, 6970000, 7323647, 7273122, 7759699, 7565283, 7697844, 7878766, 7891111, 8236190, 8433337, 8576798, 8813865, 8936133, 9270905, 9308352, 9696793, 9641549, 9848829, 10055196, 10240677, 10775501, 11217614, 10872089, 11234659, 11596292, 12186127, 12133515, 12371382, 12470341, 13091732, 13494184, 13734827, 14526143, 14515186, 14782061, 15535814, 15651787, 16055966, 16400236, 16756127, 17454700, 17949087, 18596762, 19103394, 19568912, 20006478, 20779036, 21593877, 21999000, 22804963, 23607199, 24508717, 25206678, 26030617, 27069433, 27776974, 28806248, 29795259, 30832506, 32363533, 33437293, 34488313, 35863216, 36941767, 38299501, 39942338, 41725860, 42919003, 45456940, 46695706, 48859616, 51044176]
16736E1044176K119149K422841K138007K401571K650013K875724K967556K963621
16728G1582658L039000L833370L127966L586905L641833M024772L689920M205263
16720A00731687L625469M383089M142775L945637M110195M085677L785320L381751
16712A32191600L246144L360008L120366J626118K142724J569789Q63585L57140
16704A48477474l81738l31371j184361j621441j916667k736882l121076l649564
16696A33534374l412160l425038m293791m066577m189855m080242m327155m297765
16688A01441791m214261l926677m050708l570395l715682l680146l632748l027319
16680G1623855l404992k852628k859091l111256k144832k598737k155642k420940
$$ y = [51044176, 53163325, 55586166, 57724173, 60125744, 62775757, 65651481, 68619037, 71582658, 74621658, 78455028, 81582994, 85169899, 88811732, 92836504, 96526424, 100731687, 104357156, 108740245, 112883020, 116828657, 120938852, 125024529, 128809849, 132191600, 135437744, 138797752, 141918118, 143544236, 145686960, 147256749, 148120334, 148477474, 148095736, 147764365, 146580004, 144958563, 143041896, 140305014, 137183938, 133534374, 130122214, 126697176, 122403385, 118336808, 114146953, 110066711, 105739556, 101441791, 97227530, 93300853, 89250145, 85679750, 81964068, 78283922, 74651174, 71623855, 68218863, 65366235, 62507144, 59395888, 57251056, 54652319, 52496677, 50075737]
16672E0075737k198751j908891k038281j160394j747132j871465j814899r90983
16664C6344941j828393j061927j148209j685810o06805q91501j230092q69484
16656B7022720r95124j056713o59996q17143p70511q26137p29626o20159o93761
16647A9853550p24429k57425q77011l34213o22352l83568m98476o28070k85481
16638A5242525l25105j45867l12979p37547m56645l33158j08468o62212k77009
16629A1883535j59133k68410n24760k24019J21934m35540j67523l04072m67256
16620I454756k97710k12919j01362m0765q9069n03418J73310l61509l94963K80230
16610G906581l41848q4613N0137j19364m47843j03957p9679k04609J5375o33231
$$ y = [50075737, 47876986, 45968095, 43929814, 42769420, 41022288, 39150823, 37335924, 36344941, 34516548, 33454621, 32306412, 30620602, 30013797, 29122296, 27892204, 27022720, 26027596, 24970883, 24310887, 23493744, 22723233, 21897096, 21167470, 20547311, 19853550, 19129121, 18871696, 17994685, 17660472, 17038120, 16654552, 16156076, 15528006, 15242525, 14917420, 14771553, 14458574, 13721027, 13264382, 12931224, 12822756, 12160544, 11883535, 11724402, 11455992, 10931232, 10707213, 10829147, 10393607, 10226084, 9922012, 9454756, 9157046, 8944127, 8842765, 8802000, 8712931, 8209513, 8382823, 8021314, 7626351, 7906581, 7564733, 7480120, 7530257, 7410893, 6963050, 6859093, 6779414, 6574805, 6590180, 5956949]
16600E956949L44941j43252o515o61193M64227l11481k03401J6509J60742l22772
16590E294754j18141J74871l28886r0550M2868j15859k64206k4294q1318j12358
16580D376881m8875J38075N8875j25985J46908k87149k65938k88802K30341j32797
16570C801534j78172j13098M18560k22907n9599m42055L77961j04128L7932K32335
16560C748363n68512l0627k6197K17594k89154N6232J15432R1851m72604K3696
16550B866074k15290K36217j51655J29451o556k2415j15508K00492k10084j75842
16540B534884L7255M46463n23257N6919l13373J73531l12737L6233j00529O6529
16530B101918L79621m04125J21837j3337K06256k50983Q1476j52279o3649L0874
$$ y = [5956949, 6301890, 6158638, 6152123, 5490930, 5955157, 5643676, 5440275, 5456784, 5617526, 5294754, 5176613, 5351484, 5022598, 4932048, 4974916, 4859057, 4594851, 4570557, 4489239, 4376881, 4328006, 4466081, 4524956, 4398971, 4545879, 4258730, 3992792, 3703990, 3934331, 3801534, 3623362, 3510264, 3928824, 3705917, 3646318, 3204263, 3582224, 3478096, 3516028, 3748363, 3179851, 3149224, 3123027, 3340621, 3051467, 3107699, 3223131, 3314982, 2842378, 2866074, 2650784, 2887001, 2735346, 2864797, 2858241, 2835826, 2720318, 2920810, 2710726, 2534884, 2572139, 3018602, 2495345, 2552264, 2238891, 2412422, 2099685, 2135918, 2035389, 2101918, 2481539, 2077414, 2199251, 2185914, 2392170, 2141187, 2222663, 2070384, 2006735, 2037609]
16520B037609J22145l65213O5388R5933J0997J86071l23546M05676l49163r8376
16510A787521L8436P9681r4713Q1197k15150k43354M02125N0028N8382J22356
16500B066509k26367l59742K25096j96691n6278L77171j92399J27784k51398Q2434
16490A596119l30022J78436J76242j50612K39166k39433l8837j54315K80294m3621
16480A513417m27058O3037M66786p8378k95557p7430R0001K35503l49506K67391
16470A408206K38568o93285L20810o3946k18609L97864p654k54973O4203M0467
16460A231651J59942n28722L26525J30232m82040N13832k65305r7100M2342j35807
16450H95550K68485p6720j34806j000K20274J33997q4586m29776L92326r8568
$$ y = [2037609, 2159754, 1794541, 1859929, 1955862, 1966859, 2152930, 1829384, 2235060, 1885897, 1787521, 1825957, 1905638, 1810925, 1892122, 1676972, 1433618, 1835743, 1885771, 1944153, 2066509, 1840142, 1480400, 1705496, 1508805, 1452527, 1829698, 1637299, 1765083, 1513685, 1596119, 1266097, 1444533, 1620775, 1470163, 1709329, 1469896, 1431059, 1276744, 1557038, 1513417, 1086359, 1149396, 1616182, 1537804, 1242247, 1164817, 1254818, 1490321, 1140815, 1408206, 1646774, 953489, 1274299, 1210353, 991744, 1389608, 1381954, 1126981, 1191184, 1231651, 1391593, 862871, 1189396, 1319628, 837588, 1351420, 1086115, 989015, 1031357, 895550, 1164035, 1087315, 952509, 951509, 1171783, 1305780, 1221194, 791418, 1183744, 1085176]
16440A085176J44181k36285J63150l80951M87857m36277O6947q4951K63591j41843
16430I30595K27322m86056L57418l25976q7029K01161J4412J89844k17242k69260
16420E35189N14780j34358o7178K48564k63502j64390n6881N9826K69153k93543
16410F47660K47348k82920J31394J43823O1611j34568o9849k31975J82818k9149
16400F66193M16699k66333R0452p3123K30390n25169M20013n0730m51668K70809
16390G27533N478k50145L98351m9042k7034l9052m9370J38312o2537k79766M41413
16379I54141M4632j68461L5005D29534K29297k80004J94195K59135l03630k0305
16369E08222J85214N4028k11826j40203J83249j8930K1297N3954J72411p4051
$$ y = [1085176, 1229357, 993072, 1156222, 775271, 1263128, 826851, 893798, 808847, 1072438, 930595, 1157917, 671861, 1029279, 703303, 616274, 817435, 831847, 1021691, 804449, 535189, 1049969, 915611, 848433, 1096997, 833495, 669105, 612224, 672050, 941203, 647660, 895008, 612088, 743482, 887305, 948916, 814348, 744499, 512524, 695342, 666193, 1082892, 816559, 907011, 833888, 1064278, 539109, 959122, 908392, 456724, 727533, 733011, 482866, 881217, 832175, 805141, 766089, 716719, 855031, 792494, 512728, 954141, 998773, 830312, 865317, 429534, 658831, 378827, 573022, 832157, 528527, 508222, 693436, 747464, 535638, 395435, 578684, 559754, 581051, 635005, 807416, 733365]
16359G33365K7591k18158k50110M45644J25449l70644K25031k18007K21204l35136
16349C86229Q7943L7542J36902j21580L56824D28263j47960L43477j42203K1481
16339E03058J202p4263j20294L97340j64152m4647n1003a060F03279j16525L23189
16328H09943C97433L23835k36081J03286J21152j47304B57600L9356O09750k41841
16318F64865j3180j62514J4184j58479K84820P344k14056M1517r6090J41155J14273
16307F23839J17323C16894L16781j42980N6418p0533J4112k13281K62278L02333
16297H42022B28683L86433k26416J27640j03728Q1657j48456j16218L15298A15896
16286F88977l40202Q0033K6797j69999j2397Q9786K34159c8921C34829K06457
$$ y = [733365, 760956, 542798, 292688, 738332, 863781, 493137, 718168, 500161, 721365, 386229, 474172, 511714, 648616, 527036, 883860, 428263, 280303, 623780, 481577, 503058, 504260, 429997, 309703, 707043, 542891, 498244, 447241, -1060, 603279, 486754, 809943, 397433, 721268, 485187, 588473, 709625, 562321, 257600, 296956, 906706, 664865, 651685, 489171, 503355, 344876, 629696, 637040, 422984, 464501, 368411, 509566, 623839, 741162, 316894, 633675, 490695, 547113, 476580, 490692, 277411, 539689, 842022, 228683, 615116, 388700, 516340, 412612, 494269, 345813, 229595, 544893, 115896, 688977, 348775, 428808, 455605, 285606, 273209, 362995, 597154, -38921, 334829, 541286]
16276E41286k41364l9178j7207M09462k52849j7136B2519M4308L3695L47432C8378
16264E28131B18272E4258O7396M06590k62121J22793n7610J13547B08527J64727
16254C73254L9153P6671k00961L9886q9624j08846L10810A89091C4071K15132
16244B49203R3152r5876E5122L95351K6420B9365J35259K299P7308K28891k17541
16233B55581J62490r0103I6960P3887J20138K5451N8650l3682q2191J1950A3863
16221B17142a6042D46212j52374R7984D4596l902K66712K3045k7181q4965J08937
16210C27242j38433j4600n9892K00858p5250A07337P8207J25413E6883N43760
16200F00643B49158O1187l7547m9795L131q425q1507K2627J88269m2722J17221
$$ y = [541286, 299922, 260744, 243537, 652999, 400150, 383014, 22519, 66827, 100522, 447954, 38378, 528131, 218272, 54258, 121654, 528244, 266123, 388916, 331306, 444853, 208527, 373254, 412407, 489078, 288117, 328003, 238379, 129533, 440343, 189091, 34071, 249203, 342355, 246479, 55122, 450473, 476893, 29365, 164624, 166923, 244231, 473122, 255581, 418071, 327968, 96960, 170847, 290985, 316436, 375086, 341404, 259213, 271163, 13863, 217142, -16042, 446212, 293838, 391822, 44596, 40694, 307406, 330451, 303270, 218305, 327242, 188809, 174209, 114317, 315175, 239925, 107337, 185544, 310957, 56883, 600643, 249158, 310345, 272798, 223003, 226134, 217709, 136202, 158829, 347098, 304376, 421597]
16189D21597A21497K74305j78405f120D93917j16252A80358K19336A65893j4519
16179A51374L61380A56765J87165A07658L37590B20289l7625J55490K2205o7113
16169B93246j35962c7970A26353K56012A89612j1490J25695j29132J10047o3154
16159B21578K9417i1468o8786G7745K17818A32924n5525L79948B15037M0696A9623
16147A57770J06020I5595C1040d5842p3190A93538p3325J65692j41599j5382m4820
16136H4104O3084J20533J26533b7242A68853K8052J76742j09921g5685b0978k90360
16125c11338A80838a22367f880k07650i9797c1099G7966j172N18B7379J93049
16114B20428b08205i9135E01737A72227R3121F3107g0142F4015J54678O6041A33717
$$ y = [421597, 121497, 395802, 217397, -6120, 493917, 377665, 180358, 399694, 165893, 151374, 512754, 156765, 343930, 107658, 445248, 220289, 182664, 338154, 360359, 293246, 157284, -37970, 126353, 382365, 189612, 178122, 303817, 174685, 284732, 221578, 250995, -91468, -160254, 77745, 295563, 132924, 77399, 457347, 215037, 255733, 19623, 157770, 263790, 95595, 31040, -45842, -119032, 193538, 120213, 285905, 144306, 128924, 84104, 147188, 267721, 394254, -27242, 168853, 196905, 373647, 263726, -75685, -20978, -311338, 180838, -122367, -6880, -214530, -99797, -31099, 77966, 76794, 77312, 27379, 220428, -208205, -99135, 501737, 172227, 265348, 63107, -70142, 64015, 218693, 284734, 133717]
16102B95935K8585i2225j27468D8523a26060C0874h688C06093h1892G3321F287
16090a30125B3558J35477D0651a35369B98292a00063d890A21019M6907l4130Q276
16079A42072a8181G7896A7652K65301A26910O3622c6683C94912p7886c4676B52424
16067c8119C939i4453H7924c09461i2924B18671r2015E1990j8370M39911E2250
16055c56638H464K98071E420J64919J9394O8063a05872A36986C961N08555E7182
16043I8833D6372J14598c34199H6904a50321B02025B157J00509J35239b57952
16032a60345O0711C8675M2584g910p3545A58145l2844B9327J1087b8244r4662
16021a22906B66209g1742B27769I674b8576l3962B72650R433b26379i8950Q118
$$ y = [295935, 324520, -92225, -219693, 48523, -126060, 30874, -8688, 306093, -81892, 73321, 6287, -130125, 23558, 159035, 40651, -135369, 298292, -100063, -4890, 121019, 167926, 133796, 142072, -18181, 77896, 17652, 282953, 126910, 190532, -36683, 394912, 317026, -34676, 252424, -38119, 3939, -94453, 87924, -309461, -92924, 218671, 126656, 51990, 33620, 473531, 52250, -356638, 8464, 306535, 5420, 170339, 189733, 257796, -105872, 136986, 3961, 512516, 57182, 98833, 46372, 160970, -334199, 86904, -150321, 202025, 2157, 102666, 237905, -257952, -160345, -99634, 38675, 81259, -7910, -81455, 158145, 125301, 29327, 40414, -28244, -122906, 266209, -71742, 227769, 9674, -28576, -62538, 272650, 282083, -226379, -98950, -90832]
16010i0832D03697A23474c63947J38930A43181a88534B64710H7234J73644E101
15999a27993n4197C08190h9194k4434B4901J6278c25977a57195c3838B04218b50075
15987a3167A42820d46633a18343M6501A29029a71873E9041J50958i4508c8808
15976a86416B8410J38643l4804J58548M36357J46946K2425C94449L26137j82745
15966E37841B68468n2898F5217n978c2887B34881I3454c4358F9509j6659J5759
15955F8609a89918G3376a33016j63432J37120J8023A06531a78827e1460B08888
15944C53254a11409p1128E515J31575D8592B2243a31276j94129h8124B98579c46118
15932a01521j66409A25578c40499h9349k08350F3510b07517r033i2933m3256q7615
$$ y = [-90832, 403697, 123474, -363947, -225017, 143181, -188534, 264710, 87234, 260878, 5101, -127993, -182190, 308190, -89194, -113628, 24901, 41179, -325977, -157195, -33838, 204218, -250075, -13167, 142820, -446633, -118343, -71842, 129029, -171873, 59041, 209999, -94508, -38808, -186416, 28410, 167053, 132249, 290797, 727154, 874100, 896525, 394449, 720586, 537841, 268468, 215570, 65217, 59239, -32887, 234881, 93454, -34358, 69509, 52850, 68609, -189918, 73376, -133016, -296448, -159328, -141305, 106531, -178827, -51460, 208888, 353254, -111409, -182537, 5515, 137090, 48592, 22243, -131276, -325405, -88124, 298579, -346118, -101521, -267930, 125578, -340499, -89349, -297699, 63510, -207517, -216550, -92933, -136189, -223804]
15921b23804I1273a36187l8987l1924b8468A22549b98303A79683e4887j72716
15911b27603r7187C06117A0606a60132A61271D357b10772j2276C7281J07187d09741
15899B51019E1284a42728I965R6203L205J04677H08b2243C26460b56407D7449
15887b4695j19375q141M3125C57951A06789f6238C9953J81095c82896a6143A29200
15875H1711J5013a29849B15910g6062L3174J8295B11500a94785j01431c9538B68028
15863b61889B8618P4848m2212h0653j01762B15118A876K15658D8548a87869B42133
15851A1214a58895o497L8859L5110B63896b21704B03522m6495a92451p4905e7621
15839c8432j64422L2509h0970J5810A2418O8592b06177a00677j12414B35872D8243
$$ y = [-223804, 91273, -136187, -175174, -207098, -28468, 122549, -298303, 179683, -54887, -227603, -324790, 306117, 10606, -160132, 161271, 4357, -210772, -223048, 37281, 144468, -409741, 251019, 51284, -142728, 9965, 106168, 109373, 214050, 808, -22243, 326460, -256407, 47449, -24695, -144070, -152211, -109086, 357951, 106789, -66238, 39953, 221048, -382896, -16143, 129200, 81711, 96724, -129849, 215910, -76062, -42888, -24593, 211500, -194785, -296216, -39538, 268028, -261889, 28618, 103466, 61254, -80653, -182415, 215118, 1876, 217534, 48548, -187869, 242133, 11214, -158895, -165392, -126533, -91423, 263896, -221704, 203522, 157027, -192451, -267356, -57621, -38432, -202854, -170345, -80970, -65160, 12418, 81010, -206177, -100677, -213091, 235872, 48243]
15827D8805h7806H9685h9439L3202j02635f1457p5547r6762B694J0007e2538K5343
15815b7195m26269h5976L090A76320b09131G9774J88643j10965b85527J42192
15805a43335d8640j72128f7916c632q3220j04087M092A11959a67491A92418B6907
15793A50979e8750k7359K186A88398b9086B84147j24831d9211H1623a23435k48599
15782c72034A21573a38373A36095a67620L2032A01991R09b0126o0381A40239F6705
15770G8548d9516j13157B1717h5841q7877N791e4253k60633a22985A16392d528
15758C07156d4281j50475N8178r894a9480R658r4867l58648a00120E3215I257
15746F7759N29e0082j38202P0782A46540d0900D178a4905q9494k0535f1356A33935
$$ y = [48805, -87806, 89685, -89439, -56237, -158872, -61457, -137004, -233766, 2694, 12701, -52538, -27195, -453464, -85976, -82886, 176320, -209131, 79774, 268417, 157452, -285527, -143335, -48640, -220768, -67916, -3632, -86852, -190939, -186847, 111959, -167491, 192418, 26907, 150979, -58750, -86109, -83923, 188398, -29086, 284147, 159316, -49211, 81623, -123435, -372034, 121573, -138373, 136095, -167620, -135588, 101991, 102900, -20126, -80507, 140239, 66705, 78548, -49516, -162673, 21717, -85841, -173718, -167927, -54253, -314886, -122985, 116392, -4528, 307156, -44281, -194756, -136578, -146472, -19480, -9822, -104689, -463337, -100120, 53215, 9257, 67759, 68288, -50082, -188284, -117502, 146540, -40900, 4178, -14905, -104399, -124934, -61356, 133935]
15733b55579b2004F7601L91955b349r526A61437b48713C3169j4587e8361A30272
15721b052C46979n7716a74568B21693a07218j75965A03404c11472A79946C4265
15710e9075o7848L7755j69605J07626j26061b2727o9153p139K3566b4970H8700
15698a12700A56895o2147J78606f6606j87290e2237E4822B0269C585K27985a69973
15686a58729A2156f010A59437B1791d42711b8945B02952C5982d29341A6586b01712
15674D3668a49693q569j94603A25649J63132A9723c20230C37979b14398c5605
15663A1591b35018d0430o8533j60114B18928q0453a22280b8290A18151C7970e9528
15651a10938b542j8567p8152j23140R398f222j22527A43688B9985K28794f6125
$$ y = [-255579, -22004, 67601, 459556, -2349, -11875, 161437, -248713, 33169, 18582, -58361, 130272, -2052, 346979, 289263, -174568, 221693, -107218, -283183, 103404, -311472, 179946, 34265, -59075, -126923, -89168, -258773, -151147, -277208, -22727, -91880, -99019, -75453, -24970, 88700, -112700, 156895, 94748, 273354, -66606, -253896, -52237, 54822, 20269, 3585, 231570, -169973, -158729, 12156, -6010, 159437, 21791, -442711, -28945, 202952, 35982, -429341, 16586, -201712, 43668, -149693, -158262, -352865, 125649, 288781, 19723, -320230, 337979, -214398, -35605, 11591, -235018, -40430, -108963, -269077, 218928, 138475, -122280, -28290, 118151, 37970, -59528, -110938, -2542, -21109, -99261, -222401, -213003, -6222, -128749, 143688, 29985, 258779, -66125]
15639b46380g5752A19227f8042j89691P6950B04580b58859i111n5712B68785o5117
15628B03668G4718e2718q8675l9643b4276j65077B1245g4944G0163J87305B6663
15616A1909b85619q383C9647J81811a60692N456A9570b948A14659m5224a7338
15604c2193k05915L9933B71077J11008f1842D7555c48094E8563a58048G1905M3744
15593A15649b5759B8581E480b03936A87066A4213d98930K32008R5659o3817C10937
15581E0844j8695O6881c3120l08360L2659I6139a64193A77632a86051g6395j17146
15570a93541A32073F2222b09103h3899A47833I120f1420a7738l89247E08392a52309
15558e06156B05484j01650k7287C863a59264E8275a64488N3224q8694e06j84719
$$ y = [-246380, -75752, 119227, -68042, -257733, -180783, 204580, -258859, -9111, -64823, 268785, 203668, 74718, -52718, -141393, -181036, -24276, -189353, 21245, -74944, 70163, 257468, 26663, 11909, -285619, -294002, 39647, 221458, -160692, -155236, 19570, -2948, 114659, 69435, -17338, -32193, -238108, -198175, 271077, 382085, -61842, 47555, -348094, 58563, -158048, 71905, 115649, -25759, 28581, 5480, -203936, 187066, 14213, -498930, -266922, -171263, -235080, 310937, 50844, 32149, 99030, -33120, -341480, -308821, 96139, -164193, 177632, -186051, -76395, -193541, 132073, 62222, -209103, -83899, 147833, 9120, -61420, -17738, -406985, 508392, -152309, -506156, 205484, 103834, 76547, 3863, -159264, 58275, -164488, -111264, -199958, -506, -185225]
15547a85225B96064h4440A3370M49317e0056a4852A46335L1373F2116a95527l0937
15536b26464e7169D7787B0795e4900k5242B31459b97327J16734G9203P6610o8366
15525H7447a44791A41223c3508o5447G901c01562J23390j79729A48263c5072j1704
15514d6776m14294A79408q9144a71723C0555J14723e7371F5645N6669L14424A65100
15502B92320D2422P277L18384H4122d0404C2688K25015A5630M0846J94419m2904
15491B07991o8811N3736L5929N6224j25472j8572e7567B70892k0612a14262C31708
15479B56122n0862B4183L11785a60158C54813A28408e9040I3553a01551B15166
15468a14431j87041C64592g0358B13874m5556C3071J57087c43518C28748L61594
$$ y = [-185225, 296064, -84440, 13370, 462687, -50056, -14852, 146335, 177708, 62116, -195527, -226464, -57169, 47787, 20795, -54900, -80142, 231459, -297327, -180593, 79203, 155813, 87447, -144791, 141223, -33508, -98955, 7901, -301562, -178172, -357901, 148263, -35072, -46776, -461070, 179408, 90264, -171723, 30555, 145278, -57371, 65645, 122314, 436738, 165100, 292320, 42422, 49699, 368083, 84122, -40404, 32688, 257703, 15630, 56476, 250895, 207991, 139180, 192916, 228845, 285069, 159597, 141025, -57567, 270892, 250280, -114262, 331708, 256122, 205260, 24183, 335968, -160158, 354813, 128408, -59040, 93553, -101551, 215166, -114431, -301472, 364592, -70358, 213874, 168318, 33071, 190158, -343518, 328748, 690342]
15458F90342k40389K00325n7800j35822j75787H8536P392H061a4081r0753o8883
15447a73717B72737B8002a52309G4103f5190C21945B6216R4942K46922r4799b78792
15435a04278I0336L1375a8363G4355R7236f7446C73458M587j63313K55918L44676
15424H15326L9048l398k49106C9166Q9716k4452a65558N4860B3146a4044B60060
15412h356o2582F7369b35868c2961A88971f3832j9648l956j09702A04083M8831
15401A52914b85497A3474d1428E93230I6897k4777P1765J01214F6125J214P530
15390G4869J16025P8878b56703J20205B15951K9400J1556A2456J25974B9785f2173
15378b26308E6704h893j38644c3130i528A8320O0756J66464g2145B08057C3220
$$ y = [690342, 449953, 650278, 592478, 456656, 280869, 88536, 95928, 8061, -14081, -104834, -173717, 272737, 28002, -152309, 74103, -65190, 321945, 26216, 121158, 368080, 273281, -278792, -104278, 90336, 121711, -18363, 74355, 171591, -67446, 373458, 378045, 214732, 470650, 815326, 854374, 850976, 601870, 39166, 128882, 104430, -165558, -110698, 23146, -14044, 260060, -8356, -70938, 67369, -235868, -32961, 188971, -63832, -83480, -87436, -197138, 104083, 152914, -285497, 13474, -41428, 593230, 96897, 72120, 143885, 245099, 66125, 67339, 74869, 190894, 269772, -256703, -136498, 215951, 245351, 256907, 12456, 138430, 29785, -62173, -226308, 56704, -8893, -147537, -33130, -9528, 18320, 79076, 245540, -72145, 208057, 33220]
15366A59131b15659h3520b3654A20954R5841o1585K482J05103J64285k08409a11240
15354B53953A25653E138K6328N3950B3938J67449F8367B6110K56097B893P1618
15343G4511h6B83380L8960j54200c6136k3175E7841Q4774J15637D1497J56840
15332A98337K20940A91080J1328a7591C64600N0889A65075J46606R1403A00191
15321G3128N5129J55124p9648F0894B8419K20887M2012k2854k0926J30022A85734
15309A1153b6298A59460B410K5604Q7265J45438e9893j63838B98959j06731J34331
15298C26559B9084h0404K0162A00973K99J05008b06343O0155H7838b13399F4140
15286a21331B65277a44802K9188H7572a05479k4438B01430i8003q7950d3774j16183
$$ y = [159131, -215659, -83520, -23654, 120954, 216795, 155210, 157692, 262795, 427080, 218671, -111240, 253953, 125653, 5138, 31466, 85416, 23938, 191387, 68367, 26110, 282207, 2893, 74511, -86, 283380, 322340, 168140, -36136, -59311, 57841, 142615, 258252, 41497, 198337, 419277, 191080, 202408, -17591, 364600, 415489, 165075, 311681, 403084, 100191, 73128, 128257, 283381, 203733, 60894, 28419, 249306, 291318, 268464, 247538, 377560, 185734, 11153, -26298, 159460, 2410, 28014, 115279, 260717, -59893, -223731, 298959, 192228, 326559, 29084, -80404, -60242, 100973, 101272, 206280, -206343, -146188, 87838, -213399, 64140, -121331, 265277, -144802, -115614, 87572, -105479, -129917, 201430, -98003, -185953, -43774, -159957]
15275a59957B74272q9804l4031J51865c1343n7052k02533A99920F1533O171J06620
15264A74324H4501b35726L9206R8042j36074O3318f7025I3204J46776N6655c46999
15252b463l69634a50193B24001g1736A30139C5124K68489h0580D4227J59509a55663
15240B39554a62076j22405B49811d9308C89293r1814A9753L19369K36054j32595
15230D42581N51633J2174p4199K86551n12080G2659o257K09377j17265a68332
15219D2032R0610N768a82117K9509A6909a7048G4031F521c9102m8819B26122N2696
15207B78818d2038A212L12856c06488A59964m6545b88376a01978B04100r3249
15197A10851E3943R3101c9195H506e655B42708E0152J02887O3254C5441J90493
$$ y = [-159957, 274272, 184468, 150437, 302302, -31343, -88395, -290928, 199920, 61533, 67704, 174324, 84501, -235726, -196520, -98478, -234552, -171234, -67025, 93204, 239980, 296635, -346999, -2463, -372097, -150193, 224001, -71736, 130139, 35124, 303613, -80580, 44227, 203736, -155663, 239554, -162076, -284481, 249811, -49308, 389293, 297479, 19753, 339122, 575176, 442581, 994214, 1006388, 932189, 1218740, 706660, 72659, 66402, 275779, 158514, -168332, 42032, 132642, 138410, -182117, -152608, 16909, -17048, 74031, 6521, -39102, -87921, 226122, 278818, -42038, 1212, 314068, -306488, 159964, 113419, -288376, -101978, 204100, 110851, 53943, 147044, -39195, 8506, -5655, 242708, 50152, 153039, 216293, 35441, 225934]
15186B25934B8573J62861J2098N1789f7337D57083D1808M9214d417B7409J34980
15175A62389B1877J50773c0976B48452J25700K514b20188C83995K50160B4718
15164A36011O2694a03594l2414N6113A01698K58273d3271C00962g0196m2660D41209
15152D11664A85861e7270J5476B61662o4636R0207q2458F653K13223b59593B61287
15140C63228j65120r0477N7122d1985A5921e9569A75588b16457h4216j01157D63846
15128A99477K17201A5664L27177a0167C10374m0266b9033B81489F7354K53912
15118C21266B1256J45567J21117O2500A54554g7795j3311B49986b55277E35605
15107B55768J64119A78759J39128j6599J5510A02026c6082C43422a80484B9980
$$ y = [225934, 28573, 191434, 203532, 255321, -67337, 457083, 41808, 91022, -4417, 27409, 162389, 21877, 172650, -30976, 248452, 374152, 376666, -220188, 383995, 634155, 24718, 136011, 198705, -103594, -136008, -79895, 101698, 359971, -43271, 300962, -70196, -112856, 441209, 411664, 185861, -57270, -41794, 261662, 197026, 287233, 204775, 6653, 219876, -259593, 261287, 363228, 198108, 107631, 164753, -41985, 15921, -59569, 175588, -216457, -84216, -185373, 463846, 199477, 416678, 15664, 342841, -10167, 310374, 270108, -29033, 281489, 67354, 321266, 21256, 166823, 287940, 350440, 154554, -77795, -91106, 249986, -255277, 535605, 255768, 419887, 178759, 317887, 301288, 316798, 102026, -36082, 343422, -180484, 29980]
15096A07701k7959N6180o5723K43318A45861J97668p2456c54336A66261P9690
15086B45951L1032b7140C63443A57440P2117m2239J25335E4365R8901K2199K64386
15075D39851B0761a13328B63548q2908A7986K42937n8336C0854M15160F6666J9157
15064H5823A0329K07424K97720e3457C91653j3567C5244M22180A19655O9534J71292
15053C60481J22069B40896a72970b4305G6004B5278O9479L2155J84847J16335
15043D28094I9968Q8051P3652M3024M9475j16666J91748C6221K29105A01161L55541
15032D56702k13645d0865C17017j34007q3270N1018J14399O5161K21018B01752
15021D63454j14642j7370A57454K51591k2753k4788J02089J93556p4715o3725
$$ y = [107701, 79742, 135922, 70199, 313517, 145861, 343529, 271073, -354336, 166261, 245951, 276983, -27140, 363443, 157440, 229557, 187318, 312653, 54365, 153266, 175465, 439851, 20761, -113328, 263548, 180640, 17986, 260923, 202587, 30854, 446014, 66666, 85823, 10329, 217753, 515473, -53457, 391653, 378086, 35244, 457424, 119655, 189189, 360481, 482550, 240896, -172970, -24305, 76004, 25278, 94757, 126912, 311759, 428094, 99968, 188019, 261671, 304695, 354170, 237504, 429252, 36221, 265326, 101161, 456702, 243057, -40865, 317017, 183010, 99740, 150758, 265157, 330318, 551336, 201752, 463454, 348812, 331442, 157454, 409045, 386292, 361504, 463593, 657149, 582434, 518709]
15011E18709L25842j08198l67690A58011K63481r3896A56871M08804L9686J71269
15001G76630C67082L87990k30200j92688F7183L90674A34651N25419l00197J58675
14991E18548j64625p0797r122K39815j88447n266L4107J89520m5994k11178k4287
14980B62274K56710O7088O1963k00591N4417j95122J51367j88299n7264L72971
14970E85514J68739B42706L19813J53077j55962J4361J11562k24306L8132J53890
14960F53273C20181K16574j75507J29238J8959J24295M2055k23525A78711N60764
14950G39475C25955N4584K7253j21697m3709M72563B82651r9990A0620O25937
14940F36557k37187n3679F6218J3820L38475A15510O25419B64943q1605J49114
$$ y = [518709, 844551, 736353, 368663, 158011, 421492, 327596, 156871, 565675, 605361, 776630, 367082, 755072, 524872, 332184, 67183, 457857, 134651, 660070, 359873, 518548, 353923, 283126, 274004, 513819, 325372, 320106, 354213, 543733, 497739, 286561, 262274, 518984, 586072, 648035, 447444, 501861, 306739, 458106, 269807, 212543, 585514, 754253, 242706, 562519, 715596, 559634, 573995, 685557, 461251, 499383, 653273, 320181, 536755, 361248, 490486, 509445, 633740, 675795, 452270, 178711, 739475, 325955, 380539, 407792, 286095, 242386, 714949, 282651, 182661, 10620, 636557, 399370, 345691, 66218, 80038, 418513, 115510, 740929, 264943, 183338, 332452]
14930C32452P9159J24280k44772J52370p0880O22727l27626j45859j17714N695
14920D09832N6845k2551K46432j34935L3182M04087n3055q2051M78721k69250
14910A067257M30348p2257j6497J01946j39279n0824M85963m49278M7117R1906
14900A496402M80790l05873o7023l44746l24151O6070J24053l83735M8382A88999
14889F62215j89948k0522j86965L4751J66924j61583J73496Q9702A76790K37020
14879D13810K25536n4746j64024L78964k12311k40495N2217K03343j59971J8887
14869D61210J71775j10371J8431J59963k10078K64232k42894K95784k21322K67754
14859H54484k71712j46275J37776B11256K15649R9881j35808K89487K17152J27111
$$ y = [332452, 411611, 535891, 291119, 443489, 372609, 995336, 667710, 521851, 404137, 409832, 466677, 444126, 690558, 555623, 588805, 992892, 939837, 857786, 1336507, 1067257, 1497605, 1425348, 1408851, 1510797, 1371518, 1320694, 1806657, 1357379, 1404496, 1496402, 1977192, 1671319, 1604296, 1259550, 935399, 1001469, 1125522, 741787, 790169, 188999, 662215, 472267, 451745, 264780, 299531, 466455, 304872, 478368, 568070, 176790, 413810, 639346, 584600, 420576, 799540, 587229, 346734, 398951, 602294, 442323, 461210, 632985, 522614, 541045, 701008, 490930, 755162, 512268, 808052, 586730, 854484, 582772, 436497, 574273, 211256, 426905, 526786, 390978, 680465, 897617, 1024728]
14849A024728l35687J94062C29123K47984j28479K6432R0740k67828K84778J76495
14839G59245l07004J82170j93664J83031C04819q5097N85490j63377o5373P1868
14829F48330K13897r0781k69354M73883q4105n1685j45403M68975m7992j17464
14819I98301j1134l40776J87464l61680k059j51800K69271m4321M5889k21286
14809C67869J25760J72894C10799L08932J21684J10356k24257J17638k7254M3044
14799G60942L3424k34070j88893L99131J11971k73933J25932l7673m4631K76100
14789I28300C74961L68533p4231K49778p9799k23684k51260J81942l8836Q5895
14779E93299K8560m1488R9007K0916j53297k18054J72356m4373K2481K273O8719
$$ y = [1024728, 689041, 883103, 329123, 577107, 448628, 475060, 565800, 297972, 582750, 759245, 452241, 634411, 440747, 623778, 304819, 219722, 805212, 641835, 576462, 648330, 862227, 771446, 502092, 975975, 891870, 840185, 694782, 1163757, 1115765, 998301, 987167, 646391, 833855, 472175, 470116, 318316, 587587, 543266, 589155, 367869, 493629, 666523, 310799, 619731, 741415, 851771, 627514, 745152, 717898, 760942, 794366, 560296, 371403, 770534, 882505, 608572, 734504, 696831, 652200, 928300, 374961, 743494, 669263, 919041, 839242, 615558, 364298, 546240, 507404, 593299, 621859, 580371, 679378, 700294, 546997, 328943, 501299, 456926, 479407, 481680, 550399]
14768E50399J69647K54811J82213D88159N55374E19085J89727J8288M8151J15104
14758H90355P5596j18194J29360L14182E56118L05505J18070l30905Q4010k3427
14748G09371j34412J90683k86946J64536j35468K01078J28121n7828l21785J8686
14738D76036L45655k96832L34506p4739J79456B60055L60440J73165m4433r1634
14728F57593j27950j98320L10835L51506l03881K46415L1725m6875K62430l01244
14718H82234K02497l29267R9007J38536j9231L3205J95384p759K74508J40477
14708A609591m97398L93069p4787j96504j30659o1803j86008J80466j98986J81603
14698A018584m97534K92355J04675R825k0575J67632k31422L13156r5917P6902
$$ y = [550399, 720046, 974857, 1157070, 488159, 1043533, 519085, 708812, 727100, 775251, 890355, 965951, 847757, 977117, 1291299, 556118, 861623, 979693, 648788, 732798, 709371, 574959, 765642, 478696, 643232, 507764, 708842, 836963, 779135, 457350, 476036, 821691, 524859, 859365, 784626, 964082, 260055, 620495, 793660, 749227, 657593, 529643, 331323, 642158, 993664, 689783, 936198, 967923, 921048, 1183478, 882234, 1084731, 755464, 854471, 993007, 973776, 1006981, 1202365, 1194606, 1469114, 1609591, 1112193, 1505262, 1430475, 1233971, 1103312, 1041509, 855501, 1035967, 836981, 1018584, 521050, 813405, 918080, 927905, 907330, 1074962, 843540, 1156696, 1060779, 1137681]
14688A137681K22983k51079J08661K39533j5747J43972L21040n20227l1655j40943
14678A214219j86132K19783n3218j69809k7724K52147k16633q7650j10268K92797
14668A127512k90539K94468E58102K70098J09687j3201K04232K2656k1298m15216
14658G15060M02993j93462N0226K99358n09706k5665Q1630L76591j69804O7939
14648A095160k64937K57177J081M1673J47967k23702k12387N12570m16278R6007
14638A034331K63011l25035L65709J90802q0389j96012J28855L06065l65505j26769
14628A195063J56337q6708n4710l08616K38746j94544K01664J7859J9435J13400
14618A297926P842K94111k09027k04670K61459n5427L07043j53809Q5307l4434
$$ y = [1137681, 1360664, 1109585, 1218246, 1457779, 1442032, 1586004, 1907044, 1386817, 1355162, 1214219, 1028087, 1247870, 1194652, 1024843, 997119, 1249266, 1032633, 944983, 834715, 1127512, 836973, 1131441, 558102, 828200, 937887, 924686, 1128918, 1151574, 1130276, 715060, 1118053, 924591, 974817, 1274175, 764469, 738804, 820434, 1197025, 1027221, 1095160, 830223, 1087400, 1088481, 1130154, 1278121, 1054419, 842032, 1354602, 938324, 1034331, 1297342, 972307, 1338016, 1528818, 1448429, 1252417, 1381272, 1687337, 1321832, 1195063, 1351400, 1264692, 1209982, 901366, 1140112, 945568, 1147232, 1165091, 1184526, 1297926, 1305768, 1599879, 1390852, 1186182, 1447641, 1392214, 1699257, 1545448, 1630755, 1596321]
14608A596321j41447j64315j01555M41916L0117k2225k41679L47094k69570J261
14598A475918O4661k4491j29387K20822m1273p5280L17498j86950p5127l49826
14588A196565N60264n65571M54176k1761j94131J05241J98002k31742L33772J36221
14578A971036m05830K10750j84169j5237J30625K88392m25316j6174L10700k34601
14568A630176K09506P1401M8069k2019L30293l77023j41331L02375P997j29454
14558A929990K63680J85096j04881j03134k2485L34693j98199J61457m26120N52685
14548B572782k0715K12770k70941O12987l42086Q18905k42856k89365J027010
14539D078491J8177N61616Q87020R90748J090925K981342L962378N947693R634480
$$ y = [1596321, 1454874, 1290559, 1189004, 1630920, 1661037, 1638812, 1397133, 1744227, 1474657, 1475918, 1540579, 1516088, 1386701, 1607523, 1566250, 1490970, 1808468, 1621518, 1546391, 1196565, 1756829, 1191258, 1645434, 1623673, 1429542, 1534783, 1732785, 1501043, 1834815, 1971036, 1565206, 1775956, 1591787, 1576550, 1707175, 1995567, 1570251, 1554077, 1864777, 1630176, 1839682, 1911083, 1959152, 1937133, 2267426, 1890403, 1749072, 2051447, 2059444, 1929990, 2193670, 2378766, 2273885, 2170751, 2148266, 2482959, 2284760, 2446217, 2020097, 2572782, 2552067, 2764837, 2493896, 3106883, 2764797, 3583702, 3340846, 3051481, 4078491, 4096668, 4658284, 5545304, 6536052, 7626977, 10608319, 14570697, 20518390, 30152870]
14530C0152870J196975j2460857p687399l790229j444661l91551j516385j217832
14522B840931l72059k00137J49874R6399j72451k70431J09201J23503k37529J71820
14512B239121L04445n49614L22983j73606M77837n60274L21125r1137M12074O9234
14502B772188q2381k41215K60640O4219p6922j86395K84796j1327n405K15095
14492B993293L024k62871J79940j09029J14105n7505K61393j69104K71326m32603
14482B791969K04457M16070l74946K53068j17676J8378L33290j40726K5131J12194
14472C521209K49114J49022l4037m69309M60205n7412J4937J87701l86225L97129
14462D032334q0847J97758k20563K47508j44187L62796K0704K43716k04196o6259
$$ y = [30152870, 31349845, 18888988, 11201589, 7411360, 5966699, 5575148, 4058763, 2840931, 2468872, 2268735, 2418609, 2515008, 2342557, 2072126, 2181327, 2304830, 2067301, 2239121, 2543566, 1993952, 2316935, 2143329, 2621166, 2060892, 2382017, 2290880, 2702954, 2772188, 2689807, 2448592, 2709232, 2773451, 2696529, 2510134, 2794930, 2783603, 2778198, 2993293, 2996317, 2733446, 2913386, 2804357, 2918462, 2860957, 3122350, 2953246, 3224572, 2791969, 2996426, 3412496, 3037550, 3290618, 3172942, 3191320, 3524610, 3383884, 3409015, 3521209, 3770323, 3919345, 3885308, 3415999, 3876204, 3818792, 3833729, 4021430, 3635205, 4032334, 3951487, 4149245, 3928682, 4176190, 4032003, 4394799, 4415503, 4659219, 4455023, 4388764]
14452D388764J78711K12473k33993j9317K22531K2241J47271j39968J27902k89376
14442D617239K91119L3514K58457k40043J23823O30552m48447J20969J27358L4105
14432E548646J40904J2984K24099j27686j87830L79391K4316l9492K58461j15266
14422F118527l6339L57961J14613K25394J3411M11456l88088M8415L44963j35358
14412G074955J2055M57425J7814P0338R4387l3611K11087q2250N68815J1660M33441
14401H836116L62089k21989k5768r4113j44589M80533M31121L2345j46979N3282
14391I562048M75669J97272j12671J51938Q78584p9651J18274o3070J1401R2332
14381A1232126k18389P38392k27398M61529K60305k28247O21076J35100L52317
$$ y = [4388764, 4567475, 4779948, 4545955, 4526638, 4749169, 4771410, 4918681, 4778713, 4906615, 4617239, 4908358, 4941872, 5200329, 4960286, 5084109, 5714661, 5266214, 5387183, 5514541, 5548646, 5689550, 5702534, 5926633, 5798947, 5611117, 5990508, 6014824, 5975332, 6233793, 6118527, 6082188, 6440149, 6554762, 6780156, 6793567, 7205023, 6816935, 6865350, 7210313, 7074955, 7087010, 7544435, 7562249, 7632587, 7726974, 7693363, 7904450, 7822200, 8391015, 8402675, 8836116, 9198205, 8976216, 8950448, 8856335, 8711746, 9192279, 9623400, 9655745, 9508766, 9562048, 10037717, 10234989, 10122318, 10274256, 11152840, 11073189, 11191463, 11128393, 11139794, 11232126, 11013737, 11752129, 11524731, 11986260, 12246565, 12018318, 12639394, 12774494, 13126811]
14372A3126811L85786j74579N43297N7822K46292N34945O0601M22876L06175L48874
14362A5858900J09427J93783M06827j05059P47588M12678K01440L54061O56003
14353A8835648N1393O12803j438O72753K58972R63179J63619Q94464K25330J64885
14343B2841608M46257R63536N9803N62349Q00255L24221J064903N21093L51164
14334B7935189Q86448N73467P44455J154587N53034J054869Q95439O33222R71109
14325C5401819Q82790J282074Q87675J411462Q49985J261623J473083J018870
14317D4469381J256850J415402J870432J439561J639490J655674J854382J853367
14309E7454539J869230K073356K777969J883363K482462K357637K479900K754820
$$ y = [13126811, 13512597, 13338018, 13881315, 13939137, 14185429, 14720374, 14780975, 15203851, 15510026, 15858900, 15968327, 16162110, 16568937, 16463878, 17211466, 17624144, 17825584, 18179645, 18835648, 18887041, 19499844, 19498406, 20171159, 20430131, 21393310, 21556929, 22451393, 22676723, 22841608, 23287865, 24251401, 24311204, 24873553, 25673808, 25998029, 27062932, 27584025, 27935189, 28821637, 29395104, 30139559, 31294146, 31847180, 32902049, 33797488, 34430710, 35401819, 36284609, 37566683, 38454358, 39865820, 40715805, 41977428, 43450511, 44469381, 45726231, 47141633, 49012065, 50451626, 52091116, 53746790, 55601172, 57454539, 59323769, 61397125, 64175094, 66058457, 68540919, 70898556, 73378456, 76133276]
14301G6133276K937378L456858L208327L304935L057075M117115M067968M490589
14293A04773521M690721M636091M965540N557503N599811O459880O350708P402291
14285A50436066O981856P630246Q033718Q716685R318371R391704J0163698J1071850
14277B21744194J1325718J1982696J2945583J2948583J3916108J4070742J4316813
14270C13250437J4269988J4416637J3910531J3838301J3777050J3316049J3167455
14263D09946448J1852358J1116378J0522594R973620P681398M978475K382128
14256D68453399J852459L690017K45930n386845m915312p383678q233412r858473
14248D38464085j1995285j4150688j4379377j4386257j4678654j4966367j4645128
$$ y = [76133276, 79070654, 82527512, 85735839, 89040774, 92097849, 96214964, 100282932, 104773521, 109464242, 114100333, 119065873, 124623376, 130223187, 136683067, 143033775, 150436066, 157417922, 165048168, 173081886, 181798571, 191116942, 200508646, 210672344, 221744194, 233069912, 245052608, 257998191, 270946774, 284862882, 298933624, 313250437, 327520425, 341937062, 355847593, 369685894, 383462944, 396778993, 409946448, 421798806, 432915184, 443437778, 453411398, 461092796, 466071271, 468453399, 470305858, 473995875, 474241805, 468854960, 463939648, 456555970, 448322558, 438464085, 426468800, 412318112, 397938735, 383552478, 368873824, 353907457, 339262329]
14241C39262329j5400899j4393648j3838174j3343676j3360647j2111656j2959797
14234B43853832j2528314j2494037j0998936j1105331r593786r381345q856203
14227A68895880q113973p431089p567681p194446n585279o186611n371712n573326
14219A15871763n042040m733808m454054l757347m022573m009888l396344l560052
14211H2895657l177423k872300k705660k622235k650621k535238k054076k275015
14203F2003089k213075j927337k060820j548990j712387j352324j659541j847672
14195D7680943j362936j229972j236698p17031j667703q98207j447042j427018
14187C7694336n64032r91103n79396j000889j078135q83883j017066p48212o83148
$$ y = [339262329, 323861430, 309467782, 295629608, 282285932, 268925285, 256813629, 243853832, 231325518, 218831481, 207832545, 196727214, 187133428, 177752083, 168895880, 160781907, 153350818, 145783137, 138588691, 133003412, 126816801, 121445089, 115871763, 110829723, 106095915, 101641861, 97884514, 93861941, 89852053, 86455709, 82895657, 79718234, 76845934, 74140274, 71518039, 68867418, 66332180, 64278104, 62003089, 59790014, 57862677, 55801857, 54252867, 52540480, 51188156, 49528615, 47680943, 46318007, 45088035, 43851337, 43134306, 41466603, 40568396, 39121354, 37694336, 37130304, 36139201, 35559805, 34558916, 33480781, 32596898, 31579832, 30831620, 30148472]
14178C0148472m02603r49708q05697n02724r83121m72813m97937j000550m35054
14169B4098265k09246m73360o93673p06027j16524q02949j60766m57022l36007
14160B0142691k87855o22419n62005j13061l39849l69771m67432k81615k15878
14151A6882806l97744l49348j60259K5572o75456r7771n51438k38846J4829p27532
14141A3724813j47790k71798J63042l84519n92879m6147j11874j58789l86025
14132A1788034J14039Q8398o51752j36559J55980m02857l60379j55293K64575
14123A0704186k92909m29739j0847L4396k54721k28723j31776k75305Q5507j17269
14113I082800j82956l24881J11832k98904L88787m48604R1565l85663J82901k80498
$$ y = [30148472, 29745869, 28796161, 27990464, 27487740, 26504619, 26031806, 25533869, 24533319, 24098265, 23889019, 23415659, 22721986, 22015959, 21899435, 21096486, 20935720, 20478698, 20142691, 19854836, 19232417, 18670412, 18557351, 18217502, 17847731, 17380299, 17098684, 16882806, 16485062, 16135714, 15975455, 16001027, 15325571, 15227800, 14676362, 14437516, 14452345, 13724813, 13577023, 13305225, 13468267, 13083748, 12490869, 12444722, 12332848, 12174059, 11788034, 11902073, 11990471, 11338719, 11202160, 11358140, 10955283, 10594904, 10439611, 10704186, 10411277, 9981538, 9970691, 10005087, 9750366, 9521643, 9389867, 9114562, 9200069, 9082800, 8899844, 8574963, 8686795, 8387891, 8776678, 8328074, 8419639, 8033976, 8216877, 7936379]
14103G936379N6027k10264k79850o7446k10312K95191k35860p1349k44337j37104
14093F831075j92694K42876k30541k4781O0210p7429k62840l35829M25116k82953
14083F152210k14093K49899M3450n51310K76652j42665j82424r7801L07529K3330
14073E864777p28942j58737M10031l55882O07703k30641j83440o6171j67249N8120
14063E049569O6457l24341k46866l7047L68954k52203l10391J79800J12768j88105
14053D418595j29293q3871J26993m2944r3988L34507j86369n4293J73660r1522
14043D371475k80640O9070j27006O0362l1192m76928N17427l16051J55845p7446
14033C864916k40857K89978k73786j41107n9134K96849J4479l85231P7285K2811
$$ y = [7936379, 7992406, 7782142, 7502292, 7434846, 7224534, 7519725, 7283865, 7212516, 6968179, 6831075, 6638381, 6881257, 6650716, 6625935, 6686145, 6608716, 6345876, 6010047, 6435163, 6152210, 5938117, 6188016, 6231466, 5680156, 5956808, 5814143, 5631719, 5533918, 5841447, 5864777, 5135835, 4977098, 5387129, 5031247, 5638950, 5408309, 5224869, 5158698, 4991449, 5049569, 5116026, 4791685, 4544819, 4507772, 4876726, 4624523, 4314132, 4493932, 4606700, 4418595, 4289302, 4205431, 4332424, 4289480, 4195492, 4529999, 4343630, 4289337, 4462997, 4371475, 4090835, 4159905, 4032899, 4093261, 4062069, 3585141, 4102568, 3786517, 3942362, 3864916, 3624059, 3914037, 3640251, 3499144, 3440010, 3736859, 3751338, 3366107, 3443392, 3466203]
14023C466203r8151q7493M2509J52292k89885L5945O6992L0376j97944M2184p6213
14012C086815j94821P3246J26217j28649J70984r9914k68007j74761j09870L09863
14002B791103j77857j9287m16001O08094O3588l82641L35367j72541k26171O8344
13992B471998J98329k43781L9412k66878L48416n2285q7149K74334o63639O73851
13982B692608j7650J1900K998K66559K19485J59694P84380R08503K130863L450536
13972A0609876N839572R696219O978885j0160142p903407n124454k560546j722920
13964E653083m10492q54070n58877k15428q2281o19000J31013k9841k60337n18685
13954B235085N92576k96931j50081j32797K26942J668j13581k1542N1034q9523
$$ y = [3466203, 3368052, 3280559, 3323068, 3475360, 3185475, 3221420, 3288412, 3318788, 3120844, 3163028, 3086815, 2891994, 2965240, 3091457, 2962808, 3133792, 3033878, 2765871, 2591110, 2481240, 2791103, 2613246, 2593959, 2177958, 2786052, 2849640, 2466999, 2802366, 2629825, 2403654, 2471998, 2670327, 2426546, 2465958, 2199080, 2547496, 2495211, 2408062, 2682396, 2018757, 2692608, 2674958, 2686858, 2689856, 2956415, 3175900, 3335594, 4119974, 5028477, 7159340, 10609876, 16449448, 26145667, 33124552, 22964410, 15061003, 9936549, 7376003, 5653083, 5242591, 4388521, 3829644, 3614216, 3531935, 2912935, 3043948, 3014107, 2753770, 2235085, 2827661, 2530730, 2380649, 2247852, 2474794, 2476462, 2362881, 2341339, 2392373, 2302850]
13944B302850P7381k85709L8151K35202m82012J26176K1479j78230K73604m46753
13934A682139K55993l262k04826M58171l52779J00867M3377j29602j85040J97552
13924A862590q1483p2686K05451n3550j85694J38859k07646r993J42287r7285
13914A640850M8537j30905J98950m1180k46512L07543k98610L84181l57621R8923
13904A604156K79350m92412J01197r5977L87003J86128m65527L537J57701j13871
13894A551285k61258Q3580k9438P6084K52149k81521O3410K18595k03824k09586
13884A259476J48341k06472m2550M37152j92182j00454K38603j25231Q5369k26590
13874A275462O8759M85234k90456k55981K03849j85908k8405J82264j59351k01627
$$ y = [2302850, 2380231, 2094522, 2132673, 2367875, 1885863, 2012039, 2033518, 1855288, 2128892, 1682139, 1938132, 1934870, 1730044, 2188215, 1835436, 1936303, 1979680, 1850078, 1665038, 1862590, 1781107, 1708421, 1913872, 1860322, 1674628, 1813487, 1605841, 1595848, 1738135, 1640850, 1689387, 1558482, 1757432, 1716252, 1469740, 1777283, 1478673, 1862854, 1505233, 1604156, 1883506, 1391094, 1492291, 1396314, 1783317, 1969445, 1503918, 1507455, 1665156, 1551285, 1290027, 1373607, 1344169, 1420253, 1672402, 1390881, 1454291, 1672886, 1469062, 1259476, 1407817, 1201345, 1158795, 1595947, 1403765, 1303311, 1541914, 1416683, 1502052, 1275462, 1344221, 1829455, 1538999, 1283018, 1486867, 1300959, 1272554, 1454818, 1295467, 1093840]
13864A093840K68923J64654m18275K9981K61856m06667J19958J60160M3708k3242
13854A294896k86270Q5757J92038O2234j25818P5182j06528n2156l36117m2864
13844G60354R5710J71203L01673l58047L56434j98295r0200R2302k91220L6227
13834H76141K83747O7739n9517J4028j39241o5497j33545J68813j68610J60946
13824A005004O5186j68402J64382k65382O48087n96725P884J04156q7137n3078
13814H23975O1564J95712K43807J23252G17470K74438J6265L57590E29820K77351
13804H07171J91973J3147k78836L11128D42045K68182J32235j9364k59615L60652
13794I24135k3538l55236K05638j6870L16799m33995R1669Q3711J2272l7392q8706
$$ y = [1093840, 1362763, 1527417, 1109142, 1139123, 1400979, 994312, 1114270, 1274430, 1318138, 1294896, 1008626, 1094383, 1286421, 1348655, 1222837, 1298019, 1191491, 1139335, 803218, 760354, 856064, 1027267, 1328940, 970893, 1327327, 1129032, 1038832, 1131134, 839914, 876141, 1159888, 1227627, 1168110, 1182138, 1042897, 977400, 843855, 1012668, 844058, 1005004, 1070190, 901788, 1066170, 800788, 1448875, 852150, 860034, 964190, 877053, 823975, 885539, 1081251, 1325058, 1448310, 717470, 991908, 1008173, 1365763, 529820, 807171, 999144, 1012291, 733455, 1044583, 442045, 710227, 842462, 823098, 563483, 924135, 900597, 545361, 750999, 734129, 1050928, 616933, 708602, 792313, 804585, 767193, 678487]
13783F78487N774K15750k02706K03309k54587K54615m28100M15674k25591K03280
13773H65905j45794J80886j80292j71004K49808O7299M0255l25054L01589l73109
13763E10489J05578J88009k74283K0168R3526M27028k48477j78313n7650J6502
13753F02577K79585l30490K63024o494p6934j07666J38206j78071j87652K24737
13743F20822P2238k24212J30990k97329R0862K92436o0225L3821K26275l5702
13733H49976J03522m74347J26332J69761k84222K01185C42324K72137k86109O9539
13723C97891M69798l54485N8010N429r9997J3617L3483K32915Q4902l38059K42269
13712G45773k81351n855R3860j3691K1441j48571K98748J07729L5392j54168j82713
$$ y = [678487, 684261, 900011, 697305, 900614, 646027, 900642, 472542, 888216, 662625, 865905, 720111, 900997, 720705, 549701, 799509, 866808, 907063, 582009, 883598, 510489, 616067, 804076, 529793, 549961, 643487, 1070515, 822038, 643725, 586075, 602577, 882162, 551672, 814696, 808202, 731268, 623602, 761808, 583737, 396085, 620822, 693060, 468848, 599838, 302509, 393371, 685807, 625582, 659403, 885678, 849976, 953498, 479151, 605483, 775244, 491022, 692207, 342324, 614461, 328352, 397891, 867689, 513204, 571214, 576643, 476646, 490263, 523746, 756661, 841563, 503504, 745773, 464422, 458567, 552427, 538736, 560177, 411606, 710354, 818083, 853475, 699307, 516594]
13701E16594j1525K97702j11122j25754B35596J21807J53288J94674J35981l5049
13691H06297j62197J46336B11551K17211J05P3816L08207k42430J4117J7643l4428
13680E65792o7928J11346n6291j09812L66412A29622P48811m22188O0194K8760
13670E45199J16763n7243o4130j80834J92228m8982n2676J82982r5301k31905
13660C06101L05078B80513M20125k71479A07937K46690A66452K12530j11347K39478
13650E07113J45338q4967m7437A17776M52050R6834B41596L14954J79923B91145
13639F06992k28842R7303M5215n5282A30074N03218B36037M11121j88154J72333
13629F31337B52300M47153k11730r7815j41487L41802B82866L37751q1529j04694
$$ y = [516594, 505069, 802771, 691649, 565895, 235596, 357403, 510691, 705365, 841346, 806297, 644100, 790436, 211551, 428762, 428867, 502683, 810890, 568460, 582577, 600220, 565792, 497864, 609210, 552919, 443107, 809519, 129622, 878433, 456245, 516439, 545199, 661962, 604719, 540589, 359755, 551983, 503001, 450325, 633307, 538006, 306101, 611179, 280513, 700638, 429159, 107937, 354627, 166452, 378982, 267635, 507113, 652451, 567484, 520047, 117776, 569826, 666660, 241596, 556550, 736473, 291145, 606992, 378150, 475453, 520668, 465386, 130074, 633292, 236037, 647158, 459004, 631337, 252300, 699453, 487723, 389908, 248421, 590223, 282866, 620617, 539088, 434394]
13619D34394A20152J88755J00763R4380n1379j81807L62240j32768K11407l32534
13609C79209K5695M7563p347M4073B36128K9644R5944J95393j87580n4529K13193
13598E28193r8013j49429L25953j50622l2330Q1486j12633j70791J94909j28019
13588B88704J31633J76115B46806A11040L06723A41539J53769K9228L10895B68450
13577A71585L41038j19756m5559L4040N9725q3902F9335K99659m9554J80197j65521
13566C34116K13837A28469N41334p9957A11800M09917j85755k1818O233Q7221
13556D07598C1405M28898A92153B2208K9457J64551O0529K64088B38330j1656
13546B26674M01769K95947C92538J46950j66683J10793B00902J07048q5112o6385
$$ y = [434394, 120152, 308907, 409670, 504050, 452671, 270864, 633104, 500336, 711743, 379209, 404904, 452467, 445120, 489193, 236128, 265772, 361716, 557109, 369529, 315000, 528193, 430180, 280751, 606704, 456082, 423752, 505238, 392605, 221814, 416723, 288704, 420337, 596452, 246806, 111040, 417763, 141539, 295308, 324536, 635431, 268450, 171585, 512623, 392867, 347308, 381348, 441073, 357171, 69335, 368994, 319440, 499637, 334116, 547953, 128469, 669803, 589846, 111800, 521717, 335962, 314144, 320377, 407598, 31405, 460303, 192153, 22208, 51665, 216216, 276745, 540833, 238330, 226674, 628443, 924390, 392538, 539488, 372805, 483598, 200902, 307950, 222838, 156453]
13536A56453J28979J60769k07480L35171k09958o5124o4444J52898j1166j80233
13526A95865a59510C70987A19377L10541j86791A21034k0484Q7102N4332c9994
13515B21371J50918K47970k90188J80876k34700j9058K55089k06513F2934J65250
13505B28184G4132K31752K09757r2493J20442B37315A3690a67807b2397A51513
13494C91480A07942L13917A0792L05743k0236j29242L9224J00763K23935A97781
13483C4030J92945Q6142A17011O4855m6748o3357L04492F9902J70948C663J64286
13472A67949K31024n8530j0742j13759j02193K32136O6109A8279N62810B28565
13461A52785p008m3174L60469A00125d5994C17246J25680j84979q7510q0764Q8724
$$ y = [156453, 285432, 446201, 238721, 573892, 363934, 298810, 234366, 387264, 376098, 195865, -159510, 370987, 119377, 429918, 243127, 121034, 100550, 187652, 241984, -39994, 221371, 372289, 620259, 330071, 510947, 276247, 257189, 512278, 305765, 62934, 228184, 74132, 305884, 515641, 423148, 543590, 237315, 13690, -167807, -22397, 151513, 391480, 107942, 421859, 10792, 316535, 296299, 167057, 206281, 307044, 530979, 197781, 34030, 226975, 313117, 117011, 181866, 135118, 71761, 376253, 69902, 240850, 3663, 167949, 398973, 340443, 329701, 215942, 113749, 345885, 411994, 18279, 581089, 228565, 152785, 145777, 102603, 463072, 100125, -45994, 317246, 442926, 257947, 170437, 89673, 178397]
13450A78397o6686O2567K92710A05796n0557L84621B3747a7356D82454A32478
13439A94981q6189j7214l7447K20034g0273E32656g527B42523f7693A79102K35854
13428D14956A40932J19137D580L23731j54310p0758J68238F7994a5194B94745
13417B00223B1273L8939K31830j10963J59858j34236J29554A20158J33737Q8970
13407C42865A32624l36K44465b4118E45212B39580p3264J55979r2341r4392K60103
13396C95665j52809b53509C77030j57062b631B81412j11023K08705E7132a61700
13385G3998d9905k19554d1074a9113I9406j1545M02467j61468A16390J22966h7700
13373i5467A43446a927B00589J84129a56961A34136e5841k028C86987D3748K63475
$$ y = [178397, 111711, 174278, 466988, 105796, 55239, 439860, 23747, -17356, 482454, 132478, 194981, 108792, 91578, 54131, 274165, -70273, 532656, -7527, 242523, -67693, 179102, 414956, 140932, 260069, 4580, 328311, 174001, 103243, 271481, 67994, -15194, 294745, 200223, 21273, 60212, 292042, 181079, 340937, 206701, 336255, 120158, 253895, 342865, 132624, 132288, 376753, -24118, 545212, 239580, 166316, 322295, 229954, 135562, 395665, 242856, -253509, 377030, 219968, -2631, 281412, 170389, 379094, 57132, -161700, 73998, -49905, -269459, -41074, -19113, 99406, 87861, 490328, 328860, 116390, 239356, -87700, -95467, 143446, -1927, 200589, 384718, -156961, 134136, -55841, -57869, 386987, 43748, 307223]
13362C07223C4860J73759K61060r4657L05665l12769o4028k0631A20974J17632
13352B38606o0858K46168A30561O7903M66338a1997B26254K3699a23858C20724
13341A2325L10941I5003K16309H6408N2815K48855D3079K39555J0140O1803I2998
13329E77715B42574M0028r5170J77452p4143R5550j55723J4378j07495o6803R4503
13318A65151e8998A88756F7861L490J1969a4774n3622D84421H4270J10437D0052
13306F7130L56787j79804j01631J47452g3669B61524k2834k5713J61442A64119
13295E3823b7177C63105r6706h306A55244F8483A1036f7593F214a45962D19340
13283B88038M2283K7062a0464h10F1853J09074E4537J06319J49658a4283j64989
$$ y = [307223, 34860, 208619, 469679, 375022, 680687, 367918, 303890, 283259, 120974, 238606, 177748, 423916, 130561, 198464, 664802, -11997, 226254, 249953, -123858, 320724, 12325, 323266, 95003, 311312, 86408, 139223, 388078, 43079, 282634, 292774, 354577, 92998, 577715, 242574, 282602, 187432, 364884, 290741, 386291, 230568, 244946, 137451, 70648, 165151, -58998, 188756, 67861, 71351, 83320, -14774, -68396, 484421, 84270, 194707, 40052, 67130, 423917, 244113, 142482, 289934, -73669, 261524, 238690, 212977, 374419, 164119, 53823, -27177, 363105, 266399, -8306, 155244, 68483, 11036, -67593, 6214, -145962, 419340, 288038, 330321, 357383, -10464, -810, 61853, 170927, 54537, 160856, 310514, -14283, -179272]
13272a79272A42370L3834K91687D9829a66850E44575A69228k8053E6484J83180
13262B39664a01284D57890A90097K97109a14894C64423A39581e5659B84932A16019
13251A74232A9609K68850b71047H3416B9410F431J69088K16068j52376i196A21025
13239B35224C0874E739L41296k7834R2599j93344l2816J46525b78522A50620b10649
13227A55113M9750J07486o4051N60j2804L6057A6521R3676J62449K7842e0584
13215A83113n8778D5665P9591J32246n1760a28758C15583Q3074P7610B07744n2136
13204A55608F4900L6665O2711a31794A83770H9170e6525n8764D69J34771J99233
13193C34473E1489a25747I7491g1138k56341N6669K5020H9009a07825A45035c1892
$$ y = [-179272, 142370, 176204, 467891, 49829, -166850, 544575, 169228, 141175, 56484, 239664, -101284, 457890, 190097, 487206, -114894, 364423, 139581, -55659, 284932, 116019, 174232, 19609, 288459, -271047, 83416, 29410, 6431, 175519, 391587, 239211, -9196, 121025, 235224, 30874, 5739, 347035, 319201, 411800, 218456, 185640, 332165, -278522, 150620, -210649, 155113, 204863, 312349, 248298, 248858, 236054, 272111, 16521, 110197, 272646, 300488, -50584, 183113, 124335, 45665, 125256, 257502, 205742, -128758, 315583, 398657, 476267, 207744, 155608, 64900, 101565, 164276, -131794, 183770, 89170, -56525, -115289, 469, 135240, 334473, 51489, -125747, 97491, -71138, -327479, -270810, -245790, 89009, -107825, 145035, -31892]
13181B35432f0503a576A11751a64617K1507A92186o7597b37985A64399J68705
13171C33104h105A6716i6349A43216F1382b74516a901B52J16272l6063R8356h7512
13158G0256P3589B8711J00547K69602a39514A53545O1242k7660f1976p926d757
13146a99033A53113n0703J14605J89377R1743I7501G6a38864D0780K22986b4122
13134B3487P003J16712m8472J35528I3822m6501O7255f0368j09722B08843r3296
13123A15547e1472A60187p2265j7754p489j0006J92193n3338a14117C09078c02933
13111B2015K9399R7597J32808d9550D23782c21948c1065j17838B18922a4815k658
13100a7473A83004A4886a27146j60547A34346B735a04626C6688Q2311e1376B91190
$$ y = [235432, -60503, -1576, 111751, -164617, -143110, 192186, 124589, -237985, 164399, 333104, -8105, 16716, -96349, 143216, 61382, -274516, -1901, 252, 116524, 80461, 178817, -87512, 70256, 143845, 28711, 129258, 398860, -139514, 153545, 214787, 187127, -61976, -69902, -4757, -199033, 153113, 102410, 217015, 406392, 498135, 97501, 76, -138864, 40780, 263766, -24122, 23487, 30490, 147202, 98730, 234258, 93822, 47321, 114576, -60368, -170090, 208843, 115547, -51472, 160187, 87922, 70168, 62679, 52673, 244866, 191528, -114117, 309078, -302933, 22015, 51414, 149011, 281819, -49550, 423782, -321948, -31065, -148903, 218922, -14815, -17473, 183004, 14886, -127146, -287693, 134346, 2735, -104626, 36688, 118999, -51376, 291190]
13088g718A95712d2609I4884h5097B09592a97200O389k17521A37664A0948L84805
13077C95753a89741A95170a89686K1906b7614I3564J11891i6668j24751A19351
13066b26187C7518b25651F3784b37011B63325A5228h6760B2848J2636a07551C09864
13054B19525a20325A02433C2753c38028a64072C41492A53023d8864A14487a37774
13043B10898j02855e3604p757k21453c2414D01638A96827k4402P1787N1814A01503
13031A34503K943e42037D67646a92287C71146j27378r9378F329K51755h0023j87024
13020b67047A56989i09r3194H6798b9829B57858J60937E0936c2694B2447K33300
13009B55747A16893J25457G7890K10886k3323a58239B87003r9861c40356B14981
$$ y = [-7718, 195712, -42609, 94884, -85097, 209592, -197200, -190811, -408332, 137664, 10948, 395753, -189741, 195170, -189686, -167780, -27614, 93564, 205455, -96668, -221419, 119351, -226187, 37518, -225651, 63784, -237011, 263325, 15228, -86760, 22848, 35484, -107551, 309864, 219525, -120325, 102433, 32753, -338028, -164072, 341492, 153023, -48864, 114487, -137774, 210898, 108043, -53604, -61361, -282814, -32414, 401638, 196827, 172425, 244212, 296026, 101503, 134503, 137446, -542037, 467646, -192287, 371146, 243768, 144390, 6329, 258084, -80023, -267047, 156989, -909, -94103, 86798, -29829, 257858, 418795, 50936, -32694, 22447, 255747, 116893, 242350, 77890, 288776, 265453, -158239, 287003, 187142, -340356, 214981]
12998a54930a3563A13773J55078A02608E0075M27711g0177A18276R8388b48697
12987B85065a23675d6455B73246g378K650F770j314J12615g0415A68442a63552
12975A63827n1716D1722J0371l928R9662g1683j524C22212b4440q034G9035l4232
12963D4803e4938A29479j6358L82003D0093c2246j49439E12657B08598b5526m7069
12952g2595B0097a2363l84903G4032r499J11960m2093J99629a66296d1460D81145
12940C1319K60468f6025A06719j8372J17957J52393m0281c47928N6098C6992K9557
12929F6549a04477C4636g7021C63156m4513i2834A32687a59215A05914a01508
12918a93810G2314K4774b54934B65786a4383B01975C3665a0862j0106A74765K3150
$$ y = [-154930, -13563, 113773, 268851, 102608, 50075, 477786, -70177, 118276, 216664, -248697, 285065, -123675, -46455, 273246, -7378, -4728, 6770, 5456, 118071, -70415, 168442, -163552, 163827, 112111, 41722, 52093, 48165, 147827, -71683, -73207, 322212, -24440, -32474, 79035, 44803, -54938, 129479, 113121, 495124, 40093, -32246, -181685, 512657, 208598, -25526, -72595, 20097, -12363, -397266, 74032, 64533, 176493, 134400, 334029, -166296, -41460, 481145, 31319, 291787, -66025, 106719, 88347, 206304, 358697, 318416, -347928, -291830, 36992, 66549, -104477, 34636, -77021, 363156, 318643, -92834, 132687, -159215, 105914, -101508, -193810, 72314, 97088, -254934, 265786, -14383, 201975, 33665, -10862, -20968, 174765, 197915]
12907A97915a69147A44843B0969P1346a88671A30212J18122A4130d490I4b02632
12895i8451D2366K7153L1356b6858l40452a53003A64883j9787J69181F5039K53901
12884C18940A23066D5713J49379c8195B25416I6418b05542A88221a31818f1908
12873a09748j22813a8075H0157J03511m9132a32100G4681b71069f6727b6885j8088
12862d4973B91101B0653b14823f3781j62160B29964h1662A97783a28676j5428
12852a44104A09866b09055m0078A33141b6890E1555L39202b53784B70987i42l0169
12841c1111k56516F1011J05634a43546J9154m6028L0172p2307j0621B8956L5130
12830F4086C611d1589o6163a2759A20569M9816c2905p9011p3507a7264l23247
$$ y = [197915, -169147, 144843, 20969, 92315, -188671, 130212, 248334, 14130, -4490, 94, -202632, -98451, 42366, 69519, 100875, -26858, -367310, -153003, 164883, 145096, 314277, 65039, 318940, 123066, 45713, 195092, -38195, 225416, 96418, -205542, 188221, -131818, -61908, -109748, -232561, -18075, 80157, 183668, 134536, -132100, 74681, -271069, -66727, -26885, -44973, 291101, 20653, -214823, -63781, -225941, 229964, -81662, 197783, -128676, -144104, 109866, -209055, -249133, 133141, -26890, 51555, 390757, -253784, 270987, -942, -31111, -287627, 61011, 166645, -143546, -124392, -170420, -140248, -212555, -223176, 28956, 64086, 3611, -41589, -107752, -12759, 120569, 170385, -32905, -111916, -185423, -17264, -340511]
12819c40511M8836A23306J50035n9253I1767J46787e1192A27737D6495a11251
12808A77877N6637F4357c9461n0468j70949g2417D529K81346a909F8277L07213
12797C75490m3247a65034M5962C7214b22293k9634H6853L02543A4211h9770j5407
12786a05177L8660G6813a54462A19391Q847b21109k87521E5231J67963a09977
12775B26744A02463R8966G5498L3668a1035B4639J49376a16415H2201g9347k9066
12764a08413B27101O9792a72670j2872E08779c93449A2917M29829H0412a77661
12753a24595j48292E9058H923f5839P314A40073G138i7543C64b1915k48232o804
12741b76951F9682A2851J38756n6066a28920G5088O7574B5370J71782b10725a1927
$$ y = [-340511, -291675, 123306, 273341, 214088, 91767, 238554, -51192, 127737, 46495, -111251, 177877, 234514, 64357, -39461, -89929, -260878, -72417, 4529, 285875, -1909, 68277, 375490, 332243, -165034, -119072, 37214, -222293, -251927, 86853, 389396, 14211, -89770, -105177, -66517, 76813, -154462, 119391, 128238, -221109, -508630, 55231, 223194, -109977, 226744, 102463, 201429, 75498, 109166, -11035, 24639, 174015, -116415, 82201, -79347, -108413, 227101, 296893, -172670, -185542, 508779, -393449, 12917, 442746, 80412, -177661, -124595, -272887, 59058, 8923, -65839, -58525, 140073, 7138, -97543, 364, -21915, -270147, -276951, 69682, 12851, 151607, 95541, -128920, 75088, 142662, 25370, 197152, -210725, -11927]
12729A99692E3223k1282K27911h4674K4179C63859j1292a69447A45127m410b1761
12717C454J11406a55245C19855i5508M5666A70057N4011D4721a92477c7571m4328
12706h1899f210r4183A51728o0693i4184B44730i6921C07165C3724a63147e8340
12694D0306J84691J5153J50996b3401A49837K28768f0130A4187N4824h4160k4097
12683a08257A53980h5420G3038k5574a89928c7769l0663o4293J9331E4663b31657
12671A10456b07178A4915a70351P1620G0831O1219d5875a6031A32045M8082m5153
12660A34974F1970g3088I9028C7308J29884a08727A11955b52316M6995I7889e2202
12648C04636h7144L2067J4874A20605L5036a63051A49864L21983b3821F7948J39679
$$ y = [199692, 53223, 31941, 259852, -84674, -60495, 363859, 352567, -169447, 145127, 140717, -21761, 3454, 114860, -155245, 319855, -95508, -49842, 170057, 224068, 44721, -192477, -37571, -81899, -6210, -100393, 151728, 91035, -94184, 244730, -96921, 307165, 33724, -163147, -58340, 40306, 224997, 240150, 391146, -23401, 149837, 378605, -60130, 14187, 69011, -84160, -108257, 153980, -85420, 73038, 47464, -189928, -37769, -68432, -132725, -113394, 54663, -231657, 110456, -207178, 14915, -170351, -98731, 70831, 132050, -45875, -16031, 132045, 180127, 134974, 61970, -73088, 99028, 37308, 167192, -108727, 111955, -252316, -205321, 97889, -52202, 304636, -87144, -55077, -40203, 120605, 155641, -163051, 149864, 471847, -23821, 67948, 207627]
12637B07627H0674L82539e1628m2796D2591a55295B95318j29603J58897j42822
12627A81790p2142K7179Q3413J7039p1859E0150a25107N3995A03074g4422B51747
12615B74691j25491K72288c5707A64233M7307J74502I6377K26660o9717k496G7385
12603B17477a16564g45q570C39207F5482b7586k53121b2354j20061A91586H5452
12591h0082A83670c5203A11137D9029J66623b96526G0704g5714L5818j9067b0357
12579A01549K8507D4747b69817A67714d325j93919d0003B0895i1587A7965J18870
12568A36835o741n8616a14867B46958C8773K49259a53284B13573O9493j30038
12558A53028a13643A96743b44176A1559b43039C1305n344J11115m9721a79123
$$ y = [207627, 80674, 463213, -51628, -94424, 42591, -155295, 295318, 165715, 324612, 181790, 109648, 136827, 220240, 237279, 165420, 50150, -125107, -71112, 103074, -74422, 251747, 274691, 149200, 421488, -35707, 164233, 211540, 386042, 96377, 323037, 253320, 250824, 77385, 217477, -116564, -745, -9315, 339207, 65482, -27586, -280707, -22354, -142415, 191586, 85452, -80082, 183670, -35203, 111137, 49029, 215652, -296526, 70704, -75714, -39896, -58963, -20357, 101549, 130056, 44747, -269817, 167714, -4325, -198244, -40003, 20895, -91587, 17965, 136835, 130094, 71478, -114867, 246958, 38773, 288032, -153284, 213573, 283066, 153028, -113643, 196743, -244176, 11559, -243039, 31305, 25961, 137076, 87355, -179123]
12547I4950a21692B54391c8844C1513K0795b32523P3343K7584A67584m3098a07921
12535a50720B18001b15741B30941c30934a43186C6002a2987A68734a31201p4642
12525b05843G1684h5044k35560K3650A59906a71168A03653a37412B1283c47197
12514h4879n7876I4327e528k56518h2322B07694A9604H960J12678d8578A37992
12502c7368k66067h8059C15519a99182j6326m2994a14137k718B32874a24037J3456
12491a10581C1858e2016A0239N9440b14167A9901J5095M8163c6242E5295b68254
12479c36433a48134C7613N9844C7395b92697L5629h0621j92418L8399G8450M0184
12468A18634b412C4740b82677n6257g7276n5249j5026k6567A05298c7380p2863
$$ y = [94950, -121692, 254391, -38844, 31513, 52308, -232523, -159180, -131596, 167584, 124486, -107921, -150720, 218001, -215741, 230941, -330934, -143186, 36002, -12987, 168734, -131201, -205843, 71684, -85044, -320604, -296954, 159906, -171168, 103653, -137412, 21283, -347197, -84879, -142755, 94327, -5528, -262046, -82322, 207694, 19604, 8960, 121638, -48578, 137992, -37368, -303435, -88059, 315519, -199182, -215508, -258502, -114137, -116855, 232874, -124037, -110581, 31858, -52016, 10239, 69679, -214167, 19901, 34996, 83159, -36242, 55295, -268254, -336433, -148134, 37613, 97457, 37395, -292697, -257068, -80621, -273039, -234640, 78450, 118634, -2412, 34740, -282677, -338934, -77276, -132525, -147551, -174118, 105298, -37380, -110243]
12457a10243E8242b3339J28k1929k13311A62087i4187M6328A4497K1994J10884
12446A47375f2645r929j22603h4299I6059d5355J6909n8660p6408N9936A27578
12434a23423j43174M5054d4033l9764D12104a04965A72291h0642J392A28298a62976
12422c12712a21559A25828a09744j89157B42386J26400a58010K2428j71444A05478
12411i4732J0096C9392J13893c3389j8689j48323R0600A13368a23944n41D1630
12399B41819d8681p6409B11574b9207A41167D9997J8879A1577J54050f8444m8552
12388a16996E2039F781a07981d1596k30904J19763A08305o21h4152A4876J49939
12377A64815p6697j2533a56754B26425P600M00357b72926H0032j5693P6232D3175
$$ y = [-110243, 58242, -23339, -23211, -45140, -258451, 162087, -94187, -47859, 14497, 36491, 147375, -62645, -72574, -195177, -84299, 96059, -45355, -28446, -87106, -163514, -103578, 127578, -123423, -266597, -221543, -44033, -83797, 412104, -104965, 172291, -80642, -79250, 128298, -162976, -312712, -121559, 125828, -109744, -298901, 242386, 368786, -158010, -135582, -307026, 105478, -94732, -84636, 39392, 153285, -33389, -52078, -200401, -109801, 113368, -123944, -124485, 41630, 241819, -48681, -125090, 211574, -29207, 141167, 49997, 68876, 11577, 165627, -68444, -116996, 52039, 6781, -107981, -41596, -272500, -152737, 108305, 107684, -84152, 14876, 164815, 88118, 75585, -156754, 226425, 234025, 634382, -272926, 80032, 64339, 140571, 43175]
12365H2936J84757j32752R5701a66671G4589Q2944K12669c5367A40802R6691p1170
12354A66323a31846j14794P5373A61819a32482N4673A62207n1638b10546H3599
12343d3272k26352j09818g2394b6364k31767B66390a79408P7864J1430O883C3262
12331A01893D9173f5650f359j97387R7724B90370j11674k7989M1228r0911k9018
12320G2006h648A79569J21678l5152j17581M8866C9736b7417F8430K64736r5674
12309B37492I4327K8696l9049Q3431R2676F6460b7500H5217C3282J86807j09712
12298A10377K98328n6825p3845L18623a35658j4143m5580e7537b3240A10977E1194
12286c52410a51373K5611E2477a41953B69332f7961A78221p9118J53966a157C74280
$$ y = [82936, 267693, 134941, 230642, -166671, 74589, 157533, 370202, -35367, 140802, 237493, 166323, -131846, -246640, -171267, 161819, -132482, -77809, 162207, 110569, -210546, 83599, -43272, -269624, -379442, -72394, -26364, -258131, 266390, -179408, -101544, -90114, -83231, 33262, 101893, 49173, -65650, -6359, -203746, -106022, 290370, 178696, 150707, 191935, 101024, 72006, -8648, 179569, 301247, 266095, 148514, 197380, 39736, -27417, 68430, 333166, 237492, 94327, 123023, 83974, 167405, 260081, 66460, -27500, 85217, 33282, 220089, 110377, 408705, 351880, 278035, 596658, -135658, -149801, -195381, -57537, -23240, 110977, 51194, -352410, -151373, -125762, 52477, -141953, 269332, -67961, 178221, 99103, 253069, -1157, 374280]
12274a23666q3695i5378C49621A61455d5430k3675C67144H9412K14328g1092C80833
12262A08089M3526P9404k8681p0210e00F5063J79772a83494R1260a8323A13678
12250B66667G4613J79558J95801q135j46087K1154B199J49763a36025c0603B91531
12238A83445e1305C66178A12374R5155A3223K78938h6235K0313A92766o8743a97741
12226A83770b64071B17980G2870b59152A26816K26923b72034g7253K6450k8905
12216g9708B05490f6432A53312E8817L2963J10057N6366B3820b13972E05348a15764
12204b95398C08599J32567j40625a01362A81224b10438f1639C89927a12408K1881
12194i0527C0475L621a43884O7108B17767K67861B31829F5155J94601K48876R9878
$$ y = [-123666, -207361, -95378, 349621, 161455, -45430, -69105, 367144, 89412, 303740, -71092, 380833, 108089, 151615, 231019, 202338, 132128, -500, 65063, 244835, -183494, -92234, -18323, 113678, 266667, 74613, 254171, 449972, 441837, 295750, 316904, 2199, 151962, -136025, -30603, 291531, 183445, -51305, 366178, 112374, 207529, 13223, 292161, -86235, -65922, 192766, 124023, -197741, 183770, -264071, 217980, 72870, -259152, 126816, 353739, -272034, -77253, -50803, -79708, 205490, -66432, 153312, 58817, 91780, 201837, 258203, 23820, -213972, 505348, -115764, -295398, 308599, 441166, 300541, -101362, 181224, -210438, -61639, 389927, -112408, -90527, 30475, 34096, -143884, -76776, 217767, 485628, 231829, 65155, 259756, 508632, 608510]
12183F08510H3997R4855m9647J36907h516A47823L7249E9693j9892J00625D4947
12171A4044a46435E973e7904j06861F455J96086F946Q8827J91476B429K71809
12160B74238K85487a47462j1843A08425P9882F4657l654B0879M28822l5689A77501
12148C63364H1794M8109L2786K89241A5146L92138A31553K3722K19668I3391M2626
12137A36017a40322j46702a37124A73247P9072j01668m7844j5423a92249Q4444
12127a07805D506f5071C988J28980R7377A15143Q8695H7286c6965j90616B55505
12115A54027m1820b21178a6729j69487h1739o7050B9771a17791A71438a50178
12104B61405H4206J95789p2058b9625A68868q072m3307B1532c6762H8388J48504
$$ y = [608510, 83997, 178852, 129205, 266112, -8516, 147823, 185072, 59693, 39801, 140426, 44947, 14044, -146435, 5973, -57904, -164765, 6455, 202541, 6946, 95773, 287249, 2429, 274238, 559725, -147462, -159305, 108425, 188307, 64657, 61003, 20879, 449701, 414012, 177501, 363364, 81794, 129903, 162689, 451930, 15146, 407284, 131553, 155275, 374943, 93391, 136017, -140322, -287024, -137124, 173247, 252319, 150651, 102807, 87384, -192249, -107805, 4506, -65071, 3988, 132968, 230345, 115143, 203838, 87286, -36965, -227581, 255505, 154027, 112207, -221178, -16729, -186216, -81739, -148789, 29771, -117791, 171438, -150178, 261405, 84206, 279995, 207937, -29625, 168868, 160796, 117489, 21532, -36762, 88388, 236892]
12093B36892J88943E1093a52954H3857i3384g198j80152C55055j7158r2603a87818
12081C27277I980K7434J14995L53006a47826j80059A01385g3162A20069J42551
12071B62620j20839K98041B03946F7360J55924b16921A109L27593d69646g3895
12060A08805J00124O7262o1015C2330K21765m3665q8284R7406k0866o4058M0583
12049A75211F0442a30012b4366H8721J97079r8134l165g0666D1345E119b91467
12037C07123b0945k30910P8434C09400p7783i5250n8340k6817D20181A59063k5051
12026A34012a39966C2775b68681e94C7443L0983I694K22362c80997a37870D7887
12014E4085c53567a55050P2360F2555b15342A77913p7183b75203F9958l2785J99773
$$ y = [236892, 425835, 51093, -152954, 83857, -93384, -7198, -187350, 355055, 337897, 245294, -187818, 327277, 9980, 37414, 152409, 505415, -147826, -327885, 101385, -73162, 120069, 262620, 141781, 439822, 203946, 67360, 223284, -216921, 1109, 328702, -469646, -73895, 108805, 208929, 276191, 215176, 32330, 254095, 210430, 122146, 219552, 198686, 134628, 175211, 60442, -130012, -24366, 88721, 285800, 187666, 184501, -70666, 41345, 5119, -291467, 307123, -20945, -251855, -173421, 309400, 231617, -95250, -153590, -180407, 420181, 159063, 134012, -139966, 32775, -268681, -594, 37443, 68426, 9694, 232056, -380997, -137870, 47887, 54085, -353567, -155050, -82690, 62555, -215342, 177913, 100730, -275203, 69958, 37173, 236946]
12003B36946J14313j33093J00781h8594a2148n3399l2036A94828J74678F1228
11992I9867J45054d4757C98793A75471a85281m7788A30191i1745A13325J04976
11982B18301b08729b9528j21785D0624J24123n4694B3855a30644N3025B71700
11971I951e666j64537E1254q685a40069n7870A83026n7422Q0750b2810A51336
11959d4646B57299a9348A1911c4735j10516A06491D5739p663M5379J8893D4176
11947b07918h788j18651e0672B84079G8758a45178c0724m1627C59075b21632B20049
11935d8145j53721j41168a48448B45706h5569k0718r0335j63152B48252b38637
11924G485a34575c9287j34363A94084b00992G6626a09281J9263M2409B32889H2260
$$ y = [236946, 351259, 218166, 318947, -88594, -12148, -65547, -97583, 194828, 369506, 61228, 99867, 244921, -44757, 398793, 175471, -185281, -233069, 130191, -91745, 113325, 218301, -208729, -29528, -151313, 40624, 164747, 110053, 23855, -130644, -77619, 271700, 9951, -5666, -170203, 51254, 42569, -140069, -197939, 183026, 125604, 206354, -22810, 151336, -44646, 257299, -19348, 11911, -34735, -145251, 106491, 45739, 38076, 83455, 102348, 44176, -207918, -8788, -127439, -50672, 284079, 78758, -145178, -30724, -72351, 359075, -221632, 220049, -48145, -201866, -343034, -148448, 245706, -85569, -106287, -196622, -359774, 248252, -238637, 7485, -134575, -39287, -173650, 194084, -200992, 76626, -109281, -90018, -47609, 232889, 82260]
11912A35985b91550Q614e2219r9504H7966J5724a543D2115a21087k34273D4816
11900E4369A4084a74002n639B22330m6452a13022A67100c5853A99632a16250J1566
11889a04684j96282c3140k0388G3534Q3994o8908B5725J24046f3433A39795h910
11877A54129C2183K5119k6277J44010h0498F3906c44122f867j23050d3135A73960
11865a20461e4163G083h6793l44863A95501g6897D5085A3000P7465O3401n7693
11854I6173m7241L6594C4629b9745j64646H2345a94460p7883J32112O43C8778
11842a5281j10301B3902J95828a9724A40916k3096c16350p1251d8025A56099d2185
11830A85856a36817e0294q2477m9243E1368b59213F4748a78796Q8202r8207A15156
$$ y = [135985, -291550, -282936, -52219, -151723, 87966, 103690, -1543, 42115, -121087, -355360, 44816, 54369, 14084, -174002, -179641, 222330, 175878, -113022, 167100, -35853, 199632, -116250, -104684, -300966, -33140, -53528, 73534, 157528, 88620, 25725, 149771, -63433, 139795, -8910, 154129, 32183, 57302, 31025, 175035, -80498, 63906, -344122, -6867, -129917, -43135, 173960, -120461, -54163, 7083, -86793, -431656, 195501, -76897, 45085, 13000, 90465, 153866, 96173, 48932, 85526, 34629, -29745, -194391, 82345, -194460, -272343, -140231, -139588, 38778, -15281, -125582, 23902, 219730, -19724, 140916, 117820, -316350, -387601, -48025, 156099, -42185, 185856, -136817, -50294, -132771, -182014, 51368, -259213, 64748, -178796, -90594, -188801, 115156]
11818a7008B37496J70915a80720b182A67747c44624D08688H5366a08455L0467
11808g7988l052r1183j54924h5500l3607j1910A14829b01594B69776i8154C411
11796b75294A20205a0750B096J65841D7481i7016k3089l7751n5079D1613J07801
11785A49414e4544c21B47413b52337N6878E3325f6202B79852r1100A2185J29087
11774A41272C7300J23323D3734M5376a33171H531d49593e9707k04110Q1562k436
11763a84691E9799O6696J24165g0634B8960J81050B5978g4515C8508a72882K7603
11752a45279D72586e127B6068a58880K4798C0511O3660c6206A24591N3426B6719
11740a99329i2809A67657f7368A88891B192a19024L9370M781G7283a52717j19549
$$ y = [-17008, 237496, 408411, -180720, -2182, 167747, -344624, 408688, 85366, -108455, -77988, -81040, -172223, -327147, -85500, -119107, -131017, 114829, -201594, 269776, -98154, 3411, -275294, 120205, -10750, 2096, 167937, 47481, -97016, -120105, -157856, -212935, 41613, 149414, -54544, -321, 247413, -252337, -195459, 53325, -66202, 279852, 188752, 12185, 141272, 37300, 160623, 43734, 89110, -133171, 8531, -449593, -59707, -263817, -182255, -184691, 59799, 126495, 250660, -70634, 28960, 210010, 25978, -74515, 38508, -172882, -145279, 472586, -5127, 26068, -158880, -134082, 30511, 94171, -36206, 124591, 178017, 26719, -199329, -92809, 167657, -67368, 188891, 2192, -119024, -79654, -74873, 77283, -152717, -272266]
11729b72266j45595A68484g4359B28029d05215a07925j1193D7890L5907d0146
11718A29297b1007j33766A16868b02563C4620R8801d40360H6793C2862h5111K856
11707h2255E628k562J69932J63331E0314a44761A89630J38195a20804L3675A40858
11695a78869H0414e8409n5421B2663b81909a12015A48778l7779c41140a6926k06578
11684b23504A2967J34419A4016K37858a43216A63484J47863G9602c85606Q6982
11674b98624J30076C00371a81439f1388M242J1429A9693g2414C7360N8296f7875
11662A45329P2914E1388f0482Q222B42435E3310f8754E3908a07402e1049b1266
11650a09525A10283b69026B44171g2708I1663n386b22028A41483f0363B38661
$$ y = [-272266, -417861, 168484, -74359, 228029, -405215, -107925, -119118, 47890, 83797, -40146, 129297, -21007, -154773, 116868, -202563, 34620, 133421, -440360, 86793, 32862, -85111, -82255, 5628, 3066, 172998, 336329, 50314, -144761, 189630, 327825, -120804, -87129, 140858, -178869, 80414, -58409, -113830, 22663, -281909, -112015, 148778, 110999, -341140, -16926, -223504, 12967, 147386, 14016, 251874, -143216, 163484, 311347, 79602, -385606, -298624, -168548, 300371, -181439, -61388, -57146, -45717, 19693, -72414, 37360, 95656, -67875, 145329, 218243, 51388, -60482, -52260, 242435, 53310, -68754, 53908, -107402, -51049, -21266, -109525, 110283, -269026, 244171, -72708, 91663, 86277, -222028, 141483, -60363, 238661]
11639a76289B5779c3841B95439g1005k01194f172l61824a920r3563C1276P7934
11628A09210e5641J10C32172E3482A7157J55437c6797A75223J1129B8292a38480
11616B12029A1068J00460d20139a97001f1229D0868Q1089j6253J52647A09838
11605D4395J12679b16072n2329f7782B64576c4792j24617A16574f5895A65895
11594C20797c07007E0101i8992H3189h8396A17416g8832b5679j4371C30897A25818
11582A86189a13194F527a09038C96122A51203a02059j13444e6866j30322A31520
11571b46081O4900K6276B7450N9566N9441l0072J19478i5193H8013O9818f8318
11559f1437J0041J6476I763b364B33486a62554A71447f4035C30734r9259d4464
$$ y = [-176289, 25779, -33841, 295439, -71005, -272199, -6172, -367996, -1920, -95483, 31276, 109210, -55641, -55531, 332172, 53482, 17157, 172594, -36797, 175223, 186352, 28292, -138480, 212029, 11068, 111528, -420139, -197001, -61229, 40868, 121957, 105704, 258351, 109838, 44395, 157074, -216072, -268401, -67782, 264576, -34792, -159409, 116574, -65895, 165895, 320797, -307007, 50101, -98992, 83189, -88396, 117416, -78832, -25679, -40050, 330897, 125818, 186189, -113194, 6527, -109038, 396122, 151203, -102059, -215503, -56866, -187188, 131520, -246081, -181181, -154905, 27450, 87016, 146457, 116385, 235863, -95193, 88013, 157831, -68318, -61437, -51396, -34920, 9763, -2364, 233486, -162554, 171447, -64035, 330734, 231475, -44464]
11547A42205L4419Q0389A21716h4249H0487L42276D7603i7259j93500a33546G7001
11535a01597l2916k5120h102j19593B32813f1573j02871A43613M5535K53015j73777
11524B68386D3174a45983k3092L4456F7337j3708h2777C4590M6221h4475j8449
11513a02924B17852A3847Q0938a5013j17345M3571O411j55367J10714e1461H0352
11501C16387j25177K1484A05370b4072A61184e6194B85225q3178A067R861i3366
11489a95623A93585a28205b4632j14901L0919A78811P8463G0110O8522K06276
11479C44908H8299R0839E0655M92578c04533A6333J54508D8315L9482A617J44773
11468A46390k0875l890K58202d02108B73664r421F3045a08099B50815H1887P2431
$$ y = [142205, 176624, 257013, 121716, -84249, 80487, 422763, 47603, -97259, -290759, -133546, 77001, -101597, -134513, -159633, -8102, -127695, 232813, -61573, -164444, 143613, 189148, 442163, 268386, 43174, -145983, -169075, -134619, 67337, 53629, -82777, 34590, 80811, -84475, -102924, 217852, 13847, 94785, -15013, -132358, -88787, -82376, -237743, -127029, -51461, 80352, 316387, 191210, 212694, 105370, -24072, 161184, -56194, 285225, 202047, 1067, 10928, -93366, -195623, 193585, -128205, -24632, -139533, -108614, 178811, 257274, 70110, 138632, 344908, 88299, 179138, 50655, 543233, -304533, 16333, 170841, 48315, 87797, 1617, 146390, 125515, 121625, 379827, -402108, 273664, 264243, 63045, -108099, 250815, 81887, 154318]
11457A54318k1179h5914A32814L5609B2814L74432L0617j99531a16768c3072A92823
11445b9434B28988A04609k6052K50184j04651F3497J57130k7763j4733J47077
11435C25208H7745k4367J04826m5282K3114d7868B08370k3313M88758a19263B66896
11423D1898j5315J75433F6357a70139F5884J9911c1364C22655b2359A41390Q8235
11412B29625i9511I1516D1684J67113a27814f0806l7401j99757J45177a692o7948
11401f9640B22277A05134f3508A41955D6197a04741A4408d4438o7927c2802A43222
11389F6274h3629G8489i9943K4919k18357B093b66680g6532r5140A39834f3168
11377B17407G3130b24761C79025a7173A90197e5387J7901A1646a68741j82982
$$ y = [154318, 133139, -85914, 132814, 168423, 22814, 397246, 427863, 228332, -116768, -33072, 192823, -29434, 228988, 104609, 78557, 328741, 224090, 63497, 220627, 192864, 178131, 325208, 87745, 63378, 168204, 122922, 146036, -47868, 208370, 185057, 673815, -119263, 266896, 41898, 26583, 202016, 66357, -170139, 65884, 85795, -31364, 322655, -22359, 141390, 229625, -99511, 91516, 41684, 208797, -127814, -60806, -98207, -297964, -152787, -1692, -69640, 222277, 105134, -63508, 141955, 46197, -104741, 14408, -44438, -112365, -32802, 143222, 66274, -83629, 78489, -99943, -75024, -293381, 2093, -266680, -76532, -171672, 139834, -63168, 217407, 73130, -224761, 379025, -17173, 190197, -55387, -37486, 11646, -168741, -351723]
11367c51723L8537J44893j988j09687r358E4428B4198a70054C3355j4854a46472
11355c7392A84878e5714A89800J07719m4950d258J218j91630A22804a15780M891
11344a10889j06909A28491c142k34097I7033c05516G5077R8367a11622i856A24216
11332D4777a79793D4835c41881a51043c2955B33082a96936B36067C0024a51518
11321a75064D69443c1537A09663h7982j77928c0402A0481b90958B84663E6659
11310b2295j02792j01386b6835j66432h0302A01426b87997B2663L02282A42880
11299a80553Q8455A40750b86997j94236A86999a50119E280M39683A16447J04773
11289B21220b24352B36403a21978j13960e8901B16944E2130f2460j13284l05245
$$ y = [-351723, -313186, -168293, -170281, -279968, -289326, 54428, 24198, -170054, 33355, 18501, -146472, -37392, 184878, -55714, 189800, 297519, 252569, -4258, -3040, -194670, 122804, -115780, -110889, -217798, 128491, -3142, -237239, 97033, -305516, 75077, 173444, -111622, -9856, 124216, 44777, -179793, 44835, -341881, -151043, -32955, 233082, -196936, 236067, 30024, -151518, -175064, 469443, -31537, 109663, -87982, -265910, -30402, 10481, -290958, 284663, 56659, -22295, -125087, -226473, -26835, -193267, -80302, 101426, -287997, 22663, 324945, 142880, -180553, -92098, 140750, -286997, -481233, 186999, -150119, 5280, 444963, 116447, 221220, -224352, 236403, -121978, -235938, -58901, 216944, 52130, -62460, -175744, -480989]
11279d80989R0912A14564b73568B12423p0550I583a2075A60542o600E6788e0321
11267D3101G710b9201l69369G1140c80697B9771N3467J44226b0256k03130a7931
11255c29313b652j63916F8728K3808j2277h1791B98957D563P2872P7794A972b38022
11242a62308j21565B7859K05270a73101P6618n4287A72269e8750J3012l1559D22697
11230a73590D5009Q5611b86378Q5824j21118e2379D13803H2353L1280g374F2157
11218C32807b87808N5105c7833G6531M53843b7939j42616B24304M2i6433A19278
11206G9340a16868B22268A4841M18849c53886b4125j34903K402e7762K2992D603
11194b04838P3444e9188b2829k34939A22075l5291a30693A28750a31419F8833
$$ y = [-480989, -390077, 114564, -273568, 212423, 141873, 9583, -12075, 160542, 153942, 56788, -50321, 43101, 7710, -29201, -398570, 71140, -380697, 29771, 83238, 227464, -20256, -223386, -17931, -329313, -2652, -166568, 68728, 92536, 80259, -81791, 298957, 4563, 77435, 155229, 1972, -238022, -162308, -283873, 27859, 233129, -173101, -96483, -150770, 172269, -58750, -45738, -77297, 422697, -173590, 45009, 130620, -286378, -200554, -321672, -52379, 413803, 82353, 113633, -7374, 62157, 332807, -287808, -232703, -37833, 76531, 530374, -27939, -170555, 224304, 224346, -96433, 119278, 79340, -116868, 222268, 14841, 433690, -353886, -24125, -159028, -156626, -57762, -34770, 4603, -204838, -131394, -59188, -22829, -257768, 122075, 86784, -130693, 128750, -131419, 68833]
11183h3694j14084O4463A2268c3166J3701k99388A70139B0946a16709k55305A51734
11171a54154I1045K3630b09613A45507b75090J31306j25631H1263l3415Q9903
11161A37751O9360d51216D6277q258d57903a22814A81400a45613A83542a7854
11150c34052H4106h851l03180A13340a01112n0121b6773n303H1561A02J38835
11139A38937b04985j01928A4276a05834F2042a63522M6301m2673A67181a87989
11128G6365a71106h0116C04336B667c14560a39723B86738I7322J6827b51435J7075
11117b34360A68830a8007A78213c062I3714c929j07654B26340e5501j22660B16923
11105A87694O5147J22319c6383A33248o4654f0133A68128b25490k0710f9304j07463
$$ y = [-83694, -197778, -133315, 12268, -33166, -19465, -318853, 170139, 20946, -116709, -372014, 151734, -154154, 91045, 114675, -209613, 145507, -275090, -143784, -269415, 81263, 47848, 137751, 207111, -451216, 46277, 38019, -457903, -122814, 181400, -145613, 183542, -17854, -334052, 84106, -8851, -312031, 113340, -101112, -151233, -26773, -32076, 81561, 102, 138937, -204985, -306913, 14276, -105834, 62042, -163522, -117221, -159894, 167181, -187989, 76365, -171106, -80116, 304336, 2667, -314560, -139723, 286738, 97322, 114149, -251435, -234360, 168830, -18007, 178213, -3062, 93714, -3929, -111583, 226340, -55501, -178161, 216923, 187694, 252841, 375160, -36383, 133248, 68594, -60133, 168128, -225490, -246200, -69304, -176767]
11094a76767E3904a0107j71438P8705M3966D68400a52299A70031K2861b75857
11083C34114d4118A13356K9116H090N80182B9872a8089B51771b4478I7712F34
11071F9970j3602M27088j93029j08373J8175C4891K25492J1019E2006M48403A86661
11059D22921H5625J83129b376B3006K39721l3065A8862J22551D0595L75645B08118
11047A03558K84055p4514Q2400j79785K2509L27924k29555m1831L30804j58702
11037D66863K45661C08644J84015n4447L52297k89273O1068j36832K47522j73683
11027D99311K62070C08198M62349r5298j15166P6752j7253L1640O1573j93802
11017E18993R2864k30581J1836K6236A26396N58791j59456j597m2142J19526j78030
$$ y = [-176767, 53904, -10107, -181545, -102840, -58874, 468400, -152299, 170031, 192892, -275857, 334114, -44118, 113356, 142472, 8090, 588272, 29872, -18089, 251771, -24478, 97712, 634, 69970, 56368, 483456, 290427, 182054, 200229, 34891, 260383, 271402, 52006, 500409, 186661, 422921, 85625, 268754, -2376, 23006, 262727, 229662, 18862, 141413, 40595, 416240, 208118, 103558, 387613, 313099, 395499, 215714, 238223, 566147, 336592, 294761, 625565, 466863, 712524, 308644, 492659, 438212, 790509, 501236, 562304, 425472, 672994, 499311, 761381, 308198, 770547, 675249, 560083, 636835, 619582, 651222, 712795, 518993, 611857, 381276, 393112, 419348, 126396, 685187, 525731, 524134, 481992, 601518, 423488]
11006D23488L34218j37888k24362P3169j55372O6486n8310O8416J27903r1868
10996D25880k11051L97472k0923j91106K34518K5204j57935j91244N09445l59318
10986D60942J56147k22738J77502j32732K39792j96437j5144j52336J26321J11103
10976E52420j89019J28167j20801M88135j24885B52036O7942M31767l63020K68637
10966F57362L24755n6023R4569r2420L14883q6197J39125M6415P3301j15471L39391
10955A639690J50105L29958j87780M6084j07197j4615k14111r5711k50096J62610
10945A458937J80960l13832l56531L20377P0650j07514l6139K56402j55771l56765
10935I60774K10147K23908E14164J58184R5350J34473l83328k55596J75461K4865
$$ y = [423488, 757706, 619818, 395456, 468625, 313253, 379739, 321429, 389845, 517748, 425880, 214829, 612301, 591378, 400272, 634790, 659994, 502059, 310815, 820260, 460942, 617089, 394351, 571853, 439121, 678913, 482476, 467332, 314996, 441317, 552420, 363401, 491568, 370767, 858902, 734017, 252036, 319978, 751745, 388725, 657362, 982117, 926094, 1020663, 928243, 1243126, 1156929, 1296054, 1342469, 1415770, 1300299, 1639690, 1789795, 2119753, 1931973, 1978057, 1870860, 1856245, 1642134, 1546423, 1296327, 1458937, 1639897, 1326065, 969534, 1289911, 1360561, 1253047, 1216908, 1473310, 1317539, 960774, 1170921, 1394829, 514164, 672348, 767698, 902171, 518843, 263247, 438708, 463573]
10925D63573A28879M1710L1865j9013O454B2721O3171i7666I1043J37634a9581
10913a632o9641c23q9576D8784a77540C15292F2041a35923E970a36684M8986i111
10900B0889a21162p444A23774a73510f6293o09979D0024L9716O2872c65307C16934
10888e34985G4992B4303d8891n3330d5563A63754A2097L2355a63755B2757Q1549
10877A04306K7406g9916A24391r890e03224b14634J6048j39950f7322D1493L36371
10866C77864c81007G9696a07271B39157b3445A2552R4691A7573a18810A07703
10855a07242B09604a51348k23480c4505n9421K2437a9604j33413f4725b7732C1615
10843a98543P1430D06748f064k54845d2230l4843j52988n3738c1596j49316j67867
$$ y = [463573, 128879, 170589, 202454, 183441, 189895, 22721, 85892, -97666, 91043, 228677, -19581, -1632, -71273, -323, -89899, 48784, -177540, 315292, 62041, -135923, 5970, -136684, -87698, -9111, 20889, -121162, -128606, 123774, -173510, -66293, -676272, 40024, 79740, 142612, -365307, 316934, -534985, 74992, 24303, -48891, -102221, -45563, 163754, 12097, 44452, -163755, 22757, 104306, 131712, -79916, 124391, 114501, -503224, -214634, -198586, -338536, -67322, 41493, 377864, -381007, 79696, -107271, 239157, -23445, 12552, 107243, 17573, -118810, 107703, -107242, 209604, -151348, -374828, -34505, -93926, -71489, -19604, -153017, -64725, -27732, 31615, -198543, -127113, 406748, -6064, -260909, -42230, -77073, -230061, -283799, -31596, -180912, -348779]
10832c48779D3584A7588P5120K22178a42978n0390E9846B9595f1474A93085a67252
10820A61524O7292p3871i390k85300A43078b01720c449I4243N76d3223A49758
10808b32413A06781b3057k29651A34988d4730m8901c27A05323c32987i3044M4243
10797d8801j40445M3076h745k90724G3140G290a36975K9831D9665J44050b0373
10785c52772a35377E8079a48101f4279j53250A13984J4049a57915j24410J36393
10775a45932B8665f7557A03627a23873j85747a40556A62478c11831Q4442N9465
10765a67924h0650j28875h5448C59518d2472j08422b5644A38624f485C3880a19222
10753F1390J23648L1109a0497j16413A18326M8904b52996a07942j31583P4482
$$ y = [-348779, 43584, 17588, 92708, 314886, -142978, -193368, 59846, 29595, -61474, 193085, -167252, 161524, 228816, 154945, -9390, -294690, 143078, -201720, -3449, 94243, 94819, -43223, 149758, -232413, 106781, -23057, -252708, 134988, -44730, -93631, -327, 105323, -332987, -93044, -48801, -189246, -146170, -8745, -299469, 73140, 7290, -136975, -107144, 49665, 193715, -20373, -352772, -135377, 58079, -148101, -64279, -217529, 113984, 128033, -157915, -282325, -145932, 28665, -67557, 103627, -123873, -309620, -140556, 162478, -311831, -227389, -167924, -80650, -209525, -85448, 359518, -42472, -150894, -25644, 138624, -6485, 33880, -119222, 61390, 185038, 216147, -10497, -126910, 118326, 167230, -252996, -107942, -239525, -165043]
10743a65043m01278A14662a94218g8073b740j60266L8233A00999g9722a8606q0450
10732i9056G0284J00859F1099e5578k75835a43291j11008q4489A72636E5726A9040
10720a18262a5152G9628c8531n1468I3098a67470a1306A00849L5359P5749e3114
10708a18184F8285b77561A55145e3182J5081j21954a1047k92618l9227i5826C42511
10696H5830L4444c47824A62140M0440a59946p9561a1667J146l04067O0779a12255
10684f1288B50216c752A30032e3843k8232j52103B5164L8570b57365A88737M7919
10673B36656R3059j57547n3029a71897m4802B6505J0197g2378j89046f4737I6153
10661A9974a16379b1883b913k88337R8494h5774G7248A5316b05247N2405M2486
$$ y = [-165043, -566321, 114662, -194218, -78073, -2740, -163006, -124773, 100999, -79722, -18606, -99056, 70284, 171143, 61099, -55578, -331413, -143291, -254299, -338788, 172636, 55726, 19040, -118262, -15152, 79628, -38531, -89999, 93098, -167470, -11306, 100849, 136208, 211957, -53114, -118184, 68285, -277561, 155145, -53182, -38101, -160055, -11047, -303665, -342892, -95826, 342511, 85830, 120274, -347824, 162140, 202580, -159946, -239507, -11667, -10521, -314588, -253809, -112255, -61288, 250216, -3752, 130032, -53843, -82075, -234178, 25164, 63734, -257365, 188737, 236656, 329715, 172168, 119139, -171897, -216699, 26505, 36702, -72378, -261424, -64737, 96153, 19974, -116379, -21883, -2913, -291250, -192756, -85774, 77248, 15316, -205247, -152842, -110356]
10650a10356o234F7335b44931i2773B56609c58794E246b4234B26403d5405l3638
10639g9043a0117j6676l92034a04445B76311b90148C86394h0272l74103d8943
10628I7538c8943j09009k52302C7318a55580D4729b1190A78985D6170a43616q6375
10617b29991A12099a50279O9444I7404a87585D4743R4308L9261k4175n5428a18992
10605d4179a2504m32421B76371n6110Q2584A32238a47582D1603A3344d4950H477
10593d75507A91100d6409a8335o1554j09766P963l0549d6142A38021c3073n41480
10582e74553K72130k7795B90400b03747b6531l2401n6553C5721b99804A3807c30843
10570A30213J34304a41741r4125B89338j07189d55052D0658J2273c2899j09699
$$ y = [-110356, -116590, 67335, -244931, -92773, 256609, -358794, 5246, -24234, 226403, -45405, -79043, -10117, -26793, -418827, -104445, 276311, -290148, 386394, -80272, -454375, -48943, 97538, -38943, -147952, -400254, 37318, -155580, 44729, -21190, 178985, 46170, -143616, -229991, 112099, -150279, -80835, 97404, -187585, 44743, 139051, 178312, 154137, 98709, -118992, -44179, -12504, -444925, 276371, 220261, 302845, 132238, -147582, 41603, 13344, -44950, 8477, -475507, 191100, -46409, -18335, -79889, -189655, -181692, -212241, -46142, 138021, -33073, -574553, -302423, -330218, 290400, -203747, -26531, -58932, -115485, 35721, -299804, 13807, -330843, 130213, 264517, -141741, -235866, 289338, 182149, -455052, 40658, 52931, -32899, -142598]
10560a42598d4153R048l45046A19832n8556K0023h4819d0656E3670J74532b71828
10548A7746g6419q8093b6200j41200K6676q4954M5808l202L3730K5862r0685Q5960
10536a28205A98974H6703a78485m4926K9853H6857c72279F8174b39625D9763e3006
10524b44373F5306K7893h8944o8297c1231B59662b38069e9391q1953O4811k1623
10513i8156M0635A31468a36481e087k10214E4696b51569C39530P3340j53843l6326
10502B22701M2729a78822K6418R667j87585I4985c38594A78086D541a50410A06976
10490e7442A23554N0819h1908k81501A12117L2406f8172d452I2940a23451l9203
10479a62654p6649i6783C14345c3101C23439I8554L0061b13525B316M17109a09209
$$ y = [-142598, -44153, -35105, -380151, 119832, 61276, 81299, -84819, -40656, 53670, 228202, -271828, 17746, -76419, -164512, -26200, -167400, -140724, -225678, -179870, -183072, -149342, -123480, -214165, -128205, 198974, 86703, -178485, -223411, -193558, 86857, -372279, 68174, -239625, 49763, -53006, -244373, 65306, 93199, -88944, -157241, -31231, 259662, -238069, -59391, -141344, -76533, -98156, -57521, 131468, -136481, -5087, -215301, 54696, -251569, 339530, 412870, 259027, 222701, 265430, -178822, -152404, -142737, -330322, 94985, -338594, 178086, 4541, -150410, 106976, -57442, 123554, 174373, -81908, -363409, 112117, 144523, -68172, -4452, 92940, -123451, -162654, -239303, -96783, 314345, -33101, 323439, 98554, 128615, -213525, 2316, 419425, -109209]
10467A16228b54216D14115a20171C5699K94172B1664M46699J53985B0539K46770
10457B67309a60546O9025C58454i5649B50578k1387c02267Q2148C02218b43402
10446E3091c395j99455A04456A344g6269E5444e4974a7724e814k34210B84302
10434a62696j21824f2890P848A71145p8996E392a46934G573b12211h3027B44941
10422a58007L1806c8549l9874I5512c0098q6759p788c0246E5479M8206A0205N326
10410A5531h9401A17266J35696N5597a36749B64868B5391a08441B02643P1129
10400B73772E8527K02850h5862m19993A78585a33891r6079H947b01145H9719A0892
10388G9489d24473E6255c44128a08802e1932k51379B940J9275c7362A5654K13513
$$ y = [116228, -254216, 414115, -120171, 35699, 329871, 21664, 468363, 622348, 20539, 267309, -160546, -91521, 358454, -95649, 250578, 229191, -302267, -220119, 302218, -243402, 53091, -3395, -202850, 104456, 1344, -76269, 55444, -54974, -17724, -5814, -240024, 284302, -162696, -284520, -62890, -55042, 171145, 92149, 5392, -146934, 7573, -212211, -83027, 244941, -158007, -126201, -38549, -78423, 95512, -30098, -116857, -124645, -30246, 55479, 103685, 10205, 15531, -89401, 117266, 252962, 308559, -136749, 264868, 25391, -108441, 202643, 273772, 58527, 261377, -85862, -505855, 178585, -133891, -229970, 8947, -201145, 89719, 10892, 79489, -424473, 56255, -344128, -108802, -51932, -303311, 2940, 22215, -37362, 15654, 229167]
10377B29167A084b18292B43181a53579e1164B05185M0878A18058b22181a10759
10366C04350e3968A86319F7611K93422E368J97775H7583A1183a8947F1553K39631
10355C01184j5244K1933B9712K63868A21502f1565D59629l6496A8923J34140l6830
10344A16233M21423B4464J85735F7314M697a92174B06000k3745O9344J26709J34701
10333E13009j92036Q6842A20321a00303B84094a33547A53693C8796M21444j15969
10323C44271f2127B722e6205B00374F8522K13347k5102b8447D13634B0395J55358
10312A75753J8405c12150O6478C45736j45372a57823L8844j85163A64604J73118
10302C37722J1143D275f1914a7254G7618b1164a0499k77369a8055E3676c2220
$$ y = [229167, 1084, -218292, 243181, -153579, -51164, 205185, 246063, 118058, -222181, -110759, 304350, -53968, 186319, 67611, 361033, 5368, 203143, 87583, 11183, -18947, 61553, 301184, 285940, 307873, 29712, 293580, 121502, -61565, 459629, 423133, 18923, 153063, 116233, 537656, 24464, 210199, 67314, 72011, -192174, 206000, 182255, 251599, 378308, 513009, 320973, 407815, 120321, -100303, 284094, -133547, 153693, 38796, 460240, 344271, -62127, 2722, -56205, 200374, 68522, 281869, 256767, -28447, 413634, 20395, 175753, 194158, -312150, -245672, 345736, 200364, -157823, -118979, -304142, 164604, 337722, 348865, 4275, -61914, -17254, 77618, -21164, -10499, -287868, -18055, 53676, -32220]
10290h6974k12903J46306e8084q3482B84818b93725A9023P2453i2662j17409Q7909
10279a22162F0703B5841R8411j2593b63694b5496j28841C27504f9361l5197A5728
10267a12455A05496l5517O4555a00795l02250C9635a09826k12473E5298A1458
10256b87738A11840K08272G8184g5409K808J647k52118a26243m9904A18777b54667
10244d2554j18042C03550j35289n6978K99514j41347H8813b858C10182A6139i7922
10232E3240O7680e1402I7097a58723e8304B54478k4084a4916E3973a01600j83698
10221b85298i4993D4373a81555E072O3834a03799A68416a10083J1333B546L0748
10210C3294h8900B02799i3095l2783B73311B6106d45519b19129C5620Q4771g9111
$$ y = [-86974, -299877, -153571, -58084, -141566, 284818, -293725, 19023, 91476, -92662, -210071, -122162, 60703, 25841, 124252, 111659, -263694, -25496, -154337, 327504, -69361, -104558, 15728, -112455, 105496, 69979, 134534, -100795, -403045, 39635, -109826, -322299, 55298, 11458, -287738, 111840, 320112, 78184, -75409, -72601, -70954, -323072, -126243, -176147, 118777, -254667, -42554, -160596, 303550, 168261, 111283, 410797, 269450, 88813, -2858, 310182, 16139, -97922, 53240, 120920, -51402, 97097, -158723, -58304, 254478, 230394, -14916, 53973, -101600, -285298, -94993, 44373, -181555, 5072, 68906, -103799, 168416, -110083, -98750, 2546, 33294, -88900, 202799, -93095, -125878, 273311, 26106, -445519, -219129, 35620, 120391, -79111]
10198h7253l77626a0157k26305A57106i0999k47324l3502A84401k3965B6706c60353
10186a56809l0913A92700j8588K2399R6531c304k88947g6075k38604l053B22167
10174E4777e1319m24045H4297a72137A2833J70793h3468A90026c50968A22977
10163b27223G3989h383E1064b0591B13191A5362J15846a85128F6670J36387a02422
10151e60528D2587a0551D8358b0106B3274c19192J57622F7604b81848L9759j15475
10140c57564a24664e2675m8179O650g963A09173c28528N3483L1906H8091a26157
10128A59422h1927k3193A01735A8675L3920d9079j33315h7017A9550O590J76109
10117B02249i5668J7977k97464B63989b82260E1582d8739A84705b97711j5668
$$ y = [-87253, -464879, -10157, -236462, 157106, -90999, -338323, -371825, 184401, 160436, 26706, -360353, -156809, -187722, 192700, 174112, 196511, 293042, -3304, -292251, -76075, -314679, -317732, 222167, 54777, -51319, -475364, 84297, -172137, 12833, 183626, -83468, 190026, -350968, 122977, -227223, 73989, -8383, 51064, -20591, 213191, 15362, 131208, -185128, 66670, 203057, -102422, -560528, 42587, -10551, 48358, -20106, 23274, -319192, -161570, 67604, -281848, -242089, -357564, -124664, -52675, -100854, -94204, -7963, 109173, -328528, -275045, -243139, 88091, -126157, 159422, -81927, -105120, 101735, 18675, 52595, -49079, -182394, -87017, 19550, 26140, 202249, -95668, -77691, -375155, 263989, -282260, 51582, -48739, 184705, -297711, -313379]
10107c13379R7279m7137j08601J47049a3063l02199J52996b5747n9512c8912k10593
10096b49505j5579a16992j5017A06099a27220A1457a6050n9973C005b47801i0959
10084i7473c1153J4347k15167B04413E5570P7577b14671m5598d3890F8772a0419
10072B17061o1342g6324k81659B700c25062i2096I121m290b33222a14754m9880
10061a64634j04228B41476c23096a29882K4805j08663b6547C40354h673k04060
10051b12733C5163a95211d2783j5415m5722n9786A28840c453j51803A1056a05485
10039d3133j18409j08210A66855a1922B23971d4833G0218J14582b13943h2876
10028e4546F1642d2047k61123O3832A14740a98356d417p8533A83480b83977k0924
$$ y = [-313379, -216100, -263237, -371838, -224789, -13063, -315262, -162266, -25747, -85259, -38912, -249505, -265084, -116992, -132009, 106099, -127220, 11457, -16050, -76023, 3005, -247801, -90959, -97473, -31153, -16806, -231973, 204413, 55570, 133147, -214671, -260269, -43890, 68772, -10419, 217061, 155719, -76324, -357983, 2700, -325062, -92096, 9121, 4831, -233222, -114754, -164634, -268862, 241476, -323096, -129882, -105077, -213740, -26547, 340354, -8673, -212733, 35163, -195211, -42783, -58198, -103920, -163706, 128840, -3453, -155256, 11056, -105485, -43133, -161542, -269752, 166855, -11922, 223971, -44833, 70218, 184800, -213943, -82876, -54546, 61642, -42047, -303170, -239338, 114740, -198356, -4417, -82950, 183480, -283977, -304901]
10017c04901J44572A5269a33055l67767F9851O1156n6033c9307j4521l82073b07327
10005c4284E788O2066a68197j22394J32309l1305A32082d12366J72220l8284J38358
9994a40072A25234n8588A4278c59498R4342E1294J24448C8327j135b50093e4622
9982i2375a661k9177j8662j68572l3136i0505G5784b3778l92571J43462a08556
9970G0314f954H2003J59924A4948a50824j65239G3224a39515j4497C06437a7064
9958f4507j17483D9669K80470A11574b90334A3318q23L2269e3747j7721p903j5341
9946i4712K44H7062b15624B20544g1487k5812c9971j62096B85034b02905h4690
9934g9868i165i05k61568E941a87875e323j68636C1654N6909B9195J3245G563
$$ y = [-304901, -160329, 15269, -133055, -500822, 69851, 131007, 74974, -39307, -53828, -435901, -207327, -34284, 5788, 67854, -168197, -290591, -158282, -189587, 132082, -412366, -240146, -278430, -140072, 125234, 66646, 14278, -359498, -265156, 51294, 175742, 38327, 37192, -250093, -54622, -92375, -1661, -30838, -49500, -218072, -251208, -90505, 75784, -23778, -416349, -272887, -108556, 70314, -6954, 82003, 241927, 14948, -150824, -316063, 73224, -139515, -154012, 306437, -17064, -64507, -181990, 49669, 330139, 111574, -290334, 13318, 12495, 44764, -53747, -71468, -79371, -94712, -94468, 87062, -215624, 220544, -71487, -97299, -39971, -202067, 285034, -202905, -84690, -79868, -9165, -905, -262473, 5941, -187875, -5323, -173959, 31654, 88563, 29195, 42440, 7563]
9921a69046A51212b70362e9872k53122d3946k8940j01591Q244A22183b0583G101
9909A36540i373j61094j58809J60065B0980e4859k9574k01438C76182a55472A42567
9897a86920c250n4256B78754b00486c8068l43493d928q2419I1844a40652C6736
9885e7264B9340h4509A66760a86240N7909a6539l3894k36593a01839H644k445
9874F199c3729B67686n6746a22776e1426l37666a19877c3289j8867G436e8678
9862F3705j9538f3426D6385P0269g6874p6758k80203a23364o199j6856m2080l67237
9850e55736C8453b0558k21672a5395E2292b0540l1729A92559A7261J82228c20036
9838a42796j53086O1298d0230j31902J3576i967j29149f388j00681j84366L0918
$$ y = [-169046, 151212, -270362, -59872, -312994, -43946, -72886, -174477, -166233, 122183, -20583, 7101, 136540, -9373, -170467, -329276, -169211, 20980, -54859, -84433, -285871, 376182, -155472, 142567, -186920, -3250, -57506, 278754, -200486, -38068, -381561, -4928, -87347, 91844, -140652, 36736, -57264, 29340, -84509, 166760, -186240, -128331, -16539, -50433, -287026, -101839, 8644, 6199, -33729, 267686, 210940, -122776, -51426, -389092, -119877, -33289, -52156, 7436, -58678, 63705, 44167, -63426, 46385, 116654, -76874, -153632, -433835, -123364, -129563, -146419, -188499, -555736, 38453, -20558, -242230, -15395, 52292, -20540, -52269, 192559, 17261, 199489, -320036, -142796, -295882, -234584, -40230, -172132, -158556, -9967, -139116, -6388, -107069, -291435, -260517]
9827b60517d0004l22998a50896p4860R2143D5199e0700B48817a20006c5400k91757
9816c27157J04505i2821G1255d5624E3087J77997j03864c3453F7867a68950E6255
9804a55552f1436H272b56028g4642A00263c87250E0236c5269C08813a88626e6712
9792a09300b6505k55424c6146k38079I4673a36386j46871A05424i0704b4995A20738
9780f5002D15143c10150L5995l8487B37887D1807N7034a93850k39169A93964p8522
9769A15442e9570j24152J1029B67780d01384a1608k56266J16362p9647a14788
9758I3212j1389C0248a40753d5874F8418B0395a54371A2613J8180a30051j0290
9747a40341K2540I3007c3932H4074b95265A66276b54819N7316P9840b88m66962
$$ y = [-260517, -40004, -363002, -150896, -225756, -133613, 45199, -50700, 248817, -120006, -35400, -327157, -222652, -92821, 71255, -45624, 53087, 231084, 127220, -33453, 67867, -168950, 56255, -155552, -61436, 8272, -256028, -74642, 100263, -387250, 50236, -35269, 308813, -188626, -56712, -109300, -26505, -281929, -36146, -274225, 94673, -136386, -283257, 105424, -90704, -24995, 120738, -65002, 415143, -310150, -274155, -312642, 237887, 41807, 98841, -193850, -433019, 193964, 115442, -59570, -183722, -172693, 267780, -401384, -11608, -267874, -151512, -231159, -114788, 93212, 81823, 30248, -140753, -45874, 68418, 20395, -154371, 12613, 30793, -130051, -140341, -117801, 93007, -33932, 84074, -295265, 166276, -254819, -197503, -117663, -288, -467250]
9736d67250K25350g0710F8356j1562k5387c43382a11421b753A62357m3241N7123
9725A76239h8192A81152o7446a12767l13174a79674B07116j01768a43652J8042
9715a25610j07902p9685c7008B10630b1747B08827c10551J45718e9274j2664G2341
9703b414k82311q1172J26723l72260D8777c14256L0610A9683d0268j67049C07578
9691a95380c2750r4148d8417G4391Q9960D5372a94029p8810A04824h6976k31833
9680c18809J25310d8677j36965A98949c31736a51511d5425m0503j19987C11848
9669B33122O8457H7072C7245c15493B22776n5689e1957A15063a67714B5738Q4700
9658A10438k0227a4207l5898E0010k1811a14564r2573O2708H6350b98738c1804
$$ y = [-467250, -241900, -70710, 68356, 56794, 31407, -343382, -111421, -2753, 162357, 119116, 176239, -88192, 181152, 113706, -112767, -425941, -179674, 207116, 105348, -143652, -125610, -233512, -313197, -37008, 210630, -21747, 208827, -310551, -164833, -59274, -71938, 72341, -2414, -284725, -365897, -239174, -611434, 48777, -314256, -283646, 19683, -40268, -207317, 307578, -195380, -32750, -126898, -48417, 74391, 164351, 45372, -194029, -272839, 104824, -86976, -318809, -193499, -48677, -185642, 198949, -331736, -151511, -45425, -85928, -205915, 311848, 233122, 301579, 87072, 37245, -315493, 222776, 167087, -51957, 115063, -167714, 25738, 110438, 90211, -14207, -50105, 50010, 28199, -114564, -207137, -144429, 86350, -298738, -31804]
9646f7980j02585b7871A54709j6442b96161j16957a02038A26966D8060a31745
9635G0217b7834j36004B87486d9620l31528o8326J98177N7619E4713b75704a27873
9623B18843c64618F5369b63728B81866a62793A46867h408m3807R822J6017j60697
9612a87073a7462r9384r830k30882a37844R761j26136A26988l4611k245r189k6036
9600E4907f1204k24913a12748k59494a31255j21202j73429K11001h4781j22780
9590b07561m445J01107B9082h1804A7096J29717g8744o0677K8852k78682F3308
9578c29492P2016f8615j16526p4885F1670c18997k4569C0860e7685j21046B1478
9566a16601A85791a76264A4658i1964H0063J59399c4995A68569b37071H3184R0399
$$ y = [-67980, -170565, -27871, 154709, 138267, -296161, -413118, -102038, 126966, 48060, -131745, 70217, -27834, -163838, 287486, -49620, -381148, -449474, -251297, -193678, 54713, -275704, -127873, 218843, -364618, 65369, -263728, 281866, -162793, 146867, -8408, -52215, -42393, -26376, -187073, -17462, -116846, -126676, -357558, -137844, -128083, -254219, 126988, 92377, 90132, 80943, 54907, -61204, -286117, -112748, -372242, -131255, -252457, -425886, -214885, -84781, -207561, -212006, -110899, 29082, -81804, 17096, 146813, -78744, -139421, -110569, -389251, 63308, -329492, -257476, -68615, -185141, -260026, 61670, -318997, -343566, 30860, -57685, -178731, 21478, -116601, 185791, -176264, 14658, -91964, 80063, 239462, -34995, 168569, -237071, 83184, 173583]
9555A73583j8188F4355P6302a24647j22482b7733A4369F520N7209J97630d4628
9543a15893D648i873j40477M329O7097n140e227k19673G7419A6941L9633c37155
9530d0899j12373D18069g1708j24995j13588J00192d1615j49085J1284F5661d10155
9518a01401A92284I5766N1989b62531J27828B14363b13553Q622A06744b11778
9507A15683n5920J254b18167B61262c93875J39805k21694i4766n1290j30573G8874
9495A73884B2676f7536j82731c5726F1922J42661i8079L7542j49481G7994a5036
9483c20847f5535k16809J33644p7074B00477D3062M683f6231k281b2897C1695
9471d9843j15085a1227j55138A26782a39507o839M3732B06592a95860o7958B4988
$$ y = [173583, 155395, 64355, 140657, -124647, -247129, -27733, 14369, 6520, 63729, 261359, -44628, -115893, 4648, -9873, -150350, -146021, -78924, -84064, -5227, -224900, 77419, 16941, 56574, -337155, -40899, -153272, 418069, -71708, -196703, -310291, -210099, -41615, -190700, -179416, 65661, -410155, -101401, 192284, 95766, 147755, -262531, -134703, 214363, -213553, -204931, 106744, -211778, 115683, 59763, 61017, -218167, 261262, -393875, -254070, -475764, -94766, -146056, -276629, 78874, 173884, 22676, -67536, -250267, -35726, 61922, 204583, -98079, -60537, -210018, 77994, -15036, -320847, -65535, -282344, -148700, -225774, 200477, 43062, 47745, -66231, -68512, -22897, 31695, -49843, -164928, -11227, -166365, 126782, -139507, -146346, -102614, 206592, -195860, -263818, 24988]
9459A11172a48574f9504a7821n6340A37086J22776D0664i9898C6651A7228h7173
9447a06826q4795B34725B4546b21328M2316j44572A24609a83427B2825D192M412
9436H604a2197A6902a72619m0159q912f1681A68311c25908a06135j15660d5702
9424D6228J25473m3941E4536M7058b14544o5915B50930E4955a17901B8686N3764
9413H2450a9111j50062A12865l0728i9040A83262b2267I9294K05108i0638c7355
9401e05q6256C24961d05801f9819j15771h4659I2149i5325J0532c0448F7333a61243
9388b33383A07114c46793a51524b3321G2818h3717A90097i9710k73049J49009
9378b23750N472F1492b16653m5122j47441A35066B1817a65460E827L51757D03
$$ y = [111172, -148574, -69504, -17821, -74161, 137086, 259862, 40664, -99898, 36651, 17228, -87173, -106826, -191621, 234725, 24546, -221328, -179012, -323584, 124609, -183427, 22825, 4192, 8604, -12197, 16902, -172619, -212778, -221690, -61681, 168311, -325908, -106135, -221795, -45702, 46228, 171701, 127760, 54536, 101594, -214544, -280459, 250930, 54955, -117901, 28686, 82450, -19111, -169173, 112865, 82137, -99040, 183262, -22267, 99294, 304402, -90638, -37355, -505, -86761, 324961, -405801, -69819, -185590, -84659, 92149, -95325, -84793, -30448, 67333, -161243, -233383, 107114, -346793, -151524, -23321, 72818, -83717, 190097, -99710, -372759, -223750, -218278, 61492, -216653, -261775, -409216, 135066, 21817, -165460, 5827, 357584, 403]
9366A87218r0675i0842r7923E2099b59357B15231e1774j20293E26467A64525c76386
9354g7862n2316B54984c6182l77968B6394J978a57776k10250A64136b40508b9402
9342a76850p9972J12351L7107e0145a8633r3182c3658k90981a16980B72142i287
9330D7621K00148a70517K4509A46173Q5387A07751b83274J10746A78849g2747
9319B91338b21311D4929b1397m09405K14342j22108O7173g7710A22966D9510J67510
9308B17020b35333H0803K16578I4764b55851B05597a33832H774c90977J03372
9298b87605c1718k57319A45363C1536J0881R2725m462f0211B90054j08020b2040
9286b59836B50522i7768j93662R6375j56579f4615A09788i037A92307k0257a03273
$$ y = [187218, 96543, -90842, -188765, 52099, -259357, 215231, -51774, -172067, 526467, 164525, -376386, -77862, -130178, 254984, -36182, -414150, 26394, 28372, -157776, -368026, 164136, -240508, -29402, -176850, -256822, -144471, -107364, -50145, -18633, -111815, -33658, -324639, -116980, 272142, -9287, 47621, 247769, -170517, -146008, 146173, 231560, 107751, -283274, -172528, 178849, -72747, 291338, -221311, 44929, -21397, -430802, -216460, -338568, -271395, -77710, 122966, 49510, 217020, -235333, 80803, 297381, 94764, -255851, 205597, -133832, 8774, -390977, -287605, -31718, -289037, 145363, 31536, 42417, 135142, 130680, -60211, 290054, 182034, -22040, -259836, 250522, -97768, -291430, -195055, -351634, -64615, 109788, -9037, 192307, 172050, -103273]
9274a57309G6709B4294a74291H7962i4426I9982b51435q0377J26226B592d1643
9262A5043e0053A74014d1887l65C14623b01239d5940m721C8419L398J42675a10203
9249A58403a51805E6752J70027h4327B69644d4803l5097j95481N1775H693P3159
9238H1852i4289p7226j14137G4635d11563R8495a16623l4295n3219b6784j65061
9227a91845n7683P9961j52502F6805C1488J83544b31793a14436a7356k0090m36129
9216d73575A58062b99598a885k8634A05463b71785p1787a69134K7365A618b119
9204A59974c54345I6257A9906b33391N6325m5227E4465c01932f1180E8919c1966
9192C4976a31408b3007k27270B55198e2113l9512n2588J1239K9809K5109m069
$$ y = [-157309, 76709, 24294, -174291, 87962, -94426, 99982, -251435, -331812, -205586, 2592, -41643, 15043, -50053, 174014, -41887, -42252, 314623, -201239, -45940, -50661, 38419, 41817, 184492, -110203, 158403, -151805, 56752, 226779, -84327, 269644, -44803, -79900, -275381, -223606, 8693, 81852, -94289, -171515, -285652, 74635, -411563, -313068, -116623, -150918, -204137, -26784, -191845, -249528, -169567, -322069, 66805, 31488, 215032, -231793, -114436, -17356, -37446, -473575, 158062, -299598, -1885, -30519, 105463, -271785, -343572, -169134, -141769, 1618, -2119, 159974, -354345, 96257, 19906, -233391, -177066, -222293, 54465, -301932, -61180, 58919, -31966, 34976, -131408, -23007, -250277, 255198, -52113, -91625, -144213, -132974, -103165, -78056, -82125]
9181h2125I3457a22233N6081l9248m2762k4976E0456i4528k68500f0858G4241
9169a01497D36858a14866A94020a07346A56688K1628b09642M0695j12945d2868
9158c47574b4863p9156r1071A87986d8367j00205j42144a42422B02813b32813
9147b75672r3634D1589J44592O1110F4113a57365e083A75594a76527g3182k16529
9136b89711A02458b38604p2895N4565k67190a88430q3735a2840I1193a69652B9052
9124a33153B28824B2233b12846D4508i3626R037A31385A3546O8717c5099j28714
9113a63813j7347C2670J76820l4210A1347c33499B7762b66303a6024j41372A33996
9101e6777q2073p8192j12039A73304a23080H5026a37440F7664d9265n0489d3432
$$ y = [-82125, 93457, -122233, -66152, -105400, -148162, -173138, 50456, -94528, -363028, -60858, 74241, -101497, 436858, -114866, 194020, -107346, 156688, 178316, -209642, -168947, -281892, -42868, -347574, -24863, -104019, -195090, 187986, -48367, -148572, -290716, -142422, 202813, -232813, -275672, -369306, 41589, 186181, 247291, 64113, -157365, -5083, 175594, -176527, -73182, -289711, 102458, -238604, -311499, -256934, -524124, -188430, -272165, -12840, 91193, -169652, 29052, -133153, 228824, 22233, -212846, 44508, -93626, -84589, 131385, 13546, 82263, -35099, -163813, -181160, 32670, 209490, 175280, 11347, -333499, 27762, -266303, -16024, -157396, 133996, -56777, -138850, -217042, -329081, 173304, -123080, 85026, -137440, 67664, -49265, -99754, -43432]
9089c2286k19958c7045a3153A60505J8294D8778a46777A77909g872F3257C579
9077a88594C3855b21873g2854j13126C661K77848H2434a27089B33773a94712A89543
9065B48512A15883g2367n1707A25969h0330N790J00p7540n8674j2427a02449G243
9052B9919b37503i0169J8015J8107A38147G836K1332K79597j45006h0684b8455
9040b77558g008p6657j80207a02796D5588O3185A3348L2350j277i1243A50920
9028a9993k01222h5392j22787L8016j4869H5c45244R1683i2125g457A13364g4830
9015e10254a9433A38665J40868P3371j9335j53742g1860A74384D71b65146A00697
9003b27605d5449p1389G9577P7934c31250a26151C31942g7773j677D6014i6974
$$ y = [-32286, -252244, -37045, -13153, 160505, 178799, 48778, -146777, 177909, -7872, 63257, 3579, -188594, 33855, -221873, -72854, -185980, 3661, 281509, 82434, -127089, 233773, -194712, 189543, 248512, 115883, -72367, -124074, 125969, -80330, -74540, -74440, -151980, -210654, -223081, -102449, 7243, 29919, -237503, -90169, -72154, -54047, 138147, 7836, 29168, 308765, 163759, -80684, -28455, -277558, -7008, -83665, -263872, -102796, 45588, 108773, 13348, 45698, 44421, -91243, 150920, -19993, -221215, -85392, -208179, -170163, -185032, 85, -345244, -253561, -92125, -7457, 113364, -74830, -510254, -19433, 138665, 279533, 352904, 333569, 179827, -71860, 174384, 471, -265146, 100697, -227605, -45449, -116838, 79577, 157511, -331250, -126151, 331942, -77773, -79450, 46014, -96974]
8991G6915b66248A61943c58636J11437a22332e0963k72885J11528A67898D8989
8980A9310K19673c26122Q7017A67711c96099a78400B2573d39140b00983i1856
8969a04321E0389d59292E9116j3370b0858A14899C3736K4780K40033h1454B68763
8957a04418c2975r7843q4228B58395I8092J46141C3635J8594A2794a41069L182
8946a37887E6068K3099R1332G5007j4445i9624j21606A74236b08263j73948a33636
8934D8967e9004p7031o5991A66403b18913I0586c10721J38453A05849a18644J8474
8923a00170c4200J5775k30289D6222P8104P691k0859h7954J0993A35971o4960
8912G1011g560C56241A75634L94031k3178R01468P60331J327202L097386O70847
$$ y = [76915, -266248, 161943, -358636, -247199, -122332, -50963, -323848, -212320, 167898, 48989, 19310, 238983, -326122, -239105, 167711, -396099, -178400, 22573, -439140, -200983, -91856, -104321, 50389, -459292, 59116, 45746, -20858, 114899, 33736, 58516, 298549, -81454, 268763, -104418, -32975, -130818, -215046, 258395, 98092, 244233, 33635, 52229, 12794, -141069, -137887, 56068, 79167, 170499, 75007, 60562, -99624, -221230, 174236, -208263, -382211, -133636, 48967, -59004, -136035, -202026, 166403, -218913, 90586, -310721, -172268, 105849, -118644, -100170, -34200, -18425, -248714, 46222, 124326, 132017, 111158, -87954, -76961, 135971, 71011, -7560, 356241, 175634, 569665, 546487, 1447955, 2208286, 3535488, 6632874, 7303721]
8902G303721C542480j754450G84043l60415l3613A59015J6312j0652J58861j37663
8892A85873k159J61255j36184A5367J33119b58629L6756Q4470m6195N0430A97407
8880e2478b3168j01677L8814m4941K137B0534h6978J8232o9464H7214b99130f8801
8867e4152a1545A80075f3271j13522h89p3701b1580k77862A51233a64263e055
8855c7367A3560b25812a7554C13642g962j84831G9251j1527J36523c04669b6875
$$ y = [7303721, 3542480, 1788030, 784043, 423628, 390015, 159015, 175327, 164675, 323536, 185873, 183714, 344969, 208785, 15367, 148486, -258629, -221873, -137403, -183598, -133168, 197407, -52478, -23168, -124845, -86031, -130972, -128835, 20534, -86978, -68746, -138210, 87214, -299130, -68801, -54152, -11545, 180075, -63271, -176793, -889, -74590, -21580, -299442, 151233, -164263, -5055, -37367, 13560, -225812, -17554, 313642, -7962, -192793, 79251, 67724, 204247, -304669, -26875]
$$ [...]
##END NTUPLES=NMR SPECTRUM
##END=
