
##TITLE=AC1151_Tolima_5874892_ognMuTUcEZ
##JCAMPDX= 6.0         $$ Bruker NMR JCAMP-DX V2.0
##DATA TYPE= NMR SPECTRUM
##DATA CLASS= NTUPLES
##ORIGIN= BRUKER
##OWNER= Administrator
$$ 1.72 TOPSPIN		Version 2.1
$$ 2012-03-31 21:43:12.140 -0500  Administrator@TOPSPIN
$$ Compression mode = diff/dup
##.OBSERVE FREQUENCY= 400.13188235
##.OBSERVE NUCLEUS= ^1H
##.ACQUISITION MODE= SIMULTANEOUS (DQD)
##.ACQUISITION SCHEME= undefined
##.AVERAGES= 64
##.DIGITISER RES= 22
##SPECTROMETER/DATA SYSTEM= spect
##.PULSE SEQUENCE= noesygpps1d.comp
##.SOLVENT NAME= COFFEE_meoh
##.SHIFT REFERENCE= INTERNAL, COFFEE_meoh, 1, 14.96805
##AUDIT TRAIL= $$ (NUMBER, WHEN, WHO, WHERE, PROCESS, VERSION, WHAT)
$$ ##TITLE= Audit trail, TOPSPIN		Version 2.1
$$ ##JCAMPDX= 5.01
$$ ##ORIGIN= Bruker BioSpin GmbH
$$ ##OWNER= Administrator
$$ $$ C:\Bruker\TOPSPIN/data/COFFEE/nmr/AC1151_Tolima_5874892_ognMuTUcEZ/12/pdata/1/auditp.txt
$$ ##AUDIT TRAIL=  $$ (NUMBER, WHEN, WHO, WHERE, PROCESS, VERSION, WHAT)
(   1,<2012-03-31 21:43:06.562 -0500>,<Administrator>,<TOPSPIN>,<go>,<TOPSPIN 2.1>,
      <created by zg
	started at 2012-03-31 21:31:34.828 -0500,
	POWCHK enabled, PULCHK disabled,
       configuration hash MD5:
       1A 1E CE 29 27 FD 77 03 67 4E F0 E3 C4 B2 CB 90
       data hash MD5: 64K
       E1 16 66 97 A3 88 B2 34 F9 7B D4 3D F5 33 06 F6>)
(   2,<2012-03-31 21:43:09.828 -0500>,<Administrator>,<TOPSPIN>,<proc1d>,<TOPSPIN 2.1>,
      <Start of raw data processing
       efp LB = 0.3 FT_mod = 6 PKNL = 1 PHC0 = 0 PHC1 = 0 SI = 128K 
       data hash MD5: 128K
       F9 DA 9D ED 20 3D 40 63 FE F2 43 2B D1 EA 6F 07>)
(   3,<2012-03-31 21:43:11.281 -0500>,<Administrator>,<TOPSPIN>,<proc1d>,<TOPSPIN 2.1>,
      <pk PHC0 = 39.67163 PHC1 = 0 
       data hash MD5: 128K
       21 C9 9F C2 6E 05 9B C3 20 4E 8E 7E 58 A7 84 92>)
(   4,<2012-03-31 21:43:11.781 -0500>,<Administrator>,<TOPSPIN>,<proc1d>,<TOPSPIN 2.1>,
      <abs ABSG = 1 
       data hash MD5: 128K
       6E D0 0C 5C A8 D8 5F DF B7 22 0B 87 02 F0 5D 48>)
(   5,<2012-03-31 21:43:11.875 -0500>,<Administrator>,<TOPSPIN>,<proc1d>,<TOPSPIN 2.1>,
      <abs ABSG = 2 
       data hash MD5: 128K
       73 1F 3C A0 92 B7 DE 94 1D A7 7B 73 C9 2A DD 73>)
(   6,<2012-03-31 21:43:11.937 -0500>,<Administrator>,<TOPSPIN>,<proc1d>,<TOPSPIN 2.1>,
      <abs ABSG = 3 
       data hash MD5: 128K
       7F 58 01 3C 88 AC 89 59 37 46 18 6A 19 32 14 53>)
(   7,<2012-03-31 21:43:11.984 -0500>,<Administrator>,<TOPSPIN>,<proc1d>,<TOPSPIN 2.1>,
      <abs ABSG = 4 
       data hash MD5: 128K
       73 A4 B3 87 08 BE 2F FE 58 D3 C2 B3 87 9B 83 63>)
(   8,<2012-03-31 21:43:12.046 -0500>,<Administrator>,<TOPSPIN>,<proc1d>,<TOPSPIN 2.1>,
      <abs ABSG = 5 
       data hash MD5: 128K
       15 79 B8 6A 2E 7D 5B BF BE 6F 84 D5 66 2B D2 08>)
$$ ##END=
$$ 
$$ $$ hash MD5
$$ $$ C9 A5 0F CF 47 6D 5B 7C 9D 1B CC E0 FD D0 59 C2
##$RELAX= 
##$RELAX= 
##$RELAX= 
##$RELAX= 
##$RELAX= 
##$RELAX= 
##$RELAX= 
##$RELAX= 
$$ Bruker specific parameters
$$ [...]
##$TP07= 0
##$TPNAME0= <>
##$TPNAME1= <>
##$TPNAME2= <>
##$TPNAME3= <>
##$TPNAME4= <>
##$TPNAME5= <>
##$TPNAME6= <>
##$TPNAME7= <>
##$TPOAL= (0..7)
0.5 0.5 0.5 0.5 0.5 0.5 0.5 0.5
##$TPOFFS= (0..7)
0 0 0 0 0 0 0 0
##$TUNHIN= 0
##$TUNHOUT= 0
##$TUNXOUT= 0
##$USERA1= <user>
##$USERA2= <user>
##$USERA3= <user>
##$USERA4= <user>
##$USERA5= <user>
##$V9= 5
##$VALIST= <valist>
##$VCLIST= <CCCCCCCCCCCCCCC>
##$VD= 0
##$VDLIST= <DDDDDDDDDDDDDDD>
##$VPLIST= <PPPPPPPPPPPPPPP>
##$VTLIST= <TTTTTTTTTTTTTTT>
##$WBST= 2048
##$WBSW= 25
##$XGAIN= (0..3)
0 0 0 0
##$XL= 0
##$YL= 0
##$YMAX_a= 12397049
##$YMIN_a= -6286855
##$ZGOPTNS= <>
##$ZL1= 120
##$ZL2= 120
##$ZL3= 120
##$ZL4= 120
##$ABSF1= 14.96805
##$ABSF2= -5.58448
##$ABSG= 5
##$ABSL= 3
##$ALPHA= 0
##$AQORDER= 0
##$ASSFAC= 0
##$ASSFACI= 0
##$ASSFACX= 0
##$ASSWID= 0
##$AUNMP= <proc_prof1d_extract.lims>
##$AXLEFT= 0
##$AXNAME= <>
##$AXNUC= <1H>
##$AXRIGHT= 0
##$AXTYPE= 0
##$AXUNIT= <>
##$AZFE= 0.1
##$AZFW= 0.1
##$BCFW= 0
##$BC_mod= 0
##$BYTORDP= 0
##$COROFFS= 0
##$CY= 15
##$DATMOD= 1
##$DC= 0
##$DFILT= <>
##$DTYPP= 0
##$F1P= 0
##$F2P= 0
##$FCOR= 0.5
##$FTSIZE= 131072
##$FT_mod= 6
##$GAMMA= 0
##$GB= 0
##$INTBC= 1
##$INTSCL= 1
##$ISEN= 128
##$LB= 0.3
##$LEV0= 0
##$LPBIN= 0
##$MAXI= 10000
##$MC2= 0
##$MEAN= 0
##$ME_mod= 0
##$MI= 0
##$NCOEF= 0
##$NC_proc= -3
##$NLEV= 6
##$NOISF1= 0
##$NOISF2= 0
##$NSP= 0
##$NTH_PI= 0
##$NZP= 0
##$OFFSET= 14.96805
##$PC= 1
##$PHC0= 39.67163
##$PHC1= 0
##$PH_mod= 1
##$PKNL= yes
##$PPARMOD= 0
##$PPDIAG= 0
##$PPIPTYP= 0
##$PPMPNUM= 2147483647
##$PPRESOL= 1
##$PSCAL= 4
##$PSIGN= 0
##$PYNMP= <proc.py>
##$REVERSE= no
##$SF= 400.130005025831
##$SI= 131072
##$SIGF1= 0
##$SIGF2= 0
##$SINO= 400
##$SIOLD= 131072
##$SPECTYP= <>
##$SREGLST= <1H.CDCl3>
##$SSB= 0
##$STSI= 131072
##$STSR= 0
##$SW_p= 8223.68421052632
##$SYMM= 0
##$S_DEV= 0
##$TDeff= 65536
##$TDoff= 0
##$TI= <>
##$TILT= no
##$TM1= 0
##$TM2= 0
##$TOPLEV= 0
##$USERP1= <user>
##$USERP2= <user>
##$USERP3= <user>
##$USERP4= <user>
##$USERP5= <user>
##$WDW= 1
##$XDIM= 131072
##$YMAX_p= 486151036
##$YMIN_p= -473159019
##$CURPLOT= <Network HP LaserJet P1505>
##$CURPRIN= <$Network HP LaserJet P1505>
##$DFORMAT= <normdp>
##$LAYOUT= <+/1D_H.xwp>
##$LFORMAT= <normlp>
##$PFORMAT= <normpl>
##$SURQMSG= 1
$$ End of Bruker specific parameters
$$ ---------------------------------
##NTUPLES= NMR SPECTRUM
##VAR_NAME=  FREQUENCY,     SPECTRUM/REAL,   SPECTRUM/IMAG
##SYMBOL=    X,             R,               I
##VAR_TYPE=  INDEPENDENT,   DEPENDENT,       DEPENDENT
##VAR_FORM=  AFFN,          ASDF,            ASDF
##VAR_DIM=   131072,        131072,          131072
##UNITS=     HZ,            ARBITRARY UNITS, ARBITRARY UNITS
##FACTOR=    0.0627417313425165, 1,          1
##FIRST=     8223.62146879498, 6640,         -89046
##LAST=      0,             6489,            -89108
##MIN=       0,             -473159019,      0
##MAX=       8223.62146879498, 486151036,    0
$$ Real data points
##PAGE= N=1
##DATA TABLE= (X++(R..R)), XYDATA
$$ [...]
65467 92449 94211 95300 96798 99401 102467 104910 106259 106636 106356 105892 105843 106552 107900 109587 111483 113675
65451 113675 116423 120051 124580 129366 133443 136385 138670 141071 143897 146827 149190 150368 150266 149532 148961
65436 148961 148599 147828 146429 145007 144091 143491 143034 143280 144640 146187 146443 145377 144751 146212 149725 154035
65420 154035 157872 160435 161537 161906 162734 164308 165501 165174 163623 162081 161298 161308 161969 162701 162103 159214
65404 159214 155206 152486 151662 150596 147236 142427 138785 137385 136724 134837 131355 127317 123860 121625 120783
65389 120783 120890 120828 119515 116997 114678 114061 115138 116203 115493 112866 109682 107284 106098 106004 106719 107487
65373 107487 107094 104861 101342 97751 95015 93642 93845 95158 96431 96899 96848 96676 95924 94268 92815 93031
65357 93031 94551 95543 95419 95618 97232 99318 100479 100841 101336 102052 102643 103760 106627 111262 116200 119920
65341 119920 121781 121842 120805 120026 120534 121901 122907 123291 123908 125171 126439 127231 127964 129021 130054 130909
65325 130909 132383 135191 138701 141574 143427 145117 147536 150831 154840 159594 165087 170855 176166 180653
65311 180653 184626 188653 192830 196734 200251 204135 209270 215603 222495 230164 239895 252431 266647 280250
65297 280250 291428 299632 305385 309794 313674 316479 316522 312817 306398 299141 291676 283326 273919 264649
65283 264649 256831 250476 244530 238098 231098 223861 216454 208561 200132 191968 185130 179603 174197 168306
65269 168306 162987 159381 156606 152633 147206 142382 139714 138157 135635 131599 127000 122549 118412 115221
65255 115221 113896 114199 114496 113350 110727 107500 104614 102995 103224 104539 104833 102667 99091 96708 96865
65240 96865 98365 99005 97848 95814 94483 94566 95356 95442 94049 91674 89437 88041 87512 87517 87430 86490 84803 84047
65222 84047 86060 90308 93793 94166 92230 90556 90309 90471 89832 88543 87667 88048 89799 92228 94157 94948
65206 94948 95238 96191 98148 100650 103438 106442 108902 109715 108893 107671 106966 106803 107401 109348 112115 113839
65190 113839 113679 113318 115015 119018 123798 127837 130119 129950 127856 125826 125004 123744 119745 113638 108479
65175 108479 105841 104468 102933 101391 100100 98313 95818 93863 93217 92783 91565 90646 91430 92835 92306
65160 92306 89334 86103 84564 84445 84503 84216 83550 82255 80470 79341 80046 82318 84651 85869 86004 85723
65144 85723 85586 85941 86872 87773 87460 85463 83062 82237 83375 84717 84480 82799 81007 79748 78825 78455 79314
65127 79314 81238 83059 84088 84825 85833 86841 87509 88179 89201 90233 90945 91762 93094 94315 94502 93908
65111 93908 93802 94825 96208 96706 95816 94038 92298 91123 90149 88640 86735 85719 86622 88934 91316 93241
65095 93241 95118 96997 98058 97586 95739 93030 89698 86053 83101 82203 83937 87424 90911 93131 94167
65080 94167 94970 96176 97632 98949 99942 100323 99551 97545 95280 94218 95247 98390 103020 107835 111103
65065 111103 111878 111075 110593 111273 112277 112584 112404 112600 113227 113345 112326 110812 110043 110402 111068 111244 111328 112427
65047 112427 114901 117937 120523 122234 123012 122974 122856 123961 127039 131568 136588 141753 147006 151768 155346
65032 155346 158045 161152 165723 171751 178366 184429 189191 192926 196838 201886 207760 213239 217250 219249
65018 219249 219147 217526 215625 214300 213164 211234 208076 203651 197514 189200 179378 169760 161804 155978
65004 155978 151913 148400 143636 136734 129167 123632 121271 120790 120300 118894 116355 112678 108609 105580 104247
64989 104247 103624 102286 99916 97212 94933 93517 93008 92706 91412 88708 85703 83988 84112 85516 87581
64974 87581 90100 92735 94562 94532 92517 89809 88195 88265 89030 89552 90253 91817 93515 93978 93299 92736 92310
64957 92310 90500 86843 83053 80657 79163 77777 77402 79240 82463 85080 86624 88292 90675 92910 94066
64942 94066 94101 93436 92714 92916 94548 96629 97483 96551 94509 91769 88192 84275 81227 79451 78119 76705
64926 76705 75834 76026 76694 77112 77490 78270 79141 79594 79877 80442 80924 80627 79786 79493 80356 82046 84075 86222
64908 86222 88062 88924 88780 88503 88671 88540 87032 84628 83366 84515 86855 87980 87076 85569 84976 84990 84274
64891 84274 82551 81008 80667 81088 80970 79723 78280 78453 81397 86316 90679 92103 90325 87286 85265
64876 85265 85086 86023 86960 87315 86963 85783 83623 80793 78284 77177 77803 79712 82379 85499 88442 90008
64860 90008 89219 86273 82375 78771 76212 75048 75294 76562 78155 79335 79522 78670 77657 77830 79634 81995
64844 81995 83574 84341 85281 86904 88896 91114 93908 97212 100174 102055 102834 102556 100845 97669 94006
64829 94006 90992 88744 86807 85548 86191 89180 93205 96308 97626 97656 97151 96434 95786 95648 95946 95689 94118
64812 94118 92057 91179 91673 91616 89350 85771 83426 83760 86092 88859 90707 90564 88075 84460 81883 81284
64796 81284 81496 81007 79806 78827 78334 77867 77402 77499 78243 78854 78525 77158 75248 73623 73360 75312 79184
64779 79184 83313 85766 85758 84120 82557 82346 83382 84386 84271 83429 83430 85371 88722 91898 93695 94030 93673
64762 93673 93581 94236 95051 94464 91177 85619 79851 75739 73528 72445 72179 73051 74897 76841 78506 80636
64746 80636 83858 87445 90159 91901 93394 94270 92767 88012 81741 76859 74647 74142 73970 73884 74480 76234
64730 76234 79221 83141 87153 90042 91200 91378 91988 93571 95241 95839 95343 94884 95406 96664 97739 98339
64714 98339 99150 100721 102324 102421 100363 97277 95041 94623 95656 97343 99226 101058 102480 103192 103271 103092
64698 103092 102983 102969 102669 101479 99241 96855 95723 96292 97532 98181 98059 97678 97161 96418 96054 96896 98538
64681 98538 99453 99036 98537 99240 100513 100697 99588 98993 100666 104351 108150 110430 111056 110953 110759 110149 108527
64664 108527 106064 103570 101426 99333 97347 96413 97260 99194 100729 101263 101527 102451 104117 105892 107113
64649 107113 107514 107274 106836 106590 106689 107061 107358 106911 105228 102706 100430 98986 97930 96674 95353 94378 93752
64632 93752 93448 93990 95830 98444 100734 102160 102878 103127 103137 103291 103562 103108 101344 99189 98256 98866 99888
64615 99888 100529 101238 102656 104631 106525 107674 107369 105383 102816 101466 101864 102689 102475 101140 99520 98341
64599 98341 98203 99642 102384 105163 107026 108423 110437 113482 117183 120805 123130 122664 119107 114296 110776
64584 110776 109527 109724 110363 111170 112031 112642 113018 113622 114584 115326 115321 114800 114265 113558 111998 109462 106829 104972
64566 104972 103638 102011 100345 100138 102142 104976 106700 107279 108247 110044 111090 109922 107105 104345 102639
64551 102639 101980 102115 102785 103719 104975 106769 108527 108920 107522 105621 104510 103785 102467 101121 101330 103205
64535 103205 104977 105438 105593 107149 110064 112460 112844 111877 111697 113558 116472 118478 118978 118997 119163 118636 116701
64518 116701 114420 113508 114080 114642 114061 112565 111062 110434 111290 113325 115039 115179 114502 115054 117587 120673
64502 120673 122485 122404 120742 118111 115594 114445 114836 115686 116321 117493 119941 122652 123632 122151 119333 116571
64486 116571 114201 111953 110052 109259 109865 111018 111386 110489 109119 108388 108667 109658 111054 112597 113792 114148
64470 114148 113601 112312 110351 108172 106947 107539 109352 111137 112714 114693 116555 116458 113473 108880 104682
64455 104682 101901 100814 101580 103565 105134 105319 105073 105736 106887 106980 105749 104617 104845 106454 109009 112242
64439 112242 115548 117865 118626 118198 117006 114784 111140 106475 101946 98652 97102 97228 98679 100970 103298
64424 103298 104480 103747 101971 101352 103055 105558 106329 104905 103150 102527 102566 102503 103005 105031 107795 109167
64408 109167 108041 105439 103371 103201 104923 107308 108905 109542 110661 113424 116759 118353 117554 116097 115577
64393 115577 115424 114203 111976 110253 110041 110927 111880 112021 110861 108771 107316 108095 110962 114094 116059 117038
64377 117038 117764 118255 118221 117944 117799 117344 115893 113864 112644 112848 113397 112685 110324 107436 105438 104855 105272
64360 105272 106150 107294 108472 109081 108803 108429 109207 111230 113240 114384 115165 116115 116507 115535 114010 113403 113536
64343 113536 112829 111096 110518 113051 117889 122285 124150 123180 120232 116618 113669 112090 111569 111350 111033 110692
64327 110692 110688 111624 113817 116414 117782 117440 116930 117837 119574 120361 120056 120583 123285 127087 129791 130263 128808
64310 128808 126333 124016 123231 124724 127763 130586 131711 130774 128619 127031 127794 131096 134985 137172 137389
64295 137389 137290 138088 139267 139932 140347 141343 142837 143894 143965 143191 141628 139169 136395 134631 134731 136304 138424
64278 138424 140495 142152 143059 143486 144544 146986 149994 151885 151935 150810 149200 146880 143478 139607 136707
64263 136707 135922 137383 140367 143887 147257 150358 153369 156200 158279 159059 158801 158738 160264 163651 167583
64248 167583 170245 171064 171134 171818 173322 174972 176433 177974 179629 180803 180914 180034 178752 177749 177692 179166
64232 179166 182388 186950 191902 196148 199033 200760 202132 203678 205312 207041 209528 213328 217776 221397
64218 221397 223492 224808 226610 229585 233557 237559 240050 239829 237183 233793 231260 229963 229339 228635 227139
64203 227139 224251 219962 215280 211803 210690 211753 213389 213745 212327 210230 208446 206481 203268 198879
64189 198879 194295 189981 186026 183396 183275 184968 186283 186761 188779 194229 201548 207609 211492 214704 218334
64174 218334 221903 224905 227806 231078 234417 237363 239952 242434 244889 247255 249300 250648 251273 251787 252705
64159 252705 253711 254153 253839 252607 249615 244263 237673 232147 228913 227292 226110 225036 224293 224012 224306
64144 224306 225352 226937 228363 229028 228923 228584 228894 230615 233486 235995 236940 237085 238433 241880 246484 251007
64128 251007 255074 258599 261188 262614 263094 262822 262055 261863 263606 267076 270224 271459 271349 271324 271640 271614 271107
64111 271107 270634 270475 270745 272103 275403 280642 286861 292870 297564 300108 300842 301744 304992 310938 318190
64096 318190 325585 333261 341893 351736 362601 374041 385404 396333 407296 419015 431390 443769
64084 443769 456228 469498 483349 496200 507018 516552 525690 533356 537365 537052 533749 528581 521109
64071 521109 510795 498766 487096 476731 467042 457337 447906 439340 431549 423946 416255 408678 401506
64058 401506 394996 389440 384813 380437 375574 370475 366372 364223 363894 364839 367065 370947 376416 382794 389222
64043 389222 394856 399108 402436 406719 413809 423423 433237 441524 449034 457793 468706 481152 494319
64030 494319 507725 520481 531294 539804 547118 554469 561822 568282 573140 575836 575539 571938 566291 560544
64016 560544 555183 548879 540568 531014 521847 513873 507049 501374 496864 493012 489226 485781 483581 483007
64002 483007 483684 485327 488019 491492 494974 498186 501934 507205 514048 521796 530081 539095 548965 559459
63988 559459 570543 582885 597313 613672 630593 646885 662956 680199 698918 717789 735849
63977 735849 753919 772943 791765 808275 822537 836788 851814 865265 874808 881582 888875 898219
63965 898219 908464 918328 928145 939023 951770 967009 985015 1004808 1024365 1042436 1059458 1076220
63953 1076220 1092414 1107298 1121029 1134281 1146815 1157600 1166620 1175746 1187208 1201525 1217474 1234048
63941 1234048 1251889 1272402 1295840 1320981 1346977 1374859 1406561 1442854 1483200 1527676 1577866
63930 1577866 1634974 1697612 1762525 1827803 1894953 1967598 2048392 2137345 2232875 2334045 2441496
63919 2441496 2556401 2679170 2809640 2948176 3095811 3253383 3421463 3601525 3796414
63910 3796414 4008959 4240579 4492032 4765321 5064275 5393510 5757579 6160992 6608174
63901 6608174 7103148 7649906 8253367 8919426 9653613 10459703 11339187 12291002 13311079
63892 13311079 14392430 15526050 16701636 17907583 19130921 20357391 21570572 22749916
63884 22749916 23869822 24901614 25817519 26594141 27214266 27667052 27946672 28049894 27974309
63875 27974309 27718634 27284467 26677852 25910094 24998045 23963624 22832304 21631172 20386903
63866 20386903 19123270 17858886 16607472 15381248 14193923 13059814 11990488 10993110
63858 10993110 10071391 9226610 8457657 7761515 7134341 6571453 6066495 5612276 5203268
63849 5203268 4836517 4509555 4218296 3957490 3722357 3509128 3314924 3137919 2976925
63840 2976925 2829944 2693699 2565358 2444265 2331241 2226606 2129403 2037848 1949761 1863291
63830 1863291 1778252 1696357 1619262 1546750 1477533 1411108 1347826 1287744 1230710 1177185 1127729
63819 1127729 1081801 1038234 996737 957784 921290 886698 854306 825044 798833 774488 751555
63808 751555 730791 712420 695225 678074 661261 645653 631475 618631 607335 597612 588881 580703
63796 580703 573380 567243 561957 557075 552768 549472 547349 546449 546835 548108 549372 549896 549235 546644 541458
63781 541458 534385 527203 520500 512795 502662 490639 478098 465375 452250 439293 427214 415502
63769 415502 403328 391404 381411 373535 365972 357034 346576 335299 323878 313199 304330 297627 292435
63756 292435 287962 283862 279782 275149 269854 264621 260209 256587 253197 249807 246846 244963 244359 244463 244322
63741 244322 243361 241560 238970 235605 232025 229304 227942 227325 226767 226416 226469 226261 225118 223536 222409 221498
63725 221498 219817 217227 214504 212115 210149 209162 209618 210525 210187 208475 206881 206121 205360 204247 203828 204432
63709 204432 204271 201590 197211 193604 192238 192961 195106 197830 199952 200876 201466 202823 204460 204878 203812
63694 203812 202762 203130 204710 206113 206020 204155 201738 200880 202697 206019 208677 209886 210600 211770 213354
63679 213354 215120 217253 219772 222272 224733 227961 232753 239048 246060 252683 257855 261483 265318 271883
63665 271883 281870 293258 303511 311876 318919 324771 328906 331104 331517 330093 326958 323072 319367 315343
63651 315343 309717 302591 295807 290823 287320 284382 281952 280406 279603 279264 279568 280475 280972 279956 277452
63636 277452 274110 270065 265427 261408 259474 259330 259147 258035 256946 256737 256765 256195 255505 255702 256913 258754
63620 258754 261380 265225 270323 276749 284870 294137 302494 308459 313200 319014 326210 333199 339268 345122
63606 345122 350422 353062 351835 348089 343572 338119 330895 322669 315310 309734 305757 303354 302552 302402 301596
63591 301596 300206 299653 300791 302879 304552 305034 304373 303178 302202 301665 301316 301612 304181 309982 317569 324582
63575 324582 330744 337741 346211 354828 362962 372295 384519 398955 414049 430116 448719 469840 491659
63562 491659 513294 536071 561443 588900 616821 644684 673658 705337 740470 778650 818594
63551 818594 858602 897044 932629 964356 991396 1013108 1029132 1039377 1043961 1043091 1037058 1026604
63539 1026604 1013293 999058 985003 970952 956524 942181 928572 915122 900113 882202 861220
63528 861220 837568 811828 785277 759859 736976 716660 698324 681711 666735 653139 641048
63517 641048 631317 624477 619644 615308 611026 607538 605372 604271 604075 605264 608330 613194 619613 627738
63503 627738 638089 651361 668211 688567 711058 733912 756838 781424 809249 840185 873001
63492 873001 906998 942275 978704 1015408 1051206 1084931 1115178 1140264 1158872 1170828 1177203 1179517
63480 1179517 1178672 1174707 1167775 1159124 1150562 1143007 1136082 1129040 1121175 1111147 1096971 1077342 1052372
63467 1052372 1022558 987941 949009 907634 866070 825478 786164 748504 712687 678322 645562
63456 645562 615880 590237 567089 544057 521312 501243 484687 469807 455334 442557 432797 424863
63444 424863 416939 409668 405346 404696 406196 408172 409961 411281 412044 412837 414342 416297 418173 420719 425482
63429 425482 432683 440918 449174 457852 467434 477405 487158 496907 506951 516785 525603 533021 538759 542308
63415 542308 543593 543329 542033 539264 534565 528636 522702 516982 510579 502773 493833 484742 476700 470688
63401 470688 466838 464275 462162 460763 460930 462660 464876 466637 467908 469162 470941 473949 478869 485721
63387 485721 493857 502728 512126 521598 530453 538852 548332 560637 576313 594735 615057 636764 659925
63374 659925 685473 714655 747430 781945 816528 851929 890536 933537 979937 1028387 1078619
63363 1078619 1130550 1183048 1234520 1284246 1332445 1379257 1423936 1464539 1498155 1522149 1535747
63352 1535747 1540024 1536225 1525092 1508258 1488891 1469485 1449693 1427743 1403483 1378295 1352127 1322574
63340 1322574 1287721 1248627 1208106 1167906 1127880 1087269 1045933 1004680 965004 928353 895282
63329 895282 865520 838867 815432 794987 777001 761782 750699 744540 742225 741815 742329 743993 747386
63316 747386 753193 762260 774919 790479 808159 828218 851321 877187 905018 935202 969302 1007922
63304 1007922 1049521 1091905 1134291 1177490 1222516 1269423 1317028 1363206 1405548 1441973 1470802
63293 1470802 1490566 1500405 1500742 1493025 1478637 1458620 1434640 1409356 1384949 1361471 1337195 1310507
63281 1310507 1281070 1249419 1216169 1181740 1146248 1109301 1070315 1029554 988668 949753 913735
63270 913735 880034 847815 817085 788231 760945 734450 708823 685384 665319 648254 632619
63259 632619 617243 602305 588847 577715 568905 561617 554892 548380 542568 538266 535875 534981 534485 533295
63245 533295 531422 530336 531531 534544 537100 537580 536532 535081 532691 527764 520172 511970 505308 500504
63231 500504 496485 492396 488348 485008 482883 481814 481047 479959 478762 478298 479252 481750 485374 489125 491756
63216 491756 492895 493628 495225 497507 499395 501004 503950 509249 515943 522414 528261 534276 541243 549445
63202 549445 558762 568595 578057 586881 595793 605559 616007 626457 636698 647053 657935 669879 683504
63189 683504 698746 714637 730654 747939 768128 791107 815000 838623 862985 889853 919588
63178 919588 951191 984122 1019235 1057675 1099327 1142803 1186823 1231133 1275888 1320622 1364426
63167 1364426 1406909 1448283 1488526 1527362 1565346 1603962 1643961 1684268 1723396 1761310 1798834
63156 1798834 1835466 1868877 1896693 1917927 1932627 1941027 1943303 1939361 1928374 1909046 1880769 1844326
63144 1844326 1801432 1754048 1704123 1653250 1602209 1551340 1501607 1454700 1411812 1373051 1338575
63133 1338575 1309599 1287388 1271604 1260519 1252708 1247771 1245533 1245605 1248070 1253757 1263161 1275587 1289919
63120 1289919 1305723 1322799 1340042 1356069 1371347 1388538 1409644 1433254 1455688 1474740 1491238
63109 1491238 1506831 1521499 1533938 1543283 1549232 1551006 1547625 1539357 1527818 1514175 1497960 1477916
63097 1477916 1453384 1424550 1392161 1357704 1323346 1290880 1260691 1232150 1204823 1178906 1154740
63086 1154740 1132505 1112334 1094211 1077664 1062071 1047525 1035036 1025477 1018411 1012237 1005595 998482
63074 998482 991922 986785 983110 980415 978146 975732 972820 969960 968561 969412 971540 973383 974970 977828
63060 977828 982593 987980 992729 997383 1003054 1009432 1015467 1021527 1029173 1038738 1048591 1057227 1064806 1072107
63046 1072107 1079183 1085973 1093218 1101511 1109896 1116722 1121937 1127613 1135837 1146583 1157892 1167836 1176189
63033 1176189 1184351 1193718 1204133 1214101 1222606 1230237 1238232 1246926 1255822 1264897 1274966 1286603 1299338
63020 1299338 1312222 1324873 1337781 1351904 1368064 1386442 1406659 1428586 1453009 1480918 1512025
63009 1512025 1544512 1576647 1608450 1641583 1677859 1718065 1762023 1809442 1860515 1915452 1973475
62998 1973475 2032947 2093254 2156259 2224823 2299646 2378510 2459028 2541213 2626611 2715642 2806874
62987 2806874 2898572 2989982 3080998 3171334 3260244 3346770 3430297 3511103 3590156 3668055 3744462
62976 3744462 3818822 3890943 3960180 4024688 4082593 4133519 4177796 4214188 4239609 4251116 4247084
62965 4247084 4226415 4188291 4133531 4064946 3985326 3895864 3797422 3692445 3584494 3476476 3370420
62954 3370420 3268444 3172623 3083968 3002511 2928362 2861896 2803216 2752492 2710720 2678953 2656715
62943 2656715 2642203 2634199 2632695 2637463 2647251 2660874 2677951 2697955 2719580 2741892 2765105 2789232
62931 2789232 2812861 2834507 2854593 2874638 2894581 2912089 2924518 2930462 2929277 2920338 2903313 2878359
62919 2878359 2845520 2804511 2755481 2699383 2637209 2569444 2496661 2420050 2340931 2260320 2179505
62908 2179505 2100380 2024456 1951888 1882193 1815590 1752846 1694181 1639329 1588581 1542653 1501273
62897 1501273 1462804 1425840 1390497 1357729 1328007 1301175 1276971 1254924 1234184 1214327 1196245
62886 1196245 1181396 1170032 1160784 1152169 1143836 1136025 1128446 1120387 1111716 1103049 1094885 1087079 1079346
62873 1079346 1071735 1064253 1056429 1047854 1038965 1030617 1022807 1014548 1005345 996170 988407 982264 976927 971899
62859 971899 967333 963152 958843 954423 950725 948138 945641 941873 936983 932833 931229 932145 933735 934025 932598
62844 932598 930565 928900 927437 926020 925931 928760 933886 938596 941276 943058 945508 948100 949409 949603 949940
62829 949940 950451 950119 949163 949066 950077 950536 949333 947366 945656 943496 939621 934163 928237 922414 916762 911810
62813 911810 908293 906178 904755 903282 900954 896866 890998 884780 879652 875401 870837 865669 860493 855215
62799 855215 848899 841415 834089 828269 824143 821261 819380 818296 817582 817063 817107 818050 819767 822075 824940
62784 824940 827914 830013 830882 831676 833963 837760 841370 843384 844400 846422 850718 856560 862101 866268 869675
62769 869675 873777 879446 886498 894300 902361 910294 917695 924463 931308 939577 950204 962643 975076
62756 975076 985974 995403 1004444 1013547 1022196 1030392 1039556 1051151 1064795 1078574 1091131 1102774 1114684
62743 1114684 1127861 1143066 1161075 1182444 1207115 1234334 1262854 1291489 1320059 1349782 1382200
62732 1382200 1417743 1455903 1496822 1541875 1592379 1648462 1709698 1776215 1848528 1926755 2010802
62721 2010802 2101134 2198595 2303464 2415250 2533474 2657962 2788027 2921908 3057558 3193767
62711 3193767 3329906 3464410 3593881 3713871 3820331 3910254 3981477 4032507 4062402 4070291
62701 4070291 4055125 4016613 3956455 3877802 3783117 3673330 3549667 3415445 3275137 3132144
62691 3132144 2988429 2845881 2706722 2572458 2443508 2320149 2203013 2092444 1988190
62682 1988190 1890030 1798111 1712581 1633583 1561642 1497129 1439254 1386611 1338880 1296768 1259887
62671 1259887 1226216 1194563 1166201 1142722 1123265 1105448 1088428 1073395 1061292 1051658 1043973 1038652
62659 1038652 1036116 1035815 1036771 1038523 1041221 1045371 1051773 1061138 1073451 1088076 1104710 1123783 1145789
62646 1145789 1170691 1198251 1228606 1262371 1300361 1343134 1390475 1441326 1494620 1550079 1607970
62635 1607970 1668437 1731630 1798084 1867953 1939941 2011899 2082458 2150977 2215756 2273613 2321877
62624 2321877 2359775 2387102 2402564 2404596 2393252 2369989 2335779 2290563 2234725 2170228 2099884
62613 2099884 2025973 1949890 1872796 1796185 1721619 1649815 1580109 1511318 1443374 1377829 1316538
62602 1316538 1260226 1208533 1160817 1116362 1074347 1034496 997497 964067 933763 905471 878936
62591 878936 854872 833488 813834 794940 776910 760460 745957 733293 722138 711819 701390
62580 701390 690443 679683 670203 662322 655461 648991 642795 637032 631690 626459 620919 615001 609407 605397
62566 605397 603827 604411 606067 607943 609941 612412 615607 619456 623751 628457 633908 640725 649543 660828
62552 660828 674599 690065 705705 720341 734291 749069 765896 785022 806586 831286 859630
62541 859630 891136 925034 961389 1000804 1043392 1088956 1138003 1191511 1249510 1310783 1374358
62530 1374358 1440445 1509265 1579543 1648838 1715153 1777621 1835749 1888538 1934435 1971726 1998726
62519 1998726 2013835 2015927 2005143 1983226 1952544 1914366 1868473 1814858 1755403 1693105 1629909
62508 1629909 1566154 1502088 1438741 1376997 1316847 1258291 1202298 1150145 1102329 1058788 1019686
62497 1019686 985193 954668 926722 900117 874457 850343 828950 810724 794171 776837 758151
62486 758151 740392 725910 714230 703030 691210 679490 668571 658512 649843 643466 639055 635136
62474 635136 631298 628906 629057 631156 634218 638208 643208 648583 654073 660623 668926 678166 687566 698303
62460 698303 712320 729816 749552 771205 795632 822745 850871 878729 906747 935994 967060
62449 967060 1000437 1036672 1075263 1114334 1152326 1189164 1224790 1257272 1283683 1302630 1314771
62438 1314771 1320830 1320258 1312232 1297036 1275780 1249381 1218650 1185144 1150984 1117452 1084192 1050201
62426 1050201 1015410 981096 948961 920106 894680 872045 851282 831896 814095 798102 783261
62415 783261 768312 752773 737650 724578 714586 707759 703568 701100 699358 697808 696572 695901 695782 696241
62401 696241 697607 700091 703514 707859 713649 721222 729960 738834 747431 755885 764036 771497 778512 786115
62387 786115 795316 806436 819050 832034 843890 853664 861567 868207 873351 875985 875382 871462 864404
62374 864404 854709 843544 832025 820045 806567 791174 774564 757575 740694 724654 710372 697867
62362 697867 686210 675033 665214 657520 651397 645811 640606 636414 633785 633022 634354 637674 642414 648012
62348 648012 654064 659985 665397 671161 678839 688564 698617 707953 717827 729615 742210 753353 762880
62335 762880 772778 784194 796229 807766 818627 828430 835978 840841 844449 848484 852799 855829 856754
62322 856754 856492 856601 857760 859559 861714 865263 871991 882526 895702 910389 927186 947292 970443
62309 970443 995624 1023640 1057065 1097156 1142388 1190849 1242619 1298755 1359238 1423444 1491743
62298 1491743 1564864 1641836 1719996 1797258 1873144 1947153 2017042 2079524 2132359 2175091 2207773
62287 2207773 2229603 2239378 2237094 2224218 2201897 2169699 2127135 2076020 2019948 1961355 1900359 1836673
62275 1836673 1771191 1705155 1639408 1575503 1516063 1462308 1412183 1362689 1313645 1267485 1225637
62264 1225637 1186837 1149194 1112337 1077086 1044251 1014384 987797 964280 943320 924815 909073
62253 909073 896081 885473 877091 870740 865551 860621 856263 853506 852396 852063 852599 855211 859905 864434
62239 864434 866520 866081 864467 862619 860940 859904 859507 858791 857032 854883 853422 852773 852710 853903 857265 862596
62223 862596 869107 876837 886135 896207 905839 915564 927539 943056 961562 982284 1005243 1030144
62211 1030144 1055917 1082352 1111037 1143541 1179515 1217673 1257964 1301605 1349334 1400726 1455177
62200 1455177 1512749 1573989 1639518 1709759 1784427 1862042 1940156 2016078 2087283 2151393 2206228
62189 2206228 2249882 2280781 2298040 2302047 2294261 2276003 2247639 2209249 2161792 2107129 2047137 1983159
62177 1983159 1916048 1846375 1774925 1703491 1634834 1571120 1512493 1457871 1407021 1361135 1321318
62166 1321318 1287320 1258083 1232903 1211636 1194144 1180030 1168741 1159694 1152494 1147176 1143937 1142467
62154 1142467 1141870 1141551 1141907 1143773 1147283 1151588 1155688 1159255 1162679 1166436 1170505 1174336 1177472 1180230 1183650
62139 1183650 1188662 1195426 1203591 1213088 1224386 1237874 1253075 1268610 1283105 1296377 1309760 1325148
62127 1325148 1343666 1365278 1389481 1415945 1444338 1473834 1503125 1530968 1556779 1580978 1604851
62116 1604851 1629735 1656138 1683940 1713569 1746390 1783343 1823661 1865858 1909934 1957644 2010273
62105 2010273 2066903 2125338 2183907 2241456 2296071 2345078 2386602 2420334 2446314 2463680 2471388
62094 2471388 2469949 2461681 2448936 2432355 2411137 2384731 2353890 2320129 2284704 2248533 2212785 2178761
62082 2178761 2146881 2116334 2086372 2057810 2032665 2012213 1995841 1981953 1969522 1958457 1948832
62071 1948832 1940344 1932567 1925402 1919140 1914181 1910755 1908824 1908248 1909062 1911580 1916263 1923600 1934081 1948048
62057 1948048 1965351 1985182 2006397 2028207 2050817 2075509 2103819 2136180 2171374 2207608 2244088
62046 2244088 2281247 2319749 2360054 2402935 2449193 2498040 2546495 2591585 2633097 2673465 2715093
62035 2715093 2758652 2803934 2851263 2901265 2953625 3006619 3058055 3106807 3153805 3201539 3252195
62024 3252195 3306094 3362127 3419604 3479158 3541813 3607765 3676406 3747116 3819582 3893546 3968580
62013 3968580 4044144 4119842 4195732 4272329 4350103 4429005 4508820 4589843 4672720 4757494 4843125
62002 4843125 4927900 5009828 5086765 5157071 5220522 5277997 5329922 5375583 5414395 5447122 5475169
61991 5475169 5499093 5518586 5533735 5545584 5555378 5563841 5571378 5578702 5587008 5597381 5609936 5623817
61979 5623817 5638558 5655338 5676055 5700995 5728373 5756617 5785991 5817019 5848280 5877341 5903612
61968 5903612 5928788 5954311 5979678 6003693 6026212 6047829 6068451 6086913 6101808 6112394 6119131
61957 6119131 6123670 6127917 6132582 6136697 6138716 6137882 6134472 6129265 6123198 6117376 6112963 6110839 6111166 6113087
61943 6113087 6115061 6116069 6116648 6118387 6122265 6127876 6134306 6141174 6148387 6155319 6160874 6164418 6166292 6167269
61929 6167269 6167477 6165915 6161232 6153251 6143554 6134063 6125013 6114823 6102078 6087109 6071440 6056233 6041664
61916 6041664 6027276 6012285 5995823 5977538 5957934 5937650 5916442 5893375 5868098 5841458 5814584
61905 5814584 5787643 5759705 5729592 5696661 5661047 5623664 5585965 5549143 5513148 5476864 5439712
61894 5439712 5402790 5367749 5334675 5302168 5269809 5239339 5212389 5187935 5163475 5138460 5115002
61883 5115002 5095035 5078316 5063907 5052180 5044202 5040014 5038957 5041336 5048364 5060356 5076065 5094234
61871 5094234 5115020 5139396 5167664 5199249 5233880 5272524 5316874 5367961 5425480 5488787 5558599
61860 5558599 5637297 5727181 5828722 5941054 6064190 6200149 6351621 6519969 6705259 6908426
61850 6908426 7133034 7384418 7666975 7982455 8330987 8713561 9133342 9594732 10101333
61841 10101333 10654495 11253304 11895792 12580165 13304426 14064088 14849880 15647205 16436465
61832 16436465 17192339 17882774 18470726 18919348 19197824 19285477 19174510 18871739 18397543
61823 18397543 17781207 17055277 16251940 15401189 14529170 13657219 12802675 11979977 11199833
61814 11199833 10467636 9784256 9149195 8562673 8024834 7534006 7086361 6676950 6301146
61805 6301146 5955951 5640304 5353651 5094070 4858314 4643695 4449006 4273250 4114387
61796 4114387 3970051 3838816 3719964 3612387 3514571 3425495 3344830 3272232 3207039 3148587
61786 3148587 3096246 3048961 3005263 2964012 2924997 2888786 2856139 2827460 2802476 2780427 2760812
61775 2760812 2743883 2730065 2718967 2709589 2701724 2696537 2695215 2697426 2701836 2707950 2716510 2727844 2740657
61762 2740657 2753209 2765285 2778321 2793878 2812717 2835116 2861041 2889743 2920162 2952257 2987209
61751 2987209 3025723 3066903 3109755 3155326 3206275 3264504 3330151 3402898 3483054 3570932 3666088
61740 3666088 3767913 3876652 3993422 4119553 4256162 4403973 4563191 4733841 4916496
61731 4916496 5112286 5322122 5546506 5786537 6044514 6323001 6623855 6948861 7300921
61722 7300921 7683739 8100544 8554160 9048493 9589056 10181485 10830144 11538709 12311616
61713 12311616 13154117 14070844 15064801 16137696 17290474 18522642 19830641 21206596
61705 21206596 22637818 24106042 25585551 27040910 28425725 29683279 30749606 31560015
61697 31560015 32059236 32212019 32009079 31466069 30618417 29515885 28217255 26783541 25270630
61688 25270630 23724905 22183361 20675743 19225565 17849697 16558233 15355476 14241567
61680 14241567 13214089 12269316 11402914 10610179 9886166 9226010 8625156 8079253 7583753
61671 7583753 7133564 6723237 6348033 6005123 5693297 5410880 5154211 4918909 4702368
61662 4702368 4503938 4322718 4156561 4003669 3863546 3735178 3615458 3501174 3391986
61653 3391986 3289786 3195244 3106741 3022828 2943944 2871033 2803921 2741906 2684603 2631128 2579628
61642 2579628 2528964 2480055 2434196 2390639 2347309 2303556 2260695 2219830 2180533 2141903 2103585
61631 2103585 2065322 2026667 1987870 1950330 1915502 1883728 1854401 1826703 1799910 1773596 1747968
61620 1747968 1723592 1700636 1678807 1658025 1638441 1619916 1602453 1587097 1574983 1565105 1554641
61609 1554641 1542447 1530666 1521512 1513777 1504486 1493239 1482762 1475228 1469935 1464844 1458706 1451266 1443049
61596 1443049 1435652 1430749 1427941 1424756 1419611 1413539 1408066 1402787 1396573 1390174 1385702 1383850 1383373 1383330 1384168
61581 1384168 1386103 1387954 1388513 1388104 1387919 1388523 1389960 1392697 1397175 1402489 1406673 1408884 1410630 1414237 1420287
61566 1420287 1427138 1432932 1437635 1442809 1449589 1457223 1463684 1467558 1469230 1470213 1471389 1472031 1470614 1466547
61552 1466547 1460839 1454935 1449201 1442975 1435867 1428291 1420572 1412286 1403075 1393520 1384415 1375507 1365988 1356288
61538 1356288 1348232 1342842 1338793 1333897 1327695 1321781 1317791 1315950 1315605 1316281 1317833 1320202 1323617 1328788
61524 1328788 1336459 1346754 1359205 1373382 1389352 1407567 1428285 1451087 1475121 1500142 1527139
61513 1527139 1557514 1591603 1628518 1667381 1708062 1750567 1794634 1840457 1888920 1940228 1992813
61502 1992813 2044636 2095345 2146276 2198438 2251281 2303181 2352150 2396284 2434863 2469289 2501893
61491 2501893 2533432 2562772 2589140 2613254 2635516 2654603 2669053 2679170 2685847 2688312 2684941 2676154
61479 2676154 2664745 2652887 2640220 2625539 2609229 2593150 2578873 2566926 2557320 2549887 2544201 2540022
61467 2540022 2538183 2540662 2549348 2564677 2585650 2611251 2641688 2678064 2721163 2771134 2828440 2894344
61455 2894344 2970053 3055971 3152343 3260073 3380151 3512775 3658053 3817313 3992602 4184833
61445 4184833 4393502 4618442 4860652 5120681 5396944 5686340 5986049 6294068 6608158
61436 6608158 6924502 7236721 7535520 7809549 8047302 8238712 8375831 8453720 8471942 8434855
61426 8434855 8349491 8222887 8061494 7872138 7662216 7438780 7208238 6976997 6751401 6536363
61416 6536363 6334353 6146098 5972129 5813558 5671880 5548460 5443986 5358037 5289277 5236393
61406 5236393 5198832 5176501 5168980 5175524 5195816 5230117 5278285 5338931 5409840 5488795 5573452 5660901
61394 5660901 5748639 5836330 5925585 6017217 6109387 6199321 6286195 6370961 6453660 6532473 6605949
61383 6605949 6674806 6740660 6803895 6863761 6919940 6972849 7022647 7068921 7111412 7150144 7184642
61372 7184642 7213699 7236247 7252150 7262037 7266681 7266620 7262022 7252812 7239145 7221671 7200920 7176535 7147732
61359 7147732 7114733 7079271 7043421 7008421 6974982 6944138 6916912 6893124 6871269 6850019 6829409
61348 6829409 6810077 6791545 6771935 6749704 6725170 6699765 6673942 6646677 6617346 6587437 6559639
61337 6559639 6535535 6515113 6498735 6488730 6488393 6499953 6524299 6562637 6617556 6692143 6788428 6906960
61325 6906960 7047567 7210302 7395947 7605821 7840781 8100051 8381225 8681590 8998953
61316 8998953 9330573 9671641 10015414 10354458 10680681 10984358 11254651 11481939 11659103
61307 11659103 11780462 11841142 11839024 11776694 11660138 11495591 11288469 11044449 10769600 10469099
61297 10469099 10147280 9809440 9462313 9112100 8763061 8418603 8082427 7757577 7445496
61288 7445496 7147467 6866300 6605073 6364463 6142877 5939409 5755389 5592585 5450928
61279 5450928 5328584 5223512 5134392 5060608 5002013 4958514 4929529 4914078 4911531 4921746 4944222
61268 4944222 4977684 5020879 5073231 5134025 5201358 5272587 5345510 5418450 5489609 5557529 5622255
61257 5622255 5684776 5744730 5799637 5847242 5887889 5923504 5954633 5979711 5997303 6007885 6012936
61246 6012936 6013073 6007633 5995529 5976042 5949176 5915761 5876884 5832921 5783499 5728749 5670026 5608781
61234 5608781 5545125 5478194 5407717 5334679 5260667 5187215 5115551 5046298 4979428 4915102 4854385
61223 4854385 4798497 4747434 4700028 4655274 4612808 4572256 4533174 4495951 4461729 4430789 4401616
61212 4401616 4372069 4341010 4308464 4274916 4241107 4208158 4177325 4149859 4127326 4111412 4102761
61201 4102761 4100512 4103747 4113246 4131113 4158897 4196810 4244807 4303577 4374103 4456694 4550863 4655856
61189 4655856 4770916 4895148 5027533 5167044 5312248 5460203 5605866 5742947 5865549
61180 5865549 5968710 6047427 6095900 6108538 6081833 6015276 5911135 5774010 5610163 5426288
61170 5426288 5228568 5022941 4815448 4611132 4412682 4221178 4038274 3866621 3707903
61161 3707903 3561606 3426378 3301930 3188981 3087849 2997601 2916237 2841470 2771928 2707916
61151 2707916 2650622 2600523 2557168 2520385 2490565 2467418 2449560 2435861 2426273 2420872 2419224 2421273
61139 2421273 2427624 2437954 2450295 2462921 2475827 2489060 2500794 2508865 2513537 2516833 2519363 2519592 2516268
61126 2516268 2509834 2501075 2489897 2476045 2459857 2441619 2421015 2397790 2372442 2346008 2319666 2294418
61114 2294418 2270353 2246277 2221046 2195235 2170358 2146300 2120827 2092127 2060602 2027504 1992930
61103 1992930 1956197 1917415 1877526 1837134 1796203 1754854 1713817 1674080 1636423 1601150 1567969
61092 1567969 1536285 1505733 1476115 1446801 1416809 1385750 1354096 1322210 1289921 1257703 1227495
61081 1227495 1201248 1178814 1158221 1138003 1118370 1100075 1083254 1067995 1055257 1046304 1041352 1039375
61069 1039375 1039150 1039977 1041549 1043878 1047639 1053899 1062965 1073765 1084805 1095439 1105828 1116112 1126351
61056 1126351 1137020 1148661 1160919 1172680 1183325 1193176 1202598 1211454 1219645 1227272 1233884 1238550 1241276
61043 1241276 1243430 1245871 1247614 1247430 1246160 1246053 1248075 1251063 1253492 1254878 1255367 1255138 1254635 1254489 1254649 1254176
61027 1254176 1252395 1249883 1247996 1247638 1248589 1249676 1249460 1247245 1243652 1240079 1237511 1235976 1234992 1234155 1233288
61012 1233288 1232332 1231186 1229614 1227474 1225119 1223191 1221786 1220227 1218065 1215932 1214895 1215229 1216268 1217213 1217744
60997 1217744 1218179 1219367 1222030 1225894 1230064 1234582 1240780 1249429 1259478 1269561 1279980 1292022 1305974
60984 1305974 1321197 1337742 1356367 1377064 1399012 1422205 1447872 1476972 1509277 1544287 1582212
60973 1582212 1623676 1668923 1717473 1768144 1819688 1872009 1926531 1984804 2047249 2113889 2185441
60962 2185441 2262542 2344597 2430982 2522935 2622598 2730378 2844921 2965622 3093407 3228827
60952 3228827 3371136 3519834 3675831 3840652 4015793 4203341 4406209 4627399 4869896
60943 4869896 5137159 5432623 5758782 6118076 6514667 6954555 7444853 7994771 8616635
60934 8616635 9323712 10127078 11035869 12058913 13203507 14475011 15882701 17445663 19189636
60925 19189636 21142245 23337476 25809142 28536914 31363412 33976265 36024782 37305784
60917 37305784 37861363 37911311 37709005 37459231 37319059 37387030 37628725 37820235 37620553 36754936
60907 36754936 35162720 32994044 30488272 27857105 25246112 22750459 20431326 18319009
60899 18319009 16418757 14723889 13224644 11908508 10759577 9760946 8896048 8147408
60891 8147408 7496677 6926985 6424425 5977776 5578768 5222495 4905538 4623128 4369375
60882 4369375 4140186 3934330 3751286 3589221 3445122 3315546 3196798 3085265 2978008
60873 2978008 2872833 2768439 2665336 2565881 2472001 2383064 2296965 2212894 2131820 2054717 1981735
60862 1981735 1912993 1848749 1788660 1731833 1677570 1625394 1574821 1526019 1479876 1436234 1392930
60851 1392930 1348394 1304579 1265307 1231854 1202094 1173969 1147617 1123670 1101554 1080447 1060347
60840 1060347 1041183 1022091 1002585 983530 966057 950281 935865 923198 913137 905786 900126 894921
60828 894921 889933 886222 884969 885753 886558 886045 885357 886969 892190 900378 909913 919002 926294 931994 937923
60813 937923 945367 953411 960514 966916 973879 981322 988211 994872 1002579 1010766 1016922 1019876 1021312 1023355
60799 1023355 1026314 1029378 1031923 1033417 1033641 1033803 1035951 1040423 1045208 1048691 1051659 1055649 1060547 1065051
60785 1065051 1068655 1072121 1076552 1082677 1090448 1098849 1106791 1114487 1123024 1132310 1140628 1146687 1150896 1154052
60771 1154052 1156202 1157743 1160323 1165345 1172320 1179783 1187223 1195175 1203996 1213458 1223214 1233012 1242830 1253189
60757 1253189 1264740 1277031 1288395 1297588 1305012 1311898 1318868 1325617 1331249 1334601 1335162 1334097 1333458 1333823
60743 1333823 1333485 1330360 1323771 1314012 1301434 1286800 1271451 1256137 1240347 1223517 1206141 1189049
60731 1189049 1172554 1157095 1143731 1132916 1123483 1113926 1104177 1095231 1087571 1080957 1075442 1071659 1070175
60718 1070175 1071057 1073819 1077479 1081201 1085335 1091363 1100411 1112234 1125838 1140387 1155240 1170059 1185395
60705 1185395 1202376 1221281 1241151 1261128 1281269 1301600 1321434 1340216 1358061 1374794 1389563
60694 1389563 1402163 1413843 1425973 1438679 1451381 1463642 1474814 1484041 1491589 1499134 1507708 1516291
60682 1516291 1523357 1528843 1533409 1536621 1537082 1533858 1527085 1518031 1509233 1503289 1500358 1497770 1493119 1486595
60668 1486595 1479342 1471166 1461520 1451336 1441804 1432343 1421820 1410957 1401380 1392917 1384108 1374932 1366641
60655 1366641 1359098 1350848 1342231 1335935 1333557 1333573 1333794 1334086 1335384 1337282 1338220 1337603 1336614 1336987 1339461 1343286
60639 1343286 1346952 1349556 1351514 1353775 1356542 1359102 1360562 1360235 1357832 1354099 1350951 1349975 1350867 1352037 1352575
60624 1352575 1352891 1353722 1355271 1356981 1357284 1353954 1345830 1334120 1321134 1307927 1294032 1279082 1263495
60611 1263495 1247697 1231871 1216539 1202466 1189964 1178968 1169530 1161396 1153641 1145894 1139425 1135624
60599 1135624 1133778 1131984 1130142 1130241 1133354 1138096 1142649 1146886 1151696 1157347 1163350 1169063 1173752 1176695
60585 1176695 1177797 1177665 1176914 1175929 1175198 1174947 1174417 1172548 1169575 1166914 1165236 1163785 1162013 1160832 1161647 1164841
60569 1164841 1169615 1174699 1179077 1182873 1187739 1195398 1205524 1215959 1225392 1234873 1246240 1260078 1275805
60556 1275805 1292989 1311797 1332553 1355266 1379280 1403286 1426278 1448545 1471080 1493968 1516077
60545 1516077 1536129 1553054 1565350 1571514 1571598 1567313 1560115 1550083 1536973 1521315 1504082 1486257
60533 1486257 1469128 1453798 1439846 1425565 1410274 1395394 1382629 1372087 1362981 1355098 1348585 1343058
60521 1343058 1337955 1333225 1328904 1324660 1320476 1317049 1314737 1312857 1310853 1309287 1308578 1307523 1304466 1299665
60507 1299665 1295170 1292346 1290641 1288992 1287598 1287928 1291508 1298903 1309465 1321879 1335034 1348499 1362384
60494 1362384 1377339 1394751 1416089 1441413 1469021 1497236 1526210 1557394 1591626 1628503 1667344
60483 1667344 1707885 1750009 1793559 1838612 1885278 1932802 1979038 2021146 2056705 2084144 2102348
60472 2102348 2110270 2107185 2093304 2070118 2040218 2006870 1973404 1942361 1915040 1892237 1875316 1865636
60460 1865636 1862710 1864103 1868006 1875015 1886396 1901710 1919670 1940552 1965676 1994728 2025839 2058826
60448 2058826 2096494 2141943 2196156 2259144 2331944 2416232 2512961 2622552 2745869 2884185 3038841
60437 3038841 3211546 3404200 3617629 3851006 4102989 4372808 4660192 4965461 5290099
60428 5290099 5635785 6001865 6384429 6777421 7171764 7551428 7892150 8166795 8352561
60419 8352561 8433621 8400662 8252455 7998499 7657740 7253577 6810066 6350318 5893943 5453890
60409 5453890 5036899 4647459 4289689 3965137 3671287 3404352 3162752 2946660 2755081
60400 2755081 2584990 2433165 2297647 2177217 2070346 1975102 1889721 1812918 1743678 1680938
60390 1680938 1623650 1571116 1523022 1478998 1438434 1400983 1366795 1335819 1307133 1279658 1253455
60379 1253455 1229762 1209659 1193040 1178844 1165861 1153352 1141260 1129870 1119134 1108569 1098073
60368 1098073 1088366 1080081 1072755 1065350 1057545 1049849 1042562 1035348 1027823 1020015 1012321 1005584 1001056 999422
60354 999422 999841 1000725 1001724 1004198 1009361 1016569 1023972 1030544 1036897 1044119 1052177 1059714 1065443 1069548 1073434
60339 1073434 1078169 1083678 1089608 1096216 1103756 1111478 1118203 1123794 1129349 1135965 1144013 1153536 1164422 1175788
60325 1175788 1185965 1193684 1199064 1203055 1206186 1208146 1208398 1206912 1204390 1201829 1199696 1197405 1193824 1188496
60311 1188496 1182301 1176817 1173079 1171006 1169870 1169091 1168519 1168207 1168350 1169604 1172968 1178731 1185603 1191579 1195900
60296 1195900 1199789 1205110 1212748 1222439 1233517 1245409 1257812 1270895 1285029 1300025 1314976 1329083
60284 1329083 1342206 1354326 1365077 1374282 1382341 1389471 1395036 1398338 1399715 1400199 1400477 1400849 1401847 1404033
60270 1404033 1407421 1411841 1417618 1425003 1433103 1440254 1445339 1447873 1446976 1441648 1432517 1422180 1412903 1404489
60256 1404489 1395133 1384060 1372583 1362623 1354802 1348322 1342473 1337711 1335002 1334351 1334533 1334373 1333728 1333028 1332540
60241 1332540 1332554 1333581 1335530 1337127 1337207 1336466 1336863 1339069 1341406 1341763 1339983 1337932 1337634 1339824 1344025 1349482
60225 1349482 1355788 1362739 1369962 1377138 1384719 1393940 1405736 1419952 1435958 1453642 1473152 1493890
60213 1493890 1514497 1533960 1552354 1570465 1589026 1608190 1627348 1645502 1662175 1677899 1693639
60202 1693639 1710042 1727542 1746741 1768102 1791746 1818250 1849200 1885851 1927236 1970695 2014690
60191 2014690 2060509 2110889 2167597 2230718 2299798 2375131 2457926 2549405 2649840 2758630 2875426
60180 2875426 3000792 3135420 3279037 3430589 3589281 3754877 3927099 4105052 4286931
60171 4286931 4469724 4649608 4823292 4988835 5144639 5288248 5417093 5530008 5626795 5706361
60161 5706361 5766570 5806210 5826107 5828113 5814238 5787337 5751450 5710361 5666152 5619831 5573131
60150 5573131 5529235 5492135 5465704 5453021 5455854 5474633 5509076 5559050 5625001 5707711 5807302
60139 5807302 5922286 6050076 6188959 6338997 6499981 6668727 6839520 7007165 7168495
60130 7168495 7320779 7460138 7582324 7684136 7763368 7818188 7847419 7850942 7829186 7782827 7713730
60119 7713730 7625750 7523663 7411360 7291638 7167566 7043485 6924532 6815409 6719424 6638536
60109 6638536 6574368 6529115 6505041 6502986 6521866 6559748 6614898 6685682 6770315 6867192 6974715
60098 6974715 7090046 7208513 7324981 7435630 7538117 7630783 7712675 7784055 7845815 7898304
60088 7898304 7941391 7975763 8003621 8028096 8052674 8081407 8118946 8169770 8237283 8323679 8430344
60077 8430344 8558214 8707919 8879770 9073612 9288928 9525542 9784447 10067755 10377631
60068 10377631 10715349 11081372 11476007 11899504 12351340 12829439 13330021 13847934 14376800
60059 14376800 14908840 15434775 15944292 16427044 16873631 17275964 17626768 17918914 18145595
60050 18145595 18301492 18383679 18391064 18323058 18179372 17961569 17674791 17327923 16932192 16499559
60040 16499559 16042040 15572011 15102367 14645318 14210397 13804050 13431712 13099557 12813008
60031 12813008 12573972 12381163 12233422 12131107 12073665 12057428 12076768 12125934 12198408 12285839
60021 12285839 12379579 12472897 12560403 12636069 12693547 12728070 12736434 12715575 12663279 12580523 12471332
60010 12471332 12339648 12187289 12015004 11823912 11615388 11390807 11152068 10901661 10642180
60001 10642180 10376897 10110892 9850153 9598990 9359355 9132911 8922512 8731238 8561313
59992 8561313 8414471 8292107 8194455 8120861 8071593 8048349 8052394 8083344 8140202 8222053 8326907
59981 8326907 8451251 8591799 8746472 8912504 9084721 9256798 9423041 9577837 9714780
59972 9714780 9828325 9915585 9974948 10003665 9998664 9959424 9888215 9787548 9659075 9505210 9330250
59961 9330250 9139362 8937613 8730458 8524072 8324317 8135674 7961480 7804730 7668304
59952 7668304 7554612 7465201 7400691 7361328 7347766 7361032 7401690 7469625 7564882 7687929 7838473
59941 7838473 8014784 8214741 8436582 8677634 8933138 9197558 9466263 9734337 9994221
59932 9994221 10236516 10453517 10640673 10794517 10910966 10986614 11020583 11014186 10969489 10888971
59922 10888971 10775929 10634343 10468723 10284882 10090652 9894962 9705767 9528778 9367900
59913 9367900 9226613 9108828 9018412 8957756 8927016 8925213 8952066 9008070 9092340 9200784 9327124
59902 9327124 9465842 9613816 9769073 9928672 10088615 10245835 10399342 10548739 10692105
59893 10692105 10826326 10949515 11062159 11165519 11259736 11344144 11418967 11486188 11549118 11611626
59883 11611626 11677490 11750029 11832543 11929415 12046370 12189287 12363016 12571496 12818144 13105337
59873 13105337 13433832 13803345 14213293 14662222 15146656 15660917 16197590 16747293 17298176
59864 17298176 17836317 18346481 18812003 19214668 19536412 19762349 19882730 19893176 19794510 19592733
59854 19592733 19298264 18924444 18486593 18001695 17487267 16959131 16429905 15909586 15407041
59845 15407041 14930444 14486460 14079687 13713474 13391353 13117274 12894090 12722038 12599280
59836 12599280 12523937 12494995 12511186 12569742 12666573 12796937 12955298 13134990 13328467 13527490
59826 13527490 13722669 13903447 14059243 14180368 14257604 14281828 14245291 14143520 13975866 13744827
59816 13744827 13455402 13114583 12730635 12312899 11872188 11420014 10966011 10516304 10075018
59807 10075018 9646776 9236752 8848891 8485390 8147654 7836586 7552129 7293822 7061825
59798 7061825 6856213 6675301 6516054 6376515 6256634 6156085 6072178 6000641 5937764 5881246
59788 5881246 5829563 5781296 5735069 5689783 5644913 5600610 5557453 5516237 5478077 5444087 5414237
59777 5414237 5386544 5357814 5325071 5286245 5240418 5188358 5132126 5072956 5009817 4941307 4868797
59766 4868797 4796463 4728217 4665919 4610508 4563085 4524012 4492123 4465811 4444348 4427768 4416472
59755 4416472 4411650 4415215 4428436 4451045 4482277 4522233 4571622 4630678 4698945 4775665 4859783 4950001
59743 4950001 5045367 5145424 5249129 5353918 5456424 5553964 5645061 5728986 5805493 5874798
59733 5874798 5937305 5993531 6044728 6093344 6142274 6193872 6250281 6314534 6390285 6480061 6584447
59722 6584447 6703711 6839976 6997153 7178742 7386377 7620823 7883772 8177958 8505664
59713 8505664 8867799 9264319 9694669 10157401 10649920 11168765 11708764 12260091 12805198
59704 12805198 13318619 13770172 14130052 14374646 14491940 14484175 14365906 14158827 13886794 13572780
59694 13572780 13237121 12896565 12564358 12250840 11963405 11706073 11480138 11286071 11124943
59685 11124943 10998124 10906054 10847709 10821397 10826062 10861746 10928688 11026343 11153915 11311728 11501297
59674 11501297 11723990 11980760 12273535 12605519 12979041 13394049 13849985 14348551 14893363
59665 14893363 15487422 16132222 16828942 17578918 18382803 19240457 20151736 21116198 22131574
59656 22131574 23193024 24293465 25423528 26571358 27723748 28867809 29991066 31081086
59648 31081086 32127593 33126268 34079985 34996280 35884198 36752599 37608501 38455092 39291450
59639 39291450 40114132 40917592 41692439 42424553 43097086 43693199 44197407 44596796 44883289
59630 44883289 45055270 45116895 45076654 44947059 44744789 44489894 44204460 43911479 43633390 43390277
59620 43390277 43199145 43074708 43030092 43076517 43223024 43476850 43843432 44325757 44924275 45637285
59610 45637285 46460157 47383440 48392261 49467577 50586750 51721994 52838612 53895053
59602 53895053 54844382 55636633 56222667 56559132 56612623 56362713 55805133 54954026 53840106
59593 53840106 52504957 50995926 49363642 47659239 45929354 44212037 42536509 40924793
59585 40924793 39392124 37946593 36589499 35315215 34109756 32950450 31809267 30658537
59577 30658537 29476558 28252405 26989005 25701668 24411711 23139834 21903530 20717163
59569 20717163 19591511 18533203 17545784 16631042 15788606 15015365 14306986 13659850 13070524
59560 13070524 12534138 12045053 11599225 11194674 10829521 10500550 10203842 9936045 9694845
59551 9694845 9478646 9285584 9112436 8954888 8809199 8672865 8543049 8415439 8285976
59542 8285976 8153175 8017521 7879007 7736630 7590163 7441095 7291589 7143430 6998138
59533 6998138 6857280 6722374 6594818 6475828 6366108 6265965 6176214 6098435 6033595 5980835
59523 5980835 5938335 5905074 5881222 5867344 5863896 5870772 5886509 5908573 5935395 5967636 6006659 6052507
59511 6052507 6104325 6161794 6224723 6291940 6362183 6435676 6513331 6595022 6680599 6772394 6874531
59500 6874531 6989230 7115441 7251709 7398921 7559725 7736561 7931037 8144010 8375427
59491 8375427 8624730 8891932 9177716 9482400 9805847 10148548 10511419 10893748 11292160
59482 11292160 11702069 12119232 12539343 12957169 13367056 13763748 14141987 14495781 14818761
59473 14818761 15105186 15350866 15554200 15716918 15842973 15935904 15997573 16029721 16035863 16020963
59463 16020963 15990114 15948543 15902473 15858869 15824386 15805257 15807960 15838778 15902156 15999820 16131641
59452 16131641 16296571 16491950 16711738 16945770 17180820 17402297 17595253 17744867 17837327
59443 17837327 17861099 17807619 17671279 17449778 17145103 16763938 16316744 15816363 15277039 14713356
59433 14713356 14138902 13565816 13005539 12468882 11964182 11495699 11064814 10672620 10320594
59424 10320594 10009060 9736427 9500533 9300192 9135202 9005381 8909974 8847782 8817768 8819649
59414 8819649 8853558 8918793 9013354 9135343 9284394 9460846 9663758 9890623 10138745 10405591
59404 10405591 10687583 10979527 11275542 11569546 11854469 12121905 12363112 12569715 12733103
59395 12733103 12844258 12895456 12882246 12803612 12660948 12457783 12200311 11897186 11557967 11191435
59385 11191435 10805018 10405510 10000092 9596357 9201009 8818433 8450718 8099080 7764978
59376 7764978 7449997 7155274 6881491 6629221 6398776 6189661 6000567 5830165 5677756
59367 5677756 5542816 5424112 5319975 5229681 5153825 5092714 5044956 5008393 4981854 4964904 4956505
59356 4956505 4955594 4962893 4980316 5008252 5045139 5089947 5142540 5200277 5256565 5305167 5344907 5378548
59344 5378548 5408612 5436663 5465486 5498939 5539706 5589306 5649803 5722549 5804836 5890524 5975279
59333 5975279 6059872 6148103 6243732 6350268 6471436 6609983 6766961 6943341 7141471 7364159
59323 7364159 7613313 7890322 8196865 8534619 8905151 9310792 9754600 10238685 10763609
59314 10763609 11330331 11941771 12601250 13309777 14065382 14864197 15700930 16568437 17457362
59305 17457362 18356114 19251259 20128950 20976619 21783143 22537989 23232259 23861604 24426981
59296 24426981 24931397 25376468 25762456 26089955 26359706 26571005 26721206 26806249 26820643 26757439
59286 26757439 26609443 26370830 26037822 25609283 25088076 24481465 23799131 23051043 22247947
59277 22247947 21402958 20530836 19645168 18756926 17875615 17010650 16171032 15364119 14594994
59268 14594994 13866778 13181482 12540797 11946129 11397823 10894647 10434276 10014208 9632329
59259 9632329 9287184 8977873 8703182 8460523 8246210 8056863 7889972 7743086 7613634
59250 7613634 7500039 7401943 7318540 7247752 7188182 7141089 7108942 7092310 7089425 7098748 7120673
59239 7120673 7156527 7206943 7271647 7350094 7441809 7546551 7664446 7795671 7939846 8096049
59229 8096049 8263393 8441160 8628259 8823089 9024126 9230223 9439947 9650792 9859272
59220 9859272 10061619 10254225 10433939 10598951 10750012 10890298 11023174 11149729 11268845
59211 11268845 11379494 11481993 11576446 11660752 11731011 11783382 11814707 11822015 11802883 11756327 11682290
59200 11682290 11580373 11450610 11295854 11122045 10935328 10739792 10538469 10335387 10135591
59191 10135591 9943891 9764391 9600568 9454720 9327534 9218970 9129520 9060282 9012115 8985119
59181 8985119 8978566 8990921 9020296 9065155 9124210 9195626 9277280 9368311 9469475 9581050 9700926
59170 9700926 9825661 9953243 10084169 10220175 10362789 10513266 10673487 10846701 11037331
59161 11037331 11249707 11486777 11750247 12041750 12363039 12714704 13095153 13500972 13927366
59152 13927366 14367553 14811943 15248123 15661304 16034986 16352330 16597884 16758390 16822975
59143 16822975 16784301 16640080 16392659 16047255 15612093 15100390 14529831 13918265 13280633
59134 13280633 12630565 11982588 11350116 10741750 10161633 9613248 9100944 8627495 8191831
59125 8191831 7790177 7418843 7075714 6759796 6469880 6203655 5958332 5732281 5525418
59116 5525418 5337506 5166744 5010837 4868836 4740908 4626547 4523990 4431238 4346877 4270143
59106 4270143 4201026 4140217 4088199 4044590 4008974 3981845 3963716 3953632 3949775 3951574 3960194 3976757
59094 3976757 4001031 4032199 4070142 4115449 4168545 4229154 4296479 4369800 4448939 4534140 4625581
59083 4625581 4723372 4827965 4939850 5058643 5183281 5313484 5450014 5592704 5739142 5886347
59073 5886347 6033062 6179351 6324618 6467377 6606637 6742117 6873114 6998401 7117305
59064 7117305 7229782 7335207 7432117 7519507 7597708 7667766 7730577 7786877 7837560 7884022 7928564
59053 7928564 7974302 8024091 8079693 8142473 8214460 8297869 8393899 8503063 8626545 8766086 8922255
59042 8922255 9093804 9279102 9477388 9688091 9909293 10137085 10366008 10589903 10802682
59033 10802682 10998348 11170074 11309602 11408492 11460626 11463668 11418604 11328578 11198276 11033766
59023 11033766 10842287 10631765 10409865 10182877 9955209 9729766 9508459 9292350 9081849
59014 9081849 8876899 8676443 8477872 8278332 8077256 7876519 7677278 7477840 7276026
59005 7276026 7072604 6870496 6670990 6472893 6275844 6082554 5896651 5719384 5549730
58996 5549730 5387143 5232996 5089194 4956185 4832879 4718202 4612316 4516246 4430679 4355290
58986 4355290 4288754 4229020 4174076 4123105 4076374 4033030 3989483 3941393 3887024 3826989 3760902
58975 3760902 3686711 3604254 3517212 3430029 3344565 3261276 3181790 3108019 3039821 2975869 2916309
58964 2916309 2862646 2815434 2773916 2737519 2705918 2677945 2652115 2627901 2605073 2582442 2559157
58953 2559157 2536645 2517127 2500638 2485734 2472821 2464023 2459454 2456257 2452320 2448746 2447527 2448677 2450960
58940 2450960 2454008 2458265 2463704 2469612 2475133 2479534 2482665 2485362 2488545 2491827 2494178 2495950 2498842 2503632
58926 2503632 2509594 2516540 2525771 2538152 2552734 2568344 2585421 2605277 2628338 2653856 2680584 2707294
58914 2707294 2733573 2760657 2790621 2824269 2860685 2899085 2939841 2983170 3028233 3074405 3122390
58903 3122390 3173235 3227093 3283647 3342807 3404210 3466936 3530665 3596557 3666227 3740211 3817833
58892 3817833 3898000 3979909 4063728 4150818 4242353 4337377 4433083 4527372 4620352 4713311 4807548
58881 4807548 4904567 5006014 5112682 5224695 5343278 5471120 5610222 5760521 5921492 6094057
58871 6094057 6280014 6480584 6696606 6929410 7180548 7451115 7742044 8054575 8390034
58862 8390034 8749953 9136853 9553945 10003448 10486106 11002841 11555734 12146682 12776372
58853 12776372 13445686 14157097 14913327 15715146 16561402 17450295 18379230 19343531 20336115
58844 20336115 21347963 22367789 23381202 24370666 25316118 26195411 26985066 27661745 28203654
58835 28203654 28591451 28809869 28850365 28712833 28404878 27939806 27334970 26610490 25788223
58826 25788223 24891294 23943438 22966860 21979844 20996948 20031304 19095217 18198109 17345237
58817 17345237 16539075 15780868 15070629 14407444 13790850 13220574 12693964 12205086 11747629
58808 11747629 11317615 10912294 10527921 10160509 9808088 9470696 9148672 8842257 8552409
58799 8552409 8280516 8027211 7792112 7574426 7373249 7187831 7018209 6864952 6727778
58790 6727778 6605209 6496146 6400794 6319393 6251250 6195899 6153997 6125948 6110849 6107955 6117958
58779 6117958 6141319 6176490 6221646 6277403 6346015 6428380 6523497 6630486 6749376 6880244 7023399
58768 7023399 7180494 7353749 7543753 7749324 7969818 8206426 8461117 8735605 9031788
58759 9031788 9352122 9698962 10074122 10479315 10916288 11386360 11890568 12430804 13010366
58750 13010366 13632820 14300271 15012748 15769178 16568729 17410802 18293313 19211074 20156131
58741 20156131 21119069 22088912 23051770 23990528 24885778 25715873 26456392 27081885 27569787
58732 27569787 27902627 28067410 28055981 27867861 27511404 27000817 26353104 25588609 24731913
58723 24731913 23808808 22841931 21850008 20849860 19856754 18882846 17936870 17025093 16151298
58714 16151298 15316280 14519124 13759364 13037300 12352841 11705304 11094013 10518158 9976515
58705 9976515 9468302 8993624 8551954 8140794 7757052 7399114 7066336 6757173 6469314
58696 6469314 6201210 5952130 5721039 5506674 5308281 5125026 4955161 4797076 4650654
58687 4650654 4516230 4392728 4278145 4171309 4071681 3977972 3888676 3803726 3724092 3649924
58677 3649924 3580475 3515511 3455266 3399204 3346360 3296651 3250340 3206382 3162891 3119337 3076883
58666 3076883 3036480 2997795 2959888 2921851 2882909 2842928 2802393 2760983 2717026 2669722 2620841
58655 2620841 2572397 2523593 2472250 2418608 2365210 2313349 2262217 2211637 2162953 2116827 2072670
58644 2072670 2030972 1993767 1961714 1932682 1904352 1876496 1849768 1823996 1798931 1775211 1753203
58633 1753203 1731933 1710145 1687636 1664809 1641871 1619142 1597242 1576430 1556571 1537971 1521124
58622 1521124 1505524 1490210 1475873 1464774 1457842 1453275 1448842 1444263 1440629 1438990 1440447 1446090 1455502
58609 1455502 1466469 1477503 1489597 1504217 1520518 1536168 1550272 1563790 1577127 1588687 1596109
58598 1596109 1597989 1594285 1585920 1574364 1561189 1547651 1534697 1523197 1513877 1507065 1502793 1501249 1502932
58585 1502932 1508141 1516237 1525770 1535893 1547621 1562982 1582681 1605466 1630225 1657680 1689061 1723869
58573 1723869 1760281 1797489 1836658 1879794 1928592 1983915 2045237 2110769 2179270 2251608 2329659
58562 2329659 2414148 2504819 2602367 2708595 2824573 2950150 3085646 3232812 3393604 3568899
58552 3568899 3758749 3962981 4181096 4412286 4655953 4911755 5178945 5455824 5739469
58543 5739469 6025373 6307391 6578353 6830313 7054174 7240337 7380883 7470695 7506235 7484904
58533 7484904 7407167 7278206 7105852 6897606 6660968 6405028 6138955 5869022 5599078 5333548
58523 5333548 5077696 4834891 4605673 4389966 4188737 4003486 3835484 3685211 3551081
58514 3551081 3429277 3316801 3214295 3123877 3044759 2973394 2907640 2848069 2794885 2746187 2699920
58503 2699920 2655397 2612418 2570948 2532096 2497207 2465442 2434324 2403087 2373188 2344939 2316137
58492 2316137 2285053 2252587 2220293 2188218 2155816 2123084 2089528 2053577 2014285 1972448 1929302
58481 1929302 1885396 1841351 1798260 1756713 1716775 1679285 1645557 1615428 1587237 1560098 1534435
58470 1534435 1510089 1485987 1462076 1439441 1418119 1397087 1376860 1359453 1344916 1330546 1314732
58459 1314732 1299125 1285694 1274034 1263101 1253355 1245465 1238843 1233074 1229005 1226857 1225018 1222294 1219817
58446 1219817 1219268 1220837 1224225 1229840 1237364 1244706 1250031 1253691 1256874 1259654 1261488 1262151 1261090 1257315
58432 1257315 1251021 1243876 1236876 1229566 1221931 1214864 1207884 1198852 1187274 1175561 1165682 1156984 1148804
58419 1148804 1142442 1138466 1134583 1128677 1121951 1116660 1112618 1108418 1104244 1100813 1096937 1090957 1083635 1077215
58405 1077215 1072395 1068355 1064874 1062326 1060195 1057384 1053392 1047990 1040895 1033132 1027245 1024524 1023386 1022098
58391 1022098 1021423 1022666 1024793 1025866 1026148 1027501 1030633 1035094 1041204 1049863 1060917 1073337 1086555 1100448
58377 1100448 1114864 1130223 1147340 1165493 1182147 1195808 1207457 1217814 1225146 1227673 1226331 1223100
58365 1223100 1218180 1210965 1202237 1193153 1183296 1171919 1160007 1149097 1139170 1129587 1120949 1114180 1108993
58352 1108993 1104984 1102885 1102973 1103684 1103735 1104128 1106278 1109708 1113569 1118772 1126383 1135300 1143646 1151214 1158661
58337 1158661 1165764 1172370 1179483 1187459 1194718 1200247 1205697 1213013 1221740 1230713 1240459 1251723 1263530
58324 1263530 1275083 1287710 1302579 1318304 1333115 1347451 1362186 1376454 1389609 1402941 1416819
58313 1416819 1428654 1436671 1443241 1451343 1460075 1466944 1472182 1477223 1481282 1483358 1485523 1490238 1496315 1501521
58299 1501521 1507126 1515659 1526001 1535211 1543706 1553972 1565499 1575766 1585299 1596839 1609874 1620687
58287 1620687 1627931 1634098 1641365 1649589 1658267 1667008 1674256 1678819 1682270 1686844 1691992 1696323 1701680 1711324
58273 1711324 1724825 1738665 1751393 1764569 1779259 1795159 1812596 1831960 1851788 1870593 1889740
58262 1889740 1911515 1935697 1961083 1988445 2018442 2048719 2077176 2106058 2138448 2172692 2204937
58251 2204937 2235195 2265964 2296710 2325030 2351766 2379671 2408369 2435930 2464014 2495938 2530889
58240 2530889 2565513 2599909 2636404 2673914 2709626 2745171 2784897 2828951 2874175 2920763 2971401
58229 2971401 3024686 3076414 3127152 3181791 3241524 3302842 3364541 3429199 3497551 3567820 3640780
58218 3640780 3719252 3802552 3887558 3974916 4067817 4165231 4263221 4362369 4466766 4576235 4687211
58207 4687211 4801009 4923213 5054665 5190940 5331032 5478695 5634888 5797048 5966392
58198 5966392 6147843 6341966 6544865 6756450 6980870 7218795 7467886 7730899 8014086
58189 8014086 8317135 8634026 8964381 9314388 9685763 10073658 10476409 10897545 11337229
58180 11337229 11791838 12263025 12757295 13276090 13816591 14382171 14980636 15612203 16271592
58171 16271592 16962357 17696358 18478921 19308403 20190798 21139544 22159379 23245658 24401226
58162 24401226 25637867 26959371 28360718 29847149 31436562 33139831 34956764 36894955
58154 36894955 38973967 41207964 43604990 46188134 48996932 52064142 55413579 59085167
58146 59085167 63139036 67632762 72622972 78194530 84458549 91516286 99457586 108401221
58138 108401221 118502368 129916676 142797099 157322833 173665244 191900622 212009657
58131 212009657 233991934 257965146 284219340 313287946 345795936 381628690 418628599
58124 418628599 452076359 476062273 486151036 481339158 463930201 437854331 406966307
58117 406966307 374230714 341655316 310501488 281517877 255114222 231448227 210483063
58110 210483063 192085944 176127792 162508158 151125376 141829546 134315458 127981199
58103 127981199 121962744 115472860 108196326 100351827 92389953 84676738 77415727 70715611
58095 70715611 64624869 59129520 54182966 49743505 45769236 42202689 38989177 36096743
58087 36096743 33499583 31158319 29034484 27108699 25367023 23782846 22328092 20990039
58079 20990039 19762466 18631238 17581589 16609117 15711248 14877212 14096995 13370642 12698651
58070 12698651 12072303 11482809 10930918 10418349 9938494 9484324 9057099 8658624 8282618
58061 8282618 7921728 7575738 7245635 6927147 6617397 6320771 6041241 5775605 5520328
58052 5520328 5277765 5049566 4831385 4620381 4420805 4236037 4062192 3895518 3738738
58043 3738738 3593904 3456423 3322693 3196656 3082135 2975499 2872581 2776034 2688840 2607139
58033 2607139 2526938 2451860 2386547 2327734 2269536 2212666 2160780 2112016 2061845 2010802 1962243
58022 1962243 1915536 1868161 1821663 1779020 1738663 1697080 1655033 1615688 1578941 1542843 1508349
58011 1508349 1477686 1450303 1424939 1403049 1385771 1370265 1353632 1337600 1324813 1313483 1300517
58000 1300517 1287118 1276197 1266702 1255482 1242731 1230910 1220152 1209071 1198214 1188568 1178574 1166588
57988 1166588 1154235 1143457 1132589 1119403 1105737 1094854 1086306 1077605 1068904 1061720 1054958 1046579
57976 1046579 1037608 1030443 1024862 1019667 1016415 1017143 1019773 1020041 1016888 1012187 1006458 998877 990442 983176
57962 983176 976917 970327 964045 959385 955021 948557 940510 933238 926802 919279 910355 901308 892138 881914
57948 881914 871308 861839 853290 844639 836576 830344 825095 819249 813289 808346 803294 796442 789015 783673
57934 783673 780498 777653 775185 774835 776623 778810 780739 782745 783702 781833 777848 774583 773547 774003 774897
57919 774897 775385 774257 771407 769232 769967 772267 772797 770456 766497 761486 755079 748192 742365 737135 730684
57904 730684 722911 715404 708637 701656 694352 687782 682354 677750 674250 672091 669954 666106 660621 654741
57890 654741 648922 643376 639407 637867 637360 636391 636203 638809 643182 646319 647388 647925 648529 648367 647648 647597
57874 647597 647966 647306 645686 644598 644133 642795 640200 637513 635015 631515 626441 620567 614515 608308 602298
57859 602298 596856 591601 586597 583561 583870 586131 587932 589287 592006 596531 601879 607931 614965 621608
57845 621608 626117 629248 632897 636499 637961 637883 639238 642590 645002 644369 641792 638870 635561 631680 627929
57830 627929 624405 620272 615613 611451 607413 601746 594294 587079 581249 575690 569379 562900 556972 551711
57816 551711 548040 547415 549160 550315 549150 546965 545554 544967 544786 545591 547903 551235 555124 559689 564599
57801 564599 569155 573909 580299 588008 594622 598647 600955 602422 602291 599952 596395 592548 587875 581841
57787 581841 575253 568871 562137 554515 546796 539868 533362 526620 519894 513546 507063 499875 492187 484208
57773 484208 475601 466521 458234 451818 447041 443056 439209 434686 428592 421171 414005 408257 403477 398609
57759 398609 393167 386986 379913 372388 365476 359765 355053 351400 349393 348999 349182 349191 349393 350530 353008 357029
57743 357029 362319 367519 370974 372439 373051 373479 373202 371758 369420 366497 363218 360596 360091 362003 365148
57728 365148 368364 371393 374327 377346 380881 384810 387710 388324 387629 387799 389169 389896 388686 386056 382802
57713 382802 378954 374516 369667 364183 358297 353816 352205 351672 348769 343312 339147 339276 342673 346861 351113
57698 351113 355697 360102 363857 367627 372159 377360 383331 390886 400055 409490 418188 426357 434004 440429
57684 440429 445984 452493 460875 469907 478226 485849 492932 499053 504721 511615 520062 528146 534477 539900
57670 539900 545266 549687 552597 555476 559731 564713 569723 576193 585692 597195 608546 619507 631388
57657 631388 644644 658772 673840 690327 708044 726552 745942 766225 786888 807973 830203
57646 830203 853195 875472 897611 923184 954582 989770 1025440 1061634 1100701 1143096 1187152
57635 1187152 1232278 1279676 1330234 1383942 1441109 1502208 1566918 1635250 1709133 1791070 1881789
57624 1881789 1981116 2090479 2212496 2348532 2498601 2663153 2843032 3038335 3249519 3479065
57614 3479065 3729471 3999611 4285344 4583867 4895188 5218597 5548731 5874343 6178481
57605 6178481 6439977 6638036 6758200 6795052 6751043 6634919 6460458 6243261 5996657 5730784
57595 5730784 5454661 5176733 4903042 4636973 4381618 4140963 3918180 3714173 3528323
57586 3528323 3359348 3205160 3063637 2934579 2819840 2720751 2636113 2563111 2499248 2443124
57576 2443124 2394365 2353542 2321608 2298996 2285485 2280624 2283604 2293059 2307957 2328573 2355841 2390224
57564 2390224 2432183 2483155 2544714 2617092 2699822 2793361 2898542 3014802 3140792 3276729
57554 3276729 3424377 3584445 3755459 3935250 4121662 4311307 4499180 4680141 4849323
57545 4849323 5000549 5125808 5217393 5270125 5281506 5251040 5180007 5071170 4928543 4758170
57535 4758170 4568508 4368064 4162062 3952642 3742348 3535603 3336169 3145040 2962095
57526 2962095 2788570 2626639 2477333 2339995 2213403 2096716 1989578 1891756 1802462 1720182
57516 1720182 1643851 1574053 1512082 1457818 1409502 1365533 1325302 1288258 1253602 1221299 1192076
57505 1192076 1165924 1141744 1118877 1097894 1079448 1063472 1049857 1038670 1029328 1020916 1013887 1010015
57493 1010015 1009885 1011684 1013418 1015164 1018328 1023766 1031694 1042445 1056076 1071773 1088571 1106285 1125243
57480 1125243 1145811 1168727 1195095 1225409 1259230 1296259 1336780 1380600 1426717 1474961 1526916
57469 1526916 1584338 1647523 1716195 1790974 1872789 1961642 2057282 2160505 2272406 2392655 2519827
57458 2519827 2653352 2793847 2941133 3092722 3244504 3392335 3532580 3661425 3774081
57449 3774081 3864988 3929079 3962915 3964572 3933227 3869977 3778984 3666404 3537627 3396359 3246560
57438 3246560 3093529 2941919 2793721 2649528 2510994 2380557 2259197 2146169 2041152
57429 2041152 1945464 1860600 1786441 1721509 1664543 1615224 1573454 1538483 1509268 1485632 1468477
57418 1468477 1458392 1454540 1455690 1461983 1474646 1494091 1519497 1550419 1587453 1630760 1679141 1731428
57406 1731428 1787857 1849324 1916296 1989412 2070244 2160140 2258673 2364220 2475764 2593197 2716075
57395 2716075 2842934 2971658 3099861 3224968 3344259 3454276 3549535 3622537 3666167 3676389
57385 3676389 3652572 3596209 3510318 3399404 3268515 3121998 2963782 2798598 2631828 2467868
57375 2467868 2309087 2156384 2010251 1871337 1740611 1619010 1506653 1402525 1305434 1215179
57365 1215179 1132460 1057841 991104 931232 876562 825372 776950 731848 690616 652627 616664
57354 616664 582218 549464 518496 489529 463544 441464 422515 404325 385081 365073 345906
57343 345906 328762 313565 299357 285243 271303 258630 248070 238915 229352 218388 206926 196687
57331 196687 188453 181584 175041 168510 162391 156832 151041 143932 135458 126868 119442 113350 107954 102745
57317 102745 97513 92103 86613 81624 77610 74269 71084 68404 67283 68111 69938 71348 71546 70496 68563
57302 68563 66371 64684 63977 64088 64456 64582 64209 63218 61711 60226 59604 60354 62153 64200 66070 67965
57286 67965 70017 71791 72799 73201 73567 74184 75115 76676 79208 82486 86015 89842 94374 99403 104127
57271 104127 108262 112420 117229 122828 129429 137543 147279 158034 169212 180667 192312 204049 216312
57258 216312 229780 244214 258444 271905 285264 299144 313212 327052 340840 354497 367285
57247 367285 379100 391113 404234 418042 432292 448281 467255 488471 510531 533876 559941
57236 559941 588189 616062 642190 667993 695691 726094 758719 792785 827612 863237 901145
57225 901145 943307 989925 1039150 1089533 1141695 1196793 1254336 1312514 1370047 1426583 1481502
57214 1481502 1533233 1579907 1620278 1654049 1681727 1704079 1721405 1733334 1739477 1740093 1735899 1727435
57202 1727435 1715023 1699418 1682103 1664576 1647269 1629305 1609442 1587181 1562949 1537633 1512443
57191 1512443 1489093 1469448 1454684 1445182 1441297 1443680 1452627 1467715 1488405 1514423 1545171 1579339
57179 1579339 1615489 1652431 1688699 1722635 1753797 1783500 1812850 1840767 1865066 1885298 1903557
57168 1903557 1922764 1945159 1972269 2005006 2043392 2086869 2135101 2188010 2245170 2306001 2370493
57157 2370493 2438956 2511005 2585550 2661828 2739593 2818293 2896977 2975345 3054111 3134029 3215096
57146 3215096 3296773 3378089 3457159 3531434 3599279 3661106 3718516 3772512 3822886 3869304 3912635
57135 3912635 3955052 3998730 4044428 4091327 4138079 4183741 4227946 4270980 4313836 4357501 4401770
57124 4401770 4445507 4488406 4531699 4576641 4623270 4671265 4720763 4771119 4819880 4864468 4904146
57113 4904146 4938955 4967601 4988340 5001588 5009700 5014300 5015741 5015101 5014510 5014963 5015800 5017026 5020397 5027337
57099 5027337 5037438 5050037 5065668 5084685 5105632 5126213 5144768 5159466 5166993 5163703 5147936 5120389
57087 5120389 5082740 5036983 4985636 4931320 4875691 4818980 4760073 4696341 4623477 4535966 4428040
57076 4428040 4294851 4133933 3945981 3733481 3498034 3239322 2956217 2647300 2309489
57067 2309489 1937272 1524490 1066736 561792 8385 -595174 -1252156 -1967918 -2749000 -3601694
57057 -3601694 -4532598 -5550872 -6668780 -7899542 -9255796 -10750694 -12399554 -14220266
57049 -14220266 -16233822 -18465350 -20943536 -23698792 -26764088 -30179038 -33992541 -38262263
57041 -38262263 -43055512 -48453443 -54553237 -61464815 -69306659 -78204202 -88286651 -99679416
57033 -99679416 -112496290 -126833385 -142761623 -160321096 -179521957 -200332811 -222630053
57026 -222630053 -246145310 -270520607 -295510838 -321160548 -347680291 -374972852 -402140878
57019 -402140878 -427417857 -448638898 -463931798 -472192565 -473159019 -467198279 -455025637
57012 -455025637 -437501729 -415553428 -390185883 -362498658 -333624201 -304591297 -276202341
57005 -276202341 -249003960 -223342059 -199432159 -177397870 -157283108 -139062609 -122660448
56998 -122660448 -107972022 -94882657 -83277717 -73043007 -64061038 -56210530 -49369864
56991 -49369864 -43420250 -38247732 -33746625 -29823411 -26397214 -23397059 -20760398 -18434139
56983 -18434139 -16374788 -14546324 -12918266 -11465024 -10164855 -8998377 -7948793 -7003251
56975 -7003251 -6152088 -5385983 -4694948 -4070266 -3505484 -2994445 -2529593 -2103449 -1711026
56966 -1711026 -1349848 -1018136 -713796 -434758 -179442 53188 264018 454468 626699 782439
56956 782439 921584 1042567 1144126 1226586 1292623 1348117 1400758 1454023 1500724 1524248 1508204
56945 1508204 1445391 1338593 1195926 1027354 843649 655231 470620 296093 136017 -7528
56934 -135052 -248665 -350955 -444790 -532770 -615635 -691867 -759959 -820587 -875727 -926302 -971723
56923 -971723 -1011266 -1045066 -1074297 -1101130 -1127796 -1154809 -1180638 -1203816 -1224493 -1243234 -1259595
56912 -1259595 -1273154 -1284680 -1294534 -1300765 -1300752 -1294214 -1282757 -1266831 -1245296 -1218019 -1186719 -1152552
56900 -1152552 -1114526 -1071077 -1022039 -968586 -912605 -856831 -804505 -757913 -717797 -684415 -658195
56889 -658195 -638844 -624653 -613356 -603168 -592831 -581574 -569506 -557212 -544484 -530245 -514217
56878 -514217 -497714 -481981 -466440 -449527 -430662 -410330 -388402 -363631 -335398 -305536 -277977
56867 -277977 -256652 -243720 -239353 -242480 -251400 -264135 -279011 -295189 -312232 -329078 -344083 -356344
56855 -356344 -366273 -374421 -380551 -384595 -387680 -390978 -394078 -395843 -396611 -397937 -399957 -400477 -397374 -390871 -382754
56840 -382754 -374192 -365095 -354929 -343364 -330474 -316824 -302988 -288495 -271609 -250776 -226089 -198887
56828 -198887 -170046 -139117 -105171 -68264 -30030 7063 41057 70991 96266 116106 130267 139874
56816 139874 146681 151446 153855 154245 154577 157202 163151 172015 182947 195364 209145 224812 243370
56803 243370 265600 291629 321446 355391 393394 433553 471796 503323 524595 534311 533003 522118
56791 522118 503690 480621 456543 434776 417270 404662 397060 394446 396541 402962 413773 429532
56779 429532 450681 477155 508756 545713 588837 639098 696499 758433 818724 868880 901337
56768 901337 912492 903517 878876 844024 803584 760651 717152 674725 635268 600667 571938 548822
56756 548822 530638 517683 511385 512706 520925 534653 553600 578299 608278 641701 676741 711654
56744 711654 742842 764565 772200 765322 746764 719478 685471 646915 606586 567089 530496 498348
56732 498348 470949 447047 425460 406930 393364 385531 382655 383941 389074 397244 407160 418361 431228
56719 431228 445249 458209 467437 471073 468121 458447 443139 423931 401960 377836 352914 329239
56707 329239 307870 288352 270232 253954 239741 226784 214416 203249 194301 187625 182522 178610
56695 178610 175989 174630 174067 173479 171990 169338 166289 163780 161672 159117 156071 153316 150883 147825 144123
56680 144123 141413 140873 141425 141175 139913 139030 139450 140707 141886 142495 142377 141465 139823 137638 135108 132384
56664 132384 129396 125816 121639 117768 115288 114003 112465 109750 106531 104115 103213 103939 106055 108592 109970
56649 109970 109292 107009 103942 100382 96688 93906 92886 93251 93912 94117 93582 92388 91466 92332 95357 98925
56633 98925 101331 102890 105027 107783 109735 110361 111059 113409 117364 121688 125450 128552 131196 133336 134549
56618 134549 134337 132737 130675 129565 130534 133988 139512 145787 150993 154091 155845 157973 161036 163639 164131
56603 164131 162762 161501 161721 162704 162858 161809 160399 158725 155444 149752 143246 138731 137335 137579 137203
56588 137203 135252 132501 130557 130545 132000 133066 132331 130324 128659 128016 127764 127293 126707 126327 126455 127570
56572 127570 129786 132213 133916 135360 137736 140935 143576 145158 146734 149209 152344 155800 159627 163139
56558 163139 164795 164063 162251 160750 159620 158547 157963 158309 159287 160573 162255 163952 164799 165084 166411 169187
56542 169187 171362 170995 168867 167115 166365 165824 165372 165803 167266 168884 169861 170126 170234 171302 174384 179043
56526 179043 183271 185735 187327 189523 192054 193394 192939 191579 190682 191403 194270 198329 201444 202453 202413
56511 202413 202875 203949 205165 206998 209986 213217 215358 216562 217919 219777 222149 225935 231829 238520
56497 238520 243772 247109 249837 252900 256398 260749 266338 272032 275910 277714 279077 281264 284053 286694
56483 286694 288485 288483 286258 283001 280457 278808 277009 275000 273856 273768 273590 272576 271009 269051 266574 264140
56467 264140 262403 260476 256737 251494 246951 244211 242380 241063 241396 243523 245142 244117 241085 238074
56453 238074 235800 233779 231996 230873 230178 229429 228948 229374 230348 230782 230387 230105 230860 232399 233579 233669 233154
56436 233154 232990 233134 232506 230763 229166 228750 228494 226808 224268 223078 223868 224960 225137 225340 226849 229335
56420 229335 231665 233478 234928 235754 235558 234534 233358 232879 234157 238005 244065 250974 257670 263814 269032
56405 269032 272977 276426 281041 287452 294541 301153 307449 313964 320335 325761 330010 333331 335923 337981
56391 337981 339827 341656 343579 345768 347902 348734 347315 344612 342648 342069 341945 341972 343028 344991 345809 343760
56375 343760 339389 334294 329222 324232 319477 314831 309852 305093 302272 301993 302310 300841 297514 294078 291724
56360 291724 290486 290290 291042 291908 291875 291178 291224 292921 295697 298206 299526 299668 299304 299012 298702 297951 296769
56343 296769 295508 294047 291784 288680 285596 283352 282046 281493 281580 281900 281783 281019 280012 279128 278644 279316
56327 279316 281870 285631 288753 290332 291339 293022 295284 297193 298285 298870 299779 302114 306367 311449 315613
56312 315613 318672 322293 327607 333713 339200 343992 348769 353384 356865 358577 358845 358904 360434 364346 369695
56297 369695 374491 377847 380449 382844 384569 385344 385852 386752 388080 390121 393587 398205 402395 405236 407676
56282 407676 410857 414312 416824 418365 420259 423946 430004 437541 444187 447794 448783 449919 453320 458776
56268 458776 465357 473010 481659 490142 497394 503907 511089 519875 530521 542646 554773 565008 573188
56255 573188 581428 591793 604328 617970 632108 646364 660065 672995 685789 698853 711803 724613
56243 724613 738089 752540 767223 781828 797125 813347 829272 843765 856850 868595 878672
56232 878672 887942 898600 911421 924439 935687 945718 956219 967929 981324 997495 1016500 1036493
56220 1036493 1056334 1077542 1101727 1127765 1153954 1181840 1215400 1256917 1305514 1359071 1415852
56209 1415852 1475023 1537400 1605131 1679253 1758540 1842154 1932148 2031527 2141141 2260430 2389877
56198 2389877 2530356 2680996 2840134 3007796 3185069 3371727 3566544 3769032 3978346
56189 3978346 4190965 4401911 4607975 4807498 4997289 5172216 5327982 5462341 5573770
56180 5573770 5661113 5724665 5765673 5784711 5782223 5760467 5722938 5671761 5607429 5531127 5445482
56169 5445482 5352816 5254129 5149895 5040438 4925384 4803909 4675405 4539200 4394563 4242389
56159 4242389 4085886 3927868 3768267 3606165 3443241 3282840 3126287 2972708 2822277
56150 2822277 2677109 2538896 2407879 2284387 2169333 2062891 1964401 1873620 1790386 1713238
56140 1713238 1640411 1572277 1510862 1456774 1408432 1364460 1325046 1290560 1260349 1233189 1207757
56129 1207757 1182788 1158081 1135230 1116123 1100901 1088329 1077393 1067377 1057544 1048377 1042037 1039722
56117 1039722 1039693 1039852 1040955 1044928 1051385 1058616 1066808 1077096 1088319 1098225 1107556 1119468 1134916 1151906
56103 1151906 1169337 1188184 1208618 1229489 1251281 1276098 1303769 1331172 1356712 1382464 1410499
56092 1410499 1439780 1468311 1496003 1523723 1551431 1578820 1606356 1634606 1663918 1695597 1731969
56081 1731969 1774725 1824490 1882178 1948942 2024573 2107760 2198056 2295505 2398042 2501404 2601948
56070 2601948 2697543 2785766 2864100 2932863 2995616 3055558 3112938 3166108 3212739 3249372 3272170
56059 3272170 3279506 3272703 3253982 3225169 3188099 3144015 3092180 3030968 2960384 2881661 2794826 2699417
56047 2699417 2597800 2495185 2395948 2302098 2215316 2137615 2069414 2009360 1956579 1911146 1872345
56036 1872345 1838979 1811455 1791086 1777272 1767812 1761806 1759619 1760330 1762346 1766294 1773986 1784498 1794744
56023 1794744 1804055 1814571 1826749 1838213 1847743 1856808 1866322 1875356 1884007 1894164 1906364 1918955
56011 1918955 1931256 1944612 1959703 1975815 1993200 2013063 2034938 2057322 2080996 2108267 2138985
56000 2138985 2171104 2204940 2242531 2282766 2321949 2359641 2399127 2441476 2484122 2526249 2570430
55989 2570430 2617636 2665527 2713036 2761843 2812099 2861800 2911789 2966242 3026599 3090074 3155595
55978 3155595 3225803 3301535 3379945 3460001 3544226 3632949 3722610 3812113 3905103 4003530 4104790
55967 4104790 4207858 4316356 4432754 4555316 4683626 4821080 4968921 5123890 5285009
55958 5285009 5456503 5640636 5834011 6034733 6247017 6474650 6715798 6968183 7233563
55949 7233563 7513450 7806499 8113878 8440794 8788714 9152327 9527864 9917778 10323701
55940 10323701 10742333 11172695 11620152 12088859 12577615 13087271 13624083 14191036 14784268
55931 14784268 15403101 16055260 16747438 17480096 18256888 19089347 19986090 20946899 21973073
55922 21973073 23072900 24250842 25503264 26832399 28252963 29777519 31407834 33148750
55914 33148750 35017194 37028941 39191414 41520197 44048472 46810178 49830229 53143223
55906 53143223 56805514 60877978 65417416 70499432 76228591 82709767 90032051 98298586
55898 98298586 107647764 118227475 130179838 143673874 158916177 176099646 195381981
55891 195381981 216948023 241044680 267918427 297770805 330718824 366396540 403043896
55884 403043896 436826067 462510106 475557491 474173483 459751900 435648182 405539073
55877 405539073 372465473 338645286 305603685 274336056 245455503 219291193 195922655
55870 195922655 175224165 156966716 140906912 126798682 114379960 103399817 93655138
55863 93655138 84986317 77257678 70362802 64230223 58798270 53989945 49723535 45932503
55855 45932503 42559245 39542195 36825290 34370496 32147665 30121721 28261761 26552189
55847 26552189 24981937 23531478 22181883 20927385 19766682 18689420 17682326 16741044
55839 16741044 15864759 15045797 14275308 13553175 12882041 12256777 11669180 11117780 10603746
55830 10603746 10121920 9664823 9231382 8823549 8438324 8070829 7721268 7391617 7079245
55821 7079245 6780682 6497605 6232225 5980691 5737884 5504964 5285484 5077618 4876979
55812 4876979 4684011 4502074 4330963 4168398 4015301 3873609 3740873 3612132 3485188
55803 3485188 3359890 3235153 3111130 2991367 2878458 2770464 2665485 2566192 2475667 2392618
55793 2392618 2315119 2245015 2183686 2127295 2071468 2017192 1966949 1918694 1869279 1820568 1776307
55782 1776307 1735630 1695315 1655937 1620106 1586888 1553703 1522028 1495662 1474778 1456731 1441327
55771 1441327 1430343 1423085 1417132 1412286 1409442 1406979 1402645 1397526 1393618 1388975 1379953 1366979 1353290
55758 1353290 1338880 1320532 1297496 1272731 1248565 1224952 1201911 1180147 1159173 1137686 1115563
55747 1115563 1093212 1070021 1045960 1023315 1004052 987044 970665 956255 945713 937557 928974 920176
55735 920176 912989 906696 899314 891871 887385 886194 885806 884687 882941 880143 875956 872126 870531 869890 867397
55720 867397 862673 857191 851041 843523 835594 828122 818773 804377 785631 766026 747016 727849 709207
55707 709207 693049 679179 665621 652111 639921 628685 616809 604580 593437 582664 570323
55696 570323 557056 545403 535612 525635 514942 504664 494209 481714 468110 456873 449047 441900
55684 441900 433259 423991 415469 407606 400202 393628 387480 380918 374712 370591 368475 366809 365490 365708
55670 365708 366983 367449 367172 368038 369927 370148 367299 362740 357581 351215 343738 336905 331447 326075 320344
55655 320344 316119 314652 314185 311999 307559 302566 299016 297897 298740 299985 300527 300738 301188 301274 300567 300399
55639 300399 302039 304222 304862 304336 304300 303975 300837 294945 289410 286268 284783 284195 285190 287960 291503 295691
55623 295691 301660 309452 317488 325081 333255 342551 352075 361114 369497 376039 379063 379023 378369 378161 376949
55608 376949 373577 368909 364172 359624 355495 352406 350404 349106 348752 349414 349737 348789 348440 350973 354855
55593 354855 356356 355330 355486 358371 361081 361289 360789 362015 364115 364674 363045 360107 356707 353761 351972
55578 351972 350246 346379 340185 333666 327504 320206 311687 304400 299381 294314 287449 280371 274648 268651
55564 268651 260496 251653 244599 238680 231355 222223 213162 205343 198518 192456 187106 181957 176793 172327
55550 172327 168941 165964 163262 161870 161796 161040 158435 155567 154070 152933 150689 148521 148705 151200 154117
55535 154117 156452 158150 158603 157540 156481 156892 157621 156439 153468 150722 148768 146268 142676 139062 136113
55520 136113 133351 130686 129070 129141 130416 132058 133561 134795 136250 138935 143158 147889 152225 156779 162493
55505 162493 168734 173839 176953 178150 177409 174852 171423 167985 164178 159426 154517 150729 147909 144866
55491 144866 141352 138148 135346 131903 127019 121015 114913 109948 107040 105843 104693 102497 100159 99224
55477 99224 99753 100686 101647 103034 104714 106006 106771 107373 107809 107991 108565 110329 113057 115949 118901 122262
55461 122262 125750 128841 131983 136093 140946 145292 148593 151516 154636 157654 160003 161364 161520 160506
55447 160506 158993 157827 157107 156172 154352 151282 146785 141109 135065 129452 124588 120612 117564 114745 110913
55432 110913 105906 101244 98178 95856 92371 86960 80233 73060 66428 61667 59350 58299 56978 55462
55418 55462 54773 54671 53641 51068 48091 46127 45684 46643 48618 50746 52042 52270 51894 51234 50343 49571 49379
55401 49379 49498 49006 47404 45185 43368 42816 43737 45353 46265 45570 43413 40379 37029 34356 33742 35599
55385 35599 38658 41247 42689 42897 41651 39299 37340 37108 38360 40049 41785 43598 44986 45431 45302
55370 45302 45221 45220 45480 46944 49797 52233 52330 50605 49125 48667 48469 48246 48378 48265 46573 43535 41314 41549
55352 41549 43901 47307 51220 55030 57561 58060 57091 56056 56111 57412 58775 58396 55733 52327 49852 47935
55336 47935 45179 41874 39965 40453 42423 44767 47206 49308 50068 49159 47454 45779 44175 42823 42582
55321 42582 43974 46353 48504 49521 49044 47453 45965 45720 46628 47686 48151 47709 46064 43596 41950 42324
55305 42324 43321 42188 38345 34036 31276 29927 29253 29470 30738 32019 32108 30975 29360 27842 26814 26414
55289 26414 25982 24619 22786 22236 23789 26292 28328 29716 30571 30168 27969 24963 22864 22426 23310 25030
55273 25030 27292 29877 32815 36213 39499 41483 41743 41304 41357 41836 41678 40077 37224 34318 32903 33342
55257 33342 33863 32247 28746 26058 25912 27008 27164 26250 25758 26405 27383 27546 26360 24035 21468 19754
55241 19754 19237 19507 20551 22916 26200 28556 28628 27082 25286 23498 21561 20446 21426 24104 26750 28501
55225 28501 30023 31985 34047 35531 36141 35846 34737 33171 31528 29904 28412 27509 27434 27687 27815 28410
55209 28410 30392 33391 35704 35990 34385 31965 29720 28113 27085 26327 25832 25988 26818 27570 27656 27539 27886
55192 27886 28240 27630 26474 26632 29108 32537 34533 34032 31898 29744 28712 29070 30338 31679 32466 32668
55176 32668 32698 32911 33261 33504 33722 34499 36248 38440 39995 40633 41263 42633 44082 44338 43246 41876 40942
55159 40942 40012 38629 37443 37492 38671 39637 39367 38238 37287 36861 36591 36516 37345 39120 40251 38797 34708
55142 34708 30167 27595 27792 30002 32992 35668 37234 37418 36545 35204 33990 33511 34145 35543 36759 37103
55126 37103 36537 35252 33479 31879 31364 32050 33049 33794 34881 36907 39166 40455 40748 40994 41433 41215 39728
55109 39728 37293 34440 31569 29658 30062 32747 35484 35900 34020 31976 31451 32392 34086 36226 38451
55094 38451 39895 40110 39877 40176 40660 40152 38587 37430 37911 39716 41731 43138 43318 41770 39094 37252
55078 37252 37600 39136 39913 39889 40845 43474 46178 47373 47499 47664 47400 45338 41764 38948 38555 39775 40668
55061 40668 40707 41124 42913 45402 47148 47697 47734 47757 47494 46849 46610 47686 50129 53431 57274 61408 65260
55044 65260 68369 70862 72884 74035 74177 74191 74897 75694 75558 75059 75868 78195 80230 80474 79203 77154 74217
55027 74217 70338 66632 64545 64521 66133 68790 71759 74244 76145 78063 80045 81173 80960 80180 79461 78024
55011 78024 74975 71180 68676 68506 70032 72036 73579 74112 73736 73396 74092 75819 77686 78897 79331 79481
54995 79481 80168 81920 84194 85722 85942 85529 85110 84309 82698 80940 80083 80237 80763 81265 81541 80953 78741
54978 78741 74871 70214 66335 65248 68169 73627 77831 78189 75835 73681 72887 72606 72297 72338 72569 72160
54962 72160 71207 70962 72113 74017 75875 77536 78882 79550 79627 79696 79898 79882 79816 80540 82488 85306 88583 92004
54944 92004 94735 95809 95408 94741 94409 93930 93057 92306 91824 91035 90024 90027 91709 93989 95457 96036 96315 96101
54926 96101 94733 92314 89573 86818 83939 81174 79040 77620 76566 75715 75194 75154 75884 77821 80815 83677
54910 83677 85277 86031 87584 90917 95204 98653 100080 99632 98370 97313 96675 95930 94741 93691 93804 95249
54894 95249 96869 97286 96519 96262 98293 102647 107719 112341 117295 124394 134419 146507 159312 172016
54880 172016 184323 196375 208914 222808 237979 253155 266865 278263 286942 292606 295145 294442
54868 294442 289918 281070 268747 255084 241631 228351 215036 202736 192720 184616 176892 169003
54856 169003 161840 155945 150392 143992 136919 130640 126475 124516 123669 122733 121625 121535 123640 127933 133782
54841 133782 141233 150787 161924 173000 183129 193275 204791 217577 230456 242712 254166 264073
54829 264073 271243 275551 278245 280195 280387 276697 267844 254306 237861 220808 205330 192820 183371
54816 183371 175848 168520 160019 150289 140756 133028 127255 122296 117596 113950 111847 110033 106811 102190
54802 102190 97596 93866 90817 88589 87917 88765 89996 90777 91246 91452 90977 90174 90457 92382 94530 95370
54786 95370 95258 95312 95228 93752 90908 88097 85935 83470 79923 76088 73389 72237 71760 70796 68897 66682
54770 66682 65274 65173 65856 66670 67686 69062 70012 69349 66991 64135 61975 61020 61529 63616 66694 69753
54754 69753 72571 75878 79818 83030 84079 83496 83555 85854 89717 93375 96367 99961 104946 109919 112815
54739 112815 113753 114969 117707 120765 123005 125849 131642 140214 148779 155220 160176 165816 173683 183932
54725 183932 195756 208263 221397 235879 251703 267233 280718 292102 302020 309435 312107 309672
54713 309672 304633 299568 294529 287932 279134 269226 259763 251391 243689 236235 229711 225347 222903 220195
54699 220195 215790 211311 209498 210489 211931 212472 213004 214318 215926 217910 221709 227906 235123 242411 251014
54684 251014 262190 274786 286784 298307 311438 327586 346405 366696 387020 405835 422196
54673 422196 436057 447133 453987 454986 449566 438015 421141 400963 380436 361152 342202 322564
54661 322564 303520 287168 273518 260903 248616 237259 226856 216553 206234 196798 188691 181534
54649 181534 175185 169788 164851 159730 155085 152268 151074 149694 147360 145515 145633 146981 147434 145775 142614
54634 142614 139694 138725 140218 142906 144670 144374 142598 140693 139636 139656 140242 140497 140038 139441 139328 139426 139383
54617 139383 139982 142268 145684 148454 149930 151300 153843 157741 162738 168523 173982 177598 179417 181475
54603 181475 185380 190425 194896 198325 201431 204582 207514 210184 212894 215613 217923 219635 221010 222403
54589 222403 223966 225529 226580 226669 226111 226090 227845 231838 237614 244070 249965 254797 259332 264849 271969
54574 271969 280712 291339 304125 318283 332368 346090 360705 377126 394679 412248 429538 446284
54562 446284 461001 471544 476556 475790 469768 459891 448262 436267 423498 408832 392284 375141
54550 375141 358611 343257 329603 318358 309773 303183 297333 290980 283469 275150 267097 260104 253994
54537 253994 247998 241479 234179 226346 218931 213056 208906 205675 202788 200291 197536 192707 184878 175822
54523 175822 168447 163711 160217 156500 152445 148510 144935 141986 139896 138221 136100 133304 130246 126935
54509 126935 123131 119658 118185 118997 120206 120110 119356 119611 120822 121185 119596 116852 114291 112345 110778 109551
54493 109551 108894 109015 110158 112556 115978 119611 122826 125794 128910 131732 133053 132193 129904 127766 126918
54478 126918 127514 129188 131593 134452 137291 139470 140656 141424 143236 147376 153647 160452 166521 172238 178696
54463 178696 185774 192138 197251 202302 208595 215875 223062 229943 237006 243893 249221 252048 252610 251462
54449 251462 248844 245110 240774 235557 228263 218380 207183 196527 187104 178699 171609 166558 163255 160173
54435 160173 156051 150894 145300 139735 134821 131500 130116 129806 129409 128664 127971 127363 126401 124958 123462 122365
54419 122365 121885 122213 123499 125634 128485 132203 136707 140926 143224 142820 140348 137069 134235 133202 135091
54404 135091 139675 145254 150295 154725 159108 163124 165660 166097 164752 162265 159249 156393 154175 152498
54390 152498 151129 150225 149725 148583 145645 141325 137368 134693 132555 130269 128631 128663 129695 129809 127976
54375 127976 124731 120872 116578 112161 108749 107342 107592 108302 109066 110585 112956 114439 112859 108209 103060
54360 103060 100129 100003 101480 103399 105502 107906 110503 112853 114410 115182 116448 120015 125968 131878 135325
54345 135325 136740 138403 140984 142826 142846 142367 143276 145879 149582 154442 160711 167701 174433 180880 187429
54330 187429 193702 199139 204315 210154 215903 219327 219258 216883 214172 211984 210199 208756 207611 206037 202828
54315 202828 197444 190666 183900 177904 172478 167509 163820 162217 161780 160214 156392 151644 147899 145470
54301 145470 143593 142230 141917 142410 142976 143834 145812 148598 150817 151964 152770 153415 153156 152312 152856 155818
54285 155818 159468 161491 161989 162961 165588 169556 174428 179968 185179 188657 190319 191606 193555 195629 196971
54270 196971 197910 199381 201295 202279 201169 198320 195175 192580 189826 185608 179632 172739 165575 158168 151090
54255 151090 145898 143473 142586 141133 138313 134673 130648 126370 122564 120006 118024 115043 110888 107085
54241 107085 104489 102211 99715 98296 99077 100689 100671 98635 96493 95735 95902 95843 95134 93957 92542 91234
54225 91234 90493 90355 90196 89218 87056 84181 81980 81926 83985 86312 87424 88241 90746 94859 98153 98923
54209 98923 97971 96801 95499 93497 91255 89787 89172 88762 88478 88645 88875 88488 88124 89548 93334 97704
54193 97704 100413 101172 101534 102750 104531 105947 106847 107925 109567 111119 111559 110704 109415 108691 108831 109393
54177 109393 109479 108058 104738 100538 97334 96099 96145 96435 96954 98141 99627 100548 100886 101550 103077 105019
54161 105019 106712 108033 109323 110967 112953 114449 114214 112160 110121 110063 111748 113222 113438 113073 112715 111827
54145 111827 110113 108522 107884 107585 106671 105525 105397 106711 108688 110189 110238 108348 105258 102829 102108 101933
54129 101933 100492 97918 96065 95868 96311 96243 95978 96478 97824 99199 99887 99736 98951 97858 96795 96074 96064
54112 96064 97021 98454 99004 97780 95730 94817 95671 96909 97022 96044 94812 93399 91127 87740 83903 80738
54096 80738 79205 79497 80549 80567 78694 75991 74238 74052 74638 74974 74581 73492 72341 72330 74135 76809 78592
54079 78592 78917 78695 78498 77598 75505 73431 73135 74770 76883 78400 79651 81380 83561 85477 86477 86439
54063 86439 85821 85298 84988 84104 81879 78785 76247 75087 75017 75673 77204 79294 80546 79759 77397 75037
54047 75037 73712 73475 74154 75448 76406 75957 74332 73169 73735 75555 77240 78267 79398 81444 83990 85533
54031 85533 84997 83081 81765 82282 84005 85715 87347 89608 92296 94216 94821 94688 94075 92320 89473 87387
54015 87387 87975 90925 94259 96826 99152 101881 104505 106009 106091 105329 104532 104211 104426 104912 105375 105718 105992
53998 105992 106368 107294 109286 112147 114574 115170 113995 112778 113371 116117 119849 123422 127019 131816 138359
53983 138359 145684 152270 157540 161958 166049 170130 174792 180511 186506 191135 193995 196680 200773 206083
53969 206083 211771 218206 226246 235211 243162 249164 253977 258406 262243 265200 267666 269855 271090 270733
53955 270733 269432 268797 269968 272734 275789 277625 277471 275578 272510 268258 262356 254847 246647 238928 232395
53940 232395 227073 222406 217651 212542 207571 203299 199636 196191 192944 190019 187200 184530 183011 183643
53926 183643 185783 187559 187986 187667 187283 186505 184822 182442 179960 177926 177065 177866 179554 180481 180103 179529
53910 179529 179539 179314 178101 176914 177169 178387 178819 177978 177122 177213 177752 177849 177353 176633 176102 176355 178017 180937
53892 180937 183912 185637 185726 184745 183522 182606 182259 182769 184595 187854 191731 195022 197573 200507 204531 208772
53876 208772 212222 215718 221174 228925 237055 243646 248623 252951 256981 260317 262806 264926 267429 270929
53862 270929 275550 280621 285066 288497 291718 295803 300865 306072 310721 314976 319523 324732 330300 335703
53848 335703 340858 346034 350996 354720 356489 357041 357888 359573 361299 362346 362911 363141 362238 359393 355169
53833 355169 351113 348139 345907 343543 340213 335158 328157 320167 312707 306211 299583 291798 283326 275406
53819 275406 268437 261820 255125 248568 242394 236568 231249 226791 222902 218437 212561 205743 199062 192949
53805 192949 187311 182538 179370 177555 175553 172232 168340 165627 164704 164488 163755 162473 161275 160234 158918
53790 158918 157348 155999 154671 152205 148023 143461 140665 140260 140984 141603 142198 143196 144193 144715 145501 147852
53774 147852 151770 155643 157905 158344 157691 156629 155451 154221 152975 151906 151294 151035 150509 149408 148353
53759 148353 148055 148095 147345 145511 143447 142161 142460 145319 151112 158172 163544 165941 166901 168507 171185 174527
53743 174527 178854 184558 190835 196614 202142 208204 214256 218917 222226 225830 230719 236061 240585 243948
53729 243948 246373 247996 249148 250417 251915 253130 253922 254960 256682 258481 259476 259581 259247 258582 257214
53714 257214 254829 251448 247450 243694 241187 240063 238970 236076 230848 224671 219462 215790 212562 208635
53700 208635 204463 201705 201174 201807 201991 201288 200258 199085 197404 195386 194051 194189 195561 197339 198851
53685 198851 199821 200501 201712 204139 207319 209815 210654 210178 209418 209149 209596 210320 210126 207842 203698 199457
53669 199457 196749 195673 195277 194773 193833 192346 190627 189497 189501 190159 190506 190215 189780 189777 190346 191247 192065 192586
53651 192586 193288 195127 198413 202215 205348 207683 209887 212166 214021 215264 216463 218160 220246 222490
53637 222490 225283 229366 234943 241290 247187 251667 254608 256956 260267 265652 272800 280018 285443 288452
53623 288452 290017 291651 293936 296047 296699 295553 293672 292569 292844 293896 295007 296314 298335 300753 302477
53608 302477 303038 303096 303117 302340 299949 296722 294344 293265 292407 291140 290374 291104 292672 293174 291278 287336 283192
53591 283192 281032 281756 283993 285255 284419 282584 281316 280867 280616 280396 280445 280583 280392 280019 280076 280857 282162
53574 282162 283744 285479 287433 290160 294395 299830 304757 307719 309115 310366 312010 313802 316365 321208
53560 321208 328664 336846 343219 346719 348184 349457 352240 356996 362546 367281 370971 374741 379215 383753
53546 383753 387946 392706 398885 405628 411313 415830 420665 426688 432962 438223 442746 448061 455126 463349
53532 463349 471280 477744 482281 485053 486742 488398 490877 494181 497467 499797 500831 500910 500762 501229 502858
53517 502858 505401 507890 509462 510040 510118 510224 510831 512279 514157 515248 514863 514111 514959 517980 521867 525285
53501 525285 528232 531158 533668 534931 534931 534675 535458 538336 543727 550739 557310 562013 565692 570443 576908
53486 576908 583468 588339 591656 594931 599214 604602 611231 619678 630047 641227 651640 660677 669240
53473 669240 678861 690360 703142 715685 726889 737169 748105 760778 774532 787715 799553 810924
53461 810924 823272 837292 852891 869850 887989 907035 926989 948492 972241 997973 1024524
53450 1024524 1050911 1076963 1103064 1129985 1158956 1190999 1225656 1261005 1295506 1329428 1363943
53439 1363943 1399331 1434788 1469791 1504788 1540482 1577036 1614208 1651771 1689533 1727177 1764282
53428 1764282 1800489 1835745 1870541 1905700 1941645 1978042 2014526 2051477 2089435 2127915 2165627
53417 2165627 2202006 2237649 2272878 2306804 2338606 2369001 2399345 2429459 2457434 2481695 2502346
53406 2502346 2520341 2536275 2550471 2563256 2574212 2581706 2584219 2582068 2576948 2569696 2559345 2544741
53394 2544741 2526395 2506219 2485822 2465618 2445345 2424768 2403728 2381903 2358911 2334617 2309197
53383 2309197 2282850 2255505 2227000 2197621 2168227 2139424 2110610 2080359 2048163 2015614 1985426
53372 1985426 1959265 1936785 1916756 1898683 1883036 1870175 1859614 1850556 1842827 1836916 1833194 1831534
53360 1831534 1831686 1833533 1836804 1841067 1846416 1853651 1863250 1874649 1887282 1901840 1919415 1939681 1961257
53347 1961257 1983979 2009311 2037979 2068740 2100473 2134119 2171077 2210672 2251075 2292211 2335970
53336 2335970 2383514 2434111 2486909 2542265 2600687 2661798 2725135 2790834 2858632 2927201 2995507
53325 2995507 3064132 3134201 3205437 3276274 3345632 3413623 3480598 3546339 3610342 3672300 3732142
53314 3732142 3789915 3845556 3898477 3947436 3991230 4029445 4062207 4089311 4110033 4123907 4131332
53303 4131332 4133227 4130113 4121535 4106438 4084264 4055647 4021839 3983645 3941341 3895430 3846671 3795253
53291 3795253 3740821 3683688 3625142 3565909 3505148 3441934 3377178 3313008 3250648 3189967 3130879
53280 3130879 3073851 3018840 2964900 2911375 2858667 2807286 2756812 2706394 2655984 2606599 2559598
53269 2559598 2515854 2475235 2436598 2398679 2361411 2326233 2294907 2268208 2245715 2226279 2208300
53258 2208300 2190045 2170462 2149812 2129209 2109484 2090574 2071935 2053343 2035344 2019046 2005407
53247 2005407 1994522 1985588 1977567 1969964 1963196 1958408 1956739 1958250 1961418 1964186 1966024 1968928 1975961 1988550
53233 1988550 2005287 2023396 2041292 2059571 2079723 2102396 2127262 2154123 2183317 2214837 2247719
53222 2247719 2280722 2313212 2344988 2375794 2405542 2434540 2462796 2489415 2513393 2534663 2553479
53211 2553479 2569057 2580034 2586289 2589259 2590203 2589223 2586179 2581315 2574292 2563731 2548674 2529791 2508426
53198 2508426 2485236 2460703 2436085 2412357 2388485 2362036 2331669 2298201 2263294 2228028 2192805
53187 2192805 2157652 2122284 2086532 2050885 2016072 1982191 1948994 1916938 1886899 1858582 1830193
53176 1830193 1800261 1769138 1738345 1709219 1682670 1659353 1639165 1621035 1604031 1588345 1574470
53165 1574470 1561842 1549272 1536663 1525276 1516002 1508117 1500185 1491703 1483363 1475897 1469112 1462054 1453794
53152 1453794 1443854 1432041 1418358 1403518 1389229 1377103 1366879 1356298 1343386 1328530 1313681
53141 1313681 1299889 1286532 1272819 1258909 1245182 1231377 1217132 1202704 1188406 1173836 1158504
53130 1158504 1142879 1127865 1113226 1097424 1079372 1059719 1040060 1021356 1003503 985973 968321
53119 968321 950275 931918 913913 897100 881618 866477 850221 832202 813299 795271 779160
53108 779160 764350 749486 734241 719703 706785 694860 682490 669213 655946 643696 632462
53097 632462 621440 609770 596876 582647 567744 553530 541430 532190 525553 520187 514028 505406
53085 505406 494342 482480 471510 461939 453476 445870 438904 432212 425903 420982 418179 416522 414038
53072 414038 410032 405730 402452 400005 397385 394174 390558 386550 382047 377364 372954 368851 365052 362200
53058 362200 360976 360794 359912 357059 352367 346629 340428 334313 329085 325255 322547 320370 318425 316455 313962
53043 313962 310759 307453 304608 301724 297867 293318 289650 287877 287207 286079 283895 281274 278987 277342
53029 277342 276476 276609 277763 279471 280999 281918 282514 283568 285641 288600 291952 295560 299701 304456 309453
53014 309453 314200 318274 321146 322546 323275 324893 327924 330871 331833 330842 329744 329864 330615 330528 328862 325897
52998 325897 322237 318269 314006 309208 303807 298178 292733 287434 282205 277547 273925 270605 266143 260306
52984 260306 254542 250044 246319 242361 238370 235320 233471 232300 231539 231219 230907 229877 227974 225443 222018
52969 222018 217241 211761 207417 205664 206475 208775 211217 212484 211881 210028 208357 207540 206932 205616 203294
52954 203294 200115 196652 194324 194612 197159 199642 200320 199806 199485 199265 198224 196626 195574 194993 193770 192073
52938 192073 191775 193862 196679 197743 196470 194301 192842 192729 193845 195636 197254 198095 198246 198090 197634 196641
52922 196641 195286 194225 194061 194991 196844 199098 200962 201783 201420 200215 198893 198610 200397 203936 207302
52907 207302 208911 209600 211785 216307 220981 222821 221111 217701 214805 213296 212943 213451 214891 217431 220858
52892 220858 224381 227084 228825 230480 232960 236149 239194 241681 243937 246139 247796 248392 248169 248010 248902
52877 248902 251601 256234 261879 267091 271468 276284 282887 290725 297767 302869 306931 311534 317149 323113
52863 323113 328750 333882 338493 342507 345980 349158 352210 354967 356960 357768 357553 357166 357391 357886 357194 354105
52847 354105 348898 343133 338400 335362 333584 331949 329568 326741 324766 324378 324571 323613 321136 318560 317292
52832 317292 317247 317498 317683 317966 317938 316513 313245 309173 305900 304088 303238 302757 302718 303507 305144 307201 309108
52815 309108 310270 310204 308973 307364 306179 305344 304095 302051 299634 297385 295530 294482 295061 297510 300592
52800 300592 302505 302773 302625 303360 304792 305590 304797 302725 300541 299302 299364 300501 302310 304370 306162 307227
52784 307227 307656 308193 309579 311886 314676 317608 320585 323473 326006 327894 328852 328828 328512 329115 330891 332172
52768 332172 330948 327486 324454 324049 325807 327669 328289 327548 325653 322941 320343 318890 318595 318606 318594 319197
52752 319197 320828 322833 324356 325514 327059 329194 331300 332771 333627 334216 334787 335498 336615 338419 340962
52737 340962 343845 346080 346343 343879 339485 335198 332543 331141 329386 326301 322178 317515 312217 306247
52723 306247 300255 294789 289378 283275 276875 271297 266530 261174 254610 248417 244706 243496 242742 240780
52709 240780 237860 235126 232904 230435 226894 222229 217126 212431 208661 205953 204310 203651 203541 203174 201946
52694 201946 199827 196861 192605 186788 180539 176111 174845 175834 177075 177530 177354 176413 173739 168897 163175
52679 163175 158579 155922 154487 153349 152197 150954 149594 148689 149132 150540 150735 147955 143168 138914 136093
52664 136093 133401 130209 128207 129045 131546 132784 131400 128499 125673 123667 122942 123855 125615 126383 125421
52649 125421 124238 124668 126406 127553 127196 126241 125598 124641 122008 117357 111786 106787 103185 100974 99790
52634 99790 99370 99612 100340 101307 102608 104813 108282 112371 115817 118011 119440 120662 121398 121089 120010 119177
52618 119177 119293 120318 121996 124129 126124 127037 126537 125537 125482 127129 130117 133323 135436 135807 135310 135885
52602 135885 138514 141917 144082 144866 146201 149616 154471 158945 161936 163527 164255 164699 165487 167029 169122
52587 169122 171086 172305 172638 172538 172747 173509 174025 173228 171165 169028 167557 166158 164077 161698 159875 158373
52571 158373 155900 151768 147046 143914 143907 146432 148785 148244 144627 140373 137744 136550 135139 132739 129914
52556 129914 127369 125540 124985 125940 127569 128741 129451 130348 131053 130323 128025 125608 124237 123751 123813 124672 126040
52539 126040 126580 125638 124548 125016 126820 128200 128119 127095 126056 125261 124418 123228 121803 120770 120702 121298 121724
52522 121724 122015 123272 125949 128945 131225 133411 136617 140467 143651 145920 148034 150075 151423 152331 153763
52507 153763 155335 155197 152762 150117 149566 150775 151595 150980 149856 149468 150103 151494 153523 156270 159818 164110
52491 164110 168605 172225 174169 174743 174913 175107 175051 174789 175115 176514 178152 178566 177363 175836 175695 177416
52475 177416 180041 182507 184778 187447 190505 193104 194738 196120 198332 201376 204249 206479 208745 211571
52461 211571 214088 215029 214666 214752 216300 218285 219021 218116 216418 214654 213104 212321 212967 214779 216632 217957
52445 217957 219221 220612 221266 220616 219635 219679 220575 221064 220908 221224 222487 223476 222860 220995 219351 218680 218551
52428 218551 218363 218005 217440 216284 213995 210394 206091 202680 202149 205275 210389 214390 215503 214801 214583 215640
52412 215640 216821 217170 217490 219258 222647 226442 229743 232884 236474 240145 242685 243185 241945 240391 240102
52397 240102 241549 243771 245689 247617 250702 254850 258194 259288 258985 259283 260897 263026 265079 267311 269720
52382 269720 271521 272178 272094 271824 271286 270305 269273 268621 268027 266819 265074 263850 264334 266950 270987 274859
52366 274859 277063 277404 277221 278005 279853 281552 282024 281223 279595 277292 274342 271430 269927 270794 273520 276355
52350 276355 277754 277504 276451 275429 274775 274702 275466 276869 277995 277956 276850 275557 274557 273396 271613 269862
52334 269862 269477 270817 272664 273643 273819 274139 274545 273794 271555 269755 270799 274817 279564 283013 285202 287435
52318 287435 290530 294274 298027 301333 304180 307110 310910 315801 320945 325048 327543 329088 330798 333033
52304 333033 335113 336314 336955 338045 339904 341777 343134 344701 347526 351517 355768 360044 364841 369909
52290 369909 373918 376169 377851 380845 385662 391180 396172 400536 405088 410492 416518 422300 427423 432598
52276 432598 438912 446434 454050 460752 466633 472490 479010 486508 495043 504477 514750 526095 538549
52263 538549 551425 564091 577262 592383 609343 625955 640493 653734 667551 682479 698051
52252 698051 714892 734729 758108 783513 809210 835057 861955 890294 919609 949443 980028
52241 980028 1012103 1046209 1082051 1118575 1154731 1189977 1223922 1255960 1285763 1313866 1341253
52230 1341253 1368542 1396002 1423774 1451161 1475999 1495945 1510642 1521890 1531576 1540359 1548340 1555683
52218 1555683 1561888 1565655 1566439 1565476 1564176 1562063 1557507 1550404 1542866 1536973 1532782 1529107 1525568 1523105
52204 1523105 1522728 1524397 1527276 1530663 1534448 1538775 1543551 1548459 1553588 1559990 1569296 1582375 1598395 1615516
52190 1615516 1632660 1650337 1669532 1690254 1711665 1733302 1755270 1777147 1797591 1815577 1831478
52179 1831478 1846285 1860155 1872366 1882405 1890416 1896648 1901075 1903511 1903624 1900893 1895053 1886525 1875865
52166 1875865 1862915 1847112 1828633 1808540 1787635 1765809 1742683 1718321 1693195 1668003 1643672
52155 1643672 1620827 1599002 1577101 1554942 1533642 1514052 1495645 1477588 1460135 1443978 1428742
52144 1428742 1413298 1397561 1382959 1370805 1360890 1351966 1343126 1334384 1326299 1319419 1314050 1310345 1308431
52131 1308431 1308134 1308411 1307438 1303892 1298262 1292524 1288375 1285896 1283855 1281008 1277077 1272715 1268648 1264815 1260470
52116 1260470 1255186 1249456 1244027 1239045 1234348 1230249 1227236 1224865 1221820 1217398 1212312 1207626 1203457 1199260
52102 1199260 1195023 1191421 1188819 1186576 1183594 1179433 1174894 1171472 1170045 1170029 1169992 1169076 1167446 1165367 1162623
52087 1162623 1159346 1156708 1155874 1156366 1156317 1154497 1151538 1149103 1148424 1149733 1152405 1155282 1157260 1157993 1157878 1157315
52071 1157315 1156447 1155680 1155812 1157242 1159602 1162607 1166794 1172796 1180261 1188108 1195682 1203222 1211480 1221327 1233329
52056 1233329 1247110 1261584 1276603 1293965 1315669 1341432 1369154 1397812 1428409 1461599 1495942
52045 1495942 1529552 1562452 1596035 1630865 1666253 1701623 1737051 1772530 1807738 1842581 1877042
52034 1877042 1910393 1941454 1969790 1995858 2019714 2040368 2056758 2068710 2076601 2080769 2081751 2080483
52022 2080483 2077520 2072318 2063919 2052296 2038631 2024354 2010233 1996210 1981617 1965558 1947509 1927770
52010 1927770 1907269 1886997 1867846 1850821 1836821 1825903 1817077 1809264 1802417 1797431 1795019 1795073 1797191
51997 1797191 1801258 1807184 1814564 1823343 1834563 1849550 1868088 1888107 1907575 1926031 1943736 1960093
51985 1960093 1973910 1985087 1995029 2005143 2015502 2025141 2033107 2038914 2042423 2043624 2042439 2038639 2032144
51972 2032144 2023299 2012503 1999581 1984033 1965987 1946313 1925530 1903119 1878398 1851602 1823430
51961 1823430 1793622 1760890 1724720 1686789 1649824 1614985 1580968 1546062 1510467 1475816 1442760
51950 1442760 1410212 1377202 1344239 1312121 1280424 1248453 1217083 1188106 1161772 1136267 1109908
51939 1109908 1082744 1055609 1028815 1002503 977282 953429 929909 905213 879155 853177 828895
51928 828895 806785 786223 766300 746492 726831 707597 688919 670810 653517 637470 622711
51917 622711 608707 594928 581352 568245 555771 544003 533007 522557 511991 500743 489010
51906 489010 477829 468376 460999 454700 447863 439956 432294 426499 422249 417391 410466 402434 395575 391258
51892 391258 389043 387308 384385 379664 374052 368973 364823 360983 357336 354628 352900 350791 347249 343001
51878 343001 339368 336572 334323 333262 334308 336942 339563 341387 342698 343436 343032 341786 340872 340497 339301
51863 339301 336287 332313 328973 326714 324726 322047 318169 313164 307888 303616 300871 298955 296996 294936
51849 294936 292962 290636 287419 283719 280424 277574 274464 271214 269221 269530 271335 272786 272933 272211 271195
51834 271195 269753 267723 265666 264275 263381 262247 260784 259677 259266 259052 258630 258276 258141 257554 256031 254570
51818 254570 254923 257523 260827 262888 263140 262650 263040 265105 267921 269400 268389 266323 266048 268693 272317
51803 272317 274116 273511 272477 273051 275159 277156 278006 278406 279606 281649 283387 284186 284887 286820 290492 295661
51787 295661 301967 308729 314603 318459 320512 321786 322680 322853 322349 321697 320788 318796 315651 312653 311015
51772 311015 310494 309985 308851 307100 304846 302368 300328 299271 298984 298796 298293 297414 296185 294836 293974 294038
51756 294038 294699 295220 295422 295927 297408 299865 302603 304616 304943 303025 299191 294993 292668 293641 297147 300683
51740 300683 302198 301680 300430 299291 298220 297095 295904 294131 291065 287059 283700 282252 282501 283453 284506
51725 284506 285566 286720 288347 290930 294127 296472 296749 295350 293670 292470 291564 290877 290909 291937 293399
51710 293399 294529 295359 296680 298965 301679 303959 305870 308456 312310 316670 320514 324042 328136 332630
51696 332630 336319 338872 341562 345559 350411 354943 358927 363024 367564 372140 376316 380214 384477 389838
51682 389838 396461 403604 410366 416820 423855 431962 441028 451347 463653 477773 492475 507200 522551
51669 522551 538260 552108 562290 569690 576254 581923 584884 584295 581088 576381 570820 565331 560768 556583
51655 556583 551283 544481 537273 530426 523624 516726 510392 504994 500159 495900 493089 492178 492560 493711 495929
51640 495929 499296 502785 505135 506046 506178 506659 508778 513134 518652 523374 526639 529515 532806 535966 538678
51625 538678 542184 547939 555844 564695 573477 581219 586626 589193 590081 590658 590656 588986 585928 583240 582345 583462
51609 583462 586272 590264 594599 598654 602616 606637 609831 611295 611834 613174 615464 617020 616775 615479 613919
51594 613919 611356 606580 599458 590589 580425 569670 559720 551396 543645 534685 524397 514666 507258
51581 507258 502159 498156 494253 490130 485678 480640 474692 467693 459934 452300 446073 442279 440949 440937 440553
51566 440553 438640 435111 430555 425488 420182 415008 410428 406472 402630 398635 395163 393266 392965 392700 390503
51551 390503 385745 379698 374463 371489 370954 372025 373340 373599 372415 370765 370010 370214 369964 368301 366270
51536 366270 365878 367785 370902 374177 377807 382311 387154 391048 393492 395543 398945 404520 411373 417711
51522 417711 422627 426986 432320 439057 446289 453060 459093 464190 467781 469555 469926 469318 467536 464404 460516
51507 460516 456641 452659 447867 442221 436585 431726 427694 424265 421515 419775 419270 419799 420540 420454 419334
51492 419334 418284 418651 420722 424058 428714 435047 442442 449487 455806 462518 470205 477487 482576 485448
51478 485448 487317 488604 488725 487652 486289 485138 483772 481907 479889 477603 474033 468811 463454 459967
51464 459967 458534 457652 456509 456194 458120 461980 465949 468633 470212 471668 473573 476010 479211 483410 487926
51449 487926 491157 492150 491858 492102 493348 494209 493271 490663 487413 483932 479857 474998 469636 463834 457220
51434 457220 449787 442433 436209 431297 427141 423509 420835 419315 418233 416807 415563 416070 418935 422681
51420 422681 425183 425914 426165 427349 429949 434174 440604 449473 459660 468935 475364 478682 480750 484555
51406 484555 491885 501573 510583 517265 523061 530619 540882 552626 564264 575119 585102 594022 601442
51393 601442 606895 610283 612273 613874 615215 615278 613478 610877 608930 607495 605309 602186 599396 597739 596571
51378 596571 595148 593758 592923 592540 592590 593826 596908 601447 606688 612482 618730 624428 628349 630523 632199
51363 632199 634337 636714 638325 637996 634834 628878 621380 613833 606728 599731 592854 586691 581545 577136
51349 577136 573246 569835 566287 561445 554886 547558 540683 534631 529481 525967 524848 525494 526082 525458 524165
51334 524165 523387 523492 524006 524605 525487 526867 528609 530447 532239 533868 535159 536082 536955 538280 540306 542604
51318 542604 543972 542926 538670 531660 523011 513272 502101 489184 475132 461239 448638 437868 428815
51305 428815 420670 412241 402793 392625 382701 373911 366768 361177 356056 349911 342607 336060 332136 330129
51291 330129 327521 323099 317921 313041 307897 301765 295520 290796 288160 287083 286940 286959 285848 282867 279080
51276 279080 276378 275222 274375 272739 270404 267853 265346 263506 263404 265346 268117 270114 270924 271405 272532
51261 272532 274551 277118 279895 282878 286125 289213 291411 292749 294497 297876 302579 307340 311853 317121
51247 317121 323844 331567 339686 348158 356536 363405 367845 370860 374234 378327 381879 383707 383516 381217
51233 381217 376617 370194 363286 356918 350870 344143 336055 326767 317330 309407 304295 301640 299459 295876
51219 295876 290717 285191 280358 276303 272415 267983 262708 257185 252721 250065 248335 245789 241744 237169
51205 237169 233290 230296 227798 225865 224894 224751 224733 224280 223268 221729 219885 218410 218053 218833 219999 220826
51189 220826 221081 220731 219821 218691 217759 216836 215303 213234 211715 211610 212614 214028 215858 218403 221148 223042
51173 223042 223756 223913 224036 224023 223778 223681 224138 225100 226164 226766 226235 224324 221958 220876 222055 224773 227602
51156 227602 230032 232729 236308 240257 243156 243845 242442 240298 238873 238635 239094 239683 240178 240375 240010 239350
51140 239350 239341 240573 242273 242910 241800 239713 237831 236654 236188 236695 238458 240730 241619 239658 235362 230772
51124 230772 227613 226344 226741 228261 229505 228418 224214 218705 214723 213326 213342 213369 213046 212385 211252 210059
51108 210059 209795 210575 211073 210288 209141 209245 210671 212193 213388 215130 217806 220340 221609 221912 222337 223150
51092 223150 223530 222632 220356 217191 213818 210877 208747 207351 206223 204631 201736 197067 191325 186501 184527
51077 184527 185514 187595 188729 188430 187502 186574 185553 184538 184382 185726 187826 189087 188882 188349 189194 192081
51061 192081 196289 200560 204059 206931 210271 215191 221423 227148 230735 232517 234254 236945 239874 241860
51047 241860 242571 242194 240646 238000 235248 233622 233155 232725 231622 230268 229073 227596 225543 223886 223887 225237
51031 225237 226230 225982 225569 226599 229379 232914 236017 237758 237392 234881 231482 229093 228649 229532 230591 231372
51015 231372 232172 233163 233776 233007 230401 226821 224040 223287 224241 225602 226571 227500 229175 231827 234967 238017
50999 238017 240941 244029 246876 247859 245421 240180 235007 232392 232203 232653 232736 232712 232749 232640 232925 234854 238737
50982 238737 243443 247997 252564 257200 260845 262772 264165 266859 270815 274127 275589 276205 277892 281501
50968 281501 286323 290835 293604 294144 293497 293707 296182 300456 304677 307276 308128 308230 308589 309669 311645 314540
50952 314540 317704 319757 320058 320187 322925 329269 337248 344292 350027 355993 363286 371598 380311 389334 398595
50937 398595 407714 416642 426066 436616 447988 459285 470168 481386 494168 509175 526110 544309
50925 544309 563580 584215 606261 629239 652868 677775 705249 736415 771630 810214 850643
50914 850643 891653 933590 978263 1027210 1080753 1139069 1203137 1273659 1349871 1430637 1516151
50903 1516151 1607133 1702717 1800820 1900732 2003688 2110276 2218552 2325329 2428128 2525244
50893 2525244 2615216 2697359 2771869 2838175 2893928 2936823 2966988 2986274 2995650 2994673 2983390 2963099
50881 2963099 2934781 2898323 2854355 2805980 2757340 2710610 2665222 2619918 2574632 2530073 2486309
50870 2486309 2442494 2397730 2351500 2303256 2252241 2198046 2141023 2081745 2020259 1956162 1889208
50859 1889208 1819554 1747716 1674997 1603821 1536749 1474583 1415766 1358191 1301505 1247393 1197815
50848 1197815 1153402 1113609 1078019 1047002 1020960 999152 979782 961514 944696 930652 919846
50837 919846 911183 903222 895713 889793 886924 887749 891638 897050 902457 907081 910889 914199 917733 922858
50823 922858 931026 942631 956749 972146 988092 1004135 1019842 1035399 1052007 1070887 1091976 1114235
50811 1114235 1137244 1161852 1189053 1218905 1251065 1286041 1325123 1368911 1416545 1466955 1520566
50800 1520566 1579058 1643489 1713530 1788890 1870708 1960859 2060533 2170330 2291135 2423684 2567514
50789 2567514 2721765 2887128 3065569 3257612 3461157 3673588 3893772 4120950 4352911
50780 4352911 4586672 4820146 5051490 5276959 5490712 5686689 5859675 6005113 6119731
50771 6119731 6202882 6255998 6280270 6275901 6243975 6187639 6110642 6015955 5906953 5789015 5668345
50760 5668345 5549350 5434135 5324246 5221441 5126327 5037176 4950648 4863354 4772647 4676761
50750 4676761 4574791 4466227 4350093 4224857 4089655 3945439 3794517 3639053 3480446
50741 3480446 3320117 3160346 3003872 2852780 2707989 2569821 2438873 2316296 2203341
50732 2203341 2100686 2008080 1924504 1848774 1780262 1719316 1666947 1623801 1589130 1560700 1535827
50721 1535827 1512720 1490940 1470788 1452419 1435604 1420170 1406416 1394889 1385735 1378396 1372100 1366558
50709 1366558 1361950 1358172 1354440 1349910 1344452 1338500 1332360 1326260 1320952 1317446 1315808 1314906 1313962 1313900 1316367
50694 1316367 1321632 1328250 1334990 1342490 1352749 1367376 1386628 1409856 1436455 1466332 1499718 1536935
50682 1536935 1578613 1625866 1679674 1739929 1805625 1876385 1953266 2037600 2129500 2228096 2332802
50671 2332802 2443671 2560919 2684950 2816421 2955157 3099061 3245017 3390648 3534085
50662 3534085 3672259 3801136 3918045 4022353 4113282 4188450 4245295 4282585 4299530 4294909 4268565
50651 4268565 4222799 4160742 4084091 3994208 3894953 3792569 3692494 3597520 3508822 3427024 3351799
50640 3351799 3281982 3216976 3157072 3101681 3048181 2993435 2935895 2875360 2811026 2740815 2662939
50629 2662939 2577786 2488003 2396745 2305834 2215667 2126619 2039989 1957321 1879438 1806760 1740199
50618 1740199 1680906 1629167 1584184 1544951 1510821 1481366 1456427 1436363 1421628 1412009 1406770 1405528
50606 1405528 1408535 1416080 1427990 1443460 1460881 1478328 1495135 1512761 1533195 1556726 1582191 1609128
50594 1609128 1638268 1669956 1703574 1738827 1776238 1815911 1857218 1900434 1947371 1999477 2056251
50583 2056251 2116346 2179240 2245037 2313724 2385620 2461528 2541296 2623119 2705497 2789054 2874964
50572 2874964 2962228 3047934 3129696 3206337 3276667 3339508 3395041 3444416 3487542 3522646 3548504
50561 3548504 3565980 3576868 3582329 3583067 3580043 3574233 3566408 3557859 3550691 3546709 3546314 3548902 3553879 3560797
50547 3560797 3568951 3577268 3584400 3588637 3588075 3581018 3565950 3541247 3505751 3459740 3404406 3339937 3265051
50534 3265051 3179112 3083944 2982768 2878078 2771472 2664834 2560218 2458704 2360532 2266449
50524 2266449 2177737 2094707 2016330 1941989 1872731 1810132 1754541 1705132 1661130 1622160 1587748
50513 1587748 1557333 1530857 1508711 1491041 1477544 1467946 1462232 1460366 1462273 1468123 1478120 1491757
50501 1491757 1507716 1524839 1543034 1563167 1586328 1613146 1643285 1675379 1708053 1741434 1777339
50490 1777339 1817455 1861559 1907885 1954923 2002383 2050712 2100317 2151222 2202942 2254710 2306273
50479 2306273 2358539 2413130 2471409 2534192 2602032 2675209 2753647 2837558 2928061 3026494 3133215
50468 3133215 3247784 3370115 3500514 3638715 3784006 3936408 4096459 4263409 4434691
50459 4434691 4607554 4779986 4949528 5112690 5266753 5410986 5544721 5664955 5767142
50450 5767142 5847760 5904949 5937390 5944201 5925709 5883038 5817295 5730513 5626909 5511510 5387678
50439 5387678 5257755 5126070 4999102 4881936 4776300 4682940 4604141 4542585 4498920 4471870
50429 4471870 4459865 4461181 4472983 4491269 4511386 4527925 4534854 4527010 4501248 4455639 4388362 4298504
50417 4298504 4187518 4058807 3916241 3763813 3605952 3446590 3287947 3131305 2978730
50408 2978730 2832806 2694932 2565308 2444685 2334493 2234825 2143817 2059963 1983934 1917127
50398 1917127 1859285 1808633 1763868 1725045 1692872 1667921 1650195 1638545 1630682 1624633 1620368 1619486
50386 1619486 1623313 1631833 1644264 1659913 1678280 1699038 1722189 1747774 1775198 1803475 1832498 1863541
50374 1863541 1897772 1934512 1971693 2008002 2043903 2080335 2117041 2152740 2186595 2218900 2250368
50363 2250368 2281362 2312093 2343033 2374526 2405981 2435976 2463535 2489402 2516020 2546183 2581566
50352 2581566 2622267 2667536 2716883 2770576 2829138 2892346 2958663 3025829 3092245 3157782 3222927
50341 3222927 3287063 3347980 3403361 3452302 3494829 3530251 3556832 3573028 3578105 3571213 3550800 3515717
50329 3515717 3466396 3404179 3329905 3244029 3148058 3045089 2938969 2833649 2733194 2641146
50319 2641146 2559042 2486122 2421224 2364809 2318769 2284528 2261884 2249571 2246157 2249983 2258496 2268282
50307 2268282 2276219 2280604 2280852 2275989 2263881 2242303 2210448 2168919 2118668 2060882 1997817 1932604
50295 1932604 1867693 1804054 1742114 1682502 1625333 1569902 1516218 1466192 1422002 1383544 1348800
50284 1348800 1316538 1287335 1261884 1239920 1221348 1206839 1196162 1187088 1177537 1168271 1161962 1159686
50272 1159686 1159754 1160198 1161082 1163722 1168668 1175395 1183498 1193223 1204862 1218286 1233204 1249461 1266886 1285051
50258 1285051 1303426 1321839 1340816 1361330 1383872 1407666 1430994 1452527 1472251 1490971 1509087
50247 1509087 1526053 1540962 1553489 1564217 1574021 1583134 1590972 1597092 1602139 1607231 1612252 1615383 1614889
50234 1614889 1611056 1605838 1600806 1595999 1590561 1583681 1574841 1563921 1551476 1538277 1524117 1507561 1487574
50221 1487574 1465089 1442330 1420707 1399959 1379244 1358238 1337039 1315880 1295497 1277141 1261401
50210 1261401 1247260 1233131 1218772 1205451 1194051 1183771 1173131 1161728 1150475 1140499 1132441 1126548
50198 1126548 1122544 1119237 1114948 1108834 1101520 1094155 1087129 1080069 1072786 1065601 1058573 1050885 1041500 1030451
50184 1030451 1019153 1009175 1000859 993468 986540 980475 975408 970245 963660 955923 948909 944148 941559 940275
50170 940275 939897 940434 941658 943178 944821 946484 948020 949641 951901 954666 956779 957622 958477 961091 965026
50155 965026 967722 967498 965365 963318 961764 959344 954678 947580 939011 930418 922792 915763 907838 898033
50141 898033 887010 876179 865981 855744 845185 835348 827851 823429 821305 819825 817679 814726 811672
50128 811672 809036 806690 804488 802829 802205 802380 802465 801747 800118 797810 795050 791964 788503 784435 779640
50113 779640 774413 769279 764494 759875 755072 749858 744266 738592 733181 728046 722719 716522 708912 699656
50099 699656 689077 678202 668125 658884 649371 638762 627784 618096 610714 605500 601841 599168 596798
50086 596798 593957 590264 586037 582116 579435 578479 578806 579370 579669 580260 581688 583404 584431 584724 584952 585131
50070 585131 584658 583825 584167 586784 591175 596309 601998 608478 615306 621653 627549 634038 642014 651388 661490
50055 661490 671981 683233 695891 710086 725194 740482 755792 771173 786126 800002 813163
50044 813163 826782 841184 855276 868179 880521 893294 906136 917708 927285 935009 941075 945922
50032 945922 950938 957525 965116 971303 974419 975097 974842 974109 972642 971069 970999 973550 978463 984762 991886
50017 991886 1000100 1010052 1022112 1036173 1052100 1070132 1090324 1111646 1132333 1151710 1171244 1193216
50005 1193216 1218366 1245197 1271409 1295572 1317489 1337479 1355638 1371668 1385303 1396842 1407135
49994 1407135 1416850 1425730 1432687 1436649 1437372 1435649 1432686 1428960 1423641 1415586 1405102 1394055 1383701
49981 1383701 1372998 1359990 1344510 1328397 1313070 1298198 1283309 1269317 1257338 1246788 1236132
49970 1236132 1225283 1215836 1208681 1202618 1196044 1189121 1183402 1179801 1177806 1176466 1175291 1174023 1172150 1169116
49956 1169116 1164938 1160409 1156511 1153372 1149768 1144013 1135571 1125451 1114764 1103444 1091027 1078294 1067152
49943 1067152 1058727 1052292 1046349 1040219 1034328 1029523 1026464 1025229 1025070 1024904 1024478 1024801 1027217 1032367 1040265
49928 1040265 1050816 1063784 1078760 1095766 1115517 1138237 1162415 1185503 1205970 1224064 1240555
49917 1240555 1255428 1267944 1277452 1283956 1288349 1292125 1296230 1300019 1301997 1301819 1300870 1300372 1299490 1295820
49903 1295820 1287250 1272755 1251918 1224764 1192220 1156050 1118052 1079454 1041000 1003146 966186
49892 966186 930570 897157 866766 839399 814157 789932 766007 742260 719394 698928 682196
49881 682196 668921 657238 645508 633831 623485 615297 609078 604380 601136 599462 599227 599950 600887 601278
49867 601278 600898 600486 601194 603409 606326 608936 611175 613782 617055 620138 621764 621684 621119 621650 623643 625944
49851 625944 627217 627381 627500 628538 630640 633454 636463 638830 639700 639294 639203 640822 643681 646047 647132 647947
49835 647947 649844 653045 656951 661208 665864 670975 676630 683137 690667 698931 707731 717590 729308 743022
49821 743022 758240 774695 792666 812522 834472 858579 884366 910628 936656 963880 995261
49810 995261 1032351 1073641 1116447 1159766 1204341 1250368 1296353 1340454 1381966 1421032 1457546
49799 1457546 1491049 1521520 1549716 1576649 1602940 1628708 1653829 1678025 1700566 1720063 1734849
49788 1734849 1743794 1746628 1743346 1733461 1716199 1691403 1659980 1623302 1582459 1538229 1491605 1443905
49776 1443905 1396202 1348747 1301215 1253540 1206375 1160710 1117273 1076397 1038150 1002281 968279
49765 968279 936014 906180 879512 855537 832823 810645 789689 770809 753947 738909 726296
49754 726296 716542 708491 700257 691433 683268 676493 670142 663007 655200 647542 640141 632441 624298 616254
49740 616254 608867 602255 596171 590257 584570 580134 578402 579566 581824 583052 582979 583004 584037 585344 585678
49725 585678 584812 583483 582222 580746 578524 575724 573310 572137 572105 572606 573674 576021 579701 583477 586088
49710 586088 587618 589011 590796 593065 596198 600555 605678 610849 616271 622642 629722 636649 643813 653019
49696 653019 665301 679795 695379 712221 730986 751745 774642 800426 829037 858673 887820
49685 887820 917480 949720 984488 1019600 1053558 1086347 1117315 1144516 1167042 1186286 1203723
49674 1203723 1218918 1231104 1241501 1252413 1264675 1277464 1290020 1301814 1311277 1316328 1316563 1313313
49662 1313313 1306759 1294331 1273117 1243121 1207217 1168599 1129405 1091245 1055424 1022123 990322
49651 990322 959174 929090 901203 876331 854791 836582 821008 806505 791749 777093 764287
49640 764287 754635 747864 742866 738814 735140 731137 726426 721573 717517 714394 711520 708491 705629 703320
49626 703320 701726 701418 703396 707767 712884 716695 718816 720594 723058 725497 726391 725349 723721 723361 724932
49611 724932 727486 729626 731020 732644 735485 739234 742444 743851 743335 741836 740662 740764 742159 743871 744752
49596 744752 744579 744338 745358 748160 752011 755359 756806 755943 753358 749819 745696 741384 737829 735877 735061
49581 735061 733862 731560 729177 728038 727839 726940 724499 721577 719898 720023 721104 722060 722465 722394 722037 721850
49565 721850 722824 726039 731687 738751 745794 751917 756906 760829 763876 766466 769152 772488 777356 784982
49551 784982 795801 808217 819400 827905 834972 842808 852251 862829 874444 887634 902080 916128
49539 916128 928498 939843 951864 965262 979252 992955 1006499 1020600 1035643 1051613 1068598
49528 1068598 1086887 1106665 1128118 1151880 1178782 1208633 1239588 1269432 1297683 1325971 1356238
49517 1356238 1389159 1424604 1462928 1504939 1550767 1599531 1650120 1701784 1754059 1806976 1861530
49506 1861530 1919118 1980050 2043243 2107899 2174819 2245379 2319600 2396100 2473680 2552071 2631246
49495 2631246 2711090 2792022 2874873 2959405 3043664 3125710 3205710 3285403 3365518 3444483 3519781
49484 3519781 3589777 3653787 3711071 3760614 3801801 3834683 3859362 3875474 3882478 3880345 3869848 3852291
49472 3852291 3828955 3800670 3767963 3731675 3693416 3655177 3618514 3584280 3553009 3525157 3500863
49461 3500863 3479903 3462201 3448210 3438609 3433911 3434624 3441395 3454259 3471816 3491885 3513515 3538039
49449 3538039 3567669 3603014 3642330 3683228 3724775 3767629 3812341 3858087 3903242 3946745 3988286
49438 3988286 4027253 4062257 4091983 4116014 4134247 4145722 4148528 4140899 4122213 4093142 4055099 4009175
49426 4009175 3955135 3891665 3818177 3736219 3648521 3556871 3461717 3363709 3264518 3165793 3068248
49415 3068248 2972274 2878543 2787221 2697321 2607911 2519710 2434707 2354403 2279133 2208809 2143293
49404 2143293 2081860 2023103 1965799 1909663 1855274 1803744 1756347 1713772 1675390 1639639 1605441
49393 1605441 1573136 1544054 1519281 1498470 1479474 1459523 1437591 1415503 1395970 1379602 1364645
49382 1364645 1349548 1334620 1320912 1308770 1298279 1290022 1284255 1279949 1275769 1271725 1268825 1267343 1266480
49369 1266480 1265739 1265630 1266788 1269250 1272917 1278015 1284681 1292645 1301768 1312534 1325622 1341209 1358817
49356 1358817 1377487 1395827 1412297 1425989 1437143 1446793 1455972 1465212 1474422 1483101 1491083 1499328 1509539
49343 1509539 1522550 1537379 1552351 1566942 1581967 1598030 1614535 1630536 1646106 1662397 1680400
49332 1680400 1699988 1720172 1740101 1759676 1779210 1798601 1817090 1834035 1849813 1865587 1882090
49321 1882090 1899011 1915696 1932020 1948177 1964143 1980130 1997340 2017159 2039278 2061517 2082240
49310 2082240 2102278 2123766 2147752 2173948 2202236 2232776 2264626 2296012 2326745 2358962 2394364
49299 2394364 2431773 2468840 2505479 2544043 2586341 2631954 2679571 2728441 2778153 2828409 2879924
49288 2879924 2934545 2993481 3055964 3120413 3186391 3254573 3325339 3398453 3474102 3553342 3637211
49277 3637211 3725766 3818073 3912883 4009424 4107898 4209212 4314025 4422187 4533232 4646987
49267 4646987 4763358 4881952 5002455 5124956 5249204 5374003 5498342 5623061 5750282
49258 5750282 5880858 6013076 6144185 6272404 6397073 6517659 6633320 6742929 6844841
49249 6844841 6936899 7017345 7085740 7142668 7188731 7224019 7248232 7260958 7262172 7252886 7234995 7210054
49237 7210054 7178582 7141059 7099058 7054538 7008217 6959715 6909437 6859452 6812243 6769402 6731948
49226 6731948 6701112 6677924 6662354 6653547 6650800 6653861 6662531 6676648 6696507 6722716 6755413 6793909
49214 6793909 6837138 6884060 6933469 6983773 7033433 7081632 7128352 7173755 7217465 7258243 7294196
49203 7294196 7323317 7344016 7355301 7356576 7347449 7327796 7297905 7258186 7208550 7148192 7076393 6993678
49191 6993678 6901849 6802588 6696340 6583128 6464395 6343273 6222707 6103821 5986477 5870782
49181 5870782 5757267 5646017 5536707 5429677 5326101 5226796 5131445 5039425 4950732 4865651
49171 4865651 4784171 4706538 4633914 4567473 4506867 4450546 4397768 4349400 4306232 4267333 4230873
49160 4230873 4196207 4164325 4136300 4111906 4089803 4068478 4046963 4025192 4004012 3984477 3966824
49149 3966824 3950332 3934245 3918453 3903023 3887574 3871541 3854749 3837236 3818835 3799646 3780837
49138 3780837 3764193 3750559 3739184 3728743 3718506 3708324 3698226 3688634 3680561 3674841 3671205 3668649
49126 3668649 3666727 3666069 3667603 3671688 3678050 3686113 3695158 3704448 3713649 3723335 3734983 3750158 3769248
49113 3769248 3790849 3812733 3833703 3854373 3876049 3899317 3924118 3950786 3980301 4013500 4050440
49102 4050440 4090496 4132739 4176538 4222327 4271501 4324838 4381142 4438318 4495735 4554601 4615844
49091 4615844 4678745 4742162 4806161 4871602 4938751 5007075 5075969 5144891 5213007 5279329 5343174
49080 5343174 5404128 5461961 5516950 5569868 5621108 5670257 5717131 5762631 5807704 5851754 5893078
49069 5893078 5930867 5965882 5999112 6030658 6060274 6088380 6115984 6143716 6171169 6197253 6221399
49058 6221399 6244537 6268361 6293267 6317438 6338623 6356551 6373012 6389897 6407749 6425881 6443179
49047 6443179 6459155 6474904 6492502 6512462 6532411 6549646 6564582 6579998 6597045 6614086 6629761
49036 6629761 6644935 6660432 6674867 6686608 6696648 6707521 6719939 6732337 6743616 6754663 6766879
49025 6766879 6780454 6794624 6808787 6822861 6836985 6851254 6865707 6880620 6896778 6914905 6934470
49014 6934470 6953623 6970826 6986141 7000545 7014675 7028869 7043533 7058269 7071178 7080261 7085421 7088115
49002 7088115 7089406 7089497 7088880 7088340 7087488 7084570 7078290 7068903 7057068 7042530 7024502 7002734 6977796 6950744
48988 6950744 6922669 6893929 6863707 6831093 6796677 6762082 6727808 6692835 6656898 6621772 6589172
48977 6589172 6558434 6527666 6496647 6467133 6440467 6416301 6393860 6373280 6355114 6339347 6325567
48966 6325567 6313614 6303427 6294482 6286047 6278118 6271693 6267794 6266338 6266215 6266480 6267162 6268767 6271410 6274857
48952 6274857 6279087 6284166 6289557 6294315 6298146 6301587 6304709 6306326 6305062 6300855 6294833 6288038 6280870 6273391
48938 6273391 6265225 6255019 6240903 6222163 6200258 6177679 6155635 6132976 6107451 6078003 6045667
48927 6045667 6012146 5977841 5941727 5903015 5862140 5819726 5775345 5728162 5678578 5628315 5578655
48916 5578655 5529203 5478726 5426796 5374176 5321805 5269826 5217660 5164859 5111726 5059118 5007723
48905 5007723 4957695 4909016 4861990 4817118 4774662 4734702 4697670 4664419 4635488 4610516 4588701
48894 4588701 4569723 4553985 4541992 4533883 4529665 4529519 4533528 4541311 4552329 4566473 4583901 4604237
48882 4604237 4626324 4649032 4672032 4695678 4720565 4747430 4777017 4809541 4844531 4881566 4920775
48871 4920775 4962039 5004162 5045796 5087162 5129990 5175520 5223367 5272608 5323182 5375656 5430217
48860 5430217 5486599 5544647 5604322 5665254 5726887 5789119 5852550 5918065 5986368 6057821 6132412
48849 6132412 6209787 6289225 6369577 6449492 6528112 6605545 6682319 6758438 6833497 6907603 6981353
48838 6981353 7054583 7125919 7194120 7259213 7321689 7381168 7436818 7488809 7538247 7585351 7628304
48827 7628304 7664405 7692244 7712684 7727867 7739422 7747499 7751389 7750712 7745768 7736917 7724128 7707171
48815 7707171 7685771 7659509 7628160 7592210 7552362 7508451 7459784 7406899 7351858 7296001 7238379
48804 7238379 7177453 7113426 7047481 6979336 6907433 6831672 6754428 6678294 6603900 6530448 6457247
48793 6457247 6383987 6310329 6236293 6162912 6091920 6024774 5962024 5903347 5848034 5795779 5747064
48782 5747064 5702497 5661980 5625156 5592508 5565040 5542705 5524158 5508571 5496800 5490033 5487993 5489240
48770 5489240 5492676 5497883 5504542 5512717 5523635 5539031 5559263 5582753 5607619 5633298 5660164 5688174
48758 5688174 5716709 5745564 5775243 5805914 5836686 5866606 5896148 5926864 5959307 5992059 6023307
48747 6023307 6052843 6081816 6110998 6140271 6169571 6199114 6228456 6256550 6283448 6311085 6341492
48736 6341492 6374593 6408483 6441549 6473637 6505494 6537859 6571036 6604650 6637864 6670479 6703832
48725 6703832 6739835 6778754 6818350 6855488 6888406 6917559 6944931 6972785 7002419 7033299 7063404
48714 7063404 7090807 7114975 7136263 7154306 7167531 7174408 7174649 7168714 7156542 7137559 7111967 7081103
48702 7081103 7045928 7005644 6958644 6904699 6845488 6782927 6717780 6650294 6581379 6512358 6443718
48691 6443718 6374876 6305214 6234822 6164110 6093236 6022323 5951968 5883161 5816823 5753783 5695131
48680 5695131 5641997 5594633 5551998 5512728 5476545 5444480 5417748 5396831 5381622 5371894 5367298 5367268
48668 5367268 5371259 5378828 5389302 5401776 5415867 5432053 5450794 5471734 5494384 5519141 5546662 5576369
48656 5576369 5606550 5636141 5665578 5695642 5726309 5757052 5787452 5816901 5844305 5868813 5890653
48645 5890653 5910816 5930152 5949053 5967648 5985944 6003946 6021811 6039579 6056821 6073350 6090374
48634 6090374 6109944 6132461 6155597 6176699 6195815 6215367 6237295 6261757 6288557 6318394 6352055
48623 6352055 6389231 6428905 6470593 6514691 6561797 6612096 6665352 6721359 6780455 6843700 6912406
48612 6912406 6987343 7068266 7154050 7243265 7334976 7429314 7527035 7628200 7731490 7835155 7938328
48601 7938328 8040950 8142739 8243031 8341467 8437832 8530778 8617389 8694615 8760873 8815903 8859385
48590 8859385 8890232 8907066 8908838 8894787 8864149 8816324 8751532 8671218 8577541 8472397 8357197
48579 8357197 8233530 8103295 7967615 7826177 7678738 7527277 7375552 7226073 7078395
48570 7078395 6931044 6784446 6641083 6503130 6371005 6244223 6122658 6006469 5895433
48561 5895433 5789164 5687934 5592728 5504177 5421594 5343354 5268348 5196845 5129793 5067479 5009193
48550 5009193 4954082 4901663 4851464 4802964 4756446 4713175 4673815 4636968 4600313 4563141 4526600
48539 4526600 4491352 4456380 4420824 4385692 4352382 4320274 4287362 4253103 4219183 4187317 4157683
48528 4157683 4129813 4103593 4078517 4053204 4026876 4000612 3975972 3952800 3929500 3905246 3880783
48517 3880783 3857186 3834942 3814420 3796095 3779794 3764408 3748973 3733736 3719924 3708739 3700576
48506 3700576 3694675 3689419 3683520 3677210 3672026 3669338 3669377 3671518 3674875 3678560 3681949 3684991 3687934 3690781
48492 3690781 3693459 3696427 3700520 3706258 3713937 3724078 3736865 3751280 3766056 3781547 3799323 3819536
48480 3819536 3840127 3859381 3878004 3897802 3919408 3942286 3965846 3989270 4011220 4031103 4050026
48469 4050026 4069221 4088187 4105770 4122392 4139615 4157858 4176145 4193977 4211744 4229332 4245976
48458 4245976 4261768 4277785 4294411 4310993 4327553 4345308 4364775 4384902 4404917 4425727 4448414
48447 4448414 4472514 4497076 4522496 4549900 4579217 4609329 4639973 4672287 4707409 4745461 4786036
48436 4786036 4828875 4873914 4921319 4971648 5025456 5082702 5143146 5207364 5276673 5351695 5431606
48425 5431606 5515298 5602763 5694643 5790693 5889666 5990936 6095318 6203491 6314082 6424207
48415 6424207 6531841 6636740 6738982 6837744 6932014 7021464 7105623 7182782 7250772 7308443 7355515
48404 7355515 7391393 7415361 7427827 7430159 7423142 7406630 7381057 7348233 7310259 7268376 7223254 7175595
48392 7175595 7125895 7074084 7019782 6962487 6901551 6836703 6768781 6699036 6627360 6551960 6471146
48381 6471146 6384664 6292994 6196427 6095504 5991437 5885232 5777077 5667358 5557578 5449276
48371 5449276 5342607 5237016 5133053 5032548 4937128 4847371 4763388 4685414 4613668 4548090
48361 4548090 4488285 4433501 4382899 4336181 4293739 4255865 4222256 4192605 4167138 4145875 4127786
48350 4127786 4111452 4096405 4083252 4072660 4064810 4059559 4056424 4054584 4053579 4054002 4056936 4062766 4070968
48337 4070968 4080850 4091932 4103778 4116150 4129267 4143368 4158161 4173404 4189938 4209387 4232541
48326 4232541 4258535 4285683 4312727 4339236 4365291 4390949 4415805 4439087 4460516 4480922 4501529
48315 4501529 4522578 4543027 4561620 4578048 4593177 4608384 4624418 4640641 4655582 4668540 4680261
48304 4680261 4691764 4703159 4714185 4725241 4736796 4748207 4758304 4767176 4776321 4786841 4798395 4810105
48292 4810105 4821575 4832747 4843626 4854640 4866524 4879383 4892383 4904918 4917736 4932560 4950772
48281 4950772 4972470 4996301 5020087 5042251 5063008 5083894 5105998 5129172 5153045 5178026 5204778
48270 5204778 5233153 5262267 5291497 5320978 5351112 5381746 5411905 5440488 5467368 5493613 5520288
48259 5520288 5547325 5573966 5599916 5625352 5650106 5673791 5696584 5718819 5739741 5757840 5772797
48248 5772797 5785974 5798471 5809751 5818896 5826164 5832353 5837378 5840534 5841717 5841518 5840523 5839414 5839351 5841293
48234 5841293 5844962 5849140 5852796 5855538 5857573 5860127 5865458 5875305 5889387 5906229 5925251 5947056 5971930
48221 5971930 5999476 6030002 6064994 6105449 6150549 6198551 6248393 6299893 6353065 6407962 6464682
48210 6464682 6522661 6580030 6634298 6683849 6728548 6768998 6805296 6836219 6859272 6871769 6872300 6861114
48198 6861114 6838966 6805926 6761683 6706661 6642150 6569329 6488869 6401859 6310505 6217131 6122357
48187 6122357 6024887 5923558 5819396 5715138 5612803 5512293 5412644 5313836 5216609 5120987
48177 5120987 5026258 4932745 4842484 4757349 4677044 4599713 4524134 4450475 4379101 4309598 4241206
48166 4241206 4173501 4106358 4039768 3973964 3909258 3845531 3782272 3719344 3657125 3595660 3534368
48155 3534368 3473222 3413571 3356819 3302529 3248778 3194419 3140060 3086603 3033764 2980737 2927719
48144 2927719 2875978 2826460 2778854 2732031 2685050 2637808 2591023 2545739 2502686 2462027 2423661
48133 2423661 2387578 2353786 2322023 2291719 2262305 2233665 2206380 2181351 2158735 2137375 2115771
48122 2115771 2093816 2073037 2054892 2039390 2025749 2013675 2003192 1993669 1984179 1974917 1967216 1961810
48110 1961810 1957907 1954617 1952603 1953320 1956794 1961079 1964219 1966197 1968599 1972872 1979448 1988167 1998670 2010196
48096 2010196 2021673 2032415 2042408 2051755 2060479 2069339 2080088 2093954 2110164 2126881 2143320 2159900
48084 2159900 2176562 2192539 2208063 2224679 2242981 2261484 2278887 2296200 2315032 2334713 2353170
48073 2353170 2370375 2388740 2409609 2431121 2450474 2467198 2483201 2500420 2519410 2539734 2560697
48062 2560697 2581665 2602253 2622424 2642332 2662128 2681880 2701468 2720680 2739795 2759857 2781665
48051 2781665 2804404 2825979 2845119 2862748 2881024 2901395 2923729 2946918 2970026 2993044 3016638
48040 3016638 3041114 3066067 3091472 3118602 3148846 3181792 3215614 3249490 3284459 3321511 3360067
48029 3360067 3399117 3438833 3480069 3522930 3566829 3611474 3656868 3702571 3747881 3792703 3837592
48018 3837592 3882901 3928261 3972744 4015202 4054839 4091967 4127832 4163047 4196499 4226585 4253460
48007 4253460 4279204 4305391 4331057 4353607 4371645 4386509 4400713 4415106 4428132 4438024 4444923 4450044
47995 4450044 4453488 4454297 4452616 4450237 4448519 4447126 4445428 4443788 4442391 4440104 4435879 4430422 4425059 4419734
47981 4419734 4413732 4407792 4403503 4400587 4396674 4390449 4383698 4379468 4378745 4378917 4374391 4358611 4327119 4279880
47967 4279880 4220411 4152509 4078618 4001139 3923246 3846967 3771497 3694991 3617759 3542416 3471071
47956 3471071 3403535 3338380 3274501 3211242 3148079 3085076 3023245 2963704 2906575 2851139 2796879
47945 2796879 2743877 2692425 2642926 2596232 2553252 2513871 2476875 2441411 2407908 2376906 2347682
47934 2347682 2319083 2291335 2265599 2241767 2218179 2194061 2170923 2150734 2133751 2119041 2106054
47923 2106054 2094487 2083371 2071730 2059843 2048683 2038334 2028010 2017405 2006900 1996635 1986502
47912 1986502 1976873 1967985 1958571 1946482 1931203 1914830 1900184 1888709 1880225 1873617 1867255 1859695 1850557
47899 1850557 1840358 1829418 1817794 1806254 1796099 1787544 1779316 1770367 1761063 1752104 1743316 1734217 1724942
47886 1724942 1715816 1706658 1697239 1687707 1678011 1667728 1657250 1648189 1641510 1636003 1629858 1623219 1617940
47873 1617940 1615193 1614657 1615841 1618584 1622015 1624472 1625199 1625238 1626052 1627942 1630450 1633546 1637554 1642242 1646812
47858 1646812 1650778 1654266 1657347 1659583 1660531 1660377 1659712 1658753 1657138 1654549 1651176 1647230 1642361 1636058 1628559
47843 1628559 1620760 1613119 1605117 1596054 1585868 1574938 1563574 1552219 1541800 1533255 1526747 1521625 1517185
47830 1517185 1513257 1510199 1508394 1507572 1506661 1504921 1503438 1504752 1510301 1518691 1527339 1535446 1544305 1554711
47816 1554711 1565379 1574636 1582932 1592624 1605253 1619758 1633655 1645643 1656660 1668490 1681726 1695274
47804 1695274 1707528 1717672 1725882 1732712 1738391 1742466 1744028 1742576 1738574 1732809 1725180 1714734 1701101
47791 1701101 1685262 1668453 1650894 1632116 1612151 1591626 1570805 1549245 1526487 1502663 1478439
47780 1478439 1454710 1432314 1411654 1392525 1374548 1357699 1342210 1328110 1315226 1303468 1292797
47769 1292797 1283082 1274324 1266853 1260900 1256204 1252562 1250624 1251465 1255294 1261052 1267363 1273381 1278590 1282406
47755 1282406 1284349 1284455 1283263 1281471 1279644 1278080 1276926 1276520 1277331 1279195 1280716 1280035 1276390 1270607 1264061
47740 1264061 1257553 1251281 1245362 1239964 1235177 1231110 1228080 1226509 1226594 1227993 1229811 1231142 1231959 1233403 1236762
47725 1236762 1242120 1248389 1254766 1261712 1270308 1281025 1293479 1307256 1322649 1340477 1361148 1383908
47713 1383908 1407222 1430119 1453016 1476914 1502040 1527809 1553898 1580507 1607397 1633490 1657960
47702 1657960 1681213 1704301 1727773 1751429 1774670 1796548 1816033 1833025 1848752 1864293 1878930
47691 1878930 1890857 1899484 1906045 1911790 1916565 1919544 1920403 1919167 1915749 1910451 1904327 1898160 1891579 1884096
47677 1884096 1876486 1869911 1863960 1857079 1849267 1842854 1839805 1839361 1839359 1839134 1840029 1843526 1849963 1858878 1869606
47662 1869606 1881623 1895118 1911162 1930392 1951533 1972050 1990355 2006724 2022132 2037141 2051921
$$ [...]
##END NTUPLES=NMR SPECTRUM
##END=
