
##TITLE=AC1152_Cauca-timbio_5874778_GOnV9PsAyT
##JCAMPDX= 6.0         $$ Bruker NMR JCAMP-DX V2.0
##DATA TYPE= NMR SPECTRUM
##DATA CLASS= NTUPLES
##ORIGIN= BRUKER
##OWNER= Administrator
$$ 1.72 TOPSPIN		Version 2.1
$$ 2012-03-31 19:05:41.078 -0500  Administrator@TOPSPIN
$$ Compression mode = diff/dup
##.OBSERVE FREQUENCY= 400.13188235
##.OBSERVE NUCLEUS= ^1H
##.ACQUISITION MODE= SIMULTANEOUS (DQD)
##.ACQUISITION SCHEME= undefined
##.AVERAGES= 64
##.DIGITISER RES= 22
##SPECTROMETER/DATA SYSTEM= spect
##.PULSE SEQUENCE= noesygpps1d.comp
##.SOLVENT NAME= COFFEE_meoh
##.SHIFT REFERENCE= INTERNAL, COFFEE_meoh, 1, 14.96851
##AUDIT TRAIL= $$ (NUMBER, WHEN, WHO, WHERE, PROCESS, VERSION, WHAT)
$$ ##TITLE= Audit trail, TOPSPIN		Version 2.1
$$ ##JCAMPDX= 5.01
$$ ##ORIGIN= Bruker BioSpin GmbH
$$ ##OWNER= Administrator
$$ $$ C:\Bruker\TOPSPIN/data/COFFEE/nmr/AC1152_Cauca-timbio_5874778_GOnV9PsAyT/12/pdata/1/auditp.txt
$$ ##AUDIT TRAIL=  $$ (NUMBER, WHEN, WHO, WHERE, PROCESS, VERSION, WHAT)
(   1,<2012-03-31 19:05:35.687 -0500>,<Administrator>,<TOPSPIN>,<go>,<TOPSPIN 2.1>,
      <created by zg
	started at 2012-03-31 18:54:03.984 -0500,
	POWCHK enabled, PULCHK disabled,
       configuration hash MD5:
       1A 1E CE 29 27 FD 77 03 67 4E F0 E3 C4 B2 CB 90
       data hash MD5: 64K
       60 46 11 68 15 9F C7 1A 7B EF 75 FA 44 E2 94 70>)
(   2,<2012-03-31 19:05:38.828 -0500>,<Administrator>,<TOPSPIN>,<proc1d>,<TOPSPIN 2.1>,
      <Start of raw data processing
       efp LB = 0.3 FT_mod = 6 PKNL = 1 PHC0 = 0 PHC1 = 0 SI = 128K 
       data hash MD5: 128K
       F4 B2 4B 8B 75 C0 07 84 0C 35 4F 94 ED 18 31 FF>)
(   3,<2012-03-31 19:05:40.156 -0500>,<Administrator>,<TOPSPIN>,<proc1d>,<TOPSPIN 2.1>,
      <pk PHC0 = 39.49585 PHC1 = 0 
       data hash MD5: 128K
       8A 38 ED 78 A1 10 AE FB 76 56 7A 77 DB 5C A0 0F>)
(   4,<2012-03-31 19:05:40.718 -0500>,<Administrator>,<TOPSPIN>,<proc1d>,<TOPSPIN 2.1>,
      <abs ABSG = 1 
       data hash MD5: 128K
       E6 28 4D 0A 57 FA 3E B5 E4 0B 4E 5A 66 5D 21 6C>)
(   5,<2012-03-31 19:05:40.796 -0500>,<Administrator>,<TOPSPIN>,<proc1d>,<TOPSPIN 2.1>,
      <abs ABSG = 2 
       data hash MD5: 128K
       42 A8 84 3F 88 3C 50 01 38 BD D6 9B 42 48 2A 47>)
(   6,<2012-03-31 19:05:40.859 -0500>,<Administrator>,<TOPSPIN>,<proc1d>,<TOPSPIN 2.1>,
      <abs ABSG = 3 
       data hash MD5: 128K
       D7 5B 62 0D E7 46 20 A7 29 74 9C 2A D4 9A 95 99>)
(   7,<2012-03-31 19:05:40.921 -0500>,<Administrator>,<TOPSPIN>,<proc1d>,<TOPSPIN 2.1>,
      <abs ABSG = 4 
       data hash MD5: 128K
       51 53 32 1C 89 F6 47 DF FE 37 4F 88 65 4B C2 A8>)
(   8,<2012-03-31 19:05:40.984 -0500>,<Administrator>,<TOPSPIN>,<proc1d>,<TOPSPIN 2.1>,
      <abs ABSG = 5 
       data hash MD5: 128K
       32 9B A4 CF 80 D8 7B A7 8B 2A 42 06 A4 8F DE DF>)
$$ ##END=
$$ 
$$ $$ hash MD5
$$ $$ 28 9F 31 B6 5B 53 8E 6F 9B 08 DE E0 A7 D3 BB 1E
##$RELAX= 
##$RELAX= 
##$RELAX= 
##$RELAX= 
##$RELAX= 
##$RELAX= 
##$RELAX= 
##$RELAX= 
$$ Bruker specific parameters
$$ [...]
##$TP07= 0
##$TPNAME0= <>
##$TPNAME1= <>
##$TPNAME2= <>
##$TPNAME3= <>
##$TPNAME4= <>
##$TPNAME5= <>
##$TPNAME6= <>
##$TPNAME7= <>
##$TPOAL= (0..7)
0.5 0.5 0.5 0.5 0.5 0.5 0.5 0.5
##$TPOFFS= (0..7)
0 0 0 0 0 0 0 0
##$TUNHIN= 0
##$TUNHOUT= 0
##$TUNXOUT= 0
##$USERA1= <user>
##$USERA2= <user>
##$USERA3= <user>
##$USERA4= <user>
##$USERA5= <user>
##$V9= 5
##$VALIST= <valist>
##$VCLIST= <CCCCCCCCCCCCCCC>
##$VD= 0
##$VDLIST= <DDDDDDDDDDDDDDD>
##$VPLIST= <PPPPPPPPPPPPPPP>
##$VTLIST= <TTTTTTTTTTTTTTT>
##$WBST= 2048
##$WBSW= 25
##$XGAIN= (0..3)
0 0 0 0
##$XL= 0
##$YL= 0
##$YMAX_a= 13558445
##$YMIN_a= -6566345
##$ZGOPTNS= <>
##$ZL1= 120
##$ZL2= 120
##$ZL3= 120
##$ZL4= 120
##$ABSF1= 14.96851
##$ABSF2= -5.584021
##$ABSG= 5
##$ABSL= 3
##$ALPHA= 0
##$AQORDER= 0
##$ASSFAC= 0
##$ASSFACI= 0
##$ASSFACX= 0
##$ASSWID= 0
##$AUNMP= <proc_prof1d_extract.lims>
##$AXLEFT= 0
##$AXNAME= <>
##$AXNUC= <1H>
##$AXRIGHT= 0
##$AXTYPE= 0
##$AXUNIT= <>
##$AZFE= 0.1
##$AZFW= 0.1
##$BCFW= 0
##$BC_mod= 0
##$BYTORDP= 0
##$COROFFS= 0
##$CY= 15
##$DATMOD= 1
##$DC= 0
##$DFILT= <>
##$DTYPP= 0
##$F1P= 0
##$F2P= 0
##$FCOR= 0.5
##$FTSIZE= 131072
##$FT_mod= 6
##$GAMMA= 0
##$GB= 0
##$INTBC= 1
##$INTSCL= 1
##$ISEN= 128
##$LB= 0.3
##$LEV0= 0
##$LPBIN= 0
##$MAXI= 10000
##$MC2= 0
##$MEAN= 0
##$ME_mod= 0
##$MI= 0
##$NCOEF= 0
##$NC_proc= -3
##$NLEV= 6
##$NOISF1= 0
##$NOISF2= 0
##$NSP= 0
##$NTH_PI= 0
##$NZP= 0
##$OFFSET= 14.96851
##$PC= 1
##$PHC0= 39.49585
##$PHC1= 0
##$PH_mod= 1
##$PKNL= yes
##$PPARMOD= 0
##$PPDIAG= 0
##$PPIPTYP= 0
##$PPMPNUM= 2147483647
##$PPRESOL= 1
##$PSCAL= 4
##$PSIGN= 0
##$PYNMP= <proc.py>
##$REVERSE= no
##$SF= 400.130004840547
##$SI= 131072
##$SIGF1= 0
##$SIGF2= 0
##$SINO= 400
##$SIOLD= 131072
##$SPECTYP= <>
##$SREGLST= <1H.CDCl3>
##$SSB= 0
##$STSI= 131072
##$STSR= 0
##$SW_p= 8223.68421052632
##$SYMM= 0
##$S_DEV= 0
##$TDeff= 65536
##$TDoff= 0
##$TI= <>
##$TILT= no
##$TM1= 0
##$TM2= 0
##$TOPLEV= 0
##$USERP1= <user>
##$USERP2= <user>
##$USERP3= <user>
##$USERP4= <user>
##$USERP5= <user>
##$WDW= 1
##$XDIM= 131072
##$YMAX_p= 508495463
##$YMIN_p= -477787842
##$CURPLOT= <Network HP LaserJet P1505>
##$CURPRIN= <$Network HP LaserJet P1505>
##$DFORMAT= <normdp>
##$LAYOUT= <+/1D_H.xwp>
##$LFORMAT= <normlp>
##$PFORMAT= <normpl>
##$SURQMSG= 1
$$ End of Bruker specific parameters
$$ ---------------------------------
##NTUPLES= NMR SPECTRUM
##VAR_NAME=  FREQUENCY,     SPECTRUM/REAL,   SPECTRUM/IMAG
##SYMBOL=    X,             R,               I
##VAR_TYPE=  INDEPENDENT,   DEPENDENT,       DEPENDENT
##VAR_FORM=  AFFN,          ASDF,            ASDF
##VAR_DIM=   131072,        131072,          131072
##UNITS=     HZ,            ARBITRARY UNITS, ARBITRARY UNITS
##FACTOR=    0.0627417313425165, 1,          1
##FIRST=     8223.62146879498, 3452,         -95506
##LAST=      0,             8427,            -95571
##MIN=       0,             -477787842,      0
##MAX=       8223.62146879498, 508495463,    0
$$ Real data points
##PAGE= N=1
##DATA TABLE= (X++(R..R)), XYDATA
$$ [...]
63924 2568557 2689501 2819830 2959351 3107572 3264636 3431127 3607683 3795201 3994969
63915 3994969 4208442 4437478 4684892 4953954 5246991 5565367 5911418 6289755 6706108
63906 6706108 7165740 7673960 8237685 8865258 9564478 10341449 11201495 12150582 13195288
63897 13195288 14341051 15589835 16938646 18379523 19900480 21486543 23120755 24785178
63889 24785178 26460770 28125074 29749513 31299647 32738801 34031657 35145811 36053351
63881 36053351 36733917 37176377 37376217 37331121 37039722 36503957 35731386 34735884 33538447
63872 33538447 32168219 30660977 29054223 27382471 25675974 23961942 22265362 20608699
63864 20608699 19011427 17489691 16055864 14718432 13482544 12350429 11321130 10390402
63856 10390402 9551784 8798204 8122706 7518180 6977130 6492056 6056064 5663183 5308305
63847 5308305 4986959 4695316 4430462 4190275 3972471 3773734 3590359 3419900 3261663
63838 3261663 3115297 2979505 2852602 2733730 2622623 2518340 2419036 2323121 2230054 2139818
63828 2139818 2052219 1967048 1884495 1805019 1728969 1656531 1587759 1522372 1459789 1399773 1342867
63817 1342867 1289843 1240802 1195187 1152472 1112311 1074123 1037243 1001705 968223 937037 907504
63806 907504 879376 853790 831987 813409 796224 779680 764767 752345 741856 732490 724460 718192
63794 718192 713185 708873 705989 705696 707590 709824 711175 711790 711902 711233 710053 709370 709163 707431 702067 693079
63778 693079 682029 669825 656121 640575 623542 605421 586173 565807 544792 523889 503972
63767 503972 485995 470522 457136 444792 432894 421605 411035 400733 390303 380015 370352 361260
63755 361260 352333 343604 335662 328932 323172 317796 312440 307071 301762 296600 291750 287345 283322 279572
63741 279572 276336 274079 272726 271285 268762 265356 262274 260250 258813 257211 255445 253946 252720 251543
63727 251543 250752 250990 252079 252798 252064 249883 246929 243644 240177 236839 234066 231861 229666 226935 223722
63712 223722 220539 217662 214788 211589 208455 206263 205214 204352 202715 200616 199183 198770 198632 198285 198349 199575
63696 199575 201595 203242 203765 203286 202338 201577 201767 203339 205815 208049 209220 209476 209720 210908 213349 216279
63680 216279 218336 218893 218866 219830 222478 226319 230557 234521 237478 239156 240766 244456 251003 258718 265330
63665 265330 270437 275294 280686 286020 290317 293108 294283 294049 293298 293219 294057 294830 294726 294344 295086 297645
63649 297645 301412 305043 307243 307378 305829 303635 301379 298577 294440 288994 283135 277704 272947 268733
63635 268733 264803 260857 256817 253092 250306 248724 248171 248450 249423 250577 250929 249782 247634 246176 247152
63620 247152 250924 256058 260502 263388 265568 268362 272167 276454 280637 284433 287677 290380 292894 295520
63606 295520 298046 300108 301757 303038 303293 301766 298827 295630 292454 288492 283666 279491 277338 276705 276190
63591 276190 275549 275685 276909 278270 278671 277879 276498 275618 276378 279116 282981 287098 292030 299180 308654 318710
63575 318710 327662 335499 343232 351531 360654 370977 382609 394929 407516 421533 439218 461601
63563 461601 487187 513206 537901 561440 585012 609632 635875 664255 695253 728830 764220
63552 764220 800440 836750 872222 905095 933242 955474 971972 983252 989265 989931 986120 979511
63540 979511 971510 962672 953120 943130 933188 923525 913615 902222 888380 872465 855748 838456 818912
63527 818912 795535 769593 744976 724797 708752 694081 678573 662214 646494 632899 622044
63516 622044 613557 606419 599656 593081 587544 584343 584163 586366 589430 592314 595434 600184 607557 617513
63502 617513 629618 643839 660540 680053 702569 728164 756520 786721 817723 849105 881155
63491 881155 914144 947620 980385 1010943 1037835 1059710 1075490 1084819 1088462 1088006 1084904 1079888 1073394
63478 1073394 1066194 1059047 1051830 1043553 1033337 1020880 1005945 988068 967128 943568 917602 888672
63466 888672 856274 821024 784484 748311 713951 682504 654089 627602 601882 576878 553086
63455 553086 530408 508728 489197 473477 461464 451091 440814 431139 423191 416982 411905 407847
63443 407847 404778 402074 399375 397479 397188 397788 397964 397949 399353 402766 406909 410623 414465 419558 425693
63428 425693 431573 436629 441667 447613 454212 460311 465133 468889 472065 474555 475940 476431 476857 477496 477467
63413 477467 475647 471748 466245 459921 453943 449547 446772 444168 440784 437869 437275 438551 439312 438631 438337
63398 438337 440282 443819 447050 449427 451838 454873 458422 462696 468339 475339 482774 489906 496987 504813
63384 504813 513992 524890 537854 553133 570612 589780 610079 631456 654552 680204 708654 739424
63372 739424 771818 805263 839279 873776 909528 947672 988352 1030307 1072117 1113490 1155032
63361 1155032 1197316 1240479 1284052 1326476 1365089 1397203 1421092 1435965 1441813 1439876 1432469 1421405
63349 1421405 1407025 1389546 1370574 1351879 1333005 1311648 1286641 1259188 1230633 1200419 1167296
63338 1167296 1131746 1095911 1061283 1027384 992890 957554 922820 890863 863127 839537 818932
63327 818932 800226 783164 768146 755681 746206 740191 737936 739049 742415 747238 754267 765487 781931
63314 781931 801994 822676 842622 863213 886480 912926 942073 974164 1009935 1049000 1089689
63303 1089689 1130648 1171672 1212785 1253484 1293237 1331773 1368191 1400226 1425127 1441194 1448298
63292 1448298 1447313 1439511 1426348 1409380 1390095 1369709 1348995 1328322 1307906 1287782 1267284 1244927
63280 1244927 1219394 1190682 1159849 1127701 1094166 1058956 1022347 985245 948895 914495 882631
63269 882631 853049 825304 799514 776012 754521 734380 715426 697890 681577 666126 652132
63258 652132 640840 632345 625126 617969 611532 607290 605580 605388 605521 605337 604708 603836 602868 601393 598775
63243 598775 595249 591928 589182 585802 580574 574158 568484 564611 561980 559523 556734 553770 551234 549835
63229 549835 549778 550604 551943 553993 556742 559269 560650 561209 561963 563075 563822 563932 563975 564420 565338 567182 570752
63212 570752 575850 580832 584187 586133 588103 591120 595246 600322 606503 613901 622142 630617 639100 647795
63198 647795 656643 664916 672075 678958 687394 698339 710992 724150 737698 752135 767450 783502
63186 783502 800957 820497 841226 861332 880621 901250 925471 953547 984335 1016980 1051519
63175 1051519 1088661 1129580 1175076 1224179 1274273 1323435 1372097 1421611 1471834 1521292 1569322
63164 1569322 1616606 1663352 1708206 1749723 1788250 1825572 1862882 1899628 1934377 1966404 1996167
63153 1996167 2024217 2049821 2070879 2085324 2092349 2091955 2083588 2065972 2038622 2003055 1961885 1916837
63141 1916837 1868124 1815843 1761273 1706346 1652319 1599707 1549321 1502426 1459695 1421021 1386893
63130 1386893 1358989 1338258 1322962 1310092 1298818 1291299 1289679 1293429 1300327 1309017 1319543 1332024
63118 1332024 1346016 1361173 1377581 1395249 1413774 1432496 1450520 1466836 1481267 1495297 1511004
63107 1511004 1528679 1546117 1560720 1571741 1579830 1584878 1585340 1579901 1569081 1554740 1538265 1519642
63095 1519642 1498221 1474061 1448407 1422872 1398148 1373502 1347726 1320699 1293925 1269319 1247526
63084 1247526 1227695 1208913 1191519 1176732 1165139 1155790 1146798 1136858 1126334 1116972 1110340 1106406
63072 1106406 1103934 1102476 1103504 1108844 1118004 1127856 1135409 1140481 1145175 1151096 1157808 1164046 1169592 1175362
63058 1175362 1182030 1189402 1197213 1205676 1214667 1222938 1229095 1233360 1237534 1243061 1249809 1256945 1264093 1271037
63044 1271037 1277167 1282208 1287103 1293148 1300482 1308347 1316600 1325733 1335273 1343399 1348804 1352167 1355210 1358871
63030 1358871 1362910 1366713 1369857 1372369 1375038 1379176 1385548 1393786 1403141 1413398 1424701 1437143 1451185
63017 1451185 1467843 1487519 1508968 1530420 1551701 1574321 1599501 1627161 1657075 1689913 1726380
63006 1726380 1766047 1807918 1851769 1898043 1946625 1996675 2047928 2101441 2158606 2219932 2285266
62995 2285266 2354781 2428941 2507672 2590336 2676667 2766862 2860363 2955380 3050412 3145694 3242154
62984 3242154 3339208 3434688 3526988 3616240 3703156 3787829 3870326 3951527 4032412 4112930 4192314
62973 4192314 4270088 4345976 4419002 4487363 4548997 4601577 4642199 4668033 4677582 4670724 4647285 4606129
62961 4606129 4546043 4467421 4372897 4266351 4151263 4029915 3904287 3777502 3653714 3536098
62951 3536098 3425458 3321451 3224777 3137345 3060488 2993968 2936811 2888246 2847554 2813845 2786567
62940 2786567 2765803 2751629 2743489 2740533 2742214 2748247 2758206 2771366 2786615 2802309 2816736 2829275
62928 2829275 2840879 2852891 2865329 2876572 2884609 2888237 2887090 2880931 2869207 2851204 2826361 2794298
62916 2794298 2754686 2707447 2653191 2593206 2528712 2460401 2389087 2316530 2244941 2175549 2108252
62905 2108252 2042828 1979890 1920309 1864287 1811598 1762355 1716829 1674584 1634578 1596397 1560963
62894 1560963 1529620 1502698 1479297 1458344 1439478 1422732 1407648 1393180 1378517 1363703 1349185
62883 1349185 1335002 1320801 1306511 1292474 1278760 1264862 1250434 1235992 1222356 1209490 1196519
62872 1196519 1183075 1170089 1158703 1148649 1138375 1126898 1114979 1104138 1095122 1087869 1082385 1078582
62860 1078582 1075352 1071012 1065177 1059349 1055174 1052897 1052111 1053016 1055830 1059526 1062461 1064074 1064806 1064542 1062482
62845 1062482 1058740 1054779 1051798 1049870 1049264 1051338 1056915 1064441 1070970 1074861 1076704 1077780 1078500 1078491 1077496
62830 1077496 1075726 1073444 1070397 1065792 1059153 1051263 1043838 1037996 1033394 1029176 1025298 1022373 1020499 1018937
62816 1018937 1017051 1015026 1013385 1012047 1010220 1007362 1004076 1001598 1000091 997867 992998 985630 977984 971967
62802 971967 967589 963891 960362 956690 951941 945154 936624 927828 920066 913588 907864 902275 896766 892203
62788 892203 889754 889483 889978 889874 889232 888826 888704 888434 888305 889078 890657 892174 893457 895314 898149 901429
62772 901429 904970 909684 916239 923681 930223 935196 939566 944608 950455 955987 959993 962531 965138 969536
62758 969536 976203 984373 993076 1001625 1009396 1016078 1022378 1029711 1038821 1049291 1060663 1073353 1087969
62745 1087969 1104297 1121576 1139512 1158465 1178749 1200226 1222747 1246847 1273743 1304231 1337377
62734 1337377 1370843 1403225 1435840 1471551 1512107 1557575 1607984 1663877 1724818 1788988 1855402
62723 1855402 1925571 2001794 2084541 2172747 2266205 2366319 2474484 2590836 2714788 2845838
62713 2845838 2983348 3125946 3271606 3418304 3564459 3708560 3848202 3979730 4099362
62704 4099362 4204477 4292885 4360993 4404298 4420510 4410994 4378202 4322911 4245273 4147393 4032887
62693 4032887 3904473 3763940 3614223 3459448 3302649 3145260 2989181 2837412 2691854
62684 2691854 2552190 2418110 2291352 2174305 2067478 1969442 1878559 1793882 1715141 1642777
62674 1642777 1577367 1518262 1463596 1412464 1366110 1325824 1290542 1257905 1227061 1198916 1174027
62663 1174027 1151823 1131782 1113928 1098115 1084249 1073346 1066862 1064490 1063900 1063276 1063050 1064657 1068769
62650 1068769 1075447 1084775 1096253 1108351 1119914 1131705 1145702 1163255 1184758 1210583 1241112 1275891
62638 1275891 1313745 1353980 1396805 1442505 1490969 1542169 1596390 1653570 1712865 1773217 1833894
62627 1833894 1894138 1952593 2007536 2057570 2101782 2139289 2168887 2189105 2198399 2195432 2179567 2151419
62615 2151419 2112902 2066452 2013917 1956129 1893576 1827374 1759335 1691086 1623408 1556549 1490861
62604 1490861 1426968 1365743 1308415 1256290 1209629 1166873 1125659 1084876 1045423 1008899 976050
62593 976050 946586 919924 895616 873350 852953 834296 816981 800419 784501 769912 757376
62582 757376 746721 737057 727642 718151 708367 698312 688685 680365 673119 665472 656475 647178 639646 634580
62568 634580 630670 626493 622344 619624 618781 618652 618033 617283 617824 620271 623671 626751 629441 632772 637596
62553 637596 643923 651500 660424 670899 682722 695543 709622 725933 745312 767583 791627 816264
62541 816264 841074 866663 894395 925809 961906 1002726 1047638 1096275 1149220 1207599 1271839
62530 1271839 1340849 1412563 1485391 1559082 1634111 1710304 1786198 1859728 1929138 1992822 2048486
62519 2048486 2093330 2125686 2146051 2155726 2154416 2140031 2111249 2069753 2019450 1963855 1904605 1841922
62507 1841922 1775585 1705583 1632878 1560036 1490544 1426872 1369168 1315939 1265792 1218347 1173897
62496 1173897 1132603 1094058 1057489 1022380 988947 957856 929453 903430 879188 856323 834716
62485 834716 814453 795710 778432 762106 746271 731399 718750 709029 701634 695582 690658 687039
62473 687039 684220 681309 678355 676466 676253 677002 677906 679458 682746 687719 693299 699402 707783 720025 735208
62458 735208 750588 764633 778579 794719 813922 835335 857828 880969 904919 930292 958144
62447 958144 989326 1023660 1060079 1097368 1134227 1169033 1200661 1229487 1256330 1280122 1297976
62436 1297976 1308098 1311300 1308782 1300021 1284401 1263724 1240964 1216865 1189821 1159188 1126827 1094929
62424 1094929 1064108 1034411 1006623 981404 958276 936670 917176 900659 886751 874343 863123
62413 863123 853570 845778 839376 834503 831808 831417 832715 835265 839206 844525 850622 856906 863403 870539
62399 870539 878666 888003 898765 910977 924210 937657 950631 963056 975430 988095 1000694 1012685
62387 1012685 1024306 1036318 1048577 1059547 1067643 1072545 1074713 1074284 1071124 1065391 1057156 1045903 1031332
62374 1031332 1014360 996315 977317 956558 934101 911156 888447 865615 842800 821618 803753
62363 803753 789386 777788 768606 761658 756127 751244 747579 746567 748653 752710 757402 762344 767741 773667
62349 773667 780121 787287 795349 804368 814603 826579 840438 855455 870537 884960 898268 909745
62337 909745 918658 925165 930444 935516 940074 942773 942605 939832 935646 931136 926658 922130 917824 914719
62323 914719 913816 915137 917808 921354 926515 934323 944708 956638 969489 983636 999882 1019178 1042929
62310 1042929 1072385 1107270 1146029 1188141 1235261 1289106 1349102 1413440 1481805 1555396 1634295
62299 1634295 1716529 1800078 1884278 1968401 2050101 2126393 2195447 2256418 2308004 2348233 2375548
62288 2375548 2389269 2389186 2375624 2350212 2315952 2275989 2232142 2184506 2132338 2075385 2014496 1951048
62276 1951048 1886212 1821320 1758658 1700878 1649083 1602139 1558315 1516961 1477985 1440467 1402984
62265 1402984 1365273 1328689 1294834 1264270 1236670 1211761 1189856 1171632 1157290 1145788 1135223
62254 1135223 1124397 1113854 1105017 1098537 1093866 1089983 1085820 1080314 1072985 1064634 1056710 1049771 1043107
62241 1043107 1035974 1028553 1021365 1014299 1006724 998451 990448 984595 982390 983381 985072 985189 984122 984448 987874
62226 987874 993527 999610 1005858 1013522 1023453 1035208 1048045 1062003 1077664 1095220 1114120 1133725
62214 1133725 1154163 1176304 1200683 1226690 1253337 1280783 1310508 1343765 1380395 1419414 1460208
62203 1460208 1502870 1548057 1597168 1652014 1713282 1779411 1847771 1916925 1986968 2057665 2127231
62192 2127231 2193227 2253691 2306587 2348838 2377211 2390553 2390564 2379988 2360285 2331348 2293082 2246724
62180 2246724 2194503 2138476 2079984 2020028 1959696 1900068 1841874 1785450 1731095 1679519 1632011
62169 1632011 1589978 1554069 1523738 1497869 1475794 1457455 1442660 1430662 1420684 1412487 1406039 1400872
62157 1400872 1396143 1391331 1386621 1382595 1379661 1377755 1376458 1375459 1374868 1374956 1375570 1376212 1376913 1378637 1382391 1388033
62141 1388033 1394443 1400882 1407810 1416310 1427008 1439672 1453618 1468370 1484138 1501793 1522231 1545519
62129 1545519 1570682 1596456 1622382 1649099 1677536 1707836 1739228 1770875 1802463 1833678 1863619
62118 1863619 1891504 1918027 1945263 1974934 2007372 2042474 2080874 2123357 2169661 2218894 2271003
62107 2271003 2326895 2386933 2449958 2513922 2576790 2636624 2691546 2740162 2781750 2815819 2841892
62096 2841892 2859994 2870998 2876123 2876273 2871908 2863241 2850516 2834544 2817039 2799818 2783479 2767494
62084 2767494 2751817 2737551 2725557 2715416 2706758 2700878 2699545 2702311 2706360 2709435 2711848 2715150 2719917
62071 2719917 2725835 2733388 2744129 2759003 2777102 2796577 2816543 2837742 2861393 2887779 2916253 2946422
62059 2946422 2978778 3013871 3051213 3089605 3128609 3169251 3212978 3260131 3309630 3360023 3410553
62048 3410553 3461231 3512198 3563509 3615717 3670289 3728604 3790212 3852671 3913791 3973998 4035954
62037 4035954 4101881 4171792 4244351 4318721 4394899 4472380 4549081 4622173 4690325 4755117 4819770
62026 4819770 4886240 4953970 5021742 5089901 5159715 5230884 5301078 5368318 5432901 5496651 5561303
62015 5561303 5628185 5698453 5772453 5849225 5927512 6007149 6088977 6173763 6261839 6353345 6447838
62004 6447838 6543721 6638842 6731710 6821565 6907321 6987161 7059242 7122366 7176027 7220394 7256249
61993 7256249 7284353 7304843 7317693 7323588 7323620 7318114 7306563 7288877 7265994 7239109 7209109 7177086
61981 7177086 7144586 7112638 7081012 7048990 7016606 6984679 6953935 6924565 6896478 6869504 6843354
61970 6843354 6817675 6792334 6767709 6744717 6724270 6706430 6690382 6675643 6662931 6653066 6645282 6637658
61958 6637658 6629319 6621169 6614185 6608070 6602067 6595964 6589577 6582310 6574137 6566080 6558638 6550544 6540378 6528647
61944 6528647 6516783 6504565 6490366 6473838 6456479 6439000 6419803 6396952 6370237 6340209 6306377
61933 6306377 6267849 6225176 6180008 6132907 6082720 6028395 5970505 5910572 5849618 5787915 5725607
61922 5725607 5662898 5599884 5536927 5475215 5416251 5360326 5305920 5251166 5195814 5141434 5089879
61911 5089879 5042039 4997822 4956469 4916706 4877476 4839138 4803339 4771112 4741442 4712260 4682557
61900 4682557 4653021 4625061 4599739 4577234 4556651 4536634 4516840 4498494 4482863 4469638 4457598
61889 4457598 4446346 4436229 4427089 4418667 4412189 4409864 4412306 4417824 4424870 4433966 4446604 4463555 4485223
61876 4485223 4512370 4545180 4582462 4623241 4668738 4721569 4783290 4853839 4933073 5021453 5119167
61865 5119167 5225839 5341659 5468061 5607053 5760590 5930768 6119855 6329627 6561198
61856 6561198 6816067 7097190 7408758 7755125 8140227 8567981 9042929 9570138 10154130
61847 10154130 10797859 11503069 12271736 13106465 14008932 14978157 16010531 17100309 18237838
61838 18237838 19405660 20575621 21709014 22758688 23671717 24393281 24873110 25073917 24978969
61829 24978969 24595540 23952727 23094958 22074357 20944386 19754954 18548487 17357668
61821 17357668 16205726 15108284 14074935 13110217 12214938 11387851 10626638 9928202 9289150
61812 9289150 8706284 8176118 7693988 7254543 6853562 6488583 6157368 5856462 5581896
61803 5581896 5330730 5101096 4891137 4698920 4523361 4364037 4219670 4087669 3966034
61794 3966034 3855106 3756262 3668926 3590022 3516868 3449533 3389343 3335940 3287368 3242958 3204370
61783 3204370 3173032 3147858 3126567 3108263 3093297 3081193 3070420 3060466 3052850 3049435 3050391 3054193
61771 3054193 3059067 3064194 3070078 3078087 3089318 3103785 3121065 3141559 3166379 3195893 3229168 3265082
61759 3265082 3303262 3343776 3386949 3434131 3487705 3549237 3617906 3691612 3769508 3852823 3943410
61748 3943410 4042264 4149530 4265295 4390004 4524370 4669065 4824470 4990704 5168003 5357111
61738 5357111 5559432 5776950 6011686 6264605 6535080 6822346 7127961 7456249 7811846
61729 7811846 8197486 8614908 9067159 9558829 10094325 10677498 11313446 12009639 12774460
61720 12774460 13615111 14537459 15547471 16652002 17858151 19172168 20598690 22140301
61712 22140301 23797354 25567857 27446565 29422434 31474915 33570526 35660575 37679832
61704 37679832 39546608 41166348 42440722 43281417 43624691 43442285 42746038 41585368 40038151
61695 40038151 38197454 36158521 34009428 31825672 29667294 27578224 25588179 23715800
61687 23715800 21970819 20355358 18866278 17498369 16245795 15101322 14056259 13102453
61679 13102453 12233574 11443484 10724409 10068270 9469380 8924273 8429010 7978088 7566103
61670 7566103 7188934 6842929 6524450 6231076 5962058 5716470 5491564 5283791 5090747
61661 5090747 4911205 4743885 4587483 4441622 4306492 4181369 4064441 3954322 3850892
61652 3850892 3754298 3663880 3578598 3497963 3421958 3350370 3282810 3219240 3159878 3104431 3051786
61641 3051786 3000641 2950264 2900486 2851177 2802141 2753676 2707016 2663705 2624255 2587489 2551431
61630 2551431 2514899 2478131 2442011 2406986 2372899 2339527 2306982 2275612 2245790 2217834 2191873
61619 2191873 2167694 2144813 2122836 2101577 2080732 2059687 2038035 2016308 1995904 1978063 1962953
61608 1962953 1949670 1936890 1923439 1908653 1892621 1876107 1859973 1844568 1829726 1815307 1801555
61597 1801555 1788920 1777646 1767623 1758624 1750692 1744196 1739386 1735940 1733176 1730684 1728483 1726609 1725109
61584 1725109 1724585 1725956 1729077 1732184 1733683 1734218 1735936 1739705 1744106 1747429 1749507 1751084 1752461 1753744
61570 1753744 1755642 1758816 1762705 1765909 1767570 1767485 1765161 1760109 1753339 1747367 1743957 1742346 1740234 1736038
61556 1736038 1729645 1721535 1712173 1702389 1693618 1687104 1682707 1678661 1672830 1664320 1653856 1642597 1631040
61543 1631040 1619428 1608711 1600222 1594441 1590788 1588660 1587879 1588012 1588268 1588522 1589646 1592372 1596646 1602642
61529 1602642 1611358 1623246 1637210 1652255 1669361 1690165 1714201 1739294 1764684 1791893 1821998
61518 1821998 1853911 1886326 1919866 1956028 1995230 2037408 2083553 2134778 2190080 2246796 2303512
61507 2303512 2361236 2421359 2483678 2546944 2610248 2673016 2734292 2793017 2849000 2902990 2955588
61496 2955588 3006212 3053338 3095973 3134920 3172125 3208280 3241522 3269234 3290815 3307637 3320341
61485 3320341 3327554 3327977 3322677 3314329 3304737 3294048 3281931 3268409 3253628 3237948 3222622 3209577
61473 3209577 3200045 3193804 3190040 3188547 3189815 3194555 3203722 3218741 3241030 3271261 3309587 3356584 3413368
61460 3413368 3480546 3557642 3644225 3741272 3850702 3973634 4110101 4260879 4428773 4617143
61450 4617143 4827430 5058877 5310611 5583132 5877730 6195456 6537211 6904015 7295959
61441 7295959 7710645 8142970 8586243 9032905 9473795 9897015 10287950 10630886 10911348
61432 10911348 11118089 11244221 11287716 11251411 11142270 10970036 10746033 10482587 10192389 9887081
61422 9887081 9575965 9266205 8963969 8674689 8402291 8149048 7916676 7707042 7521496
61413 7521496 7360216 7222738 7108765 7018013 6949791 6903227 6877482 6871155 6882026 6908167 6949079
61402 6949079 7004981 7075106 7157185 7248287 7345494 7446203 7548922 7653790 7761264 7869944
61392 7869944 7976443 8077739 8173226 8264473 8353770 8443081 8533449 8624792 8716522 8808431 8900287
61381 8900287 8990626 9077086 9158501 9235599 9308774 9376005 9434059 9481170 9517477 9543336 9558653
61370 9558653 9563808 9559806 9546999 9524659 9492369 9451118 9402582 9348129 9289199 9227968 9166693 9106688
61358 9106688 9048788 8994554 8946040 8904191 8868347 8837713 8812542 8793213 8778663 8766714 8755930
61347 8755930 8746341 8738085 8730132 8720932 8709728 8696383 8680227 8660365 8637648 8615539 8598186 8588036
61335 8588036 8586147 8594650 8617861 8660551 8725863 8815443 8931043 9075173 9250256 9457847 9698705
61324 9698705 9972958 10279854 10617902 10985676 11382095 11805325 12251409 12714234 13186316
61315 13186316 13658625 14119303 14553326 14944273 15276855 15538456 15719727 15815358 15824842 15752087
61305 15752087 15603783 15387700 15111784 14783881 14411704 14002981 13565597 13107388 12635823
61296 12635823 12158096 11681394 11212534 10756971 10318225 9898410 9499196 9122311 8769450
61287 8769450 8441946 8140473 7865071 7615690 7392710 7196539 7026555 6880930 6757908
61278 6757908 6656989 6578402 6521592 6484781 6465978 6463924 6477924 6507243 6550885 6607416 6674514
61267 6674514 6749046 6828329 6911485 6999014 7090658 7184018 7275659 7363314 7446409 7524485 7595991
61256 7595991 7659354 7714826 7764353 7809391 7849365 7882520 7907757 7925103 7934703 7935973 7927877 7909702
61244 7909702 7881503 7844139 7798987 7747324 7689613 7625331 7553500 7473396 7384907 7288653 7186149
61233 7186149 7079875 6972830 6867553 6765271 6665973 6569493 6476621 6389093 6308482 6235366
61223 6235366 6169667 6111429 6060680 6016589 5977293 5940788 5905728 5871332 5837098 5802984 5769356
61212 5769356 5736093 5702018 5666012 5628860 5593256 5561636 5534507 5511293 5492442 5480139 5477151
61201 5477151 5485457 5505785 5537872 5581134 5635652 5702867 5785089 5884178 6000853 6135131 6286737
61190 6286737 6454742 6637131 6831080 7033343 7239975 7445858 7644816 7829864 7992837
61181 7992837 8124049 8213285 8251840 8234073 8157936 8025409 7842875 7620208 7368203 7096413
61171 7096413 6813109 6526317 6243621 5970647 5710379 5464334 5233927 5020306 4823347
61162 4823347 4641721 4474146 4320206 4179888 4052898 3938755 3837116 3747332 3667887 3596929
61152 3596929 3533522 3477918 3430405 3390371 3356854 3329622 3309218 3296076 3290048 3290673 3297440 3309707
61140 3309707 3326642 3347249 3370163 3393450 3414986 3433056 3446352 3453643 3454279 3449173 3440429 3429257
61128 3429257 3414579 3394322 3367899 3336872 3303388 3268606 3232560 3194680 3154143 3110474 3064403
61117 3064403 3017869 2972631 2928989 2886152 2843557 2801294 2759411 2717472 2674986 2631804 2587803
61106 2587803 2542533 2495513 2446742 2396620 2345492 2293567 2241357 2189972 2140790 2094723 2051733
61095 2051733 2011078 1972078 1934473 1897895 1861282 1823358 1783759 1743146 1702102 1660617 1619150
61084 1619150 1579500 1543633 1511811 1482701 1455398 1430508 1409030 1390963 1375562 1362529 1352401
61073 1352401 1345919 1343255 1343742 1346282 1350282 1356243 1364929 1375882 1387376 1398217 1408993 1420956 1434190
61060 1434190 1447661 1460807 1474204 1488571 1503814 1519350 1534952 1550898 1567418 1584181 1600356
61049 1600356 1615226 1628764 1641379 1653026 1662935 1670421 1675503 1678313 1678378 1675292 1669949 1664237 1659282
61036 1659282 1654516 1648653 1640999 1631508 1620167 1607041 1592896 1579167 1566854 1555397 1542879 1527702
61024 1527702 1510108 1491830 1474311 1457745 1442019 1427813 1415943 1406023 1396716 1387362 1378535 1370830
61012 1370830 1363971 1357563 1352033 1348118 1345761 1344185 1342999 1342674 1343856 1346573 1350292 1354387 1358313 1361514
60998 1361514 1363610 1364746 1365406 1365661 1364907 1362754 1359950 1357881 1357234 1357750 1359269 1362210 1366797 1372599 1379250
60983 1379250 1386963 1395842 1405546 1416313 1429543 1446499 1467038 1490438 1516696 1545776 1576268 1606443
60971 1606443 1636574 1668796 1704555 1743435 1784476 1827221 1871240 1916051 1962151 2010985 2063436
60960 2063436 2119363 2178884 2242717 2310709 2381540 2454856 2532459 2616327 2706600 2802754 2905747
60949 2905747 3017408 3138303 3267784 3405977 3554183 3713009 3881256 4057307 4241091
60940 4241091 4434461 4640221 4861459 5101929 5366654 5661302 5990400 6356446 6761521
60931 6761521 7209668 7707430 8263050 8886641 9590518 10387281 11287359 12300223 13438098
60922 13438098 14716826 16154588 17774498 19609195 21697552 24074612 26768891 29803616
60914 29803616 33167951 36743088 40242075 43257863 45433174 46636709 47006892 46846952
60906 46846952 46483104 46185547 46136994 46380232 46751641 46893822 46400846 45017143 42746027
60897 42746027 39804683 36492273 33079053 29762411 26667038 23857082 21351810 19144535
60889 19144535 17217079 15544329 14094855 12834957 11734330 10768027 9915135 9157931
60881 9157931 8482234 7877275 7334974 6849135 6414112 6023327 5669499 5346560 5050580
60872 5050580 4778702 4528270 4297353 4084752 3888652 3706182 3534998 3374236 3223107
60863 3223107 3079628 2941895 2810072 2686103 2571693 2467082 2371114 2281855 2197631 2118229
60853 2118229 2044693 1977592 1916130 1859244 1806516 1757434 1710931 1666746 1626241 1590493 1558160
60842 1558160 1526618 1494916 1464355 1436449 1411643 1390004 1371727 1356486 1343246 1331258 1320709
60831 1320709 1312124 1305678 1301340 1299246 1299594 1302350 1307124 1313162 1319632 1326180 1333097 1340720 1348926 1357330
60817 1357330 1365334 1371478 1373568 1370557 1364023 1356735 1349772 1342039 1332503 1321673 1310501 1299100 1287466
60804 1287466 1276568 1267519 1259919 1252164 1243644 1235838 1230729 1228698 1228628 1229870 1233243 1239775 1249039 1259469
60790 1259469 1270286 1282590 1298424 1319024 1343983 1371707 1400563 1429890 1460049 1491220 1522215
60779 1522215 1550874 1575722 1596907 1615562 1632817 1649484 1665860 1681405 1695059 1706253 1715233
60768 1715233 1722160 1726548 1728074 1727452 1725932 1724232 1722331 1719992 1717088 1713723 1710289 1707032 1703427 1698638
60754 1698638 1692831 1687139 1681726 1674745 1664077 1649510 1632370 1613740 1594152 1574424 1555317 1536315
60742 1536315 1516028 1494130 1472090 1451668 1433442 1417009 1401953 1388235 1376056 1365670 1357235
60731 1357235 1350837 1346688 1344982 1345313 1346768 1349041 1352930 1359124 1367082 1375869 1385541 1396821 1410021 1425363
60717 1425363 1443795 1465927 1490424 1515067 1539492 1565359 1593593 1623138 1652891 1683076 1713726
60706 1713726 1743300 1770273 1795191 1819732 1844252 1867376 1887626 1904338 1917339 1926898 1934083 1940214
60694 1940214 1945648 1949551 1950992 1949964 1947385 1944372 1941355 1937700 1932424 1925537 1918399 1912431 1907720 1903105
60680 1903105 1897265 1889520 1880015 1869409 1857977 1844895 1829098 1811118 1793086 1776238 1759354 1740624
60668 1740624 1720310 1700379 1682157 1665861 1652146 1642324 1636541 1633126 1630496 1628759 1628826 1630889 1634653
60655 1634653 1640342 1648392 1658295 1668534 1677615 1684670 1689240 1691216 1691168 1690240 1689442 1689020 1688418 1686780 1683734
60640 1683734 1679933 1676548 1673944 1671146 1666981 1661413 1655169 1648444 1640822 1632428 1624077 1615947 1606991 1596169
60626 1596169 1583474 1569018 1551935 1531383 1508360 1485331 1463932 1443917 1424399 1405057 1385865
60615 1385865 1366755 1348290 1331898 1318630 1308216 1299977 1294073 1290893 1289633 1288588 1286952 1285639 1286187
60602 1286187 1289376 1294818 1301294 1307466 1312717 1317290 1321251 1323784 1324253 1323597 1323603 1324841 1326427 1327950 1330383
60587 1330383 1334532 1339663 1344427 1348433 1352124 1355787 1359503 1363595 1368222 1372859 1376943 1380895 1385780 1392177
60573 1392177 1399996 1409158 1419746 1431548 1444165 1457508 1471635 1486358 1501883 1519658 1541328 1566362
60561 1566362 1591858 1615633 1638892 1664717 1694078 1724466 1752728 1778245 1802507 1826249 1848265
60550 1848265 1867110 1882805 1896172 1907323 1915807 1921746 1925484 1926124 1921756 1911651 1897173 1879861
60538 1879861 1859667 1836156 1810531 1785026 1760603 1736704 1713291 1691733 1673250 1657736 1644748
60527 1644748 1634624 1627635 1622835 1618876 1615600 1613772 1613305 1612789 1611053 1608345 1605483 1602450 1598550 1593680
60513 1593680 1588643 1584049 1579594 1574896 1570637 1568148 1567914 1569275 1571860 1576498 1584016 1593725 1604104 1614785
60499 1614785 1626656 1639813 1652695 1664052 1674926 1687617 1703078 1720282 1737913 1755613 1773528
60488 1773528 1791643 1810066 1829357 1850205 1873229 1899386 1929975 1965792 2006634 2051976 2101662
60477 2101662 2155501 2212634 2271943 2332684 2393883 2453170 2506985 2551994 2585765 2606148 2611102
60466 2611102 2599943 2574469 2538511 2496548 2452879 2411344 2374940 2345584 2324467 2312373 2309259
60455 2309259 2313867 2324487 2340187 2360846 2386048 2414561 2445140 2477371 2511571 2548377 2588785
60444 2588785 2634121 2685370 2742752 2806518 2878165 2960417 3055876 3166064 3291836 3434252 3594705
60433 3594705 3774346 3973762 4193118 4432317 4690942 4968318 5264001 5578588 5914432
60424 5914432 6275661 6667149 7092682 7553333 8046436 8564149 9090826 9600832 10060017
60415 10060017 10431691 10683896 10794050 10750367 10552380 10211843 9752591 9207583 8613261
60406 8613261 8003184 7403264 6830257 6293488 5797785 5345316 4935973 4567688 4237320
60397 4237320 3941360 3676137 3438200 3224923 3034293 2863954 2711099 2573654 2450851
60388 2450851 2341990 2245232 2158374 2080274 2010545 1948142 1891356 1839196 1791576 1747829 1706116
60377 1706116 1665031 1625073 1587724 1553547 1521969 1492569 1465542 1440796 1417507 1395084 1374047
60366 1374047 1355315 1338828 1323431 1308162 1293222 1279583 1268120 1259319 1253255 1249318 1246260 1243246
60354 1243246 1240804 1240029 1240824 1241674 1241384 1240341 1239666 1239884 1241094 1243754 1248340 1254421 1260908 1267138 1272990
60339 1272990 1278028 1281461 1283363 1285336 1289430 1296487 1305682 1315489 1324934 1333989 1342986 1351946 1360642 1368992
60325 1368992 1376742 1382824 1385870 1385621 1383082 1379007 1373286 1366337 1359768 1354448 1349020 1341979 1334486 1329189
60311 1329189 1326592 1324725 1322515 1321276 1322117 1323893 1325005 1325700 1327133 1329199 1330772 1331510 1332120 1333306 1335502
60296 1335502 1339356 1345452 1353660 1363322 1373734 1383984 1393082 1401040 1409241 1418896 1429683 1440734 1452212
60283 1452212 1464806 1478273 1491783 1505263 1518970 1531972 1542560 1550279 1556155 1560761 1563531 1564527
60271 1564527 1565541 1568596 1574255 1582083 1591755 1602801 1614091 1624735 1634969 1645007 1653354 1657635 1657253
60258 1657253 1654032 1649805 1644361 1636556 1626606 1616100 1605989 1595813 1585218 1575213 1567230 1561565 1557517
60245 1557517 1554572 1552561 1551014 1549438 1548315 1548789 1551134 1554473 1558326 1563335 1569831 1576696 1582738 1588529
60231 1588529 1595726 1604778 1614483 1623893 1633691 1645249 1658896 1673498 1687558 1700629 1713766 1728500
60219 1728500 1745085 1761955 1777210 1790487 1803048 1816368 1831214 1847928 1866776 1887693 1910138
60208 1910138 1933631 1958384 1985294 2015261 2048504 2084649 2123617 2166264 2213674 2266003 2322811
60197 2322811 2384620 2453113 2529206 2611824 2699465 2792326 2891902 2999101 3114042 3237530 3371442
60186 3371442 3517360 3675666 3846151 4028669 4222975 4428614 4645241 4872383 5108473
60177 5108473 5350428 5594361 5836518 6073702 6303264 6522623 6728462 6916662 7083616
60168 7083616 7227389 7347079 7441564 7509789 7552058 7570123 7566270 7543211 7504495 7453684 7393319
60157 7393319 7326192 7257521 7193993 7140046 7096658 7064520 7046749 7047409 7068835 7111802 7177163 7265636
60145 7265636 7376704 7509265 7662829 7836594 8027854 8232963 8449567 8675841 8907174
60136 8907174 9135376 9352022 9551433 9729878 9883444 10008194 10101717 10163197 10192090 10187822
60126 10187822 10150800 10082928 9987118 9867115 9727967 9575856 9416943 9256704 9100545 8954292
60116 8954292 8823337 8711518 8621400 8555325 8515336 8502035 8514470 8551589 8613027 8697797 8802792
60105 8802792 8923585 9056659 9199882 9350408 9502760 9649620 9784589 9904057 10006672
60096 10006672 10091509 10157281 10203432 10231526 10244959 10247430 10242372 10233958 10227662 10229207 10243644 10275944
60084 10275944 10331469 10414555 10527080 10669500 10842826 11048193 11284905 11550810 11845277 12170654
60074 12170654 12530556 12927962 13365334 13844828 14367035 14930253 15531709 16168522 16836530
60065 16836530 17528919 18236808 18950279 19657901 20346326 21001976 21612963 22168655 22658438
60056 22658438 23072666 23404660 23650253 23805467 23866064 23829567 23696481 23469579 23153655 22756712
60046 22756712 22290196 21767267 21201583 20608041 20003168 19403208 18821941 18270941 17761082
60037 17761082 17302284 16901495 16561728 16283522 16067112 15913099 15821312 15789275 15811756 15881711
60027 15881711 15991348 16132100 16294005 16465970 16636991 16796791 16935568 17044327 17116298
60018 17116298 17147683 17136630 17082064 16983995 16844034 16664483 16447224 16194448 15910058 15599078
60008 15599078 15265787 14913779 14547999 14175159 13801419 13430995 13068057 12718772 12389837
59999 12389837 12085404 11806851 11555475 11334148 11146279 10994263 10879217 10801392 10760543 10756560
59989 10756560 10789629 10858968 10961536 11093199 11251278 11434503 11639890 11860794 12088604 12315082
59979 12315082 12532234 12731471 12904718 13046077 13151451 13217209 13240450 13220129 13156694 13051001
59969 13051001 12904673 12721159 12505300 12262330 11998636 11722976 11445046 11172455 10910222
59960 10910222 10663026 10436168 10233935 10058487 9911068 9793168 9706172 9651177 9629724 9643468
59950 9643468 9692469 9775059 9890251 10039187 10223327 10442079 10692978 10973070 11278839 11605221
59940 11605221 11945437 12291309 12633245 12960837 13264476 13536112 13768484 13955200 14092633
59931 14092633 14180476 14219040 14206980 14143221 14030330 13874322 13681770 13459021 13214071 12956990
59921 12956990 12697643 12444086 12203571 11983738 11791747 11632750 11509830 11424998 11379684 11374274
59911 11374274 11407403 11475918 11575930 11704195 11858047 12033717 12225407 12426872 12633511 12842157
59901 12842157 13049260 13250387 13441409 13619347 13782284 13929402 14060995 14177495 14278524
59892 14278524 14363828 14435035 14495563 14548988 14598813 14649919 14708844 14782176 14875786 14996077 15150629
59881 15150629 15346559 15588814 15880677 16225192 16625294 17083073 17599553 18174540 18805680
59872 18805680 19487668 20212647 20970782 21749610 22532996 23301309 24032463 24702461 25285826
59863 25285826 25757474 26095998 26286428 26321399 26201295 25934150 25534919 25023749 24423756
59854 24423756 23759072 23053255 22327850 21601404 20889516 20205598 19561165 18965308 18424495
59845 18424495 17943599 17526860 17177204 16894911 16678244 16525781 16437215 16411469 16445178 16533939
59835 16533939 16674045 16861597 17090229 17350740 17632472 17923703 18210839 18478722 18712226
59826 18712226 18896833 19017959 19061529 19016576 18877428 18643833 18320180 17914922 17439538 16906911
59816 16906911 16330533 15724768 15104404 14482843 13870736 13276318 12706319 12166152 11659806
59807 11659806 11190037 10758389 10365104 10009579 9690876 9407154 9154928 8930191 8730573
59798 8730573 8555202 8402068 8266756 8144443 8031956 7927018 7826774 7728660 7632359 7539716
59788 7539716 7452778 7372568 7299333 7233084 7173978 7122505 7078695 7040484 7003457 6962995 6916250
59777 6916250 6861624 6797634 6723809 6642021 6555265 6465289 6372979 6280937 6193791 6115332 6046765
59766 6046765 5988403 5941636 5908025 5887292 5877413 5876335 5882905 5896733 5918390 5949818 5993581 6051220
59754 6051220 6122420 6205611 6298988 6401036 6510604 6626600 6747340 6870110 6991644 7109141
59744 7109141 7220766 7325330 7421844 7509465 7587598 7655949 7714757 7765232 7809645 7850873 7892081
59733 7892081 7937000 7990205 8056520 8139922 8243148 8368418 8518159 8695018 8901652 9140906
59723 9140906 9415947 9729758 10084487 10481509 10921997 11407151 11938056 12515637 13140297
59714 13140297 13810371 14519653 15255205 15995849 16711165 17362178 17905890 18303646 18529892
59705 18529892 18577392 18457454 18195942 17826711 17384811 16902080 16405883 15919043 15459018
59696 15459018 15036869 14657795 14323393 14033956 13789542 13589993 13434659 13322446 13252322
59687 13252322 13223674 13235806 13287190 13376062 13502287 13667982 13875519 14125291 14416452 14749640
59677 14749640 15127802 15554048 16029887 16556380 17136086 17772694 18469015 19226604 20047500
59668 20047500 20935117 21892603 22920902 24019233 25186879 26423109 27724630 29083454
59660 29083454 30487293 31921263 33368787 34811907 36232556 37614653 38945584 40217155
59652 40217155 41427301 42581935 43694241 44780648 45856745 46936129 48030718 49148984
59644 49148984 50292339 51453510 52618465 53768677 54880831 55926134 56873126 57693353
59636 57693353 58365282 58874490 59213196 59381918 59391492 59262354 59021612 58700694 58333951 57956368
59626 57956368 57600516 57295093 57065556 56934481 56920568 57038204 57298711 57711417 58283034
59617 58283034 59016752 59912586 60967672 62175093 63522504 64992110 66560396 68195567
59609 68195567 69854315 71481292 73011467 74372991 75490340 76289739 76707040 76695610 76232395
59600 76232395 75321782 73996028 72310686 70336421 68150899 65832591 63455384 61083492
59592 61083492 58768103 56546545 54442750 52467749 50619942 48884930 47235269 45632574
59584 45632574 44034128 42402286 40712250 38955953 37142779 35297141 33452249 31641896
59576 31641896 29894354 28230113 26661957 25196378 23836213 22582527 21433515 20382599
59568 20382599 19420155 18538045 17731344 16995816 16326060 15716971 15164944 14666360 14216573
59559 14216573 13811517 13448405 13123331 12830105 12563368 12321166 12102139 11901566 11712748
59550 11712748 11531305 11355287 11181644 11005688 10824373 10637365 10444236 10243213 10033991
59541 10033991 9819813 9605194 9392787 9183748 8980091 8785107 8601749 8431621 8275479
59532 8275479 8134083 8008382 7898922 7805106 7725535 7659602 7608234 7572178 7550003 7539110 7538535
59521 7538535 7549406 7572417 7606198 7648592 7698350 7755021 7818217 7887634 7963050 8043801 8129039
59510 8129039 8218995 8315385 8420360 8535814 8663863 8806855 8966334 9142799 9336954 9550358
59500 9550358 9784469 10040043 10318033 10620201 10948230 11303041 11685537 12097087 12538561
59491 12538561 13009567 13509010 14035276 14585193 15154129 15738129 16334617 16939449 17544223
59482 17544223 18138382 18713693 19265165 19788313 20277999 20730644 21145731 21523841 21864097
59473 21864097 22164379 22423471 22642516 22825414 22978939 23111955 23233195 23349397 23465881
59464 23465881 23588501 23723815 23876615 24047304 24231551 24421585 24606935 24774135 24906877
59455 24906877 24987610 24999639 24928576 24763281 24496927 24127711 23658517 23096131 22451058 21737481
59445 21737481 20972009 20171503 19351848 18528222 17715267 16926012 16170568 15455915 14786672
59436 14786672 14166029 13596491 13080021 12617125 12205839 11842450 11523868 11248908 11016905
59427 11016905 10825707 10671931 10553046 10468541 10418977 10404465 10424283 10477668 10564645 10685927
59417 10685927 10841966 11032335 11256289 11513628 11804225 12126651 12478035 12855495 13256718
59408 13256718 13678412 14114759 14557879 14998868 15427337 15830584 16194707 16506696 16754851
59399 16754851 16927882 17015714 17012162 16916271 16730827 16460647 16112965 15698442 15230390 14722599
59389 14722599 14187887 13637943 13083510 12534287 11998576 11482587 10989831 10521721 10079398
59380 10079398 9664762 9279389 8923001 8594002 8291576 8016464 7769478 7549905 7355733
59371 7355733 7184857 7035629 6906680 6796793 6704791 6629180 6568211 6520816 6487254 6468159
59361 6468159 6462955 6469771 6486868 6513459 6549014 6592699 6644056 6703627 6772181 6849706 6935658 7029565
59349 7029565 7130183 7234036 7335980 7432142 7522572 7611425 7705117 7810017 7930649 8069317
59339 8069317 8227635 8408526 8616046 8852563 9116397 9402850 9708039 10032256 10380652
59330 10380652 10761361 11182575 11650405 12168702 12740403 13368663 14056833 14807845 15623751
59321 15623751 16505121 17450361 18455651 19515355 20621501 21762129 22920578 24077095
59313 24077095 25211194 26302934 27334009 28290012 29162181 29946230 30639739 31241906 31755521
59304 31755521 32186894 32542221 32824351 33033357 33168590 33228420 33208620 33103061 32906757 32617666
59294 32617666 32236105 31764591 31209655 30583048 29899766 29174543 28420122 27647495 26865641
59285 26865641 26079877 25290870 24496108 23692956 22880798 22060993 21235682 20407555 19581330
59276 19581330 18764888 17967700 17197456 16458778 15755488 15092789 14475594 13905102 13378797
59267 13378797 12894256 12451631 12051830 11693734 11374388 11090907 10840788 10620921 10427983
59258 10427983 10259939 10116055 9995194 9895031 9813094 9747763 9698088 9663580 9644446 9641026
59248 9641026 9652420 9676427 9711383 9757233 9813977 9879663 9950941 10025321 10101808 10179360 10255708
59237 10255708 10328136 10394820 10455064 10508907 10557174 10601603 10644244 10686673 10730304 10777507 10831866
59226 10831866 10896995 10975463 11069184 11180320 11310879 11461406 11630909 11818437 12024141 12248284
59216 12248284 12489652 12745287 13011028 13281302 13548511 13803534 14037083 14240346 14404970
59207 14404970 14523995 14593585 14613446 14585473 14512901 14401143 14258252 14093019 13912443 13721502
59197 13721502 13525046 13328883 13138735 12958724 12791318 12638392 12501771 12382536 12280025
59188 12280025 12191864 12115392 12049156 11992959 11946601 11909197 11880197 11860862 11854243 11863734 11891960
59177 11891960 11940995 12013151 12111478 12239921 12403256 12606427 12853373 13146477 13487311 13877597
59167 13877597 14318836 14810832 15350868 15934146 16554156 17201841 17864339 18524594 19161814
59158 19161814 19752254 20270890 20694259 21002817 21181004 21216365 21100738 20833429 20422773
59149 20422773 19884075 19236365 18500941 17701162 16861290 16004436 15151060 14318186 13518564
59140 13518564 12760283 12047786 11383525 10768693 10203210 9686098 9215863 8789845 8403422
59131 8403422 8050978 7728256 7433483 7166062 6924469 6705465 6505139 6320717 6151536
59122 6151536 5998046 5859717 5734459 5620429 5517592 5426568 5346508 5275325 5211961 5157232
59112 5157232 5112350 5077636 5052901 5038028 5032632 5035924 5047482 5067695 5097083 5135599 5182929 5239104
59100 5239104 5304358 5378456 5460276 5548146 5641056 5739759 5846183 5961276 6083975 6212824
59090 6212824 6347676 6488672 6634263 6781790 6929550 7076479 7219898 7355600 7480706
59081 7480706 7594784 7697504 7786873 7860726 7918464 7960206 7985601 7994989 7990988 7977651 7958469
59070 7958469 7936079 7913240 7892982 7878159 7871659 7876651 7895948 7931570 7985422 8059612 8155352 8272302
59058 8272302 8409972 8569244 8751719 8958200 9188633 9442874 9720462 10020216 10341135
59049 10341135 10683323 11046828 11429588 11827136 12233793 12643059 13047004 13436159 13799907
59040 13799907 14126261 14401768 14613105 14749629 14804813 14776347 14666212 14480699 14229368 13923321
59030 13923321 13573925 13191846 12785877 12362563 11927537 11486974 11047158 10612904 10187113
59021 10187113 9771626 9367803 8976585 8598878 8236004 7889314 7559532 7246894 6951690
59012 6951690 6674251 6414688 6172973 5948858 5741408 5549253 5371797 5209505 5062464
59003 5062464 4929440 4809029 4700835 4604729 4519878 4445557 4382156 4330166 4288825 4256861 4233664
58992 4233664 4218205 4207422 4197350 4185543 4170805 4150791 4121696 4080517 4026250 3958859 3878813
58981 3878813 3788254 3691330 3592542 3495213 3401410 3312202 3227770 3148268 3074739 3008355 2948900
58970 2948900 2895246 2847343 2806328 2772381 2743841 2719037 2697900 2681153 2668843 2660247 2654471 2650639
58958 2650639 2648124 2646862 2646809 2646951 2645749 2642816 2639418 2637126 2636792 2638832 2643368 2649750 2656934 2664790 2674232
58943 2674232 2685893 2699683 2715905 2735514 2758629 2783772 2809308 2834826 2860497 2885911 2910427
58932 2910427 2934233 2958375 2983974 3011548 3040595 3069712 3097859 3125727 3155072 3186530 3219017
58921 3219017 3251592 3284936 3320374 3358357 3398564 3440880 3485688 3533679 3585749 3642481 3703423
58910 3703423 3767580 3834951 3906805 3984109 4066603 4153888 4246450 4344905 4449019 4558085 4671512
58899 4671512 4788356 4907106 5026805 5147756 5270240 5392967 5513659 5631011 5745655
58890 5745655 5859777 5976510 6099225 6230474 6371416 6522426 6683919 6856445 7040754
58881 7040754 7238544 7452756 7686347 7940615 8215024 8508739 8822385 9158630 9521198
58872 9521198 9913125 10336139 10791834 11282612 11810622 12376667 12981937 13630742 14329457
58863 14329457 15082219 15889537 16752039 17673563 18658783 19709007 20822239 21996466 23230623
58854 23230623 24522041 25864148 27246596 28655935 30075313 31483838 32856234 34162622
58846 34162622 35369151 36440208 37341136 38039872 38508400 38725931 38682932 38382844 37840412
58837 37840412 37078764 36127251 35019632 33791642 32478304 31112087 29722145 28334000
58829 28334000 26969089 25644413 24372860 23164033 22024373 20956405 19958915 19029235
58821 19029235 18165600 17366708 16629304 15947486 15314600 14724811 14172721 13652808 13160117
58812 13160117 12690894 12242276 11812426 11401453 11011097 10642737 10296475 9972486 9671887
58803 9671887 9395298 9141794 8910443 8701728 8515867 8350520 8201999 8068617 7951438
58794 7951438 7851819 7769637 7704015 7654383 7620270 7600986 7596032 7605265 7628366 7664816 7714843 7780065
58782 7780065 7862686 7963940 8083229 8218753 8369115 8534469 8716002 8914545 9130314 9364126
58772 9364126 9618052 9894284 10193809 10516774 10863851 11236886 11638665 12072556 12542068
58763 12542068 13050209 13599296 14191514 14829492 15516392 16255928 17052221 17908874 18827993
58754 18827993 19810686 20858225 21971327 23147859 24382164 25666638 26992131 28345624
58746 28345624 29708560 31058208 32369288 33612957 34755387 35759548 36589188 37211900
58738 37211900 37601175 37739142 37619131 37246158 36635731 35812313 34806907 33653555 32386876
58729 32386876 31041734 29652296 28248666 26854180 25486369 24159080 22882109 21660044
58721 21660044 20494042 19385023 18334153 17341137 16404247 15522068 14693790 13917968 13192510
58712 13192510 12515561 11884744 11295818 10743997 10226726 9743439 9292712 8871602 8478047
58703 8478047 8111743 7771896 7455908 7161159 6886490 6630868 6392116 6168277 5959225
58694 5959225 5765684 5587273 5422475 5269909 5128668 4997842 4876514 4764058 4659842
58685 4659842 4562823 4471739 4385460 4303039 4223923 4148303 4076738 4009196 3944895 3883152 3823855
58674 3823855 3766948 3712051 3658673 3606193 3553666 3500396 3446938 3394767 3344610 3295654 3246480
58663 3246480 3196102 3143911 3089456 3032862 2975124 2917620 2861381 2806548 2752028 2696067 2638115
58652 2638115 2580048 2524647 2472888 2423821 2377118 2334189 2296085 2261489 2227912 2194264 2161332
58641 2161332 2130214 2101276 2074447 2049654 2026753 2005480 1985553 1966532 1947505 1927361 1905753
58630 1905753 1883877 1863945 1847499 1834232 1822857 1813082 1806033 1802389 1800908 1799465 1796991 1793505 1788623
58617 1788623 1781191 1770527 1757241 1742752 1728579 1716040 1705811 1697499 1690098 1682996 1676260 1670101
58605 1670101 1664612 1660098 1657212 1656696 1659068 1664193 1670857 1677299 1682763 1688186 1694903 1703204 1712797 1724040
58591 1724040 1737808 1754425 1773635 1795351 1819631 1846212 1874888 1906160 1940820 1979190 2021263
58580 2021263 2067000 2115813 2166736 2220255 2279092 2345686 2419374 2497629 2579710 2667483 2762916
58569 2762916 2866595 2978908 3100970 3233782 3377687 3533236 3701816 3885241 4085521
58560 4085521 4304921 4545213 4806787 5089332 5393096 5718515 6064940 6430856 6814712
58551 6814712 7213899 7623038 8034644 8440823 8832195 9195226 9513107 9770371 9955770
58542 9955770 10061336 10081597 10015291 9866579 9643818 9358241 9023979 8657038 8272414 7882196
58532 7882196 7495988 7121198 6762262 6421320 6100676 5803406 5531026 5282200 5054715
58523 5054715 4847415 4659416 4488910 4333914 4193179 4065469 3949026 3842522 3745453 3656813
58513 3656813 3574458 3496421 3421675 3349034 3276816 3204499 3133223 3063558 2994094 2923380 2851996
58502 2851996 2781423 2712074 2643865 2577758 2515095 2455872 2398911 2343459 2289786 2238653 2190868
58491 2190868 2146737 2105320 2064976 2025358 1988095 1954824 1925382 1898580 1873779 1850855 1829505
58480 1829505 1809675 1791989 1776884 1763707 1751363 1739373 1727953 1717676 1709380 1703616 1699856 1696976
58468 1696976 1694577 1692729 1690491 1686266 1679921 1672894 1665681 1656857 1645250 1631274 1615250 1596214 1573661
58455 1573661 1549034 1524363 1500717 1478784 1459215 1441193 1422396 1401847 1381348 1362850 1346023
58444 1346023 1329913 1315248 1303210 1293356 1284682 1277589 1272855 1269571 1265933 1261253 1255726 1249301 1242398
58431 1242398 1236515 1232345 1228378 1223264 1218322 1215555 1214316 1212332 1209296 1206860 1205468 1203791 1201335 1199382
58417 1199382 1198995 1199917 1201763 1204602 1208027 1210969 1212791 1213624 1213722 1213466 1213698 1214970 1216914 1219411 1223648 1230588
58401 1230588 1239099 1247250 1254997 1263843 1274176 1284701 1294366 1303055 1310263 1314659 1315250 1311763 1303879 1291420
58387 1291420 1275418 1257788 1239739 1221383 1202945 1185405 1169926 1157261 1147358 1138875 1129709 1119021
58375 1119021 1108219 1099034 1091295 1083711 1076116 1069566 1064728 1061483 1059791 1059747 1061122 1063739 1067853 1073348
58361 1073348 1079333 1085377 1092062 1099382 1105958 1111216 1116943 1124932 1134380 1143590 1152987 1164147 1176789
58348 1176789 1189385 1202230 1217334 1235270 1254374 1273132 1291316 1308767 1325106 1340820 1356664
58337 1356664 1371727 1383832 1392163 1397891 1401978 1403942 1403205 1400321 1396463 1392578 1389078 1385468 1380529 1373840
58323 1373840 1366659 1360435 1355118 1350136 1346149 1344369 1344912 1347321 1351882 1358735 1366408 1373060 1378684 1384478
58309 1384478 1390786 1397432 1405247 1415187 1426349 1436648 1445033 1451581 1456386 1460198 1465067 1472098 1479322
58296 1479322 1483979 1486140 1487914 1490028 1491647 1492693 1493668 1493895 1492565 1491020 1491339 1493261 1495149 1497203 1500758
58281 1500758 1505133 1508652 1512427 1519639 1530962 1544092 1558037 1574455 1594083 1615059 1635715 1656354
58269 1656354 1677541 1699260 1722290 1747717 1774378 1799372 1821749 1843281 1865150 1886548 1907167
58258 1907167 1928286 1950382 1972033 1992221 2011710 2031507 2051821 2073009 2095597 2118968 2141803
58247 2141803 2163979 2186427 2209521 2233513 2259824 2289414 2320580 2351052 2381589 2414655 2450311
58236 2450311 2486675 2523858 2563949 2607368 2652579 2699068 2747238 2795900 2843463 2891086 2940844
58225 2940844 2991511 3040422 3088838 3140603 3195824 3251035 3305752 3363472 3425551 3489564 3554784
58214 3554784 3623913 3697775 3773416 3849303 3927696 4010066 4094824 4181532 4272937 4370744 4473484
58203 4473484 4580388 4693441 4813957 4941013 5074635 5216615 5367142 5524750 5690210
58194 5690210 5865993 6051446 6243830 6444763 6659960 6891467 7136010 7392208 7663358
58185 7663358 7951664 8256046 8577458 8920002 9284875 9669600 10075234 10507930 10971708
58176 10971708 11466591 11995624 12565892 13179766 13832345 14520051 15244591 16006677 16804478
58167 16804478 17640941 18523831 19455545 20431959 21454658 22535388 23685794 24913017 26228232
58158 26228232 27647522 29179473 30823136 32582810 34473175 36506016 38686289 41028102
58150 41028102 43561661 46319362 49330921 52639771 56308716 60402743 64985626 70144187
58142 70144187 75997277 82668181 90263920 98890142 108667312 119727940 132226762 146359447
58134 146359447 162327616 180262414 200223655 222312937 246786801 274098314 304892244
58127 304892244 339788337 378586771 419017791 456118624 483402331 495540520 490711803
58120 490711803 470950362 440607127 404396931 366213587 328799509 293828563 262136883
58113 262136883 234018449 209462655 188253257 170014203 154303245 140711236 128892622
58106 128892622 118563195 109525320 101684143 95003252 89445359 84960876 81493429 78956536
58098 78956536 77232961 76249438 76029392 76575304 77630261 78574125 78622416 77196607 74173603
58089 74173603 69857516 64760423 59380571 54088520 49112252 44566104 40488841 36878988
58081 36878988 33716448 30964663 28567259 26458138 24580808 22896565 21377732 20002061
58073 20002061 18754639 17626032 16603783 15670541 14812394 14022430 13292857 12610078 11961922
58064 11961922 11344721 10759247 10204437 9679423 9187242 8731342 8310645 7921273 7560382
58055 7560382 7225453 6912803 6619473 6343781 6082021 5828375 5580673 5342644 5117766
58046 5117766 4904367 4699342 4502802 4315942 4137877 3968000 3808252 3659548 3518673
58037 3518673 3382072 3250341 3125992 3009161 2898458 2793869 2695985 2604265 2518410 2439393
58027 2439393 2367017 2298746 2232962 2170872 2113216 2057961 2003572 1951710 1904073 1859238 1815275
58016 1815275 1772910 1733391 1695871 1659759 1627168 1599765 1575336 1550586 1525511 1502037 1480152
58005 1480152 1458540 1437516 1418232 1400040 1381455 1362914 1346169 1331688 1318521 1305701 1292207
57994 1292207 1276962 1260581 1245559 1232970 1220585 1206003 1189891 1174336 1159939 1146685 1135794
57983 1135794 1128351 1123491 1119963 1117996 1117777 1117854 1117133 1116839 1118423 1121074 1123253 1125029 1126957 1128469 1129379
57968 1129379 1131137 1134313 1136615 1135656 1132085 1127833 1123143 1117592 1112083 1107153 1100994 1091896 1081161 1071053
57954 1071053 1061329 1050467 1038729 1027183 1015152 1001544 987494 974823 963038 950665 938352
57943 938352 927684 918014 907573 896978 888642 883277 879672 877256 876143 875390 874005 873054 874112 876366
57929 876366 877945 879247 881979 885726 888634 890934 894413 898764 901850 903499 905776 909393 913104 916813
57915 916813 921900 927952 932447 934481 935757 937074 936868 934346 931073 927931 923095 914859 904574 895276
57901 895276 888872 885685 884973 884671 882183 876788 870280 864516 859535 854540 849201 843379 837136 831683 828742
57886 828742 828222 828016 826843 825748 826018 827243 828485 829926 831962 833608 833043 829302 822785 814655 806262
57871 806262 798486 791165 783611 775711 767860 759922 751300 742203 733805 726977 721588 717029 712676 708217
57857 708217 704516 703609 706452 711166 715099 718192 722491 728755 735765 742942 751195 760712 770245 779307
57843 779307 788894 799111 808156 814699 819337 822552 823329 821295 818360 816256 813838 808814 801186 792908
57829 792908 784786 775748 765178 754247 744465 736079 728417 721179 714827 709876 706061 702492 698854 696021
57815 696021 694823 694520 693584 691963 691388 693094 696435 700261 704548 709918 716384 723375 730394 736977 742481
57800 742481 746469 748947 749971 749649 748812 748774 749834 750584 749315 745757 740997 736114 731279 725912 719417
57785 719417 711822 703604 694808 685004 674685 665870 660095 656334 652348 647721 643855 641090 637902 633373
57771 633373 628398 623552 617527 608960 598415 587265 575853 564075 552752 542796 533530 523280 511523
57758 511523 499506 488889 480501 474162 469014 464224 459773 456272 453763 451339 448441 445873 444914 445995
57744 445995 448818 453250 459453 467432 476902 487268 497634 507511 517810 530196 544814 559293 570626
57731 570626 577573 580905 582090 582442 582878 583637 584420 585140 585998 586585 585683 582650 578401 574350 570842 567184
57715 567184 562736 557435 551605 545785 540407 535314 530002 524532 519690 516007 513274 511281 510300 510516 511705
57700 511705 513836 517260 521889 526961 532049 537613 544137 551379 558880 566526 574352 582438 591134 600494
57686 600494 609487 616948 623495 631028 639969 648620 655872 662746 670145 676911 681820 686169 692445 701161
57672 701161 710781 720327 730417 742005 755465 770746 787278 804032 820801 839005 860140 883736
57660 883736 908035 932251 956989 982854 1010101 1039433 1071643 1106262 1141829 1177793 1215177
57649 1215177 1255133 1297814 1342996 1390989 1442437 1497644 1556401 1618392 1683880 1754156 1830923
57638 1830923 1914953 2005825 2103389 2208909 2324284 2450864 2589610 2741654 2907855 3088533
57628 3088533 3284582 3498140 3731093 3983515 4254681 4544960 4855279 5184839 5530305
57619 5530305 5886776 6248248 6607242 6954912 7281314 7575044 7823984 8018623 8155141
57610 8155141 8234662 8260373 8236532 8168506 8060101 7909808 7711760 7462034 7163942 6828077
57600 6828077 6469457 6104731 5748920 5411957 5098164 4809443 4547850 4314572 4108100
57591 4108100 3925200 3763232 3620549 3495438 3386253 3292610 3215253 3154308 3108092 3073825
57581 3073825 3049339 3034189 3029378 3036071 3054654 3085030 3127351 3181782 3247785 3324625 3412905 3514876
57569 3514876 3632762 3767223 3917716 4083733 4265244 4462346 4675026 4902996 5145200
57560 5145200 5399339 5661842 5927991 6191676 6444891 6677590 6878496 7036915 7144458
57551 7144458 7195279 7185212 7112060 6977695 6789454 6558446 6296287 6013294 5718484 5419664
57541 5419664 5123265 4834759 4558957 4298959 4055014 3825526 3609433 3407124 3219377
57532 3219377 3046321 2887292 2740830 2605092 2479351 2364858 2262924 2172142 2088801 2010295
57522 2010295 1936869 1869720 1808778 1752994 1701802 1655396 1614020 1577411 1544603 1514273 1485916
57511 1485916 1460500 1439167 1421486 1406001 1392321 1381289 1373159 1367094 1362738 1360644 1360813 1362398 1365451
57498 1365451 1371304 1380418 1391530 1404016 1419524 1439874 1464581 1491902 1521224 1552886 1586612 1621915
57486 1621915 1659538 1700841 1746107 1795003 1848462 1908522 1976210 2051093 2133145 2223633 2323576
57475 2323576 2432472 2549410 2674797 2810205 2956830 3114745 3283629 3463505 3654248
57466 3654248 3854412 4061049 4270874 4480937 4687340 4883581 5061212 5212157 5329588
57457 5329588 5406785 5437216 5417283 5348656 5237242 5090442 4915719 4720454 4511515 4294914
57447 4294914 4076488 3862273 3657157 3463372 3281241 3111344 2955150 2813730 2686745
57438 2686745 2573025 2471567 2381783 2303068 2234376 2174404 2122536 2079522 2046601 2023667 2008863
57427 2008863 2000320 1997798 2002353 2014988 2035931 2064559 2099642 2140420 2187848 2244062 2310137 2385140
57415 2385140 2467838 2558377 2657704 2766411 2884979 3014114 3153738 3302481 3459320 3624992
57405 3624992 3800358 3983625 4170052 4353921 4529706 4691726 4833758 4948977 5029842 5068948
57395 5068948 5061285 5005699 4903973 4759752 4579388 4372480 4149470 3918569 3685685 3455964
57385 3455964 3233421 3019536 2814273 2618638 2434905 2264641 2108083 1965153 1835239
57376 1835239 1716143 1605272 1502199 1408354 1323918 1246890 1175644 1110494 1051847 998464 948664
57365 948664 902049 858963 819130 781745 746306 712714 681154 652211 626453 603605 582827
57354 582827 563736 546177 529158 511509 493822 478216 465572 454362 442750 430535 418380
57343 418380 406669 396008 387515 381347 375857 369217 361202 352739 344759 338207 333961 331583 329145 325473
57329 325473 321708 319554 318852 318159 316963 315937 315407 314962 314472 314401 315038 316107 317085 317492 317131 316353 315563
57312 315563 314218 311274 307110 303878 303100 303918 304720 305397 306701 308296 309125 309187 309348 309688 309617 309568 311110
57295 311110 315070 320672 326766 332971 339515 346910 356004 367417 380623 394160 406994 419266 431878
57282 431878 445808 461527 478288 494126 507366 518143 527935 537911 548307 558911 569229 578519
57270 578519 586775 595515 606599 620262 635172 650190 665121 679929 694539 709520 725830 743666
57258 743666 762406 781787 802099 823206 844572 866512 890189 915908 942467 968776 995118
57247 995118 1022124 1049471 1076505 1103629 1132138 1162890 1195719 1230044 1265663 1302970 1342484
57236 1342484 1384001 1426352 1468520 1510944 1555156 1602054 1651185 1701773 1753568 1806338 1859310
57225 1859310 1911783 1963954 2016611 2070064 2123478 2175085 2223163 2267095 2307250 2343395 2373720
57214 2373720 2396304 2411126 2419386 2420996 2414346 2398851 2376067 2347545 2313142 2272683 2228040 2182049
57202 2182049 2136305 2091767 2050920 2017151 1991587 1972159 1956592 1945209 1940024 1941983 1950157 1963112
57190 1963112 1979852 1999273 2019558 2038669 2055293 2069086 2080219 2088860 2094948 2098327 2099362 2099740
57178 2099740 2102365 2109780 2122607 2139989 2161660 2188890 2223070 2263970 2309938 2359383 2411545 2466207
57166 2466207 2523294 2582441 2642442 2701500 2758726 2815147 2872640 2932186 2993598 3056105 3118137
57155 3118137 3177250 3231941 3283497 3334555 3385659 3434573 3479189 3519527 3556358 3589470 3618572
57144 3618572 3644869 3670576 3697404 3726438 3758789 3795167 3834846 3875896 3916581 3956285 3995319
57133 3995319 4034213 4073126 4111793 4150177 4188968 4228931 4269819 4310600 4350700 4390144 4428400
57122 4428400 4464097 4496293 4525114 4550754 4572640 4590010 4602505 4609826 4611666 4608468 4601467 4591537
57110 4591537 4578839 4563981 4548409 4532924 4516654 4498199 4476994 4452890 4425199 4392990 4355698
57099 4355698 4312802 4263538 4207571 4145329 4077152 4002769 3922144 3836246 3746702 3655466 3564861
57088 3564861 3476675 3390604 3304499 3216412 3125227 3029321 2926459 2815593 2696860 2568976
57078 2568976 2428497 2272695 2101160 1913273 1706087 1476457 1223631 947954 648484
57069 648484 323604 -27492 -405829 -813932 -1254667 -1730216 -2243734 -2800219 -3403957 -4056880
57059 -4056880 -4761442 -5523470 -6350435 -7249122 -8227267 -9295521 -10465470 -11747998 -13156227
57050 -13156227 -14708122 -16424252 -18326371 -20441698 -22806121 -25460700 -28449470 -31825662
57042 -31825662 -35657466 -40024572 -45015121 -50733949 -57312534 -64907684 -73695510 -83867355
57034 -83867355 -95612055 -109078591 -124355727 -141499344 -160565374 -181578838 -204454875
57027 -204454875 -228970073 -254829518 -281756174 -309509514 -337819566 -366266325 -394125509
57020 -394125509 -420245743 -443097386 -461068874 -472870440 -477787842 -475678279 -466834674
57013 -466834674 -451882670 -431727710 -407475826 -380309004 -351370228 -321694999 -292173995
57006 -292173995 -263527885 -236297276 -210849152 -187391332 -165994989 -146631387 -129213952
56999 -129213952 -113627135 -99739530 -87413446 -76514455 -66913909 -58485675 -51106631
56992 -51106631 -44661327 -39042661 -34148887 -29885080 -26168238 -22927010 -20095832 -17612773
56984 -17612773 -15423386 -13482944 -11754186 -10205920 -8814185 -7561285 -6432027 -5412234
56976 -5412234 -4490277 -3656852 -2902757 -2219345 -1601309 -1046159 -550088 -106372 292165
56966 651609 978067 1277574 1553673 1806647 2035398 2238253 2411969 2552628 2658647 2731610
56956 2731610 2774070 2788391 2777916 2747019 2699362 2637871 2566925 2492715 2420755 2354516 2296741
56945 2296741 2250146 2216091 2194482 2186518 2196890 2231876 2293608 2373191 2447131 2482593 2451718
56934 2451718 2345081 2173091 1956504 1716969 1473280 1239651 1023750 827675 652118
56925 652118 498261 365585 250719 149910 60641 -20118 -96813 -172466 -246550 -317218 -384232
56914 -384232 -448364 -509439 -566602 -619348 -666877 -707529 -740131 -764890 -781847 -789719 -787609 -776756
56902 -776756 -759256 -735932 -706603 -671361 -630355 -583534 -532185 -479969 -431061 -387872 -351579
56891 -351579 -323676 -305133 -294515 -288501 -284248 -280337 -275986 -270572 -263852 -255837 -246635 -236754 -226750
56878 -226750 -215929 -202393 -185273 -165999 -146305 -125851 -102992 -77145 -49278 -20917 5643 26461
56866 26461 36841 33865 17986 -7215 -36535 -65430 -92051 -116882 -140265 -161302 -179494 -195695
56854 -195695 -210188 -221337 -227807 -231001 -233430 -235522 -235956 -234582 -232961 -232099 -231409 -229950 -227226 -222760
56840 -222760 -216293 -208618 -201080 -194098 -186975 -178959 -169680 -158992 -147405 -136121 -125546 -114269 -100605
56827 -100605 -84376 -65895 -44355 -19323 6747 29808 47989 62252 73552 81846 88195 95380
56815 95380 105293 117398 130510 144462 159251 174275 189548 206358 225696 247237 270646 296626
56803 296626 325749 357666 392714 432981 479981 531496 581770 624461 654845 670353 670849 658717
56791 658717 637801 611958 584639 559151 538252 523411 514860 512310 515422 523901 537567 556285
56779 556285 579814 608089 641771 682117 730174 786326 850065 918894 986944 1045601 1086489
56768 1086489 1104262 1097394 1067862 1020772 963162 901806 841722 786408 738397 698937 667907
56757 667907 644883 629962 623062 622972 627953 637232 651470 671859 699072 732908 772348 815493 859086
56744 859086 897957 925542 936049 926959 899857 859401 811669 762349 714980 670526 629120 591894
56732 591894 560444 535103 515082 500082 490325 485188 483534 485684 493221 506187 522193 539258
56720 539258 557841 578519 598728 613385 618276 611967 595295 570481 540448 507832 474469 442000
56708 442000 412081 385292 360728 337666 316953 299783 285860 273942 263561 254988 248000 241995
56696 241995 236906 232704 228350 222821 217135 213854 214140 216493 218686 219916 220536 220718 220152 218621 216302
56681 216302 213651 211125 208758 206042 202605 198947 195990 193984 192429 190935 189412 187412 184156 179571
56667 179571 174681 170547 167315 164691 162802 161949 161714 161014 159263 157100 155623 154943 153869 151233 147358
56652 147358 143906 142279 142431 143299 144061 144785 146062 148118 150337 151836 152716 154339 157792 162398 166568
56637 166568 169971 173798 178722 183866 188356 192770 198146 204437 211095 218557 227869 238901 249948 259191
56623 259191 265953 270629 274169 277525 280853 283053 282678 279574 275257 271592 269357 268109 267063 265877
56609 265877 264740 263909 263408 263269 263721 264727 265485 265035 263383 261562 260770 262001 266022 272465 279061 283430
56593 283430 286008 289648 295661 302000 306324 308969 311269 312597 311495 308772 306814 305928 303742 298650
56579 298650 291804 285116 279098 273538 268640 264254 259168 252550 245492 239958 236532 234117 231667 229187
56565 229187 226874 224101 220025 215039 210909 209045 209014 209428 210077 212148 216151 220736 224312 226821 228979
56550 228979 230582 230821 229762 228249 226647 224893 223508 223174 223352 222800 221706 221928 224590 228588 232134
56535 232134 234830 237375 239842 241267 241025 240067 240411 243180 247201 250017 250494 249780 249351 249147 248652 248892
56519 248892 251623 256656 261511 264042 264305 263746 263729 265097 267950 271387 274398 277265 281150 286229 291534
56504 291534 296881 303433 311580 319701 326191 331679 337935 345216 352056 357539 362582 368643 375854 382821
56490 382821 388121 391732 394851 398270 401449 403573 405016 406675 408037 407179 403145 397327 391863 387420
56476 387420 383175 378240 372327 365558 358519 352335 347973 345434 343906 342590 341074 339186 336923 334525
56462 334525 332311 330392 328550 326345 323356 319519 315231 310988 307056 303601 300810 298563 296302 293671
56448 293671 291003 288724 286608 284220 281748 279826 278830 278998 280672 283501 285921 286673 286697 288255 292082
56433 292082 296472 299275 299756 298516 296831 296278 297773 300380 301919 301162 298831 296447 295160 295783 298795
56418 298795 303857 310073 316884 324005 330700 336201 340721 344834 348154 350232 352532 357322 364255 370317
56404 370317 374057 377615 383259 389991 395477 399702 404435 410037 415031 418514 421087 423434 425522 427386
56390 427386 429473 431833 433695 434080 432548 429566 426389 424021 421936 418536 413334 407797 403413 399957
56376 399957 396563 393550 391953 391925 392788 394076 395369 395645 394154 391640 389432 387457 384320 379375 373673
56361 373673 368755 365296 362998 361048 358554 355134 351204 347396 343867 340507 337488 335100 333328 332091
56347 332091 331582 331973 333140 335055 338020 342043 346430 350277 352846 353311 351234 347946 346348 348174 352042
56332 352042 355180 356567 357325 358547 359962 360779 360878 361045 362388 365428 369465 373176 375984 378301 380346
56317 380346 381824 383106 385426 389101 392857 395884 399265 404061 409253 413276 416557 420511 424776 427630
56303 427630 429005 430890 434507 438965 443240 447770 453270 459238 464484 468240 470228 470558 470217 470865 473367
56288 473367 476962 480299 482816 484685 486028 487002 488570 492432 499518 508576 516884 523093 529110 538137
56274 538137 550680 563588 573695 581339 589349 599513 611329 623610 635762 647503 658826 670673
56262 670673 684626 701237 719071 735823 750306 763348 776827 791841 807828 823619 838909
56251 838909 853850 867498 878157 885811 892778 900904 909209 915436 919048 921385 923546 925565 927396
56238 927396 929494 932534 937340 944712 954508 965480 977023 990417 1007213 1027024 1048299 1070880
56226 1070880 1096244 1125300 1157315 1191257 1227016 1265052 1305756 1349533 1396939 1448515 1504727
56215 1504727 1565880 1631791 1702042 1777060 1858430 1947642 2045101 2150929 2266031 2391561 2527941
56204 2527941 2675215 2833897 3004915 3189283 3388215 3602691 3832424 4076395 4334758
56195 4334758 4608586 4896779 5194856 5497951 5803208 6107604 6405126 6688342 6951564
56186 6951564 7190514 7400154 7575347 7713002 7811571 7869369 7885789 7863510 7807243 7720945
56176 7720945 7608500 7476115 7330764 7176164 7012935 6842773 6669502 6495375 6318921
56167 6318921 6137620 5950879 5759642 5564808 5366963 5166394 4962829 4756222 4547883
56158 4547883 4339766 4133044 3928940 3730462 3541091 3361643 3190392 3026409 2870864
56149 2870864 2724924 2588404 2460929 2342620 2233286 2132485 2040508 1957624 1882490 1813158
56139 1813158 1749485 1692357 1640638 1591400 1543702 1499807 1461976 1430012 1402417 1377848 1354889
56128 1354889 1332485 1311384 1293394 1278691 1265728 1254121 1245480 1240792 1239122 1239652 1242954 1249441 1258434
56115 1258434 1269463 1282614 1296903 1310389 1322774 1336151 1352344 1371130 1391483 1412536 1432758
56104 1432758 1450367 1465528 1480282 1495552 1510102 1522959 1534632 1545177 1553486 1559764 1566690 1576808
56092 1576808 1590472 1607338 1628068 1653419 1683352 1718091 1758589 1805298 1858151 1918345 1988176
56081 1988176 2068438 2158098 2257358 2368916 2495191 2636192 2790822 2957893 3134516 3315353
56071 3315353 3494539 3666952 3827444 3971486 4097799 4208446 4305785 4391410 4467867 4537487
56061 4537487 4597778 4641090 4661095 4657701 4634580 4594931 4541577 4478064 4406387 4324747 4229482
56050 4229482 4118092 3989551 3844249 3685786 3521143 3357233 3198365 3047706 2908673
56041 2908673 2783253 2671102 2572022 2487422 2417788 2360664 2312672 2271782 2236453 2204869 2176460
56030 2176460 2151980 2130738 2110072 2088895 2069159 2052285 2036728 2020892 2005847 1993290 1983219
56019 1983219 1975498 1971308 1971078 1973232 1976815 1983097 1992942 2004971 2017914 2032165 2047482 2062196 2076599
56006 2076599 2094043 2116446 2141469 2166320 2191435 2218124 2245532 2272607 2300551 2330900 2363477
55995 2363477 2398153 2435939 2476487 2517468 2558295 2601263 2647144 2693352 2738539 2784971 2833863
55984 2833863 2882672 2930195 2980130 3035780 3094957 3154053 3213870 3277431 3344930 3414519 3485435
55973 3485435 3557141 3628367 3700133 3776551 3859621 3946587 4035324 4128399 4228709 4335361 4447308
55962 4447308 4566596 4694148 4826801 4962604 5104626 5255522 5413120 5575702 5746566
55953 5746566 5928512 6118851 6315064 6520464 6738880 6968889 7209014 7463513 7736963
55944 7736963 8028048 8334950 8661821 9013372 9388052 9783361 10203331 10654286 11138146
55935 11138146 11656187 12213599 12813185 13450055 14119524 14824303 15567225 16344472 17154282
55926 17154282 18004704 18903487 19847899 20834630 21872342 22974344 24147218 25398226 26745230
55917 26745230 28205625 29782429 31474193 33291225 35249171 37356025 39621518 42072307
55909 42072307 44743675 47666129 50877391 54438712 58422831 62898344 67947896 73692242
55901 73692242 80274258 87827164 96475538 106349382 117571282 130249470 144518457 160576229
55893 160576229 178661115 199027730 221982311 247885744 277039142 309577131 345454565
55886 345454565 384218047 424233195 461840670 491604352 508148245 508495463 493182696
55879 493182696 465534068 429998624 390770569 351128992 313279090 278457974 247203678
55872 247203678 219641212 195640837 174876250 156901712 141258499 127537095 115390709
55865 115390709 104552189 94848352 86170628 78425208 71519435 65376387 59929565 55101820
55857 55101820 50808103 46975836 43545920 40459195 37660364 35112726 32793411 30676691
55849 30676691 28735434 26954243 25325767 23835927 22465462 21203024 20044061 18979082
55841 18979082 17994711 17083843 16243468 15464746 14735838 14052160 13413626 12814271 12244754
55832 12244754 11702842 11191520 10708763 10248595 9810010 9395153 9000316 8618151 8247622
55823 8247622 7893084 7554786 7228809 6915235 6617968 6337179 6069729 5816196 5579884
55814 5579884 5359433 5149523 4948179 4756865 4574649 4399183 4232302 4077862 3934961
55805 3934961 3799593 3671373 3551830 3437841 3324391 3212984 3109980 3017112 2930677 2849356
55795 2849356 2775109 2706047 2635941 2562235 2488313 2416779 2346347 2276468 2209421 2146407 2086237
55784 2086237 2028875 1976114 1928427 1885315 1848500 1820128 1798057 1777609 1757660 1740196 1724338
55773 1724338 1706222 1684913 1663138 1641751 1618499 1592750 1566419 1539538 1509756 1477091 1444546
55762 1444546 1413029 1380088 1344750 1309494 1276348 1244800 1214500 1186427 1160647 1136249 1113949
55751 1113949 1095305 1079214 1062815 1046037 1031603 1020491 1011216 1003632 999324 998021 997716 998585 1002579
55738 1002579 1008688 1012946 1013841 1013535 1012942 1009860 1003153 994582 985156 973443 958962 943661 928558 912253
55724 912253 894179 876224 859841 844492 829952 817194 806069 795130 784512 775799 768272 758584
55712 758584 745017 728818 710593 689123 664951 641485 620896 602099 584262 568949 557063
55701 557063 546712 536086 525892 517315 509924 502962 496359 489368 480805 471642 464592 460083 455563
55688 455563 449938 445457 443598 442212 438648 432980 426283 418344 409090 399969 392035 384727 378045 373618
55674 373618 372032 371475 370591 370305 371191 371539 369941 367469 365341 362602 358069 352471 346696 339881 331204
55659 331204 321717 312619 303590 294629 287547 283663 281829 280505 279886 280131 279668 277585 275883 276987 280627
55644 280627 285409 291653 299985 308554 314579 317898 320437 322899 324419 325008 325947 327808 330096 332754 336302
55629 336302 340577 344923 349479 354914 360991 366603 371090 374512 376955 378464 379295 379336 377790 374274 369627
55614 369627 364832 359955 355023 351011 348734 347476 345968 344189 343049 342713 342468 342030 341988 343014 345239
55599 345239 348289 351564 354730 358148 362262 366444 369202 369839 369108 368120 367446 367351 367702 367435 365327 361558
55583 361558 357131 351556 342941 330999 318160 306775 296899 287847 280059 273850 267787 260206 251488
55570 251488 243228 235867 228632 221205 214022 207199 200363 193400 186486 179623 172857 166673 161594 157642
55556 157642 154412 151284 147628 143640 140906 140848 142465 143041 141419 139016 137106 134879 131265 127018 123637
55541 123637 121337 119347 117296 115224 113069 111085 109961 109859 110277 111302 113518 115945 115841 111964 106675
55526 106675 103312 102552 102729 102512 101591 99635 96432 92791 89851 87699 85694 83815 82712 82728 83625 84827
55510 84827 85376 84340 81990 79982 79784 81562 84896 89450 94303 97807 99051 98642 97412 95462 93089
55495 93089 91416 91035 91124 90745 90024 89311 88294 86747 85014 83210 81332 80622 82861 87376 90850 91510
55479 91510 91542 93813 98126 102637 107023 111837 116209 118806 120150 121649 123178 123900 124617 126820 129909
55464 129909 131830 132298 133090 135093 137198 138320 138654 138546 137699 135874 133214 129765 125599 121269 117207
55449 117207 113119 108939 105537 103193 100316 95428 89686 85478 82955 80049 75741 71181 67440 64231
55435 64231 61324 59388 58554 57527 55055 51586 48799 47864 48324 48490 47181 45269 44785 46097 47103 46021
55419 46021 43555 41092 38307 34551 31436 31473 34533 37959 40137 41824 43900 45878 47070 47460 46982
55404 46982 45467 43599 42452 41830 40515 38302 36321 35122 34069 32953 32625 33356 33917 32984 30559 27600
55388 27600 25150 24041 24425 25296 25321 24322 23203 22600 22541 23181 24647 26275 27184 27497 27857 28053 27529 26964
55370 26964 27643 29290 30151 29444 28207 27623 28040 29747 32900 36293 37921 37396 36306 35727 34980 33522
55354 33522 32410 32824 34293 35431 35609 35190 34878 35349 36731 38142 38581 38417 38868 39961 40457 40195 40879
55337 40879 43705 47530 50318 51229 50394 47799 43663 39249 36127 34795 34652 34962 35353 35624 35595 35031 33747
55320 33747 31985 30410 29203 27616 25263 23302 23047 23828 23770 22566 21712 21863 21805 20645 19220 18467 17880
55303 17880 16601 14722 12530 9620 5952 2911 2264 4530 8866 13741 17248 17975 16546 15473 16528
55288 16528 18805 19999 18833 15699 11874 8925 8030 8876 9683 9035 7249 5608 4983 5715 7883 10952
55272 10952 13855 16134 18284 20395 21321 20068 17313 14746 13418 13403 14429 16022 17486 18453 19173 19854
55256 19854 20273 20408 20716 21195 20854 18846 15732 13062 12076 13042 15246 17254 17982 17898 18487 20165 21571
55239 21571 21330 19652 17705 16391 16271 17631 19813 21342 21477 20893 20235 19078 17113 15279 14589 14730
55223 14730 14873 15127 16034 17395 18766 20436 22569 24003 23467 21716 20969 22182 24158 25477 26000 26119
55207 26119 25680 24517 23394 23576 25460 28010 29663 29718 28729 27563 26352 24687 22491 20129 17929 16410
55191 16410 16737 19655 23757 26135 25473 23467 22459 22676 22755 22071 21396 21732 23450 26141 28530 29076 27577
55174 27577 25701 25182 26007 27226 28745 31006 33367 34323 33523 32357 32218 33007 33725 33913 34126 35231 37433
55157 37433 39908 41403 41300 39898 37808 35641 34308 34649 36295 37676 37862 37640 38062 38776 38847 38547 39006
55140 39006 40318 41298 41207 40677 40647 41263 42166 43167 44132 44598 44090 42877 42141 42991 45177 47087 47477 46957
55122 46957 47110 48329 49444 49557 49089 48645 47947 46686 45599 45793 47393 49384 50388 49365 46369 42961
55106 42961 40937 40192 38910 36404 34405 34586 36176 37287 37435 37189 36401 34714 33256 33801 36159 38041
55090 38041 37806 36159 34982 35526 37758 40463 41908 41296 39593 38207 37266 36168 35351 36047 38244 40255
55074 40255 40584 39320 37560 36385 36393 37297 37895 37300 36203 36084 37376 39348 41569 44207 47007 49341
55058 49341 51445 54264 57736 60395 61096 60063 57913 54865 51479 49155 49106 51398 55354 60097 64416
55043 64416 67025 67585 66924 65875 64584 63201 62418 62838 64432 66938 70086 73201 75466 76985 78678
55028 78678 80689 81998 82263 82941 85398 88698 90600 90401 89446 88896 88363 87196 85940 85599 86013 86170 86098
55011 86098 87366 90959 95364 97873 97708 96656 96302 95914 94044 91154 89108 88423 87698 86078 84782 85459
54995 85459 87910 90277 90950 89570 86567 82555 78270 74680 72731 72696 73629 73782 72087 69128 66244 63888
54979 63888 61528 59110 57744 58619 61752 66114 70420 73563 74787 74078 72316 70765 70365 71430 73750
54964 73750 76792 79915 82518 84151 84721 84634 84421 84187 83863 83893 84890 86362 86840 85904 85037 85508 86331 85631
54946 85631 83371 81248 80355 80603 82179 85702 90678 95352 98588 100543 101230 100017 97117 93965 91259
54931 91259 88046 83849 80384 79745 81750 84434 86550 88226 89549 89989 89353 88286 87547 87311 87288 87046
54915 87046 86377 85786 86481 89371 94124 99562 104731 109160 112405 114206 115217 116888 120148 124408 128279
54900 128279 131240 134291 138766 144802 151399 157868 164604 172222 180697 189894 200358 212759 226874
54887 226874 241868 257297 273068 288769 304023 319220 334680 349109 360024 365802 366408 362254
54875 362254 353744 342057 328856 314660 298823 281621 264947 250124 236354 222355 208379 195499
54863 195499 184007 173882 166013 161348 159144 157457 155304 153319 152377 152645 154060 156830 161068 166372
54849 166372 172015 177572 183569 191520 202619 216138 229859 242637 255758 271104 288684 306714
54837 306714 323311 337028 346398 350402 349338 344210 335322 322358 305734 286953 267599 248804
54825 248804 231535 216352 202695 189297 175734 162990 152216 143477 136014 129407 124084 120684
54813 120684 118968 117480 114700 110587 106576 103865 102370 101584 101487 101864 101668 100119 97846 95718 93126
54798 93126 88872 83606 79793 78977 80298 82074 83677 85314 86983 88383 89251 89289 88340 86977 86261 86346
54782 86346 85948 83838 80484 77715 76968 78234 80417 82304 83439 84347 85789 87605 88589 87744 85445 83084
54766 83084 81750 81495 81713 81942 82208 82704 83346 83910 84626 86175 88782 91725 94275 96757 100007 104044
54750 104044 108102 111949 116199 121150 126228 131059 136251 142415 148876 154237 158221 162515 169596 180708
54736 180708 194779 209365 222908 236043 250461 266765 284039 301269 318136 334235 348709
54725 348709 361150 371805 379973 383242 379761 370955 360601 351194 342270 332429 321720 311424 302330
54712 302330 293969 285224 275314 264566 254614 247391 243452 241493 239827 237995 236616 236167 236617 238050
54698 238050 240966 245819 252734 261648 272445 284964 299250 315733 334616 355075 375586 395298
54686 395298 414771 435242 457451 481013 504165 523941 537424 543602 543662 539068 529844 515356 496256
54673 496256 474701 452651 430675 408468 385892 363359 341701 321792 303916 287542 272096
54662 272096 257819 245349 234708 225480 217795 212181 208321 204965 201354 197793 194467 190812 186723
54649 186723 183360 181662 180825 179349 177173 175553 175141 175395 175851 176730 177928 178542 178090 177436 177710 178677 178976
54632 178976 178030 177068 177877 180698 183748 184971 184068 182484 181611 181678 182513 184471 187794 191551 194291 195783
54616 195783 197306 199990 203653 207661 212292 218535 226735 236041 245291 254099 262851 271882 281031 290100
54602 290100 299377 309142 318687 326502 331893 335921 340137 344673 348379 350742 352758 355552 358947 361936
54588 361936 364066 365667 367074 368477 370576 374620 381363 390411 401011 413183 427517 443910 461165
54575 461165 478126 494737 511523 528291 543939 557532 568914 577973 583692 584429 579116 568002
54563 568002 552321 533335 511677 487706 462564 438556 417809 400518 385231 371149 359276
54552 359276 350584 343830 336595 328505 322113 319926 321418 323858 325564 327158 329590 332098 332910 331336
54538 331336 328100 323691 317481 308986 299228 289931 281668 273544 264728 255526 246877 239319 232584 225734
54524 225734 217717 208424 199265 191962 186584 181533 175696 169654 164278 159201 153668 148203 144240 142371
54510 142371 141991 142535 143924 145650 146447 145451 143115 140490 137932 134941 131195 127416 125104 125230 127168
54495 127168 129168 130087 130339 130928 132059 133272 134487 136022 137683 138766 139221 140062 142171 145234 148343
54480 148343 151291 154704 158928 163261 166603 168809 171161 175234 181310 188272 195126 202085 209718 217633
54466 217633 225012 232347 241447 253079 265357 275434 282458 287842 292499 294989 293242 287360 279404
54453 279404 270530 259897 247000 233674 222389 213385 205162 197320 191008 186376 181680 175802 169976
54440 169976 165748 162579 158961 154907 151656 149616 148289 147786 148552 149601 148884 145971 142937 141915 142727
54425 142727 143592 143287 141952 140370 139096 138047 136600 134351 131862 130317 130487 132341 135423 138981 141988
54410 141988 143916 145439 147481 149564 150112 148552 146145 144442 143830 143847 143886 143101 140727 137383 135270 136124
54394 136124 139176 141873 142416 141103 139416 138320 137427 135614 132484 129104 126942 126209 125884 125358 125150 125715
54378 125715 126496 126711 126419 126118 125753 124829 123181 121120 119094 117740 118013 120581 125009 129800 133319 134771
54362 134771 134616 134128 134280 135005 135854 137052 139142 141637 143077 142850 142160 142749 145410 150140 156718 164181
54346 164181 170524 174165 175667 177242 180627 186014 192797 200612 209599 220113 232117 244590 255919
54333 255919 265436 274296 284156 295099 305498 313926 320505 326253 331633 336098 338711 338809 336082 330399
54319 330399 321989 311923 301999 293603 286758 280618 274657 268765 262466 255102 247047 239790 234338 230256
54305 230256 226727 223741 221702 220651 220503 221222 221941 220736 216484 210497 205238 201701 199098 196752 195042
54290 195042 194459 194998 196763 200170 205080 210560 215979 221725 228343 235550 242754 250218 259017 269619
54276 269619 280903 290907 298621 304690 310104 314531 316635 316048 314039 311790 308887 304282 298003 290906
54262 290906 283199 274415 264669 254857 245569 236816 228822 221905 215299 207275 197104 186136 176290 168044
54248 168044 160500 152809 144920 137365 131048 126942 125218 124720 123919 122374 120764 119361 117126 112820 106783
54233 106783 101135 98001 97643 98420 98367 96692 94038 91824 91355 92981 95709 97898 98671 98479 98140 97842
54217 97842 97488 97490 98374 99691 100093 98681 95805 92535 89928 88877 89945 92775 95979 98063 98536 98002
54201 98002 97431 97496 98450 100267 102722 105367 107600 108924 109122 108078 105675 102308 99350 98227 98706 98910
54185 98910 97598 95743 95090 95916 97349 99265 102210 105422 106710 105070 102181 100364 99943 99655 98957 98698
54169 98698 99658 101401 102712 102730 101735 101272 103224 108039 113774 117434 117469 114780 111444 108921 107414 106398
54153 106398 105459 104760 104798 105596 106300 105883 104212 102083 100234 98791 97733 97414 98181 99773 101465 102791
54137 102791 103805 104692 105405 105774 105737 105232 104016 101892 99238 97094 96402 97068 98021 98311 97981 97557 96941
54120 96941 95421 92970 90931 90752 92289 94031 95066 96203 98834 103146 107811 111127 112184 111314 109858
54105 109858 109140 109186 108669 106684 104247 103270 104192 105548 105985 105687 105354 104804 103437 101561 100293 100275 101244
54088 101244 102799 104813 106918 108232 108062 106542 104270 101463 97961 94051 90897 89697 90475 92061 93327
54073 93327 94057 94399 94074 92695 90458 87819 84782 81416 78808 78296 79545 80595 80270 79502 79649 80577
54057 80577 81299 81553 81628 81233 79832 77810 76213 75421 74945 74413 73956 73774 74062 75233 77403 79840 81676
54040 81676 82942 84148 85198 85667 85821 86185 86336 85515 84417 84829 87043 89103 89310 88255 87454 87021 85902
54023 85902 83865 82090 81834 83172 84945 85580 84206 81417 78864 77977 79284 82691 87530 92174 94747
54008 94747 94943 94421 94722 95539 95879 96116 97631 100711 104053 106394 107591 107938 107487 106586 106373 107960 111327
53991 111327 115399 119052 121730 123343 124137 124846 126528 129740 133843 137657 141023 145238 151406 158623 164619
53976 164619 168196 170317 172704 176234 181051 187285 194780 202614 209753 216070 222223 228801 236030 243903
53962 243903 251932 259135 265059 270525 276533 282750 288206 293271 299487 307024 313739 317744 319924 322641
53948 322641 326498 329656 330227 328180 324740 320964 317285 313669 309746 305358 301376 299260 299247 299545 298080
53933 298080 294625 290468 286433 282239 277700 273368 269599 265841 261339 255998 250222 244534 239757 236793
53919 236793 235578 234666 232533 228994 224934 221198 218439 217478 218726 221243 223216 223586 222792 221965 221900 222678
53903 222678 223681 223992 223323 222477 222391 222886 223139 223267 224487 227370 230794 233130 234079 234898 237050 240852 245204
53886 245204 248608 250682 252678 256216 261633 267981 274408 280894 287770 295251 303506 312397 321031 328241
53872 328241 333751 338291 342564 346793 351160 355531 358507 358102 354255 349802 347915 348951 350662 351194 351035
53857 351035 352031 355199 359820 364421 368370 372214 376456 380602 384094 387741 393087 400306 407883 414733
53843 414733 421558 429524 438467 447037 453933 458445 460584 461313 461884 462281 461053 457413 452777 449395 447991
53828 447991 447392 445745 441292 432865 420917 407759 395857 386121 378277 371874 365845 358173 347770
53815 347770 336290 326417 318440 310141 300127 289585 280251 272183 264362 256445 249030 242828 238240
53802 238240 235229 233046 230501 226903 222490 217783 213070 208817 205962 205157 205746 205832 203561 198675 192879
53787 192879 188366 185707 183607 180964 178392 176975 176390 175478 174183 173457 173372 172751 170838 168072 165011 161810
53771 161810 159083 157952 158608 159981 161308 162880 164703 165837 165917 166073 167146 168074 167397 165578 164418 164711
53755 164711 165851 167417 169671 172545 175386 177812 179825 181032 180886 179933 179804 181527 184593 187991 191380
53740 191380 194962 199036 204225 211379 220449 229843 237621 243176 247251 250651 253745 257233 262438 270222
53726 270222 279855 289440 297320 302809 305834 306653 306127 305606 305919 306584 306478 305189 303380 302044 301840 302871
53710 302871 304367 304641 302239 297435 291904 286666 281099 274332 266733 259285 252385 246205 241598 239298
53696 239298 238403 236990 234449 232103 231108 230796 229705 227470 224851 222401 219996 217550 215492 214389 214406
53681 214406 215095 215476 214579 212372 210108 209301 210324 212303 214326 216321 218643 221344 224207 227289 230986
53666 230986 235434 240074 244048 247078 249782 252879 256056 258033 258055 257022 256582 257176 257600 256692 254699 252510
53650 252510 250175 247158 243938 242345 243781 247629 251832 254708 255882 255904 255608 255732 256524 257558 258265 258841
53634 258841 260319 263535 268145 272791 276121 277670 278064 278608 280413 283498 286709 288747 289453 289950 291477
53619 291477 294227 297433 300366 302946 305534 308473 312006 316314 321287 326280 330299 332586 333141 332821 332864
53604 332864 334034 336109 338366 340480 342548 344158 344168 342017 338769 336114 334489 332884 330323 326739 322412
53589 322412 317488 312279 307280 302625 298240 294733 293152 293379 293772 293098 292007 291793 292600 293964 296400
53574 296400 300860 306759 311972 314985 315953 315592 314346 313089 313273 315416 318203 320003 320797 321926 324349
53559 324349 327941 332195 336807 341540 346113 350350 354135 357268 359666 361679 363936 366888 370689 375269
53545 375269 380227 384912 389095 393537 399393 406985 415469 423804 431561 438658 444802 449830 454373 459576
53531 459576 465862 472350 477779 481830 485249 488815 492504 495636 497556 498172 498160 498681 500502 503159 505330
53516 505330 506207 506242 506348 506794 507266 507710 508519 509879 511387 512477 512969 513197 513777 515264 517733 520627 523085
53499 523085 524560 525195 525750 527155 529850 533485 537500 541968 547397 553556 559108 562906 565263 567560 570995
53484 570995 576140 583148 591562 600207 608031 615049 621933 629072 636675 645418 655856 667199 677739
53471 677739 686790 695356 704624 714648 724963 735766 747824 761570 776603 791832 806010 818682
53459 818682 830805 843961 858793 874723 891348 909339 929600 952094 975848 999648 1022462
53448 1022462 1043943 1065107 1087969 1113849 1142214 1171540 1201004 1231064 1262761 1296683 1332212
53437 1332212 1367657 1401741 1435172 1469907 1506504 1543183 1578139 1611763 1645628 1680275 1715345
53426 1715345 1751151 1788320 1826007 1862269 1896651 1930828 1965927 2000574 2032748 2062760 2092982
53415 2092982 2124855 2157369 2188666 2218163 2246668 2275031 2303299 2331039 2357901 2383660 2407861
53404 2407861 2429609 2447810 2461774 2471717 2478615 2483376 2486070 2486092 2483026 2477192 2469273 2459623 2448048
53391 2448048 2434095 2417480 2398542 2378371 2358001 2337113 2314059 2287864 2259874 2232574 2206794
53380 2206794 2180916 2152933 2122490 2090790 2059435 2029775 2002451 1976806 1951290 1925159 1899370
53369 1899370 1875373 1853595 1833785 1816155 1801154 1788510 1777558 1768345 1761319 1755963 1750956 1745998
53357 1745998 1742305 1740801 1740963 1742273 1745702 1752356 1761212 1769937 1778142 1788327 1802829 1820975 1840331
53344 1840331 1859911 1880767 1903812 1928682 1955099 1983976 2016339 2051971 2089844 2129285 2170026
53333 2170026 2211830 2254935 2300416 2349211 2401119 2455507 2512387 2571808 2632658 2693423 2753965
53322 2753965 2815272 2877545 2940011 3002754 3067017 3133013 3198840 3262491 3323878 3383839 3442073
53311 3442073 3497238 3548670 3596962 3643006 3686983 3728038 3764514 3794957 3819309 3838663 3853563
53300 3853563 3863163 3866386 3863103 3853628 3837901 3815839 3787825 3754186 3714914 3670511 3622389 3571761
53288 3571761 3518917 3464229 3408836 3353419 3297296 3239824 3181784 3124163 3066528 3008117 2949770
53277 2949770 2893235 2839083 2786896 2736895 2689543 2643942 2598617 2553813 2511034 2470302 2430046
53266 2430046 2390206 2353214 2320849 2291908 2264175 2237237 2211988 2188634 2166801 2146941 2130101
53255 2130101 2116359 2104404 2092546 2079602 2065176 2049730 2034109 2018631 2002984 1987274 1972460
53244 1972460 1959239 1947213 1935844 1925611 1917432 1911338 1906614 1903020 1901177 1901724 1904685 1909667 1916338
53231 1916338 1924639 1934693 1946437 1959397 1973257 1988707 2007297 2030128 2056945 2086523 2117404
53220 2117404 2148236 2178111 2207071 2235888 2264984 2293946 2322240 2349782 2376517 2401995 2425702
53209 2425702 2447286 2466121 2481280 2492456 2500520 2506754 2511835 2515675 2517619 2516552 2511543 2502774 2491293
53196 2491293 2477701 2461883 2444160 2425447 2405664 2383292 2357521 2329690 2301381 2272113 2240447
53185 2240447 2206650 2172579 2139300 2106566 2074481 2043836 2014549 1985464 1956350 1928676 1903752
53174 1903752 1881221 1860128 1840189 1821072 1801463 1780230 1758052 1736811 1717629 1700388 1684978
53163 1684978 1671886 1661338 1652558 1644352 1636233 1628789 1623028 1619267 1616604 1613612 1609636 1604990 1599719
53150 1599719 1592759 1582993 1570758 1557585 1544490 1531231 1517269 1502700 1487889 1472797 1457178 1441175
53138 1441175 1425285 1409843 1394845 1380122 1365423 1350331 1334337 1317081 1298544 1279140 1259578
53127 1259578 1240383 1221495 1202519 1183368 1164116 1144193 1122426 1098405 1073292 1048761 1025646
53116 1025646 1004219 984954 967783 951038 932768 913296 894952 878776 863032 845909 828284
53105 828284 812371 798547 785132 770965 756638 743141 730541 718244 705622 692223 678198
53094 678198 664614 652543 641714 630876 619476 608158 597501 587194 576692 565914 555135
53083 555135 544915 536140 529180 522906 515663 507517 500407 495696 492717 490281 488300 487055 485988 484305
53069 484305 481857 478358 472800 465226 458351 455475 456723 458934 459477 458670 457968 457357 455872 453835 453068
53054 453068 454707 457784 460506 462567 465616 471358 479587 488446 496392 503366 510013 516515 522675 528576
53040 528576 534330 539259 541944 541229 536852 529259 519302 508096 496546 484779 472558 460461 450114
53027 450114 442559 436610 429631 420189 409431 399427 390718 382255 373391 364693 356524 348125 338983 330167
53013 330167 323020 317051 310541 303074 296114 291021 287821 286071 285458 285038 283279 279705 275413 271240 266651
52998 266651 261351 256714 254177 253079 251561 249049 246456 244330 242297 240238 238577 237263 235609 233352
52984 233352 230837 228114 224892 221679 219833 219885 220565 220052 217726 214291 210683 207414 204744 202962 202351
52969 202351 202847 203846 204542 204612 204326 203870 203039 201817 200739 200076 199202 197463 195408 194259 194230 194120 192694
52952 192694 190011 187332 186065 186766 188929 191731 194918 198448 201429 202552 202104 202408 205269 209778 213680
52937 213680 216069 217552 218537 218975 219349 220356 221756 222910 224150 226145 228141 228533 227172 225495 224442
52922 224442 223920 224272 226109 228446 229226 228471 228793 231763 235890 239484 243498 249662 257444 264983 271961
52907 271961 279433 287468 294979 301635 308290 315593 323603 332619 343001 354142 364747 374156 382449
52894 382449 389549 395279 400096 404641 408630 411160 411875 410845 407727 402370 396111 390911 387047 382983
52880 382983 377803 372381 367658 362980 357059 349734 341972 334689 328274 322863 318426 314641 311017 307105
52866 307105 302661 297940 293855 291400 290756 291145 291431 290608 288298 285420 283942 284819 286314 285569 282004 277984
52850 277984 275811 275274 274813 273868 272981 272415 271938 271699 272210 273523 275165 276968 279239 281953 284233 284873
52834 284873 283392 280770 279197 280564 284666 289166 291751 292059 291192 290016 288843 288346 289439 291912 294204
52819 294204 295162 295418 296448 298751 301686 304691 307765 310655 312437 312468 311410 310808 311700 314013 317170 320814
52803 320814 324723 328362 331036 332521 333307 334117 335295 336662 337794 338442 338934 340301 343743 349600 356839
52788 356839 363837 369843 375587 382406 390859 400234 409233 417012 423662 429922 436541 443852 451860 460574
52774 460574 469951 479333 487207 492018 493435 492606 491091 489712 488418 486683 483707 478750 472028 465164
52760 465164 459956 456344 452060 444715 434074 422171 411461 403129 396846 391560 386235 380157 373041
52747 373041 365308 358131 352596 348379 343582 336466 327245 317693 309263 302383 297496 295429 296021 297269
52733 297269 296896 294487 291334 288500 285975 283543 281446 279829 278286 276476 274753 273655 272960 271743 269428
52718 269428 266521 264045 262337 260652 258147 255013 252129 249693 246862 243170 239648 237814 237801 238175 237505
52703 237505 235548 232907 230284 228215 226933 226016 224498 221677 217736 213470 209581 206293 203419 200698
52689 200698 198184 196355 195611 195651 195536 194480 192484 190192 188260 186791 185334 183514 181622 180224 179085
52674 179085 177062 173574 169676 166923 165402 163786 161343 159069 158586 160518 164148 168085 171044 172569
52660 172569 173319 174212 175085 174790 172835 170293 168612 168047 167785 167252 166768 167144 168968 172110 175621 178347
52644 178347 179831 180391 180361 179928 179801 181099 183955 187056 189439 192203 197333 205080 213549 220985 227532
52629 227532 234500 242580 251172 259105 265693 271284 276758 282383 287342 290644 292096 291854 289471 284380
52615 284380 277244 269844 263262 256903 249704 241670 233771 226787 220740 215233 209954 205018 200902 197793
52601 197793 194941 191137 185960 180101 174236 168201 161698 155397 150752 148866 149657 151711 152806 151338
52587 151338 147897 144911 143933 143692 141708 137541 133368 131231 130875 130748 130220 129993 130773 132348 133878 134569
52571 134569 134131 133058 132442 133069 134674 136394 137826 139113 140023 139837 138632 138025 139597 142707 144822 144297
52555 144297 142171 140756 141102 142464 143688 144186 143756 142438 140808 139673 139160 138647 137792 137031 136811 136949
52539 136949 137134 137410 137667 137293 135954 134245 132907 131910 131090 131254 133559 137818 142404 145950 148457 150638
52523 150638 152928 155283 157309 158512 159057 160242 163239 167256 170028 170507 170089 170688 172617 175149 178068
52508 178068 181534 184988 187435 188626 189080 189249 189481 190391 192168 193790 194068 193426 193498 194900 196575 197544
52492 197544 198100 198898 200031 201597 204109 207571 211008 213782 216501 219754 222715 224149 224227 224138 224308 224356
52476 224356 224577 225964 228484 230689 231537 231562 231698 232009 232338 233352 235857 239515 243102 245806 247600 248624
52460 248624 249014 249201 249633 250247 250808 251644 253360 255856 258357 260435 262291 263869 264557 264099 263290 263292 264584
52443 264584 266723 268656 269203 267963 266061 265300 266148 267236 267311 266877 267077 267783 267985 267668 267921 269130 270287
52426 270287 270510 270306 270764 272115 273651 274684 275216 275889 277500 280296 283674 286766 289211 290936 291549 290749
52410 290749 289290 288540 288904 289678 290740 293197 297650 302812 306869 309571 311929 314360 316333 317594 318563
52395 318563 319391 319664 319442 319740 321363 323599 324698 323770 322036 321960 324974 330051 334798 337837 339709 341511
52379 341511 343498 345395 347242 349167 350922 352396 354145 356542 358718 359304 358064 355954 353720 351369
52365 351369 349052 347455 346923 346918 346801 346742 347556 349777 352940 355634 356612 356227 356435 358761 362538 365745 367345
52348 367345 368021 368959 370728 373184 375541 376654 376180 375425 376061 378064 379802 380093 379042 376981 374035 371046
52332 371046 369449 369585 370150 369861 368646 366814 364318 361460 359041 356987 354088 350159 347388 348148 352089
52317 352089 356451 358780 358450 356307 354023 353307 354498 356064 356299 355197 353871 352771 351579 350563 350846
52302 350846 353271 357735 363408 368940 372868 374788 375922 377724 380187 382299 383763 385326 387655 390842
52288 390842 394714 398676 401708 403628 406072 410889 417726 424556 430513 436657 443699 450563 455943 460001
52274 460001 463695 467383 471002 474898 479530 484612 489128 492111 493331 493760 495510 500455 508395 517137
52260 517137 524911 532146 540297 549520 558433 566059 573181 581448 591654 603335 615945 629832 645755
52247 645755 663706 682800 702202 721455 739922 757021 773576 791844 813213 836626 860327
52236 860327 884318 909631 935937 961844 987472 1014756 1044694 1076025 1107360 1139014 1171778
52225 1171778 1205210 1238331 1271137 1304274 1337745 1370750 1402277 1431270 1457009 1480139 1502543
52214 1502543 1525330 1547517 1567465 1584924 1600660 1614752 1626450 1635469 1642360 1647653 1651395 1653366
52202 1653366 1653159 1650386 1645581 1640446 1636240 1632324 1627479 1622442 1619690 1620376 1622772 1624417 1624898 1625637 1627636
52187 1627636 1630549 1633888 1638132 1644240 1652545 1662616 1673982 1686500 1700041 1714507 1730392 1748695
52175 1748695 1769594 1791526 1812441 1831825 1850663 1869468 1887341 1903259 1917160 1929336 1939745
52164 1939745 1948579 1956436 1962935 1966029 1963993 1957645 1949384 1940304 1929484 1915928 1899775 1881275 1859899
52151 1859899 1835251 1808211 1780530 1753596 1727792 1702516 1676547 1649026 1620595 1593174 1568183
52140 1568183 1545195 1522649 1499550 1476052 1452707 1429833 1407725 1386947 1368097 1351426 1336864
52129 1336864 1324231 1313141 1302855 1292744 1283030 1274623 1267839 1261685 1254954 1247729 1241116 1235707 1231111
52116 1231111 1226983 1223441 1220221 1216444 1211730 1206683 1201669 1196113 1189795 1183868 1179428 1175761 1171296 1165835
52102 1165835 1160453 1155531 1150360 1144764 1139572 1135160 1130840 1126196 1121812 1117989 1113829 1108489 1102564 1097401
52088 1097401 1093577 1090734 1088391 1086211 1083982 1082072 1081376 1082035 1082642 1081544 1078715 1075605 1073455 1072541 1072653
52073 1072653 1073271 1073389 1072350 1070970 1070758 1071739 1072122 1070603 1067953 1065686 1064139 1062807 1061854 1062072 1063714 1066389
52057 1066389 1069814 1073660 1076960 1079129 1081561 1086711 1095045 1104293 1112540 1120869 1131826 1146245 1162996
52044 1162996 1181287 1201517 1223754 1246775 1269357 1291901 1316283 1344281 1376163 1410585 1446058
52033 1446058 1482632 1521487 1562485 1603165 1641306 1677656 1714495 1752048 1788349 1822615 1856387
52022 1856387 1890500 1923038 1951687 1976647 1999588 2020873 2039439 2054695 2066822 2075457 2079609 2078965
52010 2078965 2074376 2067071 2058062 2047945 2036496 2022802 2006562 1988752 1970287 1950867 1930181 1909440
51998 1909440 1890229 1872430 1854875 1837627 1821818 1807479 1793595 1780550 1770416 1764028 1759677 1755879
51986 1755879 1753843 1755691 1761315 1768567 1775904 1783266 1790717 1797867 1805051 1813876 1825914 1841237 1858505
51973 1858505 1876006 1892326 1906550 1918546 1929153 1939482 1949574 1957988 1963202 1965328 1965827 1965447 1963317
51960 1963317 1958435 1951161 1942380 1931861 1918480 1901765 1882165 1860072 1835608 1809276 1781656 1752376
51948 1752376 1720390 1685431 1648293 1609750 1570256 1530784 1492620 1455861 1419171 1381504 1343126
51937 1343126 1304616 1265969 1227262 1189117 1151858 1115236 1079674 1046613 1016664 988292 959519
51926 959519 930282 902028 875536 850237 825315 800401 775411 750691 727216 705814 686226
51915 686226 667648 650114 634576 621598 610501 599873 588548 576228 563495 551023 538578
51904 538578 525268 511124 497809 487073 478974 472235 465821 459253 451882 443015 432878 422603 413119
51891 413119 404569 396687 389063 381236 373278 366253 361279 358019 354757 350145 344350 338557 334009 331499
51877 331499 330987 331355 331042 329322 326717 324146 322008 320106 317989 315282 312158 309562 308586 309439 311248
51862 311248 312833 313450 313012 312171 312067 313342 315228 316126 315233 313241 311362 310114 309140 307743 305415 302100
51846 302100 298151 293879 289344 284733 280570 276935 272847 267410 261591 257892 257713 259775 261629 262168 262060
51831 262060 262159 262268 261473 259221 255945 252834 250890 249947 248641 245624 240957 236225 233256 232633 233379 233962
51815 233962 233577 232508 231521 231171 231567 232374 232990 233172 233591 235146 237471 238870 238355 237077 236864 237856 238755
51798 238755 239247 240893 245219 251757 258403 263116 265043 264683 263436 262618 262663 263463 265209 268190 271888 275278
51782 275278 278201 281486 285422 289163 292060 294556 297170 299635 301816 304364 307351 309299 308977 307476
51768 307476 306785 306733 305128 301046 296138 292144 288809 285232 281883 279851 278935 277969 276811 276688 278434 281281
51752 281281 283605 284241 282973 280493 278103 276845 276604 276459 276142 276490 278114 280242 281576 282001 282650 284294
51736 284294 286394 287932 288579 288643 288296 287477 286444 285925 286536 288264 290611 293007 294976 296131 296364 296071
51720 296071 295909 296055 295800 294195 291214 288004 285773 284589 283553 281945 279790 277474 275422 274319 274989
51705 274989 277545 280991 284105 286526 288581 290367 291639 292528 293578 294791 295205 294018 291892 290565 291101
51690 291101 292967 295048 297157 299986 303664 307106 309348 311129 314410 320284 327918 335650 342548 348681
51676 348681 354598 361097 368991 378341 388085 397028 405164 413511 422743 432682 443246 455254 469719
51663 469719 486479 503851 519768 533322 545199 556558 567544 577018 583715 587268 588093 586828 584156
51650 584156 580666 576431 571060 564579 557894 551989 547124 543283 540747 539513 538747 537803 537354 538507 541138
51635 541138 544238 547519 551245 554684 556515 557172 559156 564213 571510 579367 587476 596364 605783 614941
51621 614941 623617 632026 640185 648259 656597 664327 669015 669479 668320 669724 674783 680739 685036 688231
51607 688231 692220 697218 701788 704991 707277 709679 713061 718035 724875 733392 743041 753005 762147 769477
51593 769477 775006 779694 784227 788237 791101 792866 793787 793426 791060 786757 781227 774591 766229 756117
51579 756117 745441 735241 725016 713536 700794 688156 676445 664887 652588 640269 629508
51568 629508 620584 612210 603443 594676 586261 577289 566803 555572 545600 537979 532077 526658 520938 514623
51554 514623 507919 501662 496563 492052 486762 480519 474950 471468 469429 467098 463853 460428 457321 454124
51540 454124 450531 447110 444704 443651 443807 444681 445204 444133 441380 438558 437409 437763 437806 436465 434790 434637
51524 434637 436573 439626 442651 445316 447961 451261 456094 463031 471649 480799 489804 498863 508132 517129
51510 517129 525652 534595 544815 555407 564069 569384 571894 572766 572229 569790 565359 559520 553012 546501
51496 546501 540502 534956 529092 522277 514909 507977 501876 496348 491543 488302 487028 486989 487360 488523 491567
51481 491567 496673 502818 509183 516027 523709 531549 538504 544783 551936 561097 571752 582462 592263 600885
51467 600885 608004 612986 615454 615742 614637 612773 610207 606522 601572 596282 592334 590560 589876 588394 585583
51452 585583 582792 581529 581799 582340 582019 580647 578850 577604 577706 579193 581195 582567 582731 581838 580241 578038
51436 578038 575087 571391 567390 563705 560364 556355 550457 542735 534883 528643 524012 519244 512540 503556
51422 503556 493447 483902 476164 470601 466834 464217 462327 461175 461093 462343 464658 467267 469643 472197
51408 472197 475813 480605 485600 489972 494156 499294 505849 513375 521504 530540 540899 552386 564280
51395 564280 575892 586882 597280 607451 617965 629323 641636 654426 666773 677916 687928
51384 687928 697569 707235 716293 723753 729361 733519 736305 737275 736406 734628 733078 732090 731207 729867 727879
51369 727879 725596 724012 724505 727995 734279 742285 750872 759290 767119 774167 780551 786741 793341 800578
51355 800578 807754 813301 815772 814952 811819 807480 802466 796993 791194 784901 777858 770613 764522 760221
51341 760221 756611 752176 746906 741970 737717 733199 727819 722386 718076 715219 713581 713007 713000 712377 710370
51326 710370 707900 706923 708376 711233 713583 714247 713570 713146 714673 718472 723019 726407 728201 729336 730229
51311 730229 729717 726202 719164 709081 696363 681119 663949 646293 629723 614940 601492 588342
51299 588342 574767 560910 547524 535111 523389 511673 499683 487816 476596 466006 455534
51288 455534 444861 434442 425236 417778 411652 405959 400178 394356 388662 383228 378461 374955 372724 370802
51274 370802 368015 364108 359836 356076 353062 350362 347310 343565 339656 336866 336068 336516 336309 334409 331939
51259 331939 330974 332214 334374 336043 337508 340166 344304 348302 350459 351127 352371 355662 360656 366376 372700
51244 372700 379965 387626 394396 399848 405063 411284 418464 425684 432603 439820 447745 455674 462230 466589
51230 466589 469093 470765 472286 473325 472771 469619 463737 455849 446888 437385 427391 416813 405781 394734
51216 394734 384155 374224 364801 355792 347343 339482 331679 323149 313790 304564 296623 290237 284867 280184
51202 280184 276380 273243 269602 264480 258606 253963 251615 250654 249592 248050 246464 244812 242683 240399
51188 240399 238950 238646 238768 238890 239591 241237 242902 243479 243441 244452 247313 251188 254927 258240 261286 263880
51172 263880 265740 267055 268257 269381 270095 270147 269499 268152 266284 264476 263387 263005 262493 261031 258809 257061
51156 257061 256938 258241 259355 258674 256155 253345 251786 251604 251854 252017 252661 254369 256394 257037 255699 254088
51140 254088 254647 257760 261271 263137 263780 264926 266659 266994 264634 260974 258587 258356 258938 258791 257908 257416
51124 257416 257945 258696 258176 255902 253133 251517 251101 250379 248437 246134 244651 243755 242446 240686 239348 238704
51108 238704 238160 237536 237483 238263 239025 238844 237887 236990 236512 236055 235150 233872 232899 233009 234334 236098 237331 237695
51090 237695 237325 236184 234300 232465 231784 232396 233411 234293 235347 236583 237086 236152 234270 232259 230018 226963
51074 226963 223221 219732 217425 216692 217200 217661 216508 213642 211002 210425 211347 211741 211184 211727 215354 221494
51058 221494 227595 231604 233427 234319 235413 236914 238558 240552 243589 247732 251806 254476 255713 256614 258005
51043 258005 259878 262090 264790 267897 270685 272262 272336 271407 270385 269903 269809 269427 268462 267400 266757 266343 265623
51026 265623 264415 262835 261074 259837 260391 263235 267053 269873 271017 271060 270297 268530 266280 264825 264665
51011 264665 264931 264552 263164 260831 258115 256644 258158 262252 266125 267393 266276 264359 262300 259829 257269
50996 257269 255790 256271 258575 261594 263467 262345 257928 252111 247555 245743 246617 249370 252864 255758 257190
50981 257190 257346 257015 256917 257821 260582 265340 271078 276624 281599 285857 288866 290765 293348 298488 305654
50966 305654 312255 316626 319581 322877 327308 332710 338681 344387 348316 349376 348440 348203 350978 356477 361850
50951 361850 364164 363008 360622 359616 361023 364406 368911 373595 377499 380421 383533 388510 396047 405483
50937 405483 415608 425472 434859 444561 455770 468651 481994 494847 507807 521817 536468 550844
50925 550844 565681 583132 604303 628289 653844 680754 709186 738943 770070 803454 840184
50914 840184 880744 925121 973248 1025211 1081516 1143067 1210291 1282535 1359283 1441628 1531211
50903 1531211 1627662 1728674 1833006 1941802 2055955 2173510 2290869 2405698 2517472 2625814
50893 2625814 2729383 2826035 2913192 2988488 3050807 3100243 3136382 3157469 3162317 3152461 3131135
50882 3131135 3100376 3060320 3011235 2954979 2894205 2831106 2767269 2703997 2642316 2583014 2526719
50871 2526719 2473416 2421832 2369964 2316520 2261518 2205448 2148373 2090026 2030202 1968732 1905408
50860 1905408 1840303 1773927 1706765 1638787 1569888 1501019 1434597 1373289 1318002 1267300 1219087
50849 1219087 1172737 1129116 1088898 1051846 1017941 988096 962907 941358 921680 903230 886764
50838 886764 873078 862145 853447 846441 840650 835851 832249 830092 829320 830049 833032 838824 846579 854570
50824 854570 862102 870244 880460 893047 907108 921494 935600 949828 965483 983739 1004504 1026756
50812 1026756 1050090 1075241 1102894 1132844 1164864 1199658 1238103 1279990 1324420 1371240 1421302
50801 1421302 1475344 1533483 1596041 1664186 1739355 1822476 1914164 2015288 2126915 2249937 2385222
50790 2385222 2533911 2697007 2874530 3065494 3268764 3483535 3708824 3943116 4185019
50781 4185019 4433881 4688953 4947731 5205523 5456713 5696069 5918668 6119153 6291821
50772 6291821 6431714 6535617 6602117 6631021 6622915 6579365 6503425 6399759 6274051 6132229
50762 6132229 5980099 5823271 5666969 5515657 5372608 5239250 5114647 4996228 4881786
50753 4881786 4770576 4661948 4553531 4441995 4325547 4204356 4078325 3945948 3806175
50744 3806175 3660155 3510022 3356848 3201162 3044874 2891165 2742453 2599629 2463316
50735 2463316 2334741 2215005 2104335 2002343 1908401 1821688 1741602 1668358 1602533 1543861
50725 1543861 1491199 1443896 1402375 1366773 1335650 1306750 1278977 1253199 1231172 1213822 1200435
50714 1200435 1189323 1179300 1170377 1163006 1157016 1151772 1147109 1143467 1141201 1140298 1140623 1141779 1142949 1143696
50700 1143696 1144906 1147969 1153011 1159000 1165792 1174742 1186740 1200835 1215733 1231613 1249531 1269976
50688 1269976 1293202 1320096 1351280 1385910 1423006 1463645 1510175 1563220 1621181 1682992 1749631
50677 1749631 1822206 1900308 1983589 2073695 2172967 2281817 2398794 2522962 2654843 2795120
50667 2795120 2943577 3099284 3260621 3424893 3588979 3750610 3908056 4058373 4197146
50658 4197146 4320434 4425817 4510941 4572386 4607239 4615028 4596882 4553591 4486059 4397343 4292629
50647 4292629 4176992 4054497 3929405 3806481 3689188 3578681 3475255 3379701 3292431 3212271
50637 3212271 3137115 3065204 2995033 2924852 2853240 2779445 2702316 2619865 2531296 2438674 2344989
50626 2344989 2251041 2156116 2061438 1970640 1886168 1807176 1732034 1661274 1596618 1538313 1485068
50615 1485068 1436106 1391827 1352677 1318645 1289793 1266213 1247387 1232469 1221212 1213796 1209713 1207821
50603 1207821 1207824 1210832 1217846 1228189 1240021 1252271 1265627 1281677 1301394 1324552 1350472 1379060
50591 1379060 1410812 1445784 1483031 1521500 1561340 1603930 1650777 1702759 1760252 1823369 1891845
50580 1891845 1965094 2042502 2123421 2207013 2292757 2381262 2473810 2570484 2669032 2766114 2859521
50569 2859521 2948840 3034330 3115850 3192799 3264333 3329233 3385984 3433476 3471631 3501290 3523632
50558 3523632 3539811 3550903 3557891 3561637 3562946 3562607 3561396 3560135 3559760 3561091 3564437 3569556 3576067 3583606
50544 3583606 3591451 3598312 3602796 3604041 3601585 3594570 3581146 3558610 3524334 3476971 3416933 3345491
50532 3345491 3263534 3171970 3073411 2972187 2871540 2771405 2670196 2568456 2469334 2375379
50522 2375379 2286391 2200948 2118780 2040838 1968019 1900814 1839491 1783725 1732600 1685871 1644695
50511 1644695 1610218 1581880 1558077 1538153 1522743 1512327 1506395 1504052 1504728 1508361 1515564 1527395
50499 1527395 1544177 1564671 1587182 1611323 1637902 1667267 1698730 1731585 1765740 1801359 1838826
50488 1838826 1879043 1922641 1968631 2014817 2059836 2103981 2147927 2191724 2235387 2279387 2324038
50477 2324038 2369381 2416160 2465968 2519817 2577448 2638715 2704749 2777012 2855955 2941474 3034043
50466 3034043 3134552 3243529 3361301 3488413 3625028 3770219 3922549 4081001 4244693
50457 4244693 4412021 4580694 4748290 4912158 5069229 5216509 5351351 5470732 5570998
50448 5570998 5649202 5704271 5736012 5743523 5725703 5683132 5618368 5534409 5433860 5319720 5196124
50437 5196124 5067889 4939663 4815532 4699059 4593696 4503178 4430877 4378221 4344200 4326944
50427 4326944 4325082 4336682 4357685 4382763 4407621 4429247 4444066 4447202 4433839 4400463 4344919 4266562
50415 4266562 4166797 4048586 3915227 3770346 3618817 3466077 3315821 3169242 3026874 2890095
50405 2890095 2760360 2638170 2523669 2417486 2320151 2231306 2150141 2076194 2009383 1950013
50395 1950013 1899078 1857495 1824334 1796806 1773002 1753776 1740921 1734430 1732946 1736236 1745417 1760741
50383 1760741 1780662 1803425 1828432 1855739 1885351 1917528 1952791 1991022 2031336 2073318 2117593
50372 2117593 2164465 2212749 2260820 2308259 2355504 2402150 2446694 2487988 2525908 2560323 2590452
50361 2590452 2615963 2637936 2657745 2675327 2689640 2700779 2710559 2720546 2730481 2739542 2748667 2760654
50349 2760654 2778017 2801573 2831151 2866641 2907742 2953258 3001472 3051321 3102805 3156170 3210828
50338 3210828 3265046 3316411 3362563 3401660 3432421 3453872 3465113 3465232 3453403 3429048 3391811 3341238
50326 3341238 3276777 3198790 3109869 3014616 2917500 2820995 2726082 2634132 2547665 2469453 2401467
50315 2401467 2344542 2298390 2262037 2234972 2217906 2211667 2215269 2225756 2240038 2256005 2271713 2284561
50303 2284561 2291944 2292098 2283828 2266160 2238955 2203270 2160404 2111012 2055749 1996341 1935279 1874716
50291 1874716 1816099 1760364 1707727 1657703 1610078 1565604 1525051 1487949 1453155 1420450 1390807
50280 1390807 1365234 1344052 1326926 1312669 1299258 1285286 1271547 1260296 1252895 1249122 1248692 1251914
50268 1251914 1258471 1266931 1276353 1287342 1300720 1316139 1333022 1352017 1374205 1399355 1426121 1453599
50256 1453599 1481569 1509465 1536472 1562673 1588925 1615460 1641690 1667586 1693901 1720453 1745431
50245 1745431 1767327 1786659 1804720 1821218 1834344 1842848 1846961 1847375 1844437 1838503 1830071 1819295 1806132
50232 1806132 1791225 1775689 1759491 1740995 1718989 1694628 1670366 1647284 1624385 1600380 1575042
50221 1575042 1548650 1521213 1493032 1465344 1439513 1415682 1392899 1370507 1348811 1328228 1308447
50210 1308447 1288852 1269388 1250401 1231713 1212602 1192999 1174152 1157483 1142978 1129423 1116216
50199 1116216 1104196 1094350 1086360 1079086 1072026 1065637 1060461 1056658 1054226 1052787 1051055 1047392 1041404 1034600
50185 1034600 1029138 1026189 1025520 1026047 1026454 1025849 1024345 1022763 1021424 1019524 1016029 1010872 1004983 999525 995365
50170 995365 992771 990945 988273 983757 978116 972957 969128 966515 965176 965557 967288 968659 968052 965644 963230
50155 963230 962414 963256 964613 965558 966378 968246 971945 976905 981524 984327 984891 983894 982493 981469 980673 979316
50139 979316 976875 973579 969948 966193 962269 958160 953765 948847 943519 938396 933794 929172 924087 919287
50125 919287 915895 913649 911086 907636 904423 902485 901121 898778 894906 890143 885086 879674 873712 867443
50111 867443 861605 857220 855047 854880 855577 856129 856435 856752 856757 855750 853577 850708 847370 842969 836476 827269
50095 827269 815787 803480 791848 781257 771000 760643 750767 742050 734367 727455 721778 717691 714214
50082 714214 709950 705155 701624 700240 699815 698807 697099 695384 693765 692001 690609 690704 692769 696178 699829
50067 699829 702856 705085 707392 711344 717877 726439 735803 745384 755180 764987 774731 785422 798441 813427
50053 813427 827833 839314 848006 855912 864734 875065 887075 900608 914518 927082 937687 947390
50041 947390 957144 966100 972556 976259 978693 981093 983301 985004 987025 990436 995062 999977 1005097 1011054
50027 1011054 1017459 1022692 1025914 1028285 1031522 1036033 1041179 1046599 1052298 1058031 1063702 1070158 1078577 1089070
50013 1089070 1100736 1113102 1126748 1142367 1159978 1179172 1199470 1220229 1240899 1261614 1282957
50002 1282957 1304881 1326404 1346576 1365246 1382765 1399475 1415590 1430938 1444724 1456310 1466314
49991 1466314 1476064 1485626 1493378 1498094 1500507 1502096 1503133 1502795 1500444 1495793 1488369 1478017 1465639 1452397
49977 1452397 1438357 1422839 1405889 1388410 1370985 1353621 1336580 1320369 1304739 1288794 1272368
49966 1272368 1256297 1240950 1225512 1209353 1193327 1178928 1166631 1155814 1146061 1137875 1131967 1128064
49954 1128064 1124570 1119726 1113374 1107346 1103440 1101261 1098850 1095416 1092243 1090518 1089374 1086930 1082531 1077098
49940 1077098 1071637 1066249 1060321 1052995 1043686 1032849 1022074 1012679 1004110 994299 981784 967154 952462
49927 952462 939587 929121 920321 911815 902623 892906 883885 876944 872466 869355 865975 861977 859041 859207
49913 859207 862503 866908 870733 874259 878769 884925 892648 901684 911316 920061 926867 932471 938638 945883
49899 945883 952726 957389 959709 961109 963117 966104 969158 971019 971223 970286 968752 966369 962561 957353 951287
49884 951287 944535 936506 926320 913354 897568 879724 861123 842669 824274 805601 787110 769811
49872 769811 754145 739787 726586 715020 705476 697541 690303 683217 676629 671610 669102 668970 670046
49859 670046 671295 672627 674194 675454 675634 674771 673502 672062 670392 669020 668637 668593 667004 662961 657772
49844 657772 653318 649908 646547 642766 639109 635868 632320 627680 622351 617657 614350 611843 609142 606187
49830 606187 603708 601952 600378 598868 598324 599395 601276 602601 603094 603505 604388 605872 608206 611325 614234
49815 614234 616192 618383 622791 629218 635037 638479 640682 643667 647708 651781 655471 659111 662885 667152
49801 667152 673214 682437 694602 707991 721085 733638 746513 761087 778464 798504 819774 840887
49789 840887 861524 881819 901504 920433 939231 958481 977660 995787 1012757 1029145 1045048
49778 1045048 1060014 1073877 1086854 1099028 1110513 1121649 1132233 1140997 1146918 1150635 1153402 1154907
49766 1154907 1153263 1146978 1135839 1120222 1100955 1079771 1058338 1036673 1013774 989960 967025 945891
49754 945891 925761 906213 888447 873420 860002 846218 831510 816848 803422 792085 783209 776092
49742 776092 769179 761756 754717 748774 742820 735330 726747 719143 713729 709874 706365 702478 697902 692760
49728 692760 687806 683750 680296 676642 672805 669521 666836 663857 660084 656060 652420 649040 645467 641507
49714 641507 637208 632928 629537 627705 626718 624938 621880 618963 617669 617819 618377 619123 620432 622081 623515
49699 623515 625125 627912 631762 635241 637538 639581 642541 646129 649269 651884 654873 658447 661667 663962
49685 663962 666253 670078 676157 684321 694235 705434 716915 727524 736847 745203 752913 760318 768549
49672 768549 779347 793496 809954 827122 844599 863056 882672 902479 921419 939412 957045
49661 957045 974529 991369 1006998 1021360 1034654 1046637 1056579 1064243 1070683 1077546 1085442 1093337 1099787
49648 1099787 1104422 1107907 1110739 1112361 1111310 1105988 1095662 1081149 1064334 1046705 1028556 1009903
49636 1009903 991637 975020 960361 947034 934728 923724 913786 903846 893439 883750 876475 872035
49624 872035 869535 868187 867915 868661 869916 871201 872468 873731 874638 874830 874574 874671 875645 877180 878443 878963
49608 878963 879191 880203 882815 886955 891814 896539 900735 904500 908192 912116 916183 919688 921610 921403 919594
49593 919594 917462 915941 914877 913486 911546 909898 909602 910739 912356 913585 914436 915262 915769 915061 912638
49578 912638 908874 904465 900011 896437 895043 896214 898465 899810 900048 900506 901275 900307 896316 891334 888731
49563 888731 889351 891436 893947 897665 902550 906372 907531 907781 910488 917063 926480 937357 948638 958839
49549 958839 966798 973507 981539 992170 1004268 1016287 1027940 1039456 1050650 1061650 1073511 1087150
49537 1087150 1102389 1118790 1136652 1156381 1177532 1199339 1221599 1244244 1266644 1288329 1309984
49526 1309984 1332796 1357146 1382871 1410466 1440969 1474564 1510199 1546760 1583990 1622203 1661738
49515 1661738 1702885 1745897 1790880 1837857 1886788 1937370 1989270 2042929 2099575 2159752 2222386
49504 2222386 2286137 2351178 2418586 2488377 2559515 2631688 2705579 2781218 2857642 2934770 3014122
49493 3014122 3096718 3181342 3265989 3350178 3434692 3519598 3603658 3685388 3763604 3837086 3904652
49482 3904652 3965752 4020436 4068800 4110784 4146175 4174347 4194456 4206568 4212058 4212041 4205923 4192664
49470 4192664 4173220 4150390 4126196 4100783 4074272 4048295 4024796 4004225 3985941 3969888 3956935
49459 3956935 3947875 3942734 3940907 3941517 3944029 3949091 3958414 3973186 3992870 4016162 4042608 4072335 4104517
49446 4104517 4137467 4170549 4204867 4241369 4278990 4315478 4349562 4381560 4411983 4440301 4465189
49435 4465189 4485460 4500501 4509916 4512886 4507991 4493877 4470330 4438389 4399092 4352176 4296337 4230705
49423 4230705 4155931 4074027 3987484 3898330 3807411 3714388 3618715 3520829 3422172 3324111 3227199
49412 3227199 3131622 3037885 2946670 2858342 2773072 2691417 2614304 2542223 2474621 2410300 2348447
49401 2348447 2289218 2233364 2181425 2133341 2088679 2046997 2007992 1971605 1938181 1908216 1881684
49390 1881684 1857779 1835660 1815149 1796239 1778170 1759747 1740680 1721991 1704949 1690187 1677979
49379 1677979 1668528 1661481 1655795 1650704 1646365 1643070 1640450 1638246 1637405 1639330 1644190 1650862 1658519 1667420
49365 1667420 1678046 1690331 1703956 1718653 1733973 1749479 1765522 1783175 1802984 1824258 1845822
49354 1845822 1866766 1886122 1902776 1916587 1929058 1941939 1955414 1968552 1981400 1995631 2012869
49343 2012869 2033209 2055737 2079832 2105341 2131940 2159066 2186419 2213932 2241241 2267701 2293129
49332 2293129 2318047 2342810 2366923 2389744 2411557 2433225 2454922 2476090 2496843 2518400 2541407
49321 2541407 2564650 2586360 2606414 2626275 2647052 2668577 2690346 2712331 2734836 2758471 2784327
49310 2784327 2813129 2843978 2874966 2905396 2936385 2968950 3002682 3036881 3071715 3107328 3142919
49299 3142919 3177976 3213616 3251332 3291007 3331511 3372842 3416262 3462454 3510939 3561241 3613265
49288 3613265 3666477 3720198 3775080 3832961 3894679 3959135 4025218 4093669 4166210 4243574 4325189
49277 4325189 4410217 4498198 4589119 4683467 4781788 4883679 4987758 5093235 5200929 5312001
49267 5312001 5426229 5542502 5660587 5781286 5904915 6030682 6157874 6286692 6417470
49258 6417470 6549753 6682637 6815462 6947463 7077069 7202319 7322109 7436536 7545732
49249 7545732 7648696 7743494 7828357 7902172 7964053 8013223 8049789 8075159 8090914 8097225 8092998
49238 8092998 8077864 8053430 8022184 7985690 7944599 7900233 7855129 7811603 7770195 7730067 7690727
49227 7690727 7652992 7618431 7588386 7563619 7544388 7530539 7521853 7518708 7522133 7532632 7549053 7569231
49215 7569231 7591865 7617172 7645562 7676402 7708580 7741525 7774829 7807248 7837098 7863595 7886962
49204 7886962 7907029 7922480 7931794 7934264 7929717 7917803 7897982 7869805 7832755 7786098 7729382 7663004
49192 7663004 7588039 7505614 7416622 7321812 7221796 7117080 7008331 6896685 6783779 6671446
49182 6671446 6561183 6453461 6347560 6242437 6138010 6035404 5935970 5840370 5748581 5660154
49172 5660154 5574242 5489912 5406937 5326111 5248467 5174337 5103321 5034892 4968841 4905502 4845802
49161 4845802 4790688 4740196 4693282 4648756 4606011 4564741 4524641 4485905 4449419 4415774 4384446
49150 4384446 4354742 4327134 4302600 4280631 4259085 4236556 4214136 4194104 4177256 4162199 4147277
49139 4147277 4132698 4120563 4113023 4110500 4111551 4114296 4118012 4123444 4131662 4142750 4155748 4169826 4185264
49126 4185264 4203003 4223337 4245453 4268269 4291224 4313983 4336108 4357812 4380624 4406265 4434738
49115 4434738 4464389 4494013 4524059 4555523 4588729 4623839 4661592 4702413 4745221 4788205 4830837
49104 4830837 4874478 4920992 4971182 5024332 5078686 5132570 5185626 5238932 5293607 5349725 5407073
49093 5407073 5466397 5528812 5594139 5660785 5727316 5793196 5858108 5921826 5985241 6050333 6118113
49082 6118113 6187037 6254132 6317310 6375920 6429567 6477500 6519452 6556418 6590053 6621482 6650968
49071 6650968 6678691 6705452 6732346 6759816 6787388 6814381 6840478 6865401 6888590 6909816 6929826
49060 6929826 6949616 6969107 6987194 7003190 7017565 7031068 7043723 7055089 7065045 7073951 7082341 7090724
49048 7090724 7099392 7108161 7116584 7124538 7132283 7139776 7146433 7151884 7156600 7161418 7166766 7172595 7178713 7184709
49034 7184709 7189972 7194221 7197825 7201236 7204492 7207891 7212751 7220534 7231072 7242427 7252940 7262925 7273974
49021 7273974 7287067 7301930 7317932 7334826 7352329 7369559 7385425 7399577 7412616 7425270 7437481
49010 7437481 7448382 7457060 7463352 7468015 7472024 7475343 7476377 7473043 7464683 7452622 7438518 7422559 7403799
48997 7403799 7381911 7357744 7331952 7303895 7272346 7236921 7198352 7157674 7115664 7072997 7030427
48986 7030427 6988419 6946590 6903789 6859107 6813067 6767532 6724061 6682479 6641511 6600641 6560667
48975 6560667 6522457 6486104 6451694 6419940 6391162 6364109 6336865 6308914 6281624 6256653 6234468
48964 6234468 6214452 6195718 6177522 6159449 6141652 6124665 6108756 6093653 6079028 6064901 6051421
48953 6051421 6038620 6026657 6015961 6006675 5998063 5988746 5977446 5963460 5947003 5929536 5913270 5899334
48941 5899334 5886433 5872131 5855599 5838184 5820949 5802834 5782195 5759384 5736457 5714611 5693297
48930 5693297 5671938 5650970 5630454 5608959 5585111 5559606 5534441 5510360 5486145 5460417 5432956
48919 5432956 5403871 5372439 5337625 5299456 5259323 5218979 5179510 5141085 5103278 5065416 5026652
48908 5026652 4985952 4942483 4896434 4849365 4803406 4760110 4720234 4684264 4652405 4623878 4596971
48897 4596971 4570383 4544273 4519676 4497259 4477239 4460407 4448353 4442163 4441160 4443523 4448205 4455695
48885 4455695 4466727 4480847 4496949 4514859 4535376 4558585 4583193 4608253 4634780 4664619 4697978
48874 4697978 4733040 4767989 4802633 4837920 4874717 4913384 4953893 4995830 5038559 5081807 5125924
48863 5125924 5171285 5217450 5263146 5307265 5350081 5393491 5439719 5489501 5541755 5595076 5649012
48852 5649012 5703636 5758829 5814840 5872869 5933900 5997212 6061332 6126349 6193924 6264725 6337153
48841 6337153 6409110 6479872 6549656 6618570 6686961 6755927 6826150 6896586 6965240 7031075 7094368
48830 7094368 7155370 7213442 7267708 7317998 7364840 7408593 7448688 7483966 7514044 7540053 7563437
48819 7563437 7584059 7600238 7610633 7615214 7614366 7608235 7597363 7582677 7563985 7539544 7508233 7471421
48807 7471421 7431598 7389661 7344592 7295316 7241769 7184408 7123771 7060535 6995233 6928004 6859149
48796 6859149 6789533 6719779 6649566 6578596 6507700 6437925 6369046 6300248 6232034 6166188 6103850
48785 6103850 6044810 5988603 5935030 5883601 5833880 5786734 5743972 5706239 5672374 5641347 5613757
48774 5613757 5590711 5572082 5556679 5543547 5532565 5524236 5519346 5518246 5520126 5523508 5527789 5533650 5541739
48761 5541739 5551885 5564133 5579555 5599133 5622346 5647632 5673827 5700549 5727664 5755112 5783027
48750 5783027 5811502 5840531 5870507 5902153 5935382 5968942 6002030 6035736 6071885 6110824 6151351
48739 6151351 6192564 6234585 6277386 6320099 6361982 6403215 6444308 6485378 6526502 6568121 6610493
48728 6610493 6653204 6695878 6739012 6783366 6828544 6872958 6915426 6956259 6996323 7035492 7072774
48717 7072774 7108021 7142711 7178325 7214201 7247710 7276827 7301946 7324651 7345118 7361530 7372202
48706 7372202 7377496 7379065 7377540 7371624 7359457 7340233 7314242 7281956 7243725 7200104 7151813 7099248
48694 7099248 7042500 6981968 6918665 6853889 6789037 6725596 6664524 6605193 6545593 6484249 6421778
48683 6421778 6360259 6301457 6246060 6194087 6145272 6099207 6055695 6014859 5976572 5940205 5905680
48672 5905680 5874486 5848849 5829965 5817657 5811501 5811345 5816760 5826877 5840971 5858586 5879181 5902414
48660 5902414 5928680 5958356 5990603 6024088 6058954 6096645 6137310 6178897 6219701 6260432 6302459
48649 6302459 6345116 6386342 6425463 6463673 6501839 6539287 6575064 6609251 6642474 6674866 6706033
48638 6706033 6735616 6763607 6790441 6816988 6844324 6873457 6905373 6940936 6980202 7022002 7064916
48627 7064916 7108866 7155358 7206140 7261930 7322467 7387366 7456874 7532053 7614204 7703804 7799978
48616 7799978 7901271 8006845 8116713 8231217 8350693 8475323 8604498 8736311 8868305
48607 8868305 8998812 9127094 9252291 9372968 9487763 9595585 9694784 9782858 9857563 9917843
48597 9917843 9963148 9992365 10004175 9998308 9975672 9937102 9882533 9811643 9724966 9624146 9511400
48586 9511400 9389112 9259699 9125307 8987233 8845856 8701465 8555167 8408662 8263143
48577 8263143 8118887 7976189 7836264 7700707 7570181 7444112 7321705 7202788 7087676
48568 7087676 6976685 6870029 6767843 6670086 6576598 6487376 6402445 6321286 6242711 6165727 6090453
48557 6090453 6017962 5949352 5885122 5825066 5768140 5712381 5655607 5596840 5537088 5478492 5422705
48546 5422705 5370131 5320474 5273376 5228352 5184590 5141412 5098788 5056992 5015810 4974699 4933798
48535 4933798 4894051 4855898 4818386 4780384 4742489 4706943 4675481 4647711 4621871 4596851 4573118
48524 4573118 4551894 4533725 4518055 4504158 4492261 4483299 4477457 4473482 4470031 4467381 4467074 4470008 4475658
48511 4475658 4483200 4492441 4503191 4514657 4526241 4538418 4552101 4567535 4584472 4602983 4623143 4644157
48499 4644157 4664719 4684214 4702688 4719767 4734809 4748352 4762216 4777508 4793397 4808386 4821837
48488 4821837 4833627 4843452 4851792 4860774 4872528 4886876 4901876 4916350 4930457 4943990 4956096 4967233
48476 4967233 4979638 4994635 5010575 5024633 5035832 5045188 5053716 5061785 5070090 5079746 5091148 5103663
48464 5103663 5116516 5129185 5141050 5151693 5161779 5172713 5185055 5198055 5211237 5225838 5244055
48453 5244055 5267026 5293850 5322448 5351274 5380507 5411840 5447094 5486952 5530932 5578240 5628507
48442 5628507 5682069 5739901 5802806 5870205 5940172 6011392 6084749 6162245 6244607 6330755 6419276
48431 6419276 6509454 6601105 6694513 6790483 6889311 6989662 7089634 7188964 7288668 7388303 7485208
48420 7485208 7577191 7664453 7747774 7826012 7896677 7958111 8009932 8052009 8084282 8107239 8121525
48409 8121525 8127384 8125192 8115991 8100730 8079702 8053677 8024705 7994488 7962483 7926980 7887654 7845590
48397 7845590 7801071 7752971 7700512 7644188 7584596 7521564 7454794 7384347 7310066 7231503 7148851
48386 7148851 7063130 6975178 6885228 6793766 6701955 6610761 6520438 6431225 6343851 6259022 6177167
48375 6177167 6098994 6025622 5957846 5895974 5840489 5791815 5748999 5709827 5673163 5640324 5613206
48364 5613206 5591789 5574528 5560546 5550043 5542673 5536923 5531594 5527092 5524623 5524513 5525822 5527496 5529586
48351 5529586 5533183 5539204 5547373 5556574 5566161 5576598 5588833 5603406 5620303 5639107 5658941 5678651
48339 5678651 5697637 5716510 5736569 5758566 5782069 5805903 5829065 5851410 5873546 5895910 5917888
48328 5917888 5938195 5956252 5972806 5988896 6004476 6018359 6029250 6036523 6040327 6041399 6040715 6038924
48316 6038924 6036118 6032267 6027672 6022745 6017651 6012494 6007619 6003183 5998502 5992494 5985105 5977995 5973449 5972568
48302 5972568 5974504 5977375 5979867 5982160 5985609 5991663 6000942 6012969 6026544 6040533 6054701 6069770 6086440
48289 6086440 6104409 6122821 6141722 6162434 6186028 6211848 6238087 6263554 6288236 6312112 6334275
48278 6334275 6353713 6370566 6385906 6400241 6412790 6422563 6429778 6435463 6439613 6440506 6436507 6428204 6417984
48265 6417984 6407536 6396516 6383867 6369555 6354271 6337965 6319633 6298724 6276165 6253755 6232839
48254 6232839 6213720 6195874 6178235 6159314 6137705 6113108 6086935 6061407 6037685 6015100 5992625
48243 5992625 5970901 5952101 5937629 5926481 5916334 5905948 5896158 5888817 5885246 5885666 5889615 5896572 5906233
48230 5906233 5918302 5932403 5948550 5967672 5991111 6019330 6051424 6086093 6122579 6160271 6198052
48219 6198052 6234875 6270755 6306229 6340649 6371788 6397425 6416746 6429906 6436846 6437119 6430361 6416180
48207 6416180 6393736 6362141 6321564 6273445 6219293 6159375 6092842 6019228 5939869 5857754 5775722
48196 5775722 5694707 5613909 5532606 5451180 5370163 5289165 5207792 5127191 5049358 4974779 4901937
48185 4901937 4829636 4758632 4690268 4624628 4561176 4500300 4442680 4387640 4333790 4281258 4231618
48174 4231618 4185352 4141040 4097710 4056487 4018808 3984063 3950246 3916233 3882327 3849186 3817347
48163 3817347 3787427 3759686 3733433 3707617 3681764 3655744 3629191 3602050 3575251 3549647 3524550
48152 3524550 3498432 3470986 3443329 3416179 3388968 3361007 3332430 3303652 3274659 3245168 3214796
48141 3214796 3182912 3149065 3113731 3077992 3042425 3007032 2972119 2938260 2905452 2873516 2843331
48130 2843331 2816234 2791755 2767475 2741978 2716755 2694261 2675190 2658728 2644502 2632946 2624223
48119 2624223 2617914 2613476 2610185 2607094 2603985 2601950 2602167 2604427 2607677 2611566 2616495 2622519 2629282 2636879
48105 2636879 2645840 2656331 2668165 2681398 2696069 2711567 2727170 2743041 2759707 2776691 2792708
48094 2792708 2807208 2820673 2833454 2845588 2857955 2872126 2888309 2904552 2918901 2931475 2943449
48083 2943449 2954755 2964176 2971521 2978473 2986926 2997236 3008425 3019494 3030023 3039910 3049166 3058075 3067147
48070 3067147 3076718 3086788 3097414 3108977 3121602 3134344 3145543 3154351 3161696 3169447 3178843 3189953
48058 3189953 3202281 3215355 3228852 3242772 3257534 3273535 3290533 3307835 3324968 3341721 3357606
48047 3357606 3372030 3385340 3398978 3414015 3429831 3444798 3458124 3470494 3483035 3496200 3509618
48036 3509618 3522471 3533905 3543769 3553302 3564515 3578313 3593659 3609164 3625020 3642507 3661927 3682357
48024 3682357 3703585 3726875 3753048 3780902 3808535 3835403 3862053 3888716 3915601 3943904 3974669
48013 3974669 4006727 4037513 4066288 4094929 4125060 4155949 4185903 4214348 4241616 4268019 4294201
48002 4294201 4321140 4348509 4374012 4395758 4414497 4432117 4448648 4462348 4472302 4479202 4483610 4485048
47990 4485048 4483122 4478285 4471138 4461895 4450759 4437933 4423134 4405954 4386874 4367032 4346898 4326042
47978 4326042 4304361 4282519 4260832 4238474 4214166 4187135 4157413 4125951 4094517 4064566 4035998
47967 4035998 4007738 3979607 3952639 3927389 3903029 3878605 3854135 3829648 3803612 3772804 3733376
47956 3733376 3682142 3618154 3544012 3465078 3386458 3310592 3237555 3166690 3097429 3029459 2963137
47945 2963137 2899520 2839389 2782619 2728921 2678609 2631887 2587920 2545542 2504695 2466390 2431336
47934 2431336 2399311 2369776 2342332 2316418 2291361 2267114 2244534 2224480 2206740 2190086 2173369
47923 2173369 2156475 2140299 2125950 2114087 2104780 2097531 2091177 2084198 2075811 2066796 2058766 2052508 2047407
47910 2047407 2042451 2037258 2032004 2026824 2021477 2015276 2007387 1997790 1987908 1979446 1972294 1964292 1953551 1940394
47896 1940394 1926605 1913456 1901092 1889129 1876910 1863382 1847630 1829739 1810795 1792108 1774560
47885 1774560 1758280 1742591 1726713 1710983 1696957 1685728 1676578 1668018 1659720 1652493 1646574 1640999
47873 1640999 1634933 1628767 1623539 1619899 1618006 1617999 1620115 1624551 1631407 1640550 1651415 1663211 1675418 1687901
47859 1687901 1700610 1713654 1727727 1743844 1762138 1781195 1799101 1815113 1829942 1844464 1858445
47848 1858445 1870687 1880184 1886946 1891767 1895363 1897745 1898378 1896877 1893498 1888919 1883494 1876837 1868261 1857537
47834 1857537 1844958 1830688 1814540 1796799 1778860 1762379 1747659 1733423 1718429 1702936 1688348
47823 1688348 1675682 1664677 1654176 1643135 1631495 1620425 1611595 1605876 1602725 1600968 1600126 1600693 1603179
47810 1603179 1607189 1611719 1616309 1621606 1628578 1637298 1646894 1656688 1666828 1677421 1687603 1696271 1703629
47797 1703629 1711269 1720628 1731887 1744296 1756617 1767024 1773646 1776109 1776120 1775781 1775553 1774306 1770899 1765028
47783 1765028 1756809 1746527 1734851 1722587 1709919 1696404 1681875 1666982 1652629 1639287 1627057
47772 1627057 1615913 1605370 1594142 1580867 1565491 1549684 1535499 1523684 1513462 1503880 1494911 1487125
47760 1487125 1480751 1475545 1471304 1468019 1465568 1463741 1462503 1461818 1461359 1461018 1461701 1464809 1470605 1477701 1484485
47745 1484485 1490560 1496446 1502556 1509074 1516231 1523770 1530376 1534509 1536140 1537217 1540167 1546005 1553870 1562081
47731 1562081 1569620 1576777 1584528 1593450 1603431 1614245 1625877 1638178 1650776 1663705 1677709 1693485
47719 1693485 1710942 1729615 1749539 1771311 1795498 1822332 1851687 1882892 1914796 1946419 1977407
47708 1977407 2007605 2036622 2064339 2091397 2118410 2144735 2168672 2188934 2205446 2218735 2229123
47697 2229123 2236610 2241116 2242613 2241180 2236972 2230021 2220284 2208046 2193850 2177657 2158563 2136127 2111669
47684 2111669 2087327 2063770 2039727 2014038 1987430 1961888 1938864 1918535 1900264 1883159 1866416
47673 1866416 1849714 1833380 1818073 1804385 1792862 1784126 1778656 1776356 1776425 1777608 1778792 1779818 1781887
47660 1781887 1786837 1795698 1807961 1822284 1837698 1854039 1871590 1890775 1912153 1936300 1963448 1993181
47648 1993181 2024489 2056085 2086854 2116337 2144913 2173281 2201444 2228225 2251987 2271765 2287459
47637 2287459 2299041 2306299 2309716 2310934 2311454 2310994 2307877 2301054 2291002 2278510 2263492 2245437 2224345
47624 2224345 2200634 2174677 2147211 2119851 2094402 2071635 2051267 2033016 2017133 2003851 1992941
47613 1992941 1984135 1977718 1974306 1974003 1975993 1979304 1984113 1991954 2004173 2020407 2039053 2059029 2080287
47600 2080287 2102767 2126008 2150157 2176151 2204028 2231904 2257555 2280516 2301830 2322260 2341656
47589 2341656 2359611 2375698 2389256 2399835 2407840 2414113 2419046 2422465 2423857 2422158 2416227 2406520 2395503
47576 2395503 2385138 2374686 2362556 2349680 2338883 2330983 2323706 2314995 2305387 2296234 2287402 2278043 2268190
47563 2268190 2258070 2246827 2233422 2218132 2201862 2184391 2164533 2141783 2116858 2090873 2064885
47552 2064885 2039759 2015407 1990339 1962977 1933338 1902548 1870952 1837876 1803301 1768660 1735524
47541 1735524 1704251 1674287 1645220 1617139 1590519 1566113 1544554 1525547 1507642 1489139 1469300
47530 1469300 1448727 1428731 1410321 1393555 1377800 1362729 1348906 1337099 1327094 1317558 1307131
47519 1307131 1295388 1282803 1270186 1258267 1247408 1237375 1227470 1217084 1206221 1195563 1186068 1178164
47507 1178164 1171101 1163459 1154900 1147304 1143387 1143874 1146715 1149503 1152013 1155664 1161034 1167033 1172550 1177768
47493 1177768 1183282 1188772 1193441 1197303 1201097 1204945 1207880 1208891 1207846 1205200 1201378 1196777 1191762 1186132
47479 1186132 1178847 1168845 1156134 1141865 1127380 1113234 1098906 1083201 1065266 1045524 1025497
47468 1025497 1006577 989241 973498 959428 946699 934015 919862 903910 887224 871250 857010
47457 857010 845022 835169 826495 817677 808043 797888 787829 778273 769598 762347 756818 752626 748900
47444 748900 744938 740674 736632 733498 731726 731449 732471 734053 735015 734709 733996 734555 737013 740479 744171
47429 744171 748547 754208 760695 767322 774473 782885 792104 800849 808540 815321 820945 825053 828397 832375
47415 832375 837166 841530 844532 846120 845891 842914 837473 831681 827498 825052 823491 822466 821972 821597 820804
47400 820804 819517 817859 815903 814052 812992 812892 813388 814529 816758 819572 821398 821471 820850 820919 822042 824359
47384 824359 828598 834887 841781 847692 852584 857309 862265 867795 874860 883739 892919 900928 908703 918461
47370 918461 930604 943380 955315 966311 976627 986725 998261 1013131 1030864 1048665 1064930
47359 1064930 1081316 1100353 1122181 1144860 1167016 1188852 1210859 1232691 1253428 1272387 1289523
47348 1289523 1305329 1320383 1334927 1348774 1361436 1372145 1380155 1385495 1389032 1391072 1390306 1385131 1375888
47335 1375888 1364691 1352975 1340443 1326717 1312695 1299439 1286770 1273980 1261245 1249191 1237406
47324 1237406 1224457 1209524 1193382 1177643 1163497 1151188 1140261 1130101 1120447 1111567 1104024 1098363
47312 1098363 1094817 1092974 1091744 1090220 1088761 1088774 1091141 1095236 1099830 1104514 1109778 1115948 1122626 1129149
47298 1129149 1135182 1140772 1146033 1150900 1155194 1158909 1162354 1165689 1168356 1169398 1168569 1166673 1164453 1161455
47284 1161455 1156421 1148606 1138173 1125432 1110384 1093176 1074554 1055570 1037154 1020211 1005633 993608
47272 993608 982984 971958 959637 946651 934089 922229 910555 898651 886678 875126 864467
47261 864467 854847 845758 836306 826294 816804 809058 802922 797260 791615 786466 781868 777187 772662 769827
47247 769827 769344 769491 768122 765472 763651 763838 765492 768076 771721 775840 778664 779132 778252 777670 777609 777169
47231 777169 776108 775310 775556 776685 778071 779394 780728 782299 784453 787635 792154 797924 804526 811444 818158
47216 818158 824165 829412 834844 841957 851180 860977 869405 876464 883985 893063 902859 912450 922627 934767
47202 934767 948757 963288 977583 991612 1005161 1018197 1031878 1047675 1065334 1082961 1099165
47191 1099165 1113848 1126937 1138037 1147748 1157609 1167921 1177013 1183640 1188827 1194131 1199155 1202222 1202879
47178 1202879 1202282 1201359 1199723 1196410 1190908 1183591 1175801 1169224 1164432 1160121 1154355 1146324 1136534 1125988
47164 1125988 1115981 1108082 1102979 1099427 1095330 1089935 1084197 1079147 1074946 1071571 1069180 1067415 1065295 1062500
47150 1062500 1060129 1059589 1061155 1064153 1068156 1073352 1079866 1087347 1095380 1104036 1113732 1124481 1135304 1144678
47136 1144678 1151853 1157597 1163309 1169408 1175015 1179196 1181973 1183952 1185467 1186521 1187222 1187727 1187699 1186280 1182840
47121 1182840 1177731 1172239 1167827 1165293 1164492 1164734 1165460 1166639 1168717 1172216 1177298 1183590 1190578 1198235 1207099
47106 1207099 1217539 1229241 1241770 1255485 1271380 1289895 1310363 1331735 1353352 1374815 1395830
47095 1395830 1416828 1439321 1464756 1492910 1521983 1550170 1576467 1600116 1620528 1638329 1655443
47084 1655443 1673089 1690103 1704115 1714046 1720551 1724516 1726461 1727315 1728168 1728723 1727212 1722785 1717008 1712128
47070 1712128 1708639 1705640 1702874 1700988 1699997 1698741 1696152 1692192 1687468 1682831 1679561 1678957 1681114 1684560
47056 1684560 1687523 1689302 1690349 1691461 1693202 1695747 1699009 1702978 1707874 1713737 1720132 1726795 1734330 1743443
47042 1743443 1753458 1762420 1769054 1773846 1777762 1780526 1780749 1777304 1769981 1759186 1745679 1730575 1714890
47029 1714890 1698746 1681235 1661317 1638934 1615197 1591378 1567751 1543664 1518827 1494118 1470771
47018 1470771 1449130 1428818 1409916 1393197 1379070 1366891 1355514 1344183 1332909 1322457 1313993
47007 1313993 1308266 1305013 1303557 1303763 1305802 1309240 1313376 1318457 1325465 1334362 1343636 1352134 1360507 1370185
46993 1370185 1381765 1395008 1409571 1424760 1439196 1451790 1462871 1473576 1484354 1494875 1505188
46982 1505188 1515991 1527592 1539255 1549912 1559166 1567443 1575394 1583313 1591100 1598710 1606529 1615008 1623995
46969 1623995 1632804 1641105 1649346 1658251 1668284 1679689 1692549 1706617 1721499 1737058 1753099 1768792
46957 1768792 1783386 1797608 1813178 1830394 1847375 1862529 1876633 1891357 1906666 1921272 1935100
46946 1935100 1949597 1965520 1982020 1998359 2015318 2034004 2054018 2073679 2091819 2108634 2124656
46935 2124656 2139334 2151098 2158924 2163501 2166440 2168549 2169409 2168445 2165454 2160062 2151935 2142037 2132540 2124499
46921 2124499 2116673 2107723 2098695 2091868 2087822 2085326 2083758 2083800 2085541 2087754 2089833 2093131 2099322 2108195
46907 2108195 2117989 2127510 2137199 2148271 2161276 2175579 2190287 2205631 2222938 2242771 2263726 2284013
46895 2284013 2303845 2324925 2347677 2370489 2392033 2412812 2433564 2453482 2471319 2487433 2503292
46884 2503292 2519343 2534681 2548823 2562538 2576503 2590009 2601572 2610310 2616359 2620382 2623194 2625565
46872 2625565 2627729 2629034 2628572 2626338 2623394 2620631 2617868 2614655 2611650 2610406 2611804 2615431 2620647 2627416
46858 2627416 2635718 2644932 2654516 2664704 2675880 2687691 2699595 2711901 2725434 2740332 2755959 2771905
46846 2771905 2788416 2805869 2824446 2844230 2864972 2885877 2906124 2925434 2943541 2959571 2972802
46835 2972802 2983780 2993580 3001933 3007049 3007474 3003317 2995622 2985355 2973098 2958992 2942927 2925654 2909549
46822 2909549 2897092 2888442 2881647 2875541 2871201 2870221 2872891 2878809 2888051 2900725 2916197 2933805 2953740
46809 2953740 2976359 3001120 3026822 3052383 3076845 3099492 3120775 3142257 3164512 3185695 3203373
46798 3203373 3217374 3229649 3241588 3252835 3262801 3272084 3281822 3292452 3303682 3315303 3327622 3341257
46786 3341257 3356547 3373030 3389686 3406039 3422838 3441229 3461346 3482192 3502744 3522656 3541943
46775 3541943 3560558 3578321 3594826 3609311 3621074 3630142 3637127 3642251 3644754 3643359 3637295 3627014
46763 3627014 3614132 3600491 3586990 3573508 3560189 3548244 3538777 3531101 3523215 3514060 3504533 3496094
46751 3496094 3489371 3484759 3483516 3487044 3495184 3506149 3518351 3531722 3547132 3565253 3586379 3610688
46739 3610688 3637809 3666360 3694750 3722578 3750659 3779447 3807981 3834671 3858523 3879121 3895845
46728 3895845 3907874 3914890 3917294 3915627 3910071 3900487 3886695 3868904 3848007 3825161 3800780 3774434
46716 3774434 3746070 3716706 3687231 3657219 3625924 3593925 3562503 3531815 3501179 3471027 3442779
46705 3442779 3416501 3390519 3364133 3338881 3315986 3294186 3271668 3248784 3227025 3206278 3185326
46694 3185326 3164505 3145574 3128841 3112751 3096901 3083420 3074192 3068292 3063557 3059438 3056712 3055142
46682 3055142 3053370 3051199 3050338 3052244 3056272 3060844 3065765 3072395 3081529 3092000 3101857 3110487 3119036 3128810
46668 3128810 3139764 3150714 3160579 3169070 3176435 3182985 3188907 3194280 3199225 3204120 3209562 3215947 3223168
46655 3223168 3230897 3239013 3247564 3256450 3265537 3274975 3285086 3295782 3306355 3316038 3324893 3334188 3345765
46642 3345765 3360589 3377593 3394212 3408423 3420218 3430816 3440762 3449337 3455765 3460079 3462229 3460804
46630 3460804 3453507 3439246 3419432 3396871 3373429 3348842 3321593 3290568 3255960 3218985 3181032
46619 3181032 3142833 3104169 3064529 3024231 2984603 2946770 2910621 2875445 2841310 2809073 2779100
46608 2779100 2750712 2723133 2696496 2671732 2649772 2630849 2614114 2598084 2582101 2567168 2554507
46597 2554507 2543481 2532215 2520508 2510737 2505168 2503663 2505009 2509219 2516982 2527750 2540292 2554985
46585 2554985 2573773 2597480 2624553 2653076 2682929 2715243 2750398 2787220 2823696 2858090 2889724
46574 2889724 2919065 2946726 2972221 2994177 3012031 3026934 3040464 3052762 3062539 3068837 3072362 3074949
46562 3074949 3077946 3081316 3084245 3086518 3089185 3094000 3102487 3115579 3133748 3156997 3184774 3216052 3249602
46549 3249602 3284288 3319417 3354928 3390875 3426566 3460501 3491191 3517541 3538465 3553075 3561767
46538 3561767 3566076 3566453 3560826 3546503 3523242 3493439 3459607 3422798 3383307 3341449 3297324 3250934
46526 3250934 3203090 3155307 3108459 3062300 3016675 2972264 2929568 2888008 2846762 2805972 2766426
46515 2766426 2728445 2691682 2655819 2621017 2587883 2557157 2528961 2502221 2475437 2448340 2422127
46504 2422127 2397591 2373740 2349028 2323485 2298831 2276732 2257581 2240722 2225160 2210155 2195750
46493 2195750 2182643 2171071 2160104 2148721 2137462 2128208 2122169 2118697 2116264 2114087 2112505 2112243 2113732
46480 2113732 2116942 2121541 2127155 2133521 2140335 2147113 2153481 2159735 2166860 2175861 2187015 2199626 2212315
46467 2212315 2223813 2234022 2244490 2257383 2273571 2291759 2309738 2326449 2342743 2360267 2379981
46456 2379981 2401796 2425286 2450374 2477207 2505588 2534781 2564073 2593408 2623276 2653836 2684341
$$ [...]
##END NTUPLES=NMR SPECTRUM
##END=
