
##TITLE=AC1158_Centauros_5875164_wDN7GagWWT
##JCAMPDX= 6.0         $$ Bruker NMR JCAMP-DX V2.0
##DATA TYPE= NMR SPECTRUM
##DATA CLASS= NTUPLES
##ORIGIN= BRUKER
##OWNER= Administrator
$$ 1.72 TOPSPIN		Version 2.1
$$ 2012-04-10 10:24:24.421 -0500  Administrator@TOPSPIN
$$ Compression mode = diff/dup
##.OBSERVE FREQUENCY= 400.13188235
##.OBSERVE NUCLEUS= ^1H
##.ACQUISITION MODE= SIMULTANEOUS (DQD)
##.ACQUISITION SCHEME= undefined
##.AVERAGES= 64
##.DIGITISER RES= 22
##SPECTROMETER/DATA SYSTEM= spect
##.PULSE SEQUENCE= noesygpps1d.comp
##.SOLVENT NAME= COFFEE_meoh
##.SHIFT REFERENCE= INTERNAL, COFFEE_meoh, 1, 14.9684
##AUDIT TRAIL= $$ (NUMBER, WHEN, WHO, WHERE, PROCESS, VERSION, WHAT)
$$ ##TITLE= Audit trail, TOPSPIN		Version 2.1
$$ ##JCAMPDX= 5.01
$$ ##ORIGIN= Bruker BioSpin GmbH
$$ ##OWNER= Administrator
$$ $$ C:\Bruker\TOPSPIN/data/COFFEE/nmr/AC1158_Centauros_5875164_wDN7GagWWT/12/pdata/1/auditp.txt
$$ ##AUDIT TRAIL=  $$ (NUMBER, WHEN, WHO, WHERE, PROCESS, VERSION, WHAT)
(   1,<2012-04-01 01:00:14.531 -0500>,<Administrator>,<TOPSPIN>,<go>,<TOPSPIN 2.1>,
      <created by zg
	started at 2012-04-01 00:48:42.375 -0500,
	POWCHK enabled, PULCHK disabled,
       configuration hash MD5:
       1A 1E CE 29 27 FD 77 03 67 4E F0 E3 C4 B2 CB 90
       data hash MD5: 64K
       3C 24 CD BE 8A DD 9C B2 AD 24 A6 14 18 1D 57 DC>)
(   2,<2012-04-01 01:00:17.390 -0500>,<Administrator>,<TOPSPIN>,<proc1d>,<TOPSPIN 2.1>,
      <Start of raw data processing
       efp LB = 0.3 FT_mod = 6 PKNL = 1 PHC0 = 0 PHC1 = 0 SI = 128K 
       data hash MD5: 128K
       36 5D 77 B6 9B 8F 2E 81 5A 02 2F F2 DD 05 49 D7>)
(   3,<2012-04-01 01:00:18.750 -0500>,<Administrator>,<TOPSPIN>,<proc1d>,<TOPSPIN 2.1>,
      <pk PHC0 = 39.776 PHC1 = 0 
       data hash MD5: 128K
       0A 53 FF BF DA 23 A1 6C 79 1B 23 F5 7B D8 7C 55>)
(   4,<2012-04-01 01:00:19.234 -0500>,<Administrator>,<TOPSPIN>,<proc1d>,<TOPSPIN 2.1>,
      <abs ABSG = 1 
       data hash MD5: 128K
       E4 31 D3 6F E4 E1 50 ED 80 C1 83 A7 25 0B 3A BC>)
(   5,<2012-04-01 01:00:19.312 -0500>,<Administrator>,<TOPSPIN>,<proc1d>,<TOPSPIN 2.1>,
      <abs ABSG = 2 
       data hash MD5: 128K
       3E EF 6E CF FD 9F C0 06 78 D1 0D 1E DA AE 97 A2>)
(   6,<2012-04-01 01:00:19.390 -0500>,<Administrator>,<TOPSPIN>,<proc1d>,<TOPSPIN 2.1>,
      <abs ABSG = 3 
       data hash MD5: 128K
       C0 81 B6 66 64 85 10 AD 3C BE 3C 89 2B 4B 01 63>)
(   7,<2012-04-01 01:00:19.437 -0500>,<Administrator>,<TOPSPIN>,<proc1d>,<TOPSPIN 2.1>,
      <abs ABSG = 4 
       data hash MD5: 128K
       B9 6D 77 53 B3 72 3D 98 B6 86 A3 75 43 02 1E 7F>)
(   8,<2012-04-01 01:00:19.500 -0500>,<Administrator>,<TOPSPIN>,<proc1d>,<TOPSPIN 2.1>,
      <abs ABSG = 5 
       data hash MD5: 128K
       6B 56 9F 31 44 74 E6 5C D3 49 D7 C5 D7 BD 73 76>)
(   9,<2012-04-01 01:00:21.703 -0500>,<Administrator>,<TOPSPIN>,<audit>,<TOPSPIN 2.1>,
      <user comment:
       ICON-NMR User ID: COFFEE
       data hash MD5: 128K
$$ [...]
150 150 150 150 150 150 150 150
##$TP07= 0
##$TPNAME0= <>
##$TPNAME1= <>
##$TPNAME2= <>
##$TPNAME3= <>
##$TPNAME4= <>
##$TPNAME5= <>
##$TPNAME6= <>
##$TPNAME7= <>
##$TPOAL= (0..7)
0.5 0.5 0.5 0.5 0.5 0.5 0.5 0.5
##$TPOFFS= (0..7)
0 0 0 0 0 0 0 0
##$TUNHIN= 0
##$TUNHOUT= 0
##$TUNXOUT= 0
##$USERA1= <user>
##$USERA2= <user>
##$USERA3= <user>
##$USERA4= <user>
##$USERA5= <user>
##$V9= 5
##$VALIST= <valist>
##$VCLIST= <CCCCCCCCCCCCCCC>
##$VD= 0
##$VDLIST= <DDDDDDDDDDDDDDD>
##$VPLIST= <PPPPPPPPPPPPPPP>
##$VTLIST= <TTTTTTTTTTTTTTT>
##$WBST= 2048
##$WBSW= 25
##$XGAIN= (0..3)
0 0 0 0
##$XL= 0
##$YL= 0
##$YMAX_a= 12974693
##$YMIN_a= -6569377
##$ZGOPTNS= <>
##$ZL1= 120
##$ZL2= 120
##$ZL3= 120
##$ZL4= 120
##$ABSF1= 14.9684
##$ABSF2= -5.58413
##$ABSG= 5
##$ABSL= 3
##$ALPHA= 0
##$AQORDER= 0
##$ASSFAC= 0
##$ASSFACI= 0
##$ASSFACX= 0
##$ASSWID= 0
##$AUNMP= <proc_prof1d_extract.lims>
##$AXLEFT= 0
##$AXNAME= <>
##$AXNUC= <1H>
##$AXRIGHT= 0
##$AXTYPE= 0
##$AXUNIT= <>
##$AZFE= 0.1
##$AZFW= 0.1
##$BCFW= 0
##$BC_mod= 0
##$BYTORDP= 0
##$COROFFS= 0
##$CY= 15
##$DATMOD= 1
##$DC= 0
##$DFILT= <>
##$DTYPP= 0
##$F1P= 0
##$F2P= 0
##$FCOR= 0.5
##$FTSIZE= 131072
##$FT_mod= 6
##$GAMMA= 0
##$GB= 0
##$INTBC= 1
##$INTSCL= 1
##$ISEN= 128
##$LB= 0.3
##$LEV0= 0
##$LPBIN= 0
##$MAXI= 10000
##$MC2= 0
##$MEAN= 0
##$ME_mod= 0
##$MI= 0
##$NCOEF= 0
##$NC_proc= -3
##$NLEV= 6
##$NOISF1= 0
##$NOISF2= 0
##$NSP= 0
##$NTH_PI= 0
##$NZP= 0
##$OFFSET= 14.9684
##$PC= 1
##$PHC0= 39.776
##$PHC1= 0
##$PH_mod= 1
##$PKNL= yes
##$PPARMOD= 0
##$PPDIAG= 0
##$PPIPTYP= 0
##$PPMPNUM= 2147483647
##$PPRESOL= 1
##$PSCAL= 4
##$PSIGN= 0
##$PYNMP= <proc.py>
##$REVERSE= no
##$SF= 400.130004885643
##$SI= 131072
##$SIGF1= 0
##$SIGF2= 0
##$SINO= 400
##$SIOLD= 131072
##$SPECTYP= <>
##$SREGLST= <1H.CDCl3>
##$SSB= 0
##$STSI= 131072
##$STSR= 0
##$SW_p= 8223.68421052632
##$SYMM= 0
##$S_DEV= 0
##$TDeff= 65536
##$TDoff= 0
##$TI= <>
##$TILT= no
##$TM1= 0
##$TM2= 0
##$TOPLEV= 0
##$USERP1= <user>
##$USERP2= <user>
##$USERP3= <user>
##$USERP4= <user>
##$USERP5= <user>
##$WDW= 1
##$XDIM= 131072
##$YMAX_p= 497222091
##$YMIN_p= -489558299
##$CURPLOT= <Network HP LaserJet P1505>
##$CURPRIN= <$Network HP LaserJet P1505>
##$DFORMAT= <normdp>
##$LAYOUT= <+/1D_H.xwp>
##$LFORMAT= <normlp>
##$PFORMAT= <normpl>
##$SURQMSG= 1
$$ End of Bruker specific parameters
$$ ---------------------------------
##NTUPLES= NMR SPECTRUM
##VAR_NAME=  FREQUENCY,     SPECTRUM/REAL,   SPECTRUM/IMAG
##SYMBOL=    X,             R,               I
##VAR_TYPE=  INDEPENDENT,   DEPENDENT,       DEPENDENT
##VAR_FORM=  AFFN,          ASDF,            ASDF
##VAR_DIM=   131072,        131072,          131072
##UNITS=     HZ,            ARBITRARY UNITS, ARBITRARY UNITS
##FACTOR=    0.0627417313425165, 1,          1
##FIRST=     8223.62146879498, 7733,         -86490
##LAST=      0,             9215,            -84306
##MIN=       0,             -489558299,      0
##MAX=       8223.62146879498, 497222091,    0
$$ Real data points
##PAGE= N=1
##DATA TABLE= (X++(R..R)), XYDATA
$$ [...]
61742D034849J24222J33007J41958J52110J63522J75645J88292K01815K16486
61733E531906K32216K48858K66415K85000L04986L27051L51772L79254M09601
61724H337059M43563M82160N25732N73887O26420O83819P46801Q15757Q90642
61715A4125840R70940J055709J144006J235134J327928J419860J507108J585012
61707B4371537J647395J685422J687809J642322J536973J361296J109807P86872
61699C5829433M08949J858m04679p82129j107281j365677j552866j672360j732005
61690B7623243j741415j710930j650798j570157j476490j375840j273159j172321
61682A5652133j075903r85149r00421q21910p49931o84582o25459n72034n23943
$$ plain form
61742 4034849 4159071 4292078 4434036 4586146 4749668 4925313 5113605 5315420 5531906
61733 5531906 5764122 6012980 6279395 6564395 6869381 7196432 7548204 7927458 8337059
61724 8337059 8780622 9262782 9788514 10362401 10988821 11672640 12419441 13235198 14125840
61715 14125840 15096780 16152489 17296495 18531629 19859557 21279417 22786525 24371537
61707 24371537 26018932 27704354 29392163 31034485 32571458 33932754 35042561 35829433
61699 35829433 36238382 36240240 35835561 35053432 33946151 32580474 31027608 29355248 27623243
61690 27623243 25881828 24170898 22520100 20949943 19473453 18097613 16824454 15652133
61682 15652133 14576230 13591081 12690660 11868750 11118819 10434237 9808778 9236744 8712801
61673H712801m80617m41046m04484l71103l41314l14675k90219k67635k47265
61664E554443k28951k11847j95591j80930j68739j58817j49922j40680j30494
61655C988472j19916j10245j02432r6427r1665q7643q3700p8948p3294o7884o3635
61644C012683n9855n5583n1718n0194n1061n2067n1469m9761m8098m6456m4229
61633B452192m1721l9989l9605m0068m0112l8615l5773l3308l2769l3545l3443
61622B043244l1140k7212k2940j9404j7552j7622j8242j7577j5666j4207j3797
61611A827885j3147j1493r940r543r723r758j0248j1844j3722j4617j4259j2848
61599A686743j0329p424o058p155q948r045p410n921n658o158o747p084o688n306
$$ plain form
61673 8712801 8232184 7791138 7386654 7015551 6674237 6359562 6069343 5801708 5554443
61664 5554443 5325492 5113645 4918054 4737124 4568385 4409568 4259646 4118966 3988472
61655 3988472 3868556 3758311 3655879 3559452 3467787 3380144 3296444 3217496 3144202 3076318 3012683
61644 3012683 2952828 2897245 2845527 2795333 2744272 2692205 2640736 2590975 2542877 2496421 2452192
61633 2452192 2410471 2370482 2330877 2290809 2250697 2212082 2176309 2143001 2110232 2076687 2043244
61622 2043244 2012104 1984892 1961952 1942548 1924996 1907374 1889132 1871555 1855889 1841682 1827885
61611 1827885 1814738 1803245 1793305 1783762 1774039 1764281 1754033 1742189 1728467 1713850 1699591 1686743
61599 1686743 1676414 1668990 1662932 1655777 1646829 1637784 1630374 1624453 1618795 1612637 1605890 1598806 1592118 1586812
61585A586812l649k691k427k170j681j061lJ782L618M313L423J636K09L15K117
61570A590543M045M062K307J235K357M267N050N032N389N487L937J452K94J058
61556A636515K012J577k90k999n850p735q016p734q388r675j0093r571r437r746
61542A550570q859o349m261m508o455q000p858n958k885J79J925K172K046K549
61528A504308L753N636Q438J1633J3818J4516J5096J7000J9799K1955K2974K3838
61516A682764K5654K8503L1579L4197L6658M0066M4765M9176N1128N0460M9424
61505B124374N0175N2640N5148N6309N5764N3837N1121M8218M5473M3085M1271
61494B677415L9776L7584L4063L0259K7958K7274K6274K3317J8595J3091P280
$$ plain form
61585 1586812 1583163 1580472 1578045 1575875 1574194 1573133 1573130 1574912 1578530 1582843 1586266 1587902 1588111 1588426 1590543
61570 1590543 1594588 1598650 1600957 1602192 1604549 1608816 1613866 1618898 1624287 1629774 1633711 1635163 1635457 1636515
61556 1636515 1638527 1640104 1639814 1636815 1630965 1623230 1615214 1607480 1599092 1589417 1579324 1569753 1560316 1550570
61542 1550570 1541711 1535362 1531101 1526593 1520138 1512138 1504280 1498322 1495437 1495616 1497541 1499713 1501759 1504308
61528 1504308 1508061 1513697 1522135 1533768 1547586 1562102 1577198 1594198 1613997 1635952 1658926 1682764
61516 1682764 1708418 1736921 1768500 1802697 1839355 1879421 1924186 1973362 2024490 2074950 2124374
61505 2124374 2174549 2227189 2282337 2338646 2394410 2448247 2499368 2547586 2593059 2636144 2677415
61494 2677415 2717191 2754775 2788838 2819097 2847055 2874329 2900603 2923920 2942515 2955606 2962886
61483B962886J539l292o734r258j1314j2539j2594j2021j1458j0752r677q765
61471B856021q339p317m111J397P668J3162J7546K1560K6372L2847M0684M8576
61459C046066N5879O3713P3450Q4481R4794J03855J13563J25795J40096J54741
61449D056433J69361J85324K03680K23726K43863K63097K81403K99099L16346
61440F242332L32853L47510L58292L62789L58787L44383L18211K80135K31583
61431I176875J74687J11592M5295j9516p7934j27496j68379k00965k24635k39322
61421H450202k46665k48461k45108k36726k24665k10488j94274j75510j55071
61412F513234j34757j15158r5639p6162n7607m0267k3643p840O272J8636L0388
$$ plain form
61483 2962886 2964425 2961133 2954399 2945141 2933827 2921288 2908694 2896673 2885215 2874463 2864786 2856021
61471 2856021 2847682 2840365 2836254 2837651 2845319 2858481 2876027 2897587 2923959 2956806 2997490 3046066
61459 3046066 3101945 3165658 3239108 3323589 3418383 3522238 3635801 3761596 3901692 4056433
61449 4056433 4225794 4411118 4614798 4838524 5082387 5345484 5626887 5925986 6242332
61440 6242332 6575185 6922695 7280987 7643776 8002563 8346946 8665157 8945292 9176875
61431 9176875 9351562 9463154 9508449 9488933 9410999 9283503 9115124 8914159 8689524 8450202
61421 8450202 8203537 7955076 7709968 7473242 7248577 7038089 6843815 6668305 6513234
61412 6513234 6378477 6263319 6167680 6091518 6033911 5993644 5970001 5962161 5968433 5987069 6017457
61401F017457M2264N3873O4658P4342Q2143Q7083Q9529R1049R2151R1688Q9240
61390F875477Q6478Q4977Q3954Q1602P7857P4415P2556P2132P2233P1757O9636
61379G723074O5702O1233N7704N5058N1907M7210M0995L3671K5620J7465R827
61368H189466K586m902j2645j9702k5396l0244l5130l9763m2736m3280m2399m1745
61356G854110m1451l9831l5548k9496k4043k0584j8454j6084j2817r532p850q577
61344G589843j0816j2885j4247j5895j8392k0460k0447j8315j4962j0095k310
61333G431019Q895K2700L8471N6269P5749R6085J17350J40574J66034J92751K19946
61322H565843K47528K74775L00211L23407L45140L64755L79078L85210L82937
$$ plain form
61401 6017457 6059721 6113594 6178252 6252594 6334737 6421820 6511349 6602398 6694549 6786237 6875477
61390 6875477 6961955 7046932 7130886 7212488 7290345 7364760 7437316 7509448 7581681 7653438 7723074
61379 7723074 7788776 7850009 7907713 7962771 8014678 8061888 8102883 8136554 8162174 8179639 8189466
61368 8189466 8192052 8187150 8174505 8154803 8129407 8099163 8064033 8024270 7981534 7938254 7895855 7854110
61356 7854110 7812659 7772828 7737280 7707784 7683741 7663157 7644703 7628619 7615802 7606270 7598420 7589843
61344 7589843 7579027 7566142 7551895 7536000 7517608 7497148 7476701 7458386 7443424 7433329 7431019
61333 7431019 7439914 7462614 7501085 7557354 7633103 7729188 7846538 7987112 8153146 8345897 8565843
61322 8565843 8813371 9088146 9388357 9711764 10056904 10421659 10800737 11185947 11568884
61313A1568884L72874L53587L22393K78351K22891J58386Q7980J6492n0658j10217
61303A3220963j62251k08681k51249k90386l24787l52077l70734l81365l85795
61294A0493638l85408l80997l73275l62471l47983l29812l09836k90375k71673
61285G441808k52076k30632k08302j86584j66128j46779j27933j08726q8872o9515
61275E856261n2321l7588k4095j0836K087J4341K6002L6894M6325N3956O0205
61264E971231O5370O9090P1165P2214P2817P2471P0121O5479N9448N3195M7191
61253F689792M1149L4792K8476K2811J7696J2250N972n91o828j3198k0563k8785
61241F782973l6874m4357n1460n8014o3339o7512p1684p6579q1331q4430q5263
$$ plain form
61313 11568884 11941758 12295345 12617738 12896089 13118980 13277366 13365346 13381838 13331180 13220963
61303 13220963 13058712 12850031 12598782 12308396 11983609 11631532 11260798 10879433 10493638
61294 10493638 10108230 9727233 9353958 8991487 8643504 8313692 8003856 7713481 7441808
61285 7441808 7189732 6959100 6750798 6564214 6398086 6251307 6123374 6014648 5925776 5856261
61275 5856261 5803940 5766352 5742257 5731421 5733508 5747849 5773851 5810745 5857070 5911026 5971231
61264 5971231 6036601 6105691 6176856 6249070 6321887 6394358 6464479 6529958 6589406 6642601 6689792
61253 6689792 6730941 6765733 6794209 6817020 6834716 6846966 6852938 6852347 6845519 6832321 6811758 6782973
61241 6782973 6746099 6701742 6650282 6592268 6528929 6461417 6389733 6313154 6231823 6147393 6062130
61230F062130q4372q2681q0933p9320p7145p3241o7274o0399n4185m9065m4267
61219E309248l9042l3635k9140k6652k6405k7473k8433k8495k7862k7115k6583
61208D988413k6400k6510k6200k4173j9707j3532o893j3P744J6345K4765L2606
61196D926445M1197N2268O5878Q0345R4087J06768J18750J30208J41058J50986
61186E907990J59093J63833J63762J58067J46265J27860J02722P1355L4367p624
61176G027690n2801r7455j37515j70808j97038k15995k27093k30762k28932k23482
61166E245809k15163k04552j92883j81053j68593j54837j40514j27088j14893
61157C746233j03207r2104q2828p5869o9859o3224n6151m9811m4124l7662k9918
$$ plain form
61230 6062130 5977758 5895077 5814144 5734824 5657679 5584438 5517164 5456765 5402580 5353515 5309248
61219 5309248 5270206 5236571 5207431 5180779 5154374 5126901 5098468 5069973 5042111 5014996 4988413
61208 4988413 4962013 4935503 4909303 4885130 4865423 4851891 4844998 4844985 4852729 4869074 4893839 4926445
61196 4926445 4967642 5019910 5085788 5166133 5260220 5366988 5485738 5615946 5757004 5907990
61186 5907990 6067083 6230916 6394678 6552745 6699010 6826870 6929592 7000947 7035314 7027690
61176 7027690 6974889 6877434 6739919 6569111 6372073 6156078 5928985 5698223 5469291 5245809
61166 5245809 5030646 4826094 4633211 4452158 4283565 4128728 3988214 3861126 3746233
61157 3746233 3643026 3550922 3468094 3392225 3322366 3259142 3202991 3153180 3109056 3071394 3041476
61146C041476k2354j6394j1378n709M86N395Q220J0361J3338J6736J9039J9522
61134C078738J8317J5527J1409O958L055m40l875o753q675j0644j3958j8181k1829
61121C049649k4660k7571l0376l1760l1643l1792l3483l6016l8024l8860l8463
61110B687001l7306l6820l8216m0604m1964m2182m3088m5197m6793m6944m6893
61099B220994m7300m6617m3796m0319l7793l5789l3866l3392l4998l6397l5526
61088A795201l4070l4811l6937l7287l5245l3082l1890l0355k7621k4456k1439
61077A448008j8465j6138j5274j4937j3207r926o454l020J116N011O509N673M913
61064A373809N325N720N862P525J1182J4534J5858J6336J7436J8257J7428J5756
$$ plain form
61146 3041476 3019122 3002728 2991350 2985641 2986127 2991522 2999742 3010103 3023441 3040177 3059216 3078738
61134 3078738 3097055 3112582 3123991 3130949 3134004 3133564 3129689 3122936 3114261 3103617 3089659 3071478 3049649
61121 3049649 3024989 2997418 2967042 2935282 2903639 2871847 2838364 2802348 2764324 2725464 2687001
61110 2687001 2649695 2612875 2574659 2534055 2492091 2449909 2406821 2361624 2314831 2267887 2220994
61099 2220994 2173694 2127077 2083281 2042962 2005169 1969380 1935514 1902122 1867124 1830727 1795201
61088 1795201 1761131 1726320 1689383 1652096 1616851 1583769 1551879 1521524 1493903 1469447 1448008
61077 1448008 1429543 1413405 1398131 1383194 1369987 1360061 1353607 1350587 1351703 1356714 1363223 1368896 1373809
61064 1373809 1379134 1384854 1390716 1398241 1409423 1423957 1439815 1456151 1473587 1491844 1509272 1525028
61052A525028J5093J5807J6917J7525J7067J5378J3515J2892J2731J0317N022
61041A677292%j811j460j788l246m283m617n462o936p597o663n067m141m392n524
61026A614305o816p647q283r545j1261j2093j1522j0695j0348r421p228n539o536
61013A497371r598j2109j2848j2709j2463j1805j0608r343q051o290m340l296
61001A383911l592m280l946j976Q78K749K172k0j093M52L094M576M970O041Q496
60986A402432J1552J4613J7541J9579J9736J8474J7564J8070J9474K0763K1510
60975A601308K2025K3262K6091K9898L2599L3157L3183L4840L8096M1519M4711
60964A960689M8077N1136N3344N5890O0234O5348O9016P1687P6110Q2855Q9181
$$ plain form
61052 1525028 1540121 1555928 1572845 1590370 1607437 1622815 1636330 1649222 1661953 1672270 1677292
61041 1677292 1677292 1675481 1674021 1672233 1668987 1664704 1660087 1654625 1647689 1640092 1633429 1628362 1624221 1619829 1614305
61026 1614305 1607489 1599842 1591559 1582014 1570753 1558660 1547138 1536443 1526095 1516674 1509446 1503907 1497371
61013 1497371 1487773 1475664 1462816 1450107 1437644 1425839 1415231 1405888 1397837 1391547 1387207 1383911
61001 1383911 1380319 1376039 1372093 1370117 1370995 1373744 1375916 1375896 1374803 1375255 1378349 1382925 1387895 1393936 1402432
60986 1402432 1413984 1428597 1446138 1465717 1485453 1503927 1521491 1539561 1559035 1579798 1601308
60975 1601308 1623333 1646595 1672686 1702584 1735183 1768340 1801523 1836363 1874459 1915978 1960689
60964 1960689 2008766 2059902 2113246 2169136 2229370 2294718 2363734 2435421 2511531 2594386 2683567
60953B683567R3232R6701J02088J09702J18741J29210J41029J52833J63370J73115
60943C963588J83371J94743K07362K21547K37550K55760K77467L03977L34677
60934F180042L67854M03687M44408M91495N45672O09923O88646P82328Q87087
60925A1401142J001405J128725J270884J425132J592554J783023K004473K254614
60917B3861952K533704K851399L185315L419304L360078K872531K022711J069207
60909D5176201K92568j68927l28581k51793q161K75435L83400J12361n67717j467711
60899D3447075k307166k889147l169650l206032l079247k858639k598008k332325
60891B1006861k075899j832487j607041j405044j226207j066402r24990q05181
$$ plain form
60953 2683567 2776799 2873500 2975588 3085290 3204031 3333241 3474270 3627103 3790473 3963588
60943 3963588 4146959 4341702 4549064 4770611 5008161 5263921 5541388 5845365 6180042
60934 6180042 6547896 6951583 7395991 7887486 8433158 9043081 9731727 10514055 11401142
60925 11401142 12402547 13531272 14802156 16227288 17819842 19602865 21607338 23861952
60917 23861952 26395656 29247055 32432370 35851674 39211752 42084283 44106994 45176201
60909 45176201 45468769 45299842 44971261 44719468 44711307 44986742 45370142 45482503 44914786 43447075
60899 43447075 41139909 38250762 35081112 31875080 28795833 25937194 23339186 21006861
60891 21006861 18930962 17098475 15491434 14086390 12860183 11793781 10868791 10063610
60883A0063610p07780o28697n62657n06198m57179m14342l77793l47671l22238
60874E739055k98998k77385k58304k41390k24943k08657j94258j83131j74951
60865C677038j68673j63114j56537j47716j37778j29159j22349j15511j07721
60856B428480j00451r4933r0016q4047p7327p1300o6404o2159n8419n5159n1707
60845A616558m7490m3124l9693l7288l5195l3016l0785k8463k6209k4596k3661
60834A247038k2297j9621j6484j4487j3887j3541j2575j0884q294m735j290L90
60822A109333K46J13J336L091L815L361K826K819K919K619J913J000J04l52l8
60807A135105O25O55l20j465j809j542j737k763l592l020j151P32J558J351R53
$$ plain form
60883 10063610 9355830 8727133 8164476 7658278 7201099 6786757 6408964 6061293 5739055
60874 5739055 5440057 5162672 4904368 4662978 4438035 4229378 4035120 3851989 3677038
60865 3677038 3508365 3345251 3188714 3040998 2903220 2774061 2651712 2536201 2428480
60856 2428480 2328029 2233096 2143080 2059033 1981706 1910406 1844002 1781843 1723424 1668265 1616558
60845 1616558 1569068 1525944 1486251 1448963 1413768 1380752 1349967 1321504 1295295 1270699 1247038
60834 1247038 1224741 1205120 1188636 1174149 1160262 1146721 1134146 1123262 1114968 1110233 1108943 1109333
60822 1109333 1109579 1109692 1111028 1114119 1117934 1121295 1124121 1126940 1129859 1132478 1134391 1135391 1135495 1135143 1135105
60807 1135105 1135730 1136385 1136065 1134600 1132791 1131249 1129512 1126749 1123157 1120137 1118986 1119718 1121276 1122627 1123580
60792A123580J219K353L661M200M059M673P228J1067J4408J6393J7492J8015J7469
60779A245817J5658J3296J1065R054P614P592R021J0457J0505R274P705O287N225
60766A368570M901N266N514N211M968N197N275M892M932N718N702L779J613J425
60752A432963K321J500j275l348l459l453m887o680p513q254j0220j2742j4247
60739A360706j4490j4102j3115j1583j0570j0804j1131j0080q360p922q784q668
60727A231097o137k546k99j38p58m64J395M169O642P974Q200Q162R018J1450J4769
60712A292534J7116J7388J6708J7011J8328J9002J8576J8610J9804K0385J8754
60701A494216J6050J4302J3290J1409Q756O986O440N776M624M404N857P545P764
$$ plain form
60792 1123580 1124799 1127152 1130813 1135013 1139072 1143745 1150973 1162040 1176448 1192841 1210333 1228348 1245817
60779 1245817 1261475 1274771 1285836 1294890 1302504 1310096 1319117 1329574 1340079 1349353 1357058 1363345 1368570
60766 1368570 1373471 1378737 1384251 1389462 1394430 1399627 1404902 1409794 1414726 1420444 1426146 1429925 1431538 1432963
60752 1432963 1435284 1436784 1435509 1432161 1428702 1425249 1420362 1413682 1406169 1397915 1387695 1374953 1360706
60739 1360706 1346216 1332114 1318999 1307416 1296846 1286042 1274911 1264831 1256471 1248549 1239765 1231097
60727 1231097 1224960 1222414 1222115 1221977 1221219 1220755 1222150 1226319 1232961 1240935 1249135 1257297 1266315 1277765 1292534
60712 1292534 1309650 1327038 1343746 1360757 1379085 1398087 1416663 1435273 1455077 1475462 1494216
60701 1494216 1510266 1524568 1537858 1549267 1558023 1565009 1571449 1577225 1581849 1586253 1592110 1599655 1607419
60688A607419O562N017L711K772K476K727K502Q07k103m899o476o812o793p336
60674A599574q399q887q043o766o800q592j0802j2043j2226j1929j1405j0799
60662A482883j0464j0324r517p490n038l500l124k870j811j99R35R50K11l73m66
60647A429803p79k313n047p724q932q225o285m435l836m530n159m258k055m41
60633A365784q22k528l709l410k306j779k751n111p754r317r316q559q210q626
60619A291586r423j0311j1333j2382j3078j3283j3310j3339j2918j1395q845o257
60607A155712m665m192m058l428k128n45P91J411J063P8n45O1J624K843K756J734
60591A148512R54J014J424J515J527K397M374O222O370M742K919K202K125J393
$$ plain form
60688 1607419 1613981 1618998 1622709 1625481 1627957 1630684 1633186 1633993 1631890 1626991 1620515 1613703 1606910 1599574
60674 1599574 1591175 1582288 1574245 1567479 1560679 1552087 1541285 1529242 1517016 1505087 1493682 1482883
60662 1482883 1472419 1462095 1452578 1445088 1440050 1436550 1433426 1430556 1428745 1428546 1429481 1430431 1430642 1430269 1429803
60647 1429803 1429024 1426711 1421664 1413940 1405008 1396783 1390498 1386063 1382227 1377697 1372538 1368280 1366225 1365784
60633 1365784 1364962 1362434 1358725 1355315 1353009 1351230 1348479 1343368 1335614 1326297 1316981 1308422 1300212 1291586
60619 1291586 1282163 1271852 1260519 1248137 1235059 1221776 1208466 1195127 1182209 1170814 1161969 1155712
60607 1155712 1151047 1146855 1142797 1139369 1137241 1136696 1137487 1138898 1139961 1140039 1139494 1139555 1141179 1144022 1146778 1148512
60591 1148512 1149466 1150480 1151904 1153419 1154946 1157343 1161717 1167939 1174309 1179051 1181970 1184172 1186297 1187690
60577A187690j65j337j057N06K455M084N145N780O482P754R497J1101J2273J3441
60563A263649J5010J6652J7751J8390J9349K1061K2851K3465K2368K0518J9611
60552A480675K0425K1966K2542K1570J9957J8603J7070J4068R144L518r03l385
60540A645250n199q345j3179j7632j9298j8097j6214j5441j5530j5455j5130j4879
60528A470851j4074j1638p873m552k883k321j742j003o89j007j581k029k187j997
60514A415275j607j314r98j72R19R19q15k447j260K795O529P241N832N250O810
60499A442957R429J1851J3961J5789J6729J6448J5698J5588J6616J8848K2404
60488A616318K6981L1244L3565L3612L2998L4062L7883M3304M8098N1349N4343
$$ plain form
60577 1187690 1187525 1186188 1185131 1185637 1188092 1192176 1197321 1203101 1209583 1217337 1226834 1237935 1250208 1263649
60563 1263649 1278659 1295311 1313062 1331452 1350801 1371862 1394713 1418178 1440546 1461064 1480675
60552 1480675 1501100 1523066 1545608 1567178 1587135 1605738 1622808 1636876 1646020 1649538 1648635 1645250
60540 1645250 1640051 1631706 1618527 1600895 1581597 1563500 1547286 1531845 1516315 1500860 1485730 1470851
60528 1470851 1456777 1445139 1437266 1432714 1429831 1427510 1425768 1424765 1424076 1423069 1421488 1419459 1417272 1415275
60514 1415275 1413668 1412354 1411356 1411184 1412103 1413022 1412207 1409760 1408500 1411295 1417824 1425065 1430897 1436147 1442957
60499 1442957 1452386 1464237 1478198 1493987 1510716 1527164 1542862 1558450 1575066 1593914 1616318
60488 1616318 1643299 1674543 1708108 1741720 1774718 1808780 1846663 1889967 1938065 1989414 2043757
60477B043757N8633O3403O5677O3180N6129M5927L3306J8506K434j3499k8198
60466B409255m0404m7966m9166m5045l9050l3749k8825k2822j5705q592j824N078
60454B081185J1757J6938K0419K3727K7979L2232L5101L7343M1305M8176N7046
60443B433208O6693P6791Q7140R7265J07545J19502J34088J50676J68483J87694
60433C629085K08056K27646K44720K59920K74979K89916L03527L16321L30798
60424F084968L48303L66880L81838L86472L72572L33210K66810J77485P1327m5412
60414H744453j64067k72687l60403m22157m58321m71572m66006m47508m21914
60405E259818l92469l60412l27347k95375k65436k37373k11452j88297j67720
$$ plain form
60477 2043757 2102390 2165793 2231470 2294650 2350779 2396706 2430012 2448518 2450952 2437453 2409255
60466 2409255 2368851 2320885 2271719 2226674 2187624 2153875 2125050 2102228 2086523 2077931 2076107 2081185
60454 2081185 2092942 2109880 2130299 2154026 2182005 2214237 2249338 2286681 2327986 2376162 2433208
60443 2433208 2499901 2576692 2663832 2761097 2868642 2988144 3122232 3272908 3441391 3629085
60433 3629085 3837141 4064787 4309507 4569427 4844406 5134322 5437849 5754170 6084968
60424 6084968 6433271 6800151 7181989 7568461 7941033 8274243 8541053 8718538 8789865 8744453
60414 8744453 8580386 8307699 7947296 7525139 7066818 6595246 6129240 5681732 5259818
60405 5259818 4867349 4506937 4179590 3884215 3618779 3381406 3169954 2981657 2813937
60396B813937j49314j33918j22574j14013j05095r4303q3234p4158o7460o2083
60386A807785n7106n2090m6908m2159l9070l8143l8354l8108l6705l4474l1826
60375A352842k8689k4889k0904j7947j6893j7058j6779j5499j4394j4368j4525
60364A150897j3609j2010j0866j0013q518o781o121o300n469k997n80K55K56J084
60350A069228L026N067O465P240P619P648P156N864L956K488K566L990N454O177
60336A143944O537P092P920Q907R662R189O883M087L147M452N840N553M337L663
60322A231213L426K683J572Q11oj916m496n831m939l142k474l307m074l158o26
60307A205736K043L638M188M164L536K351J702K861N447P605Q284Q313Q861R806
$$ plain form
60396 2813937 2664623 2530705 2408131 2294118 2189023 2094720 2011486 1937328 1869868 1807785
60386 1807785 1750679 1698589 1651681 1609522 1570452 1532309 1493955 1455847 1419142 1384668 1352842
60375 1352842 1324153 1299264 1278360 1260413 1243520 1226462 1209683 1194184 1179790 1165422 1150897
60364 1150897 1137288 1125278 1114412 1104399 1095881 1089100 1082979 1076679 1071210 1068213 1067633 1067888 1068144 1069228
60350 1069228 1072254 1077321 1083786 1091026 1098645 1106293 1113449 1119313 1123269 1125757 1128323 1132313 1137767 1143944
60336 1143944 1150481 1157573 1165493 1174400 1184062 1193251 1200134 1204221 1207368 1211820 1217660 1223213 1227550 1231213
60322 1231213 1234639 1237322 1238894 1239705 1239699 1237783 1233287 1227456 1222517 1219375 1216901 1213594 1209520 1206362 1205736
60307 1205736 1207779 1211417 1215605 1219769 1223305 1225656 1227358 1230219 1235666 1243271 1251555 1259868 1268729 1278535
60293A278535J0230R786Q996Q755R775J1901J3746J3809J2126J0081Q557P376
60281A403673O586O662O980N821K870K35k74M28L94m36o17M13K035L927O029P483
60265A452209P291N954M786L788J845r08k867l440l979n328o157n033l027k689
60251A442445m842p670q872p710n005k099j69K37m55j150j058l28L84P79J125
60236A405612J745K532K993K759K048J644K205L393M056L649L220M258O655Q705
60222A455474R454R969J1600J3857J5165J5160J4908J5047J5032J4399J3596J3190
60210A616851J3259J4004J6016J9305K2736K5134K6509K7836K9948L2928L6195
60199A880721L9035M1439M4389M8634N3317N6758N8823O1485O6560P3763Q1492
$$ plain form
60293 1278535 1288765 1298551 1307547 1316302 1326077 1337978 1351724 1365533 1377659 1387740 1396297 1403673
60281 1403673 1410259 1416921 1423901 1429722 1432592 1432827 1432553 1432981 1433375 1432939 1432322 1432735 1434770 1438697 1444726 1452209
60265 1452209 1459500 1465454 1470240 1474028 1475873 1474965 1472098 1468658 1464679 1459351 1453194 1448161 1445134 1442445
60251 1442445 1437603 1429933 1421061 1413351 1408346 1406247 1406078 1406315 1405860 1404710 1403652 1403324 1403708 1404487 1405612
60236 1405612 1407357 1409889 1412882 1415641 1417689 1419333 1421538 1424931 1428987 1432636 1435856 1440114 1446769 1455474
60222 1455474 1464928 1474897 1486497 1500354 1515519 1530679 1545587 1560634 1575666 1590065 1603661 1616851
60210 1616851 1630110 1644114 1660130 1679435 1702171 1727305 1753814 1781650 1811598 1844526 1880721
60199 1880721 1919756 1961195 2005584 2054218 2107535 2164293 2223116 2284601 2351161 2424924 2506416
60188B506416Q8733R5626J02889J11283J21045J31303J40691J48958J57273J66456
60178C770673J75671J83615J90088J95473J99228J99918J96673J89857J80428
60169E481624J69110J56062J40906J23289J03590Q2818O1716M0596K0230K084
60159F382025j2847k4784l4214m0866m4150m4039m0892l4915k6370j5836l757
60148F059355R883K5015M1178N8054P5652R3565J10846J27125J42973J58487J72259
60137G074392J82472J88263J89432J85768J77567J66051J52001J34601J12727
60128H563274Q6913N9002L0282J126k7706n4612p8183r7950j13920j25862j33138
60117H109226j35107j31846j24545j14567j02023q6082o6888m6006k4529k121
$$ plain form
60188 2506416 2595149 2690775 2793664 2904947 3025992 3157295 3297986 3446944 3604217 3770673
60178 3770673 3946344 4129959 4320047 4515520 4714748 4914666 5111339 5301196 5481624
60169 5481624 5650734 5806796 5947702 6070991 6174581 6257399 6319115 6359711 6379941 6382025
60159 6382025 6369178 6344394 6310180 6269314 6225164 6181125 6140233 6105318 6078948 6063112 6059355
60148 6059355 6069238 6094253 6135431 6193485 6269137 6362702 6473548 6600673 6743646 6902133 7074392
60137 7074392 7256864 7445127 7634559 7820327 7997894 8163945 8315946 8450547 8563274
60128 8563274 8650187 8709189 8739471 8740597 8712891 8658279 8580096 8482146 8368226 8242364 8109226
60117 8109226 7974119 7842273 7717728 7603161 7501138 7415056 7348168 7302162 7277633 7275512
60107G275512K1072M3024O1852P8188R3757J08150J18933J24689J26147J24051
60097H175375J17656J06118R0310P2543N5009L8905K4530J1819R74p159j1287
60086H674793j0117k815J0242K7008M4998O3644Q4764J10026J38750J68963J99824
60075I510080K31881K65400K99627L33725L67704M02376M38530M75568N10820
60066A2835711N41138N65661N85813O01998O11734O12056O02180N82461N52343
60057A8091095N11421M61288M04069L39868K67897J89552J07968K4881n9627j44173
60047B0194239k25245k99647l65641m21342m64386m93908n10947n16075n08584
60038A6388464m88915m59901m24306l82773l35716k85668k35907j87460j39275
$$ plain form
60107 7275512 7296584 7339608 7401460 7479648 7573405 7681555 7800488 7925177 8051324 8175375
60097 8175375 8293031 8399149 8489459 8562002 8617011 8655916 8680446 8692265 8693239 8686080 8674793
60086 8674793 8664676 8661861 8672103 8699111 8744109 8807753 8892517 9002543 9141293 9310256 9510080
60075 9510080 9741961 10007361 10306988 10640713 11008417 11410793 11849323 12324891 12835711
60066 12835711 13376849 13942510 14528323 15130321 15742055 16354111 16956291 17538752 18091095
60057 18091095 18602516 19063804 19467873 19807741 20075638 20265190 20373158 20398039 20338412 20194239
60047 20194239 19968994 19669347 19303706 18882364 18417978 17924070 17413123 16897048 16388464
60038 16388464 15899549 15439648 15015342 14632569 14296853 14011185 13775278 13587818 13448543
60029A3448543r1148m5142l943L1174O0421Q3950J00751J09294J09358J02576
60019A3905834R0544P2851M8101J6906j7277n0515q0922j08678j34674j59479
60009A3582691j83008k04718k24268k41794k57101k69039k76451k79344k78266
60000A1368702k73205k64130k51852k36811k17698j93311j65397j37411j10344
59991I518543q2251n2296k2559N342L2901O1925R0853J16170J36598J53800J69140
59980A0128166J81478J88297J87848J79966J65562J45574J20276Q9830N5555J9892
59970A1462444j5209m9313q2610j14762j44962j72269j95341k12510k22794k26329
59960A0026345k23699k15515k02878j87084j68480j46580j21825r6071p0624m4907
$$ plain form
60029 13448543 13357395 13312253 13308310 13339484 13399905 13483855 13584606 13693900 13803258 13905834
60019 13905834 13996378 14069229 14117330 14134236 14116959 14066444 13985522 13876844 13742170 13582691
60009 13582691 13399683 13194965 12970697 12728903 12471802 12202763 11926312 11646968 11368702
60000 11368702 11095497 10831367 10579515 10342704 10125006 9931695 9766298 9628887 9518543
59991 9518543 9436292 9383996 9361437 9366779 9399680 9461605 9552458 9668628 9805226 9959026 10128166
59980 10128166 10309644 10497941 10685789 10865755 11031317 11176891 11297167 11386997 11442552 11462444
59970 11462444 11447235 11397922 11315312 11200550 11055588 10883319 10687978 10475468 10252674 10026345
59960 10026345 9802646 9587131 9384253 9197169 9028689 8882109 8760284 8664213 8593589 8548682
59950H548682j7880J0224L8578O7073R5826J24141J51179J77103K02366K26207
59940I623499K46853K62870K73355K77224K73471K62111K43979K19816J90230
59931A1873408J56218J18727P8015L4505r773n1927r0700j27041j61371j91152
59921A1628909k12288k22793k24170k19169k09215j94552j75724j53544j27905
59912I889549r8246o5628l2915k047K7527N6646Q4015J07734J28254J47559J65559
59901A0408007J79504J87461J90490J90674J88636J83920J76425J66424J54040
59892A2025581J39792J25023J11196R9236Q9856Q3667Q0679Q0694Q4572R4023
59882A3014319J09794J31240J58016J90730K29088K70920L14210L58863M05152
$$ plain form
59950 8548682 8530802 8541026 8579604 8646677 8742503 8866644 9017823 9194926 9397292 9623499
59940 9623499 9870352 10133222 10406577 10683801 10957272 11219383 11463362 11683178 11873408
59931 11873408 12029626 12148353 12226368 12260873 12251100 12199173 12108473 11981432 11820061 11628909
59921 11628909 11416621 11193828 10969658 10750489 10541274 10346722 10170998 10017454 9889549
59912 9889549 9791303 9725675 9692760 9690713 9718240 9774886 9858901 9966635 10094889 10242448 10408007
59901 10408007 10587511 10774972 10965462 11156136 11344772 11528692 11705117 11871541 12025581
59892 12025581 12165373 12290396 12401592 12500828 12590684 12674351 12755030 12835724 12920296 13014319
59882 13014319 13124113 13255353 13413369 13604099 13833187 14104107 14418317 14777180 15182332
59873A5182332M51373M94690N33600N67881N96086O14419O18494O05479N74307
59864B0238661N24337M54520L64393K56260J36063J1241j12265k30300l38474
59855B1304436m31630n05904n60080n94518o10052o08680n93810n68572n34525
59846A6296665m92792m45465l94945l42704k89618k36692j84546j32948q1822
59837A3695133l2167J4767N8599R9274J35909J66865J90477K05362K10759K06785
59827A4951763J93471J69271J31940Q1457K0876m6151j17021j88763k57162l18935
59817A4620746l73151m18992m53782m75289m84673m85068m78187m64442m45346
59808A0541816m23246l98933l71744l42015l11407k81008k50992k22247j96379
$$ plain form
59873 15182332 15633705 16128395 16661995 17229876 17825962 18440381 19058875 19664354 20238661
59864 20238661 20762998 21217518 21581911 21838171 21974234 21985475 21873210 21642910 21304436
59855 21304436 20872806 20366902 19806822 19212304 18602252 17993572 17399762 16831190 16296665
59846 16296665 15803873 15358408 14963463 14620759 14331141 14094449 13909903 13776955 13695133
59837 13695133 13662966 13677733 13736332 13835606 13971515 14138380 14328857 14534219 14744978 14951763
59827 14951763 15145234 15314505 15446445 15527902 15548778 15502627 15385606 15196843 14939681 14620746
59817 14620746 14247595 13828603 13374821 12899532 12414859 11929791 11451604 10987162 10541816
59808 10541816 10118570 9719637 9347893 9005878 8694471 8413463 8162471 7940224 7743845
59799G743845j73800j53470j34803j18380j04686r3597q5296q0140p7356p5257
59789F647060p3032p1088o9524o7652o5077o1822n7229n0531m2895l7395l6128
59778F014687l8560m3143m9081n5847o2393o7925p2455p5762p6732p4531o9597
59767E328661o2674n3929m3965l4731k7989k3237j8334j1970m492L595J2691K3164
59755E086790L4196M4309N2808O0140O6834P2713P7514Q1945Q7239R3447R8758
59744E856693J01081J00006R6721R2264Q6467P8633O8796N8266M9128M3131M0678
59733F671864M0950M3097M7123N3541O2657P4491Q8989J05766J24157J44066J66486
59722G623187J92547K22179K54163K87255L20764L54395L88178M22494M57579
$$ plain form
59799 7743845 7570045 7416575 7281772 7163392 7058706 6965109 6879813 6799673 6722317 6647060
59789 6647060 6574028 6502940 6433416 6365764 6300687 6238865 6181636 6131105 6088210 6050815 6014687
59778 6014687 5976127 5932984 5883903 5828056 5765663 5697738 5625283 5549521 5472789 5398258 5328661
59767 5328661 5265987 5212058 5168093 5133362 5105373 5082136 5063802 5051832 5047340 5050935 5063626 5086790
59755 5086790 5120986 5165295 5218103 5278243 5345077 5417790 5495304 5577249 5664488 5757935 5856693
59744 5856693 5957774 6057780 6154501 6246765 6333232 6411865 6480661 6538927 6588055 6631186 6671864
59733 6671864 6712814 6755911 6803034 6856575 6919232 6993723 7082712 7188478 7312635 7456701 7623187
59722 7623187 7815734 8037913 8292076 8579331 8900095 9254490 9642668 10065162 10522741
59713A0522741M92732N25886N53378N69657N67502N39392M79470L85747K62439
59704A4898944J21108k1800j50650k55316l31720l79882m02521m04241l89911
59695A2684011l63281l27555k86579k44165k02182j60369j18194p6333l6277Q53
59685A0869929L5097O7727J00447J34064J68044K01519K34431K67388L00962L35627
59675A2715235L72037M10740M51851M95196N40421N86933O34519O84237P37582
59666A7628751P94368Q52485R10267R67805J025138J080516J131454J176087J212111
59657B6778982J235813J244257J237730J218509J187970J147106J099543J051914
59649C6201824J010647R79402R59277R49805R49252R54958R63517R70208R68965
$$ plain form
59713 10522741 11015473 11541359 12094737 12664394 13231896 13771288 14250758 14636505 14898944
59704 14898944 15020052 14998252 14847602 14592286 14260566 13880684 13478163 13073922 12684011
59695 12684011 12320730 11993175 11706596 11462431 11260249 11099880 10981686 10905353 10869076 10869929
59685 10869929 10905026 10972753 11073200 11207264 11375308 11576827 11811258 12078646 12379608 12715235
59675 12715235 13087272 13498012 13949863 14445059 14985480 15572413 16206932 16891169 17628751
59666 17628751 18423119 19275604 20185871 21153676 22178814 23259330 24390784 25566871 26778982
59657 26778982 28014795 29259052 30496782 31715291 32903261 34050367 35149910 36201824
59649 36201824 37212471 38191873 39151150 40100955 41050207 42005165 42968682 43938890 44907855
59640D4907855R54207R22386Q71020P97620P01674N87187M61187L29786J97497
59631E0730419P0057m4787j40172k12224k58940k78933k72440k42108j91407j22746
59621D9036719l7677O1772J72735K92158M17520N46969O78466Q08533R32599J047039
59611E3956833J149576J236217J298790J327394J314551J255045J142772R71406
59603F3652584P39576M53912J26980k25273n83494r25910j232927j491312j693891
59594E8820245j837029j920349j948283j930019j877028j800054j707639j607052
59586D4192792j507031j419297j356183j325814j329174j360370j408159j457998
59578C3028766j495821j512316j504270j472781j421550j356174j282428j203970
$$ plain form
59640 44907855 45862062 46784448 47655468 48453088 49154762 49741949 50203136 50532922 50730419
59631 50730419 50800476 50755689 50615517 50403293 50144353 49865420 49592980 49350872 49159465 49036719
59621 49036719 48999042 49060814 49233549 49525707 49943227 50490196 51168662 51977195 52909794 53956833
59611 53956833 55106409 56342626 57641416 58968810 60283361 61538406 62681178 63652584
59603 63652584 64392160 64846072 64973052 64747779 64164285 63238375 62005448 60514136 58820245
59594 58820245 56983216 55062867 53114584 51184565 49307537 47507483 45799844 44192792
59586 44192792 42685761 41266464 39910281 38584467 37255293 35894923 34486764 33028766
59578 33028766 31532945 30020629 28516359 27043578 25622028 24265854 22983426 21779456
59570B1779456j122578j040460r60515q84176q11099p41585o77302o18870n64944
59561A4357927n14782m69583m29738l92866l56679l22265k92315k67123k44641
59552A1067935k23929k06213j92583j82586j75479j71337j70322j71890j75190
59543I398406j79594j84423j88628j91062j91073j88826j85019j80000j73250
59534G736531j64200j53517j42677j32092j20697j07819r4403q1613o9069n5582
59524F614862m1176k7349j5392n130M625J4670K4546L2856L8839M3466M8525N4575
59512F787917O0541O5363O9237P3037P7499Q3421R1585J01762J12520J22886J33687
59501G779455J46568J61971J78769J95688K12576K30469K50626K73260K96945
$$ plain form
59570 21779456 20656878 19616418 18655903 17771727 16960628 16219043 15541741 14922871 14357927
59561 14357927 13843145 13373562 12943824 12550958 12194279 11872014 11579699 11312576 11067935
59552 11067935 10844006 10637793 10445210 10262624 10087145 9915808 9745486 9573596 9398406
59543 9398406 9218812 9034389 8845761 8654699 8463626 8274800 8089781 7909781 7736531
59534 7736531 7572331 7418814 7276137 7144045 7023348 6915529 6821126 6739513 6670444 6614862
59524 6614862 6573686 6546337 6530945 6525815 6530440 6545110 6569656 6602512 6641351 6684817 6733342 6787917
59512 6787917 6848458 6913821 6983058 7056095 7133594 7217015 7308600 7410362 7522882 7645768 7779455
59501 7779455 7926023 8087994 8266763 8462451 8675027 8905496 9156122 9429382 9726327
59492I726327L19682L40886L61920L84270M07522M29496M48222M63311M75269
59483A3356905M83756M86922M82805M71100M53066M30064M03089L73441L42061
59474A7283209L07653K67498K21830J75922J35916J03442P6250N3054L5129K3615
59464A8683518J8096J8407K5519L9840O0208Q5057J12954J41649J68100J89652
59454A9543000K03573K05677J91798J61124J16026N8216j2397r4308j82468k71214
59444A9919027l57086m37488n08697n67092o10957o39677o52780o51223o38122
59435A4855905o16390n86796n49737n07612m63752m20021l76861l34698k93868
59426A0706170k54157k15798j79947j46946j15168q2993n0826j9689J1063M2836
$$ plain form
59492 9726327 10046009 10386895 10748815 11133085 11540607 11970103 12418325 12881636 13356905
59483 13356905 13840661 14327583 14810388 15281488 15734554 16164618 16567707 16941148 17283209
59474 17283209 17590862 17858360 18080190 18256112 18392028 18495470 18571720 18624774 18659903 18683518
59464 18683518 18701614 18720021 18745540 18785380 18845588 18930645 19043599 19185248 19353348 19543000
59454 19543000 19746573 19952250 20144048 20305172 20421198 20479414 20467017 20372709 20190241 19919027
59444 19919027 19561941 19124453 18615756 18048664 17437707 16798030 16145250 15494027 14855905
59435 14855905 14239515 13652719 13102982 12595370 12131618 11711597 11334736 11000038 10706170
59426 10706170 10452013 10236215 10056268 9909322 9794154 9711161 9660335 9640646 9651709 9694545
59416I694545P5379J07059J37093J65986J94134K21365K47605K72699K95789L15628
59406A1727282L31209L41353L44310L38652L23980L00094K66281K22202J68688
59397A4364051J06851L7493l7543j14251j87853k54771l12798l60543l97821m25637
59387A2417178m44667m54506m55305m49088m38368m24341m07316l87893l66639
59378H589055l43546l18944k94140k70405k48163k27699k09303j91909j73430
59369F311516j53592j34886j19400j06214r3334q0469o8184n5877m2758k9741
59359E427061j8402q839j76P746J4822K1900K9942L8774M7736N6283O2694O4187
59347E743728O0257N4409N0717N0309N3025N9976P1590Q5254R8555J13243J31892
$$ plain form
59416 9694545 9769924 9876983 10014076 10180062 10374196 10595561 10843166 11115865 11411654 11727282
59406 11727282 12058491 12399844 12744154 13082806 13406786 13706880 13973161 14195363 14364051
59397 14364051 14470902 14508395 14470852 14356601 14168748 13913977 13601179 13240636 12842815 12417178
59387 12417178 11972511 11518005 11062700 10613612 10175244 9750903 9343587 8955694 8589055
59378 8589055 8245509 7926565 7632425 7362020 7113857 6886158 6676855 6484946 6311516
59369 6311516 6157924 6023038 5903638 5797424 5704090 5623621 5555437 5499560 5456802 5427061
59359 5427061 5408659 5399820 5399644 5407390 5422212 5444112 5474054 5512828 5560564 5616847 5679541 5743728
59347 5743728 5803985 5858394 5909111 5959420 6012445 6072421 6144011 6229265 6327820 6441063 6572955
59336F572955J51692J66079J72819J76578J83057J94265K10311K31796K58491
59327H318043K88404L20160L54485L92041M31789M72760N15643N61261O08993
59318A2263579O57914P08053P59294Q09979Q57536Q99532R33515R56829R67276
59309A9813507R63291R43516R07602Q57755P98288P33072O64265N93397N22313
59300B6797006M52807L86344L23977K65130K06673J44923P8668Q772o4906j43811
59290B8455583k27624l13086l96620m76157n49725o14610o69518p15926p55695
59281B3736622p88522q13156q29923q40259q44267q40485q28194q08830p84720
59272A6358266p56960p25041o88496o48452o07079n65647n24092m82781m43280
$$ plain form
59336 6572955 6724647 6890726 7063545 7240123 7423180 7617445 7827756 8059552 8318043
59327 8318043 8606447 8926607 9281092 9673133 10104922 10577682 11093325 11654586 12263579
59318 12263579 12921493 13629546 14388840 15198819 16056355 16955887 17889402 18846231 19813507
59309 19813507 20776798 21720314 22627916 23485671 24283959 25017031 25681296 26274693 26797006
59300 26797006 27249813 27636157 27960134 28225264 28431937 28576860 28655528 28664300 28599394 28455583
59290 28455583 28227959 27914873 27518253 27042096 26492371 25877761 25208243 24492317 23736622
59281 23736622 22948100 22134944 21305021 20464762 19620495 18780010 17951816 17142986 16358266
59272 16358266 15601306 14876265 14187769 13539317 12932238 12366591 11842499 11359718 10916438
59263A0916438m06333l70361l33751k97863k65771k38356k13613j89828j67269
59254H433293j46394j26425j06724q8097p1658n7171m3234k8599j3022K571J6833
59243G771373K9523M1907N4825O7182P7639Q7083R7416J08269J17003J22131J24735
59232H699086J26229J26712J26081J24880J23341J21071J18336J16252J15214
59223I797202J14713J15165J18109J23860J30564J36569J42368J49283J57375
59214A0985208J65321J70902J70881J62061J43982J19877R3765O7138L8978Q214
59204A2126327k4606n7394q7638j13975j36912j57239j73726j83553j85348j80658
59194A0825278j72032j60819j47293j31678j14120r4590p3573n2285l1888j3046
$$ plain form
59263 10916438 10510105 10139744 9805993 9508130 9242359 9004003 8790390 8600562 8433293
59254 8433293 8286899 8160474 8053750 7965653 7893995 7836824 7793590 7764991 7751969 7754540 7771373
59243 7771373 7800896 7842803 7897628 7964810 8042449 8129532 8226948 8335217 8452220 8574351 8699086
59232 8699086 8825315 8952027 9078108 9202988 9326329 9447400 9565736 9681988 9797202
59223 9797202 9911915 10027080 10145189 10269049 10399613 10536182 10678550 10827833 10985208
59214 10985208 11150529 11321431 11492312 11654373 11798355 11918232 12011997 12079135 12118113 12126327
59204 12126327 12101721 12044327 11956689 11842714 11705802 11548563 11374837 11191284 11005936 10825278
59194 10825278 10653246 10492427 10345134 10213456 10099336 10004746 9931173 9878888 9847000 9833954
59184I833954L646J7732K9571L9987M9064N6216O1632O6549P1910P7836Q4586
59173A0392683R2940J03353J15834J30811J49117J71116J96749K26198K59171
59164A1837972K93877L28409L62960L98674M34294M65993M90763N07639N14806
59155A5635387N07827M82314M37064L73636K94196K00812R5715j8501j37929k56492
59145A7614029l67503m66599n51676o20047o68254o95635p05751p02746o88124
59136A2147694o62510o28629n90538n51091n11728m73573m36976m01078l65567
59127G526004l32170l02899k77458k53880k31229k10253j91678j75168j59949
59118E391320j45524j31829j19223j08140r8429q9413q0648p2119o3624n4926
$$ plain form
59184 9833954 9837600 9855332 9884903 9924890 9973954 10030170 10091802 10158351 10230261 10308097 10392683
59173 10392683 10485623 10588976 10704810 10835621 10984738 11155854 11352603 11578801 11837972
59164 11837972 12131849 12460258 12823218 13221892 13656186 14122179 14612942 15120581 15635387
59155 15635387 16143214 16625528 17062592 17436228 17730424 17931236 18026951 18008450 17870521 17614029
59145 17614029 17246526 16779927 16228251 15608204 14939950 14244315 13538564 12835818 12147694
59136 12147694 11485184 10856555 10266017 9714926 9203198 8729625 8292649 7891571 7526004
59127 7526004 7193834 6890935 6613477 6359597 6128368 5918115 5726437 5551269 5391320
59118 5391320 5245796 5113967 4994744 4886604 4788175 4698762 4618114 4545995 4482371 4427445
59108D427445m6577l9427l3024k5749j6994q010j71O513J2685J8700K4794L1070
59096D351255L6979M2028M7219N4172O2463O9646P4591P9083Q5158R2403R9024
59085E094021J04234J08535J12679J17146J21680J24980J25944J25389J24914
59076F159522J24076J20651J14031J06081R8174Q9823Q0943P2687O4970N6114
59066G087072M6386L9012L5757L4473L3227L3951L9023M6913N4640O2601P3279
59055G586334Q6655J00666J15288J32317J51343J69538J85714K01579K18455K35483
59045I183372K51501K66263K79071K88429K93705K95179K91626K79528K55710
59036A1684384K19793J73906J21117O4412N964n2741j09321j59660k00278k31301
$$ plain form
59108 4427445 4380868 4341441 4308417 4282668 4265674 4257664 4257493 4264006 4276691 4295391 4320185 4351255
59096 4351255 4388234 4430262 4477481 4531653 4594116 4663762 4738353 4817436 4902594 4994997 5094021
59085 5094021 5198255 5306790 5419469 5536615 5658295 5783275 5909219 6034608 6159522
59076 6159522 6283598 6404249 6518280 6624361 6722535 6812358 6893301 6965988 7030958 7087072
59066 7087072 7133458 7172470 7208227 7242700 7275927 7309878 7348901 7395814 7450454 7513055 7586334
59055 7586334 7672989 7773655 7888943 8021260 8172603 8342141 8527855 8729434 8947889 9183372
59045 9183372 9434873 9701136 9980207 10268636 10562341 10857520 11149146 11428674 11684384
59036 11684384 11904177 12078083 12199200 12263612 12269576 12216835 12107514 11947854 11747576 11516275
59026A1516275k55374k73777k85498k90383k91045k90614k90006k88291k84779
59017H966508k79963k75128k71688k70188k69443k67180k61981k54330k45670
59008F570937k37046k28844k21165k13839k06328j98015j88848j79565j71011
58999D726276j62978j54200j44086j34056j26073j19962j13512j05406r6738q9145
58989C480120q2944p7828p3935p1144o8429o5183o2208o0331n9038n7505n6074
58978B745501n5336n4583n2452m8630m3911l9095l4720l1170k8157k4852k1287
58967B311308j8664j7448j6228j3681j0578q522p631o772n354l574j584M54K061
58954B203787L141M149M776L784J199p47l17J452K823M232P023J0448J2374J2406
$$ plain form
59026 11516275 11260901 10987124 10701626 10411243 10120198 9829584 9539578 9251287 8966508
59017 8966508 8686545 8411417 8139729 7869541 7600098 7332918 7070937 6816607 6570937
59008 6570937 6333891 6105047 5883882 5670043 5463715 5265700 5076852 4897287 4726276
58999 4726276 4563298 4409098 4265012 4130956 4004883 3884921 3771409 3666003 3569265 3480120
58989 3480120 3397176 3319348 3245413 3174269 3105840 3040657 2978449 2918118 2859080 2801575 2745501
58978 2745501 2690165 2635582 2583130 2534500 2490589 2451494 2416774 2385604 2357447 2332595 2311308
58967 2311308 2292644 2275196 2258968 2245287 2234709 2226187 2218556 2211784 2206430 2202856 2201272 2201726 2203787
58954 2203787 2206928 2211077 2215853 2219637 2220836 2220089 2219772 2221224 2224047 2228279 2235302 2245750 2258124 2270530
58940B270530J2074J2193J2109J1494J0962J0928J1481J3207J6516K0182K2284
58929B423960K2541K2333K2489K2676K2967K4253K6688K9155L0772L1891L3144
58918B712869L4409L5106L5111L5082L6087L8532M1244M2438M2033M2105M4261
58907C139277M7591N0236N1909N3592N5580N7389N9077O1261O4028O6885O9515
58896C776340P1850P3990P6771Q1420Q7677R3314R6846R9705J04406J11382J19078
58885D792779J26398J33563J41085J49322J58621J68932J79702J90911K03317
58876F244630K16963K30854K44940K60842K79373K99113L18965L40133L63726
58867H799539L88467M13245M40025M71280N05915N41055N76871O16189O59740
$$ plain form
58940 2270530 2282604 2294797 2306906 2318400 2329362 2340290 2351771 2364978 2381494 2401676 2423960
58929 2423960 2446501 2468834 2491323 2513999 2536966 2561219 2587907 2617062 2647834 2679725 2712869
58918 2712869 2747278 2782384 2817495 2852577 2888664 2927196 2968440 3010878 3052911 3095016 3139277
58907 3139277 3186868 3237104 3289013 3342605 3398185 3455574 3514651 3575912 3639940 3706825 3776340
58896 3776340 3848190 3922180 3998951 4080371 4168048 4261362 4358208 4457913 4562319 4673701 4792779
58885 4792779 4919177 5052740 5193825 5343147 5501768 5670700 5850402 6041313 6244630
58876 6244630 6461593 6692447 6937387 7198229 7477602 7776715 8095680 8435813 8799539
58867 8799539 9188006 9601251 10041276 10512556 11018471 11559526 12136397 12752586 13412326
58858A3412326P05241P51405P99543Q50467R02392R52932J001011J045970J086362
58849B1507649J120150J144759J156603J151930J128123J082878J012603R13645
58841C0218340P85341O30548M53626K59782N6200j48406l45960n29801o93864
58832C0685806q33047r44594j027921j083513j113448j122222j114846j094157
58824B2352058j061492j019392r71441r19796q65129q09081p54662p03877o56727
58815A4590461o12751n72038n34639n00426m69622m42174m16888l92468l68954
58806A0280501l46830l25430l03779k82251k61674k41696k21884k03369j87264
58797G906324j72311j56554j40504j26155j13513j00808q7593p4828o2155m8002
$$ plain form
58858 13412326 14117567 14868972 15668515 16518982 17421374 18374306 19375317 20421287 21507649
58849 21507649 22627799 23772558 24929161 26081091 27209214 28292092 29304695 30218340
58841 30218340 31003681 31634229 32087855 32347637 32403837 32255431 31909471 31379670 30685806
58832 30685806 29852759 28908165 27880244 26796731 25683283 24561061 23446215 22352058
58824 22352058 21290566 20271174 19299733 18379937 17514808 16705727 15951065 15247188 14590461
58815 14590461 13977710 13405672 12871033 12370607 11900985 11458811 11041923 10649455 10280501
58806 10280501 9933671 9608241 9304462 9022211 8760537 8518841 8296957 8093588 7906324
58797 7906324 7734013 7577459 7436955 7310800 7197287 7096479 7008886 6934058 6871903 6823901
58787F823901l2515j7745m723P551K0191L3588M8139O3584P8052R0132J01341
58776G211496J14204J28675J43180J58128J75097J93275K10527K27600K47312
58767H809494K69560K91296L11887L34411L60656L88839M17567M48289M82156
58758A2114155N17960N55053N95107O39100O85431P32864P82519Q34801Q86889
58749A8343879R35406R79596J019784J054525J080866J095717J095345J075186
58741B6680304J031654R62837Q66836P41725N88620M13007K21861K1326j81834
58732C1346336l78966n61671p23978q61629r71365j052481j107562j140056j152143
58723B3396485j145581j123127j088207j044464r96016r46321q96235q44917p93119
$$ plain form
58787 6823901 6791386 6773641 6768918 6776469 6796660 6830248 6878387 6941971 7020023 7110155 7211496
58776 7211496 7325700 7454375 7597555 7755683 7930780 8124055 8334582 8562182 8809494
58767 8809494 9079054 9370350 9682237 10016648 10377304 10766143 11183710 11631999 12114155
58758 12114155 12632115 13187168 13782275 14421375 15106806 15839670 16622189 17456990 18343879
58749 18343879 19279285 20258881 21278665 22333190 23414056 24509773 25605118 26680304
58741 26680304 27711958 28674795 29541631 30283356 30871976 31284983 31506844 31528170 31346336
58732 31346336 30967370 30405699 29681721 28820092 27848727 26796246 25688684 24548628 23396485
58723 23396485 22250904 21127777 20039570 18995106 17999090 17052769 16156534 15311617 14518498
58714A4518498p43571o97894o55356o15179n77637n42231n07416m73251m41984
58705I263979m14886l90647l67659l45754l24870l04486k85204k68432k53552
58696F308489k38055k21405k06001j93135j80827j67234j53419j41064j29966
58687D677383j19656j11119j04945r9721r4075q8523q3793p9221p4319o9959o6560
58676C685492o2972n8518n4262n1050m8206m5331m3298m2446m2004m2291m4750
58665C150364m8688n0782m9600m7860m8366n0316n1660n2551n4051n5471n5552
58654B585467n4732n4218n4053n3661n2884n1356m8553m5420m3806m3355m1425
58643B042004l7229l3310l1505l0400k8532k7066k7170k7508k6727k5892k6094
$$ plain form
58714 14518498 13774927 13077033 12421677 11806498 11228861 10686630 10179214 9705963 9263979
58705 9263979 8849093 8458446 8090787 7745033 7420163 7115677 6830473 6562041 6308489
58696 6308489 6070434 5849029 5643028 5449893 5269066 5101832 4948413 4807349 4677383
58687 4677383 4557727 4446608 4341663 4241942 4147867 4059344 3975551 3896330 3822011 3752052 3685492
58676 3685492 3622520 3564002 3509740 3458690 3410484 3365153 3321855 3279409 3237405 3195114 3150364
58665 3150364 3101676 3050894 3001294 2953434 2905068 2854752 2803092 2750541 2696490 2641019 2585467
58654 2585467 2530735 2476517 2422464 2368803 2315919 2264563 2216010 2170590 2126784 2083429 2042004
58643 2042004 2004775 1971465 1939960 1909560 1881028 1853962 1826792 1799284 1772557 1746665 1720571
58632A720571k6049k4544k2923k2661k2565k0913j8405j6563j5030j2886j0810
58621A507222r690q627o432l600j067J220K998L137J956J668K914L324J355j247
58607A495131k690l748n033m971l143k311m051n520l937j212m13n78Q73L079L677
58592A465153L653N591Q546R494R039J1050J6578K2363K5635K7041K8305L0039
58580A662487L2435L5654L9114M2111M5134M9016N3325N7147O0765O5029O9935
58569B212152P5234Q1314Q8084R4429J00161J06780J14908J23127J31189J41811
58559C269189J56862J74002J89841K04470K20127K37150K54107K70413K86134
58550E262295L00596L13387L24953L33758L34894L24271L02523K72221K33201
$$ plain form
58632 1720571 1694522 1669978 1647055 1624394 1601829 1580916 1562511 1545948 1530918 1518032 1507222
58621 1507222 1497532 1488905 1482473 1478873 1477806 1479026 1482024 1485161 1487117 1488785 1491699 1495023 1496378 1495131
58607 1495131 1492441 1488693 1483660 1478689 1475546 1473235 1469184 1463664 1459727 1458515 1458102 1457524 1458397 1461476 1465153
58592 1465153 1468806 1474397 1482943 1492437 1501476 1512526 1529104 1551467 1577102 1604143 1632448 1662487
58580 1662487 1694922 1730576 1769690 1811801 1856935 1905951 1959276 2016423 2077188 2142217 2212152
58569 2212152 2287386 2368700 2456784 2551213 2651374 2758154 2873062 2996189 3127378 3269189
58559 3269189 3426051 3600053 3789894 3994364 4214491 4451641 4705748 4976161 5262295
58550 5262295 5562891 5876278 6201231 6534989 6869883 7194154 7496677 7768898 8002099
58541H002099J83662J24274N8448r971p6935j37936j90285k34156k69439k93827
58531G155934l06254l09547l07083k99422k86949k72554k58276k42259k22797
58522D650793k02465j84410j67483j49458j32272j19172j09004r8472q8252q1592
58512C318213p8294p5073p1006o7835o5744o3362o1215o0711o0533n8269n4793
58501B601378n2797n2002n0186m7857m7340m8058m7443m5853m5942m7570m7958
58490B068372m6563m5296m4226m1517l7603l5071l4351l3500l2033l1076l0076
58479A657060k7445k4079k2243k1535j9895j7965j7957j8934j7823j4762j2787
58468A441635j2517j1863j0782j1373j3186j3311j1493j0527j1128j1061r846
$$ plain form
58541 8002099 8185761 8310035 8368483 8358512 8281577 8143641 7953356 7719200 7449761 7155934
58531 7155934 6849680 6540133 6233050 5933628 5646679 5374125 5115849 4873590 4650793
58522 4650793 4448328 4263918 4096435 3946977 3814705 3695533 3586529 3488057 3399805 3318213
58512 3318213 3239919 3164846 3093840 3026005 2960261 2896899 2835684 2774973 2714440 2656171 2601378
58501 2601378 2548581 2496579 2446393 2398536 2351196 2303138 2255695 2209842 2163900 2116330 2068372
58490 2068372 2021809 1976513 1932287 1890770 1853167 1818096 1783745 1750245 1718212 1687136 1657060
58479 1657060 1629615 1605536 1583293 1561758 1541863 1523898 1505941 1487007 1469184 1454422 1441635
58468 1441635 1429118 1417255 1406473 1395100 1381914 1368603 1357110 1346583 1335455 1324394 1314548
58457A314548r729j1189j1864j0808r781r633r300q888r723j0886r831o957n496
58444A190463o256o640n571n211o693p984p338n664m511m354n294o773o778m250
58430A107146j664k089m442n287m251l640l696k736j323j630l057l143k329l046
58416A064813m575l928j610j192k933l203p70J286P66j155l149n021n580l600
58402A030149j079j047k429j787M78J011j0Q48L535M303K612K084L672M005J757
58387A048102p9K40P26O7o14j326l395n465m728k565l195o200o704l790k098l752
58371A005224n376m890m651n663n059j794R30J288J256J461l37l698m500j890
58357I72301j20j091j133K069N454O442O987Q746R715Q783Q345R492R678P826
$$ plain form
58457 1314548 1304819 1293630 1281766 1270958 1261177 1251544 1242244 1233356 1223633 1212747 1202916 1195959 1190463
58444 1190463 1184207 1177567 1171996 1166785 1160092 1152108 1144770 1139106 1134595 1130241 1124947 1118174 1111396 1107146
58430 1107146 1105482 1103393 1098951 1093664 1089413 1085773 1082077 1079341 1078018 1076388 1073331 1070188 1067859 1064813
58416 1064813 1060238 1056310 1054700 1053508 1050575 1047372 1046602 1047888 1048654 1047499 1044350 1039329 1033749 1030149
58402 1030149 1029070 1028023 1025594 1023807 1024285 1025296 1025286 1026134 1029669 1033972 1036584 1038668 1042340 1046345 1048102
58387 1048102 1048023 1048263 1048989 1049056 1048442 1047116 1043721 1038256 1033528 1030963 1027768 1021568 1014864 1011074 1008976 1005224
58371 1005224 999848 994958 990307 984644 979585 977791 978721 980009 981265 982726 982389 978691 974191 972301
58357 972301 972181 971090 969957 972026 977480 983922 990909 999655 1009370 1018153 1026498 1035990 1045668 1053494
58343A053494O654P467P936P354Q472J1577J2544R755P250Q065R861J0112J0201
58330A170742J1226J1066Q665O369N260L184k41j888p25K27k65M72L273N175N261
58315A227801O303Q498Q131M863L460N686P357O214N560P104P561N829O030R647
58301A320044J2018J0661R825J2327J4116J1668Q033O778O434N427O020Q867J0054
58288A442272P940O567Q319R829R008Q990J1123J1598R248Q836J2081J3576J0599
58275A569986Q588J1392J4477J3832J3394J6909K0363J9411J7162J7752J9147
58264A742413J8870J9794K3637K5790K3339K1255K3951K7676K7814K6691K7500
58253B008730K7649K4910K2968K4333K4951K2482K1997K6605L0513K8768K5943
$$ plain form
58343 1053494 1060148 1067615 1075551 1082905 1091377 1102954 1115498 1125253 1132503 1140568 1150429 1160541 1170742
58330 1170742 1181968 1193034 1201699 1208068 1213328 1216512 1216271 1214383 1213658 1213885 1213620 1214092 1217365 1222540 1227801
58315 1227801 1234104 1242602 1250733 1255596 1259056 1264742 1272099 1278313 1283873 1290977 1298538 1304367 1310397 1320044
58301 1320044 1332062 1342723 1352548 1364875 1378991 1390659 1398692 1405470 1411904 1417331 1423351 1432218 1442272
58288 1442272 1450212 1456779 1465098 1474927 1483935 1492925 1504048 1515646 1524894 1533730 1545811 1559387 1569986
58275 1569986 1578574 1589966 1604443 1618275 1631669 1648578 1668941 1688352 1705514 1723266 1742413
58264 1742413 1761283 1781077 1804714 1830504 1853843 1875098 1899049 1926725 1954539 1981230 2008730
58253 2008730 2036379 2061289 2084257 2108590 2133541 2156023 2178020 2204625 2235138 2263906 2289849
58242B289849K7514L0524L0664L0705L3873L6488L5408L5146L9696M4749M5938
58231B680554M6857N1073N4356N2974N1478N4150N7237N7521N9488O5707O9792
58220C301187O7806O6706P2184P8211P8524P8070Q2611Q7299Q6738Q6376R2511
58209D178223J00594J04602J08144J15352J21313J22843J27637J40765J53561
58200E273034J58379J62431J73812J86106J91194J95146K06242K19092K26149
58191F991585K33140K47152K61239K67287K72340K85514L00730L09593L18916
58182I487496L37650L58999L73979L89914M16613M47136M71746M97481N33918
58173A3314932N73641O07654O45642O99167P59731Q15754Q75430R49298J027060
$$ plain form
58242 2289849 2317363 2347887 2378551 2409256 2443129 2479617 2515025 2550171 2589867 2634616 2680554
58231 2680554 2727411 2778484 2832840 2885814 2937292 2991442 3048679 3106200 3165688 3231395 3301187
58220 3301187 3368993 3435699 3507883 3586094 3664618 3742688 3825299 3912598 3999336 4085712 4178223
58209 4178223 4278817 4383419 4491563 4606915 4728228 4851071 4978708 5119473 5273034
58200 5273034 5431413 5593844 5767656 5953762 6144956 6340102 6546344 6765436 6991585
58191 6991585 7224725 7471877 7733116 8000403 8272743 8558257 8858987 9168580 9487496
58182 9487496 9825146 10184145 10558124 10948038 11364651 11811787 12283533 12781014 13314932
58173 13314932 13888573 14496227 15141869 15841036 16600767 17416521 18291951 19241249 20268309
58164B0268309J096481J167834J253685J343324J424735J511844J620088J736270
58156C1422570J845037J963258K113031K282846K452668K634033K845708L075365
58148E0634516L309631L576727L912428M310998M760207N294890N959254O746537
58140H8505188P635682Q653367R834720J1164004J2627215J4270541J6114519
58133A68805236J8067764K0038071K2075100K4301571K6825656K9871327L3692822
58126C43677547L7750677L9866624L6907018K7109496J1910729m737877j8907474
58119D73576740k8617741l3856626l5568428l4898051l2896730l0324762k7549181
58112B49865221k4697267k1878962j9211759j6739678j4458646j2391048j0560223
$$ plain form
58164 20268309 21364790 22532624 23786309 25129633 26554368 28066212 29686300 31422570
58156 31422570 33267607 35230865 37343896 39626742 42079410 44713443 47559151 50634516
58148 50634516 53944147 57520874 61433302 65744300 70504507 75799397 81758651 88505188
58140 88505188 96140870 104794237 114628957 125792961 138420176 152690717 168805236
58133 168805236 186873000 206911071 228986171 253287742 280113398 309984725 343677547
58126 343677547 381428224 421294848 458201866 485311362 497222091 492484214 473576740
58119 473576740 444958999 411102373 375533945 340635894 307739164 277414402 249865221
58112 249865221 225167954 203288992 184077233 167337555 152878909 140487861 129927638
58105A29927638q934527p465540o145904m980086l944302l020764k219870j533072
58097I1683573r45086n57173o10661j269007k393382l611965m594853n207531
58089G2493915n453910n391386n116533m742334m340088l929233l525399l156782
58081C6838250k831306k531744k252540k007965j800393j613965j443795j301245
58073B1055297j187188j087952r99909r31739q81159q34127p87559p49103p15277
58064A2881284o73615o25718n84992n52334n16520m77398m45912m21832l94175
58055H188788l63921l44252l37193l30588l19506l10788l05238k94552k77809
58046E304941k63113k51400k35626k16719k03362j95125j82625j65287j52379
$$ plain form
58105 129927638 120993111 113527571 107381667 102401581 98457279 95436515 93216645 91683573
58097 91683573 90738487 90181314 89570653 88301646 85908264 82296299 77701446 72493915
58089 72493915 67040005 61648619 56532086 51789752 47449664 43520431 39995032 36838250
58081 36838250 34006944 31475200 29222660 27214695 25414302 23800337 22356542 21055297
58073 21055297 19868109 18780157 17780248 16848509 15967350 15133223 14345664 13596561 12881284
58064 12881284 12207669 11581951 10996959 10444625 9928105 9450707 9004795 8582963 8188788
58055 8188788 7824867 7480615 7143422 6812834 6493328 6182540 5877302 5582750 5304941
58046 5304941 5041828 4790428 4554802 4338083 4134721 3939596 3756971 3591684 3439305
58037C439305j45451j36105j22693j13099j09090j03186r3304q5848q2310p6812
58027B371407o8887o4924o4945o1397n3240m8298m9449n0823m9573m9374n0377
58016A760120m7706m1879l9314m0701l9919l5806l3832l4842l3440k8952k6893
58005A356836k8031k6923k2920k1578k3445k2398j7140j3720j4433j4556j2374
57994A139318j2226j5019j5591j2289r938j0686j0785q772q086r277q335m992
57982A013322m231p290r410q544q068q947p574l567j509k748l369k214k877n756
57968I37218o381l883l052n472o510l848j386j787k408j498j440l012l148j210
57954H92183j016l950o403o427o762q898j0271r770r958j1507j1379q736o893
$$ plain form
58037 3439305 3293854 3157749 3035056 2921957 2812867 2709681 2616377 2530529 2448219 2371407
58027 2371407 2302520 2237596 2172651 2111254 2058014 2009716 1960267 1909444 1859871 1810497 1760120
58016 1760120 1712414 1670535 1631221 1590520 1550601 1514795 1480963 1446121 1412681 1383729 1356836
58005 1356836 1328805 1301882 1278962 1257384 1233939 1211541 1194401 1180681 1166248 1151692 1139318
57994 1139318 1127092 1112073 1096482 1084193 1074255 1063569 1052784 1044012 1035926 1026649 1018314 1013322
57982 1013322 1009091 1001801 992391 983847 975779 966832 959258 955691 954182 951434 948065 945851 942974 937218
57968 937218 930837 926954 923902 918430 911920 908072 906686 904899 902491 900993 899553 896541 893393 892183
57954 892183 891167 887217 880814 874387 867625 858727 848456 838686 828728 817221 805842 797106 790213
57941G90213p193o765m376k790l217l038j094J28m84o94N30J566K399M808P295
57926G77288N725L76l474l272j837j273m57L06j415m691n345l186k758n343o888
57911G43756n659n035o409o261l258j676m341q085r485r563r647q230n234m086
57897F56787o083p627o169m105l869m095l677m620p502q751n956j855R7L29N59
57882E93463N96L52J216K964L020R68o4J409K744J762k31j840l745n751o111n433
57866E85319o682r647j0411p975o179o956p383n860n268o841o680k299K533L747
57852E09418L179M434O576O474M373L090L986O675J0213J2301J0440O026L811
57839E90996N419P111N958L815K789J429j670m696o134p430r301r621p729o631
$$ plain form
57941 790213 783020 776255 771879 769089 765872 762834 761740 761868 761384 760690 761220 762786 765185 769993 777288
57926 777288 783013 783389 779915 776643 774806 773533 773076 773382 771967 767276 761931 758745 755987 750644 743756
57911 743756 738097 733062 726653 720392 717134 715458 711117 703032 693547 683984 674337 666107 660873 656787
57897 656787 650704 643077 636908 632803 628934 624839 621162 616542 609040 600289 594333 592478 592575 592904 593463
57882 593463 594059 594411 595627 598591 601611 602579 602515 603924 606668 608430 608199 606359 602614 596863 590752 585319
57866 585319 578637 568990 558579 550604 544425 537469 530086 524226 518958 512117 505437 503138 505671 509418
57852 509418 512597 517031 523607 530081 534454 537544 541530 548205 558418 570719 581159 587185 590996
57839 590996 596415 603526 609484 613299 616088 617517 615847 611151 605017 597587 588286 578665 570936 564305
57825E64305p823q341o222m333n239o599n569l680l312l152j322N94O44K97J215
57810E11463J700K67n56J860N601P456P793Q478R003Q508Q503R767R609O188K329
57795E97969J137R96q99l441m484n568q935j2625j3415j2195j1629j1066q687
57782E07158o355o928q752q146n906n884q199r119p253n037m247m288m840o238
57768D15966p466p220o566p374q890r125q543q915r636q910p622q149j0033j0586
57754B96931r358q267p793o609m769l728l381k320q06m37r77o69N82J244J191
57739B50834J897L750N687P112P785O671L506P46R91L224M484M328M590N466N330
57724C16401M126L546L960M187M109M481M367K034j612l681l673m009n803p217
$$ plain form
57825 564305 556482 548141 541919 537586 532347 525748 520179 516499 513187 510035 508713 509307 509951 510248 511463
57810 511463 513163 513430 512874 514734 520335 527791 535584 544062 553065 561573 570076 579843 589452 595640 597969
57795 597969 599106 600102 599203 595762 591278 585710 576775 564150 550735 538540 526911 515845 507158
57782 507158 500803 493875 485123 476977 471071 465187 456988 447869 440616 435579 431332 427044 422204 415966
57768 415966 408500 401280 394714 387340 378450 369325 360782 351867 342231 333321 325699 317550 307517 296931
57754 296931 287573 279306 271513 264904 260135 256407 253026 250706 249900 249463 248486 247817 248399 249643 250834
57739 250834 252731 256481 262168 269280 277065 283736 287242 287988 288979 292203 296687 301015 305605 311071 316401
57724 316401 320527 324073 328033 332220 336329 340810 345177 347211 345599 341918 338245 334236 328433 321216
57710C21216o821n663n012m451l421k552k320j968o58J486L961O213P201N984
57696C13195L272J241J533M006P311R801J0382R349Q101P335O452N264M893N763
57682C97898O264N089L539L631N026N802N411M890M880N165N679O449P174Q026
57668D74923R850J2461J4066J3657J2518J2036J1783J1320J1815J3917J5952J6534
57656F30832J7070J9319K2225K3736K4064K4491K4788K4608K5670K9394L3855
57645I00052L6348L7732M0801M5534M9380N1581N3785N6915O0525O4786P0166
57634A467605P5740Q0606Q6257R4544J04212J12755J20793J31152J44195J57770
57624B575629J71352J86498K03169K19385K34790K51063K68263K84006K96782
$$ plain form
57710 321216 314395 308732 303720 299269 295848 293296 290976 289008 288350 289836 293797 300010 307211 313195
57696 313195 316467 317708 319241 323247 330558 340359 350741 360090 368191 375526 381978 387242 392135 397898
57682 397898 404162 409251 412790 416421 421447 427249 432660 437550 442430 447595 453274 459723 466897 474923
57668 474923 484773 497234 511300 524957 537475 549511 561294 572614 584429 598346 614298 630832
57656 630832 647902 667221 689446 713182 737246 761737 786525 811133 836803 866197 900052
57645 900052 936400 974132 1014933 1060467 1109847 1161428 1215213 1272128 1332653 1397439 1467605
57634 1467605 1543345 1623951 1710208 1804752 1908964 2021719 2142512 2273664 2417859 2575629
57624 2575629 2746981 2933479 3136648 3356033 3590823 3841886 4110149 4394155 4690937
57615D690937L06862L13341L13339L04859K87941K62684K28965J88215J42220
57606G039363Q9645K7134m4758j19190j87427k43367k83632l06796l14452l11046
57596E345474l00998k86704k69316k49583k27876k05170j83799j65270j47966
57587C308792j29645j11563r6968q5893p5068o3114n2011m2728l3283k2509j2220
57576B583790l925L578J1643J9630K6967L4768M3639N2370O0603P0405Q3202R7288
57564C083958J10297J22291J34439J46516J57776J68851J80596J92108K01571
57555D498403K08133K11439K10157K02357J86715J62351J28561Q5994L7523j2897
57545E918736o1838j06681j45658j78363k05160k25536k38103k42864k42093k38152
$$ plain form
57615 4690937 4997799 5311140 5624479 5929338 6217279 6479963 6708928 6897143 7039363
57606 7039363 7129008 7156142 7111384 6992194 6804767 6561400 6277768 5970972 5656520 5345474
57596 5345474 5044476 4757772 4488456 4238873 4010997 3805827 3622028 3456758 3308792
57587 3308792 3179147 3067584 2970616 2884723 2809655 2746541 2694530 2651802 2618519 2596010 2583790
57576 2583790 2579865 2583443 2595086 2614716 2641683 2676451 2720090 2772460 2833063 2903468 2986670 3083958
57564 3083958 3194255 3316546 3450985 3597501 3755277 3924128 4104724 4296832 4498403
57555 4498403 4706536 4917975 5128132 5330489 5517204 5679555 5808116 5894110 5931633 5918736
57545 5918736 5856898 5750217 5604559 5426196 5221036 4995500 4757397 4514533 4272440 4034288
57535D034288k31486k21610k09125j95770j83029j71249j59718j47468j34535
57526B380298j22455j12804j05471r9134r2933q6621p9714p2063o4787n9139n4676
57515A430501n0156m5703m2385m0117l7887l5612l3716l1410k7691k3695k1420
57504A040709k0408j8328j4811j1661r258o010j989K78r4n28J255M353P145J0041
57490I80694J3850J7638K0311K2583K5552K8699L1013L2862L5137L7722M0225
57479A286286M3251M7651N3327N9589O5864P1480P5975Q0265Q6220R4489J03910
57468B068307J13295J22301J30409J37026J43192J51005J60405J68313J71888
57459C366141J70872J65888J56374J41345J20531R3711O0649K2845j6143n3102
$$ plain form
57535 4034288 3802802 3581192 3372067 3176297 2993268 2822019 2662301 2514833 2380298
57526 2380298 2257843 2145039 2039568 1940434 1847501 1760880 1681166 1609103 1544316 1485177 1430501
57515 1430501 1380345 1334642 1292257 1252140 1214253 1178641 1144925 1113515 1085824 1062129 1040709
57504 1040709 1020301 1001973 987162 975501 966243 960233 958244 958522 958428 957900 959155 963508 970653 980694
57490 980694 994544 1012182 1032493 1055076 1080628 1109327 1140340 1173202 1208339 1246061 1286286
57479 1286286 1329537 1377188 1430515 1490104 1555968 1627448 1703423 1783688 1869908 1964397 2068307
57468 2068307 2181602 2303903 2434312 2571338 2714530 2865535 3025940 3194253 3366141
57459 3366141 3537013 3702901 3859275 4000620 4121151 4214862 4275511 4298356 4282213 4229111
57449D229111q6581j15382j37734j53102j63065j69156j71208j68779j62680j54213
57439B747211j44278j33908j24032j14167j03167r1808q2474p5601o8772o0315
57429A748689n1460m3869l7368l1369k6077k0927j4255o141Q43N429R809J6162
57417A549466K3489K9987L6183M3239N0299N6305O2682P1456Q2082R2592J02559
57406B200339J12382J21148J27887J33919J41075J48295J52703J53470J51992
57397C443210J48313J39765J23489R8764O6924L0500p688m5615q2105j15364j42738
57386C657455j62934j77051j86244j90008j88350j83816j79029j73535j65301
57377B051187j54366j42697j31620j21471j12924j06170r9543r1385q2639p5419
$$ plain form
57449 4229111 4142530 4027148 3889414 3736312 3573247 3404091 3232883 3064104 2901424 2747211
57439 2747211 2602933 2469025 2344993 2230826 2127659 2035851 1953377 1877776 1809004 1748689
57429 1748689 1697229 1653360 1615992 1584623 1558546 1537619 1523364 1517223 1518066 1523495 1533304 1549466
57417 1549466 1572955 1602942 1639125 1682364 1732663 1788968 1851650 1923106 2005188 2097780 2200339
57406 2200339 2312721 2433869 2561756 2695675 2836750 2985045 3137748 3291218 3443210
57397 3443210 3591523 3731288 3854777 3953541 4020465 4050965 4043277 3997662 3915557 3800193 3657455
57386 3657455 3494521 3317470 3131226 2941218 2752868 2569052 2390023 2216488 2051187
57377 2051187 1896821 1754124 1622504 1501033 1388109 1281939 1182396 1091011 1008372 932953
57367I32953o9646o3624n7322n2487m9599m7288m4875m2983m1456l8966l5286
57356C89421l1926k9872k8417k6822k5518k4947k4575k3747k2492k1060j9483
57345A10562j7924j6596j5281j3720j2419j2194I516c949j3041j1731j0111q827
57333d7659q305q335q251p964q045q402p941o424n481o599q995j0701j0977j0421
57319a64500r577q698q163p901p107n580m439m351m132k518k44J057J074L98j043
57304b25724l427n780o933o973o401m892k461o27n36j144j177j511l346n306n071
57289b81309l010j408q05NQ87L68j244j844q38J24J87M04J406K332K688K957K948
57272b76152J828K29oJ198J874J347J406L195N329O290O503O768O709O310P162
$$ plain form
57367 932953 863307 799683 742361 689874 640275 592987 548112 505129 463673 424707 389421
57356 389421 357495 327623 299206 272384 246866 221919 197344 173597 151105 130045 110562
57345 110562 92638 76042 60761 47041 34622 22428 9516 -3949 -16990 -28721 -38832 -47659
57333 -47659 -55964 -64299 -72550 -80514 -88559 -96961 -104902 -111326 -116807 -123406 -132401 -143102 -154079 -164500
57319 -164500 -174077 -182775 -190938 -198839 -205946 -211526 -215965 -220316 -224448 -226966 -227210 -226153 -225079 -224681 -225724
57304 -225724 -229151 -234931 -241864 -248837 -255238 -260130 -262591 -263218 -263754 -264898 -266075 -267586 -270932 -276238 -281309
57289 -281309 -284319 -285727 -286532 -286527 -285640 -285272 -286516 -288360 -289198 -289074 -288887 -288483 -287077 -284745 -282057 -279100 -276152
57272 -276152 -274324 -274095 -274101 -272903 -271029 -269682 -268276 -265081 -259752 -253462 -246959 -240191 -233482 -227172 -220010
57257b20010J0375J4669J8012K0034K1436K2179K1801K0706J9762J9096a3721
57245C097J4756J1972R316Q553J0561J3990J6519J7251J7363J8680K1903K5952
57233A89913K8918K9942L0041L0637L1829L2931L4132L6193L8871M1182M3168
57222E67757M5740M8547M9852M8999M7401M6346M5315M3346M0629L7673L3957
57211A055562K8664K2109J5507R673M563k95n377j0709j5520j8743k0010j9782
57199A045642j8620j7053j5890j5643j5645j4667j2493j0036p919n947l865j592
57187I06272J301N175R373J2795J5363J7933K0834K3714K6513K9250L1129L1530
57175A131182L1634L3210L5838L7318L7040L6716L7474L8555L9537M1474M4568
$$ plain form
57257 -220010 -209635 -194966 -176954 -156920 -135484 -113305 -91504 -70798 -51036 -31940 -13721
57245 3097 17853 29825 39141 47694 58255 72245 88764 106015 123378 142058 163961 189913
57233 189913 218831 248773 278814 309451 341280 374211 408343 444536 483407 524589 567757
57222 567757 613497 662044 711896 760895 808296 854642 899957 943303 983932 1021605 1055562
57211 1055562 1084226 1106335 1121842 1131515 1136078 1135783 1130406 1119697 1104177 1085434 1065424 1045642
57199 1045642 1027022 1009969 994079 978436 962791 948124 935631 925595 917676 911729 907864 906272
57187 906272 907573 912748 922121 934916 950279 968212 989046 1012760 1039273 1068523 1099652 1131182
57175 1131182 1162816 1196026 1231864 1269182 1306222 1342938 1380412 1418967 1458504 1499978 1544546
57164A544546M6947M7372M7352M8897N1587N3594N4344N4411N3746N1817M8984
57153B103597M6236M3916M1807M0008L8723L7786L7391L8568M1770M5500M7587
57142B562889M7432M6023M4204M2149M0315L9556L9954M0363L9720L8430L7986
57131C019021L9176M0904M1256L9670L7363L5315L2886K9339K5687K3493K2456
57120C386566K0987J8848J7191J6046J3901J0071N455O17m602r062j0489q740
57108C456789o547n698m898k961j584k666m871n570m710m044l690k266R0J431
57094C408805M55k962r249j8858l0552m2295n4047o7706q4208j02519j21490j40675
57082B734699j59164j75797j91153k07568k26455k47119k68460k90192l11788
$$ plain form
57164 1544546 1591493 1638865 1686217 1735114 1786701 1840295 1894639 1949050 2002796 2054613 2103597
57153 2103597 2149833 2193749 2235556 2275564 2314287 2352073 2389464 2428032 2469802 2515302 2562889
57142 2562889 2610321 2656344 2700548 2742697 2783012 2822568 2862522 2902885 2942605 2981035 3019021
57131 3019021 3058197 3099101 3140357 3180027 3217390 3252705 3285591 3314930 3340617 3364110 3386566
57120 3386566 3407553 3426401 3443592 3459638 3473539 3483610 3489065 3489682 3485080 3476018 3465529 3456789
57108 3456789 3450242 3444544 3439646 3436685 3435101 3432435 3427564 3421994 3417284 3413240 3409550 3407284 3407374 3408805
57094 3408805 3409260 3406298 3397049 3378191 3347639 3305344 3251297 3183591 3099383 2996864 2875374 2734699
57082 2734699 2575535 2399738 2208585 2001017 1774562 1527443 1258983 968791 657003
57073F57003C24868b6322l70789l92917m18291m46659m77147n08012n37972n68509
57063c746618o03216o44243o91192p44295q06426q80565r67334j066825j181100
57054a1331814j312718j462071j628294j811921k014883k238886k485513k756702
57046b7042802l053291l374687l722592m104242m530100n010155n555181o179998
57038f2573048o902679p742604q722430r867903j1197036j2705341j4360719j6109005
57030a50180765j7884411j9625473k1286786k2818921k4128044k5102043k5751905
57023c06778348k6320576k7109740k8031281k8305360k6748649k2550479j5886260
57016d81730693p827606L20546P645632J3786050J8713403K2488543K5185434
$$ plain form
57073 657003 324868 -26322 -397111 -790028 -1208319 -1654978 -2132125 -2640137 -3178109 -3746618
57063 -3746618 -4349834 -4994077 -5685269 -6429564 -7235990 -8116555 -9083889 -10150714 -11331814
57054 -11331814 -12644532 -14106603 -15734897 -17546818 -19561701 -21800587 -24286100 -27042802
57046 -27042802 -30096093 -33470780 -37193372 -41297614 -45827714 -50837869 -56393050 -62573048
57038 -62573048 -69475727 -77218331 -85940761 -95808664 -107005700 -119711041 -134071760 -150180765
57030 -150180765 -168065176 -187690649 -208977435 -231796356 -255924400 -281026443 -306778348
57023 -306778348 -333098924 -360208664 -388239945 -416545305 -443293954 -465844433 -481730693
57016 -481730693 -489558299 -489237753 -481592121 -467806071 -449092668 -426604125 -401418691
57009d01418691K6922386K7872002K8212634K8070043K7502989K6539234K5223135
57002b11076268K3631652K1854412J9970101J8043571J6134524J4298820J2582085
56995h4561103J1015565R615691Q383956P309611O376827N569857M872117M265547
56987b7151932L735065L271962K870552K523705K223524J963460J736952J536422
56979g290290J356399J195603J053836R28999Q19324P25576e62413B1603N29314
56970E50917M82477M42668M07265L73966L43139L15183K87685K58273K28423K01409
56960C891405J78196J58132J41492J27911J14104R6826P6973N7691L9930K3039
56950D905699Q088l309j2540k3009l6455n2705p0617q5629q9910q2148p6676r5021
$$ plain form
57009 -401418691 -374496305 -346624303 -318411669 -290341626 -262838637 -236299403 -211076268
57002 -211076268 -187444616 -165590204 -145620103 -127576532 -111442008 -97143188 -84561103
56995 -84561103 -73545538 -63929847 -55545891 -48236280 -41859453 -36289596 -31417479 -27151932
56987 -27151932 -23416867 -20144905 -17274353 -14750648 -12527124 -10563664 -8826712 -7290290
56979 -7290290 -5933891 -4738288 -3684452 -2755453 -1936129 -1210553 -562413 21603 550917
56970 550917 1033394 1476062 1883327 2257293 2600432 2915615 3203300 3461573 3689996 3891405
56960 3891405 4069601 4227733 4369225 4497136 4611240 4708066 4785039 4842730 4882660 4905699
56950 4905699 4913787 4910478 4897938 4874929 4838474 4785769 4715152 4629523 4539613 4457465 4380789 4285768
56938D285768j44848k11102k69872l07285l23505l24250l14102k96418k74631
56929A819755k51758k29641k08804j88699j68631j48905j30584j14295j00214
56920B78224q8910q0812C3536c6149o4478n9747n5135m9793m4106l9095l4064
56909c82567k7134j8428j0494m810J01O169J3188J9762K5271K9835L3589L7050
56897b78468M1175M5950M9648N0365d3566g36C5943L0073K3748J8527J5149J3888
56885A37328J4039J4147J3277J1746J0231Q824P627P411Q633J0547J2275J4160
56873B70245J6858J9951K2630K4792K6038K4537J8754R722j2q933j6495k1609
56861C86478k3479k3264k2648k1238j7668j2714q791o505m291j411J339L899P040
$$ plain form
56938 4285768 4140920 3929818 3659946 3352661 3029156 2704906 2390804 2094386 1819755
56929 1819755 1567997 1338356 1129552 940853 772222 623317 492733 378438 278224
56920 278224 189314 108502 33536 -36149 -100627 -160374 -215509 -265302 -309408 -348503 -382567
56909 -382567 -409701 -428129 -438623 -443433 -443332 -437163 -423975 -404213 -378942 -349107 -315518 -278468
56897 -278468 -237293 -191343 -141695 -91330 -43566 -736 35943 66016 89764 108291 123440 137328
56885 137328 151367 165514 178791 190537 200768 209592 217219 224630 233263 243810 256085 270245
56873 270245 287103 307054 329684 354476 380514 405051 423805 433527 433515 424582 408087 386478
56861 386478 362999 339735 317087 295849 278181 265467 256676 250171 245880 244469 245808 249707 256747
56848B56747R839J0050P809O156O720P607P073O772R099J3077J5334J4456J2448
56835C83187J2055J3953J6684J8576J9565K1062K3895K6904K8343K8090K7203
56824F19517K5839K3220J9534J6034J3029R429M720j7l541n651o539o182m770
56811G04622k896j009P67K506M735Q089J1944J4626J6221J9557K6393L4013L8177
56798H77745L8156L5873L1241K2241R479l134j2762j9446k3184k2930j9428j5628
56786H98223j2812r278m004J421N867J0520J6055K1005K4805K9586L6817M4692
56774A062897N0978N5764N8939N7391M7765L0788J0561r122k5894l7970m4799
56763A257298m7725m8194m6066m0999l4183k7221k0534j4172q700l986J287P663
$$ plain form
56848 256747 266586 276636 284445 290601 297321 304928 312001 318773 327872 340949 356283 370739 383187
56835 383187 395242 409195 425879 444455 464020 485082 508977 535881 564224 592314 619517
56824 619517 645356 668576 688110 704144 717173 726602 731322 731305 727764 722113 715574 709392 704622
56811 704622 701726 700717 701484 703990 708725 716814 728758 743384 759605 779162 805555 839568 877745
56798 877745 915901 951774 983015 1005256 1014735 1011601 998839 979393 956209 933279 913851 898223
56786 898223 885411 876133 872129 873550 879417 889937 905992 926997 951802 981388 1018205 1062897
56774 1062897 1113875 1169639 1228578 1285969 1333734 1364522 1375083 1365961 1340067 1302097 1257298
56763 1257298 1209573 1161379 1115313 1074314 1040131 1012910 992376 978204 969504 965518 966805 974468
56751I74468J3977J9487K4924L0267L3731L4420L3403L0443K2618Q689p594k1356
56739A197477l1508l9121m3476m3456m0918l8703l6377l1606k4885j9181j5374
56728H32872j1762p919n350m103k074J569N305Q094J0663J3044J3371J0138L852
56715H67700m123j2485j9489k3755k6021k8058k9441k7795k3033j8735j7764j8576
56703F18425j7820j5073j2781j2186j1606r212n957m615o339r156j0149q478n631
56690D89422l226j700q70m58K55J753K871J693j416l457k603o07M1l90j44Q34
56674D81998J265R98P39J08j600l208k627l3K125K324J261o3j475k541k339j066
56658D75866m11j537l693n268n419m362k883j908j998l077m737o393p089o083
$$ plain form
56751 974468 988445 1007932 1032856 1063123 1096854 1131274 1164677 1195120 1217738 1226427 1218833 1197477
56739 1197477 1165969 1126848 1083372 1039916 998998 960295 923918 892312 867427 848246 832872
56728 832872 821110 813191 807841 803738 801664 803233 808538 816632 827295 840339 853710 863848 867700
56715 867700 863577 851092 831603 807848 781827 753769 724328 696533 673500 654765 637001 618425
56703 618425 600605 585532 572751 560565 548959 539747 533790 529175 522836 513680 503531 495053 489422
56690 489422 486196 484496 483626 483168 483423 485176 488047 489740 488324 484867 482264 481657 481698 481308 481164 481998
56674 481998 483263 484261 485000 485108 483508 480300 477673 477640 479765 482089 483350 483287 481812 479271 476932 475866
56658 475866 475455 473918 470225 464957 459538 455176 452293 450385 448387 445310 440573 434180 427091 421008
56644D21008m097k905l056l243k663k271k624k390p58M44p12l005l868l337l523
56629C83000m834n486m555l050j913j121p71j069j252m04Q93J557K183M153O871
56614C74202Q218P614O429N471M345L271L237M122M799N231O222P118O179L569
56600D50027J647J696K562K975L010K695J422m29j354j102j305k933m870n816
56586D48225n932n905n983o473p666q746q538p602p713q816q714o513m199l703
56572C51722m405m710m232l181j322R66K063J023q66j689j134q5R73K123L168
56557C40414L660L345K208O48l94l20J75R3j28P29K368L038K058N92l69j019j410
56540C55688q85N63J961K771L086K312k70l200l465l66L180M310L218J664M97
$$ plain form
56644 421008 416911 414006 410950 407707 405044 402773 400149 397759 397001 397445 396733 393728 389860 386523 383000
56629 383000 378166 372680 368125 365075 363162 362041 361270 360201 358949 358545 359438 360995 363178 367331 374202
56614 374202 382420 390034 396463 401934 406279 409550 412787 416909 421708 426939 433161 440279 446458 450027
56600 450027 451674 453370 455932 458907 461917 464612 466034 465605 464251 463149 461844 458911 454041 448225
56586 448225 442293 436388 430405 423932 416266 407520 398982 391380 383667 374851 366137 359624 355425 351722
56572 351722 347317 342607 338375 335194 333872 334838 336901 337924 337058 335369 334235 334150 335123 337246 340414
56557 340414 344074 347419 349627 350275 349881 349561 349736 349829 349701 350430 352798 355836 357894 358486 358117 357098 355688
56540 355688 354803 355366 357327 360098 363184 365496 365226 362026 358561 358195 361375 365685 368903 370567 371064
56525C71064j7O82K386L506L051K117K146K991L782M444N064M899L517K017J821
56510D13470K813L778M100M126M399N190O291O923O485N616N564O336O663O036
56496D87790N449N632N939N578M803M280M198M431M626L933J814q69k662l298
56482E31644l434l067j947j162k090l860m241l194l026m583o010n912n157m617
56468D79344l770k716k944m650n613m355k268j114m94M90J096L86p96j023l46
56453D51227K05k3j358l664n476n028k956j853k374k230j75J707J307m18j488
56438D27403j822k104j928j076o89j264j455n54j3o21o04J264L104L040K488L493
56422D28662M899M325K265J050J084J263J912M059O598P299O228N433N691O100
$$ plain form
56525 371064 371047 371729 374115 377621 380672 382789 384935 387926 391708 396152 401216 406115 409632 411649 413470
56510 413470 416283 420061 424161 428287 432686 437876 444167 451090 457575 463191 468755 475091 481754 487790
56496 487790 493239 498871 504810 510388 515191 519471 523669 528100 532726 536659 538473 537604 534942 531644
56482 531644 528210 525143 523196 522034 519944 516084 511843 508649 505623 501040 495030 489118 483961 479344
56468 479344 475574 472858 469914 465264 459651 455296 453028 451914 451420 451910 453006 453392 452596 451573 451227
56453 451227 451432 451409 450051 446387 440911 435883 432927 431074 428700 426470 426295 428002 429309 428891 427403
56438 427403 425581 423477 421549 420473 419784 418520 417065 416511 416498 415877 415273 416537 419641 422681 425169 428662
56422 428662 433561 437886 440151 441201 442285 443548 445460 449519 456117 463416 469644 475077 480768 486868
56408D86868O448P440Q729R062Q239P159O261N572N638O718P779P940P967Q760
56394E90580R551R375Q867Q593P240L911O77jR04O01j074j991j743k042l437m619
56378F25392n050n502n951n505m613m896o492p778p906p554p080n987m468l505
56364E43105l275l080k958l603m695m923l870k478j739k031l387n100n596m038
56350D92332j612j25j22j333l595n985o600n045l642m152m885l420n98R39R05
56335D53062J114J997K468K635L577M722M260K165L34k41k43k10j44m92j417j605
56319D71982M5K140K421J097K63O78J396J885K241K112J643K425N115P396O975
56304E09814N192M684M953L800J823J447K387K245J187J727L896M934M093L677
$$ plain form
56408 486868 493316 500756 509485 518547 526786 533945 540206 545778 551416 558134 565913 573853 581820 590580
56394 590580 600131 609506 618373 626966 634206 638117 638794 638793 639697 640298 639224 637233 635490 633448 630011 625392
56378 625392 620342 614840 608889 603384 598771 593875 587383 579605 571699 564145 557065 551078 546610 543105
56364 543105 539830 536750 533792 530189 525494 520571 516701 514223 512484 510453 507066 501966 496370 492332
56350 492332 490720 490595 490473 489140 485545 479560 472960 467915 464273 460121 455236 451816 451218 452157 453062
56335 453062 454176 456173 458641 461276 464853 469575 473835 476000 476334 476093 475850 475640 475496 475004 473587 471982
56319 471982 472027 474167 476588 477685 477948 478626 480022 481907 484148 486260 487903 490328 495443 502839 509814
56304 509814 515006 519690 524643 528443 530266 531713 534100 536345 537532 539259 543155 548089 552182 555859
56290E55859M592M798L169J351Q26J194K165M044N678N142L113K457L811M935
56276F03134M940N535P144P465N377L099K850M079N380O604P859Q761R603J1021
56262F92851J2052J1128R268R240J1105J1967J0783R837J0496J1174J0867J1138
56250H21906J2780J3826J2865J1526J1661J2572J2853J2609J2195J1052R324Q416
56238I63585Q628Q419P263O807P918R081R120R184J0565J2696J4458J5638J6168
56225A099530J6089J6779J9739K3677K5749K6207K8494L3767L8909M1428M2854
56214A413222M5466M8930N2313N6470O2218O8468P4203Q0053Q6403R2429R8426
56203B178601J06414J16853J27501J37135J47572J60126J73047J84496J95316
$$ plain form
56290 555859 560451 565249 568418 569769 570595 571789 573954 577998 583676 588818 591931 594388 598199 603134
56276 603134 608074 613609 620753 628218 633595 636694 639544 643623 649003 655607 663466 672227 681830 692851
56262 692851 704903 716031 725299 734539 745644 757611 768394 778231 788727 799901 810768 821906
56250 821906 834686 848512 861377 872903 884564 897136 909989 922598 934793 945845 955169 963585
56238 963585 972213 980632 987895 994702 1002620 1011701 1020821 1030005 1040570 1053266 1067724 1083362 1099530
56225 1099530 1115619 1132398 1152137 1175814 1201563 1227770 1256264 1290031 1328940 1370368 1413222
56214 1413222 1458688 1507618 1559931 1616401 1678619 1747087 1821290 1901343 1987746 2080175 2178601
56203 2178601 2285015 2401868 2529369 2666504 2814076 2974202 3147249 3331745 3527061
56194C527061K06667K17549K26833K35141K42399K46025K44014K37617K28570
56185E611876K15738J96968J72580J44703J14638Q2865N0348J8168j2902m1397
56175F553585o5493q5287j02675j17982j29176j35588j39714j43775j47066j48480
56165E338349j49146j50651j52794j54862j57260j60200j62549j63292j62483
56156C925112j60077j56006j51799j49428j47788j43416j35523j27200j20636
56147B633239j14571j07640j00678r4174q6856p8538p1220o5898o1335n7055n4023
56136A741251n1428m6887m1036l7465l6623l4591k9823k5846k4783k3475j9348
56125A369946j5155j3985j3997j2179r403p668o029l302j226r58M6L599O875P022
$$ plain form
56194 3527061 3733728 3951277 4178110 4413251 4655650 4901675 5145689 5383306 5611876
56185 5611876 5827614 6024582 6197162 6341865 6456503 6539368 6589716 6607884 6594982 6553585
56175 6553585 6488092 6402805 6300130 6182148 6052972 5917384 5777670 5633895 5486829 5338349
56165 5338349 5189203 5038552 4885758 4730896 4573636 4413436 4250887 4087595 3925112
56156 3925112 3765035 3609029 3457230 3307802 3160014 3016598 2881075 2753875 2633239
56147 2633239 2518668 2411028 2310350 2216176 2129320 2050782 1979562 1913664 1852329 1795274 1741251
56136 1741251 1689823 1642936 1601900 1564435 1527812 1493221 1463398 1437552 1412769 1389294 1369946
56125 1369946 1354791 1340806 1326809 1314630 1305227 1297559 1291530 1288228 1287002 1286044 1286090 1289689 1296564 1303586
56111A303586O249P780J0133J0282R623J1625J5666J8191J8421J8495J9222J9625
56099A468898J9616J9752J9490J8390J7584J7701J7478J6566J7067J9921K2840
56088A675303K4398K6714L1190L5257L6796L8228M2719M9731N7977O9033Q3745
56077B171091R8426J09280J17797J27597J38495J47571J53285J54616J49162J36433
56067C503753J20678J06726R5381Q5735P8377P2648O4377N0531L3107J5114l426
56056D223001k1912l6236m4096m9413n7087o7153p8109r1264j06811j20029j26760
56045C424131j28780j29125j26556j19562j10973j03050r3068p9482o7182o0165
56035B406188n4183m3901l2429k6117k4200k1596j8081j6646j6156j3595j0700
$$ plain form
56111 1303586 1309835 1317615 1327748 1338030 1347653 1359278 1374944 1393135 1411556 1430051 1449273 1468898
56099 1468898 1488514 1508266 1527756 1546146 1563730 1581431 1598909 1615475 1632542 1652463 1675303
56088 1675303 1699701 1726415 1757605 1792862 1829658 1867886 1910605 1960336 2018313 2087346 2171091
56077 2171091 2269517 2378797 2496594 2624191 2762686 2910257 3063542 3218158 3367320 3503753
56067 3503753 3624431 3731157 3826538 3912273 3990650 4063298 4127675 4178206 4211313 4226427 4223001
56056 4223001 4201089 4164853 4120757 4071344 4014257 3947104 3868995 3777731 3670920 3550891 3424131
56045 3424131 3295351 3166226 3039670 2920108 2809135 2706085 2613017 2533535 2466353 2406188
56035 2406188 2352005 2308104 2275675 2249558 2225358 2203762 2185681 2169035 2152879 2139284 2128584
56024B128584j0825j2019j0515p949p896q490n893j713M28K149O477J0589J0383
56011B093310Q606J0174J3226J3243J2245J4926J9274K0368J9956K2692K6274
56000B274294K5333K2125K3192K7931L0593L1163L3977L7854L8045L6105L7646
55989B618258M2061M4415M5258M8493N1969N0893M8299N1051N7622O0881O1026
55978C180226O4303P0627P4277P5357P8988Q4329Q6008Q5224Q8021R3810R7064
55967D078234R8767J04482J12894J18177J21748J29541J39783J46146J50581J60015
55957E360368J72660J81108J86567J96011K07947K15405K20423K30555K43710
55948G214754K51970K57486K68360K81955K89585K94704L08202L28356L44373
$$ plain form
56024 2128584 2117759 2105740 2095225 2087276 2079380 2070890 2064997 2063284 2063712 2065861 2072338 2082927 2093310
56011 2093310 2101916 2112090 2125316 2138559 2150804 2165730 2185004 2205372 2225328 2248020 2274294
56000 2274294 2299627 2321752 2344944 2372875 2403468 2434631 2468608 2506462 2544507 2580612 2618258
55989 2618258 2660319 2704734 2749992 2798485 2850454 2901347 2949646 3000697 3058319 3119200 3180226
55978 3180226 3244529 3315156 3389433 3464790 3543778 3628107 3714115 3799339 3887360 3981170 4078234
55967 4078234 4177001 4281483 4394377 4512554 4634302 4763843 4903626 5049772 5200353 5360368
55957 5360368 5533028 5714136 5900703 6096714 6304661 6520066 6740489 6971044 7214754
55948 7214754 7466724 7724210 7992570 8274525 8564110 8858814 9167016 9495372 9839745
55939I839745L57322L77854M05373M30025M53337M85723N25319N61126N95264
55930A4031088O39557O92125P41342P90596Q53615R27004R94436J056719J129520
55921B1856002J212766J292262J370632J464623J572296J676868J783171J914231
55913C4142851K070547K230781K394227K582299K796526L019551L261435L558474
55905E6056691L922361M340558M830845N439238O177147P019966P973848R077113
55897A04837767J0330113J1702500J3219965J4955174J6922030J9084897K1485229
55890B12537675K4226159K7311636L0659148L4229155L7710917L9776061L8024812
55883D44475563L0444348J7310210J495794j3275006k4504470l1569304l5026578
$$ plain form
55939 9839745 10197067 10574921 10980294 11410319 11863656 12349379 12874698 13435824 14031088
55930 14031088 14670645 15362770 16104112 16894708 17748323 18675327 19669763 20726482 21856002
55921 21856002 23068768 24361030 25731662 27196285 28768581 30445449 32228620 34142851
55913 34142851 36213398 38444179 40838406 43420705 46217231 49236782 52498217 56056691
55905 56056691 59979052 64319610 69150455 74589693 80766840 87786806 95760654 104837767
55897 104837767 115167880 126870380 140090345 155045519 171967549 191052446 212537675
55890 212537675 236763834 264075470 294734618 328963773 366674690 406450751 444475563
55883 444475563 474919911 492230121 493725915 480450909 455946439 424377135 389350557
55876C89350557l5787292l4761784l2717907l0149983k7305190k4363689k1518215
55869A82746497j8892254j6505095j4357680j2479784j0876464r504754q329527
55862I1800939p345793o531107n832835n219965m698988m265236l884885l538111
55854E0484019l236255k982407k754370k539093k346891k179659k019961j863318
55846C0562065j728214j622076j527451j432456j345645j270405j193250j108835
55838A9333733j030276r63719q97456q26509p63901p16854o74465o29437n90697
55829A2240419n63934n39790n11641m86290m67387m46273m18582l92879l74123
55820H039520l54880l31137l10582k97270k83762k66235k52031k44596k36102
$$ plain form
55876 389350557 353563265 318801481 286083574 255933591 228628401 204264712 182746497
55869 182746497 163854243 147349148 132991468 120511684 109635220 100130466 91800939
55862 91800939 84455146 77924039 72091204 66871239 62172251 57907015 54022130 50484019
55854 50484019 47247764 44265357 41510987 38971894 36625003 34445344 32425383 30562065
55846 30562065 28833851 27211775 25684324 24251868 22906223 21635818 20442568 19333733
55838 19333733 18303457 17339738 16442282 15615773 14851872 14135018 13460553 12831116 12240419
55829 12240419 11676485 11136695 10625054 10138764 9671377 9225104 8806522 8413643 8039520
55820 8039520 7684640 7353503 7042921 6745651 6461889 6195654 5943623 5699027 5462925
55811E462925k22652k12002k08416k04112j93510j82212j74318j64363j49594
55802C751746j37143j31029j24337j12011r9791r3095q8556q3577q2707q7189
55792B712311q9231q4147p7815p5201p1965o4448n7606n5548n3761m7971m1858
55781A992760l9132l6519l1144k6502k5118k3383j9268j6888j8035j7774j3878
55770A725119j1881j5225j9001j9109j9071k2086k4813k5027k6881l2539l6712
55759A472774l5738l4072l5601l6488l3149k9520k9606l0056k6928k3066k2036
55748A136514k1263j7811j4782j5397j6502j4232j0666q873o928k720P21M97o74
55735A007884K73J117p47l051l437m288p731j0994j1711j2423j4901j5648j2251
$$ plain form
55811 5462925 5240273 5028271 4819855 4615743 4422233 4240021 4065703 3901340 3751746
55802 3751746 3614603 3483574 3359237 3247226 3147435 3054340 2965784 2882207 2799500 2712311
55792 2712311 2623080 2538933 2461118 2385917 2313952 2249504 2191898 2136350 2082589 2034618 1992760
55781 1992760 1953628 1917109 1885965 1859463 1834345 1810962 1791694 1774806 1756771 1738997 1725119
55770 1725119 1713238 1698013 1679012 1659903 1640832 1618746 1593933 1568906 1542025 1509486 1472774
55759 1472774 1437036 1402964 1367363 1330875 1297726 1268206 1238600 1208544 1181616 1158550 1136514
55748 1136514 1115251 1097440 1082658 1067261 1050759 1036527 1025861 1016988 1010060 1007340 1008061 1008558 1007884
55735 1007884 1008157 1009274 1008527 1005476 1002039 997751 990020 979026 967315 954892 939991 924343 912092
55722I12092q646q499q881o128k733k519l946m106m774q487j2931j4885j5765
55709H09792j7859j9229j7595j5144j4254j2656q164l983l877o065p233q497j1788
55696F63448j4386j3024r988r290r925q555n958n146n697n372n018o752r380j0370
55682E44587j0368j1480j3093j3307j2339j1126r054o194m762n207m462j323N18
55669D42390j485m045l614k248l235n073n015m650o536q720q169o505o820p724
55655C68551o122l399l090m563m486k721j603r88R83L630M782M679M787M443K527
55640C67410N18J4n35k644l942j731K018L629L353L643M313L902L588M953O101
55625C94590M740L002M236O959P056M405K394K178K176J973K086J178k064n454
$$ plain form
55722 912092 903446 894947 886066 879938 877205 874686 870740 866634 861860 853373 840442 825557 809792
55709 809792 791933 772704 755109 739965 725711 713055 704891 700908 697031 690966 683733 675236 663448
55696 663448 649062 636038 626050 616760 606835 598280 592322 587176 581479 576107 571089 564337 554957 544587
55682 544587 534219 522739 509646 496339 484000 472874 463820 457626 452864 447657 443195 441872 442390
55669 442390 440905 436860 433246 430998 427763 422690 417675 413025 406489 397769 389600 383095 376275 368551
55655 368551 362429 359030 355940 351377 346891 344170 342567 341579 342562 346192 350974 355653 360440 364883 367410
55640 367410 367928 367942 367407 364763 360821 359090 361108 364737 368090 371733 376046 379948 383536 388489 394590
55625 394590 399330 402332 406568 413527 420583 424988 427382 429560 431736 433709 435795 436973 434909 429455
55611D29455o029m836m787n412m306k177j552j709Q9L155M092K476J189J445J727
55596D12820J478J827K697K819K303K150J912Q77L20J313J880p0k674k969k090
55581D24593l276o099p391o904p186q373p931n620m318n452p349q431q861q851
55567C28551q319q085q771r117p929o566o726p204n999m098l707m301m090l824
55553B39815n181o751n839l170j737j919j908j879l484n877o409m798k855r59
55539A87049J368K562R24j611j811l50l25j803k350k009k695l546k088M91N37
55524A74343j826k918j932j711k900k873j246r60k781l851l067k816l886l568
55510A38008p68J618J566R78J702K371J492J93l43j019k392l005k070j114j265
$$ plain form
55611 429455 423426 418590 413803 408391 404085 401908 400356 398647 398736 401891 405983 408459 409648 411093 412820
55596 412820 414298 416125 418822 421641 423944 426094 428006 428883 429203 430516 432396 432326 429652 426683 424593
55581 424593 421317 415218 407827 400923 393737 385364 377433 371813 367495 362043 354694 346263 337402 328551
55567 328551 320232 312147 303376 294259 286330 279764 273038 265834 259835 255737 252030 247729 243639 239815
55553 239815 234634 227883 222044 218874 217137 215218 213310 211431 207947 202070 195661 190863 188008 187049
55539 187049 188417 190979 191903 190292 188481 188131 187806 186003 183653 181644 178949 175403 173315 173806 174343
55524 174343 172517 169599 167667 165956 163056 160183 158937 157977 155196 151345 148278 145462 141576 138008
55510 138008 137240 138858 140424 141402 143104 145475 146967 147160 146817 145798 143406 140401 138331 137217 135952
55495A35952j420n91L98P65R75J134P37O69K571N420N891L172M45L43J840K948
55479A61249L516L903L417J741Np71n94N06K307L168J566r94j395N11J845J410
55463A81390J086J993K781K723L031L910L552J506j8L92J397J650J629J455j48
55448B08329l262n757o350o224o469o519o238o716p802p635n923m863n344n179
55434A24048k787JP23m03j762k751l221k596j112l01r09j920k548l181l674k907
55418I4700r38O49J260J787K040N98j878k329J83K567K074o0j163r01n12m06m31
55401I7240q63j514j389m60l8n15p51m76r92k444k937j652l06j85k29M13M73j008
55383H2367k598k677j682o04P03K145K381R75l34r5R32J533J737J533J37j898
$$ plain form
55495 135952 134532 133941 134339 135104 136079 137213 137950 138619 141190 146610 152501 155673 156118 156461 158301 161249
55479 161249 164765 168668 172085 173826 173831 173060 172466 172972 175279 178447 180013 179019 177624 178135 179980 181390
55463 181390 182476 184469 187250 189973 193004 196914 200466 201972 201954 202346 203743 205393 207022 208477 208329
55448 208329 205067 199310 192960 186736 180267 173748 167510 160794 152992 145357 139434 134571 129227 124048
55434 124048 121261 121262 121985 121582 119820 117069 113848 111252 110140 109839 108930 107010 104462 101281 97607 94700
55418 94700 93762 94411 95671 97458 99498 100096 98218 95889 96072 98639 100713 100653 99490 98589 98077 97671 97240
55401 97240 96377 94863 93474 93014 92976 92461 91710 91234 90242 87798 84861 83209 82903 82718 82489 82902 83375 82367
55383 82367 79769 77092 75410 74806 75509 77654 80035 81010 80676 80581 81513 83046 84783 86316 86453 84555
55367H4555k238q7K133K227J215J095J659J569P89l4j010k050k001m86Q22M30
55351H8588q21j183k61J308K893L532K246k03j548r58K4J51j06l90j228j982r40
55334H9122J364J873m05k621k599j902k212k004L56L026L427K268J684J384j3
55319I2748j507j045P68J411K57r93j220r50r20j310j901j838l09J592J486p39
55303H5530k227j526r17k239l232j163K266L200J282m93n61n8N5J8k55j094j735
55286G6851j349q97j789l291l493k242r55j62O76J427J640J934L043M023L441
55271G8857J818Q57Q32N73m97k000l561m518l680j207N02k11j561r36J029J575
55255F7872J26j298j501j219r98l57P29J606K151K616K544J486L42K27N81K03
$$ plain form
55367 84555 82317 82230 84363 86590 87805 88900 90559 92128 92917 92883 91873 89823 87822 87336 88158 88588
55351 88588 87767 86584 86323 87631 90524 94056 96302 96099 94551 93593 93617 93768 93662 93272 92044 90062 89122
55334 89122 90486 92359 91954 89333 86734 84832 82620 80616 80972 83998 87425 89693 91377 92761 92748
55319 92748 91241 90196 90964 92375 92632 91639 90419 89469 88549 87239 85338 83500 83191 84783 86269 85530
55303 85530 83303 81777 80860 78621 75389 74226 76492 79692 80974 80481 79920 79862 79917 79935 79680 78586 76851
55286 76851 75502 74605 72816 69525 66032 63790 62835 62673 63349 64776 66416 68350 71393 75416 78857
55271 78857 80675 81532 82364 82937 82440 80440 76879 72361 68681 67474 67976 67765 66204 65268 66297 67872
55255 67872 67998 66700 65199 63980 62982 62625 63354 64960 67111 69727 72271 73757 74099 74326 74907 75110
55239G5110n35m65J54J65k76j63L06J39m77o75p84j574k212j256P46J864J678
55222G1745J469J853K263K424K301J177j062k397r48J706K079m55l028l289j549
55207G4289R67L290L996K145o23j440j53N43o69j975j675n56J44P12J590K010
55191H2595J497J049J318J212l01k163k575j525n46m94p15k84P43J417R90n8m14
55174H1746L24Q54l7j600k193j704j338j300n45R95J795J026q6o9P03P66l85j760
55156G7192k021p44J232K451K209J218O33O70P40O09O29R29J079N72p46k459l505
55139H0688k886j036L08K09l73l20j09n04o62P25K941L777K400R0j786l021l586
55122G6855l017j330M49J247R20J52j76M14J530K206J944J163L61m40j074j018
$$ plain form
55239 75110 74575 74110 74264 74429 74153 73990 74296 74435 73958 73283 72499 70925 68713 67457 68203 70067 71745
55222 71745 73214 75067 77330 79754 82055 83232 82170 79773 78825 80531 82610 82155 79127 75838 74289
55207 74289 75256 78546 82542 84687 84064 82624 82471 83014 82345 80370 78695 78139 78283 78995 80585 82595
55191 82595 84092 85141 86459 87671 87370 85207 82632 81107 80561 80067 79352 79068 79811 81228 82218 82160 81746
55174 81746 82070 82924 82887 81287 79094 77390 76052 74752 74207 75202 76997 78023 77937 77868 78571 79337 78952 77192
55156 77192 75171 74427 75659 78110 80319 81537 82170 82840 83580 84189 84818 85747 86826 87398 86652 84193 80688
55139 80688 77802 76766 77074 77283 76910 76590 76481 75977 75315 76040 78981 82758 85158 85248 83462 80441 76855
55122 76855 73838 72508 72957 74204 75124 75276 75100 75514 77044 79250 81194 82357 82718 82278 81204 80186
55106H0186l84j18m85n26K19P21K14m21l06j75p92j178k21J121J196J93p49j917
55088G6578m063n818m759j099K192L173K742K332J937J180O92J261K503L067J884
55073H3802q54l560m413l161j262L6Q54J399J011m05j358o63P87J554J749K115
55057G7631K271J690J200J752K775L514M512N890N768K961k82j073k32o81k533
55042A05163l182j831m50k10j10N43J129J528K286K877K271J332J986L832M487
55027A21651L351K256K013J303m15j753j881j641j519j051p24j666k918j873J518
55012A16651L957L278J146n3k90m46j36J212K860L763L635K251n28l366m156k877
54996A26901j635j342p96K03k76k862n046m535k267m01N65J076R23K60K80J211
$$ plain form
55106 80186 79802 79684 79199 78673 78892 79613 79827 79406 79100 78925 78133 76955 76734 77855 79051 79244 78495 76578
55088 76578 72515 66697 61938 60839 63031 66204 68946 71278 73215 74395 75087 76348 78851 81918 83802
55073 83802 82948 79388 74975 71814 70552 70588 71442 72841 73852 73447 72089 71426 72213 73767 75516 77631
55057 77631 79902 81592 82792 84544 87319 90833 95345 101235 107003 109964 109682 108609 108377 107696 105163
55042 105163 101981 100150 99700 99490 99380 99923 101052 102580 104866 107743 110014 111346 113332 117164 121651
55027 121651 125002 127258 129271 130574 130159 128406 126525 124884 123365 122314 121590 119924 117006 115133 116651
55012 116651 120608 123886 125032 124979 124689 124243 124107 125319 128179 131942 135577 137828 137300 133934 129778 126901
54996 126901 125266 123924 123128 123331 123055 120193 115147 110612 108345 107944 108509 109585 110508 110768 111048 112259
54980A12259J332l59k262k555j703q80K08K024L363L016J868J351J014l54k149
54965A16173k611j355M34J825K612K558J600L94l74p33p98k65Q00J629J947K312
54949A26148K684K117O35j56N61J495J465J172J439J294l72k596l637l404k964
54934A25881k558j812j100j056j285r23kQ17J246J169L73o76o99O39J936J949
54918A23899J197P72P90J116K087L161K377j044m669n282k619Q59L149M034L976
54903A33803L417K913K679K310J836K234L857N335N267M223L748M220N008N877
54889A86727O866P538P787Q588J0598J2710J3530J3505J3936J4566J3939J1765
54877C22055R097O353K909j172m632o724q214j0055j1937j2749j2130j1065j0845
$$ plain form
54980 112259 113591 113232 110970 108415 106712 105832 106040 108064 111427 114443 116311 117662 118676 118322 116173
54965 116173 113562 112207 112641 114466 117078 119636 121236 121630 121256 120523 119725 119460 120260 121889 123836 126148
54949 126148 128832 130949 131584 131428 131989 133484 134949 136121 137560 138854 138482 135886 132249 128845 125881
54934 125881 123323 121511 120411 119355 118070 117147 117145 117962 119208 120377 120750 120074 119375 120014 121950 123899
54918 123899 125096 125868 126658 127774 129861 133022 135399 134355 129686 124404 121785 122644 125793 129827 133803
54903 133803 137220 140133 142812 145122 146958 149192 153049 158384 163651 167874 171622 175842 180850 186727
54889 186727 193593 201131 208918 217506 228104 240814 254344 267849 281785 296351 310290 322055
54877 322055 331152 337505 340414 339242 334610 327886 319672 309617 297680 284931 272801 261736 250891
54864B50891j1499j1669j0374q479p485p287o398m341k224p95L51J193Q81k87
54850A82478m99R19K360K699L214N000O482N806M272M838P913J1027J2309J2164
54836B60982J1590J0746R447P670N250K084j337m305o560q107q909r358j0209
54823B58984j1426j2074j1982j2119j2370j0764o593k676k262m589n898m438k150
54810A59643j464k435l532l670k802j537n64j17ml32j509l058l500k239o11m3
54794A32226k10l6N11Q86J117J174K53j711k912j858J50O25o61j777j731j463
54778A24583j817k377k503k149j467o50j01J13O43J762K487J799J88j159j955
54763A17397k462k387j480n54m26m78L69J966L468M717N632N337L624K251K779
$$ plain form
54864 250891 239392 227723 217349 208870 201385 194098 187700 183359 181135 180340 180691 181884 182765 182478
54850 182478 181979 182898 185258 187957 191171 196171 202653 208459 212731 217569 225482 236509 248818 260982
54836 260982 272572 283318 292765 300435 305685 307769 306432 302127 295567 287460 278551 269193 258984
54823 258984 247558 235484 223502 211383 199013 188249 181656 178980 176718 172129 166231 161793 159643
54810 159643 158179 155744 152212 148542 145740 144203 143639 143522 143518 143186 141677 138619 135119 132880 132269 132226
54794 132226 132016 131980 132491 133377 134494 135668 135921 134210 131298 129440 129590 130215 129554 127777 126046 124583
54778 124583 122766 120389 117886 115737 114270 113620 113519 113632 114275 116037 118524 120323 120511 119352 117397
54763 117397 114935 112548 111068 110514 110088 109610 109979 111945 115413 120130 125762 131099 134723 136974 139753
54748A39753L978L612K084J809L362M769M716M078L931M122M362M916N716O192
54734A97400O339O698P309P953R207J1562J3816J4141J2871J2294J3480J5018
54722C28088J5118J3222R400L993j584n396o966p544q123q568q778r121r331q531
54708B95879o832n487n053m667l567k047n47R52K330L267L972M794N157M262K934
54693B95347L126N342Q104J0320J2533J5287J7834J9259J9673J9611J9282J8883
54681D64601J8628J8148J6918J5376J4278J2801Q949K327m997j0955j5310j8530
54669E22234k0522k1437k2186k2994k2630k0351j7580j6317j6528j6380j4703
54658C10606j2151j0037q876q179p200n738m356l731l940m592n363n888n514l937
$$ plain form
54748 139753 143731 147343 149427 151236 154598 159367 164083 168161 172092 176214 180576 185492 191208 197400
54734 197400 203739 210437 217746 225699 234906 246468 260284 274425 287296 299590 313070 328088
54722 328088 343206 356428 365828 369821 368237 362841 355875 348331 340208 331640 322862 313741 304410 295879
54708 295879 289047 283560 278507 273840 270273 268226 267679 268631 270961 274228 278200 282994 288151 292413 295347
54693 295347 298473 303815 311919 322239 334772 350059 367893 387152 406825 426436 445718 464601
54681 464601 483229 501377 518295 533671 547949 560750 569699 572026 567029 556074 540764 522234
54669 522234 501712 480275 458089 435095 412465 392114 374534 358217 341689 325309 310606
54658 310606 298455 288418 279542 271363 264163 258425 254069 250338 246398 241806 236443 230555 225041 221104
54644B21104j941p40o19r61j320j553j213O3J510J786P44k97k75M64R88R09M70
54627B19119J6l85j073k220k915j690J286L556L200J401P49J767K971L656M399
54612B33837N034M509L084K464L255M179M404M665N347N388M176K820K395K414
54598B87971K232K519L976N693O259N725N116M644L788K792K757M053N627O212
54584C49364N868N936P481R955J1776J2394J3073J5081J7846J9914K1089K2292
54572E12069K3571K3855K2817K1476K0496J9201J6782J3309Q927L149m169j1900
54560F69583j8418k2924k5491k6350k5773k4301k2600k0943j9117j6930j4924
54549D31812j4158j4725j4866j2707q996o639o931p946p598o522o321o643o137
$$ plain form
54644 221104 219163 218423 217804 216843 215523 213970 212757 212820 214330 216116 216860 216563 216288 216752 217740 218649 219119
54627 219119 219135 218750 217677 215457 212542 210852 212138 215694 218894 220295 221044 222811 225782 229438 233837
54612 233837 238871 243380 246464 248928 252183 256362 260766 265431 270778 276166 280342 283162 285557 287971
54598 287971 290203 292722 296698 302391 308650 314375 319491 324135 327923 330715 333472 337525 343152 349364
54584 349364 355232 361168 368649 378604 390380 402774 415847 430928 448774 468688 489777 512069
54572 512069 535640 559495 582312 603788 624284 643485 660267 673576 682503 685652 681483 669583
54560 669583 651165 628241 602750 576400 550627 526326 503726 482783 463666 446736 431812
54549 431812 417654 402929 388063 375356 366360 359721 352790 344844 337246 330724 324403 317760 311623
54536C11623n102m884n384n497n355n847o496o228n787o692q183p970o076m962
54522B27160n441n455l724j859j604k342k738k810l033l033k533k201k532l108
54508A84747l577m064m105k796n80P57M52m36j024j595k031j367L02J293P05l32
54492A66349m82K48J423K770L359K227M34L33K009K879J772Q84K162M176M529
54477A95072L374K550K848L931N500O879O821N312M226M808N956O410O939Q651
54463B69277J0718J1688J1673J1515J0966R509P829O669N246K479j128m348o911
54450C45182q974j0117j0406j1109j2641j3110j0944p847o926q540j0074r463
54438B25031p167m904m003m798o329o828n458l239j633r31p71j048j491j478j200
$$ plain form
54536 311623 306521 301637 296253 290756 285401 279554 273058 266830 261043 254351 246168 238198 232122 227160
54522 227160 221719 216264 212540 210681 209077 206735 203997 201187 198154 195121 192588 190387 187855 184747
54508 184747 181170 177106 173001 170205 169625 170382 170834 170398 169374 167779 165748 164381 164683 165976 166681 166349
54492 166349 165867 166115 167538 170308 173667 175894 176328 176661 178670 181549 183321 184205 186367 190543 195072
54477 195072 198446 200996 203844 207775 213275 220154 226975 232287 236513 241321 247277 253687 260626 269277
54463 269277 279995 291683 303356 314871 325837 335346 343175 349844 355090 357569 356441 352093 345182
54450 345182 336208 326091 315685 304576 291935 278825 267881 260034 253108 244568 234494 225031
54438 225031 217864 212960 208957 204159 197830 191002 185544 182305 180672 179741 178970 177922 176431 174953 173753
54423A73753j730l009l318j936n41n05o38N71K145K265J317R26J198J231J493
54408A73222L051N061N330L296M64j741k821k388n77R99O26j169k253j652k70
54393A79178Q09J214Q46r8r02j334k178l658m318l049j118m09n50O0J206J169
54377A66868k12j280j293j340k215l195l323k533j285k04Pn88q17L0R31O89p0
54360A50170k7N44N20K29Q81K170K639K229K371L522M631N015M894M047K041k2
54344A85854j16J887L868M414M271M374M206L152K023K078L348M805N567N371
54330B35102M321K721J017k31m23M81J333O17j583l318l236k219j838k229k657
54315B27858k951l163k884k171k021k580k458j217q79k898n360n663m473m170
$$ plain form
54423 173753 172023 169014 165696 163760 163219 162714 162076 162647 164792 167057 168374 169300 170498 171729 173222
54408 173222 176273 181334 186664 189960 190424 188683 185862 183474 182897 183896 184522 183353 181100 179448 179178
54393 179178 179987 181201 182047 181949 181047 179713 177535 173877 169559 166510 165392 164983 164433 164493 165699 166868
54377 166868 166656 165376 164083 162743 160528 157333 154010 151477 150192 149988 149995 149407 148590 148620 149551 150240 150170
54360 150170 150143 150687 151207 151436 152317 154487 157126 159355 161726 165248 169879 174894 179788 183835 185876 185854
54344 185854 185738 187625 191493 195907 200178 204552 208758 211910 213933 216011 219359 224164 229731 235102
54330 235102 239423 242144 243161 242930 242507 242988 244321 244938 243355 240037 236801 234582 232744 230515 227858
54315 227858 224907 221744 218860 216689 214668 212088 209630 208413 207534 204636 199276 193613 189140 184970
54301A84970m584l616j327Q0J67P70K289K742J229m58o89n8K96L58M30N32J129
54284A84260K701M250M170K831K244K938L432L155L365M567N262M308K379L84
54270B30246j636l219l245j937j156j835k875l392m033n144n610m791l796l705
54256A83872l988l708k878j791n15J71q14k821l598k448j377j983l115l059k234
54241A49714k144k881l391l204k573j687q10m20m15j26K83k50j613j914q8K210
54225A30691K624J006r26j920k051j824j512j088k81R24J793J624Q60L86j7j019
54209A29270j766o55J726K738J447kK32J129R15j85q97r66p41nJ216J878J310
54192A36644L33j16l55q34r28j48O52N26r5k80K2M93J143J651J274L52L94J646
$$ plain form
54301 184970 180386 176770 175443 175523 175690 176460 178749 181491 182720 182262 181573 181515 181811 182169 182599 183131 184260
54284 184260 186961 191211 195381 198212 200456 203394 206826 209981 213346 217913 223175 227483 229862 230246
54270 230246 228610 225391 222146 220209 219053 217218 214343 210951 206918 201774 196164 191373 187577 183872
54256 183872 179884 176176 173298 171507 170992 171163 170349 167528 163930 161482 160105 158122 155007 151948 149714
54241 149714 147570 144689 141298 138094 135521 133834 133024 132604 132189 132063 132346 132096 130483 128569 128481 130691
54225 130691 133315 134321 133395 131475 129424 127600 126088 125000 124719 125643 127436 129060 129920 130306 130289 129270
54209 129270 127504 126849 128575 131313 132760 132758 132990 134119 135034 134849 133952 132986 132245 132240 133456 135334 136644
54192 136644 136977 136861 136506 135672 134744 134596 135248 135774 135679 135399 135421 135914 137057 138708 139982 140334 140728 142374
54174A42374K160O68j249j425j88O36M86Q5l17p94o27Q68K818L645K977J602J17
54157A53836j147j616j112l85L5O33J516J516Kj520j354j79J06o35r09j79N54
54140A49162O73O85R35R28K21q99j717j578m05Q27P84m55j215n12M12q4j757l107
54122A42898l425k922j702L3J382J584J013L45n01j621k295k086j797k063j878
54107A26965j72K009K537J016q98j694j335p45r88k403l765l138n02J680J572
54092A20139K92l08n50j645k913k722j365n97q02r71r25j241j358k39J216J075
54076A07086k94l70J629L496L376K008P64k96j260j263J9J241J184M76L00L34
54060A18430n90k470l881l613j811K71J354J260J052J640K346J677n77k906l838
$$ plain form
54174 142374 144534 145202 143953 142528 142340 142976 143462 143547 143230 142436 141809 142677 145495 149140 152117 153719 153836
54157 153836 152689 151073 149961 149576 149611 150244 151760 153276 153278 151758 150404 150225 150331 149696 148787 148608 149162
54140 149162 149835 150520 151455 152383 152604 151705 149988 148410 148005 148832 149616 149161 147946 147434 147846 147762 146005 142898
54122 142898 139473 136551 134849 134882 136264 137848 138861 139206 138705 137084 134789 132703 130906 128843 126965
54107 126965 126793 128802 131339 132355 131457 129763 128428 127683 126695 124292 120527 117389 116887 118567 120139
54092 120139 120431 120123 119573 117928 115015 112293 110928 110331 109529 108558 107633 106392 105034 104795 106011 107086
54076 107086 106792 106422 108051 111547 114923 116931 117695 117399 116139 114876 114895 116136 117320 117796 118096 118430
54060 118430 117840 115370 111489 107876 106065 106336 107690 108950 110002 111642 113988 115665 115088 112182 108344
54045A08344l143j350P95K239K172J156O65J123J510J285J345K305L045K230N29
54030A24250QJ432L348L914K819J130j61q68j149r58k42N47O88p2j307k431k986
54013A27962k496p57J498K929K952K233J549Q99J64l18m20n86q32l14J246K583
53997A38292K482J625J648K886M250M899M801M023K665J405R69J180J379J500
53983A74004J911K569L242M092N116N541M872L932L859M584N523O991R402J1656
53969B47294J2065J0678R110Q295P908P716P754P359N827M109L967N308O154N622
53955C49166M919M957M840L725K464K239K715K647J498l61k342l884m710n195
53941C62678n883o551o739p021q297r754r316o745m536m660n987o172m854l500
$$ plain form
54045 108344 105201 103851 104646 106885 109057 110213 110878 112001 113511 114796 116141 118446 121491 123721 124250
54030 124250 124258 125690 129038 132952 135771 136901 136740 135872 134723 133765 133523 134070 134758 134686 133379 130948 127962
54013 127962 125466 124709 126207 129136 132088 134321 135870 136769 136933 136615 136195 135609 134777 134463 135709 138292
53997 138292 140774 142399 144047 146933 151183 156082 160883 164906 167571 168976 169945 171125 172504 174004
53983 174004 175915 178484 181726 185818 190934 196475 201347 205279 209138 213722 219245 226236 235638 247294
53969 247294 259359 270037 279147 287442 295350 303066 310820 318179 324006 328115 332082 337390 343544 349166
53955 349166 354085 359042 363882 367607 370071 372310 375025 377672 379170 378809 376467 372583 367873 362678
53941 362678 356795 350244 343505 336484 328187 318433 309117 302372 297836 293176 287189 281017 276163 272663
53927B72663k978k823k523k191k080k341l085m031m356l496j839k40Q48J320J095
53912B43943M01r2qK64K88K78N34O93L26j06K73J371J959J152l94j119k17J492
53894B51038K450J976Q12P5P7L76N51M74K11J66R32K454L708L961L907M621N775
53877B83564O137N642N655O869Q215Q401P516O476N687M979M359M071M146M267
53863C65984M025L273K400K176K921M035M870N665O942Q251Q595P984P432P320
53849D41873O989O240O017O901P963Q011P254O831P002O681M747J382j948l647
53835E12296l234j685n21o25j805l228m033m090m372o137r179j1633j2127j1423
53821D38204j1124j1466j1557j1152j0756j0372r621q889q824q904q009o489n955
$$ plain form
53927 272663 269685 266862 264339 262148 260068 257727 254642 250611 246255 242759 240920 240680 241528 242848 243943
53912 243943 244344 244252 244244 244508 244796 245074 245608 246301 246627 246521 246794 248165 250124 251276 250882 249763 249546 251038
53894 251038 253488 255464 256276 256351 256428 256804 257355 257829 258040 258206 259138 261592 265300 269261 273168 277789 283564
53877 283564 289701 295343 300998 307867 316082 324483 331999 338475 344162 349141 353500 357571 361717 365984
53863 365984 370009 373282 375682 377858 380779 384814 389684 395349 402291 410542 419137 427121 434553 441873
53849 441873 448862 455102 461119 468020 475983 483994 491248 498079 505081 511762 516509 517891 515943 512296
53835 512296 509062 507377 506856 506231 504426 501198 497165 493075 488703 482566 473387 461754 449627 438204
53821 438204 427080 415614 404057 392905 382149 371777 362156 353267 344443 335539 327530 321041 315086
53808C15086o881p982q197p663o502m519k666k863n273p374o947m630k475j329
53794B39785r96j705l579n335n282l550k084k358l880n045m898l860k986k465
53780A91762j280J043K900K186n69k395j752m37o24j751j918j044n88q86q15l7
53764A83795M21Q6K7J215L008L971L543K245P86l81p70K04K543N074O142N307
53748B17216M000L835M485M242K696J685K893N441O942O438N275N128O075O944
53734B83295O885O178N469M775L711K661K920M977P204P381N276K695J049J28
53720C44604m91l53Q04J956J807L56j316k425l048l689m705n820o065m780k782
53705C14053j690j795j752q64m45j895m422o012o064n684n615n283m102k624j777
$$ plain form
53808 315086 308205 300223 292026 284363 277861 273342 270676 267813 262540 255166 248219 243589 241114 239785
53794 239785 238789 237084 233505 228170 222888 219338 217254 214896 211016 205971 201073 197213 194227 191762
53780 191762 190482 191525 194425 196611 196042 193647 191895 191458 190834 189083 187165 186121 185533 184647 183832 183795
53764 183795 184216 184302 184329 185544 188552 192523 196066 198311 199097 198716 197946 198150 200693 205767 211909 217216
53748 217216 221216 225051 229536 233778 236474 238159 241052 246493 253435 259873 265148 270276 276351 283295
53734 283295 290180 296358 301827 306602 310313 312974 315894 320871 328075 335456 340732 343427 344476 344604
53720 344604 344113 343760 344564 346520 348327 348683 347367 344942 341894 338205 333500 327680 321615 316835 314053
53705 314053 312363 310568 308816 307952 307507 305612 301190 295178 289114 283430 277815 272532 268430 265806 264029
53690B64029j581j277l97P23J525J852J823J335K53r90j603j469j382j780k114
53675B58947k002k189l228m095l468j832p54m51J68J218J556R76O75J050R87N6
53659B47614n16n0J83q59k012j615j5J155J345J261J379J632K099K832L401L426
53643B61260L137K746K061J348J623L075M201L575J759M52M59J464K980M402M868
53628B99410M258L760M367N453N739N000L827K448R14k40o21o25n59M7J256J839
53612C36273Q61o67j219r39r39j143p18j10o97k506l924l915l054k229j594j088
53596C12392q56q88r90j191j476j394o60J10K09k9K73J229K252K915K916J858
53580C16670J34o79L62K013K340J255J69j84m9O38K050L393L736L577L911M159
$$ plain form
53690 264029 262448 261171 260774 261497 263022 264874 266697 268032 268285 267295 265692 264223 262841 261061 258947
53675 258947 256945 254756 251528 247433 243965 242133 241379 240928 241096 242314 243870 244846 245521 246571 247558 247614
53659 247614 247098 247048 247231 246372 244360 242745 242730 243885 245230 246491 247870 249502 251601 254433 257834 261260
53643 261260 264397 267143 269204 270552 272175 275250 279451 283026 284785 285237 285696 287160 290140 294542 299410
53628 299410 303668 307428 311795 317248 322987 327987 331814 334262 335176 334936 334315 333690 333131 333178 334434 336273
53612 336273 337134 336467 335248 334309 333370 332227 331509 331399 330702 328196 324272 320357 317303 315074 313480 312392
53596 312392 311536 310648 309658 308467 306991 305597 304937 305047 305256 305227 305500 306729 308981 311896 314812 316670
53580 316670 316804 316125 316487 318500 320840 322095 322264 322080 322031 322669 324719 328112 331848 335425 339336 343495
53564C43495L046J192O20J660K536K366K341L363M549M865M457L669K467J489
53550C82115J993L905N552O042O210O447N633L428J783K574N087P333Q539Q896
53536D55537Q221O607N354N414N754M978L756L686M347L734J489l85l60P87J633
53521E10552J917K078K202K297K733L552M033L628K773K189J882J455R42P08Q24
53506E43765J169J787K542K688J592j25r49k20J102J765J723J870K673L630L970
53491E68982L421K420J741J955K833L494L382K800K208J516P96J100L436O950
53477F07034R330R340P992O928O590O553O629O912P340P846Q477Q930Q708Q220
53463G16829Q813J1010J3562J5065J5728J6583J7699J8411J8813J9708K1201K2499
$$ plain form
53564 343495 346541 347733 348353 350013 352549 354915 357256 360619 365168 370033 374490 378159 380626 382115
53550 382115 384108 388013 393565 399607 405817 412264 417897 421325 423108 425682 430769 438102 446641 455537
53536 455537 463758 470365 475719 481133 486887 491865 495621 499307 503654 507388 508877 508492 508132 508919 510552
53521 510552 512469 514547 516749 519046 521779 525331 529364 532992 535765 537954 539836 541291 542233 542941 543765
53506 543765 544934 546721 549263 551951 553543 553418 552469 552249 553351 555116 556839 558709 561382 565012 568982
53491 568982 572403 574823 576564 578519 581352 584846 588228 591028 593236 594752 595548 596648 600084 607034
53477 607034 616364 625704 633696 640624 647214 653767 660396 667308 674648 682494 690971 699901 708609 716829
53463 716829 725642 736652 750214 765279 781007 797590 815289 833700 852513 872221 893422 915921
53451I15921K3080K3270K3541K3962K4410K4897K5637K7004K9033L0877L1497
53440A203129L1168L1310L2442L3506L3849L4404L5747L6654L6120L5405L6004
53429A579738L6833L5877L3745L2786L3037L2055K9128K6642K6400K7267K7703
53418A921211K8247K9668L0710K9815K7821K6813K7006K6729K5186K3526K2965
53407B219697K3113K2580K0541J7421J4409J2312J0816Q926O140K769q03m499
53395B353422p974j0481j1798j2747j4311j6581j8923k0761k1819k2002k1520
53384B174505k0946k0977k2047k3933k5553k5578k3962k2387k2507k3973k5165
53373A917477k5374k5051k4134k1867j8566j5851j4442j3012j0208o708m322l760
$$ plain form
53451 915921 939001 962271 985812 1009774 1034184 1059081 1084718 1111722 1140755 1171632 1203129
53440 1203129 1234297 1265607 1298049 1331555 1365404 1399808 1435555 1472209 1508329 1543734 1579738
53429 1579738 1616571 1652448 1686193 1718979 1752016 1784071 1813199 1839841 1866241 1893508 1921211
53418 1921211 1949458 1979126 2009836 2039651 2067472 2094285 2121291 2148020 2173206 2196732 2219697
53407 2219697 2242810 2265390 2285931 2303352 2317761 2330073 2340889 2349815 2355955 2358724 2357921 2353422
53395 2353422 2345448 2334967 2323169 2310422 2296111 2279530 2260607 2239846 2218027 2196025 2174505
53384 2174505 2153559 2132582 2110535 2086602 2061049 2035471 2011509 1989122 1966615 1942642 1917477
53373 1917477 1892103 1867052 1842918 1821051 1802485 1786634 1772192 1759180 1748972 1742264 1737942 1734182
53361A734182m251m632m000j892J261M185N969O962Q045R486J1087J2914J5176
53348A794492J7641J9867K1789K3586K5190K6419K7506K9051L1395L4248L6928
53337B088112L9004M0741M2816M5497M8366N0952N3250N5351N7236N9346O2452
53326B643123O6058O7975O6941O4960O5159O7641O9491O8903O7151O5968O5161
53315C378531O3978O2894O2434O1547N8769N4167M8840M3296L7610L2437K8392
53304C932895K4855K0592J5345R781M144j977q638j5302k1529k7285l2526l7189
53292C863166m1469m5526m9086n1834n4066n6458n9179o1634o3027o2888o1259
53281C256740n8630n5702n3086n1178n0083m9444m8585m7387m6614m6750m6905
$$ plain form
53361 1734182 1729931 1725299 1721299 1719407 1720668 1724853 1730822 1737784 1745829 1755315 1766402 1779316 1794492
53348 1794492 1812133 1832000 1853789 1877375 1902565 1928984 1956490 1985541 2016936 2051184 2088112
53337 2088112 2127116 2167857 2210673 2256170 2304536 2355488 2408738 2464089 2521325 2580671 2643123
53326 2643123 2709181 2777156 2844097 2909057 2974216 3041857 3111348 3180251 3247402 3313370 3378531
53315 3378531 3442509 3505403 3567837 3629384 3688153 3742320 3791160 3834456 3872066 3904503 3932895
53304 3932895 3957750 3978342 3993687 4003468 4007612 4005635 3996997 3981695 3960166 3932881 3900355 3863166
53292 3863166 3821697 3776171 3727085 3675251 3621185 3564727 3505548 3443914 3380887 3317999 3256740
53281 3256740 3198110 3142408 3089322 3038144 2988061 2938617 2890032 2842645 2796031 2749281 2702376
53270B702376m5887m4034m2776m2459m2019m0823l9316l7529l4584l0381k6272
53259B276296k3249k0824j8534j7075j6844j6820j6241j6174j7759j9881k0351
53248B072544j8887j7217j6407j5711j4068j1548r023p271o466n994m820k567
53236A942565L9K189L929N608P156Q606J0580J3303J5820J7208J7946J9097K0739
53223B084785K2346K4150K6664K9204L0226K9234K7326K5829K5324K5718K6215
53212B377021K5318K2112J7620J4023J2334J1647J0536Q247M569k37n042q446
53200B489702j0296j1906j4327j7136j9433k1327k3567k5935k7040k6173k4791
53189B267771k5253k8008l0918l1943l1639l2000l3423l4353l3837l2711l1860
$$ plain form
53270 2702376 2656489 2612455 2569679 2527220 2485201 2444378 2405062 2367533 2332949 2302568 2276296
53259 2276296 2253047 2232223 2213689 2196614 2179770 2162950 2146709 2130535 2112776 2092895 2072544
53248 2072544 2053657 2036440 2020033 2004322 1990254 1978706 1969683 1962412 1955946 1949952 1945132 1942565
53236 1942565 1942604 1944793 1948722 1954330 1961486 1970092 1980672 1993975 2009795 2027003 2044949 2064046 2084785
53223 2084785 2107131 2131281 2157945 2187149 2217375 2246609 2273935 2299764 2325088 2350806 2377021
53212 2377021 2402339 2424451 2442071 2456094 2468428 2480075 2490611 2498858 2503427 2503190 2498148 2489702
53200 2489702 2479406 2467500 2453173 2436037 2416604 2395277 2371710 2345775 2318735 2292562 2267771
53189 2267771 2242518 2214510 2183592 2151649 2120010 2088010 2054587 2020234 1986397 1953686 1921826
53178A921826l1018l0006k9562k9739k9008k6413k3534k2646k3732k4778k4534
53167A626856k3365k1924k0473j9374j8862j8428j7480j6359j5591j4722j3243
53156A427035j2097j2601j4077j4345j2704j0862j0604j1963j4013j6098j7759
53145A279912j8602j8855j9194j9724j9871j9439j8912j8566j8131j7390j6258
53134A074970j4504j2468j1769j3790j7330j9373j8582j6657j5836j6439j7471
53123I00751j8162j8051j6753j4753j3527j3924j5152j6014j6272j6057j5070
53112G27016j3422j2318j2530j2912j1847r827r046j0400j2170j2172j0233q024
53100E92115p053p458q370q931q943q731q557q204p312o086n306n472o050n991
$$ plain form
53178 1921826 1890808 1860802 1831240 1801501 1772493 1746080 1722546 1699900 1676168 1651390 1626856
53167 1626856 1603491 1581567 1561094 1541720 1522858 1504430 1486950 1470591 1455000 1440278 1427035
53156 1427035 1414938 1402337 1388260 1373915 1361211 1350349 1339745 1327782 1313769 1297671 1279912
53145 1279912 1261310 1242455 1223261 1203537 1183666 1164227 1145315 1126749 1108618 1091228 1074970
53134 1074970 1060466 1047998 1036229 1022439 1005109 985736 967154 950497 934661 918222 900751
53123 900751 882589 864538 847785 833032 819505 805581 790429 774415 758143 742086 727016
53112 727016 713594 701276 688746 675834 663987 654160 645114 634714 622544 610372 600139 592115
53100 592115 585062 577604 569234 560303 551360 542629 534072 525868 518556 512470 507164 501692 495642 489651
53086D89651n040m167m295m945m754l394k135k203l325m495n321n798n378l631
53072D30770j564q90j806k748k656k255k454k779k437k008k652m049m514l264
53058C94694j455n64o94r51q86q14j108j813k778l654l849l106k032j482j428
53043C68080j124m32L5L36J526L729N104M036J613J82J29J3l75N57L153N195M799
53026C96556K772Q14q61k502l070j679K14L89q95j435o96o99k978o468r077r883
53010C60502r222p746o150m986m227l531l087l437m426n191n332n241n112m584
52996B88230l584k655k141j752j149l39N82J378J425L63r01q86M97J573Q70j223
52980B80288l206m184m425m641n096n226m199k071j57K94m70j192j182p00r4M91
$$ plain form
53086 489651 484611 480444 476149 471204 466450 463056 460921 458718 455393 450898 445577 439779 434401 430770
53072 430770 429206 428316 426510 423762 421106 418851 416397 413618 411181 409173 406521 402472 397958 394694
53058 394694 393239 392675 391981 391030 390144 389330 388222 386409 383631 379977 376128 373022 370990 369508 368080
53043 368080 366956 366524 366559 366895 368421 372150 377254 381290 382903 383085 383214 383227 382852 383409 386562 391757 396556
53026 396556 399328 400142 399281 396779 393709 392030 392244 392633 391738 390303 389607 388908 385930 379462 370385 360502
53010 360502 351280 343534 337384 332398 328171 324640 321553 318116 313690 308499 303167 297926 292814 288230
52996 288230 284646 281991 279850 278098 276949 276610 277192 278570 279995 280358 279457 278571 279068 280641 281511 280288
52980 280288 277082 272898 268473 263832 258736 253510 249311 247240 247083 247377 246907 245715 244533 243833 243739 244230
52964B44230P62N33K02J61pp98j678j772j360j314j402o68N91J002L19k34j85
52947B38382m67j327j532n75R3o41j551q80R68K209K326K316K682K766K113J208
52931B48090N98K09j49k23K18O41M3j738l174k351M72K464J409j355k628j552
52915B40974k33j10K6J477L124L111J706P81J114J850K228K338K315K036J725
52900B64462J898K532K996K981K886L201L827M214L983L426L284L881M727N457
52886C13755O627Q643J0209R379O376L758L153L316K462J067Q45K006L208L650
52872C78454L571K930J254j040k520k451j687j512k157k835k731j766p17p11k254
52857C63828m602o270o257m737k748j259l72N53J766K395J496l15j210k97J360
$$ plain form
52964 244230 244992 245525 245727 245888 245881 245083 243405 241633 240273 238959 237557 236889 237480 238482 238801 238567 238382
52947 238382 237915 236588 235056 234481 234574 233933 232382 231502 232470 234679 237005 239321 242003 244769 246882 248090
52931 248090 248688 248897 248748 248525 248743 249384 249427 247689 244515 242164 242636 245100 246509 245154 242526 240974
52915 240974 240741 240631 240657 242134 245258 248369 250075 250856 251970 253820 256048 258386 260701 262737 264462
52900 264462 266360 268892 271888 274869 277755 280956 284783 288997 292980 296406 299690 303571 308298 313755
52886 313755 320382 329025 339234 348613 354989 358747 361900 365216 367678 368745 369590 371596 374804 378454
52872 378454 382025 384955 386209 385169 382649 380198 378511 376999 374842 372007 369276 367510 366793 366082 363828
52857 363828 359226 352956 346699 341962 339214 337955 337583 338136 339902 342297 343793 343478 342268 341971 343331
52842C43331K216J855P74m84j453j756j589j474j142L48K721L909K413n71k477
52827C46621k316j240o47p89j028o37N51J847K340K097K066K491K486J667J007
52812C56516J126J015k56j772k232k152k778l562k807m19J840K840L011K854K275
52797C55499J644J688K033J390l81j825j971j342m97P47K078K311J220L28P48
52782C63670J588J676J561K286L194K807J461J171K770M618M716K997R59j82l05
52767C94987J22O63J022J120J164J481K031K249J671O87K40N64O75l63k052k981
52751D03280k634j950k014k904l979m612m402l326k154k092l467n124n658m921
52737C54043l798k916k246j845k194l559n432o944p513o975n390l169j324j042
$$ plain form
52842 343331 345547 347402 348176 347692 346239 344483 342894 341420 340278 340626 343347 347256 349669 349098 346621
52827 346621 344305 343065 342418 341629 340601 339964 340515 342362 344702 346799 348865 351356 353842 355509 356516
52812 356516 357642 358657 358401 356629 354397 352245 349467 345905 343098 342679 344519 347359 350370 353224 355499
52797 355499 357143 358831 360864 362254 361873 360048 358077 356735 356238 356985 359063 361374 362594 362922 363670
52782 363670 365258 366934 368495 370781 373975 376782 378243 379414 382184 386802 391518 394515 395474 395292 394987
52767 394987 395109 395772 396794 397914 399078 400559 402590 404839 406510 407197 407437 408001 408676 408313 406261 403280
52751 403280 400646 398696 396682 393778 389799 385187 380785 377459 375305 373213 369746 364622 358964 354043
52737 354043 350245 347329 345083 343238 341044 337485 332053 325109 317596 310621 305231 302062 300738 299696
52723B99696k536m448m791k824J42K006J753L8j867l221l945m197m107l792l378
52708B64529k874k130r69L93J177N91j242l156m113m181m025l812l254k575k461
52693B31898k937l128k569j995k152k537k207j387j227k020k847l130l435m139
52679A96188m441l669k832l502n348o100m308j089J350K124J953J700J467R60
52665A74453J10q35j477j636j602j795k086j888j115m57m21o48o11m05k55J50
52649A59482J099K010K051J346P77O47L76n25j761k575k391j288r8L67M16J112
52633A61045K325K388N85j117m06K112L826L729L115K885K355J134J60J81Q33
52618A85150J719K896L781L334J958J517K596L535L168K627L061L295J651j168
$$ plain form
52723 299696 297160 292712 287921 285097 285239 287245 288998 289036 287169 283948 280003 275806 271699 267907 264529
52708 264529 261655 259525 258556 258949 260126 260717 259475 256319 252206 248025 244000 240188 236934 234359 231898
52693 231898 228961 225833 223264 221269 219117 216580 214373 212986 211759 209739 206892 203762 200327 196188
52679 196188 191747 188078 185246 181744 176396 170296 165988 164899 166249 168373 170326 172026 173493 174453
52665 174453 174563 173728 172251 170615 169013 167218 165132 163244 162129 161672 161251 160603 159992 159587 159332 159482
52649 159482 160581 162591 164642 165988 166765 167412 167788 167263 165502 162927 160536 159248 159150 159517 159933 161045
52633 161045 163370 165758 166343 165226 164820 166932 170758 174487 177602 180487 182842 183976 184136 184317 185150
52618 185150 186869 189765 193546 196880 198838 200355 202951 206486 209654 212281 215342 218637 220288 219120
52604B19120k921k887k295k285k844l523l849l329j958n21L08N29J07j326l228
52589A89098l975l043k118k650l492k701o20O90M16n33j410k044j805k24J443
52574A67032J332k87j245n89L26K67k30k67j00l83j094j982l072m088m241l130
52558A48249j215Q56K530K864J068j935l618k499M9J530J228N10O13J269J649
52543A53148J700J862J922J218P7J5J623L217K928J607J751L569M400K742N90
52528A82369K92J123J007O6J1J013J723J877K409L160K856J568R13J368J484M58
52512B03697l81M02K248L537L629L100K679K564K427J790P06q5j04L25R63K187
52496B29684L669L727J558r36j456n61m05r73k75K029M051M849N267N250L346
$$ plain form
52604 219120 216199 213312 211017 208732 205888 202365 198516 195187 193229 192708 193016 193545 193652 192326 189098
52589 189098 185123 182080 179962 177312 173820 171119 170499 171189 171605 171072 169662 167618 165813 165589 167032
52574 167032 168364 168077 166832 166243 166569 166836 166606 166339 166239 165856 164762 162780 159708 155620 151379 148249
52558 148249 147034 147890 150420 153284 154352 152417 148799 146300 146349 147879 149107 149617 150230 151499 153148
52543 153148 154848 156710 158632 159850 159927 159942 161565 164782 167710 169317 171068 174637 179037 181779 182369
52528 182369 182661 183784 184791 184857 184868 185881 187604 189481 191890 195050 197906 199474 200387 201755 203239 203697
52512 203697 203316 203718 205966 209503 213132 216232 218911 221475 223902 225692 226398 226313 226209 226534 227497 229684
52496 229684 233353 237080 238638 237702 236246 235685 235280 234307 234032 236061 240112 244961 250228 255478 258824
52481B58824p8k175j545k38j87k08J387L466L923L234L468M618M503K154o95j821
52465B78630q99N22O71q30k648l175k319j156j24J130K141J764L14l36L24M83
52449B74492r29k225j640j41L22j15PQ27J443J917K921L884L474J675k35j510
52433B84167k244k392j900j489j796k158j593n06J0K3L68Q19M36n19o25P07K598
52416B73906L985M298L237J229j12M95K177K956K307J272M56l34p68k21O42M55
52400B95980m93m25R80J839R81k33o9J241K421L015L188K783J876J343J640J750
52384C17817O40q77j051L08J621J800J534J884K533K187M35j505k132j353l73
52369C23468j6J50O97J129O27m33p14K95J690K429K302J470J1j603k398k012j275
$$ plain form
52481 258824 258746 256571 255026 254788 254601 254393 255780 259246 263169 266403 269871 274489 278992 281146 280451 278630
52465 278630 277731 278253 278924 278094 275446 272271 269952 268796 268672 269802 271943 273707 274021 273685 274009 274492
52449 274492 273563 271338 269698 269557 269879 269764 269771 270598 272041 273958 276879 280763 284237 285912 285677 284167
52433 284167 281923 279531 277631 276142 274346 272188 270595 270089 270099 270122 270490 271309 271745 271226 270601 271308 273906
52416 273906 277891 282189 285426 286655 286543 287038 289215 292171 294478 295750 296206 295872 295104 294883 295525 295980
52400 295980 295487 295062 296042 297881 298862 298629 298560 299801 302222 305237 308425 311208 313084 314427 316067 317817
52384 317817 318457 317580 316529 316837 318458 320258 321792 323676 326209 328396 328831 327326 325194 323841 323468
52369 323468 323452 323602 324299 325428 326055 325622 324908 325203 326893 329322 331624 333094 333105 331502 329104 327092 325817
52352C25817j006p82K63J736K086O29j277j593J21K240K874J812N40N13J780L309
52336C39062M276M655M746M431L295J286p81j763j298k24L98M28M93Q57J093Q04
52320C61758P2r12j819j815k60J831K203J85j965j681O18K271K095J738K938M877
52304C72134N271L467J275O21J227J366O42Q35L268O295O983N085L455M005N126
52289D21055M464K563J841K891M051M333M618N650O715O990O703O233N297L908
52275D87312L077L640N001N856N724N110M640M732N700P405Q908R012P408N113
52261E68638L787M493O839R307J0604J0793J0876J1516J2555J3586J4348J4594
52249F91936J4309J4225J5377J7813K0308K1778K2403K3023K3916K4767K5434
$$ plain form
52352 325817 324811 324029 324292 326028 328114 328743 327466 325873 325994 328234 331108 332920 333460 333973 335753 339062
52336 339062 343338 347993 352739 357170 360465 361751 360970 359207 357909 357685 358083 358511 359004 359861 360954 361758
52320 361758 361830 360918 359099 357284 357024 358855 361058 361243 359278 357597 358215 360486 362581 364319 367257 372134
52304 372134 377405 380872 382147 382768 383995 385361 386003 386838 390106 396401 403384 408469 411924 415929 421055
52289 421055 425519 428082 429923 432814 436865 441198 445816 451466 458181 465171 471874 478107 483404 487312
52275 487312 490389 494029 499030 504886 510610 515720 520360 525092 530792 538197 547105 556117 563525 568638
52261 568638 572425 576918 583757 593064 603668 614461 625337 636853 649408 662994 677342 691936
52249 691936 706245 720470 735847 753660 773968 795746 818149 841172 865088 889855 915289
52238I15289K6073K6574K6591K6279K6565K8300L1270L4208L5785L5480L3717
52227A246131L1462K9790K9308K9624K9497K8025K5766K4175K3875K3892K2808
52216A544353K0304J7323J5102J4103J3578J2048Q790M945K483J873J666O90l57
52203A656901k58Q19J821K406K802K553R42j387k597j769K16K142L824N640P557
52188A681612R188J0367J1301J2467J4396J7068J9521K0679K0661K0606K1063
52177A858929K1325K0672J9595J9185J9709K0292J9874J8229J6126J4565J3683
52166B062184J2463R764N767J977l29j417k676m997p727r342r239q752r968j3477
52152B024231j7703k0603k1567k1435k1286k1698k2588k3129k2349k0406j8754
$$ plain form
52238 915289 941362 967936 994527 1020806 1047371 1075671 1106941 1141149 1176934 1212414 1246131
52227 1246131 1277593 1307383 1336691 1366315 1395812 1423837 1449603 1473778 1497653 1521545 1544353
52216 1544353 1564657 1581980 1597082 1611185 1624763 1636811 1645601 1650546 1653029 1654902 1656568 1657258 1656901
52203 1656901 1656643 1657462 1659283 1661689 1664491 1667044 1667986 1666599 1664002 1662233 1662449 1664591 1668415 1674055 1681612
52188 1681612 1690800 1701167 1712468 1724935 1739331 1756399 1775920 1796599 1817260 1837866 1858929
52177 1858929 1880254 1900926 1920521 1939706 1959415 1979707 1999581 2017810 2033936 2048501 2062184
52166 2062184 2074647 2084411 2090178 2092155 2091826 2090409 2087733 2082736 2075009 2065667 2056428 2047676 2037708 2024231
52152 2024231 2006528 1985925 1964358 1942923 1921637 1899939 1877351 1854222 1831873 1811467 1792713
52141A792713j8382j8392j7252j4854j2339j0339q657p483p418q179q476p558
52129A653384n929m311k867j797j583k093k431k216k305l511n267o301o153n374
52115A601246m557l921l714m327n697o974p123n987m621m334n268o291o393n829
52101A526210n517n812o418o993p229o689n440m523m866n877o034m863l359k487
52087A450103k296k569l268m007m111l660l639m470n333n407n034m822m376k926
52073A394185q93J81n53k158k967k451j695j960l070l623k764j235k74j9M20J495
52057A372619K702L477L912M427N235O330P621R007J0502J2231J4176J6101J7910
52044A486250J9665K1157K2161K3348K5943K9736L2635L3295L3229L4702L7357
$$ plain form
52141 1792713 1774331 1755939 1738687 1723833 1711494 1701155 1692498 1685015 1677597 1669418 1660942 1653384
52129 1653384 1647455 1643144 1640277 1638480 1636897 1634804 1632373 1630157 1627852 1624341 1619074 1612773 1606620 1601246
52115 1601246 1596689 1592768 1589054 1584727 1579030 1572056 1564933 1558946 1554325 1549991 1544723 1538432 1532039 1526210
52101 1526210 1520693 1514881 1508463 1501470 1494241 1487552 1482112 1477589 1472723 1466846 1460812 1455949 1452590 1450103
52087 1450103 1447807 1445238 1441970 1437963 1433852 1430192 1426553 1422083 1416750 1411343 1406309 1401487 1397111 1394185
52073 1394185 1393292 1393473 1392920 1390762 1387795 1385344 1383649 1381689 1378619 1374996 1372232 1370997 1370723 1370704 1371124 1372619
52057 1372619 1375321 1378798 1382710 1387137 1392372 1398702 1406323 1415330 1425832 1438063 1452239 1468340 1486250
52044 1486250 1505915 1527072 1549233 1572581 1598524 1628260 1660895 1694190 1727419 1762121 1799478
52033A799478L8749L7845L6069L4940L4544L4466L4449L3813L1934K9642K8353
52022B174282K7558K5177K1041J7635J6272J4768J0720N301J555J93p60k753n368
52009B305621p924j0436j2712j4066j4424j4635j5276j5896j5693j4498j2920
51998B157141j1855j1709j1748j0557p621m085j482j34P98K106L941N839O834
51985B117468O191M707M499O622R491J0755J0116R102Q542P829O605N622N467
51972B213016N664N535N030M153K524J96j815k782l585n802r642j3559j6195j7909
51958B164829j9976k2720k5124k6210k6174k5983k6353k7406k8962l0615l1819
51947A873487l2396l2836l3672l4702l5270l5215l4955l4756l4526l4425l4971
$$ plain form
52033 1799478 1838227 1876072 1912141 1947081 1981625 2016091 2050540 2084353 2116287 2145929 2174282
52022 2174282 2201840 2227017 2248058 2265693 2281965 2296733 2307453 2312754 2314309 2314502 2313742 2310989 2305621
52009 2305621 2297697 2287261 2274549 2260483 2246059 2231424 2216148 2200252 2184559 2170061 2157141
51998 2157141 2145286 2133577 2121829 2111272 2103651 2099566 2098084 2097950 2098748 2100854 2104795 2110634 2117468
51985 2117468 2123659 2128366 2132865 2139487 2148978 2159733 2169849 2178951 2187493 2195322 2201927 2207549 2213016
51972 2213016 2218680 2224215 2229245 2233398 2235922 2236118 2234303 2231521 2227936 2222134 2212492 2198933 2182738 2164829
51958 2164829 2144853 2122133 2097009 2070799 2044625 2018642 1992289 1964883 1935921 1905306 1873487
51947 1873487 1841091 1808255 1774583 1739881 1704611 1669396 1634441 1599685 1565159 1530734 1495763
51936A495763l6341l7912l8662l7913l5857l3693l2887l3730l4856l4886l4055
51925A104971l3494l3235l2269l0374k8576k7578k6917k6020k5017k4110k3176
51914G94205k2290k1614k0594j8501j6021j4904j5395j5584j4096j2037j1208
51903F11961j1670j2347j2859j3252j2765j0588p575n698n867p121p910p428n985
51890D90896m743m805o031p177p545p637p695o870m929l572m418o467p203n869
51876D05935m019l111l126l531l975l866k683r93LK26O02J007r1l121n941o267
51860C67049m743m045n169o099m668j560N60M17o21q37m97j001k532l901m450
51845C27903m776n271n289m218k400n05J041J549L30j835k758j576k38r44k997
$$ plain form
51936 1495763 1459422 1421510 1382848 1344935 1309078 1275385 1242498 1208768 1173912 1139026 1104971
51925 1104971 1071477 1038242 1005973 975599 947023 919445 892528 866508 841491 817381 794205
51914 794205 771915 750301 729707 711206 695185 680281 664886 649302 635206 623169 611961
51903 611961 600291 587944 575085 561833 549068 538480 530905 525207 519340 512219 504309 496881 490896
51890 490896 486153 481348 475317 468140 460595 452958 445263 438393 433464 429892 425474 419007 411804 405935
51876 405935 401916 398805 395679 392148 388173 384307 381624 380631 380634 380860 381462 382469 382378 379257 373316 367049
51860 367049 362306 358261 353092 346993 342325 340765 341325 341742 341121 340284 339787 338786 336254 332353 327903
51845 327903 323127 317856 312567 308349 305949 305444 306485 308034 308364 306529 303771 302195 301957 301013 298016
51830B98016l893k894j731j829k553k598j725n41N81J566K150J952J011O2J0Q22
51814B88406J155l02k931m493l631j288P76J915K432K536K375K334K409K008J094
51799B94795O43J081J377P27L7M13J193J135O83J114K143K274J269L41L2k70n93
51782C08394l4J512K872L333L485L848L854K812J012n89j254r85o49j282k619
51767C23710k929j273Q73J539J036J076J836J959J215Q09R11J05k014l684l333
51752C21836j557P3P98O52m4n64l06J51k26r92o03R55J714N20j386k349k194j376
51734C15102PJ376J464J74p80k84N37K32p24r00J8J447K999M101L713J741j58
51717C30065n09J62O16Q63J477K013J756J156R43O36l88j145k70J524K143J000
$$ plain form
51830 298016 294123 291229 289498 287669 285116 282518 280793 280252 280833 282399 284549 286501 287512 287574 287584 288406
51814 288406 289561 289259 286328 281835 278204 276916 277692 279607 282039 284575 286950 289284 291693 293701 294795
51799 294795 295438 296519 297896 298623 298660 299073 300266 301401 302084 303198 305341 307615 308884 309225 309257 308987 308394
51782 308394 308360 309872 312744 316077 319562 323410 327264 330076 331088 330499 329245 328260 327611 326329 323710
51767 323710 320781 319508 320381 321920 322956 324032 325868 327827 329042 329851 330762 330867 328853 325169 321836
51752 321836 320279 320352 321150 321802 321758 321194 320888 321039 320813 319821 319218 320173 321887 322407 321021 318672 316478 315102
51734 315102 315109 316485 317949 318123 317343 317059 317596 317828 317104 316204 316222 317669 320668 324769 328482 330223 330065
51717 330065 329556 329718 330334 331197 332674 334687 336443 337599 338542 339178 338790 337645 337375 338899 341042 342042
51701C42042m94j210j272p85N85K381L268K789K049K204L258M561N575N801M988
51686C75740L817L508M369N421N694N249M681M368M484N088N896O477O838P354
51672D48984Q043Q493Q524Q282P707O542M948L360J727k63k094k610j668o01m30
51657D98944n17M3N65l45k328l261k121o27j006l001m330l846k770k446k270q81
51641D69803J498L279L667L339K957K314J299N51N68J071J787K972M481N193M372
51626E09151L080L158M958O985P789P531P511Q481R621R176O276K081j330l154
51612E81314m209n196n651n167m429m154l970l291k616k667l039k875k405k394
51598E29251k439j371O70K122K113J232j7j907m046m958m218l712n187p521q070
$$ plain form
51701 342042 341548 340338 339066 338281 338866 341247 344515 347304 349353 351557 354815 359376 364951 370752 375740
51686 375740 379557 383065 387434 392855 398549 403798 408479 412847 417331 422419 428315 434792 441630 448984
51672 448984 457027 465520 474044 482326 490033 496575 501523 504883 506610 506347 504253 501643 499975 499374 498944
51657 498944 498427 498470 499035 498690 496362 493101 490980 490353 489347 486346 482016 478170 475400 472954 470684 469803
51641 469803 471301 474580 478247 481586 484543 486857 488156 488707 489275 490346 492133 495105 499586 504779 509151
51626 509151 512231 515389 520347 527332 535121 542652 550163 558644 568265 577441 583717 585798 584468 581314
51612 581314 577105 571909 566258 561091 556662 552508 548538 545247 542631 539964 536925 534050 531645 529251
51598 529251 526812 525441 526111 528233 530346 531578 531561 529654 525608 520650 516432 512720 507533 500012 491942
51583D91942o388m704m615n095m595l645l874n163n516l906j798j138j870k521
51569D37114k565k901m022n011m904m103l649l707l483k533j438j097j663k270
51555C93768j806j91J165O50j631l757m108l048j995j502j054m36k33p81j422
51540C73619j277l69M99Q11Q74J204J640J539Q22K91N93J280J658J980K897L904
51524C91965L794K780K658M073N187M273K439K076L452M683M725M391M255L503
51510D44254J694o8p31r10j681k743l012k474k020j769r65L12P25m10j826j784
51494D26592k69J225J746J625J254L09j186k048j148R46K590L170L562M366M762
51479D47496L773J921P67J042J917K163J569R61J017J386J265P91J111K617L824
$$ plain form
51583 491942 485554 480850 476235 471140 466545 462900 459026 453863 448347 444441 442643 441505 439635 437114
51569 437114 434549 431648 427626 422615 417711 413608 409959 406252 402769 400236 398798 397701 396038 393768
51555 393768 391962 391771 392936 393586 391955 388198 384090 381042 379047 377545 376491 376055 375822 375041 373619
51540 373619 372342 371973 372472 373283 374157 375361 377001 378540 379362 379653 380246 381526 383184 385164 388061 391965
51524 391965 395759 398539 401197 405270 410457 414730 417169 419245 422697 427380 432105 436496 440751 444254
51510 444254 445948 445880 445149 444239 442558 439815 436803 434329 432309 430540 429575 429887 430612 430202 428376 426592
51494 426592 426323 427548 429294 430919 432173 432482 431296 429248 428100 429046 431636 434806 438368 442734 447496
51479 447496 451269 453190 453957 454999 456916 459079 460648 461609 462626 464012 465277 466068 467179 469796 473620
51464D73620L160J388Q11J914K589J350l95n77M49Q51L92M13J124J163J70k27
51448D88195J018K426J935j85j815j948j879l254n825p600o971m449k197j936
51434D55515l325m529m284l002j985j954k593l044k693j633n90k38n38q91q80
51419D23336m98L05J723L415M306L657K226J723K921M656N068L763K326K599M744
51404D66270P287Q781Q824P654N671L828L474M895O414O119M366L433M402N605
51390E47023M893K541O84L39L38n20j559j337R2J139Q40J6m6P31J517J880J905
51373E60476J348k31k274l251k437r77m18o67k83J325K988L309K244O92q87k670
51357E58287m431n289m831l966l975m923n623n280m440m023m037l922l692l884
$$ plain form
51464 473620 476780 478168 478979 480893 483482 484832 484437 483860 484309 485160 485552 485965 487089 488252 488422 488195
51448 488195 489213 491639 493574 493389 491574 489626 487747 484493 478668 471068 464097 459648 457451 455515
51434 455515 452190 447661 443377 440375 438390 436436 433843 430799 428106 426473 425883 425645 425107 424216 423336
51419 423336 422838 423143 424866 428281 432587 436244 438470 440193 443114 447770 452838 456601 458927 461526 466270
51404 466270 473557 482338 491162 498816 504487 508315 511789 516684 523098 529217 533583 537016 541418 547023
51390 547023 551916 554457 555141 555480 555818 555298 553739 552402 552494 553633 554473 554489 554443 555174 556691 558571 560476
51373 560476 561824 561593 559319 556068 553631 552654 552236 551569 551286 552611 555599 558908 561152 561844 560957 558287
51357 558287 553856 548567 543736 539770 535795 530872 525249 519969 515529 511506 507469 503547 499855 495971
51343D95971m397m297l000j060M91J136R62L14j85J39J306K300J979M18j004r61
51327D90112M69J914K140J281M28R7m18j893l981n714o762p403p570o824n377
51312D50499m202l957m525n650p253q880r765r718r307q890q169o833m978k786
51298C55586p41j02j837m834o565o134n212n187n055l499j580j446l077m343l980
51283C01994k786j825j117m51j33k58k61K18O82M75l82j387k128k319j653j32
51267B88537J528K213J431k6p75m12N5k25n22K77J587J761Q07O72K288M090M451
51250C07737L881L590L432K858K530L124L632K952K149K967M705M983L289J351
51236C53180Kj765m196n658n049l460k422k148k379l363m939o030o226o522p479
$$ plain form
51343 495971 491574 487277 484277 483217 483708 484844 485806 486120 485935 486074 487380 489680 491659 492077 491073 490112
51327 490112 490581 492495 494635 495916 496344 496441 496023 494130 490149 484435 477673 470270 462700 455876 450499
51312 450499 446297 442340 437815 432165 424912 416032 406267 396549 387242 378352 370183 363350 358372 355586
51298 355586 354845 354743 352906 348072 341507 335373 330161 324974 319919 316420 314840 313394 310317 305974 301994
51283 301994 299208 297383 296266 295815 295682 295424 295163 295381 296063 296538 296156 294769 292641 290322 288669 288537
51267 288537 290065 292278 293709 293683 292908 292496 292551 292326 291804 292081 293668 295429 296236 296908 299196 303286 307737
51250 307737 311618 315208 318640 321498 324028 327152 330784 333736 335885 338852 343557 348540 351829 353180
51236 353180 353182 351417 347221 341563 336514 333054 330632 328484 326105 322742 317803 311773 305547 299025 291546
51221B91546p907o632m473l083k673k201j279m94k28l50q28j646k227j991j337
51206B54197j252j941k643k843k745k468j581L8J420J278m17k097k139n80R51
51191B37178J063Rr15r78n89m51o62o87N3J595L224L900L201J704L73k20mP15
51173B48509J221Q63P2J54J528K825K645J481Q13R09Q31K94j1J22L4n78j176j354
51155B59182j244q42q4M26L2n39K39K310L728L275K002J368J282J019Q43J329
51139B74326J810J017r34k427k264q96L63O79J03q47j628j939j870j891k413l120
51123B58069k942j277Q25J569P00k09k64o47k401m178l947k055n85j93K66J137
51107B43868J382Q37P53J400J309j74j482j254l85l59q99q46l02l63j279k126
$$ plain form
51221 291546 283639 277007 272534 269451 266778 264577 263298 262804 262576 262226 261398 259752 257525 255534 254197
51206 254197 252945 251004 248361 245518 242773 240305 238724 238762 240182 241460 241043 238946 236807 236227 237178
51191 237178 238241 238250 237335 236357 235768 235317 234655 233968 234021 235616 238840 242740 245941 247645 248018 247798 247794 248509
51173 248509 249730 250593 250665 250819 252347 255172 257817 259298 260111 261020 261851 262145 262134 262256 262290 261712 260536 259182
51155 259182 257938 257096 257012 257438 257470 256931 257170 259480 263208 266483 268485 269853 271135 272154 272997 274326
51139 274326 276136 277153 276219 273792 271528 270632 270995 271674 271777 270930 269302 267363 265493 263602 261189 258069
51123 258069 255127 253850 254675 256244 256944 256735 256471 255824 253423 249245 245298 243243 242658 242465 242731 243868
51107 243868 245250 246087 246840 248240 249549 249375 247893 246639 246254 245895 244996 244150 243848 243485 242206 240080
51091B40080k081j211l24l67j481k536k399j615j649k490k637j629o84l06N27
51076B19198J916K155O36n52J89J219L80j213q43J496L257L190K411J853J216
51061B36508O37R94K092K513J901J568K178K578J743N13L42J250K057J958J061
51046B59893j92j407k252k521k186j326j57Q96J461J572J541J575J601J325M94
51031B60317o43j120j81J527K513K311J955K195K421J932J257J311K031K746L121
51016B83693L047K356J401J060J415J371M34k52L89J779K872L678M295L755J532
51001C12825q39j511q38l88l57K0L00o09k268l278l681m429m777k908O21K774
$$ plain form
51091 240080 237999 236788 236464 236097 234616 232080 229681 228066 226417 223927 221290 219661 218977 218671 219198
51076 219198 221114 223269 223905 223353 223542 224761 225141 223928 223085 224581 227838 231028 233439 235292 236508
51061 236508 237145 238139 240231 242744 244645 246213 248391 250969 252712 253225 253567 254817 256874 258832 259893
51046 259893 259701 258294 256042 253521 251335 250009 249852 250748 252209 253781 255322 256897 258498 259823 260317
51031 260317 259674 258554 258373 259900 262413 264724 266679 268874 271295 273227 274484 275795 277826 280572 283693
51016 283693 286740 289096 290497 291557 292972 294343 294777 294525 294914 296693 299565 303243 307538 311293 312825
51001 312825 311986 310475 309637 309249 308892 308912 309212 308603 306335 303057 299376 294947 290170 287262 287883 290657
$$ [...]
##END NTUPLES=NMR SPECTRUM
##END=
