
##TITLE=AC1158_Centauros_5875164_wDN7GagWWT
##JCAMPDX= 6.0         $$ Bruker NMR JCAMP-DX V2.0
##DATA TYPE= NMR SPECTRUM
##DATA CLASS= NTUPLES
##ORIGIN= BRUKER
##OWNER= Administrator
$$ 1.72 TOPSPIN		Version 2.1
$$ 2012-04-10 10:24:14.468 -0500  Administrator@TOPSPIN
$$ Compression mode = diff/dup
##.OBSERVE FREQUENCY= 400.13188235
##.OBSERVE NUCLEUS= ^1H
##.ACQUISITION MODE= SIMULTANEOUS (DQD)
##.ACQUISITION SCHEME= undefined
##.AVERAGES= 8
##.DIGITISER RES= 22
##SPECTROMETER/DATA SYSTEM= spect
##.PULSE SEQUENCE= zg30
##.SOLVENT NAME= COFFEE_meoh
##.SHIFT REFERENCE= INTERNAL, COFFEE_meoh, 1, 14.98061
##AUDIT TRAIL= $$ (NUMBER, WHEN, WHO, WHERE, PROCESS, VERSION, WHAT)
$$ ##TITLE= Audit trail, TOPSPIN		Version 2.1
$$ ##JCAMPDX= 5.01
$$ ##ORIGIN= Bruker BioSpin GmbH
$$ ##OWNER= Administrator
$$ $$ C:\Bruker\TOPSPIN/data/COFFEE/nmr/AC1158_Centauros_5875164_wDN7GagWWT/10/pdata/1/auditp.txt
$$ ##AUDIT TRAIL=  $$ (NUMBER, WHEN, WHO, WHERE, PROCESS, VERSION, WHAT)
(   1,<2012-04-01 00:46:34.437 -0500>,<Administrator>,<TOPSPIN>,<go>,<TOPSPIN 2.1>,
      <created by zg
	started at 2012-04-01 00:45:27.703 -0500,
	POWCHK enabled, PULCHK disabled,
       configuration hash MD5:
       1A 1E CE 29 27 FD 77 03 67 4E F0 E3 C4 B2 CB 90
       data hash MD5: 64K
       7F 53 07 25 FD 89 A7 DB E9 43 DF 2E 34 36 49 3E>)
(   2,<2012-04-01 00:46:38.421 -0500>,<Administrator>,<TOPSPIN>,<proc1d>,<TOPSPIN 2.1>,
      <Start of raw data processing
       efp LB = 0 FT_mod = 6 PKNL = 1 PHC0 = 0 PHC1 = 0 SI = 32K 
       data hash MD5: 32K
       FF D0 DB C0 06 CB 89 6D D5 8F 27 99 E6 C1 B5 03>)
(   3,<2012-04-01 00:46:38.781 -0500>,<Administrator>,<TOPSPIN>,<proc1d>,<TOPSPIN 2.1>,
      <pk PHC0 = 217.793 PHC1 = 0 
       data hash MD5: 32K
       D5 58 ED 00 2B D5 BA 50 73 6E 09 A2 60 97 0D 26>)
(   4,<2012-04-01 00:46:38.843 -0500>,<Administrator>,<TOPSPIN>,<proc1d>,<TOPSPIN 2.1>,
      <abs ABSG = 1 
       data hash MD5: 32K
       D4 8B 41 89 C3 4B 9A 8A BA 89 A4 30 8E 65 5F 50>)
(   5,<2012-04-01 00:46:38.875 -0500>,<Administrator>,<TOPSPIN>,<proc1d>,<TOPSPIN 2.1>,
      <abs ABSG = 2 
       data hash MD5: 32K
       C9 66 13 F3 40 E6 5A 55 D8 2A 3C 04 B1 4B AF 88>)
(   6,<2012-04-01 00:46:38.906 -0500>,<Administrator>,<TOPSPIN>,<proc1d>,<TOPSPIN 2.1>,
      <abs ABSG = 3 
       data hash MD5: 32K
       B2 F9 3E 7F 3F F4 EC 5C 3F 94 A1 FA 22 8C 76 2A>)
(   7,<2012-04-01 00:46:38.968 -0500>,<Administrator>,<TOPSPIN>,<proc1d>,<TOPSPIN 2.1>,
      <abs ABSG = 4 
       data hash MD5: 32K
       09 46 1C 6D B7 9C 5D B4 17 A0 B6 CD 12 53 BB 76>)
(   8,<2012-04-01 00:46:39.000 -0500>,<Administrator>,<TOPSPIN>,<proc1d>,<TOPSPIN 2.1>,
      <abs ABSG = 5 
       data hash MD5: 32K
       B9 FA 74 40 C6 AE E1 75 69 39 8E EF E0 8A 68 05>)
(   9,<2012-04-01 00:46:44.390 -0500>,<Administrator>,<TOPSPIN>,<audit>,<TOPSPIN 2.1>,
      <user comment:
       ICON-NMR User ID: COFFEE
       data hash MD5: 32K
       B9 FA 74 40 C6 AE E1 75 69 39 8E EF E0 8A 68 05>)
$$ ##END=
$$ [...]
##$TP= (0..7)
150 150 150 150 150 150 150 150
##$TP07= 0
##$TPNAME0= <>
##$TPNAME1= <>
##$TPNAME2= <>
##$TPNAME3= <>
##$TPNAME4= <>
##$TPNAME5= <>
##$TPNAME6= <>
##$TPNAME7= <>
##$TPOAL= (0..7)
0.5 0.5 0.5 0.5 0.5 0.5 0.5 0.5
##$TPOFFS= (0..7)
0 0 0 0 0 0 0 0
##$TUNHIN= 0
##$TUNHOUT= 0
##$TUNXOUT= 0
##$USERA1= <user>
##$USERA2= <user>
##$USERA3= <user>
##$USERA4= <user>
##$USERA5= <user>
##$V9= 5
##$VALIST= <valist>
##$VCLIST= <CCCCCCCCCCCCCCC>
##$VD= 0
##$VDLIST= <DDDDDDDDDDDDDDD>
##$VPLIST= <PPPPPPPPPPPPPPP>
##$VTLIST= <TTTTTTTTTTTTTTT>
##$WBST= 2048
##$WBSW= 25
##$XGAIN= (0..3)
0 0 0 0
##$XL= 0
##$YL= 0
##$YMAX_a= 533679
##$YMIN_a= -628376
##$ZGOPTNS= <>
##$ZL1= 120
##$ZL2= 120
##$ZL3= 120
##$ZL4= 120
##$ABSF1= 14.98061
##$ABSF2= -5.57192
##$ABSG= 5
##$ABSL= 3
##$ALPHA= 0
##$AQORDER= 0
##$ASSFAC= 0
##$ASSFACI= 0
##$ASSFACX= 0
##$ASSWID= 0
##$AUNMP= <proc_prof1d_extract_pilot.lims>
##$AXLEFT= 0
##$AXNAME= <>
##$AXNUC= <1H>
##$AXRIGHT= 0
##$AXTYPE= 0
##$AXUNIT= <>
##$AZFE= 0.1
##$AZFW= 0.1
##$BCFW= 0
##$BC_mod= 0
##$BYTORDP= 0
##$COROFFS= 0
##$CY= 15
##$DATMOD= 1
##$DC= 0
##$DFILT= <>
##$DTYPP= 0
##$F1P= 0
##$F2P= 0
##$FCOR= 0.5
##$FTSIZE= 32768
##$FT_mod= 6
##$GAMMA= 0
##$GB= 0
##$INTBC= 1
##$INTSCL= 1
##$ISEN= 128
##$LB= 0
##$LEV0= 0
##$LPBIN= 0
##$MAXI= 10000
##$MC2= 0
##$MEAN= 0
##$ME_mod= 0
##$MI= 0
##$NCOEF= 0
##$NC_proc= -8
##$NLEV= 6
##$NOISF1= 0
##$NOISF2= 0
##$NSP= 0
##$NTH_PI= 0
##$NZP= 0
##$OFFSET= 14.98061
##$PC= 1
##$PHC0= 217.793
##$PHC1= 0
##$PH_mod= 1
##$PKNL= yes
##$PPARMOD= 0
##$PPDIAG= 0
##$PPIPTYP= 0
##$PPMPNUM= 2147483647
##$PPRESOL= 1
##$PSCAL= 4
##$PSIGN= 0
##$PYNMP= <proc.py>
##$REVERSE= no
##$SF= 400.13
##$SI= 32768
##$SIGF1= 0
##$SIGF2= 0
##$SINO= 400
##$SIOLD= 32768
##$SPECTYP= <>
##$SREGLST= <1H.CDCl3>
##$SSB= 0
##$STSI= 32768
##$STSR= 0
##$SW_p= 8223.68421052632
##$SYMM= 0
##$S_DEV= 0
##$TDeff= 65536
##$TDoff= 0
##$TI= <>
##$TILT= no
##$TM1= 0
##$TM2= 0
##$TOPLEV= 0
##$USERP1= <user>
##$USERP2= <user>
##$USERP3= <user>
##$USERP4= <user>
##$USERP5= <user>
##$WDW= 1
##$XDIM= 32768
##$YMAX_p= 477345506
##$YMIN_p= -772295
##$CURPLOT= <Network HP LaserJet P1505>
##$CURPRIN= <$Network HP LaserJet P1505>
##$DFORMAT= <normdp>
##$LAYOUT= <+/1D_H.xwp>
##$LFORMAT= <normlp>
##$PFORMAT= <normpl>
##$SURQMSG= 1
$$ End of Bruker specific parameters
$$ ---------------------------------
##NTUPLES= NMR SPECTRUM
##VAR_NAME=  FREQUENCY,     SPECTRUM/REAL,   SPECTRUM/IMAG
##SYMBOL=    X,             R,               I
##VAR_TYPE=  INDEPENDENT,   DEPENDENT,       DEPENDENT
##VAR_FORM=  AFFN,          ASDF,            ASDF
##VAR_DIM=   32768,         32768,           32768
##UNITS=     HZ,            ARBITRARY UNITS, ARBITRARY UNITS
##FACTOR=    0.250966925370066, 1,           1
##FIRST=     8223.43324360095, -12948,       -212452
##LAST=      0,             41247,           -95022
##MIN=       0,             -772295,         0
##MAX=       8223.43324360095, 477345506,    0
$$ Real data points
##PAGE= N=1
##DATA TABLE= (X++(R..R)), XYDATA
$$ [...]
19480c05582a28380c1920C2659a11852A48364a79122a886o8903o323o1570I2229
19468B9286c48704A7720b11203O0813A20780i6065D8522L8501k7790I869K87776
19457B97645A45462b33233C06818B8261c706A04892d5932B63106C2360a25734
19446b64052i3369C63027a88616j96503P552b6399q4628j28944B58671m7490a50782
19434A94340B0563b4832G2013k9752b25645c334G2311P4033F2092a92361b8076
19422a31013f2939k90733a66213j2332c140B62278d9685a6288k2423m47065A489
19410a47317A45754a63897I1330b1331A6850a68694k691j69117a5683A42470a81192
19398a22626j55505g77l77671a69589p9624A0110J5872q21J56527a32197A2794
$$ y = [-305582, -128380, -31920, 32659, -111852, 148364, -179122, -1886, -70789, -77112, -138682, 92229, 29286, -348704, 17720, -211203, -150390, 120780, -96065, 48522, 87023, 59233, 9869, 297645, 145462, -233233, 306818, 28261, -3706, 104892, -45932, 263106, 32360, -125734, -264052, -93369, 363027, -188616, -385119, -377567, -26399, -111027, -239971, 258671, 211181, -150782, 194340, 20563, -24832, 72013, 42261, -225645, -3334, 72311, 146344, 62092, -192361, -28076, -131013, -62939, -353672, -166213, -178545, -3140, 262278, -49685, -16288, -38711, -485776, 1489, -147317, 145754, -163897, 91330, -21331, 16850, -168694, -171385, -340502, -15683, 142470, -181192, -122626, -278131, -777, -378448, -169589, -249213, 10110, 25982, 25161, 181688, -132197, 12794]
19386b69848O1091O9259f6073G514J4672b79992A9493C727e6834B6757d19044
19374b28458i5697a0217c146B40254B3410n924b44200I7571b0891J850l30605
19363c49646G8786a31848o8775m6317a18142J0344d7458l28384B842a23166P679
19352a15487A98905J18453A24156a58690A16169r99a82584f9409F4985k5102a09348
19340B13031q5489B1660a25746M3049j22703c0512o85G5919b03060A9133c23280
19328b879o5447r0317I9683l1062a57706M8083l45884A37744P7508c6656A68940
19316g5108k53184J5609a38202q2562j13053A06976a18209E4094L6966a82498
19305c53574K1275j11878h7580k29401A32382b09363d8088A68870i3257J1269
$$ y = [-269848, -208757, -139498, -66073, 7514, 22186, -279992, 19493, 3727, -56834, 26757, -419044, -228458, -95697, -10217, -3146, 240254, 23410, 17486, -244200, 97571, -20891, -19041, -349646, 78786, -131848, -200623, -246940, -118142, -107798, -47458, -375842, 2842, -123166, -115487, 198905, 317358, 124156, -158690, 116169, 115170, -182584, -69409, 64985, 39883, -109348, 213031, 127542, 21660, -125746, -82697, -205400, -30512, -31197, 75919, -203060, 19133, -323280, -2879, -68326, -158643, 99683, 68621, -157706, -109623, -455507, 137744, 215252, -36656, 168940, -75108, -328292, -312683, -138202, -220764, -333817, 106976, -118209, 54094, 91060, -182498, -353574, -332299, -444177, -87580, -316981, 132382, -209363, -48088, 168870, -93257, -81988]
19295h1988m5020A39887a46007K8329k71161A79356m456a73711N9519p8900j90137
19284c83229a79907j18876A80820n4035a58372l5510K472P630j04125c6844j22544
19273a59388D2086d9568k81109b8302j07876A23956g6247c7257B21893b75803
19262b92747a24550L4465M2047A64353L7761H2905j7164b6743q8863A65972b97264
19250A25904N3723d39622A45003g4485j4662m02596B03634D935a53661H6202P0858
19239A57060a75545P7307k0922o8081h1160k67502G790M6131J33752f0854j3086
19228g3940A03158l943L8842B9889k431e3375a3749l51537I0520c52541f3604
19216d2840r1282C6017a11001A86445a73068r120L8525e4216a2629E2713e695
$$ y = [-81988, -127008, 139887, -146007, -117678, -388839, 179356, 174900, -173711, -114192, -193092, -383229, -179907, -298783, 180820, 126785, -158372, -193882, -191410, -183780, -287905, -36844, -159388, 42086, -49568, -330677, -28302, -136178, 123956, -76247, -37257, 221893, -275803, -292747, -124550, -90085, -48038, 164353, 202114, 82905, 65741, -26743, -115606, 165972, -297264, 125904, 179627, -439622, 145003, -74485, -89147, -491743, 203634, 4935, -153661, 86202, 157060, -175545, -98238, -119160, -187241, -81160, -348662, 7790, 53921, 187673, -60854, -73940, 103158, 99215, 138057, 29889, 27458, -53375, -13749, -365286, 90520, -352541, -63604, -42840, -134122, 36017, -111001, 186445, -173068, -182188, -143663, -54216, -12629, 52713, -5695]
19204B05867b85790a19932J807G2140b51961k7148N6225A01379M4254J11689b66057
19192D4317f04j04471B6138K10189B4240l468c849A43194o3973e34342a90859
19180d709B38596a51578C9357b9207j60291A96599G895a24100A39649b63207A37303
19168C8179b53659F4839G516a5773A38479c7855j98241G1842c59798G8852I073
19156a49946p8482A38014c89495c5874C7857a25595c5557B06141a42640G6838
19145a06144B0241a9499r9465p2126k1401A0210J3799M2829a08198l39193b06188
19133b799k73836j77155B28966j5492i5463r7622C1794K16955a03664C40723j56881
19122A83842e2504j31182J5694A66091D4086L9607a09682A45806g2152B08354
$$ y = [205867, -285790, -119932, -118125, 72140, -251961, -279109, -222884, 101379, 145633, 257322, -266057, 44317, -604, -105075, 26138, 236327, 24240, 20772, -3849, 143194, 79221, -534342, -190859, -4709, 238596, -151578, 39357, -29207, -189498, 196599, 7895, -124100, 139649, -263207, 137303, 38179, -253659, 64839, 7516, -15773, 138479, -37855, -236096, 71842, -359798, 78852, 9073, -149946, -228428, 138014, -389495, -35874, 37857, -125595, -35557, 206141, -142640, 76838, -106144, 20241, -19499, -118964, -191090, -212491, 10210, 24009, 66838, -108198, -447391, -206188, -2799, -276635, -453790, 228966, 213474, -95463, -193085, 31794, 248749, -103664, 340723, 183842, -52504, -183686, -167992, 166091, 44086, 83693, -109682, 145806, -72152, 208354]
19111a06830c4758k29223E268b01655A6520a785A09395b32233B75225b22667i6475
19099i0966L1101A9715d4049j20579O4659B68349G9224M9254d2184a4109C5169
19087g4419j12639j28981d4383B37024b4655A50922K5568g6152L3578l64491J66771
19076b40294A13382a66436H521a36382K7971K088D6053a09803A95873p6110J64895
19065B84658d63809I2627b05375A11504J25206b02946A44259d61824a1417B82304
19054A26368c41500J46018p0175M3188m7033A83641b0765C49235a53577M9119
19044a04458j43851J03156C21198J70577g633o2220J5055j23947C7381b3746I561
19032a16893l3013A76448i6949j78779g1059D0753a64729M9570e2027A04301b64515
$$ y = [-106830, -34758, -263981, 5268, -201655, 16520, -1785, 109395, -232233, 275225, -222667, -96475, -90966, -59865, 19715, -44049, -164628, -99969, 268349, 79224, 128478, -42184, -14109, 35169, -74419, -187058, -316039, -44383, 237024, -24655, 150922, 176490, -76152, -42574, -407065, -240294, 113382, -166436, 8521, -136382, -108411, -106323, 46053, -109803, 195873, 119763, 284658, -463809, 92627, -205375, 111504, 236710, -202946, 144259, -461824, -11417, 282304, 126368, -341500, -195482, -265657, -222469, -269502, 183641, -20765, 349235, -153577, -104458, -248309, -145153, 321198, 491775, -7633, -69853, -54798, -178745, 37381, -23746, 9561, -116893, -149906, 176448, -96949, -275728, -71059, 40753, -164729, -115159, -52027, 104301, -264515]
19020a03556H5155a00132J9596G4416a5747A17601a36046c846r8914q182O501
19009a04441B69514h1806j53668F9398J58034I8733d9355j34275b3539a0793C6916
18997B52382e1836j03975k1390d1886A0697b91690b3724k72910E5276R2591a15242
18985b05217O1753N9838B25506A00383J78775C0424a70124O0414j96130e2745
18974d35372C7253J26535h1392L9219k71556B2253a57718d2390A18881f3914B10335
18962a80168A77602J1472P0859d4383D01148A12656K68720D9187c253F0000O1311
18951A21311Q5222b24182I3411J29812a04565B8641L9756R6549b22718h7913k04993
18940b92906j3152A26462a70766j14856B54450a32171A16807N7031d8700C5547
$$ y = [-103556, 85155, -100132, -80536, 74416, -15747, 117601, -136046, -3846, -102760, -110942, -104441, 269514, -81806, -235474, 69398, 227432, 98733, -49355, -183630, -23539, -10793, 36916, 252382, -51836, -155811, -177201, -41886, 10697, -291690, -23724, -296634, 55276, 147867, -115242, -205217, -143464, -83626, 225506, 100383, 279158, 30424, -170124, -109710, -305840, -52745, -435372, 37253, 163788, -81392, -42173, -313729, 22253, -157718, -42390, 118881, -63914, 210335, -180168, 177602, 189074, 259933, -44383, 401148, 112656, 381376, 49187, -3253, 60000, 121311, 206533, -224182, 93411, 223223, -104565, 28641, 68397, 164946, -222718, -87913, -292906, -306058, 126462, -170766, -285622, 254450, -132171, 116807, 173838, -48700, 35547]
18929H4911C6621c7290C89162a42518N1612c402l84766a8933B119M42962C1452
18917A81031J3790a21225B49087h1626q1880f4015A6789c20745O6167A29420G277
18905e1423p5245D8480J52876a05504A89903P4627I6267D7336J93981b64293g7597
18893D91311o8639j69779m6096M739o3414J52142h7843A10866n445a46455A56925
18881b69496b2957j59029L1074A554J09072c74159J50180B56764b3123A81038
18870a75460F7579C3633J09163a77755M6927j49587j2631e2892A03253c14397
18859b82838a11290k7492N4481c4473j48053F975a63246a6835m31455B28798b37069
18847a31640p3987A23352N9788A7763a39787j8893F5011d953l26335A94623a65159
$$ y = [84911, 36621, -37290, 389162, -142518, -90906, -3402, -388168, -18933, 2119, 445081, 31452, 181031, 194821, -121225, 249087, -81626, -163506, -64015, 16789, -320745, -254578, 129420, 7277, -51423, -126668, 48480, 201356, -105504, 189903, 264530, 96267, 47336, 241317, -264293, -77597, 491311, 422672, 252893, 206797, 211536, 148122, 300264, -87843, 110866, 105421, -146455, 156925, -269496, -22957, -181986, -150912, 1554, 110626, -374159, -223979, 256764, -23123, 181038, -175460, 67579, 33633, 142796, -177755, -130828, -280415, -293046, -52892, 103253, -314397, -282838, -111290, -138782, -84301, -34473, -182526, 6975, -163246, -16835, -448290, 228798, -237069, -131640, -205627, 123352, 183140, 17763, -139787, -158680, 65011, -4953, -331288, 194623, -165159]
18835a3909A40260l394a46750A3883a67995g4517A38295l2874b26127j42092C26120
18823a32020J4537A06402a43310A41042g3197p990k04439a09013l9277P1706a7580
18811a22947C58870A01339c2796j83705e2796C860a3313o4360j01337P0171B70654
18799D4848a51798O0560B9849R7584P3692K79525C6098J06073f0030j03575G3602
18787A95493c56507J56545a3240k63636P7797A85050b27006h8998A37321e9038
18776b88458C67658b6981A21466a00394A7263b6879J1688D6540a42781A6292J01468
18765A17760a06524F8399K63729D1456b60947A4881i4740E7086l184a79891e2771
18753I8238b76925a14140q4416G6651M0146m3411b93310Q8147H0686b3066k28174
$$ y = [-13909, 140260, 136866, -146750, 13883, -167995, -74517, 138295, 105421, -226127, -368219, 326120, -132020, -117483, 106402, -143310, 141042, -73197, -81187, -285626, -109013, -148290, -76584, -17580, -122947, 358870, 101339, -32796, -216501, -52796, 3860, -13313, -77673, -179010, -108839, 270654, 44848, -151798, -91238, 29849, 127433, 201125, 480650, 36098, 142171, -60030, -163605, 73602, 195493, -356507, -199962, -13240, -276876, -199079, 185050, -227006, -88998, 137321, -59038, -288458, 367658, -26981, 121466, -100394, 17263, -26879, -15191, 46540, -142781, 16292, 117760, -106524, 68399, 332128, 41456, -260947, 14881, -94740, 57086, 53902, -179891, -52771, 98238, -276925, -114140, -198556, 76651, 116797, 73386, -293310, -205163, 80686, -23066, -251240]
18742b51240b3136C98801b48724j16114D5515O7638a4076m8990B06243a28243
18731c99403H9236g3404E69329a0426k05214g8808m43228A19903a52442P0433
18721h2009A3804K0106J5468c5266j08231M7240G8424c1813j24688K8373a6861
18709a56164A30426a3325E9434g3547a0187j91233P8199A42487m605d343q7720
18698i2063E8939i3138j08800d2318J0882A98084J00877a95843f689p6795B91642
18686D39528c52231a73002F193b87754A96981A3414c01854K5992I5436b07420
18675c21095a34146E3888j2002L3631M664a02593J9607G7116a29738g460A74600
18663f5291B38101r1830F418i9873k15721A74503l1203h5724D2763a30342j08782
$$ y = [-251240, -23136, 398801, -248724, -364838, 45515, 113153, -14076, -63066, 206243, -128243, -399403, 89236, -73404, 569329, -10426, -215640, -78808, -522036, 119903, -152442, -82009, 13804, 33910, 49378, -35266, -143497, -96257, 78424, -31813, -156501, -128128, -16861, -156164, 130426, -13325, 59434, -73547, -10187, -201420, -123221, 142487, 137882, -4343, -92063, 58939, -93138, -201938, -42318, -31436, 198084, 298961, -195843, -6689, -83484, 291642, 439528, -352231, -173002, 6193, -287754, 196981, 13414, -301854, -275862, 95436, -207420, -321095, -134146, 53888, 41886, 75517, 80181, -102593, -82986, 77116, -129738, -7460, 174600, -65291, 238101, 146271, 6418, -99873, -315594, 174503, 143300, -85724, 42763, -130342, -239124]
18652b39124j2442o1743O9096A63018b51806A10241e9549A10001b14817F8443
18641a22795D0768e3446B33597b42959O7786c0411D2089b23881C14607B8563b63405
18629E3183d2833k32544f3879C71756c29496A6206B723O3673G261b24592Q8921
18618a35671O5477B104a26023B17971a47327E7412J5095b54531O6687j6350N9913
18607a44281j16480E3108f25932A20403f2693A74350d4615c644A48962a01640
18596A84075a44700m3068E3138B2498K94037c5053j33339P4728j60856J04223
18586a50297j06225P1370j1753c8476l55435A20040K6439J31458q7232I0678d4313
18574b56292L5146F7399b03964g7515B03020p0642J9328a25157j41939J18408
$$ y = [-239124, -251566, -313309, -244213, 163018, -251806, 110241, -59549, 110001, -214817, 68443, -122795, 40768, -53446, 233597, -242959, -175173, -30411, 42089, -223881, 314607, 28563, -263405, 53183, -42833, -275377, -63879, 371756, -329496, 16206, 2723, 66396, 7261, -224592, -135671, -70194, 2104, -126023, 217971, -147327, 57412, 72507, -254531, -187844, -204194, -144281, -260761, 53108, -625932, 120403, -62693, 174350, -44615, -3644, 148962, -101640, 184075, -144700, -187768, 53138, 22498, 316535, -35053, -168392, -93664, -254520, -150297, -256522, -185152, -196905, -38476, -393911, 120040, 146479, 277937, 190705, 90678, -44313, -256292, -221146, 67399, -203964, -77515, 203020, 132378, 151706, -125157, -267096, -148688]
18564a48688A97483b63267D19398F0996e7202H4560h790j15775N9759n3372L4164
18553h4014l11532a5265j27480E9076b5764H4K32018b10544I269J0170d1148j40047
18541a81195B8409g629A43957E7670R3911F4248a54570G3736a67500P8209j25565
18530b14856g1801j15910G812c47628C7587P7475d50864a37198e8854k7409l93289
18519d79552a93411G5522c12270Q7853F9138a35288l21970J44618M4882c4932
18508A14808B3950K0265b09577E0386e8082j22165A11047g7210G940b34197i8906
18496A51400a86099E0524R8413K9876c4182j7772n1634j91588D15156E0892B2641
18484B62406k6019c22163D95702A8772a92933N0104I3283b72228f2943i661B89743
$$ y = [-148688, 197483, -263267, 419398, 60996, -57202, 84560, -8790, -124565, -64806, -118178, -84014, -395546, -15265, -142745, 59076, -25764, 84, 232102, -210544, 9269, 19439, -41148, -181195, 28409, -7629, 143957, 57670, 151581, 64248, -154570, 73736, -167500, -89291, -214856, -71801, -187711, 7812, -347628, 37587, 115062, -450864, -137198, -58854, -86263, -479552, -193411, 75522, -312270, -224417, 69138, -135288, -457258, -312640, -267758, -34932, 114808, 23950, 44215, -209577, 50386, -58082, -180247, 111047, -77210, 7940, -234197, -98906, 151400, -186099, 50524, 148937, 178813, -34182, -51954, -103588, -295176, 415156, 50892, 22641, 262406, 236387, -322163, 495702, 18772, -192933, -142829, 93283, -272228, -62943, -9661, 289743]
18472c0844B5679b8644A59219a43104A01605b95878A39469b5419l06441B3877
18461C0861L7494N2256D1116a02533j71382B54501J0431b25973A21743N0201e0236
18449b94644c8921j57268C85930a51237D5025e4250h553B76898G9786Q6446b51891
18437B8967a33962N1273l04400a41799j47244L6646M9342a3859B06855j03331
18427A03524b45740J12228C9241c8374j15884I5596C2138L6987h4150n1151o0408
18416a95709g0975B24111c6894o9869E71054f177F720g4911C9391Q9420J59504
18405B88315j22284b41599J9006B14059K48368a42017D5652a78820Q6552j9030
18395a11298q495N279L9105B0013b26990G0330a8114B74299a35104F9631J06810
$$ y = [-30844, 25679, -28644, 159219, -143104, 101605, -295878, 139469, -25419, -331860, 23877, 30861, 68355, 120611, 41116, -102533, -273915, 254501, 264932, -225973, 121743, 171944, -50236, -294644, -38921, -196189, 385930, -151237, 45025, -54250, -8553, 276898, 79786, 166232, -251891, 28967, -133962, -82689, -387089, -141799, -289043, -252397, -203055, -13859, 206855, 103524, -245740, -133512, 39241, -38374, -154258, 95596, 32138, 69125, -84150, -135301, -195709, -70975, 224111, -36894, -106763, 571054, -6177, 6720, -74911, 39391, 128811, 288315, 166031, -241599, -222593, 214059, 462427, -142017, 45652, -178820, -92268, -111298, -119793, -114514, -75409, 20013, -226990, 70330, -18114, 274299, -135104, 69631, 176441]
18384A76441q6021a63918F9291g7375F097c48567H0282C6612N1344b51476B29279
18372a54388j20720L7987N9413m1288B3644e0533I0114a71925C6411e5560p1365
18361a26925d8768o7516J420D1415b52486a19731R135l7075b2884j45098A53498
18349e9511A21399O9609b88253K5776A29054J31275b2439B43815m8585R1754A25872
18337b2217j18372C612i3092j32838K9095B12480n7174D1473K2373b95552A21331
18325I3287h8516B27784b45472M3240j17656A56198n2006a01702k47376Q7990
18315b61088e6322j18028M8027C73587A45588c85766B5962a66473l4710K810e6797
18303h6136j10648K398f2448G4347a41756d3684j17167J7603L7932j25543H2436
$$ y = [176441, 90420, -163918, 69291, -77375, 6097, -348567, 80282, 36612, 87956, -251476, 229279, -154388, -275108, -237121, -177708, -218996, 23644, -50533, 90114, -171925, 36411, -55560, -126925, -48768, -116284, -114864, 41415, -252486, -119731, -110596, -147671, -22884, -167982, 153498, -59511, 121399, 191008, -288253, -262477, 129054, 260329, -22439, 243815, 195230, 286984, 125872, -22217, -140589, 3612, -93092, -225930, -196835, 212480, 155306, 41473, 63846, -295552, 121331, 93287, -88516, 227784, -245472, -202232, -319888, 156198, 104192, -101702, -349078, -261088, -56322, -174350, -126323, 373587, 145588, -385766, 25962, -166473, -201183, -198373, -56797, -86136, -196784, -194386, -62448, 74347, -141756, -43684, -160851, -143248, -105316, -230859, 82436]
18291B26103c7982k60576B79649R1964A5651J5613f602k21046F9802a31387I4531
18279g8175k96896H8047a51070G7012k8037c22085B3121d891j53249A8174f0075
18267e9049r0267e6115K2544c594A16557h0334p5939K0044c4477r8172d9631a1474
18254a42509j58718K5341A30532a73710O4576A64675d105B92251q9750r9712j3585
18243H9204b01434N1559m2432E3129j2387K72020A53621J55416a13093O515C18890
18231B20377P4618d1671l60213g5558a3688o7240B1076c02157F0782r830j3481
18220C7471c36403a01406e0342A67565b0496k66806A30276Q7118b51616j18491
18210c70107C68523g6447G9289J46504c2019A44771c4331l5580p7502p3752P2372
$$ y = [226103, -37982, -298558, 279649, 371613, 15651, 31264, -6602, -227648, 69802, -131387, 94531, -78175, -375071, 88047, -151070, 77012, 48975, -322085, 23121, -4891, -158140, 18174, -60075, -59049, -149316, -56115, -33571, -3594, 116557, -80334, -156273, -136229, -34477, -132649, -49631, -11474, -142509, -301227, -275886, 130532, -173710, -109134, 164675, -4105, 292251, 202501, 102789, 89204, -201434, -149875, -192307, 53129, 40742, 312762, 153621, 309037, -113093, -106578, 318890, 220377, 294995, -41671, -401884, -75558, -13688, -80928, 21076, -302157, 60782, 50952, 37471, -336403, -101406, -50342, 167565, -20496, -287302, 130276, 217394, -251616, -370107, 368523, -76447, 79289, 225793, -32019, 144771, -34331, -69911, -147413, -221165, -148793]
18199a48793j98181J69919F8132a48206q0982A88283q1220a6472C0722h2649o4887
18188a47536C17639d3317p3598q2288j45806c8556k44153F2055c34436R5555C04911
18176B21213l4219j6220f3452H1970A091b23617D8882a1779k04821Q7724A78661
18164A7310c7790j4104j71742A30836a80611j7902A63912b5612C38460h9942A25254
18152A6966h363j99749B3469a27246G2480d56581A76140a06387r2523P9095F0814
18140a79208Q2288k6959A2178f4527l1757r6776A76454a73813a6327A79939J03533
18129B83472c8981d164E2418N4145m5621L09367b60226A71009A3016c34941E6388
18117A46559g9623l57339C69112c19179B734a20187A73655C9090a33950a8855
$$ y = [-148793, -346974, -177055, 68132, -148206, -229188, 188283, 107063, -16472, 30722, -82649, -147536, 317639, -43317, -116915, -199203, -345009, -38556, -282709, 62055, -334436, -238881, 304911, 221213, 186994, 170774, -63452, 81970, 1091, -223617, 48882, -11779, -216600, -128876, 178661, 17310, -37790, -51894, -223636, 130836, -180611, -198513, 163912, -25612, 338460, -89942, 125254, 16966, -8363, -208112, 23469, -127246, 72480, -456581, 176140, -106387, -198910, -119815, 60814, -179208, -96920, -123879, 12178, -64527, -96284, -193060, 176454, -173813, -16327, 179939, 283472, -38981, -4164, 52418, 106563, 60942, 370309, -260226, 171009, 13016, -334941, 56388, 146559, -79623, -436962, 369112, -319179, 2734, -120187, 173655, 39090, -133950, -18855]
18106a65036p9050b0142j07349r5478a03044j14801e7950B202R5157f3343A56753
18094b89744A07690a08843q5739E9754b8746I8151b79895F950K13655J70421F6306
18082b7925N605l24779c5331I8170i948r364L386k7151l8732k3617m12721I6467
18069D6232M6765K55336g5193C5846A5821b69570C17568o2791c1045D47072B04825
18057A1760h5929D57377B0260Q707d0538B43683A8450J40555B4453b7678B03920
18045a00150j01369A60231E6465J31490g4755L5226F6545b25815h264l18822a44084
18033a90934g4579o4304b7488k67704B40062P494a80924a3696k8645B38952j15560
18022A23392L0060e5429m3837I6534L45869j63929A5505a16018A25053m7158b8980
$$ y = [-165036, -244086, -20142, -127491, -222969, -103044, -217845, -57950, 2202, 97359, -63343, 156753, -289744, 107690, -108843, -194582, 59754, -28746, 98151, -279895, 6950, 220605, 391026, 66306, -27925, -22320, -347099, -35331, 98170, -9948, -19312, -15926, -43077, -81809, -105426, -518147, 96467, 46232, 92997, 348333, -75193, 35846, 15821, -269570, 317568, 254777, -31045, 447072, 204825, 11760, -85929, 457377, 20260, 28967, -40538, 243683, 18450, 159005, 24453, -27678, 203920, -100150, -201519, 160231, 56465, 187955, -74755, -39529, 66545, -225815, -8264, -327086, -144084, -190934, -74579, -138883, -27488, -295192, 240062, 247556, -180924, -13696, -42341, 238952, 123392, 153452, -55429, -99266, 96534, 442403, 278474, 15505, -116018, 125053, 77895, -28980]
18010b87209P8128H3120j3503l2975K49499l1490a06698L0088J0787A22638a45457
17998F5449k0885a8923o3673A55273i8119c2827r5738R060A85804d88037A17828
17986a12171M9432A85664K19087A132b38745G5561h8020p6867C04122G9617a26394
17974B14808A7193f9504n6907B08308L6464I0594E884B586d8381r6802I5681K87779
17962C83460Q3837b71846K2651D6557Q6420D2112J02941e1878k5077B0138J16036
17951A36174K8094c740B40926H284J77944b09323J6381q7229A82999L1183I9141
17939B91914D7262N252h6329E2600a51353F166a91231D30819C9564a40851B3052
17927A45416l1999f7915B9980b40116A0283b17591c136B72448f2323C20890A12218
$$ y = [-287209, -209081, 83120, 69617, 36642, 286141, 254651, -106698, -76610, -65823, 122638, -145457, 65449, 44564, -18923, -82596, 155273, -98119, -32827, -128565, -119505, 185804, -488037, 117828, -112171, -62739, 185664, 404751, 1132, -238745, 75561, -88020, -164887, 304122, 79617, -126394, 214808, 17193, -69504, -126411, 208308, 244772, 90594, 5884, 2586, -48381, -145183, 95681, 383460, 467297, -271846, -249195, 46557, 132977, 42112, 145053, -51878, -76955, 20138, 136174, 164268, -3740, 240926, 8284, 186228, -209323, -192942, -280171, 182999, 214182, 99141, 291914, 47262, 52514, -86329, 52600, -151353, 6166, -191231, 430819, 39564, -140851, 23052, 145416, 113417, -67915, 29980, -240116, 10283, -217591, -3136, 272448, -62323, 320890, 112218]
17915a00048B2092P9956e8961J1465D2898h9901C0376M38558A98649E1177L66140
17904D17317c56778D00584A26844J7718h544G076M51376a38928A94651g4593J9151
17893e5442F7681a43583j1096B5017J6207b18190A01428K34964D3012a97203b5175
17881a5611B2515k769O0851a07053j18756i1822G6257j8097a86936A24268c26361
17869g3836q781K0653H6864a93312A58837G0629b7429m5220E389b6673j50823
17858a77496j34269C24201j15638E9072d6726o4854A59714m7962J71660p7924
17848B05488a43950D8841a48708C3657f0846A57123b7298r7687Q575N1860j83582
17837b48132b5094A67311c5701A2454Q4194h5900R344D2929J76969c0659A26355
$$ y = [-100048, 22092, 102048, -58961, -47496, 42898, -89901, 30376, 468934, 198649, 51177, 417317, -356778, 400584, 126844, 144562, -8544, 7076, 458452, -138928, 194651, -74593, -55442, 67681, -143583, -154679, 25017, 41224, -218190, 101428, 336392, 43012, -197203, -25175, -15611, 22515, 19746, 80597, -107053, -225809, -91822, 76257, 58160, -186936, 124268, -326361, -73836, -82617, -61964, 86864, -193312, 158837, 70629, -27429, -72649, 5389, -26673, -177496, -311765, 324201, 208563, 59072, -46726, -111580, 159714, 111752, 283412, 205488, -143950, 48841, -148708, 33657, -60846, 157123, -27298, -124985, -116410, -64550, -248132, -25094, 167311, -35701, 12454, 96648, -85900, -76556, 42929, 219898, -30659, 126355]
17825B1204a4548n1944A30014a44127P0998j21902C99664b50567E17742A45470
17814A4815M6985L772M7446a37609D6874b70807J23896K6322l2134C27948a73915
17802c8754C91226b65724H2744a76284H5222k1760B4880b63910e1617B79877F4793
17790B20001a43327k1940g3878G9476d8755A16144C8298a8348B05361I8528B7147
17778A14045J5644C2978L00968f9607o5748L5436E1423a19336H8007a28203B45152
17766c47774B43147A19758O5930F4243P8339J25302h8678A04434A0569a40513
17755B96363A18788a24961J9434a4259A29068l1529J88915o9054O5842a70372
17744C22790F6753K57075a77041M2607A17050J0345M6315b27526C3257K90756
$$ y = [21204, -14548, -66492, 130014, -144127, -73129, -195031, 399664, -250567, 517742, 145470, 14815, 61800, 65572, 113018, -137609, 46874, -270807, -146911, -120589, -152723, 327948, -173915, -38754, 391226, -265724, 82744, -176284, 85222, 63462, 24880, -263910, -51617, 279877, 64793, 220001, -143327, -165267, -73878, 79476, -48755, 116144, 38298, -18348, 205361, 98528, 27147, 114045, 129689, 32978, 333946, -69607, -135355, -99919, 51423, -119336, 88007, -128203, 245152, -347774, 243147, 119758, 185688, 64243, 142582, 267884, -88678, 104434, 10569, -140513, 296363, 118788, -124961, -105527, -14259, 129068, 97539, 286454, 217400, 283242, -170372, 322790, 66753, 323828, -177041, -134434, 117050, 127395, 173710, -227526, 33257, 324013]
17734C24013a33191i583q9319C9884i2227b4792A5757J56005J82517A69056q0727
17723H8329C9392b11830A45043b5128G2272a15334M5058m4438C74247j44971A1578
17711B40089m2104e062E10874I82Q2095b5626B39535i1220J7321c3171B14802
17699f3395I7766N0095b2088F0344J68223A6877J38135L3479C1578J56251F9533
17687B8620K17140E1225b11433J5698A23783E4668J33488a4528A28077D852a24495
17675B6485K89593i4484e864o5088I380J0316K78862p2639O2455b11705A69060
17663a48319A0533K77484A01982g1408n5710k2922A67057L05230f7040B05508
17652A52007L3220J839k0016G7554J62180B111M19651H5843K984a53765A59939
$$ y = [324013, -133191, -9583, -98902, 39884, -92227, -24792, 15757, 171762, 354279, 169056, 88329, 39392, -211830, 145043, -25128, 72272, -115334, -70276, -114714, 374247, 229276, 11578, 240089, 197985, -5062, 510874, 982, 83077, -25626, 239535, -91220, -73899, -33171, 214802, -63395, 97766, 147861, -22088, 60344, 228567, 16877, 155012, 188491, 31578, 187829, 69533, 28620, 245760, 51225, -211433, -195735, 123783, 54668, 188156, -14528, 128077, 4852, -124495, 26485, 316078, -94484, -5864, -70952, 9380, 19696, 298558, 225919, 288374, -211705, 169060, -148319, 10533, 288017, 101982, -71408, -127118, -150040, 167057, 472287, -67040, 205508, 152007, 185227, 187066, 167050, 77554, 239734, 2111, 421762, 85843, 88827, -153765, 159939]
17640E7294a21750A30383n838a949j33418C37022a32687e6450j56264d7526A89111
17628a9093A54813a54727B55473q7652F7885c06318b1860B51135O2046F2028a46720
17616G9103a27539H6198O6471R8987J28376D3830P273K27672e3857B51528q6806
17605A64722J11239A27520c593B69333n7319J87588A03943b1663A98301m1818
17595A56483J8519q4377K64539b78015i9162A87080N6985F3093L60903A48222
17584a33064H2200J83775m1556p1448J13498A08963R0267H8370a1651C951d3954
17572C32972k2708J67131h8565C58541j43734I4471b08772b0125D56457j27509
17562C28948j57543c8327A03566d9431A60080D3368L5322K94314A53226L01398
$$ y = [57294, -121750, 130383, 124545, -1949, -135367, 337022, -132687, -56450, -212714, -47526, 189111, -19093, 154813, -154727, 255473, 167821, 67885, -306318, -21860, 251135, 313181, 62028, -146720, 79103, -127539, 86198, 152669, 251656, 380032, 43830, 51103, 278775, -53857, 251528, 164722, 275961, 127520, -3593, 269333, 212014, 399602, 103943, -21663, 198301, 156483, 175002, 90625, 355164, -278015, -99162, 187080, 244065, 63093, 423996, 148222, -133064, 82200, 265975, 224419, 152971, 266469, 108963, 199230, 88370, -11651, 3951, -43954, 332972, 310264, 477395, -88565, 358541, 214807, 94471, -208772, -20125, 456457, 328948, 171405, -38327, 103566, -49431, 160080, 43368, 78690, 373004, 153226, 454624]
17552D54624E3889J78491h4413B56843A20078M5423P0405n2118q04G5097L14810
17541C89907A43047g5341C69685j63430L85899G356K38418J21390L27534B44449
17530D04005c5123C57127A33266J85417R4902A06419K42106P5606A30718j28B6903
17518B18913E3559L89134q6201q5326L7077r0805L32174L13408n5551K90167k21426
17507H76210J73638l25009j56993J85430n2322j96387B28780l6796L89193K52079
17497H33256C97130K23298K06393k86147O28803n20675J30470J70536m43666J01187
17487F07329P198B62998A13043M13969D5343K55244I6278J25183N5422j00937
17477A75946J54054k5291c0179D31377A04211M9151K7232F6578e7616A7492L49790
$$ y = [454624, 53889, 232380, -84413, 256843, 120078, 165501, 235906, 183788, 182984, 75097, 389907, 143047, -75341, 369685, 206255, 592154, 7356, 245774, 367164, 694698, 244449, 404005, -35123, 357127, 133266, 318683, 413585, 106419, 348525, 424131, 130718, 130590, 26903, 218913, 53559, 442693, 356492, 271166, 308243, 217438, 549612, 863020, 807469, 1097636, 876210, 1049848, 724839, 567846, 753276, 700954, 504567, 228780, 191984, 581177, 833256, 397130, 620428, 826821, 540674, 1169477, 648802, 779272, 949808, 506142, 607329, 614527, 262998, 113043, 527012, 45343, 300587, 96278, 221461, 276883, 175946, 330000, 304709, -30179, 431377, 104211, 153362, 180594, 66578, -57616, 17492, 367282]
17466C67282j01939l9913a83814A79986m4933J6645a57592C74778j49453A00033
17455B60614O9892j64688d2972F7310M32616P65k49382D8379J58366J81670I2145
17443B64676o3964C6214P2269L11983B5578M11851J45218B47677j0037K28128
17433D65768k13663l7632L70992A90745L9451K50748E5479J12962P5233L79552
17423F23226C1094K5036b4963B54836j16401K60203j85350e9919A43448L97235
17413E40683q8443A2609L85534N2732A62268L75694n7174A72601K92852G7932
17402g7890D99488k13048J8945n3665L63841A21429J03080j4939o5261K9298C2409
17390A71170M9919n5088c0097G2674J2705J47656C7442L22265o2816b881G6552
$$ y = [367282, 265343, 225430, -183814, 179986, 135053, 151698, -157592, 374778, 225325, 100033, 260614, 330506, 165818, -42972, 67310, 499926, 500691, 251309, 48379, 206745, 388415, 92145, 264676, 200712, 36214, 108483, 420466, 25578, 437429, 582647, 247677, 237640, 465768, 252105, 214473, 585465, 190745, 230196, 480944, 55479, 168441, 243674, 623226, 31094, 56130, -24963, 254836, 138435, 398638, 213288, -59919, 143448, 540683, 452240, 12609, 398143, 450875, 162268, 537962, 480788, 172601, 465453, 77932, -77890, 499488, 286440, 305385, 251720, 615561, 121429, 224509, 209570, 144309, 173607, 32409, 171170, 221089, 166001, -30097, 72674, 85379, 233035, 37442, 359707, 296891, -2881, 76552]
17378A2685M02688B05344p4030a03169C95736A13660j2219L82785j08081H7341
17367B80543k1359E5253N4365L85420n6220A61517K52939o5525J20145r4229A78179
17355B96408L22150g4846E81328A92112J04990B1659J6508L4318L48406n6052
17345C64839j49835M03828A28373j971O8654Q4789Q7172A14604M17025A08850
17334F96715k52992G1673K02839L63984L7963l02850H8246J32592J86554P2936
17324D80328J82545k92559A63904K28095C525M01187A64831n2024L48779k26503
17314B35083R1920p2833M6528J65744j94070K7504A15602K07884A27331J2313
17304A39644j87J77077j19111k1234g517D63580f1930I8271L16212J94824k08545
$$ y = [12685, 415373, 205344, 131314, -103169, 395736, 113660, 101441, 484226, 376145, 87341, 280543, 259184, 55253, 109618, 495038, 438818, 161517, 414456, 348931, 469076, 374847, 178179, 296408, 618558, -74846, 581328, 192112, 297102, 21659, 38167, 72485, 420891, 364839, 215004, 618832, 128373, 126402, 195056, 279845, 367017, 114604, 531629, 108850, 696715, 443723, 71673, 274512, 638496, 676459, 373609, 88246, 220838, 407392, 480328, 662873, 370314, 163904, 391999, 3525, 404712, 164831, 112807, 461586, 235083, 327003, 254170, 300698, 466442, 272372, 299876, 115602, 323486, 127331, 139644, 139457, 316534, 197423, 176189, -7517, 463580, -61930, 98271, 414483, 609307, 400762]
17293D00762O0634A04436K71028j07607n2648m1814k648m5139L68101j42151p7853
17282B73705n1766n0135L06703j10246J14401n4911l1224m6363k1607q5693M3758
17271B86622N7031J27991d0774B73040k0507k4770L15409G9628L343M18436B32973
17259C18004K63422j35198a20721A88532L13860j00972j24426a02641B8121M37579
17249D65700q7479j00222L7805j20219K63703a1587B96449A11114K49072A08722
17238D51310A81579M21393k38227j8903L46603l40954P468j15111M2226J38831
17228D24905J13470B10168L997K66199o6938j95026j2728K39441j89077J19483
17218C75519I9644M5626J29681L7699n1778J118J27541R6674j05762A04138L15128
$$ y = [400762, 461396, 104436, 375464, 267857, 215209, 173395, 170747, 125608, 493709, 351558, 273705, 221939, 171804, 478507, 368261, 482662, 427751, 396527, 350164, 328557, 242864, 286622, 343653, 471644, -40774, 273040, 252533, 227763, 543172, 79628, 82971, 501407, 232973, 318004, 581426, 446228, -120721, 188532, 502392, 401420, 276994, -102641, 28121, 465700, 378221, 277999, 315804, 195585, 459288, -11587, 296449, 111114, 360186, 108722, 451310, 181579, 602972, 364745, 345842, 692445, 351491, 358959, 243848, 286074, 424905, 538375, 210168, 214165, 480364, 413426, 218400, 205672, 445113, 256036, 375519, 99644, 145270, 274951, 312650, 260872, 261990, 389531, 486205, 380443, 104138, 419266]
17207D19266K3629p5592o7840q079q2133J17434K04175j2098B4963J98019K66349
17196D89331j55977R1940p0584E2946L85960J19468G2047J70042q0730R5332J44732
17185D01423J70475A04704M59221R952j98819o78j61653J95594K15150k70777
17175C52694l0863K96768m46H3460K9769K05104M19719j61165L5892A59414M10085
17164E69499j69351M51184j78309J4229l03820J56509K05255C20973j7915K41039
17154E44097j14914Q2859J35941B08864N14703k72593K41512k56814J33874O332
17144E75878q0807k8575P8970j68466k3257R1833J42922r5440J2980k00754K59638
17133E64922j82695L9154j09786J299J43609J79198j22636j39825J43096j34695
$$ y = [419266, 442895, 367303, 299463, 291384, 209251, 326685, 530860, 518762, 24963, 222982, 489331, 333354, 425294, 354710, 52946, 438906, 558374, 72047, 242089, 161359, 256691, 401423, 571898, 104704, 563925, 573877, 375058, 374380, 212727, 408321, 623471, 352694, 321831, 618599, 618153, 83460, 113229, 318333, 738052, 576887, 612779, 159414, 569499, 400148, 851332, 673023, 687252, 383432, 539941, 745196, 320973, 303058, 544097, 429183, 512042, 647983, 208864, 723567, 450974, 692486, 435672, 569546, 575878, 495071, 466496, 545466, 377000, 353743, 445576, 588498, 493058, 506038, 305284, 564922, 382227, 421381, 311595, 312894, 456503, 635701, 513065, 373240, 516336, 381641]
17123C81641o6273j4004K10199r5819J06921j09709J15115q7334J56775B75958
17112C57783N4569L57528o2823k60931J77221j49427K00301n2920J99580k7229
17102G93652A82172K69118K30097j91038M8618P8288c4278D08532J615n7061M49725
17091H02811L1615l34358l5690L04331J40035m09383J8699J36014j35936J81156
17081F99294n8778k9030P532l01757L70631j85766k22L24732l98349J08031p0813
17070D65505K12967j16552j66153K83238J54298m05710M36602j63107L59848m85434
17060E75502K26200l62200K19172K38019m6210r2466m0228k39026Q6434Q0045
17050F45242J39023j30506n3018J249K58422m429k86943L01189l6148K07627k55221
$$ y = [381641, 315368, 301364, 511563, 415744, 522665, 412956, 528071, 440737, 597512, 275958, 357783, 412352, 769880, 707057, 446126, 623347, 473920, 674221, 621301, 820881, 793652, 182172, 451290, 681387, 490349, 538967, 617255, -34278, 408532, 410147, 353086, 802811, 834426, 500068, 464378, 768709, 908744, 499361, 518060, 654074, 518138, 699294, 640516, 611486, 619018, 317261, 687892, 502126, 501904, 826636, 428287, 536318, 465505, 678472, 561920, 395767, 679005, 833303, 427593, 864195, 701088, 1060936, 575502, 801702, 439502, 658674, 896693, 850483, 758017, 717789, 478763, 565197, 645242, 784265, 653759, 600741, 601990, 860412, 855983, 569040, 870229, 834081, 1041708, 786487]
17039G86487K23334m86078L75306k2386n5j69009P3188k900J8990Q1953R8265
17028I77095l63610L05594j35075L6609m7915Q1101p1955L40642m75063J75591
17018H23014j33236J80934O618j88401L85142j53492K67873j1442E75269L44737
17008I20006L4395j05232J67897q1500N5698j47735K60809k4295l07300K47283
16998A020026M70303o24815K6713M57697j19127k94328J36072l62163J02471K79449
16988A092298M33502l36864j57642Q772K21523j3226j89892r7454j96831K94248
16978A058434r7943L45717j39681K70454j82291j7895k24742L47706k11056l914
16968A144789J9588L00751J0424j43870K5234J76262k66894O5591j4219K10961
$$ y = [786487, 1009821, 523743, 899049, 876663, 876608, 707599, 780787, 777887, 796877, 878830, 977095, 613485, 919079, 784004, 820613, 772698, 853799, 781844, 1122486, 647423, 823014, 689778, 870712, 877330, 688929, 1074071, 920579, 1188452, 1177010, 575269, 920006, 954401, 849169, 1017066, 935566, 991264, 843529, 1104338, 1080043, 772743, 1020026, 1490329, 865514, 892227, 1349924, 1230797, 936469, 1072541, 710378, 812849, 1092298, 1525800, 1188936, 1031294, 1040066, 1261589, 1248363, 1058471, 961017, 764186, 1058434, 960491, 1306208, 1166527, 1436981, 1254690, 1236795, 1012053, 1359759, 1148703, 1144789, 1164377, 1465128, 1475552, 1331682, 1356916, 1533178, 1266284, 1331875, 1317656, 1528617]
16958A528617K7276m10004L35393l40579L28077J1061k79479J95402O650K4744
16948A427158J22210o6104k3008k0322J61797j75419J80136L8937l32664L11464
16938A624185K72963j98111k9173J44989r8861k8844J24023O5179j47578k31341
16928A497431M56583k20008K5550j80498K49296L57943j38024k9920l04328L92806
16918B106831k39050K75830j27344J0686j6325L9790K25265j04382J68053k56121
16908B083233J33561J2604j14027M7550Q5359J719l84818K22949l43430N35212
16898B279912j14131K59273J8806P2946p6298L6962j80642K71121J17994P980
16888B693923j85074j82908L77066j32831L8830K08091j76669L13407m58734M37314
$$ y = [1528617, 1555893, 1145889, 1481282, 1140703, 1468780, 1479841, 1200362, 1395764, 1402414, 1427158, 1549368, 1483264, 1460256, 1439934, 1601731, 1426312, 1606448, 1645385, 1312721, 1624185, 1897148, 1699037, 1669864, 1814853, 1715992, 1687148, 1811171, 1876350, 1728772, 1497431, 1954014, 1734006, 1759556, 1579058, 1828354, 2186297, 2048273, 2018353, 1714025, 2106831, 1867781, 2143611, 2016267, 2026953, 2010628, 2050418, 2275683, 2171301, 2339354, 2083233, 2216794, 2229398, 2115371, 2162921, 2248280, 2249999, 1865181, 2088130, 1744700, 2279912, 2165781, 2425054, 2443860, 2516806, 2440508, 2477470, 2296828, 2567949, 2685943, 2693923, 2508849, 2325941, 2703007, 2570176, 2609006, 2817097, 2640428, 2953835, 2495101, 2932415]
16878B932415k10560M10839l77324j0020N30202m32004L29861J98927k36368l84515
16868B751453P21455j83380K10737k22981K17648J6655j33950M3251o7983K4262
16858C377167K67323O7047l45850N60304j19648Q026P9074l23988K90855O3260
16848C923570J41642Q3551q1180K14454M2161R4917K12044k86807L76643j17712
16838D603283K08517j64545L97166P9357l145J60652j44037J21595k42908K60828
16828E276763P6980L20333J78013j45395L70973k40770J35009M60084l32966L70487
16818F469511K89052k9996K39531m05634J26542K40330M03816p1730j9843L70466
16808G612045k40260N16281k1635O4244L63887K07508J7721K76962P5723P985
$$ y = [2932415, 2721855, 3132694, 2755370, 2745350, 3275552, 2843548, 3173409, 3372336, 3135968, 2751453, 3472908, 3289528, 3500265, 3277284, 3494932, 3511587, 3377637, 3420888, 3352905, 3377167, 3644490, 3711537, 3365687, 3925991, 3806343, 3814369, 3893443, 3569455, 3860310, 3923570, 4065212, 4148763, 4067583, 4282037, 4324198, 4419115, 4631159, 4344352, 4720995, 4603283, 4811800, 4647255, 5044421, 5123778, 5120633, 5281285, 5137248, 5258843, 5015935, 5276763, 5353743, 5674076, 5852089, 5706694, 6077667, 5836897, 5971906, 6431990, 6099024, 6469511, 6758563, 6728567, 6968098, 6562464, 6689006, 6929336, 7333152, 7261422, 7241579, 7612045, 7371785, 7888066, 7866431, 7930675, 8294562, 8502070, 8519791, 8796753, 8872476, 8880461]
16798H880461M45535L75251O5077K97764M87031j157P4682J58688J69733K71507
16788A1224572L72849K97716K17363J87294k42662J010914j17645L14605M19280
16779A3684286L64231K55291M19854K76284O85051L08576O31792N13616J09443
16770A7248424N40393O35964M78316N45363P26469J65401R02954K31444R28961
16761B2403689K37089J063289R03105L54549J341091L68427R18736Q51228J287519
16752B9728722N89233J295276Q50266R44849J503351J352543P57996J748006J350165
16743D0120407J070333J899837J907538J412196J840650J997304J967619J790912
16735E4006796K461991K538755K163092K380944K412631K870124K675804K604905
$$ y = [8880461, 9325996, 9701247, 9766324, 10064088, 10551119, 10549962, 10624644, 10783332, 10953065, 11224572, 11597421, 11895137, 12112500, 12299794, 12057132, 13068046, 12950401, 13265006, 13684286, 14048517, 14303808, 14723662, 14999946, 15684997, 15993573, 16625365, 17138981, 17248424, 17788817, 18424781, 18903097, 19448460, 20174929, 20340330, 21243284, 21474728, 22403689, 22640778, 23704067, 24607172, 24961721, 26302812, 26671239, 27589975, 28441203, 29728722, 30317955, 31613231, 32463497, 33408346, 34911697, 36264240, 37022236, 38770242, 40120407, 41190740, 43090577, 44998115, 46410311, 48250961, 50248265, 52215884, 54006796, 56468787, 59007542, 61170634, 63551578, 65964209, 68834333, 71510137, 74115042]
16727G4115042L349585K865204L245849L160997L391488L408862L483280L594241
16719A00614548L205063L641444L230799L629311L324171K912125L103394K650141
16711A26310996K182601K175616K094610J355219J220698R84923J38225L55270
16703A36818158r37197q91158j350753j683136k024845k271852k550131k693471
16695A22415615l131375l260845l159701m158282k945876l476079l271018l838834
16687I5173605l406926l555929k937805l847982l148826k985774l069983k825946
16679F9394434k732365k856458k165301k873905k371583k208092j982472j824877
16671E0379381k069959k205919j717207j358380j695061j340454j940084j228321
$$ y = [74115042, 77464627, 80329831, 83575680, 86736677, 90128165, 93537027, 97020307, 100614548, 103819611, 107461055, 110691854, 114321165, 117645336, 120557461, 123660855, 126310996, 128493597, 130669213, 132763823, 134119042, 135339740, 136324663, 136462888, 136818158, 135880961, 134989803, 133639050, 131955914, 129931069, 127659217, 125109086, 122415615, 119284240, 116023395, 112863694, 108705412, 105759536, 102283457, 99012439, 95173605, 91766679, 88210750, 85272945, 81424963, 78276137, 75290363, 72220380, 69394434, 66662069, 63805611, 61640310, 58766405, 56394822, 54186730, 52204258, 50379381, 48309422, 46103503, 44386296, 43027916, 41332855, 39992401, 38052317, 36823996]
16663C6823996j370549j068382j563108p10385j358151q12143j240367q01292
16655B7899619r19473q03176j082726q05590n06742j047405n80826o48154p60185
16646B0745342o55046m51305o07586o62914k37893o16772m00752k55620n40670
16637A6316784m48921m67518m80186j37506n74250n41350j14647n82749l64972
16628A2604685O809k53303m43021O4962q81883n8834j07184l07600k31652k18570
16618A0174409p4700k94909M1769m44084l53864j30259l55904K80260n34908j48739
16608H159071j11572n9676p2209p6423k96917L5135o04901K95081k23428j07915
16598F936246m27878K63285k93501J11489k42941k22370k70704K95080n22473
$$ y = [36823996, 35453447, 34385065, 32821957, 32111572, 30753421, 29941278, 28700911, 27899619, 26980146, 26176970, 25094244, 24288654, 23781912, 22734507, 22153681, 21505527, 20745342, 20090296, 19638991, 19031405, 18368491, 18130598, 17513826, 17113074, 16857454, 16316784, 15867863, 15400345, 14920159, 14782653, 14208403, 13667053, 13552406, 12969657, 12604685, 12611494, 12358191, 11915170, 11980132, 11098249, 11039415, 10932231, 10624631, 10392979, 10174409, 10099709, 9804800, 9846569, 9402485, 9048621, 8918362, 8562458, 8842718, 8307810, 8159071, 8047499, 7987823, 7915614, 7839191, 7542274, 7577409, 6972508, 7267589, 7044161, 6936246, 6508368, 6771653, 6478152, 6589641, 6346700, 6124330, 5853626, 6148706, 5626233]
16589E626233J36209K73159l94663k68541j52864j54569j53422P5716r3359J27571
16579E021470j92664k32499O07617o29503J27132J10478m79165j15214q2534n6919
16569D078199J82213l08547J27990k56179K51719m0825k75961O9022k36416J57225
16559C748440k53803q7529K28184M8968m00366n664L612N6664k14658P7865J8729
16548C220442j03858K6451j43614K25412m18198K2866J46922j66022J37041n76559
16538B370883K31478J57868K10707q3412N5526l60860j28862M69795m49042J68723
16528B642804m39370L66284J05844j73895Q1165q6483j76437j45147L47030k63617
16518B258178J43697j65413j10144q7915n4403K03576L2749m9261j95053R205
$$ y = [5626233, 5762442, 6035601, 5640938, 5372397, 5219533, 5064964, 4911542, 4987258, 4893899, 5021470, 4828806, 4596307, 5203924, 4574421, 4701553, 4812031, 4332866, 4217652, 4135118, 4078199, 4260412, 3951865, 4079855, 3823676, 4075395, 4034570, 3758609, 3827631, 3591215, 3748440, 3494637, 3407108, 3635292, 3684260, 3283894, 3278230, 3281842, 3338506, 3123848, 3201713, 3220442, 3116584, 3143035, 2999421, 3224833, 2806635, 2829501, 2976423, 2810401, 2947442, 2370883, 2602361, 2760229, 2970936, 2887524, 2943050, 2582190, 2453328, 2923123, 2474081, 2642804, 2203434, 2569718, 2675562, 2501667, 2582832, 2496349, 2319912, 2174765, 2521795, 2258178, 2401875, 2236462, 2126318, 2038403, 1984000, 2187576, 2220325, 2171064, 1976011, 1985216]
16508A985216n3023k06173N92661n87566L73917p0512j12134L51808m91920o4884
16498A717390M4511m7069K22794r27j16708j09267R1317p9787P4195k41804O9086
16487A623731J96178j94023O7429j11770l40486M81846l72736K25112k45797J76415
16477A505899k06309L11101j23536q4278n88931O69515j06694j94201K97051j82708
16467A296909P9205j30399M20518k34422J12061m09954M25477l60534k29346J53815
16457A123330J49180l9669k11168M91086k38048j03066M27343o7142O0631m93164
16447A099313K73580K5862J3210r6787l15390j8514l05799L95309j94679L30659
16437A206764K55473o10014M26613n66121M10415Q6165l0082r8340m02966O07698
$$ y = [1985216, 1932193, 1726020, 2318681, 1731115, 2105032, 2034520, 1922386, 2274194, 1782274, 1717390, 1761901, 1714832, 1937626, 1936699, 1819991, 1710724, 1802041, 1722254, 1796449, 1554645, 1623731, 1819909, 1625886, 1693315, 1581545, 1241059, 1722905, 1350169, 1575281, 1329484, 1505899, 1299590, 1610691, 1487155, 1402877, 813946, 1483461, 1376767, 1182566, 1479617, 1296909, 1376114, 1245715, 1666233, 1431811, 1543872, 1133918, 1559395, 1198861, 969515, 1123330, 1272510, 1232841, 1021673, 1512759, 1274711, 1171645, 1598988, 1531846, 1592477, 1099313, 1372893, 1398755, 1411965, 1315178, 999788, 981274, 675475, 1070784, 876105, 1206764, 1462237, 852223, 1278836, 712715, 1123130, 1209295, 1179213, 1080873, 677907, 1285605]
16427A285605J29395m11477K5398j03746J20367J5286J36237k511m79649L6766
16417G51671J92651Q5259l335l73962K29876k7532J11432M6740j8669K9050j33734
16406H89447p7583o7612K1106K60367E05132M03109J60625k67447J23324j29732
16396G95011N6436R6617k11963j96945p2360Q8334M57059l25242j8996J07541
16386G75492J53625j77557J34129l18198J27813L9520j94328L74241q4806C72219
16375G44233J31771q0721j18963J61181k52349l5391L49602r2061j15796j65140
16365E26366R1371C07888M42935l5813k12381K56738P04B87202O83067l83100
16355E87169L74410j72743n8105j51490p8028J35875J64182Q3736o3793k13038
$$ y = [1285605, 1415000, 1003523, 1028921, 925175, 1045542, 1060828, 1197065, 1194554, 714905, 751671, 944322, 1029581, 1026246, 652284, 882160, 854628, 966060, 1012800, 994131, 1023181, 889447, 811864, 744252, 765358, 1025725, 505132, 908241, 1068866, 801419, 924743, 795011, 851447, 948064, 736101, 539156, 466796, 555130, 1012189, 686947, 667951, 775492, 929117, 751560, 885689, 567491, 695304, 734824, 540496, 914737, 829931, 372219, 744233, 876004, 795283, 676320, 837501, 585152, 549761, 899363, 807302, 691506, 526366, 617737, 307888, 750823, 715010, 502629, 759367, 760071, 287202, 970269, 587169, 961579, 788836, 730731, 579241, 501213, 637088, 801270, 885006, 821213, 608175]
16345F08175J80553J96398m23130L1428n7367m9038R3500j63260J57606J49853
16335G24718l1177J2442k17173P78L14660q7554k26841L09840J47935m40798J97516
16324G04346N6997l38251r1354L33152k77653J48424j21835J72059j03576J83906
16314F66215o4708M9501k72237j83512K42055q3693j4859J35771J52955r3440
16304E34048m0623j7037k0292j55244J47703L84298C99008L94747k99305j10793
16294C83657j05220J44874m9198J57502q3465J12200j49040N3849j6649j18308
16284C30202J63452k23940M45670N4913C69762j08534N4938K82553j08748B28612
16273A82311n1629M14905K5373B75931J14280j23380K59785B51179n3356a9734
$$ y = [608175, 788728, 985126, 561996, 593424, 536057, 487019, 580519, 417259, 574865, 724718, 693541, 705983, 488810, 489588, 804248, 716694, 489853, 799693, 947628, 506830, 704346, 761343, 423092, 331738, 664890, 387237, 535661, 413826, 585885, 482309, 666215, 601507, 651008, 378771, 195259, 437314, 353621, 338762, 474533, 627488, 534048, 493425, 476388, 456096, 300852, 448555, 832853, 399008, 793755, 494450, 383657, 278437, 423311, 374113, 531615, 448150, 560350, 411310, 465159, 448510, 330202, 493654, 269714, 715384, 770297, 369762, 261228, 316166, 598719, 489971, 228612, 182311, 130682, 545587, 570960, 275931, 390211, 266831, 526616, 251179, 197823, -19734]
16262B73259J13813J24055j36433J76194P9810k22664J76247k50036m8232J12417
16252C98430A67072Q4777M06132k25270m3881j49621J32443J75524k45638R458
16242C10996j2229j03682M70790k82717R1177j14609p4578M1053j06557N5523
16232B75167J87068L4026o3608k14580L5064m2635K18036A66186L7919L08944
16222E13049k53437m3334n6289J26161m518q2915P2120J96409g0255E0847M29988
16211D80835J9411A01930K4004k4801J21627J27128J38012B27089J3967l1800
16201B09256J15281j54560A8359K53771Q9907A37329J41372D4902e5532C86477
16190E69572B02225K31203j42447P1639K36664b0184C0735g1382D22342L5798
$$ y = [273259, 387072, 511127, 374694, 550888, 630698, 408034, 584281, 334245, 286013, 398430, 167072, 251849, 657981, 432711, 388830, 239209, 371652, 547176, 301538, 310996, 298767, 195085, 665875, 383158, 474335, 359726, 285148, 326201, 219644, 275167, 462235, 496261, 432653, 218073, 253137, 210502, 428538, 166186, 204105, 513049, 259612, 216278, 159989, 286150, 281632, 198717, 270837, 467246, -70255, 50847, 480835, 500246, 101930, 125934, 101133, 222760, 349888, 487900, 227089, 241056, 209256, 324537, 169977, 18359, 272130, 362037, 137329, 278701, 44902, -55532, 386477, 569572, 202225, 433428, 290981, 362620, 599284, -20184, 30735, -71382, 422342, 458140]
16180D58140k25001J52384j00932J70214C4952M41508Q8526A80730c595E15555
16169D13275Q3651g3590B6959K26856l2817K02377A7956J05708Q0957K19318A52152
16157A44870k497A7900L1387J23838J40992J13102n0980e259A46324N4476b8281
16145B57343J05865C9755M31877A58522a16244B89952K40791p7166A45441a65458
16134A82605n6587M49006j35763j02087A41137M966k7439J89141L7585j64775
16124A80615J88321A62280p8581K09268K0816g585C21927H5044K48520E2067J33739
16113A85806f3092A75159G8509c4013B46968A19856K03186C4154K90841E6810
16102a41038f3824B34059K35438D170N1392K3060J32928a83785g9920A1864N4780
$$ y = [458140, 233139, 385523, 284591, 454805, 34952, 476460, 564986, 180730, -3595, 515555, 413275, 496926, -73590, 26959, 253815, 220998, 423375, 17956, 123664, 204621, 423939, 152152, 144870, 142373, 17900, 49287, 173125, 314117, 427219, 376239, -5259, 146324, 200800, -28281, 257343, 363208, 39755, 471632, 158522, -116244, 289952, 530743, 453577, 145441, -165458, 182605, 126018, 575024, 439261, 337174, 141137, 146103, 118664, 307805, 345390, 180615, 368936, 162280, 83699, 292967, 313783, -7585, 321927, 85044, 333564, 52067, 185806, -63092, 175159, 78509, -34013, 246968, 119856, 323042, 34154, 324995, 56810, -141038, -63824, 234059, 469497, 4170, 55562, 78622, 211550, -183785, -79920, 11864, 66644]
16091F6644b4191F7370K57462J83898a72392r8366g3673B05488P2928o7378A9176
16079d9843A8238h1827D9855P5021b00132A248J66291B2651e7333B9439J0452
16068C9891J92524a05458B68291c42792A61175d577G9646J0980e5084A85480C6762
16056C1613P3765M5413e69A19169E8984A268a03127K679A57722K69736a77689
16044A9990a74990A97727G849O7433f7564k4003E4335L56577A55382B2914Q6601
16033A09515J50571b6060E29588f419r6953E0170J14685B2780e9168A61524J55092
16022C16616A42585J4214P463R1255a95253i0696A2465J19673D0673M2222A0504
16010A42468j3948d21656B25016P3807k3304A2045N7436E191L36544B944K59557
$$ y = [66644, -24191, 67370, 324832, 508730, -172392, -270758, -73673, 205488, 278416, 211038, 19176, -49843, 18238, -81827, 49855, 124876, -200132, 1248, 167539, 22651, -57333, 29439, 39891, 232415, -105458, 268291, -342792, 161175, -4577, 79646, 90626, -55084, 185480, 36762, 31613, 105378, 150791, -569, 119169, 58984, 1268, -103127, -100448, 157722, 427458, -177689, 19990, -174990, 197727, 7849, 75282, -67564, -91567, 54335, 410912, 155382, 22914, 109515, 260086, -26060, 529588, -6419, -103372, 50170, 164855, 22780, -59168, 161524, 316616, 142585, 156799, 164262, 255517, -195253, -90696, 12465, 132138, 40673, 82895, 10504, 142468, 128520, -421656, 225016, 298823, 275519, 12045, 69481, 5191, 341735, 2944, 262501]
15999B62501G664Q1470a0973j3302A2395i8619A08421J53240e8306E67410E4268
15987A2376L57559a32564B35648D1954a522G4693a29155a1997j57057B34770a8687
15975f335l7497D43850J2166p29J24302K51613L3566M8792P1431m73794j40384
15964C70813e5108C08611E3134J07772h580A40976a16523e4039j43999R3675B52008
15952e7466A11906a20547C69023D1617K12142b68124A21308r814a37326B33136
15941C58257E0822N8633m9842a7816A7003i4936K8121j54961B90683j30876B461
15929C5860K541K07657b07403A54813l4524C6210i5445d4405A35882a35458p052
15918a42510F0954K3517L03487a39417h32B41941f3503C63112B1540K75102a8295
$$ y = [262501, 7664, 89134, -10973, -24275, 12395, -98619, 108421, 261661, -58306, 567410, 54268, 12376, 369935, -132564, 235648, 41954, -1522, 74693, -129155, -11997, -169054, 234770, -18687, -6335, -43832, 443850, 456016, 455287, 579589, 831202, 864768, 913560, 984991, 511197, 370813, -55108, 308611, 53134, 160906, -8580, 140976, -116523, -54039, -198038, -104363, 252008, -57466, 111906, -120547, 369023, 41617, 253759, -268124, 121308, 111494, -137326, 233136, 358257, 50822, 109455, 59613, -17816, 17003, -94936, -66815, -221776, 290683, 159807, 2461, 35860, 38401, 246058, -207403, 154813, 120289, 36210, -95445, -44405, 135882, -135458, -142510, 60954, 84471, 387958, -139417, -832, 241941, -63503, 363112, 21540, 296642, -18295]
15906f2910l0586L6242q149j998a14k06402E7104N2147O5471M2261G3279K1585
15894I4864e5824h450j96224B80593a3231C33917A13494J26626m5211a65937F3012
15882d4774l3881A78572L87b99910k1973a08906o3115P1386j96541J37135D4266
15870a81646d9715j48324L9382C3899c32699d062f57H1365b4742k8231l2215m5446
15858a30634A95611c67590i7936m45646H2607J81888H778J11296g3018j50277
15848b23295A4268g3602K9842k71324A43508j4300J15950b609H4921e484G8944
15836A42867b03453c7828A19951a01016o308l2521j09788Q9845A36931a06013
15825B806a2034C5863a58299K0208A34071b52916l8776a24636q570k5843L694
$$ y = [-62910, -93496, -57254, -65403, -67401, -114, -206516, 57104, 109251, 174722, 216983, 73279, 94864, -55824, -8450, -204674, 280593, -13231, 333917, 113494, 240120, 194909, -165937, 63012, -44774, -78655, 178572, 178959, -299910, -321883, -108906, -172021, -100635, -297176, -160041, 44266, -181646, -49715, -198039, -158657, 33899, -332699, -4062, -657, 81365, -24742, -52973, -85188, -130634, 195611, -367590, -97936, -543582, 82607, 264495, 8778, 120074, -73018, -223295, 14268, -73602, -43760, -315084, 143508, 129208, 245158, -2609, 84921, -5484, 78944, 142867, -203453, -37828, 119951, -101016, -107324, -139845, -249633, -159788, 136931, -106013, 2806, -12034, 35863, -158299, -138091, 134071, -252916, -291692, -124636, -133206, -159049, -155355]
15814a55355A11378H155M3050M5095Q7170o4783J08400A0008d19104a28199B25234
15802a21941m6437e1241B33333n0926G1853l575O786a0344B62509A06063f6990
15790A42238N6872G6697c28018J48390f6756k15139E6058J64305F6277d17701
15779b55523C60591g4231j48541A25610K9670a78659j1596A91530b058l2661B9631
15767a28844L2058g280B19450C1199b19461I2434D582e0224B98905E8606d88l2605
15755c3093b487j46366r3285F3968A6083J20329f100A29196b91936A25619B508
15743A2864K51342a12545G4436Q2090K8117E2308e4907B60913a00597p1871B62042
15731D100f0196C69034c18863B18714c3706j47822k5216f8019B54440j12319b72531
$$ y = [-155355, 111378, 8155, 51205, 96300, 183470, 118687, 227087, 10008, -419104, -128199, 225234, -121941, -168378, -51241, 233333, 182407, 71853, 68278, 75064, -10344, 262509, 106063, -66990, 142238, 199110, 76697, -328018, -179628, -66756, -281895, 56058, 220363, 66277, -417701, -255523, 360591, -74231, -222772, 125610, 155280, -178659, -190255, 191530, -2058, -34719, 29631, -128844, -96786, -7280, 219450, 31199, -219461, 92434, 4582, -50224, 298905, 58606, -488, -33093, -2487, -148853, -242138, 63968, 16083, 136412, -6100, 129196, -291936, 125619, 2508, 12864, 264206, -112545, 74436, 156526, 184643, 52308, -54907, 260913, -100597, -172468, 262042, 4100, -60196, 369034, -318863, 218714, -33706, -181528, -206744, -68019, 254440, 142121, -272531]
15719E2499J32373c8738B28698a51141A10772a56881j0257A83229o6558J598a33050
15707B86122D9621B890f6390k3832l17702a63041k475B8002n385M0658G79a1576
15694G0210g7573a3933I2106a24516B47876h2392o9541H3487h1491m6177a4445
15682A08153k3344a50204K790A52500g0390A51293P8649r5446b5111A28920K46160
15671C75080a93204A78305p1879b49477Q9535E4345a72488P1501K8635I1312J68402
15660B59714b67677L3115A78650A4820J56523E7628f9343D6320J5633N3642i9224
15648c0761k3624B82681b28062P6228e4851J2328A68342b94569A53272a73382
15637a01043J2617q2790k16095a44833M9994a5485A20721K57914B7583a85965
$$ y = [52499, 184872, -38738, 228698, -151141, 110772, -156881, -167138, 183229, 116671, 118269, -133050, 286122, 49621, 2890, -66390, -90222, -407924, -163041, -165516, 28002, 22617, 63275, 779, -11576, 70210, -77573, -13933, 92106, -124516, 247876, -82392, -151933, 83487, -81491, -127668, -14445, 108153, 84809, -150204, -147414, 152500, -70390, 151293, 229942, 134496, -25111, 128920, 375080, -193204, 178305, 106426, -249477, -159942, 54345, -172488, -100987, -72352, 91312, 259714, -267677, -234562, 178650, 14820, 171343, 57628, -69343, 46320, 61953, 115595, -99224, -30761, -54385, 282681, -228062, -151834, -54851, -42523, 168342, -294569, 153272, -173382, -101043, -88426, -171216, -387311, -144833, -94839, -15485, 120721, 378635, 27583, -185965]
15626a30894B84109l3824g0151B01017b7856k11103C6843b85882a6021n4099k23299
15615b93419a27322n4317k2725C3694b50347p603J21078l7202g699a794n7661
15604e9455j56852h2741q8254m5047A27948F1560d15548E9261B2879L46914a56007
15592H1787d28065C800K77606j30466d1092j14773N9577q3132B2492J21826a67976
15580b35408h2828c2962B52875q3351c53008J9579g8137o2153N3316I47L2306
15569C3253K66336O4145a20468q8579B71297A5472a02363A08309J42085c74618
15558b73175B03560i6823j23643J9908O5043A56389h1374M0161E5870M0229N0393
15547A46492d64435c2858A33612a26513l9714g7407j71651b5858j94708I2053
$$ y = [-130894, 284109, 250285, -70151, 201017, -27856, -238959, 36843, -285882, -16021, -70120, -293419, -127322, -181639, -204364, 33694, -250347, -257950, -136872, -174074, -7699, -1794, -59455, -216307, -82741, -170995, -216042, 127948, 61560, -415548, 59261, 22879, 369793, -156007, 81787, -428065, 3800, 281406, 150940, -41092, -155865, -96288, -179420, 22492, 144318, -167976, -235408, -82828, -32962, 252875, 169524, -353008, -333429, -78137, -140290, -86974, 947, 33253, 299589, 363734, -120468, -209047, 271297, 15472, -102363, 108309, 250394, -374618, -273175, 203560, -96823, -220466, -200558, -135515, 156389, -81374, -41213, 55870, 96099, 146492, -464435, -32858, 133612, -126513, -166227, -77407, -249058, -25858, -220566, 92053]
15536e1877B19592e5302A51814f0545j01397o1287h2936B06657D1327b1424A45492
15524i3087K6216K0335G976J62305J64011A3213a23005C63553d8165A3314P2290
15513H5604J34212J73973A0014Q9675P8653B9590P0883K6470c6844k3626F5820
15501C49821A60772F0895J98000I3744M9661e853l1929E1109g2822d346j76851
15490a81197A30553K40755a9588B21729L35228A11203J62898r2295a57428B60422
15479A76761F1570P4353R3193j4969c8358A92079a81045l4856A6613J7813L11537
15468C45963a49320C23472C6729A8181L32954j02663K27966B7929L17576l9503
15458C06002K03582n5121O1499A35680L5236L491G8903Q4552A5013b2756j28898
$$ y = [-51877, 219592, -55302, 151814, -60545, -161942, -223229, -82936, 206657, 41327, -21424, 145492, -93087, -66871, -46536, 7976, 170281, 334292, 13213, -123005, 363553, -48165, 13314, 85604, 219816, 393789, 10014, 99689, 178342, 29590, 100473, 126943, -36844, -60470, 65820, 349821, 160772, 60895, 258895, 93744, 143405, -5853, -37782, 51109, -72822, -4346, -181197, 130553, 371308, -19588, 221729, 556957, 111203, 274101, 181806, -157428, 260422, 176761, 61570, 135923, 229116, 214147, -38358, 192079, -181045, -215901, 16613, 34426, 345963, -149320, 323472, 36729, 18181, 351135, 248472, 476438, 27929, 345505, 306002, 509584, 454463, 515962, 135680, 170916, 174407, 78903, 163455, 15013, -22756, -151654]
15447a51654p9148a12874l73974H9245f6412C66105a0826k05653D8491c4779J1062
15436b3717r5953B65288a19253j69192E0609O8027P3980R1852M91030B19991L95318
15425F15309N79407j51375r3400C35031J43146A55358N4022J4480j6390b23759
15414A10570b14864I1412c34697P8094a09272B61106A3708c6330k83487N5099
15404b64718j3921D39395j42947b43m26282a03041A53414b91187f7872A41773
15393B10288i7431k25737c4440C39666a7153A35259B8155J81804d1432j14348
15383a55780A21650B1596P39d929j60036F5111r614a55380E2150K43279A05409
15371B76269a07345B28812j00624K3138B2639c02700D5170a16146A29115b98510
$$ y = [-151654, -230802, -112874, -486848, 89245, -66412, 366105, -10826, -216479, 48491, -34779, -23717, -119670, 265288, -119253, -288445, 50609, 118636, 192616, 284468, 775498, 219991, 615309, 1194716, 1043341, 949941, 335031, 478177, 155358, 209380, 223860, 207470, -223759, 110570, -214864, 91412, -334697, -256603, -109272, 261106, 13708, -36330, -319817, -264718, -278639, 439395, 296448, -243, -426525, -103041, 153414, -291187, -67872, 141773, 210288, -97431, -323168, -34440, 339666, -17153, 135259, 28155, 209959, -41432, -155780, 121650, 21596, 22335, -4929, -164965, 65111, 55497, -155380, 52150, 295429, 105409, 276269, -107345, 228812, 128188, 151326, 22639, -302700, 45170, -116146, 129115, -298510]
15360f4464B62775J74265b8074l3358H0820K32958D014J69173b9277E3225j2447
15349D0778a24245B20022j05276l7294M4020K31112j67527m9551K89394G3350
15338a51584I0159K01883f715F6123J0553l4143A0156M49889A87182K00199A68229
15326C74414K74424B29141a98010C29568H502K86518a99175O2247d9979B94818
15315A05245i6066D6637k1851L29233D5883j1223J56975p8549L20694A72747b13110
15303h3812C05737n8922K322m0196b29076A93736J03J98833A21644a51681A71542
15291A12578K44528k2292c8833A78056L6487a42826A93060j0632K23398e3147
15280F8237J5927C0108K6231b31602A06684a04193j6647C05595j47205C5020a72829
$$ y = [-64464, 262775, 437040, -28074, -61432, 80820, 313778, 4014, 173187, -29277, 53225, 40778, -124245, 220022, 114746, 77452, 121472, 352584, 185057, 135506, 424900, 73350, -151584, 90159, 292042, -6715, 66123, 76676, 42533, 10156, 460045, 187182, 387381, 168229, 374414, 648838, 229141, -198010, 329568, 8502, 295020, -199175, -136928, -49979, 294818, 105245, -96066, 46637, 24786, 354019, 45883, 34660, 191635, 113086, 433780, 172747, -213110, -83812, 305737, 246815, 249137, 208941, -229076, 193736, 193839, 392672, 121644, -151681, 171542, 112578, 357106, 334814, -38833, 178056, 214543, -142826, 193060, 182428, 405826, -53147, 68237, 84164, 30108, 56339, -231602, 106684, -104193, -120840, 305595, 158390, 35020, -172829]
15268H5178j8485c35916C28060E9859l537b58884i0968K3358A60851a54158C44913
15256f2728A30491h179H1780E222M2184K42229g7646C60104b7596B7192a26613
15244A23892A5172b89111G4613J13447a28640G7177P8932f0943a3061C47187j18117
15233B29070J14608A49825k539R4819M57522N96475J42369k80525M06109G51101
15222D47389E230L01972C707b70105C25636j52677J25689L7377A44112P7104m7798
15211A73418L9523m7207a3124A1381M75864k08416M7728q0866a80058E04359A81723
15199A21170h1504c6511D4512P1233J3662B6776J79172b45704B64647l9922i2726
15187C60367A12505b27884A60546a16591K1457A03456M1325j1324k3515h1098
$$ y = [85178, 66693, -335916, 328060, 59859, 56322, -258884, -90968, -67610, 160851, -154158, 344913, -62728, 130491, -8179, 81780, 5222, 47406, 289635, -77646, 360104, -27596, 27192, -126613, 123892, 15172, -289111, 74613, 188060, -128640, 77177, 156109, -60943, -13061, 347187, 229070, 343678, 149825, 147286, 242105, 699627, 1296102, 1438471, 1157946, 1564055, 751101, 447389, 5230, 307202, 3707, -270105, 325636, 172959, 298648, 336025, 144112, 221216, 173418, 212941, 165734, -13124, 11381, 487245, 278829, 326557, 245691, -180058, 504359, 181723, 121170, -81504, -36511, 44512, 115745, 129407, 26776, 205948, -245704, 264647, 224725, -92726, 360367, 112505, -227884, 160546, -116591, -95134, 103456, 144781, 133457, 109942, -81098]
15176B92995R8449a27297A65155a3295A51658a76609P8890A46052J35664E2495
15165A0100L35714j10985F3815O34708B59744j13711a77781L1918C24469E8195
15154B4615a0831j22823B80105a39460B18907h4192B45535R5271G3288J83888
15144B57176b0208p5879j26418A37883i5685A53431J56972L0437E5035P6345Q0482
15133B11862E1204J88436r6257o5839a89912C68273O6181G1050O4171e2400k51807
15122c04207N7812a01996B9108J70936R7897A0876M7458l382e5645C41718c461
15110A26384a50264C22789j25067J5469a03773D18090B08803K59055F6722J63523
15100B30245L25412B75677h4804o3819B44962p1193M6635G7394i424E62803A99689
$$ y = [292995, 391444, -127297, 165155, -13295, 151658, -176609, -97719, 146052, 281716, 52495, 10100, 345814, 234829, 63815, 698523, 259744, 146033, -177781, -145863, 324469, 58195, 24615, -10831, -133654, 280105, -139460, 218907, -84192, 245535, 340806, 73288, 257176, -20208, -96087, -222505, 137883, -95685, 153431, 310403, 340840, 55035, 131380, 211862, 51204, 239640, 143383, 77544, -189912, 368273, 434454, 71050, 135221, -52400, -304207, -246395, -101996, 29108, 200044, 297941, 10876, 58334, 54952, -55645, 341718, -3461, 126384, -150264, 322789, 197722, 213191, -103773, 418090, 208803, 467858, 66722, 230245, 555657, 275677, -84804, -148623, 244962, 173769, 220404, 77394, -9424, 562803, 199689]
15088A06409L1543J32467a04985H871O9343K72203F893i2441L6302k06652A61878
15076E7451K8983l9522b30856F6397l2087M15541j57443L7094Q3384D2855N75
15065D3430A1436J96072h7511D4404K08478j14622E4195J45016K6370R5996a7062
15053C30221n1341G4155k3519j7877a0209C60854D5322P6180j5067M23954A7907
15041D52229j36317j43056m3449M29887a18747D2609M16508c8061H3273L07090
15031C90363j51697R4171J42763B4958J01747P2711J91854p8875M7527p4166J78795
15020D64551j48153r0643N4360L61789n8386L4084k7048K59026j42913K70610
15010I77277m06337K0284j95513K29884j47894P6027r7168Q7117r5715O641J4342
$$ y = [106409, 137952, 270419, -104985, 8871, 78214, 350417, 6893, -92441, -56139, -262791, 161878, 57451, 86434, 46912, -230856, 66397, 34310, 449851, 292408, 329502, 412886, 42855, 43430, 11436, 207508, -87511, 44404, 252882, 138260, 54195, 199211, 225581, 321577, -17062, 330221, 278880, 74155, 50636, 32759, -10209, 360854, 45322, 121502, 106435, 530389, 17907, 452229, 315912, 172856, 129407, 559294, -118747, 42609, 459117, -38061, 83273, 390363, 238666, 332837, 475600, 24958, 126705, 199416, 391270, 312395, 359922, 285756, 464551, 316398, 225755, 280115, 641904, 583518, 617602, 590554, 849580, 706667, 977277, 570940, 591224, 395711, 625595, 477701, 553728, 456560, 543677, 447962, 454603, 468945]
14999D68945m3807A56574R0259J50158K45846j68066r2088L526j69702K16433
14989D32940K317A50025J39359M3727A2890N60949j69860q2307J25788K28147
14979F75607k19209c08690C16697J62371j43997J32243K94150k43743m8215j05253
14969C64253j5576A27571P01450k65074K35199j20110k89927K33027j38722j16715
14959C66699J34762Q1406J20746k58410K52520k27480j77363J84936A71921L66378
14949E38299j89597A30227J86525J23640K92432k46413J51837q2791J49670B98941
14938C44535j3398P3989q0191p698l2808E639Q10617A31331J33569K62359o9849
14927D57410m3537L36694l14771L1111M86249k91201J35254l54216J91220k95613
$$ y = [468945, 425138, 156574, 246833, 396991, 642837, 474771, 382683, 386209, 216507, 432940, 435257, 150025, 289384, 333111, 12890, 573839, 403979, 321672, 447460, 675607, 456398, -308690, 316697, 479068, 335071, 467314, 761464, 517721, 469506, 364253, 348677, 127571, 829021, 563947, 799146, 679036, 389109, 622136, 483414, 366699, 501461, 582867, 703613, 445203, 697723, 470243, 292880, 477816, 171921, 538299, 348702, 130227, 316752, 440392, 732824, 486411, 638248, 555457, 705127, 298941, 344535, 331137, 405126, 324935, 317237, 284429, 5639, 816256, 131331, 264900, 527259, 457410, 413873, 750567, 435796, 466907, 953156, 661955, 797209, 442993, 634213, 338600]
14917C38600M96365O0896N3069L02003p8265K69361O5340p7215K28282k10477
14907A447959O9887O3002J94513j48712M7146P1275J48094L53890m97498l0001
14897A719555l85414k22570J73465k49322m78032N3789k71261M66979C36995J41941
14887D78936J40461j15158K9319K096o1029J09391k22465K73672j38130K28694
14877G25787C58511J24425A70552N40874j51594m7528m5847K17978j28531L87383
14867I43287J04263K789l02677o3495J72740K28847l57978j75767K87325B65329
14856B59733K72938K56800k11889J09350k08058Q4235O9742N26384D61426J03425
14846E64851M29927C49947K51033j70929L5599n1240k0344j45809k5970L23817
$$ y = [338600, 834965, 895861, 948930, 1250933, 1172668, 1442029, 1507369, 1430154, 1658436, 1447959, 1517846, 1580848, 1775361, 1626649, 1673795, 1745070, 1893164, 2247054, 1749556, 1719555, 1334141, 1111571, 1285036, 1035714, 557682, 611471, 340210, 807189, 336995, 478936, 619397, 504239, 533558, 535654, 474625, 584016, 361551, 635223, 497093, 725787, 358511, 482936, 170552, 711426, 559832, 512304, 466457, 684435, 555904, 943287, 1047550, 1050339, 747662, 684167, 856907, 1085754, 727776, 552009, 839334, 265329, 259733, 532671, 789471, 577582, 686932, 478874, 563109, 632851, 1159235, 461426, 564851, 994778, 349947, 600980, 430051, 465650, 414410, 394066, 248257, 222287, 546104]
14836E46104P6537j86691J74180J65502l40048j68600N38906K21147j63011j29867
14826G34159M71196l11984j47339Q7014J18008K21269k7077j01543D77719L02122
14816G79841k9881Q790k96841L54696Q7337D43874m6606J65652K56419l57206
14806D62133K72935j63793K11997j99651M79334m66429j07723K43570j81169J39921
14796F91125N6686m6773k71817P48221l64076j39264O0028L73921l19486K17499
14786A006064r495k28762k43660J95185r0915o4435O4931j12202K12106j72600
14776E56217j86129J91963K36886k2403j92138B67623K47720M45423k53835o3142
14766F43789L8380p5128O8410R1349J38688L451R6261j06985R5741r7935K02684
$$ y = [546104, 622641, 435950, 610130, 775632, 435584, 266984, 805890, 1027037, 864026, 734159, 1205355, 893371, 746032, 833046, 951054, 1172323, 1145246, 1043703, 477719, 779841, 749960, 758750, 461909, 816605, 903942, 443874, 397268, 562920, 819339, 462133, 735068, 571275, 783272, 583621, 1062955, 596526, 488803, 732373, 551204, 691125, 747811, 701038, 429221, 1177442, 813366, 674102, 734130, 1108051, 788565, 1006064, 996569, 767807, 524147, 719332, 628417, 563982, 628913, 516711, 728817, 556217, 370088, 562051, 798937, 776534, 584396, 267623, 515343, 960766, 706931, 643789, 682169, 607041, 675451, 766800, 905488, 908939, 1005200, 898215, 993956, 896021, 1098705]
14755A098705n41169K7833N0832n8793k04759M28356L4704L4540j77422K87036
14745I79863k82056m483j56507K77805l53529K11197N512R65J83237j35443j69744
14734E56817M02185m45933J00442j28691P9426J25144J46563j35653L85619m05489
14724F80430M694K66962j45470K280K50832m7589j32785L88974l79257K92986
14714A182057J52552n02942N89263R7005k16198L36018j51291N1610l59503l21512
14704H57059l7812L6232K9521K16797l40988N0273Q6979D34005O53392l20645
14694G66752J01984K95877M7553J2162l44850L11601k86764N16095K82186l28104
14684A374492K00862K03245k08502j67437k65515p3947M3359Q9621n4029J22215
$$ y = [1098705, 557536, 585369, 636201, 577408, 372649, 801005, 835709, 870249, 692827, 979863, 697807, 693324, 536817, 814622, 461093, 672290, 677802, 678767, 862004, 726561, 556817, 959002, 513069, 613511, 484820, 564246, 689390, 835953, 700300, 1085919, 680430, 685124, 952086, 806616, 808896, 1059728, 1012139, 879354, 1268328, 889071, 1182057, 1334609, 831667, 1420930, 1517935, 1301737, 1637755, 1486464, 1538074, 1178571, 857059, 819247, 855479, 885000, 1101797, 760809, 811082, 898061, 434005, 1087397, 766752, 868736, 1164613, 1212166, 1224328, 879478, 1191079, 904315, 1420410, 1702596, 1374492, 1575354, 1778599, 1570097, 1402660, 1137145, 1063198, 1106557, 1196178, 1142149, 1264364]
14674A264364l94110K87809j67901j57287O7197q7322J41901J61668j93823J39393
14664A061889j16925J7890l65031N88640k64499P6346K39249n69978N77256l09276
14654I35561k2127M07622l0554j47515J25375k67331k5192J46391l66565K99333
14644A054998k8115p8897l23342L90359l4428P5000K22731p8450J49146l6161
14634A312841k01925j26378K74517j40213L1960N7415K1708p3360K70971j82499
14624A245037j59305L92174k88778K1637k19303L85938j8951l23571L051K50780
14614A288709k7123M4838N8323Q2056j04337P728k11252M66955k87590J32511
14604A450818m1456J06870l91799K65987L71418k25522o1565l2084q5690J94548
$$ y = [1264364, 870254, 1158063, 990162, 832875, 900072, 812750, 954651, 1116319, 922496, 1061889, 944964, 962854, 597823, 1186463, 921964, 998310, 1237559, 667581, 1244837, 935561, 913434, 1321056, 1290502, 1142987, 1268362, 1001031, 975839, 1122230, 755665, 1054998, 1026883, 947986, 624644, 1015003, 980575, 1055575, 1278306, 1199856, 1349002, 1312841, 1110916, 984538, 1259055, 1118842, 1150802, 1208217, 1229925, 1156565, 1427536, 1245037, 1085732, 1477906, 1189128, 1210765, 991462, 1377400, 1358449, 1034878, 1037929, 1288709, 1261586, 1306424, 1364747, 1446803, 1342466, 1350194, 1138942, 1605897, 1318307, 1450818, 1409362, 1516232, 1124433, 1390420, 1761838, 1536316, 1474751, 1442667, 1356977, 1551525]
14594A551525j5916j56227J57631J04040j29571J1405R1100J38767M5036j48023
14584A649767P8618j43165L89427l87908J02123J2903k52650J64570M83036k80637
14574A816084k51018Q3687J56228J72307k49621J24094j24813L85243k58005m5374
14564A808812N5766R8902K97710l01764j32861J65772l61289P74264l87734K95331
14554B312909J88460l01800R0381k45012K47937J56137r6534N61354m85305N68134
14544B996661j29573K49014J32942L77982M08360Q6863Q39757K78152N98958J403007
14534G242123K895933L848042O576403R418550K330251j3892618p784544l974189
14526F659951j545787L9092l72893K05743j187032q33554j75014j3031k27369
$$ y = [1551525, 1535609, 1379382, 1537013, 1641053, 1511482, 1522887, 1613987, 1752754, 1797790, 1649767, 1728385, 1585220, 1974647, 1586739, 1688862, 1701765, 1449115, 1613685, 2096721, 1816084, 1565066, 1648753, 1804981, 1977288, 1727667, 1851761, 1726948, 2112191, 1854186, 1808812, 1864578, 1963480, 2261190, 1959426, 1826565, 1992337, 1631048, 2405312, 2017578, 2312909, 2501369, 2199569, 2289950, 2044938, 2292875, 2449012, 2352478, 2913832, 2428527, 2996661, 2867088, 3116102, 3249044, 3627026, 4035386, 4122249, 4962006, 5240158, 5839116, 7242123, 10138056, 13986098, 20562501, 29981051, 32311302, 18418684, 10634140, 6659951, 5114164, 5153256, 4780363, 4986106, 3799074, 2965520, 2790506, 2777475, 2550106]
14517B550106k19482l2017J71453P614j63998J17938j30189L95811J8171j74541
14507B540866o182r2755j23763M1550k0167L79835r088K96478l39527m8944J67034
14496B785337J62016j75972l33713K97640J98276L6398j74633l997N38641p0523
14486C259470l6300K13726J3216k99959p7662L47469k18551N1797L46125r2261
14476C507070m85433L87081n2134K18010j16846K21579J18440j51294L32067r0207
14466C888333l2327J88228k63222K81329J66660j80703o1088J75756K09241J92895
14456D565102k64836r2000L56481k37752L39984q0851L40928j02562l24240K82798
14446D783052l22622N48453k74021J87977R0102L05825l85206J09391L03133P7258
$$ y = [2550106, 2330624, 2298607, 2470060, 2477674, 2313676, 2431614, 2301425, 2697236, 2715407, 2540866, 2534684, 2441929, 2318166, 2359716, 2339549, 2719384, 2710296, 3006774, 2667247, 2618303, 2785337, 2947353, 2771381, 2437668, 2735308, 2933584, 2969982, 2795349, 2791352, 3329993, 3259470, 3223170, 3436896, 3450112, 3150153, 3072491, 3419960, 3201409, 3253206, 3599331, 3507070, 3021637, 3408718, 3356584, 3574594, 3457748, 3679327, 3797767, 3646473, 3978540, 3888333, 3856006, 4044234, 3781012, 4062341, 4229001, 4048298, 3987210, 4162966, 4372207, 4565102, 4300266, 4208266, 4564747, 4326995, 4666979, 4586128, 4927056, 4824494, 4500254, 4783052, 4460430, 5008883, 4734862, 4922839, 5012941, 5318766, 4933560, 5042951, 5346084, 5423342]
14436E423342J60076O374n9987K88980l84029L55461K00382l17849M02783N4755
14426F130288M1448k30020J80897M01267k16034l2108J46453K93227L22012k29974
14416F807456K83604l69237L47210j7419M31211J38861N4420m76117M38568r6842
14406G541715O57730Q3320K9571J42713M10713j21518m7208M0096L63638N9512
14396I160282j72285j23068L59436O10310k66092L66571o0362M34853O3694K05606
14386A0578945M6794Q1387J06915M35393k47399L32100J84620K42567M07221n3469
14376A2115074J15699M20628r5393L25290K42891K9532L46946M39290J36776L47229
14366A4423962M75602m8673N37577j4098N17360M60486Q9968J70821N80708M28627
$$ y = [5423342, 5583418, 5589792, 5529805, 5818785, 5434756, 5790217, 5990599, 5672750, 6075533, 6130288, 6171736, 5941716, 6122613, 6523880, 6307846, 6275738, 6422191, 6715418, 7037430, 6807456, 7091060, 6721823, 7069033, 7051614, 7482825, 7621686, 7676106, 7199989, 7638557, 7541715, 8199445, 8282765, 8312336, 8455049, 8865762, 8744244, 8697036, 8737132, 9100770, 9160282, 8987997, 8864929, 9224365, 9834675, 9568583, 9935154, 9874792, 10309645, 10373339, 10578945, 10625739, 10707126, 10814041, 11249434, 11002035, 11334135, 11518755, 11761322, 12168543, 12115074, 12230773, 12651401, 12556008, 12881298, 13124189, 13153721, 13500667, 13939957, 14076733, 14423962, 14899564, 14850891, 15388468, 15374370, 15891730, 16352216, 16442184, 16613005, 17193713, 17622340]
14356A7622340J96441M33922J58051N00345M88096O34447J90967M52795k4600
14347B0652804P69020L63046N71302N68339K641O89263P21364K44742P85474R43422
14337B6311417N34426L79449O60306P54380N01364N21917J250195P00209P30178
14328C2343841P04742R73824J033517J289399P27432J092883J176963J185300
14320D0527901R44320R62715J391725J541161J270137J742728J014277K061923
14312E1456887J897773J578021K082734J498296K436849J910609K580410K053183
14304F7494762K581902K607173K918945K677895L072612K956750L358356L726339
14296I1394734L435329M257685M252166M576160M319004N227696N404690N433423
$$ y = [17622340, 17818781, 18252703, 18410754, 18911099, 19399195, 20033642, 20224609, 20677404, 20652804, 21421824, 21784870, 22356172, 22924511, 22927152, 23616415, 24337779, 24582521, 25367995, 26311417, 26845843, 27225292, 27885598, 28639978, 29141342, 29663259, 30913454, 31613663, 32343841, 33048583, 34022407, 35055924, 36345323, 37072755, 38165638, 39342601, 40527901, 41472221, 42434936, 43826661, 45367822, 46637959, 48380687, 49394964, 51456887, 53354660, 54932681, 57015415, 58513711, 60950560, 62861169, 65441579, 67494762, 70076664, 72683837, 75602782, 78280677, 81353289, 84310039, 87668395, 91394734, 94830063, 99087748, 103339914, 107916074, 112235078, 117462774, 122867464, 128300887]
14288A28300887O516184O046528O819133P037906P500683P983490Q762425R028530
14280A87995766R030148J0388000J0704991J1474286J1755818J2476256J3288978
14273B67114243J3578780J3932493J4025988J4533977J4612205J5465820J4757245
14266C68020751J5106209J4438231J2936251J1916877J1100238J0354694R547262
14259D53420513Q549718N247960K416143K115687L882769J712716n495794n495977
14251D66353735r224660j0552577j1669586j1108086j2358017j2207563j3709951
14244C85523295j2810409j4238685j4833947j4500525j3859639j4594871j3451820
14237B87233399j2994701j2867834j2969563j2205488j1896425j2304987j0896066
$$ y = [128300887, 134817071, 140863599, 147682732, 154720638, 162221321, 170204811, 178967236, 187995766, 197025914, 207413914, 218118905, 229593191, 241349009, 253825265, 267114243, 280693023, 294625516, 308651504, 323185481, 337797686, 353263506, 368020751, 383126960, 397565191, 410501442, 422418319, 433518557, 443873251, 453420513, 461970231, 467218191, 469634334, 471750021, 475632790, 477345506, 471849712, 466353735, 457129075, 446576498, 434906912, 423798826, 411440809, 399233246, 385523295, 372712886, 358474201, 343640254, 329139729, 315280090, 300685219, 287233399, 274238698, 261370864, 248401301, 236195813, 224299388, 211994401, 201098335]
14230B01098335j0541630r777595r158426q293313q101582p647049o718862o351316
14222A34508562o280199n593216n446363n166504m798277m420830m228270m206875
14214I4368028l610027l641013l395145l328111l183953k652692k962490k488336
14206F9106261k219167k434878j823210k735785j985882j708222j916830j623009
14198E2659278j316332k133241j301276j472982j553300j014249r11918r00700
14190D2055280j552036j288850j054833j190335r00410o47403j220397r04548
14182C3296468j001352p91348m74278q84807q01557o51729q59555m99730p51481
14173B6580631m74179m69183r23503n35633n61432m61681k46091o42921n08017
$$ y = [201098335, 190556705, 180779110, 171620684, 163327371, 155225789, 147578740, 140859878, 134508562, 128228363, 122635147, 117188784, 112022280, 107224003, 102803173, 98574903, 94368028, 90758001, 87116988, 83721843, 80393732, 77209779, 74557087, 71594597, 69106261, 66887094, 64452216, 62629006, 59893221, 57907339, 56199117, 54282287, 52659278, 51342946, 49209705, 47908429, 46435447, 44882147, 43867898, 42955980, 42055280, 40503244, 39214394, 38159561, 36969226, 36068816, 35421413, 34201016, 33296468, 32295116, 31503768, 31029490, 30144683, 29343126, 28691397, 27831842, 27332112, 26580631, 26106452, 25637269, 24713766, 24178133, 23616701, 23155020, 22908929, 22266008, 21757991]
14164B1757991n50792o27644j12112k91978m43053j79491p88353k97275k23861
14155A8243432m92957l03629n11765k28314m48800m75374j67676k58510k02613
14146A5153794j38558q55161L16720k92523l14420j70206k74883k84043R9538
14137A3240258m47855L6929k85477k51958j71277l23069k14214L209n20601L12447
14127A1378392l76681l12694L4771j81217m2680k89746m70260O2948K20762m24315
14117I599280j794J00596m88140L4753m63683k16409L36601m17418N268n74421
14107G914633K78915L753k40561J43644o70441K67770l35381M76646q29859K98647
14097G307766k22193j4293l27459L15128j43684k85081J87008k9478l62531J63118
$$ y = [21757991, 21207199, 20579555, 20467443, 20175465, 19732412, 19552921, 18764568, 18467293, 18243432, 17750475, 17446846, 16935081, 16706767, 16257967, 15782593, 15614917, 15356407, 15153794, 15015236, 14160075, 14476795, 14184272, 13869852, 13699646, 13424763, 13140720, 13240258, 12792403, 12829332, 12543855, 12291897, 12120620, 11797551, 11583337, 11586546, 11065945, 11378392, 11001711, 10689017, 10723788, 10542571, 10499891, 10210145, 9739885, 9802833, 10023595, 9599280, 9597486, 9698082, 9209942, 9244695, 8781012, 8564603, 8901204, 8483786, 8489054, 7914633, 8193548, 8197301, 7956740, 8100384, 7429943, 7697713, 7362332, 7838978, 7009119, 7307766, 7085573, 7071280, 6743821, 7058949, 6915265, 6630184, 6817192, 6787714, 6425183, 6588301]
14087F588301j19472n7462K7812k14370q6041m9742k52280R0746k78745J95398
14077E844145l94919J45197k61289K83429j24194j08674k15847j63949K29411
14068E233310l79785L75558m66765K7949j04491M83997l79239l62341J81155K15037
14058D824385J0909l3763j57545J01195k75197j06717j23175q3374Q8931j38254
14048D107395o6206J03803R7718J47604j50748K54063m50709l90383L62055j4144
14038D000448l84372J42892l77232K9625n1635J38070n9257N8294K95418m41446
14028C350805J09738k18282k96740N88542l52464k00251M04267j79388j66758
14019C039469O9288q5673J36488n2824O3814K8628l27560N17266n56218N56793
$$ y = [6588301, 6468829, 6411367, 6439179, 6224809, 6138768, 6089026, 5836746, 5927492, 5648747, 5844145, 5449226, 5594423, 5333134, 5616563, 5492369, 5383695, 5167848, 5003899, 5233310, 4853525, 5229083, 4762318, 4790267, 4685776, 5169773, 4790534, 4428193, 4609348, 4824385, 4835294, 4801531, 4643986, 4745181, 4469984, 4363267, 4240092, 4156718, 4245649, 4107395, 4041189, 4144992, 4242710, 4390314, 4239566, 4493629, 4042920, 3652537, 4014592, 4000448, 3616076, 3758968, 3381736, 3411361, 3359726, 3497796, 3438539, 3496833, 3792251, 3350805, 3460543, 3242261, 2945521, 3534063, 3181599, 2981348, 3385615, 3206227, 3039469, 3108757, 3023084, 3159572, 3106748, 3170562, 3199190, 2871630, 3388896, 2832678, 3389471]
14009C389471n17335k74923K84306n5577l62322J14370J97565j85145N7135j17453
13999B530092M72120l83267j95726k94891O81677n44818L32124l04070K3636j4885
13989B301992j60531J48609k28967K06385q1401m4550J70695P1641M0459K44160
13979B668492K77407K1128M52937K0257J187417K000288L566980N302060J0158653
13970B5655619Q914291j1476867q474848m388056k485625j326126j152219o54862
13962D611307n30704l31380q9159m99299p6278k89928o3224J16830n58400L36267
13952B626032l5451j64219k00274J07279J8358K33190l88905p5841j07116K85166
13942B298219k03076K69413j5079j61335l26240L05899l64203M48564m78411L22725
$$ y = [3389471, 2872136, 2597213, 2881519, 2825942, 2463620, 2577990, 2775555, 2590410, 2647545, 2530092, 3002212, 2618945, 2423219, 2128328, 2810005, 2265187, 2597311, 2293241, 2316877, 2301992, 2141461, 2290070, 2061103, 2267488, 2186087, 2141537, 2312232, 2383873, 2424332, 2668492, 2945899, 2967027, 3419964, 3440221, 4627638, 6627926, 10194906, 15496966, 25655619, 34569910, 23093043, 14618195, 10230139, 7744514, 6418388, 5266169, 4611307, 4080603, 3749223, 3660064, 3160765, 3084487, 2794559, 2731335, 2848165, 2289765, 2626032, 2590581, 2426362, 2226088, 2333367, 2351725, 2584915, 2196010, 2120169, 2013053, 2298219, 2095143, 2364556, 2349477, 2188142, 1861902, 2167801, 1803598, 2252162, 1773751, 2096476]
13932B096476k31847L37038l15448K19664j88874j50644L13220k23136m9553K49471
13922B056367r7159p9809l2276q6514k77333J74895K9122k6942k00028P9813L5916
13911A576052N2604j22987J67426m3928k39152M51883k78605k4882j15159J93164
13901A616416j94198N1992J04327k858Q4920l94631K63565J72759l35064N0305
13891A417533J61896k288K1839o9903k40793j25996R7208j47887K04587p2422
13881A243774J45586J11383l39006L29913l91610Q3551J33372J72527j64896j2933
13871A311661l5985J79080m44673N894L45774j28679k81866k8073K07675J98293
13861A329101p9456k04261K36670R347o164k93984L46435k80056l9889l08268
$$ y = [2096476, 1864629, 2201667, 1886219, 2105883, 1917009, 1766365, 2079585, 1856449, 1806896, 2056367, 1959208, 1879399, 1847123, 1760609, 1483276, 1658171, 1687293, 1660351, 1460323, 1540136, 1576052, 1628656, 1505669, 1673095, 1629167, 1390015, 1841898, 1563293, 1538411, 1423252, 1616416, 1422218, 1474210, 1578537, 1575679, 1660599, 1265968, 1529533, 1702292, 1367228, 1417533, 1579429, 1577141, 1598980, 1529077, 1288284, 1162288, 1259496, 1111609, 1316196, 1243774, 1389360, 1500743, 1161737, 1491650, 1100040, 1183591, 1316963, 1489490, 1324594, 1311661, 1275676, 1454756, 1010083, 1015977, 1361751, 1233072, 951206, 923133, 1130808, 1329101, 1249645, 1045384, 1282054, 1291401, 1285237, 991253, 1337688, 1057632, 1017743, 709475]
13851G09475O18707l96194M04544m18562J25335L6436j40498J62338r6780K37001
13841A241802m42929L77697j00771J09248l49436J73415J74307J03484l56589
13832I30228r2447N7279M9631J56163j23229k9312r9915J87380l68980M13688
13822A080486m24883J48801m422O8341M3986j20358m28J58879k23484M05857j25662
13811A007113J2461L3496l21909J02270q7870K52801k56527K88645m22279N46376
13801A154577j65384K123j02821J53729k71498M62550m37480J07724k56391j68785
13791D78344O5268K41262K1441L45171E27062K11396k92742J30820o90L79500
13781I55346l22833K68058C82887N70878Q7290J62102k75188j19985j19779J39460
$$ y = [709475, 1328182, 931988, 1336532, 917970, 1043305, 1079741, 939243, 1101581, 1004801, 1241802, 798873, 1176570, 1075799, 1185047, 835611, 1009026, 1183333, 1286817, 930228, 837781, 895060, 944691, 1100854, 977625, 948313, 848398, 1035778, 666798, 1080486, 655603, 804404, 799982, 868323, 912309, 791951, 791523, 950402, 726918, 1132775, 1007113, 1019574, 1053070, 731161, 833431, 745561, 998362, 741835, 1030480, 608201, 1154577, 989193, 991316, 888495, 1042224, 770726, 1233276, 795796, 903520, 647129, 478344, 543612, 784874, 806315, 1151486, 527062, 738458, 445716, 576536, 575846, 955346, 632513, 900571, 382887, 953765, 1041055, 1203157, 927969, 807984, 688205, 827665]
13771H27665J88785l81688K91598l11411L62681l68157N20399m87852L98680l58253
13761F82447m9123Q320j17627O5830J98300Q793m3972k29080n2166O6159K03718
13750G41599k47217L0620K35455C15616N42705j92511K60058k12939J64424P6273
13740I53626J3521k51337B93266L08771m0027J31645j22778K6865L1008r9283
13730E29467K77218C90284J70860M74996C35098L80456p3374j77796L30755k37280
13720E57859O6094L973j12571J95329j99926L52816D21995K03060j14237J34863
13710F45681r339B37261J11880l3470N8988J00472R863L49028k30679A88229K33070
13699D21299L71763l27289K42451R4728l62023Q0278m3999J74489J124k43777
$$ y = [827665, 1016450, 634762, 926360, 614949, 977630, 609473, 1129872, 642020, 1040700, 682447, 633324, 641644, 524017, 589847, 788147, 796940, 752968, 523888, 471722, 537881, 741599, 494382, 525002, 760457, 315616, 858321, 665810, 925868, 712929, 877353, 953626, 967147, 715810, 293266, 602037, 562010, 693655, 570877, 597742, 628750, 529467, 806685, 390284, 561144, 1036140, 335098, 715554, 642180, 464384, 795139, 557859, 623953, 627926, 515355, 710684, 510758, 863574, 421995, 625055, 510818, 645681, 636342, 237261, 349141, 315671, 374659, 475131, 484994, 834022, 603343, 188229, 421299, 793062, 465773, 708224, 802952, 440929, 521207, 477208, 651697, 652821, 409044]
13689D09044K87924l21215K73799P3935l23921R6549L41395l59346p5187M01430
13679H04407j44434j04412N7798j49285K96220A72693M52440j5609J7942J33500
13669G60966j16069C19829K60367P9331k50035J17377K24995j94550J29186P4543
13659G61043B34451M1565K4811j3514Q4408j45386M99734j73378j82451K1504
13649C91744K19535k20023K05798n751j00598M7436N8181B80264M88968l29344
13639D39888L801j95230r5372M917L11040N2823J54115q6322n1665r8095P4570
13628E14470r1169J22936j85534N16981l41072o4007K39477k85013R6866B33447
13617E47796j71183A60861N12686k81065r9984K71967j40012o3445k8444J32412
$$ y = [409044, 696968, 375753, 649552, 723487, 399566, 496115, 837510, 478164, 402977, 804407, 659973, 555561, 613359, 464074, 760294, 172693, 625133, 609524, 627466, 760966, 644897, 319829, 580196, 659527, 409492, 526869, 751864, 557314, 686500, 761043, 234451, 276016, 300827, 287313, 371721, 226335, 726069, 552691, 370240, 391744, 611279, 391256, 597054, 591303, 490705, 538141, 596322, 280264, 769232, 439888, 443689, 248459, 153087, 158004, 469044, 521867, 675982, 589660, 537995, 439900, 514470, 423301, 546237, 360703, 877684, 536612, 472605, 712082, 427069, 523935, 233447, 547796, 376613, 160861, 673547, 392482, 292498, 564465, 424453, 361008, 332564, 464976]
13607D64976A33249Q3839L3872J48126J14692f7699C67064r1616K19432A64699
13596A96145K05800A76078L14603B36093K55795m4629k5373j95818J51003l9187
13586C37884O5642M7518J59752J40631k93019K0573k05391I9938N93109C31352
13575C45335r1155c1521B12922K09527A86859J34518j52944K76535j35877K8711
13565C37802r0080J97228A56007J43203A09805L93607k38418Q1281j58201n4067
13555A34007K67825o1996n7126K07650j00506A88382J63867L5115L17234B66946
13544D04241j09060l5090R5525b19001A41637J25299R3681A49069K35398K54482
13534F38949A28478J98734K3757K72745k51647j73284Q3809m9882N64138C66528
$$ y = [464976, 133249, 217088, 250960, 399086, 513778, -67699, 367064, 275448, 494880, 164699, 196145, 401945, 176078, 490681, 236093, 491888, 447259, 421886, 226068, 377071, 337884, 403526, 451044, 610796, 751427, 458408, 478981, 273590, 99938, 693047, 331352, 345335, 254180, -31521, 212922, 422449, 186859, 321377, 168433, 444968, 309091, 337802, 247722, 444950, 156007, 299210, 109805, 503412, 264994, 346275, 188074, 134007, 401832, 339836, 282710, 490360, 389854, 188382, 352249, 387364, 704598, 266946, 404241, 295181, 260091, 355616, -219001, 141637, 266936, 360617, 149069, 384467, 638949, 128478, 327212, 350969, 623714, 372067, 198783, 282592, 232710, 796848, 366528]
13523A56875J80037o5410j8751n9226k9520K22765I2026J34633J74761J25799
13513E27219B39009n0316P1680J09547j42819p4948K89505A67830K09962j18120
13503B59672N474d8952C15495K26199A1875L7154c0445D28744B4587R6785K82278
13492D03650j45916M4595o8802q0611J49346j11058L9837D5543b52178A26K72569
13481B72695p5277J3551r3564J36223n6155Q8483k176M7697r7727n8367J67865
13470C43248c6034A31053M43807D5883L96781j65609q6087K01227r8558J94315
13460D87952B34118Q9983m1722J27642A13271L93448k14912j15953L670L85998
13450E65522A32791M9925J66638J71799k23513K3686N7849J3814j00088j00108
$$ y = [156875, 336912, 271502, 252751, 193525, 164005, 386770, 92026, 226659, 401420, 527219, 239009, 188693, 260373, 369920, 227101, 152153, 441658, 167830, 377792, 259672, 265146, -48952, 315495, 541694, 11875, 49029, -30445, 428744, 24587, 121372, 403650, 257734, 302329, 233527, 152916, 302262, 191204, 231041, 45543, -252178, 126, 272695, 197418, 210969, 117405, 253628, 197473, 285956, 283780, 331477, 233750, 175383, 343248, -36034, 131053, 574860, 45883, 442664, 277055, 190968, 392195, 293637, 487952, 234118, 324101, 282379, 410021, 113271, 506719, 291807, 175854, 179524, 565522, 132791, 182716, 349354, 521153, 297640, 321326, 379175, 392989, 292901, 192793]
13440A92793e716C58989p7886A27704L4149O6028l2829M9875b28034A14518J36414
13429B50932o533K90581A54237P6426J19167l883A21881K36831m9523r6841e2061
13417B98896c1759C10916I9486O2865K78483h365C98630A88737l5274D2339J48443
13406A90782P5272B0909h5258K7646D09434j89609B9053J26209A2459b18059C213
13394C13495g823A76339a18045A0792K06969K0562J76313A29970a62282B90834
13383C32511L54465A84875L9036g8417B73505j20007E5376J74500m3873e9475
13372C18627j14535l6743Q5850Q2372K1042k241r7346c1819D52782A23744L0118
13361A53862o4037J8775D7598K47973A27069Q3418C4169L84878b5478G171L29713
$$ y = [192793, -5716, 358989, 281103, 127704, 161853, 227881, 195052, 244927, -228034, 114518, 250932, 244399, 534980, 154237, 230663, 349830, 345947, 121881, 358712, 309189, 212348, -52061, 298896, -31759, 310916, 99486, 162351, 440834, -8365, 398630, 188737, 153463, 42339, 190782, 266054, 20909, -85258, -57612, 409434, 219825, 29053, 155262, 12459, -218059, 3213, 313495, -7823, 176339, -118045, 10792, 217761, 238323, 414636, 129970, -162282, 290834, 332511, 686976, 184875, 223911, -78417, 273505, 153498, 55376, 229876, 186003, -59475, 318627, 204092, 167349, 253199, 335571, 356613, 354372, 257026, -31819, 452782, 123744, 153862, 89825, 108600, 47598, 295571, 127069, 210487, 34169, 419047, -25478, 7171, 336884]
13350C36884G7261J25351M1320q8618C9208L9701K14112A8187g0644B07579b19663
13338H3798L17141p9792k3045J9359b15617C83412H3890g2534F92499l38243A16169
13326A49998R2143e3160G7639J62087N6825M0728A62730H0983e589D75101B36011
13314B97081j43488E3843j5614L08868A16051J67772K4237J1757g4108C97923
13303D55615A2449N0032J55534l3032a19213C98803m8276L0986K984A35777J09461
13292B45238J90699A58887K01627J46034A81467Q8683j27629L7261D7698N4954
13282A02652a72332e523B25815m3686q8260l0308L22404H5097K45568c601B43904
13270A68086N0163C1369J22098g8668A60379E1692L4036L28403q6365d4935K0178
$$ y = [336884, 77261, 202612, 243932, 155314, 39208, 78909, 293021, 18187, -70644, 207579, -219663, 83798, 400939, 321147, 298102, 317461, -215617, 383412, 83890, -72534, 692499, 354256, 116169, 149998, 242141, -53160, 77639, 239726, 296551, 337279, 162730, 80983, -5589, 475101, 236011, 297081, 153593, 53843, 38229, 347097, 116051, 283823, 308060, 319817, -74108, 397923, 455615, 12449, 62481, 218015, 184983, -119213, 398803, 350527, 381513, 384497, 135777, 245238, 435937, 158887, 360514, 506548, 181467, 270150, 142521, 179782, 47698, 102652, -172332, -5523, 225815, 182129, 93869, 63561, 385965, 85097, 330665, -3601, 243904, 168086, 218249, 31369, 153467, -78668, 160379, 51692, 85728, 414131, 327766, -44935, -24757]
13259b4757D14805a50766E1694c2128H9362c9304i332E5981d8164j27764A49358
13247B07595J49532G577J24961J35093I4882L6524N8154K03572c0071A49077g5661
13235f8907A61041K60003q123F0842M03984b7276l7988j01032B3438a79436j07912
13224b87348A30217Q8152e582B26190g6884a986C19803F6335a9840C03156e5575
13212B59790l9778f3606A98384c325C6344M6532J48444q1024L6961h0086B39884
13200a15692B75768a441l8854B30723I6557l9920M7483a20052A92067c54947B95599
13188a01339B4993J97056c3788B57065O2121c4532D42473A59950o3229R8731J8953
13177B14405E4166Q430J50266d8046a0987C70056I8829J91444A30691J76967r6272
$$ y = [-24757, 414805, -150766, 51694, -32128, 89362, -39304, -9332, 55981, -48164, -175928, 149358, 207595, 357127, 7577, 132538, 267631, 94882, 131406, 189560, 393132, -30071, 149077, -75661, -68907, 161041, 421044, 412921, 60842, 464826, -27276, -65264, -166296, 23438, -179436, -287348, 130217, 218369, -5582, 226190, -76884, -1986, 319803, 66335, -19840, 303156, -55575, 259790, 220012, -63606, 198384, -3325, 36344, 82876, 231320, 150296, 187257, -80086, 239884, -115692, 275768, -1441, -40295, 230723, 96557, 56637, 104120, -120052, 192067, -354947, 295599, -101339, 24993, 222049, -33788, 257065, 319186, -34532, 442473, 159950, 96721, 195452, 214405, 54166, 62596, 212862, -48046, -10987, 370056, 98829, 290273, 130691, 307658, 211386]
13166B11386i5168B04907k7559B4662J88777J02880C0524F594J00839B4416f6936
13154h3894A57272R3286a0069j0940p7949c0849B04627c8351D41440j75340h7115
13142a03789k48872a34102H989a49221B12882a30083A32185a03702a5801D73877
13131a46322P1214C7078L67228p7170n3488a20992e9975A92273p4375C3655N4943
13120H8598K90622f3228A7290i7356B17938j03198b0859E0621b3554p5649G8169
13108a48669A31420J28607B2082K90287D5636J24120Q5995L1640r2783b1866k14015
13097b35881A55768k0885l4436B9985a43781b6047F2899a63382A20469i9088i09
13085c0070B3497L36485o5884f7511C258J54944R6059j00716b37528D51119A88111
$$ y = [211386, -95168, 204907, 177348, 24662, 213439, 316319, 30524, 6594, 107433, 24416, -66936, -83894, 157272, 250558, -10069, -21009, -98958, -30849, 204627, -38351, 441440, 266100, -87115, -103789, -352661, -134102, 8989, -149221, 212882, -130083, 132185, -103702, -15801, 473877, -146322, -75108, 37078, 404306, 327136, 273648, -120992, -59975, 192273, 117898, 33655, 88598, 379220, -63228, 17290, -97356, 217938, 114740, -20859, 50621, -23554, -99203, 78169, -148669, 131420, 260027, 22082, 312369, 45636, 169756, 255751, 287391, 194608, -21866, -235881, 155768, 134883, 100447, 29985, -143781, -26047, 62899, -163382, 120469, -99088, -909, -30070, 23497, 359982, 294098, -67511, 3258, 158202, 254261, 153545, -237528, 451119, 188111]
13073C63494D2676A0593L3978L15074j48606R8675A46253b76066B026J10583e5162
13061B75877e7000A15555L13737c05899A00136a37049n1142o562A28265a7450
13050d33818K11919A4029a34771I2351l9890K14750q1687E1737d356r2370B54920
13038b8619A74202F0045K46033A41245a44297b2182n4233I7291e0324J3967C55359
13026B48593j18104c474j74041P6535A50311b23048f3094D08157e0090p9115c2237
13014A89651g0875A0947Q0922j2141J16034i7244M3887B07031q6549d3025F00920
13002A44158j2927d2487d1A15146k2209J78273Q5884b0189G6936g9789b6669G1081
12989D9918K18465a62163A55169a31029F030J00004K07558i3759D5038f457F2210
$$ y = [363494, 42676, 10593, 44571, 359645, 211039, 309714, 146253, -276066, 2026, 112609, -55162, 275877, -57000, 115555, 429292, -305899, 100136, -137049, -188191, -194753, 128265, -17450, -433818, -221899, 14029, -134771, 92351, 52461, 267211, 185524, 51737, -4356, -96726, 254920, -28619, 174202, 60045, 306078, 141245, -144297, -22182, -76415, 97291, -50324, -36357, 355359, 248593, 130489, -3474, -177515, -100980, 150311, -223048, -63094, 408157, -50090, -129205, -32237, 189651, -70875, 10947, 91869, 79728, 195762, -97244, -53357, 207031, 120482, -43025, 600920, 144158, 131231, -42487, -41, 115146, 92937, 271210, 357094, -20189, 76936, -79789, -26669, 71081, 49918, 268383, -162163, 155169, -131029, 6030, 106034, 313592, -93759, 45038, -6457, 62210]
12977I91b41486F1259J34183a50725F3242l1231M1738b52259C99597p0022A18767
12965g6688J9503n3423B23137P4488h7124d0686J8057A31988f0005b560l36818
12954c39378J54945A21252J16060r6481E6544J4370i2724j09219e6264r6408H533
12942A11760A0840J75968E8506J05263a9922k29030C00503A40196K70572j79939
12932B30829E7165Q9308A8486M4670J2644R8007a37489L6285j69097a02856C3362
12920H526a52179C5086J96590J25627a57322n0757C11171b44665B5044a24386
12909E3867J23005d889j61562j64303A951P7463a34419o44G283h4790E89385d092
12896a71061C07128c89618A4059g104B31473G0153K30770j13606K7184e6860f667
$$ y = [991, -241486, 61259, 195442, -150725, 63242, 32011, 73749, -252259, 399597, 329575, 118767, -76688, -57185, -110608, 223137, 297625, -87124, -40686, -22629, 131988, -60005, -2560, -339378, -184433, 121252, 237312, 140831, 56544, 70914, -92724, -201943, -56264, -152672, 8533, 111760, 10840, 186808, 58506, 163769, -19922, -248952, 300503, 140196, 410768, 230829, 57165, 146473, 18486, 63156, 75800, 173807, -137489, -101204, -270301, -102856, 33362, 8526, -152179, 35086, 231676, 357303, -157322, -208079, 311171, -244665, 25044, -124386, 53867, 176872, -4889, -166451, -330754, 1951, 79414, -134419, -135063, 7283, -84790, 589385, -4092, -171061, 307128, -389618, 14059, -7104, 231473, 70153, 300923, 187317, 214501, -56860, -6667]
12884C38510A54329m0203N968Q5720B7604i6409j1923B35394a66111d0924C04826
12872E3591a55959j48194A72258b81585A12954e896F8681C718Q0426a8304j26167
12861a44471B4266c73521g5248B6746L1089e3281I4294l6904b02393F0258c6734
12849a7825h11l16829c7325j86010b4997j17137I07J31518a06209d468E41016
12837a00462A52588E7786B4522a8706H5438a38751d8643K029A82873A5470L7871
12826E3341J05902g1734m82110A00996C7147b12477o9859R7741A96713a31580
12815a07052D397O6806a39357A39129b94066B9801Q6034a77398C22244I4026M383
12804I8409k537C6305N6062D5075a3811r5609A05585K48440A70417J05359O4575
$$ y = [338510, 154329, 114126, 120094, 205814, 27604, -96409, -108332, 235394, -166111, -40924, 304826, 53591, -155959, -304153, 172258, -281585, 112954, -5896, 68681, 3718, 84144, -18304, -144471, 24266, -373521, -75248, 26746, 57835, -53281, 94294, 57390, -202393, 60258, -36734, -17825, -811, -317640, -37325, -223335, -24997, -142134, 907, 132425, -106209, -4468, 541016, -100462, 152588, 57786, 24522, -18706, 85438, -138751, -48643, -46614, 182873, 15470, 53341, 159243, -71734, -553844, 100996, 37147, -212477, -282336, -184595, 196713, -131580, -107052, 4397, 71203, -139357, 139129, -294066, 29801, 115835, -177398, 322244, 94026, 98409, 95872, 36305, 92367, 45075, -13811, -109420, 105585, 354025, 170417, 275776, 340351]
12793C40351f1149A54323a46787A12851a1034k29754A27080n4496a36919H2322
12782A92733c6149q9321k38478J00340H254b51020l9559A73996g5676A27542c0484
12770I4812L3411Q3321d6833I7774g7683B08612b95095C7629L34380B4127J56127
12759A80254a61183c6303k45008J36408l29617a78128f4583k368B71817a66015
12748F7533a59259b1133D989K93763a11090a6601j20206l84125a81139B78949
12737A3370a2590A09144b20637A80454h0033E0811A1887b02358h8763K639p539
12726i3663D765K7289b67262C52182j62516a0502A05281J78232I8328k2824K248
12715G7752c55723E2217J83823h2530b2054k4399k71816A55024b93141b9832j42510
$$ y = [340351, -61149, 154323, -146787, 112851, -11034, -240788, 127080, 72584, -136919, 82322, 192733, -36149, -125470, -363948, -263608, 8254, -251020, -290579, 173996, -75676, 127542, -30484, 94812, 128223, 211544, -46833, 97774, -77683, 208612, -295095, 37629, 372009, 24127, 180254, -161183, -36303, -281311, -144903, -474520, -178128, -64583, -66951, 271817, -166015, 67533, -159259, -21133, 4989, 298752, -111090, -16601, -136807, -520932, -181139, 278949, 13370, -12590, 109144, -220637, 180454, -80033, 50811, 11887, -202358, -88763, -86124, -93663, 4765, 32054, -267262, 352182, 189666, -10502, 105281, 283513, 98328, 75504, 77752, -355723, 52217, 236040, -82530, -22054, -46453, -318269, 155024, -293141, -29832, -172342]
12704a72342A28669Q787o4213a68190a8260A64549o4809N571a98950A70937D9811
12692B40491q0466F3739L59340G6537J26468p3990R0568A9571J62106J52239B3262
12680a32096q9276E460L04781i9980E274a20389A41405c8056j59071B04880m1991
12669A62889l8718K79556b1245G9425a89331P6626A59523D0293b4506F689N2437
12658E9126B2050a09222j34917e8161B60923b56073A73797M2856a24863b243A73220
12646A01840a63345I5166l6628b6613o105j03556F6764d7507p5686E5592K2070
12635G7662M32569c03664g4678l16225B13789n9773Q8425b5521B16667C7730c1800
12623I2884J35726h6541K93c8858I7887a03162B01255r2229K06907H1548R8403
$$ y = [-172342, 128669, 137456, 73243, -168190, -18260, 164549, 99740, 105311, -198950, 170937, 49811, 240491, 160025, 63739, 423079, 76537, 203005, 129015, 219583, 19571, 181677, 333916, 23262, -132096, -221372, 5460, 310241, -99980, 5274, -120389, 141405, -38056, -197127, 204880, 162889, 124171, 403727, -21245, 79425, -189331, -112705, 159523, 40293, -24506, 6689, 59126, 22050, -109222, -244139, -58161, 260923, -256073, 173797, 216653, -124863, -2243, 173220, 101840, -163345, 95166, 58538, -26613, -32718, -136274, 66764, -47507, -123193, 55592, 77662, 510231, -303664, -74678, -390903, 213789, 154016, 242441, -25521, 216667, 37730, -31800, 92884, 228610, -86541, -86248, -38858, 97887, -103162, 201255, 109026, 315933, 81548, 179951]
12612A79951p0413J38477k6101a85818C09211a51684F4504J23511K13036b44016
12601I3426B8035J27705j8363a26367j17863B18724J6545K33547e8984k0785k8317
12590a08086B24747g1564o1903A8793L07102a4580p1671A14869b6903d863n4900
12579e9763q4893J4131A7333b82389B14814A06528e9171I0837a72724d2965n1058
12568i4023k20796C44640A35174A537Q1001b47650a1517l75686A8814Q9385b62917
12556a57669N455A32485d6191H3641f8956r3100O3462G7438f4701j11916G5052
12544B8362M3202h7756m1902M6472a0335k62049A48026a49891A73100c0375J3345
12533a7030A1854Q9688a29404p7536A57805l2570c8965m4527E2949b30602H3258
$$ y = [179951, 109538, 248015, 221914, -185818, 309211, -151684, 64504, 188015, 401051, -244016, 93426, 28035, 155740, 137377, -126367, -244230, 218724, 235269, 468816, -58984, -79769, -108086, 224747, -71564, -133467, 18793, 325895, -14580, -86251, 114869, -26903, -4863, -59763, -144656, -130525, 17333, -282389, 214814, 106528, -59171, 90837, -172724, -42965, -94023, -314819, 344640, 135174, 1537, 82538, -247650, -11517, -387203, 18814, 108199, -262917, -157669, -152214, 132485, -46191, 83641, -68956, -162056, -98594, 77438, -64701, -176617, 75052, 28362, 71564, -87756, -129658, -83186, -10335, -272384, 148026, -149891, 173100, -30375, -17030, 11854, 101542, -129404, -206940, 157805, 125235, -38965, -83492, 52949, -230602, 83258]
12521B4337J13205n7351K5782d37729a76671A39585a30980A42150F2963o282K6394
12510H3075J20158f7586p0230B81378a10688A42275b26522J7225i9625d0094F0243
12498A10195D5459a06744D9980K1024a71508f2850j88123N5391O8206K3096B94142
12486c2147m7423B33729M8444q1609b73477J07305A04898o64J76559b49749f8512
12474b49624f2943F5318Q5870b8783j63479a6809r0009B3391J70571e44321I1321
12462c15978G1270k0036J59504k2647o4741C6656a47730q0445f9779j66140a0035
12450b30030A33976L6707g714B98230a43040f4822R368m1521k2864j3260k63065
12439c96164n8370A30676i7762j16632I3143M9794c8027a7709m7549C7107M2231
$$ y = [24337, 137542, 80191, 105973, -437729, -176671, 139585, -130980, 142150, 62963, 56681, 83075, 203233, -67586, -137816, 281378, -110688, 142275, -226522, -209297, -99625, -40094, 60243, 110195, 45459, -106744, 49980, 71004, -171508, -62850, -250973, -195582, -127376, -104280, 294142, -32147, -79570, 233729, 282173, 200564, -273477, -166172, 104898, 104234, 280793, -249749, -68512, -249624, -62943, 65318, 151188, -28783, -192262, -16809, -106818, 23391, 193962, -544321, 91321, -315978, 71270, 51234, 210738, 188091, 123350, 36656, -147730, -228175, -69779, -235919, -10035, -230030, 133976, 170683, -7714, 298230, -143040, -64822, -55454, -96975, -119839, -133099, -396164, -454534, 130676, -97762, -214394, 93143, 142937, -38027, -17709, -65258, 37107, 79338]
12428G9338J59094j6948a61869N6929H4270b67890N6161B23991i1946H2832a73807
12416i1653D00278e1389l2764G6388B0940L6384a44315C2022a78823P7389d2929
12404b91989C8130A5129f7111J6578A98365D5531b1517q6517A05828R7355b46818
12392A90747c75410G48420a14341b6435A1495h5636r5210B78039I6764k0473a47045
12380c4022l85449R4978I2493a24402B42855M9061a06845b3953A89919a26785
12369A16982J40506A9804M4449J79644d2435B3094f7687b1043B19490b35926A78245
12357A75581a04511c9812B327K15458B3531J32846A1356a17699b8044A12571J7025
12346A29596A9037b41448B23344c09212a22617I6554a46073j7185G7958a19727
$$ y = [79338, 238432, 221484, -161869, -104940, 84270, -267890, -211729, 223991, -91946, 82832, -173807, -91653, 400278, -51389, -84153, 76388, 20940, 57324, -144315, 32022, -178823, -101434, -42929, -291989, 38130, 15129, -67111, -50533, 198365, 45531, -21517, -108034, 105828, 203183, -246818, 190747, -375410, 748420, -114341, -26435, 11495, -85636, -180846, 278039, 96764, 76291, -147045, -34022, -419471, -324493, 92493, -124402, 242855, 291916, -106845, -23953, 189919, -126785, 116982, 257488, 19804, 64253, 243897, -42435, 23094, -67687, -21043, 219490, -235926, 178245, 175581, -104511, -39812, 2327, 217785, 23531, 156377, 11356, -117699, -28044, 112571, 129596, 19037, -241448, 223344, -309212, -122617, 96554, -146073, -163258, 77958, -119727]
12335a54796C1884M83052a11714B01132I7878a48233f2437A31111A9784a57484
12324G0821h6405D14635a21261a860r1992E8538A2938a76126a0649C13660A53422
12312B36686D3616J72283r5159K28118E7193Q7978J25479I0513M03993a16825
12301C84422A07816e4857k2095D50459A78579B491M07235f0862I6559c3669A15477
12289f7699A78648N11158a99403D6775K00628J40661b9177F6358M68425A1810
12278B29759c516B95492J76936M1598A75978e7337B1608b22749g7461k9037j22423
12267b28921B18520n8767K45733b2307E544K80944D0035L73819A00027o710B5170
12255d2298H4212l5807J50024k3864O7614J09693j48245a76457C235M51134k13402
$$ y = [-154796, 31884, 514936, -111714, 201132, 97878, -148233, -62437, 131111, 19784, -157484, 70821, -86405, 414635, -121261, -1860, -93852, 58538, 12938, -176126, -10649, 313660, 153422, 236686, 43616, 215899, 120740, 348858, 57193, 145171, 270650, 90513, 494506, -116825, 384422, 107816, -54857, -76952, 450459, 178579, 2491, 409726, -60862, 96559, -33669, 115477, -67699, 178648, 689806, -199403, 46775, 247403, 388064, -29177, 66358, 534783, 11810, 229759, -3516, 295492, 472428, 514026, 175978, -57337, 21608, -222749, -77461, -106498, -228921, 218520, 159753, 405486, -22307, 5544, 286488, 40035, 413854, 100027, 93317, 25170, -42298, 84212, 48405, 198429, 174565, 242179, 351872, 203627, -176457, 3235, 454369, 240967]
12244B40967q5890R5788R3730I4164j7164j4994O1612M0589I894d7603B85181
12232a41400D2415a50709B53830E5192B6474c19883H5291a17261B85843C5620
12221B31680H8861P5312a8382B72169A22446K10286F6163B8464Q6071D3847M8806
12210I2653L92318I9115L85601a42388B01967c7846D25800j30091l3390j02781
12200A59538O3044c17105D97833a6062D24289H5303J36202Q528i4757A98886c20803
12188B11450e8315A8104P7731J01084I2035J63879N5851h4325G7632K44150q7409
12177B34373e8163B1840L47586j44069n3001i7598K7630A32813b9933f161A03027
12165g5999D68215A14426C1654L78182h7506A30211i3474G6032B6415K05447k7594
$$ y = [240967, 155077, 250865, 344595, 94164, 77000, 62006, 123618, 164207, 9894, -47603, 285181, -141400, 42415, -150709, 253830, 55192, 26474, -319883, 85291, -117261, 285843, 35620, 231680, 88861, 164173, -18382, 272169, 122446, 332732, 66163, 28464, 114535, 43847, 92653, 484971, 99115, 484716, -142388, 201967, -37846, 425800, 295709, 262319, 159538, 222582, -317105, 497833, -16062, 424289, 85303, 221505, 230033, -94757, 198886, -320803, 211450, -58315, 18104, 95835, 196919, 92035, 255914, 311765, -84325, 77632, 321782, 234373, -58163, 21840, 369426, 225357, 172356, -97598, -69968, 132813, -29933, -6161, 103027, -75999, 468215, 114426, 31654, 409836, -87506, 130211, -93474, 76032, 26415, 231862, 204268]
12154B04268a42102D25262b6134B10549J63415A4050L26498J29465k01298O8603
12144C37318D6072b50039C02005A26940E5399P3117R9017h6537A48008j8890a11358
12132b31839C7691r256b00017D250h4534A29871a59191B66909j3741j2579h5526
12120A76431K4483E0719M5917R1816C4378J48418l8529a15918o6154B38028m0197
12109A97831A3258P2583J28132J41649a09929I7998d1425A83691R2957K43466
12099E20114b09108B22744A909a26155e0744C06612G6326k4755J1464e7209A32077
12087b62742d8039p739P907A4448b26558D0908M07134k13271J05038A63883O7011
12076B30894j910J38824a16520a4352B5527K18367i2380I0474J64286b2509D31273
$$ y = [204268, -142102, 425262, -26134, 210549, 373964, 14050, 340548, 470013, 268715, 337318, 46072, -250039, 302005, 126940, 55399, 128516, 227533, -86537, 148008, 129118, -111358, -231839, 37691, 28435, -200017, 4250, -84534, 129871, -159191, 266909, 253168, 240589, -85526, 176431, 200914, 50719, 96636, 188452, 34378, 182796, 144267, -115918, -182072, 238028, 197831, 13258, 85841, 213973, 355622, -109929, 97998, -41425, 183691, 276648, 520114, -209108, 222744, 1909, -126155, -50744, 306612, 76326, 51571, 63035, -57209, 132077, -262742, -48039, -55778, -47871, 14448, -226558, 40908, 448042, 234771, 339809, 163883, 230894, 228984, 367808, -116520, -14352, 25527, 243894, -92380, 90474, 254760, -22509, 431273]
12064B17818J52957E136R3482f1831k03254C21573j26612J42330F8128m610P2105
12053A35623A2470O9220L34389f1130A85161P2646b55718B04302C0686J18561
12043A49247J68828D6102b43487A03163J05273c12803J24439n2383I4967J14521
12033B09488L7545b61780g5415j55776d4625f241B3955a50849A66963J63945j27934
12022B02974G8799J34470a51443K0341a7261B9140g1561k15507c5720n2953j11317
12011a99990A0940J2375J39240K57225A0447J66160E7382J80541h9646H9989P823
12000I7812g6878k37244A83340a4208j06416k3946A00075N1517k8675J68964o6035
11989B25846b57718f1801A19590d2581r8695C16132j42802b62766M1861d4972
$$ y = [217818, 370775, 5136, 98618, -61831, -265085, 321573, 194961, 337291, 68128, 63518, 135623, 12470, 81690, 416079, -61130, 185161, 257807, -255718, 204302, 30686, 149247, 318075, 46102, -243487, 103163, 208436, -312803, -188364, -240747, 94967, 209488, 247033, -261780, -75415, -231191, -44625, -6241, 23955, -150849, 166963, 330908, 202974, 78799, 213269, -151443, -131102, -17261, 29140, -71561, -287068, -35720, -88673, -199990, 10940, 23315, 162555, 419780, 10447, 176607, 57382, 237923, -89646, 89989, 97812, -76878, -314122, 183340, -14208, -120624, -144570, 100075, 151592, 122917, 291881, 225846, -257718, -61801, 119590, -42581, -141276, 316132, 173330, -262766, -220905, -44972]
11978B33896B3174a99559B52202b01765I1916K2874E5337K2887J72182A16338
11967b40049e9343A19771a26148C7318J59079Q8524b9104p6589o6981D1284b1694
11955b3441A34252c62053A89862b08898C28330j55000a90792A02600c19186I0346
11944E8646c00829J10295j72277A71915c06600C0724O7015l4565J93897i1649
11933a8635B09721m3709P6794A04294c31293B73377G6007b73510F4132b69467
11922A10619c39888A15805k7966a90519b923A26689E9666i452l8230p358A62983
11910b57169J00042B76052a47074A55334i2149A01948g7530p9754p0750d5280
11899B21503N0767m0129A1636b36970D0341K52043j19211b05319B7824a40607
$$ y = [233896, 23174, -199559, 252202, -201765, 91916, 114790, 55337, 78224, 250406, 116338, -240049, -59343, 119771, -126148, 37318, 196397, 284921, -29104, -105693, -172674, 41284, -21694, -23441, 134252, -362053, 189862, -208898, 328330, 173330, -190792, 102600, -319186, 90346, 58646, -300829, -190534, -362811, 171915, -306600, 30724, 97739, 63174, 257071, -91649, -18635, 209721, 166012, 242806, 104294, -331293, 273377, 76007, -273510, 64132, -269467, 110619, -339888, 115805, 87839, -190519, -2923, 126689, 59666, -9452, -47682, -55040, 162983, -257169, -157127, 276052, -147074, 155334, -92149, 101948, -77530, -157284, -228034, -45280, 221503, 272270, 232141, 11636, -236970, 40341, 292384, 173173, -205319, 27824, -140607]
11888i5331H1463J8498J33348B133K85564b40418a03170O49A15760b06109D6614
11876I811b19694C7657d2323C06104a15437k33971C9322J49518C1615a14733B1665
11864a36930K9077A24993A4457K00533a30746E8781a5863k08712i5906b7981H2670
11852A09866a57764E0816A8284i7968l01321A85300a13712p0480l4821O7893M520
11841a46600j7240Q0984b6228J2826j39050A41148a63424L2542l89715I2839J34260
11830B27099a40779E2972b09770i0961B070f8195j997J1733g933G7563l5593b4928
11817d1353j10649q6767h2591p6322F7233b48480d2775j96301A75537a26887D2762
11805c8023B22987a39469B33318q3048A8306a43558B54399M4270A47568d9858
$$ y = [-95331, 81463, 99961, 233309, 2133, 287697, -240418, -103170, -102521, 115760, -206109, 46614, 9811, -219694, 37657, -42323, 306104, -115437, -349408, 39322, 188840, 31615, -114733, 21665, -136930, -107853, 124993, 14457, 214990, -130746, 58781, -15863, -224575, -95906, -27981, 82670, 109866, -157764, 50816, 18284, -97968, -399289, 185300, -113712, -184192, -219013, -151120, -146600, -163840, -82856, -26228, -13402, -152452, 141148, -163424, -130882, -520597, 92839, 227099, -140779, 52972, -209770, -90961, 2070, -68195, -70192, -58459, -7933, 77563, 41970, -24928, -41353, -152002, -238769, -82591, -158913, 67233, -248480, -42775, -239076, 175537, -126887, 42762, -38023, 222987, -139469, 233318, 150270, 18306, -143558, 254399, 298669, 147568, -49858]
11794A30123A418J14660c10536H5115e9541j24535I4502b16743A36127a44233
11783C2010O1175f359G4887a40022A1712L6775L4565K05716j18162a88460D542
11771A2305N352j175a60627d8211p9694a0326G3669L9602J46602I6395a58935
11759h360j4478o7240j154B62887h3052k27006f5971r2032E6193a59357O3049
11748i6308m5568k698P492A1915D286a72658k1152h6296A48536J4590f5879m02
11736f6281n6938G5933h2131d0839n5050A24198h1313l75971a8403D60909j52347
11725C08562J97950c0537A36087J17466G9173J4406c03603A55044n080a9372A6792
11713A4316b88777e217C0722L16316C5754J29760a13510C4007d5031m600k5985
$$ y = [130123, 1418, 116078, -310536, 85115, -59541, -184076, 94502, -216743, 136127, -144233, 32010, 93185, -6359, 74887, -140022, 11712, 48487, 83052, 288768, 170606, -188460, 4542, 12305, 17657, 16482, -160627, -48211, -127905, -10326, 73669, 113271, 259873, 96395, -158935, -8360, -22838, -90078, -91232, 262887, -83052, -310058, -65971, -158003, 56193, -159357, -96308, -141876, -144574, -137082, 11915, 4286, -172658, -193810, -86296, 148536, 163126, -65879, -66281, -123219, 75933, -82131, -40839, -95889, 124198, -81313, -457284, -18403, 460909, 308562, 506512, -30537, 136087, 253553, 79173, 93579, -303603, 155044, 149964, -19372, 16792, 14316, -288777, -5217, 30722, 347038, 35754, 165514, -113510, 34007, -45031, -49631, -75616]
11702g5616j32599Q6992D0634d14333i4073C45669A27941j750j887J31641j8252
11691B37693l4205L2796b84270A44006a00085J0576C40022a89660Q8560F6784
11680a0437I2846g1251B91057D1969a77718A53680M1882c96674a97098A68854
11669C5013a5453E3694J27494e56998a3059j11381K1609l60096I8873b06878A66043
11657B7277K33332j13906k9217l5522F630c94446C47654A34621b87822Q1848A95441
11645D9088K55014p5516n7039B9463R6434B919K39614c71270A56723A063a99296
11633D0253a6525I2541C5094a16736A45689B5907L75705j46330j07323A180K45230
11622B46410K1256J64375d9269B20586K39271A36025P1700c0229l5018k6961E5104
$$ y = [-75616, -208215, -121223, 40634, -414333, -94073, 345669, 127941, 126191, 124304, 255945, 237693, 203488, 236284, -284270, 144006, -100085, -89509, 340022, -189660, -101100, 66784, -10437, 92846, -71251, 291057, 41969, -177718, 153680, 195562, -396674, -197098, 168854, 35013, -15453, 53694, 181188, -556998, -13059, -124440, -102831, -462927, 98873, -206878, 166043, 27277, 260609, 146703, 117486, 81964, 6630, -394446, 347654, 134621, -287822, -205974, 195441, 49088, 304102, 228586, 171547, 29463, 125897, 2919, 242533, -371270, 156723, 1063, -199296, 40253, -16525, 92541, 35094, -116736, 145689, 25907, 401612, 255282, 147959, 1180, 246410, 267666, 432041, -49269, 220586, 459857, 136025, 207725, -30229, -65247, -92208, 55104]
11610A68141a67459g9076A35790g1376o5890A96000Q074b0773A97679j2985d28510
11598a92543D3451d59276a9766j1319B19760H954i6127E8236B4284b5604D1131
11586f8131l29823A82924E66L3639K71500a87513F0195L2550a94754m0173B81574
11574a085j22213A66523h5691B12059N4777j2052A15343K79811B9726J0091i3718
11562A86191c86961g0499b4876F9606Q110C358a61081f3183A01836e7120b6878
11550b38444I2716A011a3811l01933A57490a85538h7824F7120J68504c9136j41061
11539a80197H7960J56949j1885R5447A59862J21579I9125J47187a43593A57185
11528G6318a60719B3465h2447r3872g5031j29656E14955j54496A19563L2752b8971
$$ y = [168141, -167459, -79076, 135790, -71376, -137266, 196000, 204074, -20773, 197679, 184694, -428510, -192543, 43451, -459276, -19766, -31085, 219760, 8954, -96127, 58236, 24284, -25604, 41131, -68131, -397954, 182924, 566, 34205, 305705, -187513, 60195, 92745, -194754, -234927, 281574, -1085, -123298, 166523, -85691, 212059, 266836, 254784, 115343, 395154, 29726, 39817, -93718, 186191, -386961, -70499, -24876, 69606, 77716, 3358, -161081, -63183, 101836, -57120, -26878, -238444, 92716, 1011, -13811, -315744, 157490, -185538, -87824, 67120, 235624, -39136, -180197, 87960, 244909, 233024, 328471, 159862, 281441, 99125, 246312, -143593, 157185, 76318, -160719, 23465, -82447, -176319, -75031, -204687, 514955, 360459, 119563, 152315, -28971]
11516B98961a54152j01107F8743a42074D13331a86490C5441L54826A07236M8579
11506A55815J68228p1301b67961B57773a18620A25644L05b2406A14022i1275A36618
11494C9221P7646c7205p8405n4062H247O3166a11877j07459A45786a77063C19885
11482a71328A20851P0324j9579J9939N7600b42891A64467d1585A8385L39138D7307
11470I4807a56859L1660k18393I3513N6788J66849E8084J48312J01323A52805
11459b3969B78784d1595C15816K1049J4390C1586L36347C1853k429J19569a17856
11447B97408r2076e1110C91121P1524C6684J47798e0088A73490n1537R2821a08145
11435f6839C5731J95187O7398r7010a08327k41902A73037m5934j9406K7934j9880
$$ y = [298961, -154152, -255259, 68743, -142074, 413331, -186490, 35441, 390267, 107236, 155815, 324043, 252742, -267961, 257773, -118620, 125644, 125949, -22406, 114022, -91275, 136618, 39221, 116867, -37205, -115610, -169672, 8247, 71413, -111877, -219336, 145786, -177063, 319885, -171328, 120851, 191175, 171596, 191535, 249135, -242891, 164467, -41585, 18385, 357523, 47307, 94807, -156859, -125199, -343592, 93513, 150301, 317150, 58084, 206396, 307719, 152805, -23969, 278784, -41595, 315816, 336865, 351255, 31586, 367933, 31853, 29424, 148993, -117856, 297408, 205332, -51110, 391121, 462645, 36684, 184482, -50088, 173490, 121953, 214774, -108145, -66839, 35731, 230918, 298316, 201306, -108327, -350229, 173037, 127103, 107697, 135631, 115751]
11424A15751a52483O8089l82531C53070j39329J13460a54305A63262k0017f3711
11413G4196J51296L6202c96000a42775A4888e869r3771b0478n2756j69356A83278
11401a1489M401A74217o573B8000J00534b28991M9527j7813A06724q004b8215
11389d8366F7926a43888A22026J40586d6747b1795k40054f2369B08572a64516
11378I0527C5607P9132f7429E9916J07207L6451f7146r846n0984d9090C573L33352
11366C36925f79669f2602m9034j3863j47630N7105r4104A71408G1374a02245C4610
11354a93473h610m07839A70165p6329a55920B2337f37935a39881B20679b57739
11343a40642E0982O129e5424j58333A56986c20865J51235a6357r1198k41325a39139
$$ y = [115751, -152483, -84394, -466925, 353070, 213741, 327201, -154305, 163262, 143245, -63711, 74196, 225492, 261694, -396000, -142775, 14888, -5869, -99640, -20478, -73234, -242590, 183278, -11489, -7088, 174217, 167644, 28000, 128534, -228991, -179464, -197277, 106724, 98720, -28215, -48366, 67926, -143888, 122026, 262612, -46747, -21795, -261849, -62369, 208572, -164516, 90527, 35607, 114739, -67429, 59916, 167123, 203574, -67146, -76992, -127976, -49090, 3573, 336925, -679669, -62602, -111636, -125499, -273129, -216024, -310128, 171408, 71374, -102245, 34610, -193473, -8610, -416449, 170165, 93836, -155920, 22337, -637935, -139881, 220679, -257739, -140642, 50982, 57111, -55424, -213757, 156986, -320865, -169630, -16357, -107555, -348880, -139139]
11331H4634a50549e2722E0834i80j07881A55844N5591c5464D5113a21651a8241
11319F033h1586j7678A73431q641f321r6751K7903B78902D5807c05348J01253
11308b04095A29150J63934K8847i4090k9178B6279d37845B13824L1541F9167k0340
11297D8827J25916a70951c5459p7972m9261H6990a42231d3516l51226a04797B5790
11285a2047m2263a3915j36763p9165A70011g6154c1383l69522J27644e9273A81074
11273b14688h9464A22820K05256a60466J987A52308b4868E7815j5205f3024j11411
11262a74435l7668k7040d1304B2269c6461o5487m3626j12814i3500J7208A00998
11250a82181A76302G6626g6853p8576A96222a13743d9694p6026E2404c1269j32794
$$ y = [84634, -150549, -52722, 50834, -980, -108861, 155844, 211435, -35464, 45113, -121651, -18241, 6033, -81586, -99264, 173431, 164790, -6321, -103072, -75169, 278902, 45807, -305348, -204095, 129150, 293084, 321931, -94090, -123268, 26279, -437845, 213824, 245365, 69167, 48827, 174743, -170951, -35459, -113431, -162692, 86990, -142231, -43516, -394742, -104797, 25790, -12047, -54310, -13915, -150678, -229843, 170011, -76154, -31383, -400905, -273261, -59273, 181074, -214688, -89464, 122820, 328076, -160466, -158479, 152308, -24868, 57815, 42610, -63024, -174435, -212103, -239143, -41304, 22269, -36461, -101948, -145574, -258388, -93500, -76292, 100998, -182181, 176302, 76626, -76853, -155429, 196222, -113743, -49694, -125720, 52404, -31269, -164063]
11239a64063b8184m99186A81578E1502a19848e3332o2189m1613K5210l5879D9832
11227A91306g0101C47709a04148A15808i9312m4340o9463A29214a19172J4630
11217a04542D0976K7657J82502c52231p6481E659K94206a29495A962a90017B6048
11205C35675b02809M3308A899K36421g9234j00068N8222k45464a00376j07994
11195b08370e4244j23842d9831p6851L7008C6898g1072A54883h2551j28260F2667
11183f3128G483Q5801q973J02121c5447I8545a17715L3371C96174a92525o171
11172a98696e9184D255a12496a4279F4219j1322J52906a64668A93159J12564c45764
11160a83211F0798h1732J0272A53151h2270J6691p0486J7407a5760A02408b05201
$$ y = [-164063, -28184, -527370, 181578, 51502, -119848, -53332, -115521, -157134, -131924, -167803, 49832, 191306, -70101, 347709, -104148, 115808, -99312, -143652, -213115, 129214, -119172, -104542, 40976, 68633, 251135, -352231, -428712, 5659, 299865, -129495, 1962, -190017, 26048, 335675, -202809, -159501, 1899, 238320, -79234, -179302, -121080, -366544, -100376, -208370, -54244, -178086, -49831, -126682, -89674, 36898, -71072, 154883, -82551, -210811, 62667, -63128, 7483, 93284, 84311, 186432, -35447, 98545, -117715, -84344, 396174, -192525, -198696, -59184, 4255, -112496, -14279, 64219, 52897, 205803, -164668, 193159, 305723, -345764, -183211, 60798, -81732, -71460, 153151, -82270, -65579, -136065, -118658, -15760, 102408, -205201]
11148a57803e2795F9329a24965j67751a40218q8725A53744d8610k09776C23715
11137b49303A350K73517b04740C2754R2861m629b71156g4311k04522a25085B48556
11125A9744b30079o6169A65456a58242c5791j46933H2601a17058p4306j8907c0999
11113a53474i644j0997O703k90096C3183o696a84535j838G2177e1056H6212j2786
11101G3426a66670b7220o5908a7270B27538A06343k2663J90740c7367l975A91186
11089A8238J02493O4072b8047C89073A41358L97612A33105d48713A18960b6141
11078b0980C700a07054A21810a4292j44611A34939D5808K06792o1406J27979A07549
11066a01613I0107K55183e2564B88899A08529B0174J90041p8670N6089a21832
$$ y = [-157803, -52795, 69329, -124965, -292716, -140218, -228943, 153744, -48610, -258386, 323715, -249303, 1350, 274867, -204740, 32754, 125615, 120986, -271156, -74311, -278833, -125085, 248556, 19744, -230079, -296248, 165456, -158242, -35791, -182724, 82601, -117058, -191364, -210271, -30999, -153474, -9644, -20641, -13938, -304034, 33183, 26487, -184535, -186373, 72177, -51056, 86212, 73426, -166670, -27220, -93128, -17270, 227538, 106343, 83680, 274420, -37367, -41342, 191186, 18238, 120731, 184803, -28047, 389073, 141358, 538970, 133105, -448713, 118960, -26141, -20980, 3700, -107054, 121810, -14292, -158903, 134939, 45808, 252600, 191194, 319173, 107549, -101613, 90107, 345290, -52564, 288899, 108529, 20174, 210215, 131545, 187634, -121832]
11055A00564C7569K82610a13442C61023r9997J8260J04553q7750R4051j34466
11045B55674P1153r3526J27669P9109a914E25061B62451Q5345K04453m2031J26681
11034F36899B58689J24308L48134B42038M44270B69691M82130B49431K58595J67457
11024F75483k04730J34546J51692C64129n2107K24491k7385M9732B25609K23187
11014D48796K76030k73797j23962K40577k1632k38072M26432B52431N62541J40355
11004I55327B39428J16555L23007B67071J12932P9556n9475K76224p5476J32394
10994G33226k94892d3818B91622K46493M5581j5222k76280q1145K42190B22258
10983G89068j69580J34539B75851K96120j48374J22872J5993j9768M3452J08763
$$ y = [100564, 37569, 320179, -113442, 361023, 261026, 279286, 383839, 296089, 390140, 255674, 326827, 233301, 360970, 440079, -1914, 525061, 262451, 347796, 552249, 510218, 636899, 258689, 382997, 731131, 242038, 686308, 269691, 751821, 249431, 508026, 675483, 470753, 605299, 756991, 364129, 312022, 536513, 509128, 558860, 225609, 448796, 724826, 451029, 327067, 567644, 546012, 307940, 734372, 252431, 814972, 955327, 239428, 355983, 678990, 267071, 380003, 459559, 400084, 676308, 600832, 733226, 438334, -43818, 291622, 538115, 583696, 568474, 292194, 211049, 453239, 222258, 789068, 619488, 754027, 275851, 571971, 423597, 546469, 562462, 542694, 586146, 694909]
10973F94909j63225K01138K179j04250J73181J8814j63421j66047J17056j58771
10963D51563L53588M23291j47498J40621K36788q8689K2543K50708M08966j8659
10953B033222Q8851j23948j03158m6444j65632j2662k63985J16554k8451J54329
10943A648676m56587L75572l4128J36851l5973M9933n9163P0858l66025J9068
10933A349082m47877N6234j94875J71588l62322K3974k77766o0965K3163J23291
10923D03527b45896G4211J41185F3565l1503a88595B86500A25899b39969J07393
10913a32576C93069a7328n3365A12752l0138j6146k2721J88843H8617b15215A47270
10901A58237P5380d08212B6715J8737a52544l1117e0874l7293j3988j73693A98949
$$ y = [694909, 531684, 732822, 735001, 630751, 803932, 822746, 659325, 493278, 610334, 451563, 805151, 1228442, 1080944, 1221565, 1458353, 1369664, 1392207, 1642915, 2051881, 2033222, 2122073, 1998125, 1894967, 1848523, 1682891, 1670229, 1406244, 1522798, 1494347, 1648676, 1192089, 1567661, 1533533, 1670384, 1634411, 1684344, 1625181, 1696039, 1330014, 1349082, 901205, 957439, 762564, 934152, 571830, 595804, 318038, 257073, 280236, 403527, -245896, 74211, 215396, 63565, 32062, -188595, 286500, 125899, -239969, -132576, 393069, -17328, -70693, 112752, 82614, 66468, 43747, 232590, 88617, -215215, 147270, 158237, 233617, -408212, 26715, 45452, -152544, -183661, -50874, -88167, -102155, -275848, 198949]
10889a11100A23859b11249n7026a30877k25619e3224A63477L4119B367L04671
10879C07038c9098B50651C3648b72162J11440b4170p1221p0312p0215G4290Q2872
10868A57162a28131R846j57376a729E4118j3893A3961J25841b18884h8737m423
10857i3160A25050H562b54761J18478P476A1761b84334H3137a75326b0544p9972
10846a00516A71773c51557q357a66291b7312q4125A53203E4060M6382a56315K6732
10835a29583o0956j17358B86157A00960g4801L4535G234a63856N9128b5038l39677
10824c64715c5030F5836J1885b2217F0131a33534B41791a96725B9148O9636a46554
10812d1158A51233L3602g3034j4496j39903a08290k58219A50401c33154A90716
$$ y = [-111100, 123859, -211249, -268275, -130877, -356496, -53224, 163477, 197596, 2367, 307038, -39098, 250651, 33648, -272162, -160722, -24170, -95391, -165703, -235918, 74290, 157162, -128131, -118285, -275661, -1729, 54118, 40225, 13961, 139802, -218884, -88737, -93160, 125050, 8562, -254761, -136283, -128807, 11761, -284334, 83137, -175326, -20544, -100516, 171773, -351557, -359914, -166291, -27312, -111437, 153203, 54060, 100442, -156315, -129583, -190539, -307897, 286157, 100960, -74801, -40266, 7234, -163856, -104728, -25038, -364715, -35030, 65836, 77721, -22217, 60131, -133534, 241791, -196725, 29148, 98784, -146554, -41158, 151233, 184835, -73034, -87530, -227433, -108290, -366509, 150401, -333154, 190716]
10801A5641d72379B6000J4894g5132m04361J35643A27460a73025A55745o0484
10791I5261a25416A36535a66578q1313B0430e3500j41887E6695b73282E3151d06180
10779a00252k7255j76181A99124d37246c3433A84470a91020B3856M4383e37858
10768F6467b94447M0147a11100j25677H3659O3483b88633O8504A28840b16438
10757C1201f3364R286A08361b32288A33144o6116c39659g9029A899N4983b18240
10745a04515J0314b8916A10272a14182A04034A0549L5748a30663I2149a27226
10734b48282d6712a585k49369D6669i4452A30943b21878l3810g026E3398a43773
10722e0921k9106A32905f3039E2777a06034m988j54370j80271d8281A16397a92388
$$ y = [15641, -472379, 26000, 40894, -75132, -479493, -343850, 127460, -173025, 155745, 95261, -125416, 136535, -166578, -247891, 20430, -53500, -195387, 56695, -273282, 53151, -406180, -100252, -127507, -303688, 199124, -437246, -33433, 184470, -191020, 23856, 68239, -537858, 66467, -294447, -254300, -111100, -236777, 83659, 147142, -288633, -220129, 128840, -216438, 31201, -63364, -54078, 108361, -232288, 133144, 67028, -339659, -79029, 1899, 56882, -218240, -104515, -94201, -28916, 110272, -114182, 104034, 10549, 46297, -130663, 92149, -127226, -248282, -46712, -1585, -250954, 46669, -94452, 130943, -221878, -255688, -7026, 53398, -143773, -50921, -80027, 132905, -63039, 52777, -106034, -111022, -265392, -445663, -48281, 116397, -192388]
10710A58665f7019B23445H1530a47839d7083B55716G2087M7301a14258m1724l174
10699a59156o4783j422j3374I4546a14075e4734j48866i6782b479D238a32671
10687a20428A04124c5836A54180K17785A65309B902c62612h6007C9261R2692K4767
10676A56720B0476O9909b32586j05133A00375b95350d2902j03392l0052D5942
10665b9223j04018f1060m03346A8525a52692r8612g8825j26137D9691f441o9797
10654g6238c694l11941A77553c6853o7283j63398k4238L8384g0976C31848f1877
10642a86529E0961R1153b12845A72038o8879a49185m21411a13429D1026L0382
10632G1408J8212d4259k63353j30346h9986k36712h5620j01725J4766A54231J0070
$$ y = [158665, -67019, 223445, 81530, -147839, -47083, 255716, 72087, 119388, -114258, -155982, -159156, -223939, -225361, -238735, 94546, -114075, -54734, -203600, -96782, -2479, 4238, -132671, -120428, 104124, -35836, 154180, 371965, 165309, 2902, -362612, -86007, 39261, 131953, 156720, 20476, 90385, -232586, -337719, 100375, -295350, -42902, -146294, -176346, 45942, -29223, -133241, -61060, -464406, 18525, -152692, -251304, -78825, -204962, 49691, -6441, -76238, -3694, -315635, 177553, -36853, -104136, -267534, -291772, -253388, -70976, 331848, -61877, -186529, 50961, 142114, -212845, 172038, 103159, -149185, -570596, -113429, 41026, 71408, 89620, -44259, -307612, -437958, -89986, -326698, -85620, -187345, -172579, 154231, 164301]
10621A64301C7812K75398H2690a72221m634D8574b57253d4149l54778a11198d2600
10609b32849h7636k0978B82984h4584A54776a95948L7929B75128C9196b65462
10598c45893a09843M089E8822J11997n7572b96063k1353c0372k16739i1267k0389
10587a11656H1872b47034a17284m9113p5059R7366j77979F6506O5491b69085J2903
10576b56182d8789b604A48696b2861k65066A3512a37052k05362a24464d2492A15663
10564e79467c7478A09692D4754a29674A60571e4755a6100j53896O2901M2127A68274
10552b31978d139A89891H8964c30879A18163e8292j40379A84707O611G9725M4321
10541A24046e9769r3109c4548A67446G7566C7605b81921J05034B00538g2994j01680
$$ y = [164301, 37812, 313210, 82690, -172221, -176855, 48574, -257253, -44149, -398927, -111198, -42600, -232849, -87636, -108614, 282984, -84584, 154776, -195948, -158019, 275128, 39196, -265462, -345893, -109843, -105754, 58822, 170819, 113247, -296063, -317416, -30372, -247111, -91267, -111656, 81872, -247034, -117284, -166397, -241456, -144090, -322069, 66506, 131997, -269085, -256182, -48789, -2604, 148696, -22861, -287927, 13512, -137052, -342414, -124464, -42492, 115663, -579467, -37478, 109692, 44754, -129674, 160571, -54755, -16100, -169996, -107095, -64968, 168274, -231978, -4139, 189891, 88964, -330879, 118163, -58292, -198671, 184707, 191318, 79725, 124046, -59769, -152878, -34548, 167446, 77566, 37605, -281921, -176887, 200538, -72994, -174674]
10530a74674c0277A63267h7860C5497J43880C3635K38167a43271L5469A84341
10519F4001B6339d10995j09J67750G2955b7831A98318b62451j631m3700D3760
10507i3606n3222e3580j15809B1326b14191N7097E6656J05745b93466J42993G6878
10495C28570G1672k8895R7057b63488H8202c38751b0560p3154a8913H6885L0344
10484A17229K5569a09089A67403f4413r9539f9823l06489g7440B74496A14221
10473A69681c8422O216l0803E531b0944A68710a465G3323h3122A17316a22150
10461B71588G0422N66288B72189M6681p5333j7955D5567a25304m1891A7976a27029
10449B0215b02054B12225a58644l4034k62836J45732C66187A5893b66998e4760
$$ y = [-174674, -30277, 163267, -87860, 35497, 179377, 33635, 271802, -143271, -107802, 184341, 64001, 26339, -410995, -411104, -243354, 72955, -27831, 198318, -262451, -264082, -307782, 43760, -93606, -146828, -53580, -169389, 21326, -214191, -157094, 56656, 162401, -293466, -150473, 76878, 328570, 71672, 42777, 139834, -263488, 88202, -338751, -20560, -93714, -18913, 86885, 117229, 142798, -109089, 167403, -64413, -163952, -69823, -376312, -77440, 274496, 114221, 169681, -38422, -32206, -63009, 5531, -20944, 168710, -1465, 73323, -83122, 117316, -122150, 271588, 70422, 636710, 272189, 318870, 243537, 225582, 45567, -125304, -167195, 17976, -127029, 20215, -202054, 212225, -158644, -192678, -455514, -309782, 366187, 15893, -266998, -54760]
10438E382J607J23304A7283a43052b8761C8955C569J5944c17100f8477D0659j7607
10426B3052a4893l12341J59087e8932k79693J59895k07631C97775A4182R5546
10416A09728J68818c6629j62898C48192a49213L0571L0490e950A92411a95338
10405i6140k20464L7565j9009J17190K8900L8737L0835B49188e8087j24557J9273
10394a63371o7021G5193e9982j03114D8604b91907a4470j62879C0965K05806c67907
10382B3408h2475B80160a49261g4108A1139J66673p6365J07216j2725b8714o3304
10371i2018G660R98J6693a28928D7968L55011a84588e0238B51013a71251Q3585
10360h7666C1356h6306A86416i8012C74200a99529B09522L2521K13261J7382j53751
$$ y = [5382, 6989, 130293, 17283, -143052, -28761, 38955, 3569, 19513, -317100, -68477, 40659, 23052, -14893, -327234, -168147, -58932, -338625, -178730, -386361, 397775, 14182, 109728, 278546, -36629, -199527, 348192, -149213, -118642, -88152, -5950, 192411, -195338, -96140, -316604, -279039, -298048, -180858, -151958, -113221, -82386, 249188, -58087, -182644, -163371, -230392, 75193, -59982, -163096, 48604, -291907, -14470, -177349, 30965, 236771, -367907, 23408, -82475, 280160, -149261, -74108, 11139, 177812, 101447, 208663, 195938, -28714, -92018, 7660, 8658, 25351, -128928, 47968, 402979, -184588, -50238, 251013, -171251, -87666, 31356, -86306, 186416, -98012, 374200, -199529, 209522, 242043, 455304, 472686, 318935]
10349C18935K4506j00137J23152A14748j4879K88943j50898R1975J12763p7066
10339C65586j26224r1493P2396d8907A19696o470K12553o1406P8480B614J12891
10328A15505J13952K91027k19542D8434a9882B18766C9361L5584R1942J88368
10318C55255F3531a0279q7013A35565d8069A45044J51517j11087G292J23570j7535
10307A13327a87259h1555j52657A03594K62804J43394I9895P0041m6757e3081
10296A67969J5844B9324l083K0591p396a98357f7601o7857o5431F5812J35398
10285B01210g8613A76016b88923D3981K90822C0704O6516K8345d90353K15125
10275b75228A31767d6616G6575A1970c1137C60409h8222A81808a62147j61056
$$ y = [318935, 343441, 243304, 366456, 114748, 99869, 388812, 237914, 329889, 442652, 365586, 239362, 147869, 220265, -48907, 119696, 113226, 325779, 264373, 342853, 2614, 115505, 229457, 520484, 300942, 48434, -19882, 218766, 39361, 74945, 166887, 355255, 63531, -10279, -97292, 135565, -48069, 145044, 296561, 185474, 7292, 130862, 113327, -187259, -81555, -234212, 103594, 366398, 509792, 99895, 169936, 123179, -53081, 167969, 183813, 29324, 26241, 46832, 39436, -198357, -67601, -135458, -200889, 65812, 201210, -78613, 176016, -288923, 43981, 334803, 30704, 97220, 125565, -490353, -275228, 131767, -46616, 76575, 11970, -31137, 360409, -88222, 181808, -162147, -323203]
10265c23203a47943j44245J11708K9656j02454A55823b03978N7138m9510l4713
10255b31063B27335d84480d4279B14175J201q9619c22260i2301k2777P150h305
10243D3698a9188l7919j61934c4224B26838M39771a29029b9016B35910D8780J72324
10232B21104J0357H8372b11373g5143k45946A20102C3935a91775g7068D3101a8305
10220a71447f9436R076k9456l08620L6941L7937a20491k34250F7974P475a78233
10208b31496A3272c14435H8670c7759j77298E1025d6946l47553h442o4331j73415
10197b46188C9509f7532j35278A30100c10857b8308C0332a17146H4485d33499
10186h9487k25336h3271r4100J0241a7945C4826a64318j6504J5565B44386d15574
$$ y = [-323203, -147943, -292188, -180480, -150824, -253278, 155823, -203978, -146840, -196350, -231063, 227335, -484480, -44279, 214175, 215376, 125757, -322260, -92301, -115078, -107928, -8305, 43698, -19188, -57107, -219041, -34224, 226838, 666609, -129029, -29016, 235910, 48780, 221104, 231461, 88372, -211373, -75143, -321089, 120102, 33935, -191775, -77068, 43101, -18305, -171447, -69436, -60360, -89816, -398436, -361495, -323558, -120491, -354741, 67974, 75449, -178233, -231496, 13272, -314435, 88670, -37759, -215057, 51025, -46946, -394499, -8442, -72773, -246188, 39509, -67532, -202810, 130100, -310857, -28308, 30332, -117146, 84485, -433499, -89487, -314823, -83271, -177371, -167130, -17945, 34826, -164318, -180822, -165257, 244386, -415574]
10174b26342R1440c5631A26149c7753k60501a32432j8784g4228M774k42919b9229
10162i9969l15029A64927J59255a41725e8322k6047l99229K07219a35790A15e0017
10150b39186A20506B0155J32821c2526A97464b0088k11091A06669d56622d2227
10139A1488Q1759J45700d36574G0142f5756k57905J10195l31001B25764c54944
10128B9143a17640C27515b62648H7907C4280K06170a37532G2455K1647c53967
10117a30890j52355c0501A8857c6179N008m03804B056h3284B48421k2401a51847
10105G6655P5372b67956O0341A17173b65466j86615f1627j21190I1902a23123
10094a79806Q1533A27742e6437j00727M6408E0870C931e3463A76830b6555A01963
$$ y = [-226342, -134902, -35631, 126149, -37753, -298254, -132432, -151216, -74228, -69454, -312373, -29229, -99969, -414998, 164927, 324182, -141725, -58322, -84369, -483598, -276379, -135790, 115, -50017, -239186, 120506, 20155, 152976, -32526, 197464, -20088, -231179, 106669, -456622, -42227, 11488, 93247, 238947, -436574, 70142, -65756, -323661, -213466, -544467, 225764, -354944, 29143, -117640, 327515, -262648, 87907, 34280, 240450, -137532, 72455, 94102, -353967, -130890, -283245, -30501, 18857, -36179, -31171, -434975, 2056, -83284, 248421, 226020, -151847, 76655, 152027, -267956, -207615, 117173, -265466, -452081, -61627, -182817, 91902, -123123, -179806, -98273, 127742, -56437, -157164, -110756, 50870, 3931, -53463, 176830, -26555, 101963]
10082A06349g3094G459a15708I3692a67444M2500B900K8624a57323d6837k01720
10071b48557d1690j24697j50585f2396D7276a36234a727j66532j05024P1747I6560
10059b42116g3870D2588d6105B81870a96089J8666C2923b67495M2155k21491K1430
10048d25401a45957k85285a81451f1111B0125c15877A64561i8425k30945C9454
10037a71329k318K6563f7260k68297A48054a16245q4910B33592E818a26976H8615
10025b61849A4567c01309h87A01286a01978a0080k3526I841b16924C1142M8789
10014G9931f8910a1775C56516C405a3766e252l08800A2872b17081E6878e5570
10002c48716a03902F8859o032c54656h0253q6770D6704c15390h3511A21330g2752
$$ y = [106349, -73094, 7459, -115708, 93692, -167444, -124944, 2900, 31524, -157323, -46837, -248557, -41690, -166387, -316972, -62396, 47276, -136234, -1727, -168259, -273283, -201536, 96560, -242116, -73870, 42588, -46105, 281870, -196089, -177423, 32923, -267495, -225340, -446831, -425401, -145957, -431242, -181451, -61111, 20125, -315877, 164561, -98425, -329370, 39454, -171329, -173647, -147084, -67260, -335557, 148054, -116245, -201155, 233592, 5818, -126976, 88615, -261849, 14567, -301309, -887, 101286, -101978, -10080, -33606, 9841, -216924, 31142, 79931, -68910, -11775, 356516, 3405, -13766, -5252, -314052, 12872, -217081, 56878, -55570, -348716, -103902, 68859, 62827, -354656, -80253, -167023, 46704, -315390, -83511, 121330, -72752]
9990f8776D3242d86746d8009n5356F3587K8727j4187b21499b6919H865J12195
9979A21060d6232A08340C7852K77416a48774j8617G2757c54848a7209j11064I1363
9967a7876C31467a73813k77224a97538G1151a12052n0772H3614c17255j100J08616
9956b09739B40642a34371K3239B30961F3441n00b16845N4758k26897a59761j1609
9945a71370d206q4486a1710I9594K12107b35126a375l88696K7547o7780J87643
9934b42661G9484B8848c27533a07536B2981J92026o6589D8155c4947H1520R1556
9923A73076C0930a96034J7269k10088B84064j03224f8005k5488F5547J8048b84651
9911g3426k37504i9153m726K4936A79903N1605a31453C5547c66205i9403J641
$$ y = [-68776, 43242, -486746, -48009, -103365, 63587, 92314, 78127, -221499, -26919, 8865, 121060, -46232, 108340, 37852, 315268, -148774, -167391, 72757, -354848, -17209, -128273, 91363, -17876, 331467, -173813, -451037, -197538, 71151, -112052, -162824, 83614, -317255, -318355, -209739, 240642, -134371, -111132, 230961, 63441, 62941, -216845, -162087, -388984, -159761, -171370, -4206, -88692, -11710, 99594, 311701, -235126, -1375, -390071, -362524, -430304, -242661, 79484, 28848, -327533, -107536, 22981, 215007, 148418, 48155, -34947, 81520, 173076, 30930, -196034, -178765, -388853, 284064, 180840, -68005, -93493, 65547, 83595, -284651, -73426, -310930, -99153, -103879, -78943, 179903, 231508, -131453, 35547, -366205, -99403, -97762]
9900i7762E03431a16191A2783a13536q2395A71718D1126K19645A3004a8628D6078
9888a94636o9801d0410B16022G5823i1508A6132a03770b8594m7757A68565k3890
9877A44675J39633E3576a41144j59191D0376M96K19302J3326d1086A46782g7759
9865C86371b57574A48599a9445n77940A20635a77116J3298B4162R2885L5198d70256
9853A70059c7731A37048e5049l10546A18270k8237J19832a56183M124q9132G9383
9841G6436e6937j8545j58212h7875L4828k93112A42428a30309j02930a10948j068
9830a12016A32024b64643A65445a9068l36866a25230k1235E5822a37693B4861
9819a99404p441j7321J10400d8049C6516e6377k87616O9244r112A61163j095b2536
$$ y = [-97762, 503431, -116191, 12783, -113536, -195931, 171718, 41126, 260771, 13004, -18628, 46078, -194636, -264437, -40410, 216022, 75823, -91508, 16132, -103770, -28594, -76351, 168565, 144675, 284308, 53576, -141144, -300335, 40376, 40872, 260174, 273500, -41086, 146782, -77759, 386371, -257574, 148599, -19445, -597385, 120635, -177116, -163818, 24162, 117047, 152245, -470256, 170059, -37731, 137048, -55049, -365595, 118270, 90033, 209865, -156183, -152059, -241191, 79383, 76436, -56937, -75482, -233694, -87875, -53047, -346159, 142428, -130309, -233239, -110948, -112016, 132024, -264643, 165445, -19068, -355934, -125230, -146465, 55822, -137693, 24861, -199404, -206845, -224166, -113766, -48049, 36516, -56377, -343993, -274749, -283861, 161163, 160068, -22536]
9806h0478D860e1349l7791c6984k69763p198J35668A59387i3623A29994a4337
9794d74330Q8170J88537B65217a48997A74233d0360r4071M1055a0479B68489k9688
9783B38801g2006F2602a6760j51084j11543J6546E2963a37443B5511Q7107a31054
9771a45534j71250H7417L0424i3005E5816i4756l4241n5600d7864l35962B87274
9759c80136a77364J9803j89932B11210c32006Q1746j94930b14857a185C9776K67031
9748C06807A07862a31098j42901b6973G5434L992A4426M7530P4580b84219a29084
9736C62372b13079B77497m7166h7895l6615j11957L0111h7361A75964J3520C2472
9724c7945m2432C46191j70702a41392j36738j99762D7299c5999A3468L5888h953
$$ y = [-80478, 4860, -51349, -89140, -36984, -306747, -313945, -178277, 159387, -93623, 129994, -14337, -474330, -386160, -197623, 265217, -148997, 174233, -40360, -134431, -93376, -10479, 268489, 238801, -72006, 62602, -16760, -167844, -279387, -262841, 52963, -137443, 25511, 112618, -131054, -145534, -316784, 87417, 117841, -93005, 55816, -94756, -128997, -184597, -47864, -383826, 287274, -380136, -177364, -157561, -347493, 211210, -332006, -250260, -445190, -214857, -1185, 39776, 306807, 107862, -131098, -273999, -26973, 75434, 79426, 14426, 61956, 136536, -284219, -129084, 362372, -213079, 277497, 230331, -87895, -124510, -236467, -206356, -87361, 175964, 189484, 32472, -37945, -80377, 346191, 175489, -141392, -278130, -477892, 47299, -35999, 13468, 49356, -8953]
9712A63518E6255a9844k84641B5468d76546B32827b37036d8006A54303e03515
9701A84771j5794o0710e512B1437J5320L83135a19465a6391D9732b23755M8929
9690a74826a4572H710J04227N6451k0956a47792f6178k75915c7381i435r1709
9679a01144b8160D4056d0743D4162c43196d7801C1804K58506A5047M2544f8585
9667D0429c81863a42358j60746f0505B37981b9850l61977J89957A7450a25643
9656A2544K51142a26379a1862j12371A51752l0447c06304d7183n7210j44395G869
9644a2224l36054F8628A8151a83470F5757J14674c4332l05952A8052D57N8060
9633E8517b02818B16899r4886K9169a62204E4983a51972j3722j42589O3987C6023
$$ y = [163518, 56255, -19844, -304485, 25468, -476546, 232827, -237036, -48006, 154303, -503515, 184771, 168977, 108267, -5512, 21437, 36757, 419892, -119465, -16391, 49732, -223755, -174826, -14572, 8710, 112937, 169388, 148432, -147792, -66178, -342093, -37381, -9435, -101144, -28160, 44056, -40743, 44162, -343196, -47801, 31804, 290310, 15047, 57591, -68585, 40429, -381863, -142358, -303104, -60505, 237981, -29850, -391827, -201870, 17450, -125643, 12544, 263686, -126379, -11862, -124233, 151752, 121305, -306304, -47183, -104393, -248788, 7869, -12224, -348278, 68628, 18151, -183470, 65757, 180431, -34332, -340284, 18052, 457, 58517, -202818, 216899, 122013, 151182, -162204, 54983, -151972, -165694, -308283, -244296, 36023]
9621a06700l1085B55769a15749L4027c4364A73370C0321F246Q3986a90738P3678
9610a17060j9719B9068a08731j22673R2415L1801C08247b29536k3086J19528A49771
9598b74808H4852a80977J7028B8024c11709a8292r9124D4779a06161M624k14672
9587c16209D8733d54026n9543K48355p4285C673a69014n2551L2127b0555k69133
9576b89688J00827l992B60699h8706j18625R8311A67998b85120K2570B04128a350
9564a61612A29293o0459a03427p917k16829J60301b5987A96947b28317A94596
9553F1432a2950k60428A46030b10311A77064a1546k21675E254e59140a0258A14911
9541H603b4499q6995c2093k510k05511K381d7973k64421q444J2638a3730k36808
$$ y = [-106700, -137785, 255769, -115749, -81722, -34364, 173370, 30321, 6246, 90232, -190738, -117060, -136779, 29068, -108731, -231404, -138989, -107188, 308247, -229536, -252622, -133094, 149771, -274808, 84852, -180977, -163949, 28024, -311709, -18292, -117416, 44779, -106161, -101537, -316209, 48733, -454026, -513569, -265214, -339499, 3673, -169014, -221565, -189438, -20555, -289688, -188861, -192853, 260699, -88706, -207331, -109020, 167998, -285120, -262550, 204128, -1350, -161612, 129293, 68834, -103427, -111344, -328173, -167872, -25987, 196947, -228317, 194596, 61432, -12950, -273378, 146030, -210311, 177064, -11546, -233221, 5254, -559140, -10258, 114911, 8603, -24499, -111494, -32093, -34603, -240114, -237733, -47973, -312394, -320838, -308200, -13730, -250538]
9529b50538e7034j71111A18347c00996J06018D10248G3442a09180I018Q6250a80239
9517a34802h103H1719a20851b7563k5267A2749O1637c02158d2403B38779g2853
9505a65188o6606R6874A0014b90842H1740e0368k52083O6528A04787c18587A3931
9493g695K766j98587d5887m211b2450B1304J45334B9486a18954A1468d14924a05472
9480a42863n6977Q8129k5963m0473A54570a88861p8666A09143B911h9224o4823
9469a54047J0173B83208d33276J97377G1424h4989g325n574A18278a66350j36196
9458c02546j07338a52113P3641K8085k2840j47268L4871j45056B41458b31536
9447G292J26375g0002B926J22905d2294r377k60833K415G909b75436a22650c8349
$$ y = [-250538, -57034, -228145, 118347, -300996, -194978, 410248, 73442, -109180, 9018, 95268, -180239, -134802, -8103, 81719, -120851, -27563, -52830, 12749, 74386, -302158, -42403, 238779, -72853, -165188, -231794, -134920, 10014, -290842, 81740, -50368, -302451, -235923, 104787, -318587, 13931, -7695, -4929, -203516, -45887, -50098, -22450, 21304, 166638, 29486, -118954, 11468, -414924, -105472, -142863, -199840, -111711, -137674, -178147, 154570, -188861, -267527, 109143, 2911, -89224, -154047, -143874, 283208, -433276, -235899, 71424, -84989, -7325, -12899, 118278, -166350, -302546, -409884, -152113, -78472, -50387, -73227, -220495, -185624, -330680, 241458, -231536, 7292, 133667, -70002, 2926, 125831, -42294, -51671, -312504, -310089, 7909, -275436, -122650, -38349]
9434h7791c9941n4520M2905C19266e3485k95729a36602h469r9609p7621k50380
9423d36079G195a70448g5047A8128a84354A69983p286e8590j42295E8579a01889
9411b4664B45378j01623l9637l1628Q8419c06950G9490e9241n7967c1265o4179
9400i5444n1336B42769p5968e8483J5721I096J3005a2091j02784A99741g7634
9388b13426N6600c1568q4987N773C761a84133f8707n8658A95579c41230B804f9411
9375b93670A1506c0216j11997D23355a59025B14708d50873A54920J6063a58661
9364e2214l5686o129j4494J4412D705k008J47566d1050j30466A88524l8139n6138
9352I4247L7895K01746g5173J7372B73303a94830b1585B16544n6007J35706a50044
$$ y = [-87791, -39941, -94461, -51556, 319266, -53485, -349214, -136602, -8469, -108078, -185699, -436079, 7195, -170448, -75047, 18128, -184354, 169983, 162697, -58590, -200885, 58579, -101889, -24664, 245378, 143755, 104118, 72490, 160909, -306950, 79490, -59241, -117208, -31265, -95444, -146780, 242769, 166801, -58483, -42762, 9096, 22101, -12091, -114875, 199741, -77634, -213426, -156826, -31568, -116555, -110782, 3761, -184133, -68707, -127365, 195579, -341230, 2804, -69411, -293670, 11506, -30216, -142213, 423355, -159025, 214708, -450873, 154920, 170983, -158661, -52214, -87900, -94029, -108523, -94111, 4705, 2697, 150263, -41050, -171516, 188524, 150385, 94247, 132142, 333888, -75173, -57801, 273303, -194830, -21585, 216544, 160537, 296243, -150044]
9340c18455J39615N0185D9064M9582O2698c16616i1868g493j10143d2264m77786
9329e20050b33014A07133d7654o7377J3793A5096K14806a12253j84981B4303c68510
9317b50553g782k59243D123b06765E865d01449A95360G590K3129O0832b49681
9305a61023C73423G8646a19308A09303c05747a00455F2666A2970b29429C48461
9294e0016B29687p362a91894B02727c83165B73991j36409l5703L1569a39704g980
9282G5331i4602K5332o379k2855B74915r5343a32277L9077a5711B34767a44936
9270c06153b4615b83A79129J1351F6229b66348a2566r0669j02132A52628d50838
9258b11602H330J36897l5819b08402m4426R156g0670j20125a7235o7127E073b49453
$$ y = [-318455, -178840, -128655, 49064, 98646, 161344, -316616, -91868, -7493, -117636, -42264, -520050, -233014, 107133, -47654, -115031, -101238, 15096, 229902, -112253, -297234, 24303, -368510, -250553, -7782, -267025, 4123, -206765, 5865, -401449, 195360, 7590, 30719, 91551, -249681, -161023, 373423, 78646, -119308, 109303, -305747, -100455, 62666, 12970, -229429, 348461, -50016, 229687, 222325, -191894, 202727, -383165, 273991, 137582, 101879, 133448, -139704, -7980, 75331, -94602, -69270, -75649, -98504, 274915, 179572, -132277, -93200, -15711, 234767, -144936, -306153, -24615, -283, 179129, 190480, 66229, -266348, -12566, -103235, -205367, 152628, -450838, -211602, 8330, 145227, 109408, -208402, -252828, -243672, -70670, -190795, -17235, -84362, 5073, -249453]
9245a42195B06237F7665b57675a08627m4464m162K7445j76240B74302Q8908a14387
9233a4757j47739l27651G1511J43315R0734b29669d8486K621F0844d7783I6818
9221b32737J04945I2466B187d4264G5085J41074b1777E6126b02702J6296d8736
9209A1243M38195A26709B5957i5831C49293c19494A60311b04412C8833K64059
9199C02892b58807F1804e4380A63735a58382J465B31631E0028R6649Q9618h9819
9187b09750a01569j8159k6891k74599B68432b09776A18619c09952j89720K40794
9177b58878I2184b20853J8574h6727k12980e7438J4108k83907P1835I8323C5917
9165b38381c8635j14398e4392j06297D787i0161A65675c44759E8039a13830A16430
$$ y = [-142195, 206237, 67665, -257675, -108627, -153091, -157253, -129808, -306048, 274302, 363210, -114387, -14757, -162496, -490147, 71511, 214826, 305560, -229669, -48486, -45865, 60844, -47783, 96818, -232737, -127792, 92466, 2187, -44264, 75085, 216159, -21777, 56126, -202702, -186406, -48736, 11243, 449438, 126709, 25957, -95831, 349293, -319494, 160311, -204412, 38833, 302892, -258807, 61804, -54380, 163735, -158382, -156917, 231631, 50028, 146677, 236295, -89819, -209750, -101569, -119728, -146619, -421218, 268432, -209776, 118619, -309952, -499672, -258878, 92184, -220853, -202279, -86727, -299707, -57438, -43330, -327237, -255402, 98323, 35917, -238381, -38635, -153033, -54392, -160689, 4787, -90161, 165675, -344759, 58039, -113830, 116430]
9153c24418J58544k3410I6211a75039I5574O9621G3114L7579J54323C7395a76067
9141A81663b0917j93629C0985a37995j25666d0433J3841k56992H4670d8695m8350
9130i7045A386b91754h2157A21658a52023A69325m9007d53972K20014K2897j17691
9119c28752R0730C4768h9394k56254B9084d0420J4460C85338a92179I9303a27818
9107a83289j474A81038e0740r4344B16551d9332b4577A70270p3772a3264j37737
9096a51001A06746g7263G3088o382a05767O720D8591e11200a09643c4000k36556
9085b70556f2744k10449j18839b082j68228k61633K13040P8635j0540J4871a4094
9073a90382b293A10647J86988c72108J62344j61664a44240a882D4312a42432j01285
$$ y = [-324418, -165874, -189284, 96211, -175039, 95574, 165195, 73114, 110693, 265016, 37395, -176067, 181663, -20917, -214546, 30985, -137995, -263661, -40433, -26592, -283584, 84670, -48695, -97045, 1386, -291754, -82157, 121658, -152023, 169325, 120318, -453972, -233958, -211061, -328752, -238022, 34768, -89394, -345648, 29084, -40420, -25960, 385338, -192179, 99303, -127818, -183289, -184763, 181038, -50740, -145084, 216551, -49332, -24577, 170270, 96498, -13264, -151001, 106746, -77263, 73088, 66706, -105767, -99047, 48591, -511200, -109643, -34000, -270556, -62744, -273193, -392032, -2082, -170310, -431943, -218903, -140268, -150808, -135937, -14094, -190382, -2293, 110647, 297635, -372108, -209764, -371428, -144240, -1882, 44312, -142432, -243717]
9062b43717c2917A71974C1086N187b5192B05402c64357R7840K9879P2610O517
9051a57511L4839E0664e7491D6099d2771m7987D6021J6441c4892k10447m4672
9040b90011e4191j09674e2636H4843b03041C5099a43375E15801A26978d04714
9029F0887j5886E207J7030E272J86490e1392D9214a05027M3357k9109B500J20450
9017A22950J09603I8907N7316C6942J55759A6560c02734o1398a41580A1514h5382
9005i0328j20990A6096a91145G3972a38434G9053c24491P9004l7737m1640A37972
8993e6833A50127c5641j39758A73414a73993e9292K2685k17840B6153a49015j88776
8982c37791i65q367l48009a45246d7292B51852a79743N1342l3844B5059a92726
$$ y = [-243717, -32917, 171974, 31086, 36273, -25192, 205402, -364357, -266517, -236638, -164028, -157511, -122672, 50664, -57491, 46099, -42771, -90758, 46021, 62462, -34892, -245339, -290011, -54191, -163865, -52636, 84843, -203041, 35099, -143375, 515801, 126978, -404714, 60887, 45001, 5207, 22237, 5272, 191762, -51392, 49214, -105027, -61670, -90779, 2500, 122950, 232553, 98907, 156223, 36942, 192701, 16560, -302734, -364132, -141580, 11514, -85382, -90328, -211318, 16096, -191145, 73972, -138434, 79053, -324491, -245487, -283224, -324864, 137972, -56833, 150127, -35641, -175399, 173414, -173993, -59292, -36607, -254447, 26153, -149015, -337791, -965, -9332, -357341, -145246, -47292, 251852, -179743, -128401, -162245, 25059, -192726]
8970G7336P1271a70859D0929a04684I3091a67357P1536k14256p0897h2844B98584
8958a86792j42204J3884a45803f6717k20563j00927J03243J35063k47939A69296
8947F4228a54809f6115m5885d2345n3645A47573c16330a33267E7536k0266a7008
8935A14860a99272j32126D8758J08345d882k78374O8473P5452C6879L78095f4714
8923b34050A37811J11555a85027A82707K04068d0951g245B6256g0471C86956g551
8911D74840c99D72980B04144J21066J20307M95393J038864J458323M163091l784233
8901C816955A868351q66388D22229J55376C5518a30439f683j32136j47665A32380
8890C36149E2970L44887F5469J8772d1108j69695d4664e511j51495B58083f5612
$$ y = [77336, 148607, -170859, 40929, -104684, 93091, -167357, -95821, -310077, -380974, -82844, 298584, -186792, -328996, -315112, -145803, -66717, -287280, -388207, -284964, -149901, -397840, 169296, 64228, -154809, -66115, -112000, -42345, -95990, 147573, -316330, -133267, 57536, 37270, -17008, 114860, -199272, -331398, 48758, 157103, -4882, -283256, -214783, -139331, 36879, 414974, -64714, -234050, 137811, 249366, -185027, 182707, 386775, -40951, -7245, 26256, -70471, 386956, -7551, 474840, -399, 472980, 204144, 325210, 445517, 940910, 1979774, 3438097, 7601188, 3816955, 1868351, 1001963, 422229, 577605, 35518, -130439, -6683, -138819, -286484, 132380, 336149, 52970, 397857, 65469, 84241, -41108, -210803, -44664, -5511, -157006, 258083, -65612]
8878B03507g8737A38906m4886D1441b43835A04268E0320L09726a23453C81514
8867e9198j25638k7585A66524a08124J5996A6496K9858d3586A01973c49098J32281
8856b16817H2506N9459k4574J30117l9741a84925o0715C5525J4762b9045o7562
8845i6607A99128B969a43904j05787R4458B07443a70880H1164b02780C147c16172
$$ y = [203507, -78737, 138906, 94020, 41441, -243835, 104268, 50320, 360046, -123453, 381514, -59198, -184836, -212421, 166524, -108124, -92128, 16496, 46354, -43586, 101973, -349098, -216817, 82506, 141965, 117391, 247508, 207767, -184925, -245640, 35525, 50287, -29045, -96607, 199128, 2969, -143904, -249691, -155233, 207443, -170880, 81164, -202780, 3147, -316172]
$$ [...]
##END NTUPLES=NMR SPECTRUM
##END=
