
##TITLE=AC1159_Tamara_5875076_Ygq0hIHIcJ
##JCAMPDX= 6.0         $$ Bruker NMR JCAMP-DX V2.0
##DATA TYPE= NMR SPECTRUM
##DATA CLASS= NTUPLES
##ORIGIN= BRUKER
##OWNER= Administrator
$$ 1.72 TOPSPIN		Version 2.1
$$ 2012-03-31 22:48:25.109 -0500  Administrator@TOPSPIN
$$ Compression mode = diff/dup
##.OBSERVE FREQUENCY= 400.13188235
##.OBSERVE NUCLEUS= ^1H
##.ACQUISITION MODE= SIMULTANEOUS (DQD)
##.ACQUISITION SCHEME= undefined
##.AVERAGES= 8
##.DIGITISER RES= 22
##SPECTROMETER/DATA SYSTEM= spect
##.PULSE SEQUENCE= zg30
##.SOLVENT NAME= COFFEE_meoh
##.SHIFT REFERENCE= INTERNAL, COFFEE_meoh, 1, 14.98061
##AUDIT TRAIL= $$ (NUMBER, WHEN, WHO, WHERE, PROCESS, VERSION, WHAT)
$$ ##TITLE= Audit trail, TOPSPIN		Version 2.1
$$ ##JCAMPDX= 5.01
$$ ##ORIGIN= Bruker BioSpin GmbH
$$ ##OWNER= Administrator
$$ $$ C:\Bruker\TOPSPIN/data/COFFEE/nmr/AC1159_Tamara_5875076_Ygq0hIHIcJ/10/pdata/1/auditp.txt
$$ ##AUDIT TRAIL=  $$ (NUMBER, WHEN, WHO, WHERE, PROCESS, VERSION, WHAT)
(   1,<2012-03-31 22:48:16.062 -0500>,<Administrator>,<TOPSPIN>,<go>,<TOPSPIN 2.1>,
      <created by zg
	started at 2012-03-31 22:47:07.734 -0500,
	POWCHK enabled, PULCHK disabled,
       configuration hash MD5:
       1A 1E CE 29 27 FD 77 03 67 4E F0 E3 C4 B2 CB 90
       data hash MD5: 64K
       EC C2 92 22 CC 39 09 49 EE 6D 8C 48 B6 0A 6E 19>)
(   2,<2012-03-31 22:48:19.921 -0500>,<Administrator>,<TOPSPIN>,<proc1d>,<TOPSPIN 2.1>,
      <Start of raw data processing
       efp LB = 0 FT_mod = 6 PKNL = 1 PHC0 = 0 PHC1 = 0 SI = 32K 
       data hash MD5: 32K
       91 BE 91 EF E5 3A BB CE A5 99 4A 79 AD 47 F3 AC>)
(   3,<2012-03-31 22:48:20.296 -0500>,<Administrator>,<TOPSPIN>,<proc1d>,<TOPSPIN 2.1>,
      <pk PHC0 = 216.3098 PHC1 = 0 
       data hash MD5: 32K
       FF 66 9D 09 5A 9D CC 49 56 96 49 09 51 44 EE 29>)
(   4,<2012-03-31 22:48:20.453 -0500>,<Administrator>,<TOPSPIN>,<proc1d>,<TOPSPIN 2.1>,
      <abs ABSG = 1 
       data hash MD5: 32K
       47 49 7F 26 50 DA 07 CE 61 ED 19 C5 4D 91 A8 5F>)
(   5,<2012-03-31 22:48:20.609 -0500>,<Administrator>,<TOPSPIN>,<proc1d>,<TOPSPIN 2.1>,
      <abs ABSG = 2 
       data hash MD5: 32K
       71 9B 3E FC CC BB 05 ED 5D 76 E5 D3 E5 A7 32 B0>)
(   6,<2012-03-31 22:48:20.656 -0500>,<Administrator>,<TOPSPIN>,<proc1d>,<TOPSPIN 2.1>,
      <abs ABSG = 3 
       data hash MD5: 32K
       B7 52 97 3E F5 7A 88 6B 07 DE 15 50 95 A4 82 6C>)
(   7,<2012-03-31 22:48:20.687 -0500>,<Administrator>,<TOPSPIN>,<proc1d>,<TOPSPIN 2.1>,
      <abs ABSG = 4 
       data hash MD5: 32K
       3E 57 16 33 DD D3 8E C5 8E 2E 1F 58 B2 A1 4E C1>)
(   8,<2012-03-31 22:48:20.718 -0500>,<Administrator>,<TOPSPIN>,<proc1d>,<TOPSPIN 2.1>,
      <abs ABSG = 5 
       data hash MD5: 32K
       D0 14 F1 C0 07 63 09 E8 28 38 4F 1D CE EC B5 41>)
$$ ##END=
$$ 
$$ $$ hash MD5
$$ $$ A3 E5 83 6D 32 B7 CE BB 1D 43 B6 A5 CA AD 0A 6C
##$RELAX= 
##$RELAX= 
##$RELAX= 
##$RELAX= 
##$RELAX= 
##$RELAX= 
##$RELAX= 
$$ Bruker specific parameters
$$ --------------------------
$$ [...]
150 150 150 150 150 150 150 150
##$TP07= 0
##$TPNAME0= <>
##$TPNAME1= <>
##$TPNAME2= <>
##$TPNAME3= <>
##$TPNAME4= <>
##$TPNAME5= <>
##$TPNAME6= <>
##$TPNAME7= <>
##$TPOAL= (0..7)
0.5 0.5 0.5 0.5 0.5 0.5 0.5 0.5
##$TPOFFS= (0..7)
0 0 0 0 0 0 0 0
##$TUNHIN= 0
##$TUNHOUT= 0
##$TUNXOUT= 0
##$USERA1= <user>
##$USERA2= <user>
##$USERA3= <user>
##$USERA4= <user>
##$USERA5= <user>
##$V9= 5
##$VALIST= <valist>
##$VCLIST= <CCCCCCCCCCCCCCC>
##$VD= 0
##$VDLIST= <DDDDDDDDDDDDDDD>
##$VPLIST= <PPPPPPPPPPPPPPP>
##$VTLIST= <TTTTTTTTTTTTTTT>
##$WBST= 2048
##$WBSW= 25
##$XGAIN= (0..3)
0 0 0 0
##$XL= 0
##$YL= 0
##$YMAX_a= 533684
##$YMIN_a= -635410
##$ZGOPTNS= <>
##$ZL1= 120
##$ZL2= 120
##$ZL3= 120
##$ZL4= 120
##$ABSF1= 14.98061
##$ABSF2= -5.57192
##$ABSG= 5
##$ABSL= 3
##$ALPHA= 0
##$AQORDER= 0
##$ASSFAC= 0
##$ASSFACI= 0
##$ASSFACX= 0
##$ASSWID= 0
##$AUNMP= <proc_prof1d_extract_pilot.lims>
##$AXLEFT= 0
##$AXNAME= <>
##$AXNUC= <1H>
##$AXRIGHT= 0
##$AXTYPE= 0
##$AXUNIT= <>
##$AZFE= 0.1
##$AZFW= 0.1
##$BCFW= 0
##$BC_mod= 0
##$BYTORDP= 0
##$COROFFS= 0
##$CY= 15
##$DATMOD= 1
##$DC= 0
##$DFILT= <>
##$DTYPP= 0
##$F1P= 0
##$F2P= 0
##$FCOR= 0.5
##$FTSIZE= 32768
##$FT_mod= 6
##$GAMMA= 0
##$GB= 0
##$INTBC= 1
##$INTSCL= 1
##$ISEN= 128
##$LB= 0
##$LEV0= 0
##$LPBIN= 0
##$MAXI= 10000
##$MC2= 0
##$MEAN= 0
##$ME_mod= 0
##$MI= 0
##$NCOEF= 0
##$NC_proc= -8
##$NLEV= 6
##$NOISF1= 0
##$NOISF2= 0
##$NSP= 0
##$NTH_PI= 0
##$NZP= 0
##$OFFSET= 14.98061
##$PC= 1
##$PHC0= 216.3098
##$PHC1= 0
##$PH_mod= 1
##$PKNL= yes
##$PPARMOD= 0
##$PPDIAG= 0
##$PPIPTYP= 0
##$PPMPNUM= 2147483647
##$PPRESOL= 1
##$PSCAL= 4
##$PSIGN= 0
##$PYNMP= <proc.py>
##$REVERSE= no
##$SF= 400.13
##$SI= 32768
##$SIGF1= 0
##$SIGF2= 0
##$SINO= 400
##$SIOLD= 32768
##$SPECTYP= <>
##$SREGLST= <1H.CDCl3>
##$SSB= 0
##$STSI= 32768
##$STSR= 0
##$SW_p= 8223.68421052632
##$SYMM= 0
##$S_DEV= 0
##$TDeff= 65536
##$TDoff= 0
##$TI= <>
##$TILT= no
##$TM1= 0
##$TM2= 0
##$TOPLEV= 0
##$USERP1= <user>
##$USERP2= <user>
##$USERP3= <user>
##$USERP4= <user>
##$USERP5= <user>
##$WDW= 1
##$XDIM= 32768
##$YMAX_p= 476538413
##$YMIN_p= -744560
##$CURPLOT= <Network HP LaserJet P1505>
##$CURPRIN= <$Network HP LaserJet P1505>
##$DFORMAT= <normdp>
##$LAYOUT= <+/1D_H.xwp>
##$LFORMAT= <normlp>
##$PFORMAT= <normpl>
##$SURQMSG= 1
$$ End of Bruker specific parameters
$$ ---------------------------------
##NTUPLES= NMR SPECTRUM
##VAR_NAME=  FREQUENCY,     SPECTRUM/REAL,   SPECTRUM/IMAG
##SYMBOL=    X,             R,               I
##VAR_TYPE=  INDEPENDENT,   DEPENDENT,       DEPENDENT
##VAR_FORM=  AFFN,          ASDF,            ASDF
##VAR_DIM=   32768,         32768,           32768
##UNITS=     HZ,            ARBITRARY UNITS, ARBITRARY UNITS
##FACTOR=    0.250966925370066, 1,           1
##FIRST=     8223.43324360095, -297418,      -118009
##LAST=      0,             -99035,          -297191
##MIN=       0,             -744560,         0
##MAX=       8223.43324360095, 476538413,    0
$$ Real data points
##PAGE= N=1
##DATA TABLE= (X++(R..R)), XYDATA
$$ [...]
19464i2265A44555m2531b2468p7913m1537A8813b4410k8876q5111j05336c7235
19452b5711l99931C23745a19194A44740d31746h9906m03890i5511c5651o605B09759
19440d03205a00567q9251f8494l00684A63025d9455h766k16978H6927a54376E5602
19428b3031q693j88767G1495d60463a10025q5681i97A85910a50779c1968C3178
19416i8109k24626k4851A30738a37633F6946e4453l18588I1277m0975L0433J18489
19405A99224a95166O6598K2140j53803e5391q4534N4836j15049E5227K9606K653
19394H7486g0020B43154c32770A03596c4743B36471k6509B5110b5547j056A24189
19382d7007k059B04731a63437j36200m6334d9889j95690A49388l4273J39354N3090
$$ y = [-92265, 144555, 102024, -22468, -100381, -141918, 18813, -24410, -53286, -138397, -243733, -37235, -25711, -425642, 323745, -119194, 144740, -431746, -89906, -493796, -95511, -35651, -42256, 209759, -403205, -100567, -189818, -68494, -369178, 163025, -49455, -8766, -225744, 86927, -154376, 55602, -23031, -31724, -220491, 71495, -460463, -110025, -195706, -997, 185910, -150779, -31968, 33178, -98109, -322735, -347586, 130738, -137633, 66946, -54453, -373041, 91277, 50302, 80735, 199224, -195166, -128568, -106428, -260231, -55391, -139925, -85089, -200138, 55227, 84833, 87486, -70020, 243154, -332770, 103596, -34743, 236471, 209962, 25110, -25547, -26603, 124189, -47007, -49066, 204731, -163437, -299637, -345971, -49889, -245579, 149388, 115115, 254469, 307559]
19371C07559a57777A0782e6387k48286l20328a26050M6713k5356A19866J47923
19361B67789c85405H7187J19417a09412m18275C09159d02865Q8827h3289H3126
19350d7890b2211L017D6721a9387H3036e15717a30736E0092H566a30972o9410
19339b00382g3541M366D9347b81179H7915K72043B8365d88664b03716O1471R378
19328a32867P597C2310b41180C1703o665j2206c4902k13400j20585J23162j5559
19317b61284m4007B8860c43323A0778L9770b20888P1994c6796m69679P8468J71653
19306b56354g0222D9535a48014k1573A02877b00435d9838o5215D0558a3502k97523
19295c11025E9581a08457j39176c6801D0248d8589A37591L6816c93802J87585
$$ y = [307559, -157777, 10782, -56387, -304673, -625001, -126050, -79337, -104693, 119866, 267789, -385405, 87187, 206604, -109412, -527687, 309159, -402865, -314038, -83289, 83126, -47890, -22211, -19194, 46721, -19387, 83036, -515717, -130736, 50092, 8566, -130972, -200382, -73541, -69175, 49347, -281179, 87915, 359958, 28365, -488664, -203716, -142245, -132867, -125270, 32310, -241180, 31703, 25038, 12832, -34902, -248302, -368887, -245725, -261284, -305291, 28860, -343323, 10778, 50548, -220888, -148894, -36796, -506475, -428007, -256354, -70222, 49535, -148014, -169587, 102877, -200435, -49838, -115053, 40558, -13502, -311025, 59581, -108457, -247633, -36801, 40248, -48589, 137591, 174407, -393802, -206217]
19285b06217A29546L5485b61111H5485a0009j20505j850F6668a65978G8247a41778
19273a53080j33098I7273i2799G2420a91904c8893M819A17591c47722h4932B820
19261E3615J00399k4936g3202n9735M2529c7184j11359A07591f8639o3545l01708
19250d33892B32311A06023l6729i5451H652g571k34316f6675j06476c0988k1050
19239e2038j52105i1024c397j80743c6255A92604b41540B2803d4460C69098a42279
19227G8277f1087k56724a26612g844k51117F3756d38439K14239c4132j53873i0684
19215b1206j58093g0483k70167g4569C8109A462J88940b4174E1708b80395A75119
19203F3296K4095K325a79015M3781r1302r9250A43129d15997l7901h0303b7663
$$ y = [-206217, 129546, 165031, -261111, 85485, -10009, -130514, -132364, 66668, -165978, 78247, -141778, -153080, -286178, 97273, -92799, 72420, -191904, -38893, -34074, 117591, -347722, -84932, 2820, 53615, 154014, 129078, -73202, -132937, -90408, -37184, -148543, 107591, -68639, -132184, -433892, 232311, 106023, 69294, -95451, 8652, -7571, -241887, -66675, -173151, -30988, -52038, -204143, -91024, -3397, -184140, -36255, 192604, -241540, 22803, -44460, 369098, -142279, 78277, -61087, -317811, -126612, -7844, -258961, 63756, -438439, -224200, -34132, -188005, -90684, -21206, -179299, -70483, -340650, -74569, 38109, 1462, 190402, -24174, 51708, -280395, 175119, 63296, 87391, 89716, -179015, -135234, -226536, -325786, 143129, -415997, -453898, -80303, -27663]
19191I3011a36885O5431r2936B68310A7833K17888e0930k27279l066J17747j26471
19180b89999D2256j7544K53313D3606a14675k66425K50B51996f5101k03996B48391
19168a39818o2402b8196p3118c812G8981a22843K5929K0560A53306b09291L1005
19157a78286D561f96B14712J39996a64940c4959A58507l2520e1574j82435C5587
19145c12849i4268l93476a14541c2618C5091d13536H6951i5930L4948j43979b7394
19133i2537o9350A42918i1362o7952a3958k35630e2574b128j99424p7970K6470
19122b53052c400l68190Q1562P3881G5679K8578f3904B64615a96071L695f8601
19110h2634r4445A65845k4829j3047b76772E8928b12142M3399A90914b3733A24531
$$ y = [93011, -136885, -71454, -164390, 268310, 17833, 235721, -50930, -278209, -281275, -163528, -289999, 42256, 24712, 278025, 43606, -114675, -381100, -380850, 251996, -65101, -269097, 248391, -139818, -202220, -28196, -101314, -3812, 78981, -122843, -96914, -76354, 153306, -209291, -178286, 4561, -696, 214712, 354708, -164940, -34959, 158507, 125987, -51574, -234009, 35587, -312849, -94268, -487744, -114541, -32618, 35091, -413536, 86951, -95930, -60982, -204961, -27394, -92537, -161887, 142918, -91362, -159314, -13958, -249588, -52574, -2128, -201552, -279522, -253052, -3400, -371590, -290028, -216147, 75679, 104257, -63904, 264615, -196071, -192376, -68601, -82634, -177079, 165845, 141016, 127969, -276772, 58928, -212142, -168743, 190914, -23733, 124531]
19098a96291p7438C6574L947a0687l613j2981k65399A59103J11669h2669J9546
19087f3123j3042L0544m03486A68925B659b30045j27768g533j27423p5517B26806
19075a51130I6135b24270D24987A61924L703n68a37275j36763c6352p6130l6358
19064a48840H8868R1479b66787D09899E3304a94139N0899K7119D9734B326a17306
19052d16108a32518n6635M3235B81357B8913J22690b29169a07901A24680a26246
19041F6451A4628J1289a25697j44529a26780k394A74208D1646a46161j2678k04106
19030c62945B6055i2801J4090j07664B49292h8709n0658q5603M2416C8919a01129
19018B30321B390b80964h8494D7883K62076d4368G3394b95044C00440A0470J50313
$$ y = [-196291, -273729, 36574, 40521, -10687, -14300, -27281, -292680, 159103, 270772, -82669, -63123, -76165, -45621, -449107, 168925, 2659, -230045, -357813, -7533, -134956, -210473, 226806, -151130, 96135, -224270, 424987, 161924, 165627, 165059, -137275, -274038, -36352, -112482, -148840, 88868, 180347, -266787, 409899, 53304, -194139, -143240, -116121, 49734, 2326, -117306, -416108, -132518, -189153, -145918, 281357, 28913, 151603, -229169, -107901, 124680, -126246, 66451, 14628, 25917, -125697, -270226, -126780, -129174, 174208, 41646, -146161, -158839, -362945, 26055, -92801, -78711, -186375, 249292, -88709, -139367, -224970, -182554, 38919, -101129, 230321, 2390, -280964, -88494, 47883, 309959, -44368, 73394, -295044, 300440, 10470, 160783]
19007A60783D3139K49725i2363C00721a12716q549k66487a42560f934C26985G8743
18995A18840a02277d6315A68408R534b64618D21149h1627c4268D1657A1902M3012
18984E4914a09374m20585b28203Q7977G5808a95232r8018p7889b8282j62977L9687
18973a51572D423c85174Q4728f0525l4573F1109e493A8178K43822a203j57626
18962a58829A6966b72750A68166M978K01465n2944J21232A94243h9420A19180
18951E5265a00252k44914H9215c3474A3299E653a87843B66646o9674b7127a867
18939a42297B469E11a78791j19392l6555g9008p3502c008F7738a71076i610n7735
18927f7345A50927n3245i2786A65723a09265j17315i9591B95700g3588m2967j5374
$$ y = [160783, 43139, 292864, -92363, 300721, -112716, -121265, -387752, -142560, -6934, 326985, 78743, 118840, -102277, -46315, 168408, 177942, -264618, 421149, -81627, -34268, 41657, 11902, 54914, -109374, -529959, -228203, -140226, 75808, -195232, -293250, -371139, -28282, -191259, -151572, 4423, -385174, -300446, -60525, -95098, 61109, -5493, 18178, 262000, -1203, -158829, 16966, -272750, 168166, 173144, 374609, 321665, 442897, 194243, -89420, 119180, 55265, -100252, -345166, 89215, -33474, 13299, 5653, -187843, 266646, 196972, -27127, -1867, -142297, 2469, 511, -178791, -298183, -334738, -79008, -152510, -3008, 67738, -171076, -9610, -67345, 150927, 97682, -92786, 165723, -109265, -226580, -99591, 295700, -73588, -116555, -131929]
18916a31929j53042O7741H9786K67115a76593B15715b96318H0635a47054I6836
18905f226j2661j63340b8965B9619R7674n8976b144A78508L7395J43180J25334
18894D84417B09597o5118J55477R239b3899e739C2941b87447e9782D0180K11698
18883B51878a41727A032J2220N0432a63106A50217a70416l51649a15885A33866
18872g8114j9117j71504B43890b2268p4919c8893j5074k85407J48279i0501c3948
18860C3503e1044a1691I6114l766K6272b85104I693J13134a94485O8132c1260
18848a908j87472h9794C1754b13328C67220a37511d8633B06304o4408c615B57988
18836c88351a23984A72796Q9496b09487B08122i0062B53254g6527j30833h9320
$$ y = [-131929, -284971, -217230, 89786, 356901, -176593, 215715, -296318, 80635, -147054, 96836, -6226, -18887, -182227, -28965, 29619, 127293, 68317, -2144, 178508, 215903, 359083, 484417, 209597, 144479, 299956, 309195, -23899, -5739, 32941, -287447, -59782, 40180, 251878, -141727, 1032, 13252, 63684, -163106, 150217, -170416, -522065, -115885, 133866, -78114, -97231, -268735, 243890, -22268, -97187, -38893, -53967, -339374, -191095, -90501, -33948, 33503, -51044, -11691, 96114, 92348, 118620, -285104, 9693, 122827, -194485, -126353, -31260, -1908, -189380, -89794, 31754, -213328, 367220, -137511, -48633, 206304, 141896, -3615, 257988, -388351, -123984, 172796, 262292, -209487, 208122, -90062, 253254, -76527, -207360, -89320]
18825h8255J3305o69610a1108G9449b50392n8807F6649E090J64352c46821a55123
18813b41600L6704B9444J40118a39080B71049a19227D049a58635Q128C6492K17991
18802B54483j02031b38692A01248a33402A22925O3493J29385A1673J14074J27508
18792B53255e7091F8480P7246G356J70781a08710C0064a83204N9601j7239k5566
18781a66408K6080K8871l37510G5565a94751d7493E3529j8859J64644b80388J07314
18770a73074B11664a94945A02216a30587c7141A2075N0355k3015O1097a50067
18759c02839A27083b08508a800B17282H364L0155N8422B8524c93079a49557B80827
18747H8921g4888F6970a61868e2859k5025j14067Q2089A34413d14300B24098h5730
$$ y = [-88255, -74950, -744560, -11108, 79449, -250392, -309199, 66649, 5090, 169442, -346821, -155123, -241600, -204896, 29444, 169562, -139080, 271049, -119227, 4049, -158635, -150507, 36492, 254483, 152452, -238692, 101248, -133402, 122925, 186418, 315803, 11673, 125747, 253255, -57091, 68480, 145726, 7356, 178137, -108710, 30064, -183204, -123603, -140842, -166408, -140328, -111457, -448967, 75565, -194751, -47493, 53529, 34670, 199314, -280388, -173074, 211664, -194945, 102216, -130587, -37141, 12075, 62430, 39415, 100512, -150067, -302839, 127083, -208508, -1800, 217282, 8364, 38519, 96941, 28524, -393079, -149557, 280827, 88921, -74888, 66970, -161868, -52859, -77884, -191951, -109862, 134413, -414300, 224098, -85730]
18735a70131N9590l9743A04729b18107M8349F1945c61843J43376L8348Q6049j1165
18724a05235A78863e7681J6668k57656J33170k45020J98633l6336L6287A20776
18713b62264h6689b4989k65757F3402e5498p3160p489k38732B44922c1650D8102
18701G3978a81288B01691R1806e6607F5015J2081J66502f5154D4568c38582m6947
18690c85529M8674A53967F5253b19899J07916A92751e38482D4287c76988r779
18680c86767E46506b38430A44074b15754j93764J11603A78425d5709F068e0173
18669i8778B55379d05078d6244F5168C0103e2033J1626C9658a86950j34131C008
18657d3122A40485b96087i7032B10917a65828M6132M3642j28684g1240D3431a32809
$$ y = [-170131, -110541, -150284, 104729, -218107, -169758, 61945, -361843, -218467, -180119, -94070, -105235, 178863, -57681, -41013, -298669, -165499, -410519, -211886, -248222, -211935, 120776, -262264, -86689, -24989, -290746, 63402, -55498, -128658, -136147, -374879, 244922, -31650, 48102, 73978, -181288, 201691, 293497, -56607, 65015, 77096, 243598, -65154, 44568, -338582, -385529, -336855, 153967, 65253, -219899, -111983, 192751, -538482, 44287, -376988, -386767, 546506, -238430, 144074, -215754, -409518, -297915, 178425, -45709, 6068, -50173, -98778, 255379, -405078, -46244, 65168, 30103, -52033, -40407, 39658, -186950, -321081, 3008, -43122, 140485, -296087, -97032, 210917, -165828, -119696, -76054, -204738, -71240, 43431, -132809]
18645c40047A89561a43959A29309a8083p8524A5113g1956C4183c05142B8050c78924
18633E8688b86933O0733a354A47829c7979m8819p8064L7658A25812d38252J43928
18622b94324D4922c9932p4577E7491e6404j95006n8610a02834A2678b73433g3848
18610b20458K1662D6087N5619c51181h7189D4456c12357j6634I9143P276a98970
18598A85564b60231B63462G6563a22354e8403o0807M0476R670I9544a55671A77074
18586d21537a21418A08537d787l05591P9945c7851A3238e4639a8807B84797a06999
18574E1422a61576a3558j5917j06910K5090I0510c6936a6340O485B8512a17625
18562a18271j1963M6373a6961A85801h4845D6851a18472D6960J14618j3130e6574
$$ y = [-340047, 189561, -143959, 129309, -18083, -96607, 15113, -71956, 34183, -305142, 28050, -378924, 58688, -286933, -226200, -1354, 147829, -37979, -86798, -164862, -127204, 125812, -438252, -294324, 44922, -39932, -114509, 57491, -56404, -251410, -310020, -102834, 12678, -273433, -73848, -220458, -198796, 46087, 101706, -351181, -87189, 44456, -312357, -328991, 99143, 106419, -198970, 185564, -260231, 263462, 76563, -122354, -58403, -119210, -78734, -69064, 99544, -155671, 177074, -421537, -121418, 108537, -4787, -310378, -230433, -37851, 13238, -54639, -18807, 284797, -106999, 51422, -161576, -13558, -29475, -136385, -111295, 90510, -36936, -16340, -9855, 28512, -117625, -118271, -130234, -83861, -16961, 185801, -84845, 46851, -118472, 46960, 161578, 148448, -56574]
18550d31988a48977H7147D2917a96648h2587b1747D5201c34574D2859e545j0630
18539a6175o4864A06559b63502G2451a35875B8129b2548A02844a24877e2753I3315
18527f1328f836j79118L651A94212d65811c626E3877H745J0158J3509M6996b77553
18514a12809l4896b0786A42779n4016J71030a68675j25814c2462d806G8309j4492
18503F3817a12858j42881D083P8575O9946j4049i7139A42384d6042j26860M6939
18492a25963K0688o8951E0220b910H7883a91119H7097J31400b23881f4823l29098
18481c93921B83157a54662p9867O3869f2229k91147c1882p788A44427e8368j43691
18470b02059j38844c597m35326c5406k01449a8792A69998G5566R6486b91994a34198
$$ y = [-431988, -148977, 87147, 42917, -196648, -82587, -21747, 45201, -334574, 42859, -5545, -16175, -81039, 106559, -263502, 72451, -135875, 28129, -22548, 102844, -124877, -52753, 93315, -61328, -6836, -185954, -182303, 194212, -465811, -3626, 53877, 8745, 18903, 32412, 79408, -277553, -112809, -147705, -20786, 142779, 88763, 259793, -168675, -294489, -32462, -4806, 78309, 63817, -112858, -255739, 4083, 82658, 152604, 138555, -97139, 142384, -46042, -172902, -125963, -105275, -174226, 50220, -2910, 87883, -191119, 87097, 218497, -223881, -64823, -393921, 283157, -154662, -234529, -170660, -62229, -353376, -31882, -39670, 144427, -58368, -202059, -340903, -3597, -438923, -35406, -236855, -18792, 169998, 75566, 172052, -291994, -134198]
18458C95023G786a01455j84835D2435b39514A21672i444j72795A29316a58559
18447a16843j72368k17716A30926e0719r067k98812a51316p0046j13578A97695
18436c45022P7835A05258L44381A9675D284c1945A2622M29007e1244K2524n8977
18425h7697A20322b7051C23740d5643j30537g1415l2147k56948H3454b38957e251
18413E2237a50134A77007l6621a2676j06396b9350l6479n8900a214j03801j14346
18402b19361A4449a67104k46924J31706a39285j62763A23033g7536B2229K4868
18392D7097e51510D921b3965j71172b089C34893l0245A35667A1172J84716a0892
18380F2386J1949K76222g3441B29471H5409K20626b7605k93968e764j51812o0065
$$ y = [395023, 7786, -101455, -286290, 42435, -239514, 121672, -9444, -182239, 129316, -158559, -116843, -289211, -506927, 130926, -50719, -59786, -358598, -151316, -221362, -334940, 197695, -345022, -267187, 105258, 449639, 19675, 4284, -31945, 12622, 441629, -51244, -28720, -87697, 120322, -27051, 323740, -45643, -176180, -71415, -103562, -360510, 83454, -238957, -5251, 52237, -150134, 177007, 140386, -12676, -119072, -29350, -65829, -124729, -1214, -105015, -219361, 14449, -167104, -414028, -282322, -139285, -302048, 123033, -77536, 22229, 47097, -551510, 4921, -23965, -195137, -2089, 334893, 304648, 135667, 11172, 195888, -10892, 62386, 74335, 350557, -73441, 229471, 85409, 306035, -27605, -321573, -5764, -157576, -217641]
18369b17641B08339B8282J02005l8479d1936j35748p765P4667j37609A18142K02642
18358C20784c5961l1181C568K1300B192e55477K29392A1046c9920o0388o7863
18347a68171b490F7816a66563d7173C9715J78891a62696j42333A36660b21199
18336B09634a4142j73662d031R15k5225j02134A16226f9092K6891A19524l6920
18325H2604c58651e0103q979j80054A47000R5992l0518q7377c8182k28093p4313
18314c40588A06008a0936D7567K1587a32869A30019N2088a55434j89456p1259
18304d16149A7977c66065g2892H966e3289h136j89436I2835b5911r7041P08I5439
18291b55179f094B57408a88447E01944c7318j3334j74855R0019D6360g721k7605
$$ y = [-217641, 208339, 28282, 130287, 91808, -41936, -177684, -185449, -110782, -248391, 118142, 320784, -35961, -67142, 3568, 24868, 2192, -555477, -326085, 11046, -39920, -100308, -168171, -2490, 67816, -166563, -47173, 39715, 218606, -162696, -305029, 136660, -221199, 209634, -14142, -187804, -4031, -3116, -28341, -130475, 116226, -69092, -42201, 119524, 82604, -358651, -50103, -59082, -239136, 147000, 242992, 212474, 125097, -38182, -266275, -340588, 106008, -10936, 47567, 69154, -132869, 130019, 182107, -155434, -344890, -416149, 17977, -366065, -72892, 8966, -53289, -8136, -197572, 92835, -25911, -122952, -122244, 95439, -255179, -6094, 257408, -188447, 501944, -37318, -50652, -225507, -135488, 46360, -7721, -35326]
18280c5326G9219a90116L54f8120j49373E1453a71881A58570g9132I6670b77632
18268a17306H2406a47739O4778A57514F5566k4526J80742c69348b4808F5684a8636
18256A53638b86103A69294c09052K5980l9990B02869a74952n0014e2225l00023
18246c52248J19050D0781J91919m61H1554l0759J55397d41173A35307C021g478
18234A08517a26303A53683J94596B1055Q2484C0539a75658H379k823J58604l8287
18223A25873m1453J32184a02683j7327C4144a84371D39179A26328b03000c8328
18212b58980J24949K2784A00152P0992c84814A01333C8442R1113b92163A12644
18201G0286a53153A41061a49633g615j4874o8560H1861c17489c2915F9463f4062
$$ y = [-35326, 79219, -190116, -189762, -68120, -217493, 51453, -171881, 158570, -79132, 96670, -277632, -117306, 82406, -147739, -82961, 157514, 65566, 41040, 221782, -369348, -24808, 65684, -18636, 153638, -286103, 169294, -309052, -283072, -323062, 202869, -174952, -224966, -52225, -352248, -233198, 40781, 232700, 232239, 81554, 50795, 206192, -441173, 135307, 3021, -7478, 108517, -126303, 153683, 348279, 21055, 103539, 30539, -175658, 8379, 5556, 164160, 125873, 84420, 216604, -102683, -120010, 34144, -184371, 439179, 126328, -203000, -38328, -258980, -134031, -111247, 100152, 171144, -384814, 101333, 38442, 129555, -292163, 112644, 70286, -153153, 141061, -149633, -7615, -22489, -91049, 81861, -317489, -32915, 69463, -64062]
18189G070a99370B4870E844J03572E2354L25147C8686O3162a67071D49521a15808
18177A71139b78451J34769I0011I229f4995A06989a7330E4310b66895a26752N9317
18166f7435B58236b19982P7097E1756J71448c19725A55424a23650L0382B56169
18155A86970K5330a12997G5986k4491b22426M8803A30530B5648a52779k54327
18145d07106J59477H9353b94914A30404c30597C0571a59563b9022A87676g9323
18134E0663g6996j44389a07366J1025j0183J8796B90139b07703a03645J5463B25503
18122a5589j63247g643j83927j90312g4804k2775i73A07681c11014h3340I7532
18110a73786P1935A36795f7797B22619I7581K08189a03962L9551b2328A44277
$$ y = [7070, -199370, 24870, 5844, 109416, 52354, 377501, 38686, 101848, -167071, 449521, -115808, 171139, -278451, -143682, 90011, 9229, -64995, 106989, -17330, 54310, -266895, -126752, -67435, 258236, -219982, -142885, 51756, 223204, -319725, 155424, -123650, -93268, 256169, 186970, 212300, -112997, 75986, 51495, -222426, -173623, 130530, 25648, -152779, -407106, -247629, 89353, -294914, 130404, -330597, 30571, -159563, -29022, 187676, -79323, 50663, -76996, -221385, -107366, -96341, -106524, -87728, 290139, -207703, -103645, -88182, 225503, -15589, -178836, -7643, -191570, -381882, -74804, -97579, -973, 107681, -311014, -83340, 97532, -173786, -101851, 136795, -67797, 222619, 97581, 305770, -103962, -64411, -22328, 144277]
18099a86171B86311a62150q2296G9787c08736K8334B76c12991A15291K9790J21623
18088B66704r8125a05815c4634j0833l7396j11500A02886e5834n5025d5113B18590
18076I2793P1969a84120B33497j13252h8509C67219A24602K06124a5372q9169
18066a04541D2229a28999d1940A83672h0994k8536j56519g3046D3988f6773A38005
18054a36591l27294A0759J06839a36509j10824B20417c42858O1279l7415a46671
18043a2711k3773j12546j3998A01583E672c1645F2642R9172C948K0767c2130B93719
18030a8774F5877R7480i6182k90213B17642b05665B73418d56637a44208A96668
18019a58901c6151j01771C7157a65530e745k90032J16758h525A9306C126e0826
$$ y = [-186171, 286311, -162150, -244446, 79787, -308736, -280402, 276, -312991, 115291, 145081, 266704, 168579, -105815, -34634, -45467, -82863, -194363, 102886, -55834, -110859, -45113, 218590, 92793, 164762, -184120, 233497, 120245, -88509, 367219, 124602, 330726, -15372, -104541, 42229, -128999, -41940, 183672, -80994, -109530, -266049, -73046, 43988, -66773, 138005, -136591, -463885, 10759, 117598, -136509, -247333, 220417, -342858, -281579, -318994, -146671, -12711, -36484, -149030, -163028, 101583, 5672, -31645, 62642, 161814, 3948, 24715, -32130, 293719, -18774, 65877, 163357, -96182, -386395, 217642, -205665, 273418, -456637, -144208, 196668, -158901, -36151, -137922, 37157, -165530, -5745, -295777, -179019, -8525, 19306, 3126, -50826]
18007B20689E1133R6324a55238B46416b85175J9056O9446J2512n9055J10752j4458
17996a46922F5357a1597k95781J26a8700j03052A99295C192J5431K2745J41593
17985A82961d5615a960E4544a9138A34319a39713G7536e6643A69889G8738I854
17973E9218i1156A9386Q6941a44974G2465h1390r1709A0441K58494j01856F7513
17961A01775a95907l2737A19630a36003D0295J03580J24563r2311c8637a6377
17950B58878I1191a86950D1543M9277a36519K5483k3773F4233J62811J37402B6458
17938a23094n7940B51889H1521e8664A1201d4314A29585f4078j76511G4964J6335
17927I1299b8452r2075e0844l1625A41989b91376A6572b84886a15385C7143a293
$$ y = [220689, 51133, 147457, -155238, 246416, -285175, -266119, -196673, -184161, -243216, -132464, -146922, 65357, -11597, -307378, -307252, -18700, -121752, 199295, 3192, 18623, 41368, 182961, -45615, -1960, 54544, -19138, 134319, -139713, 77536, -56643, 169889, 78738, 9854, 59218, -91156, 19386, 106327, -144974, 72465, -81390, -173099, 10441, 268935, 167079, 67513, 101775, -195907, -228644, 119630, -136003, 40295, 143875, 268438, 176127, -38637, -16377, 258878, 91191, -186950, 41543, 90820, -136519, -111036, -134809, 64233, 227044, 364446, 26458, -123094, -181034, 251889, 81521, -58664, 11201, -44314, 129585, -64078, -240589, 74964, 91299, -28452, -120527, -50844, -82469, 141989, -291376, 16572, -284886, -115385, 37143, -1293]
17915C5363h5387j97835B83079a96511E0904a03560j4268N7045B0193c80885B9638
17903B19239R7426j25661B7094b3346k8416k87177B07626M65604l35357K4550
17893C62423d432A46669K17537b4259A12031a16464k49035C01762a7586C25354
17882A4476J60767C1278K95927G5135b54916d152B7742K63565a21227A41425f9126
17870a52025A42091a83770A8589K32185e2938C54346b46142c4732j56323F1385
17859g6477I5039C3175c7918c953m7944f097G6513J13707b83832a16096M1530
17848g4566m2776I0793B6675d05738a29830A72801c82824A95620p7312a98298
17837a18657j98905A20611e0547A11080J66383B2470N7822a04180k38452K3132
$$ y = [35363, -85387, -283222, 283079, -196511, 50904, -103560, -117828, -60783, 20193, -380885, 29638, 219239, 316665, 191004, 27094, -23346, -51762, -338939, 207626, 673230, 337873, 362423, -4432, 146669, 364206, -24259, 112031, -116464, -365499, 301762, -17586, 325354, 14476, 175243, 31278, 327205, 75135, -254916, -4152, 27742, 291307, -121227, 141425, -69126, -152025, 142091, -183770, 18589, 250774, -52938, 354346, -246142, -34732, -191055, 61385, -76477, 95039, 33175, -37918, -3953, -51897, -6097, 76513, 190220, -283832, -116096, -74566, -117342, 90793, 26675, -405738, -129830, 172801, -382824, 195620, 118308, -198298, -118657, -317562, 120611, -50547, 111080, 277463, 22470, 80292, -104180, -342632, -319500]
17827c19500a11695A19940b60462A61503m4718J4462j0926B486a40102n9941C69485
17815F3381f4602J1530H609a81198P1255k4327N2351q4586A26515J44034m8210
17804B22339b34888A6024e7868A57179K33556j34268A04480B3318A0136J36101
17794A46237b06351B43002J83944a85015A32675M8758k7840H44N5034b46108h12
17782B84357A37393a2294j50169A64903h057B28577M3044I4858K7189N0704J07085
17771B79836a65078B21997c26q3061k6198B17889k7941h4009j1041J4165B81939
17759a58681O5787a9444o5027k2240F9056d41744C41872j67335f0202k02270B23985
17747A1300N2788b92013C05351a11466m6419A62761a24225A58034g5469B6498
$$ y = [-319500, -111695, 119940, -260462, 161503, 116785, 131247, 120321, 2486, -140102, -200043, 369485, 63381, -64602, -53072, 8609, -181198, -109943, -134270, -81919, -166505, 126515, 270549, 222339, -234888, 16024, -57868, 157179, 390735, 256467, 104480, 23318, 10136, 146237, -206351, 243002, 426946, -185015, 132675, 181433, 153593, 844, 55878, -246108, -812, 284357, 137393, -12294, -162463, 164903, -8057, 228577, 271621, 94858, 122047, 172751, 279836, -165078, 221997, -326, -83387, -109585, 217889, 189948, -84009, -95050, -80885, 281939, -158681, -92894, -19444, -84471, -106711, 69056, -441744, 341872, 174537, -60202, -262472, 223985, 11300, 64088, -292013, 305351, -111466, -157885, 162761, -124225, 158034, -75469, 26498]
17736b34533A73709N1798O8696I2675a02898F7520L27715a86785h7041J672j12640
17725a98009A27369K52820A32277k919B5923K23543G417d3129m9897A29900C4212
17713A47025f2640C79020A27216b78396B45697A18006J4102d37856D31037G4477
17702A31617O4481r5600J72198a23938B14016i8762B58232a73710C97263L0386
17692D27649b06921A08992J36098a9414E0362d572A23435C9696Q3096a98188A05432
17680b55319A49014h7807B06848o8966b81192B02869L9790a01415C5271J00253
17670A35524B743b09944A86437J19472a85627c3578e90B03443o2059R756C7027
17658A12378b06667C92217h8155J0405L2391D3006G802P9267L752c19061D6506
$$ y = [-234533, 173709, 225507, 294203, 92675, -102898, 67520, 395235, -186785, -87041, -85369, -198009, 127369, 380189, 132277, 129358, 25923, 249466, 7417, -43129, -93026, 129900, 34212, 147025, -62640, 379020, 127216, -278396, 245697, 118006, 132108, -437856, 431037, 74477, 131617, 196098, 100498, 272696, -123938, 214016, -98762, 258232, -173710, 397263, 427649, -206921, 108992, 245090, -19414, 50362, -4572, 123435, 39696, 122792, -198188, 105432, -255319, 149014, -87807, 206848, 137882, -281192, 202869, 242659, -101415, 35271, 135524, 2743, -209944, 186437, 305909, -185627, -33578, -590, 203443, 141384, 151140, 37027, 112378, -206667, 392217, -88155, -77750, -45359, 43006, 7802, 87069, 90821, -319061, 46506]
17646a78481I4681l9917K10792C3113L9832e7821A5836M69775A67265J06997A11896
17634A19292d7016H2965a00715M9186j76079A85003d282C68362g2320k632A99592
17622B71032r6058K12262A75087o4909l2293M29H222a91283B01628m7590m1916
17611A12122J56096b1193E03686D4008L145d2950n4706n437K4069B94978j43609
17600A51369P6091d0686F02883b7264C31858j5443j52633Q8370k4386p3140M16403
17589E71029a18049A10910K85818E8364A8346i0305F7893J62701A5289h194G1139
17577b50685A83565a50710A82297O6926L5532B9255J73232f0709A58573K12465
17567C71038a68879A40365b32773F2909K1994a64988A84001k6653J89336e1056
$$ y = [-178481, 94681, 54764, 265556, 33113, 72945, -57821, 15836, 485611, 167265, 274262, 111896, 119292, -47016, 82965, -100715, -51529, -227608, 185003, -4282, 368362, -72320, -74952, 199592, 271032, 174974, 387236, 175087, 110178, 77885, 78314, 8222, -191283, 201628, 154038, 112122, 268218, -21193, 503686, 44008, 47153, -42950, -97656, -103093, -79024, 294978, 151369, 227460, -40686, 602883, -27264, 331858, 316415, 163782, 252152, 227766, 154626, 571029, -118049, 110910, 396728, 58364, 18346, -90305, 67893, 230594, 15289, -8194, 71139, -250685, 183565, -150710, 182297, 249223, 284755, 29255, 202487, -60709, 158573, 371038, -168879, 140365, -232773, 62909, 84903, -164988, 184001, 157348, 346684, -51056]
17556B9364J08174l7213A9618L72597j9268r7616h5653k130C57237H5551d18467
17544C10217A48448M8181J797b61338H1083c6762l1315B66846J77062Q8346j76919
17533C55335A48586K19170j71489K4425I6927l5739i6335C6457c06503B79327
17522h4734C40560l1101K1793j51506B7513K21970J61785J92509k3961B87383
17511G84341O6896J44028n9025k12165M2417j03323k05244J3413C6143K28286
17501B64429K14719O6429k51580L95466J39567l66371M53961Q8837K4556l88226
17491F41787N0254R5687j61033l6962J13816C38854j18474J23618I0669K73957
17481C64626q5304q0058L05546B21913F886K38130K09226j62479c8033B93180
$$ y = [29364, 137538, 100325, 19618, 392215, 372947, 275331, -85653, -87783, 357237, 85551, -418467, 310217, 148448, 196629, 198426, -261338, 81083, -36762, -68077, 266846, 443908, 532254, 355335, 148586, 367756, 196267, 220692, 96927, 61188, -96335, 36457, -306503, 279327, -84734, 340560, 309459, 331252, 179746, 27513, 249483, 411268, 603777, 579816, 287383, 784341, 851237, 995265, 936240, 724075, 766492, 663169, 457925, 471338, 36143, 264429, 479148, 545577, 293997, 689463, 829030, 462659, 916620, 1005457, 1030013, 641787, 692041, 787728, 626695, 589733, 703549, 338854, 220380, 343998, 90669, 364626, 279322, 199264, 504810, 221913, 6886, 245016, 454242, 291763, -38033, 293180]
17470F564J3722L92791j49936m118K8300A34192o6075M2226l6051J48463J53923
17459C76678j76926M05394A96830J58106j33043K30022E3382K18583L4017D1378
17448h5020A24899R4885J05159J25388j9462b8287B76033F6522M06160A84295
17437B56240o2340L6783N5791K24986K71681A23942K00700J0951K16667q1945
17427D70315j55264M3190J09518j58142j1099J65030j68102B9914h6331A43619
17416C1665K17987C1210J42175J87752N5799A21770L73777j29750l600j52459
17406B09738G8627K07964K05382g097E65387j43627k01823L61317A46154j01K16542
17395C62595A45907L7031O1871J28866r8122d9428A52216L25470A25793a44356
$$ y = [6564, 20286, 413077, 263141, 259023, 287323, 134192, 68117, 110343, 74292, 222755, 376678, 199752, 605146, 196830, 354936, 221893, 451915, 53382, 271965, 305982, 41378, -85020, 124899, 219784, 324943, 450331, 430869, -28287, 276033, 66522, 472682, 184295, 256240, 193900, 230683, 286474, 511460, 783141, 123942, 324642, 335593, 552260, 470315, 315051, 358241, 467759, 309617, 298518, 463548, 295446, 29914, -86331, 143619, 31665, 249652, 31210, 173385, 361137, 416936, 121770, 495547, 365797, 362197, 209738, 78627, 286591, 491973, -7097, 565387, 421760, 219937, 581254, 146154, 146053, 362595, 145907, 182938, 244809, 373675, 275553, -49428, 152216, 477686, 125793, -144356]
17384C95043p1241J05128N5839k37306O2147K08401K2577j52350j53899G8761
17373D37024c2226D07538A88289L38971A41325A8132f7747C79465A61475K8243
17363A89718H0087K83394l426j31226J20176N1005d4580C05415G9575J07409G0795
17351B94097K17939A38756L258J32120d8905B60474b01600I7444j0267K63476
17341C50653r7566L7130o4777H5029K39332p1061l6505p3781N3833M7017A5114
17329h4410B45095L14918r6550Q8412B52335A9459J87189J73626A20226K23008
17319C43234j27181r4056B1488K32195J37296G6892L57843A1964J96407J41821
17309C50192o6488L97914j39231k69807J05689m2099J35995B35815G1439j1800
$$ y = [395043, 323802, 428930, 484769, 247463, 309610, 518011, 540588, 388238, 234339, 78761, 437024, -32226, 407538, 188289, 527260, 141325, 18132, -67747, 379465, 161475, 189718, 80087, 363481, 360055, 228829, 349005, 400010, -44580, 305415, 79575, 186984, 70795, 294097, 512036, 138756, 142014, 274134, -48905, 260474, -201600, 97444, 87177, 350653, 253087, 290217, 225440, 85029, 324361, 253300, 216795, 143014, 196847, 243864, 15114, -84410, 245095, 560013, 463463, 551875, 252335, 19459, 206648, 380274, 120226, 343234, 216053, 121997, 21488, 253683, 390979, 76892, 434735, 11964, 208371, 350192, 283704, 681618, 542387, 272580, 378269, 336170, 472165, 235815, 71439, 59639]
17299E9639J38160M67604C0675L15056K56167k45167m4425J36888A63787J22964
17289B86751J15777L3193p6609A38224k6672J57023L5888K32618B68306n0110
17279B18196q7392L00450f1814D52593L4045q1676E2467M22901j58600L02113
17269F18881A22369K18919G5697L0141J65933n9873n3l4578J03654j2619Q9563
17258C57865J20523j78264J5899J14352m7932k4943M7344p5189Q390A19480K89155
17247D08635k5820r6300A38622J38203J6354L67642H4901K11235I8092a3336C8332
17235D67518A01780D0527L29880J56010k32164J86044E9483J30960L12478B11255
17224I6099P0358E0038M08984j19320p5588K63804A67135L86985j07570q782K1151
$$ y = [59639, 197799, 665403, 30675, 345731, 601898, 356731, 312306, 449194, 163787, 286751, 402528, 435721, 359112, 138224, 111552, 268575, 304463, 537081, 268306, 218196, 130804, 431254, -61814, 452593, 486638, 404962, 52467, 475368, 316768, 618881, 122369, 341288, 75697, 105838, 271771, 211898, 211845, 177267, 280921, 268302, 357865, 478388, 300124, 316023, 430375, 382443, 357500, 404844, 329655, 338045, 119480, 408635, 382815, 286515, 138622, 276825, 293179, 660821, 84901, 296136, 98092, -13336, 38332, 467518, 101780, 40527, 370407, 526417, 294253, 480297, 59483, 190443, 502921, 211255, 96099, 166457, 50038, 459022, 339702, 264114, 527918, 167135, 554120, 446550, 437768, 458919]
17213D58919n2965l9350O6209A15285L64162j69353j18718M52308l19385K87086
17203F11385E2895K16470P74N16709C77381R9775o993o5305K97920k14738q1210
17192D06830j78831o8434J41835P8137L28137A50582M17232B44619L45014l5470
17182E54163A08502M15349k10337J12984B01844P6528J00041J45556p8229N5001
17172E00741l4204j47356j53199J67494m3769K20749L2227n2329B32124J62309
17162C94433O4503o4383j67148M53660j63275p5836l7957J81522J98519k05049
17152E78989k21530K39817D2529N62386k56940M15760j31923j42661l545P1126
17142E56732K6095j01119K8523r525o562j49120L99449J8418k78841k25497L52257
$$ y = [458919, 405954, 366604, 432813, 115285, 479447, 310094, 191376, 643684, 324299, 611385, 52895, 269365, 270139, 786848, 377381, 477156, 470163, 404858, 702778, 488040, 406830, 227999, 159565, 301400, 379537, 707674, 150582, 567814, 244619, 589633, 554163, 108502, 523851, 313514, 426498, 201844, 278372, 378413, 523969, 445740, 500741, 466537, 319181, 165982, 333476, 289707, 510456, 542683, 490354, 232124, 394433, 458936, 394553, 227405, 681065, 517790, 441954, 403997, 585519, 784038, 578989, 357459, 597276, 42529, 604915, 347975, 763735, 631812, 489151, 485606, 556732, 582827, 481708, 510231, 500706, 494144, 345024, 744473, 762891, 484050, 258553, 610810]
17131F10810k52405L08535q2867N8961j70373j19653L4523j63870K49238j05364
17121C67535J51603r9013M84840C88886J83458M2433K18962D16245J96105k1349
17111E91001j65759L26355o1655B71070K56627j73839J06724M183N17977D29971
17100D75024L04661C39456J81365J10346j55966K42536k07602K52258k71889O4345
17090E54849j13936L30481B89504J70329m7066L77621k46719K12665J02481m19031
17080D39784M38444l17378M6041L17651r2005l33934K43001m199r7580K8846o688
17069F61983j71199m1180L91392j82979K79026l64021j05123J50262j76275L20959
17059G62845k12079R7045L3036r3854L33680l47497M55633m34960o8368J74496
$$ y = [610810, 358405, 666940, 584073, 643034, 472661, 353008, 387531, 223661, 472899, 367535, 519138, 420125, 904965, 388886, 572344, 614777, 833739, 416245, 612350, 591001, 425242, 751597, 689942, 271070, 527697, 353858, 460582, 464765, 982742, 429971, 475024, 779685, 339456, 520821, 631167, 475201, 717737, 510135, 762393, 490504, 554849, 440913, 771394, 289504, 459833, 412767, 790388, 543669, 756334, 858815, 439784, 878228, 560850, 606891, 924542, 832537, 498603, 741604, 737405, 639825, 668671, 661983, 490784, 449604, 840996, 658017, 937043, 573022, 467899, 618161, 441886, 762845, 550766, 647811, 680847, 586993, 920673, 573176, 1028809, 593849, 525481, 699977]
17049F99977l9636J96379j90193J04747Q2580k48601K14336O8186o4008J74640
17039I98407l6245k97197J67492K35720k81125J23348J5578k60131J36856j72232
17029F30471J91502O758O4257p5205O2742K68539l78233L44810j47559j51713
17019H16369P7541K17719k31002J66847J48390j52216L62233o88266L78246P5290
17009A171151J77322m64354R172p7045L95554k99580K95144m43899k0732M90932
16999A233665p9707l22187j0790K28891j04462K14936J76621k38742j97707L25603
16989A226121r7053J95291n16275N88238j15581o13400K33966N13254o5501j51780
16979A197280j5810J49647k80632J89045k0642j5100M39493n24188j0981M1317
$$ y = [699977, 660341, 856720, 666527, 771274, 853854, 605253, 819589, 887775, 823767, 998407, 962162, 664965, 832457, 1068177, 787052, 910400, 925978, 665847, 802703, 630471, 821973, 828731, 892988, 817783, 880525, 1149064, 770831, 1115641, 968082, 816369, 893910, 1111629, 880627, 1047474, 1195864, 1043648, 1405881, 717615, 1095861, 1171151, 1348473, 884119, 893291, 816246, 1211800, 912220, 1207364, 763465, 742733, 1233665, 1153958, 831771, 820981, 1049872, 945410, 1160346, 1336967, 1098225, 900518, 1226121, 1129068, 1324359, 808084, 1396322, 1280741, 667341, 901307, 1414561, 1349060, 1197280, 1181470, 1331117, 1050485, 1239530, 1218888, 1203788, 1643281, 1119093, 1108112, 1149429]
16969A149429N96200o16132J19507K50210l28058J80569L70146o70959J14449
16960A165361J44189K63988l37625L29944l95659K53864j90540M28551J65831
16951A827904k91054K37792l15643J62708l0097K52337j88002j14030L5653j09151
16941A468417N5606K97163l26600J70990P6683p9065K27532m38818L63134r8499
16931A716543P7530K41055k54359N6814j30592J60918J03078j42543m1919K27107
16921B013632j74999J17618p2937J35509p6446K59843K15158n68497j3883M11631
16911B246629l96509K65049j42313L11188K15643k33498m58278N55884M7288j04902
16901B306181J3414J85176r6125l8538l10685M70682l00905L14738j2517K83182
$$ y = [1149429, 1745629, 1129497, 1249004, 1499214, 1171156, 1351725, 1721871, 1050912, 1165361, 1309550, 1573538, 1235913, 1565857, 1170198, 1424062, 1233522, 1662073, 1827904, 1536850, 1774642, 1458999, 1621707, 1591610, 1843947, 1655945, 1541915, 1577568, 1468417, 1524023, 1821186, 1494586, 1665576, 1742259, 1663194, 1890726, 1451908, 1815042, 1716543, 1794073, 2035128, 1780769, 1837583, 1706991, 1867909, 1970987, 1828444, 1786525, 2013632, 1838633, 1956251, 1883314, 2018823, 1942377, 2202220, 2417378, 1848881, 1834998, 2246629, 1850120, 2115169, 1972856, 2284044, 2499687, 2266189, 1807911, 2363795, 2411083, 2306181, 2319595, 2504771, 2408646, 2370108, 2059423, 2530105, 2229200, 2543938, 2531421, 2814603]
16891B814603k37609j80289L02349J97199k55040Q600J3912J25909k89953L82692
16881B882373j30797Q6767J41095O3898L822j06899L0384M65201k28932l9229
16871C167683P702J34705j09216M83001j22145l60119R6861L20820k1113j72929
16861C425250N22855l10445j97646K84199j20222M18299j73072l5944L99197j09699
16851D102772k79638L91011k19971J63935K30391p8887N82565j23419m30029K16254
16841D554984K59787Q8446J4963J68364N055m0230K60761k35410J81023J33950
16831E391693l74689J46841N00098J97707j47650J66014r354J50265Q7817l4395
16821F074347M42703J22105o3479j6117M74030k0237Q5301K36752j54676O5961
$$ y = [2814603, 2576994, 2396705, 2699054, 2896253, 2641213, 2649813, 2663725, 2789634, 2499681, 2882373, 2751576, 2838343, 2979438, 3043336, 3047158, 2940259, 2970643, 3435844, 3206912, 3167683, 3175385, 3310090, 3200874, 3683875, 3561730, 3201611, 3298472, 3619292, 3598179, 3425250, 3948105, 3637660, 3440014, 3724213, 3603991, 4022290, 3849218, 3813274, 4212471, 4102772, 3823134, 4214145, 3994174, 4158109, 4388500, 4309613, 4892178, 4768759, 4338730, 4554984, 4814771, 4903217, 4918180, 5086544, 5091599, 5051369, 5312130, 5076720, 5257743, 5391693, 5017004, 5163845, 5663943, 5861650, 5714000, 5880014, 5870660, 6020925, 6108742, 6074347, 6517050, 6639155, 6575676, 6559559, 7033589, 7013352, 7098653, 7335405, 7180729, 7246690]
16811G246690J12840M29453L35612p5123K37336J909M70374j75347L5378K81729
16801H900851K02417K22859O881O38096K2630J57972n9054L84710K03576L34998
16791A1015936j76673P13368K87038P1322P04206R9701L88422l9537K54951M04684
16781A3723418O06563J98897M43610j05049P19280L96131K07568R28663K5977
16772A7145058O08707K69248M60983R05543J42059P75889N16710R39187J15380
16763B1878764J020966L08085R76241N06853P97722J290819R98382N89032Q03631
16754B9170495J302170P76868J381811R97798R06257J172451J723847J277853
16746C8709550J374245J461603J372047J477821J710268J883576J745276K006522
$$ y = [7246690, 7359530, 7788983, 8124595, 8049472, 8286808, 8288717, 8759091, 8583744, 8619122, 8900851, 9103268, 9326127, 9333008, 9971104, 9993734, 10151706, 10092652, 10477362, 10680938, 11015936, 10839263, 11552631, 11839669, 11910991, 12615197, 12714898, 13103320, 13063783, 13318734, 13723418, 14329981, 14528878, 14972488, 14867439, 15586719, 15982850, 16190418, 17119081, 17145058, 17753765, 18023013, 18483996, 19389539, 19531598, 20307487, 20824197, 21763384, 21878764, 22899730, 23207815, 24184056, 24690909, 25488631, 26779450, 27777832, 28366864, 29170495, 30472665, 31249533, 32631344, 33629142, 34535399, 35707850, 37431697, 38709550, 40083795, 41545398, 42917445, 44395266, 46105534, 47989110, 49734386, 51740908]
16738E1740908K095234K444467K116387K053962K756071K699302K272488K945912
16730G1124731K584732K987714L064476L290948K875746L581352L049138L099085
16722I5657922L625838L730039L206142L651764L120926K988232L261357K864153
16714A22106373K882506J880518K366087J967407J599722Q86740P94545O09942
16706A35093840M8803m918j226408j586103j136856k207866j964618k711675k493322
16697A21810877k733238l606406l111140l299253l491329l317313l879541l571550
16689I4801107k951006l448530l462590l089312l097095l179609k883285k964631
16681F9725049k975818k615081k473731k222035k705222k109637j699670k225621
$$ y = [51740908, 53836142, 56280609, 58396996, 60450958, 63207029, 65906331, 68178819, 71124731, 73709463, 76697177, 79761653, 83052601, 85928347, 89509699, 92558837, 95657922, 99283760, 103013799, 106219941, 109871705, 112992631, 115980863, 119242220, 122106373, 124988879, 126869397, 129235484, 131202891, 132802613, 133689353, 134483898, 135093840, 135142643, 135137725, 133911317, 132325214, 131188358, 128980492, 127015874, 124304199, 121810877, 119077639, 115471233, 112360093, 109060840, 105569511, 102252198, 98372657, 94801107, 91850101, 88401571, 84938981, 81849669, 78752574, 75572965, 72689680, 69725049, 66749231, 64134150, 61660419, 59438384, 56733162, 54623525, 52923855, 50698234]
16673E0698234k108233j936933j854812j336387j866035j127768j640729j317768
16665C7509569r93571j801855j202762j048616j520989p11450q98702r63114r73941
16656B7394569q10380j179289m40762r80101q22977o36214r15685k60654r44333
16647B0404174o41007k42718r03470p2566l99430j263629L06800p80458n45935
16638A5861761o24458N117l50547n03677j49597q13479J58749m14878m16894j91282
16628A2560815j75548n06732m17356j91209P622m87289m11429M9613j90787m28339
16618I809361M6842m42578o5714l01092j78172q9752k15773k1621n29175j21615
16608G890711K36967n10823J84586l46589m08592K51956l95388K28338n25601
$$ y = [50698234, 48590001, 46653068, 44798256, 43461869, 41595834, 40468066, 38827337, 37509569, 36515998, 34714143, 33511381, 32462765, 30941776, 30230326, 29331624, 28368510, 27394569, 26584189, 25404900, 24964138, 23984037, 23161060, 22524846, 21609161, 21348507, 20404174, 19763167, 19520449, 18616979, 18544413, 18144983, 16881354, 17188154, 16407696, 15861761, 15237303, 15242420, 14891873, 14388196, 14238599, 13425120, 13583869, 13168991, 12752097, 12560815, 12385267, 11878535, 11461179, 11269970, 11277592, 10790303, 10378874, 10428487, 10237700, 9809361, 9856203, 9413625, 9347911, 9046819, 8868647, 8778895, 8563122, 8541501, 8012326, 7890711, 8127678, 7616855, 7801441, 7454852, 7046260, 7298216, 6902828, 7131166, 6605565]
16599F605565J05691O0574n22250k4215k24101K1738L27666n95764j42686o1481
16589E550737M8031r368J13125n32495J56219M8729r6416l17115K65490l85074
16579D841863j70823K78019k18284k41295J679J27647k7250q9502k41266j58385
16569D102403J90594N3071j12595j12505m10012J82464j42420j47775j9134P8021
16559C662112q8105Q6825j70289P774j20923J85838r1642j52489j76937K33847
16549C376011j91875q8134J30996m42147J17237r6241k4372N3420k24127J03165
16539B713933Q9589j6867j59271o2770r1879j3646l157K88411J80321k20217l68669
16528B335778m6584M09453m27843M7054Q8730q3622N1420J45433j08205k02712
$$ y = [6605565, 6711256, 6771830, 6249580, 6225365, 6001264, 6023002, 6350668, 5754904, 5612218, 5550737, 5598768, 5589400, 5702525, 5170030, 5326249, 5374978, 5278562, 4961447, 5226937, 4841863, 4671040, 4949059, 4730775, 4489480, 4491159, 4618806, 4591556, 4502054, 4260788, 4102403, 4292997, 4346068, 4233473, 4120968, 3710956, 3893420, 3751000, 3603225, 3584091, 3662112, 3574007, 3660832, 3490543, 3498317, 3377394, 3563232, 3471590, 3319101, 3142164, 3376011, 3184136, 3096002, 3226998, 2784851, 2902088, 2805847, 2781475, 2834895, 2610768, 2713933, 2803522, 2786655, 2627384, 2564614, 2472735, 2459089, 2455932, 2744343, 2924664, 2704447, 2335778, 2289194, 2698647, 2270804, 2317858, 2406588, 2322966, 2374386, 2519819, 2411614, 2208902]
16518B208902j91256L08457m03628M35531j43374l82865K04314j74158L22064
16509B183987l10762k29014K14386L39035l55525K96900j89116k01696M73211
16500B221406p46207N30432N1821m13822L05140j20144k05235j77558M06323m2491
16490A809665k25939J86839j94212M0772R1010L0967l31127q053K24407M1744
16480A666073k5534m97633L59831J649j4949L4315M0637k12318L3907N7756j26844
16469A316890q8987L80461n0184n08411L22842j91004K91557k97447j62473M12583
16459A425827L4929j23784L7943j84469O8110K5617O767J22067j44397l1234k8593
16448A208783R9675L06899j72105l04825k06341L52415m51519O47623k78167l92629
$$ y = [2208902, 2017646, 2326103, 1922475, 2358006, 2214632, 1831767, 2036081, 1861923, 2183987, 1873225, 1644211, 1858597, 2197632, 1842107, 2139007, 1949891, 1748195, 2221406, 1475199, 2005631, 2057452, 1643630, 1948770, 1828626, 1623391, 1445833, 1852156, 1809665, 1583726, 1770565, 1576353, 1617125, 1708135, 1739102, 1407975, 1399922, 1624329, 1666073, 1640539, 1142906, 1502737, 1504386, 1489437, 1523752, 1564389, 1352071, 1385978, 1443734, 1316890, 1227903, 1608364, 1558180, 1049769, 1372611, 1181607, 1473164, 1175717, 1013244, 1425827, 1460756, 1336972, 1374915, 1190446, 1258556, 1284173, 1290940, 1413007, 1268610, 1237376, 1208783, 1308458, 1615357, 1443252, 1138427, 932086, 1284501, 832982, 1480605, 1202438, 809809]
16438H09809M09690l13707L69399l0308j48205j89455L13021j26335N7014J16344
16428A267267N5960k86931M3256k02062J53913N792o8400m9894k69075L61803
16418A011629O1497j00426j97613k3300l5715M13473j96689K24110m15962M351
16408G45355M37193m07672K18571k18178K80091l47251Q3637M22906o00561L24197
16398I38288N5764j51732n8289O9915M8118q2414L03638l22507j22926J19381
16388G97236l000J370m4815j31845K61633M12j0707m23388J58881J0363q0052
16377E36088J78392j19171j16303j7908P5799K5967j30103L77273j90989K82115
16367I01160k36162p9027j5228J28711o5894k90646N53533j20291K972j50257
$$ y = [809809, 1219499, 905792, 1275191, 1244883, 1096678, 907223, 1220244, 1093909, 1150923, 1267267, 1323227, 1036296, 1079552, 877490, 1031403, 1037195, 968795, 918901, 649826, 1011629, 1073126, 972700, 775087, 751787, 716072, 1129545, 932856, 1156966, 741004, 745355, 1182548, 774876, 993447, 775269, 1055360, 708109, 791746, 1214652, 614091, 938288, 994052, 842320, 784031, 853946, 902064, 819650, 1123288, 800781, 677855, 797236, 794236, 795606, 750791, 618946, 880579, 880991, 870284, 446896, 605777, 616140, 536088, 714480, 595309, 479006, 461098, 536897, 562864, 432761, 810034, 619045, 901160, 664998, 585971, 570743, 699454, 633560, 342914, 896447, 776156, 779128, 628871]
16357F28871B78844M10185j98550L26590m02217J15236L4263J60710j59566n46
16347E64949J01379J030j24685M7764J62061J7509B46355K91176l9289K61729
16337G59971M8598B33264J14619K01726J27950L053l3047j57288J1693j08822
16327C93148N76430k04719j67974q3731J97933l51530L15567C34866J51801K20584
16317G07251B86268K22872J24478l01043J81959J01826N2095j82958K04252o9066
16307F20683j07236O2084B44950K86583k34549L73902k66968N468J28012m0529
16297D96869K9926J47956j21539K9453Q7514r6605B82380L3076n7697J61323J68566
16286E87648k92608j4667M50285k76442N0742A66713L86619n4249j94847M07007
$$ y = [628871, 278844, 689029, 490479, 817069, 414852, 530088, 564351, 725061, 565495, 564949, 666328, 667358, 542673, 590437, 752498, 770007, 246355, 537531, 498242, 759971, 808569, 233264, 347883, 549609, 677559, 680612, 647565, 490277, 501970, 393148, 969578, 764859, 596885, 513154, 711087, 359557, 675124, 334866, 486667, 707251, 286268, 509140, 633618, 332575, 514534, 616360, 668455, 485497, 689749, 620683, 513447, 575531, 244950, 531533, 296984, 670886, 403918, 409386, 537398, 496869, 526795, 674751, 553212, 582665, 670179, 573574, 282380, 315456, 257759, 419082, 587648, 295040, 280373, 730658, 454216, 504958, 166713, 553332, 499083, 304236, 711243]
16276G11243j83316j06076M2824q2243K84742k05448j42633R313j27193H1689
16265C91970K9079A73980M46346j02976k57934P0604o3628O3884m3467L51686
16255F38495l6325k44284r8687L1630K16958m2446m1903m1790j46931L0800M07371
16244F72888C27125Q9114k6071l7167n7417a1261A74925L0528L08588k13416A48694
16232G2166L03354L9146A50973J45475j34198J97083j15278j09672L09819o9754
16222C74448A32136L36903q6557A52441K23787D9636L84953j99698I5832K19545
16212C15377A10405L13239j18080j03958K77382B01277q6781Q1601J80458j6178
16202C60377B5769J33982L4676n1279K11556j12035R7047o0711J91977j26926
$$ y = [711243, 527927, 421851, 464675, 382432, 667174, 461726, 319093, 328406, 201213, 81689, 391970, 421049, 173980, 620326, 517350, 259416, 330020, 266392, 330276, 286809, 638495, 602170, 357886, 259199, 290829, 507787, 465341, 423438, 381648, 234717, 265517, 672888, 327125, 416239, 390168, 353001, 295584, -11261, 174925, 205453, 514041, 300625, 148694, 72166, 375520, 414666, 150973, 296448, 162250, 359333, 244055, 134383, 444202, 374448, 132136, 469039, 382482, 152441, 376228, 49636, 434589, 234891, 95832, 315377, 110405, 423644, 305564, 201606, 478988, 201277, 114496, 196097, 376555, 360377, 25769, 159751, 194427, 143148, 354704, 242669, 339716, 279005, 470982, 344056]
16192C44056M2269j77719A6528M73477j72342j30213K81313E064L15379k8451
16182B91992j04241J35168j47657k9140K74232A26544L13529j85933A12220J77907
16172B90127L60355B52321n8526B2641h8618A74209K13693A16081K2839f3435
16161E01865B18147f4078A90315J51742M0132A10979J69280k4399q7428b92D9573
16149B51765j15021J92754j46303o6477J3831K72814A95230B6228l226K48770
16139B71772G676K65798m5061P3222J20551A83196j780Q5627Q1275f57j2821q8653
16127a02131b8952J3344B07907G5536M7275A4825J44652a9439q9568D5638J36190
16116A81828k8759D0842J17476j6436f3988q1721A80522q8391a02636B56009A15773
$$ y = [344056, 386325, 208606, 16528, 490005, 317663, 187450, 468763, 5064, 320443, 291992, 187751, 322919, 175262, 146122, 420354, 126544, 440073, 254140, 112220, 290127, 650482, 252321, 193795, 22641, -88618, 174209, 387902, 116081, 138920, -63435, 501865, 218147, -64078, 190315, 342057, 382189, 110979, 280259, 255860, 168432, -292, 49573, 251765, 136744, 329498, 183195, 116718, 130549, 403363, 195230, 26228, 23002, 271772, 7676, 273474, 228413, 301635, 422186, 183196, 181416, 267043, 348318, -657, -13478, -102131, -28952, -15608, 207907, 75536, 122811, 14825, 159477, -19439, -109007, 45638, 181828, 153069, 40842, 158318, 141882, -63988, -145709, 180522, 92131, -102636, 256009, 115773]
16104d776A71066K11789a32081A52107f5737B44843m6491E8041B5278h9979D82550
16092A92192L7223I4445k7157a24623E6668K12155o7060a94878A32310J47337
16082B79647B6944a62711B19638a01185A52868K5715b69803F9402J30093a4928
16071E4172K18853Q0689b82316A92985a07698j84890A089h6569C61069A62695
16060i9814J82j59520A58458F3742b7172A51169J01679j25229o3273B976K55163
16049B58139i2928A89190H3215a8126D09590p0217A45279D6249L00118A40915
16038C40490l0540E1288R2470e7983G264M5359J04026a54459A9209b21693h9807
16026i1244B84912A07182K7786R0637a3178A3655K7537p098a88745M8850A9177
$$ y = [-4776, 171066, 382855, -132081, 152107, -65737, 244843, 198352, 58041, 25278, -89979, 482550, 192192, 229415, 94445, 67288, -124623, 56668, 268823, 201763, -194878, 132310, 279647, 26944, -162711, 219638, -101185, 152868, 178583, -269803, 69402, 199495, -14928, 54172, 273025, 353714, -282316, 192985, -107698, -292588, 1089, -86569, 361069, 162695, -99814, -99632, -259152, 158458, 63742, -27172, 151169, 252848, 127619, 64346, 2976, 258139, -92928, 189190, 83215, -18126, 409590, 339373, 145279, 46249, 346367, 140915, 340490, 309950, 51288, 143758, -57983, 7264, 52623, 156649, -154459, 19209, -221693, -89807, -91244, 284912, 107182, 134968, 225605, -13178, 13655, 41192, 34094, -188745, -139895, 19177]
16014A75800d8632k09603C63962a94790B034a8882B29941D9296a549B29183b3780
16002B26756r0339J13587c221H841K22944b45262A21646a31281k50169C65645
15991C36529q1127h3615k28868b9348B80042b90559b2908B97325b621B45031a58456
15979a14659A30314l7015K2361J52537R0338J50743j50099M04728J06449J77013
15969A047369j08268K60423k30129m08733k12529A38150J60733j18999J7138D6932
15958c5690j73593H1932K52944I4433J30639p3192f4369A42148N927c44161B3361
15946A77488d764A05304b30953D4670b01727A47311a24589A34284a46290A41658
15935A1448J31960l967E7092J6539a23808q0541J01502j20265j1114I6688e4970
$$ y = [175800, -48632, -258235, 363962, -194790, 2034, -18882, 229941, 49296, -1549, 229183, -23780, 226756, 136417, 250004, -3221, 8841, 231785, -245262, 121646, -131281, -381450, 365645, 336529, 255402, -83615, -312483, -29348, 280042, -290559, -22908, 297325, -2621, 245031, -158456, -114659, 130314, 93299, 115660, 268197, 358535, 509278, 359179, 763907, 870356, 1047369, 939101, 1199524, 969395, 560662, 348133, 138150, 298883, 179884, 197022, 46932, -35690, -209283, 81932, 334876, 94433, 225072, 151880, -64369, 142148, 148075, -344161, 23361, 177488, -4764, 105304, -230953, 44670, -201727, 147311, -124589, 134284, -146290, 141658, 11448, 143408, 139441, 57092, 73631, -123808, -204349, -102847, -223112, -234226, 96688, -54970]
15923A66691k5506L7657l9674a05389e0039C7529K54231e8770F0128h5350i028
15911a89247M7516A32227c9863k3588b7127A04653b9470l49443J87459O702A71923
15899D24898b04580A51820e5550b6141L3I643a51276A62467c29551a40346G6929
15887B07686j00361c07780A95048F3615b45789A31242K66479b02488A09839e7438
15876B9870K3496c89038e1976j44500A10487a64092A52188a6416A29414K328b78079
15864b63425B33853d15415M6475D2227g9812A28498E4857P0529g3975j53009j55865
15853c82849J86144A8924c1989A98270J509a43867e2733d282q3956K0538b5963
15841c08323J36011f6997o9191B1202b7152A9833m425Q3776b05181A72046g0127
$$ y = [166691, 141185, 178842, 139168, -105389, -50039, 37529, 291760, -58770, 60128, -85350, -9028, -189247, -141731, 132227, -39863, -63451, -27127, 104653, -29470, -378913, -191454, -184752, 171923, 424898, -204580, 151820, -55550, -26141, -26108, 9643, -151276, 162467, -329551, -140346, 76929, 207686, 107325, -307780, 195048, 63615, -245789, 131242, 397721, -202488, 109839, -57438, 29870, 53366, -389038, -51976, -196476, 110487, -164092, 152188, -16416, 129414, 131742, -278079, -263425, 233853, -415415, -368940, 42227, -79812, 128498, 54857, 125386, -73975, -226984, -382849, -196705, 18924, -31989, 198270, 199779, -143867, -52733, -4282, -88238, -67700, -25963, -308323, -172312, -66997, -136188, 21202, -27152, 19833, 15408, 99184, -205181, 172046, -70127]
15829A40239a93059B58151b67404b6650A94852K050J17657a55214J6544j65098
15819c03768P2183J10102j13046h3755m6117E3771h9574m5946D4373c12072f8393
15807a86049h1088n3889L2958B19961i9750A54713c53660a53323A75180f4786
15796B67383a02749D0739i5424A31080R8450f2682o2276A95810b75986L7097B24813
15784C090f3941O919B9355a23169B6600M0675M5046K14604e0384E7149M0740c95259
15771b22781l482B2576J26662C071O8653K2701C0855e4869j8481A10084J26164
15760B36248H6249b76620h5963A36632a23197C281R1360g2764b5893k9893j8009
15749g3795m16703H1069a74618B75131b27598A01641L5805E5673N4166K64827
$$ y = [140239, -193059, 258151, -267404, -26650, 194852, 196902, 314559, -155214, -138670, -303768, -231585, -121483, -234529, -83755, -129872, 53771, -89574, -135520, 44373, -312072, -68393, -186049, -81088, -134977, -102019, 219961, -99750, 154713, -353660, -153323, 175180, -64786, 267383, -102749, 40739, -95424, 131080, 229530, -62682, -124958, 195810, -275986, -238889, 224813, 3090, -63941, -57022, 29355, -123169, 26600, 67275, 112321, 326925, -50384, 57149, 97889, -395259, -222781, -226263, 22576, 149238, 3071, 71724, 94425, 30855, -54869, -73350, 110084, 236248, 86249, -276620, -85963, 136632, -123197, 3281, 94641, -72764, -25893, -55786, -73795, -490498, 81069, -174618, 275131, -227598, 101641, 137446, 55673, 109839, 374666]
15739C74666B7704g0294E5062c26801A920d149l37954A90744a02116H3109B8753
15727g6868C4347c58960b1025C8526J96360a18101F2359J9679a99723B23502f1382
15715F6345c70880a57568B05274c4481j10833A02089i7909N279M1514m75803b04856
15703D1498I142a34600N3903j73144G7914L4151m6184a21834c9955m7610E5775
15691g1255I5954c12810J35840D6821c8569B17273A4933b50087B03737E9821g1294
15679F0295e041C4232i5322D9886O3273A6243a39746B56933F3879J20696q5460
15668I9115d9110m0908q0561j30733C28047b52308r3936b8746j20151a2478C9749
15656h9575m5005A22249k5440j0444J93586c06363F8038J51637p5498O0160e026
$$ y = [374666, 27704, -70294, 55062, -326801, 1920, -4149, -342103, 190744, -102116, 83109, 28753, -76868, 34347, -358960, -21025, 38526, 234886, -118101, 62359, 82038, -199723, 223502, -61382, 66345, -370880, -157568, 205274, -34481, -145314, 102089, -97909, -92630, -51116, -526919, -204856, 41498, 9142, -134600, -80697, -253841, 77914, 112065, 65881, -121834, -39955, -87565, 55775, -71255, 95954, -312810, -176970, 46821, -38569, 217273, 14933, -250087, 203737, 59821, -71294, 60295, -5041, 34232, -95322, 49886, 113159, 16243, -139746, 256933, 63879, 184575, 99115, -49110, -90018, -170579, -301312, 328047, -252308, -346244, -28746, -148897, -12478, 39749, -89575, -134580, 122249, 96809, 86365, 279951, -306363, 68038, 219675, 144177, 204337, -5026]
15644A40947H564b0429H5763A4814b77875f2392B476J88460k4953f1147C4718
15632a05382A48517k7697b01759A7768J59674a78620J979b6273k10503P7748E4671
15620d8206j24910Q1207j3657C180a4528D0497O7302b33469A43731i2692k02712
15609b95404f9579j14958B42325a16759D5338M91518A75464a39950G0390a26634
15598a04918o1708F6232Q4590a84732C70533c0348o5905j44136f9611l56032a17895
15586C90520e3763k85887O5975a3764r143j1097n9488A37075a64910j43429O3956
15575b44383E4485d92180B60238N2833j06373C0491c0134l0132B5934a70751d4134
15563i6802B531b90422n3995d0194A98823G4102O3830P9702p5080E1786f1478
$$ y = [140947, 8564, -20429, 85763, 14814, -277875, -62392, 2476, 190936, 165983, -61147, 34718, -105382, 148517, 120820, -201759, 17768, 177442, -178620, -176641, -26273, -236776, -159028, 54671, -48206, -173116, -91909, -105566, 3180, -14528, 40497, 107799, -233469, 143731, -92692, -295404, -69579, -184537, 242325, -116759, 45338, 536856, 175464, -139950, 70390, -126634, -104918, -166626, 66232, 150822, -184732, 370533, -30348, -96253, -240389, -69611, -425643, -117895, 390520, -53763, -339650, -273675, -13764, -22907, -34004, -93492, 137075, -164910, -308339, -244383, 54485, -492180, 260238, 313071, 206698, 30491, -30134, -60266, 25934, -170751, -44134, -96802, 2531, -290422, -344417, -40194, 198823, 74102, 137932, 217634, 142554, 51786, -61478]
15551b62686A27886a32545F992a16307L7351m1294j13543C57270c02939f9071
15540a51279l5663A99907c2229B29464a14480A08485P0973a76904c5551j37035
15530a72586I0281a00657b7340l39129J15824C9699Q7254J09451j05721a73423
15519A54890L841a29450n2128n9286e1782j81975F7564e2786j3317j05472j98311
15508c69886i7077B43553a216j92286C71997f2673A56605a26266k5299A27878
15497a31630B5416b48897H7895J00304P0258a01902c3199g120B74167M7947k9647
15486B92467j40924A8222H030K58347o3023K22063A76328J20451p984d4194A69354
15474E4930J62013G3885d39652D2039f549B00034J49742i7970A82923j3151D8100
$$ y = [-262686, 127886, -132545, 6992, -116307, -78956, -120250, -233793, 357270, -302939, -69071, -151279, -186942, 199907, -32229, 229464, -114480, 108485, 179458, -176904, -35551, -172586, 90281, -100657, -27340, -366469, -250645, 39699, 126953, 236404, 130683, -173423, 154890, 158731, -129450, -181578, -240864, -51782, -233757, 67564, -52786, -66103, -171575, -369886, -97077, 243553, -1216, -193502, 371997, -62673, 156605, -126266, -151565, 127878, -131630, 25416, -248897, 87895, 188199, 258457, -101902, -33199, -7120, 274167, 322114, 292467, 151543, 18222, 8030, 266377, 203354, 425417, 176328, 296779, 288795, -44194, 169354, 54930, 216943, 73885, -439652, 42039, -6549, 200034, 349776, -97970, 182923, 169772, 48100]
15462A18556b8879C85359m2771k3463o0064K83583j59119K35347A58384b75002
15451C12349H2912N8255L45445a72903G4692a05379r3220K9864I1102J04443P9292
15440B74837F0790M8569m3346K58692H2328C9367K16665A14945l8305K85410p8510
15429B83540K13760k4165J75106j79534Q02091m59064m9471j54238n4509F3397
15418B37983J57640b41302P1087H5401K53779f9577A15822A9561J466L0541M8223
15407I9791f7455k8859m773A73499c00970p5088h2891j02789N8043B76884j26806
15396A50078A623f0890m4941q2479L3881B61447a16706k0522A8133i113j57027
15385a66140L8465a7433q981q118n97644a6474j2965B04220c8391A79461J11733
$$ y = [118556, -28879, 385359, 342588, 319125, 259061, 542644, 383525, 618872, 158384, -275002, 312349, 82912, 141167, 486612, -172903, 74692, -105379, -198599, -168735, 91102, 195545, 274837, 60790, 109359, 66013, 324705, 82328, 39367, 256032, 114945, 76640, 362050, 283540, 497300, 473135, 648241, 468707, 1270798, 811734, 762263, 608025, 553516, 63397, 237983, 395623, -241302, -170215, 85401, 339180, -69577, 115822, 19561, 21027, 51568, 99791, -67455, -96314, -101087, 173499, -300970, -376058, -82891, -185680, -127637, 276884, 150078, 1623, -60890, -105831, -188310, -154429, 261447, -116706, -137228, 18133, -9113, -166140, -127675, -17433, -26414, -34532, -632176, -16474, -29439, 204220, -38391, 179461, 291194]
15374B91194c51018A39526f6611a7608G5833i3931L2355l5657A11846j0451g5762
15362A11828C8719h4098b0388A83693O9404B4412K21467a37825f0626b4545B7842
15350C08598E4177J92551j0708K33978j44482A54994b22129A94646l575A8928
15339I4242J49348A03091D0756K60296D7807L64775a47161I5676L9599J79320
15329C14595A39763K10540h6409A84804K6055H7672d7934B34723K7616l3070b0215
15317e6545l4888C46630A16005K61445A83589K3824j8095o1575J9603b9585A43175
15305H1990h1242F5808d573F0095K80421I9242J60855a31924A58867D1062J06353
15294A47415m8156M9028a11067B94379B6138J75188N9074a15355A24202j9929
$$ y = [291194, -351018, 139526, -66611, -17608, 75833, -93931, -61576, -97233, 111846, 101395, -75762, 111828, 38719, -84098, -20388, 183693, 253097, 24412, 245879, -137825, -60626, -24545, 27842, 308598, 54177, 246728, 236020, 469998, 325516, 154994, -222129, 194646, 191071, 18928, 94242, 243590, 103091, 40756, 301052, 47807, 412582, -147161, 95676, 135275, 314595, 139763, 350303, -86409, 184804, 210859, 87672, -47934, 234723, 262339, 229269, -20215, -56545, -91433, 346630, 116005, 377450, 183589, 207413, 189318, 127743, 147346, -29585, 143175, 81990, -81242, 65808, -4573, 60095, 340516, 99242, 260097, -131924, 158867, 41062, 147415, 99259, 148287, -111067, 294379, 26138, 201326, 260400, -115355, 124202, 104273]
15284A04273K41833d0018B28742a26566C94617h5282F3788l1146d9536h772D713
15272A28022J19610o8249r663K30683a64822P934D7166G354K0602L32495j55437
15261B05014p0960N2663a87715e7258A73664I071a04323B0864d9287c432o3233
15250f6665A52458P4294N520K69649c74032i1270a7168A61332c34868A94520F3315
15238d7507C19362i6163D0994K8605J7256M1879J24374a25564A07160L14578M56511
15227H78249M16973J80995R263N2287F54129B68712j9274o3044K36219e91662
15216B09452I4506J99861j38768h726j5824k3218H6938J67666L6307N1217J9186
15205C61314d09889G107Q4310P2996l5394a66475A03133h0174B97178a89856A06881
$$ y = [104273, 346106, -40018, 228742, -126566, 394617, -85282, 63788, 32642, -49536, -8772, 4713, 128022, 247632, 179383, 169720, 400403, -164822, -156888, 47166, 7354, 27956, 360451, 205014, 134054, 186717, -187715, -57258, 173664, 9071, -104323, 20864, -49287, -3432, -66665, 152458, 226752, 232272, 501921, -374032, -91270, -17168, 161332, -334868, 194520, 63315, -47507, 319362, -96163, 40994, 69599, 86855, 128734, 253108, -125564, 107160, 421738, 878249, 1295222, 1476217, 1485480, 1537767, 654129, 268712, 249438, 186394, 422613, -591662, 209452, 94506, 294367, 155599, -8726, -24550, -47768, 86938, 254604, 290911, 342128, 361314, -409889, 7107, 91417, 164413, 129019, -166475, 103133, -80174, 297178, -189856, 106881]
15193A01336f7778k7477D9066b29915B85503g8108K1781A70738C902K75636A07652
15181a35555b0521j6968H4792J70994J86954A96934g5472o7320A23456N0142j6051
15170A57547C1057J76223d26066B73291c15847C59560j0627D70J67733h4841n5771
15159a40612C87213G9156Q7716a33585b9666A7499K64453k7828A25845J32263
15149B58108c2387l45962K4145h2094A39615k308n0303i2030A60600B2529Q6824
15138A09353m646Q3450Q1089b75988A16971a6704p5770C5722O2937l7273L7817
15127I9203d4425F1475J98876J73361A39889E4905K75711A57856f9695A42691
15116f020D3981a41798F152K10988k8426o4185L5402C5260N2169K9279L69059
$$ y = [101336, -67778, -95255, 49066, -229915, 285503, -78108, -56327, 170738, 3902, 279538, 107652, -135555, -20521, -37489, 84792, 255786, 442740, 196934, -75472, -142792, 123456, 173598, 157547, 31057, 207280, -426066, 273291, -315847, 359560, 348933, 470, 168203, -84841, -140612, 387213, 79156, 166872, -133585, -29666, 17499, 281952, 254124, 125845, 258108, -32387, -378349, -354204, -82094, 139615, 137307, 87004, -92030, 160600, 22529, 109353, 104707, 188157, 269246, -275988, 116971, -16704, -92474, 35722, 98659, 61386, 99203, -44425, 61475, 260351, 433712, 139889, 54905, 330616, 157856, -69695, 142691, -6020, 43981, -141798, 6152, 217140, 188714, 124529, 159931, 35260, 87429, 116708, 485767]
15105D85767j50636O3716A51960K16596j70564J25036I0245J66870j9752p0485
15095A66878D4490P9478I333K62379b11534C2162J30584Q3293o0013E6755r338
15084D7417B146b3796j81754A18584h3116n2876e1342D03496h5055b3586C07062
15072A11762J51695d0639o84E1539J23805J47230L867j44496q3862i6188A70335
15060B05985J0833B642K66030p4402J34613a86604C07538A51186E1270K42298
15050B93568i9858A74178L84789k11438A63654F6383b9700j20153A44704K32395
15040C77099p4551K705k6050Q3365M427l9095P206A67551J6330K55551G9086J63196
15028B42282J26050j36297n3473K94272J3909o1512K31846B80181J36257j48815
$$ y = [485767, 335131, 398847, 151960, 368556, 197992, 323028, 90245, 257115, 237363, 166878, 44490, 123968, 9333, 271712, -211534, 32162, 162746, 246039, 186026, 56755, 47417, 2146, -23796, -205550, 118584, -83116, -135992, -51342, 403496, -85055, -23586, 307062, 111762, 263457, -40639, -41323, 51539, 175344, 322574, 326441, 181945, 98083, -96188, 170335, 205985, 216818, 2642, 268672, 194270, 328883, -186604, 307538, 151186, 51270, 293568, -99858, 174178, 558967, 347529, 163654, 66383, -29700, -149853, 144704, 377099, 302548, 305253, 279203, 362568, 366995, 327900, 335106, 167551, 183881, 439432, 79086, 242282, 368332, 232035, 178562, 472834, 486743, 425231, 657077, 280181, 416438, 267623]
15018B67623F9022O11190j19247k3191L19100n9800l10954J69790p9038B50359
15007C74766K24020j60560N920R3846J06250k03549o6153J24175j90822J86371
14997D94264r5270O8005j77816K68690j04237k13485Q5944j0109A50079K0190
14987A70269L07306J43452k50246L57393l20098J22437r2094j92691K01657J61497
14977F08882B59738M58571L7321E7989K56786J00946K02155k85589K27092I0047
14966E90453N85033n57923J78254k51693B46492o7283P26981B40661J78345J27366
14956E46372o5639J07469n0336J01601k85160K93483B39775L48398j08385A72640
14945C64001K466j06923K10130p0722M3646j43897K89496h285B83805R8403i2833
$$ y = [267623, 69022, 680212, 560965, 537774, 856874, 797074, 486120, 655910, 576872, 250359, 374766, 598786, 438226, 444146, 537992, 644242, 440693, 374540, 498715, 307893, 494264, 398994, 466999, 289183, 557873, 453636, 240151, 326095, 315986, 150079, 170269, 477575, 621027, 370781, 728174, 408076, 530513, 438419, 245728, 447385, 608882, 259738, 718309, 755630, 57989, 314775, 415721, 617876, 332287, 559379, 90047, 590453, 1175486, 617563, 795817, 544124, 246492, 179209, 906190, 240661, 419006, 546372, 480733, 588202, 537866, 639467, 354307, 647790, 239775, 588173, 479788, 172640, 364001, 366467, 259544, 469674, 398952, 442598, 298701, 588197, -8285, 283805, 382208, -92833]
14933E77018k20118m7216M4349j29881M02501Q6774l2900l02510K09280M437M562
14922E96296B38758L34031N8025j79678L11492j82373K44835K55264k94634L29819
14912A115539K04050J12267O2801J78541j86359R4599k21540L5020J57991l5359
14902A517550J92214K05371l53313N48761n45254j3708n33387j7896p5253J3521
14892I38606j40225k34567j16233j14396K70231B71958M43552k53132r1384A67431
14881D12368j8521p3059K4186E8858M40744r0980N3432j991o3462O4168J01351
14870E62120K96159L2300j91669j82583K45611K40781l4724D57048J82270R6344
14860G35662k48232K68377j4506C26071J86909j85507J98226q9557L85796B92925
$$ y = [577018, 356900, 309684, 354033, 224152, 626653, 713427, 680527, 378017, 587297, 591734, 596296, 238758, 572789, 630814, 451136, 762628, 580255, 825090, 1080354, 785720, 1115539, 1319589, 1431856, 1494657, 1673198, 1486839, 1581438, 1359898, 1394918, 1552909, 1517550, 1709764, 1915135, 1561822, 2110583, 1565329, 1551621, 1018234, 1000338, 925085, 938606, 798381, 563814, 447581, 333185, 603416, 271958, 715510, 462378, 370994, 167431, 412368, 393847, 320788, 344974, 58858, 499602, 408622, 462054, 460063, 396601, 460769, 562120, 858279, 890579, 698910, 516327, 761938, 1002719, 967995, 457048, 639318, 735662, 487430, 755807, 741301, 326071, 512980, 327473, 525699, 436142, 821938, 292925]
14849I47486l01439k15630L63196k8122l35692K9150B28721J90754J36518O0537
14839F16530k08842J23481r2884j38128N47763B15645L76440p3046n3079L02948
14829G68908K18876k44437P2057M07912m5118j57411M0663l6044j21286j10888
14819G93232r3447J09530L323k20184k35862K94891B66330K09143J41267J47325
14809G64065j51205j31180P9481l2621j03223J57866M67714m35245J99820N8208
14799H73680r5882k28635J32219Q223j68096N2000K83206l16928L18184j68287
14789F89684O8058L58330l33073J95206j61402k35568J58341j93670j55719j19245
14779B70942j8549M37205r6348j55333J98705j46473L1629M48266m19366m7547
$$ y = [947486, 646047, 430417, 793613, 765491, 429799, 458949, 228721, 419475, 555993, 616530, 407688, 531169, 438285, 300157, 847920, 215645, 592085, 519039, 465960, 768908, 987784, 743347, 815404, 1223316, 1178198, 1020787, 1061450, 1025406, 904120, 793232, 699785, 809315, 812638, 592454, 356592, 651483, 266330, 475473, 616740, 764065, 612860, 481680, 561161, 528540, 425317, 583183, 1050897, 615652, 815472, 873680, 777798, 549163, 681382, 689605, 521509, 573509, 856715, 539787, 857971, 689684, 757742, 1116072, 782999, 978205, 816803, 581235, 739576, 545906, 390187, 270942, 252393, 689598, 593250, 437917, 636622, 490149, 521778, 970044, 550678, 503131]
14769E03131J10642n3823k7551j28357L20622K35466j92600L17633m29929j19100
14759E36134M48614l45434M63391r5360k81199j58375j08540J67309N330K58829
14749H90699r3058C03938M82382O9371k28109j05428j33513J75984j73910L92912
14739G83627l27411r2032K47101j82243L30641j99836K9220j0955l2347K9390
14729E75155K54539A81441N69273k2061j26863j84451M50503k81281K97769n0092
14719H34238R0119J51104p0549J34473j77946J75304j08734O25928k3773j71170
14709A458994K90712m64072K58117l61674j25113k29290Q4775J44462r1077j44370
14699H21464O2833j25963L10481j62321L760J7124k2294L8571o1756J12780o5773
$$ y = [503131, 613773, 559950, 532399, 404042, 724664, 960130, 767530, 1085163, 655234, 536134, 984748, 639314, 1102705, 1007345, 726146, 567771, 459231, 626540, 631870, 890699, 797641, 303938, 786320, 855691, 627582, 522154, 388641, 564625, 390715, 783627, 456216, 364184, 611285, 429042, 759683, 559847, 589067, 578112, 545765, 575155, 829694, 181441, 750714, 728653, 601790, 417339, 867842, 586561, 884330, 834238, 924357, 1075461, 1004912, 1139385, 961439, 1136743, 1028009, 1653937, 1630164, 1458994, 1749706, 1285634, 1543751, 1182077, 1056964, 827674, 912449, 1056911, 965834, 821464, 884297, 758334, 1068815, 906494, 910254, 927378, 905084, 943655, 881899, 994679, 928906]
14688I28906M09119J72670J36046n2676J45703p6581l19796J40991j43448j48179
14678A192755j91746N8490n3796k53098n3219M69372n9540n6013q152k38011N6422
14667H63464k07034J44809j12837L52756l36779J0030M10551q5661j13951o3257
14657H62091L67446l88273J58510k30711N9055K91681j82706J72990j14769p5064
14647I20250J39573P9593Q7478k27340k85249O36836j22155J11044F65984M04074
14637A070058J70001k2054m55L6336J37619k2228n5128K09455l23841o9487P1713
14626A201989R961j11191Q3511J02228k7974j5584J55782K22874j93201l30027
14616A098368K71888k19618L54839l70018K56413n7943p8234M52239o24661J16539
$$ y = [928906, 1338025, 1510695, 1646741, 1594065, 1739768, 1663187, 1343391, 1484382, 1340934, 1192755, 1001009, 1059499, 1005703, 752605, 699386, 1168758, 1109218, 1053205, 1045053, 807042, 863464, 656430, 801239, 688402, 1041158, 704379, 714409, 1124960, 1039299, 925348, 862091, 1229537, 841264, 999774, 769063, 828118, 1119799, 937093, 1110083, 995314, 920250, 1059823, 1139416, 1226894, 999554, 714305, 1351141, 1228986, 1340030, 665984, 1070058, 1240059, 1218005, 1217550, 1253886, 1391505, 1369277, 1314149, 1523604, 1199763, 1130276, 1201989, 1211950, 1100759, 1184270, 1286498, 1258524, 1242940, 1398722, 1621596, 1428395, 1098368, 1370256, 1150638, 1505477, 1135459, 1391872, 1333929, 1255695, 1707934, 1083273, 1199812]
14606A199812K24635l12689R845K37022J09507k17424J39273l1120Q1416P8706
14596A518983o2477j78602K23099j15500L37505k89875K79601j92934j13456m4688
14586A361656N9236m8346L14893k95623R0053L0098J3282M0909j29828L70409
14576A806739j20137l1738j79346L93830j48679J00911o1408P6636P5317L9220
14566A951345l7204J7856l8711J36073l1615R1340p7508r407L61259k70082k0987
14555B072359k77619M09404P9785J37475n0912J88973j56317J00958J93498J20048
14545B817652j92327K83150l1982M59195K28507J35862O83270J51640R23800O56381
14535F115148J257105K548777L711822N873628J0245459L273577j2953757q600873
$$ y = [1199812, 1424447, 1111758, 1121603, 1358625, 1468132, 1250708, 1389981, 1358861, 1440277, 1518983, 1456506, 1277904, 1501003, 1385503, 1723008, 1433133, 1712734, 1519800, 1406344, 1361656, 1420892, 1372546, 1687439, 1391816, 1481869, 1511967, 1525249, 1566158, 1436330, 1806739, 1686602, 1654864, 1475518, 1869348, 1720669, 1821580, 1760172, 1836808, 1912125, 1951345, 1914141, 1931997, 1893286, 2029359, 1997744, 2089084, 2011576, 2002169, 2363428, 2093346, 2072359, 1794740, 2204144, 2283929, 2421404, 2370492, 2559465, 2403148, 2504106, 2697604, 2817652, 2625325, 2908475, 2876493, 3335688, 3564195, 3700057, 4383327, 4534967, 5458767, 6115148, 7372253, 9921030, 13632852, 19506480, 29751939, 33025516, 20071759, 11470886]
14527A1470886m482928k267364l48042l63069M39836j22119j139267m41478j21505
14518B624950l87982p2150K18433n9099R408J67088R6780r5585l55602L06668
14508B452909k1928m25768N91317j96899P2084L2206M12901n6829m38641J06755
14498B528107N1784P745l7858J14586J68733r1372j05079M13121P6725j64402
14488B962090l90366N85467j03190K86211k2227j14562k2065k3659M65277m95997
14478C126979L93225l43919K31423J43126P5925J11722j41200K53737J12386m77298
14468C486106K56633K24201l15199K40609j25063K41860j5192R7079j42298P1453
14458D020189K18245l56955O20043J24946k59980k1563j20246K12152J29315J25348
$$ y = [11470886, 6987958, 4720594, 4372552, 4009483, 4449319, 4327200, 3187933, 2746455, 2624950, 2236968, 2164818, 2383251, 2324152, 2333560, 2500648, 2597428, 2501843, 2146241, 2452909, 2430981, 2005213, 2596530, 2399631, 2471715, 2503921, 2916822, 2859993, 2421352, 2528107, 2579891, 2587636, 2549778, 2664364, 2833097, 2741725, 2636646, 3049767, 3126492, 2962090, 2571724, 3157191, 3054001, 3340212, 3317985, 3203423, 3181358, 3157699, 3622976, 3126979, 3520204, 3176285, 3407708, 3550834, 3626759, 3738481, 3597281, 3851018, 3963404, 3486106, 3742739, 3966940, 3651741, 3892350, 3767287, 4009147, 3993955, 4091034, 3948736, 4020189, 4238434, 3881479, 4501522, 4626468, 4366488, 4344925, 4224679, 4436831, 4566146, 4691494]
14448D691494r0365J88008j57907m2265j03955O60983k35783r986K48629r8804
14438E050049N7500J46721o6958J90663j57611M90888m1268L4466j4026J41270
14428E831694P4654M4202j3601J68872L50860k04290K8520K84970j13483N2554
14418F504952p5350N3724M12903J5793j1754J88697k7117N28551j27214J35561
14408G598746Q8619L06689k27647K32748M1572L10607L12939r4949L86746k09852
14398H746218J67036O9002k39121L46997L05028k78219K83101N36471L15947l4404
14388A0218056K38603J6559j03848M04304K61086l67771M46762J58458L2807M42089
14378A1747105N8367K87396K26785J70942J38396L47489K46522L51846L53284
$$ y = [4691494, 4601129, 4789137, 4631230, 4588965, 4485010, 5145993, 4910210, 4900224, 5148853, 5050049, 5107549, 5254270, 5187312, 5377975, 5220364, 5711252, 5669984, 5704450, 5690424, 5831694, 5906348, 5950550, 5936949, 6105821, 6456681, 6252391, 6280911, 6565881, 6452398, 6504952, 6429602, 6483326, 6896229, 6912022, 6900268, 7088965, 7061848, 7590399, 7463185, 7598746, 7687365, 7994054, 7766407, 7999155, 8040727, 8351334, 8664273, 8569324, 8956070, 8746218, 8913254, 8982256, 8743135, 9090132, 9395160, 9116941, 9400042, 9936513, 10252460, 10218056, 10456659, 10473218, 10369370, 10773674, 11034760, 10666989, 11113751, 11272209, 11305016, 11747105, 11805472, 12092868, 12319653, 12490595, 12628991, 12976480, 13223002, 13574848, 13928132]
14369A3928132L07664k16521N65844r861P04533L75215L29384l59250O22653K56562
14359A6504355J11610M13086L27943P5981L16243O19328L86619L13319P84232
14350A9852716L29884K56171M99325N35999L40277L55197J61605R19902M65580
14341B3716656N50415O02750N01348N66172O00769M06035P28126J111769L21825
14332B9105865J230238M08234Q85864P83345Q30674P28113J196010O56816J343978
14323C7169137R52114J351502J235610Q44440J075734J317876J486782J288543
14315D6721738J265588J926507J652817J349841J960213J608749K267413K008626
14307F0761492K295801J998702K488107K613668K907411K546868K938714K851264
$$ y = [13928132, 14235796, 14019275, 14585119, 14575258, 15279791, 15655006, 15984390, 15625140, 16247793, 16504355, 16615965, 17029051, 17356994, 17432975, 17749218, 18368546, 18755165, 19068484, 19852716, 20182600, 20438771, 20938096, 21474095, 21814372, 22169569, 22331174, 23251076, 23716656, 24267071, 24869821, 25371169, 25937341, 26538110, 26944145, 27672271, 28784040, 29105865, 30336103, 30744337, 31630201, 32413546, 33244220, 33972333, 35168343, 35825159, 37169137, 38121251, 39472753, 40708363, 41552803, 42628537, 43946413, 45433195, 46721738, 47987326, 49913833, 51566650, 52916491, 54876704, 56485453, 58752866, 60761492, 63057293, 65055995, 67544102, 70157770, 73065181, 75612049, 78550763, 81402027]
14299H1402027L278384L300048L682075L986129M194517M131941M505244M600633
14291A13080998N479801N497041N729691O084363O622949P006325P105702Q007636
14283A64614506Q553478Q761176R087725J0317332J0519150J1097462J1792438
14276B34743267J2528541J2865376J4055105J4371630J4485320J4495427J4390044
14269C31934710J4400226J4292664J4113272J3349438J3383266J1613910J0873613
14262D23961099J0355690R354068R063896Q324395N577795L427571K618552L674994
14254D76358060J80353n807130l876985p163104q078268j3017691j3748204j4474196
14246D10372835j4650474j4672973j5205781j5484748j5477853j4273504j4503775
$$ y = [81402027, 84680411, 87980459, 91662534, 95648663, 99843180, 103975121, 108480365, 113080998, 118560799, 124057840, 129787531, 135871894, 142494843, 149501168, 156606870, 164614506, 173167984, 181929160, 191016885, 201334217, 211853367, 222950829, 234743267, 247271808, 260137184, 274192289, 288563919, 303049239, 317544666, 331934710, 346334936, 360627600, 374740872, 388090310, 401473576, 413087486, 423961099, 434316789, 443670857, 452734753, 461059148, 466636943, 470064514, 472683066, 476358060, 476538413, 470731283, 466854298, 459691194, 451612926, 438595235, 424847031, 410372835, 395722361, 381049388, 365843607, 350358859, 334881006, 320607502, 306103727]
14239C06103727j3894699j3199999j3078706j2579444j1708308j1189234j0562047
14232B19891290j1085357j0704108j0086617r221098r227117q238469q003975
14225A53324549p165531p234025o044492n774506n996681n200825m964231m517083
14217A06427175m692739l776683m284922l587309l676016l131193l479122l234663
14209G6564528k818120k850468j953955k433803k220236k347539j732033k200981
14201E8007393j666106j786627j882318j315114j890828j492896j343231j556800
14193D5073473j225595r04286j374459j580599p77947j194312q72583q36673r82006
14184C5325013n32586j563337o96114q29708q87702m47261o84952j210299m99510
$$ y = [306103727, 292209028, 279009029, 265930323, 253350879, 241642571, 230453337, 219891290, 208805933, 198101825, 188015208, 178794110, 169566993, 161328524, 153324549, 146159018, 138924993, 132880501, 127105995, 121109314, 115908489, 110944258, 106427175, 101734436, 97957753, 93672831, 90085522, 86409506, 83278313, 79799191, 76564528, 73746408, 70895940, 68941985, 66508182, 64287946, 61940407, 60208374, 58007393, 56341287, 54554660, 52672342, 51357228, 49466400, 47973504, 46630273, 45073473, 43847878, 42943592, 41569133, 39988534, 39210587, 38016275, 37143692, 36307019, 35325013, 34792427, 33229090, 32532976, 31703268, 30815566, 30368305, 29683353, 28473054, 27973544]
14175B7973544n14026p12071l38123j054811m85570p19358k83991o30571m49472
14166B2785551o75467l22833l55222o70983k11394m91590m33710m07640k80950
14157A8935762n50859j55134m47249k26280p06075q3095k00856l10548k62752
14148A5992914n51630k91172m32987J38775p29424j29576L01013o04463m2498
14139A3650952j18462k88787l03349n18171N37773m18159n46357k667m69657k5430
14129A1497686p1203l29253l47237l36509j0737M0768l68013j51442K36947n35518
14119I625489J69261l87964L86258m69142k73351J06669j57864j92285k3721j16249
14109H667101r7126k54346r5646j40421k35623J28898l80914J86763k53813J7125
$$ y = [27973544, 27459518, 26747447, 26409324, 25354513, 24868943, 24149585, 23865594, 23235023, 22785551, 22110084, 21787251, 21432029, 20761046, 20549652, 20058062, 19624352, 19216712, 18935762, 18384903, 18229769, 17782520, 17556240, 16850165, 16767070, 16566214, 16255666, 15992914, 15441284, 15150112, 14717125, 14855900, 14126476, 13996900, 14297913, 13693450, 13650952, 13532490, 13243703, 12940354, 12422183, 12959956, 12541797, 11995440, 11992773, 11523116, 11497686, 11426483, 11097230, 10749993, 10413484, 10402747, 10443515, 10075502, 9924060, 10161007, 9625489, 9794750, 9406786, 9793044, 9323902, 9050551, 9157220, 8999356, 8807071, 8783350, 8667101, 8569975, 8315629, 8219983, 8079562, 7843939, 7972837, 7591923, 7778686, 7524873, 7541998]
14099G541998k45760o783J444l01802K9783j04062Q2784l26368Q9746J18829o60437
14088F219372K04384r6570o1268j08073o8542l13243K30664j9783k6127J9281
14078E980095m9071j41182j98217L42384o23322J95497j11709l63231N53961j60193
14068E425012j95078k41001j74625K5129r4463m2402J01530L59173l39310Q8948
14058D912913l37157J920M3677n5247N1399l45120K7064K0699O0150j83592L29616
14047D526322j8920j86591J07409j96720n2759k35731L08349l43990J22874l73041
14037C657202Q3788n3343q0550N0666j75709L35579k91162P6569j50772R1619
14027C543887k71938p3835J78040j22526L30766k83388j35832J66222N79k25951
$$ y = [7541998, 7296238, 7289455, 7290899, 6989097, 7018880, 6914818, 6997602, 6671234, 6760980, 6879809, 6219372, 6423756, 6327186, 6265918, 6157845, 6089303, 5776060, 6006724, 5986941, 5960814, 5980095, 5931024, 5789842, 5591625, 5934009, 5310687, 5506184, 5394475, 5031244, 5585205, 5425012, 5229934, 4988933, 4814308, 4839437, 4744974, 4702572, 4804102, 5163275, 4823965, 4912913, 4575756, 4577676, 4621353, 4566106, 4617505, 4272385, 4299449, 4320148, 4380298, 4196706, 4526322, 4507402, 4320811, 4428220, 4231500, 4178741, 3943010, 4251359, 3907369, 4030243, 3657202, 3740990, 3687647, 3607097, 3657763, 3482054, 3817633, 3526471, 3603040, 3452268, 3543887, 3271949, 3198114, 3376154, 3253628, 3584394, 3301006, 3165174, 3331396, 3331975, 3106024]
14017C106024O5008p9401J14286m21817J79137L14557k26942R7987Q8801l00432
14007B937208J40012k36652k96672L22102j34420n3028J51944l07098J18465j19004
13997B522857J36000J05410k60428k52018Q80k5373M13765q0423l8916n40865
13987A980889J68217L30263l4849j33470L9810M33728k23307R1609L98726K12081
13977C263697L58981M93897O31461J722132K928966N552313J0052628R842078
13969C4846153j0447408q923673n217714k707307j695767j112548r8501o46461
13961C996774n1867m21776m41943R4461k51854N2756K4434k35140n1568n17204
13951B197073N00247k80090j35051M9028m1358j14195R0123O0701k02431o335
$$ y = [3106024, 3171032, 3091631, 3205917, 2784100, 2963237, 3277794, 3050852, 3148839, 3237640, 2937208, 3077220, 2840568, 2543896, 2865998, 2731578, 2678550, 2830494, 2523396, 2641861, 2522857, 2658857, 2764267, 2503839, 2251821, 2252701, 2227328, 2641093, 2560670, 2521754, 1980889, 2149106, 2479369, 2444520, 2311050, 2350860, 2784588, 2561281, 2652890, 3051616, 3263697, 3622678, 4116575, 4748036, 6470168, 9399134, 14951447, 25004075, 34846153, 24398745, 15475072, 10257358, 7550051, 5854284, 4741736, 4643235, 3996774, 3944907, 3523131, 3081188, 3175649, 2923795, 2976551, 3000985, 2765845, 2714277, 2197073, 2697320, 2417230, 2282179, 2331207, 2289849, 2175654, 2265777, 2326478, 2124047, 2117712]
13941B117712R5579k45291K46388k47312L61141q3580k95605M02449n52652J62323
13931A961152M725O5090P6109m14015L72750k77980j9665k5126K6364J03793j33916
13920A739281J09991q1985L6331K6764k05925K59867r5531k26795L68910n98411
13910A332497N10091K95630m91692O9764l20601K9698k30590K18538J77926J63183
13900A754444k63025J9708K43163m76626L68705k54913R2075K32135k61142m9772
13890A404752M4765L78987n16478L7207J04822J12018p6497l68437K38215L8123
13880A397477k21184K48679m7730k2428m07507N64698n6863l27644M81173l6957
13870A571714l33979k5009M1032N1921k69744M0101J58842P5859K5566P855M427
$$ y = [2117712, 2213291, 1968000, 2214388, 1967076, 2328217, 2244637, 1949032, 2351481, 1798829, 1961152, 1965877, 2030967, 2107076, 1693061, 2065811, 1787831, 1768166, 1743040, 1769404, 1873197, 1739281, 1849272, 1767287, 1803618, 1830382, 1624457, 1884324, 1788793, 1561998, 1930908, 1332497, 1842588, 2138218, 1646526, 1716290, 1395689, 1425387, 1194797, 1413335, 1591261, 1754444, 1491419, 1511127, 1754290, 1277664, 1646369, 1391456, 1483531, 1715666, 1454524, 1404752, 1449517, 1828504, 1312026, 1349233, 1454055, 1566073, 1489576, 1121139, 1359354, 1397477, 1176293, 1424972, 1377242, 1354814, 947307, 1512005, 1455142, 1127498, 1608671, 1571714, 1237735, 1212726, 1253758, 1305679, 1035935, 1076036, 1234878, 1310737, 1336303, 1344158, 1348585]
13859A348585l42351L86752l36733q6593K62018j67453M1101J21606q4167J7191
13849A159956N2534k42795L220K07719j36563J06837Q3538J20814k67036P8148
13839A166372o5865q5350J53362j92423q8137N2289o3516P0551J94139k06277
13829I35145J7340O7259J73441k2131p3702j48439K59562m75204M75813k20290
13819I88794k97785P19654l14642J07094l87552q4811L52051p8616l4777K93697
13809A263107l30073m2619R8953O1625k28195K42412l42489J92396M308O474l8505
13798H87394j67253K98467o7517q4852j53154K35656j55466L13628k83985K19165
13788A042083n8582p5920J53413r9116l70516J42509K3821j16241J40026L23366
$$ y = [1348585, 1006234, 1392986, 1056253, 969660, 1231678, 1064225, 1105326, 1226932, 1142765, 1159956, 1212490, 969695, 972915, 1180634, 1044071, 1150908, 1234446, 1355260, 1088224, 1166372, 1100507, 1015157, 1168519, 976096, 887959, 940248, 876732, 947283, 1141422, 935145, 952485, 1019744, 1193185, 1171054, 1097352, 948913, 1208475, 733271, 1209084, 988794, 691009, 1410663, 1096021, 1203115, 815563, 730752, 1082803, 1004187, 969410, 1263107, 933034, 890415, 989368, 1050993, 822798, 1065210, 722721, 915117, 919425, 925899, 887394, 720141, 1018608, 951091, 866239, 713085, 948741, 793275, 1106903, 822918, 1042083, 983501, 907581, 1060994, 961878, 591362, 733871, 757692, 641451, 781477, 1104843]
13778A104843E40627K84651o9118n4900J01480K39973k48549j11244K25717k18053
13768F90584J16396P7157j14498j16458L40314m3394p9370r8824l79091M51747
13758H44563j20397o4433J77555j77622p2778L73954j24678j56499m8398J93577
13748H24844n1085j65370K36167C57853L06162K96492j24412K12840l58415J59182
13738H49702j91858L66790m61514l2287J60025k93147M52165l76217J93807j85870
13728D81596J1455N0151J39659J34012j53263l04477K708P572K00109J77406k280
13717G44648l21077K42713k60785K74996l4296j71746K15777R310k75829J57225
13707E80936K8000k75239J49272J00918K52922m12232O50372D66004J11332J40511
$$ y = [1104843, 540627, 825278, 756160, 701260, 802740, 1042713, 794164, 682920, 908637, 690584, 806980, 884137, 769639, 653181, 993495, 950101, 870731, 771907, 392816, 844563, 724166, 659733, 837288, 659666, 586888, 960842, 836164, 679665, 631267, 824844, 773759, 608389, 844556, 357853, 664015, 960507, 836095, 1048935, 690520, 849702, 657844, 1024634, 563120, 530833, 690858, 397711, 849876, 473659, 667466, 481596, 493051, 543202, 682861, 816873, 663610, 359133, 361841, 369413, 569522, 746928, 744648, 423571, 666284, 405499, 680495, 646199, 474453, 690230, 699540, 423711, 580936, 608936, 333697, 482969, 583887, 836809, 424577, 1074949, 466004, 577336, 717847]
13697G17847j30744j58759K33959j48230J0798j07886O7300p747j57344L78875
13687F98069B82819O3825O5002M83269m09910O2203O6911Q6992R5348k00957m1947
13676E53555r8325K17839H7536M94188A59551K94417J82540J88334C89251K93619
13666F82870l29249K76785k17606K01245K30226A92034N35904j18946A68713J46937
13656C15650J75769J51838j03392N3991K9821j99358K05777A92759O639K24454
13646D23852A62677L07579B17567L50681n2898j52570j45783L56750O6022j55423
13636D84346K89783p612k75808J69526k17651B00169q38K13470J17036G4684Q44060
13625I18744k46289L1582l25608A57685J44963J26691j51291r679K47065A90196
$$ y = [717847, 587103, 428344, 662303, 514073, 524871, 416985, 484285, 476538, 319194, 698069, 282819, 346644, 411646, 894915, 485005, 547208, 614119, 701111, 796459, 595502, 553555, 455230, 673069, 87536, 581724, 159551, 453968, 636508, 824842, 389251, 682870, 353621, 630406, 412800, 614045, 844271, 192034, 727938, 608992, 168713, 315650, 491419, 643257, 539865, 593856, 623677, 424319, 630096, 192759, 199398, 423852, 162677, 470256, 217567, 568248, 515350, 362780, 216997, 573747, 639769, 484346, 774129, 766517, 490709, 660235, 442584, 200169, 199331, 412801, 529837, 74684, 918744, 672455, 704037, 378429, 157685, 302648, 429339, 278048, 268369, 515434, 190196]
13614C86598J93194J67753B17031q9419M49158j64344K05552k51217O0497J38154
13604E65412j37977j17425j0317J58496p4431P9270K30495B84503Q7078j37822
13594B33759K97337j2265n4809j8735N7568K08775B80310L16874r8314B44004
13583C41693j18175H4498K02790A10471M00158j76195L47983M8132k76148q7202
13573C67199Q559N5435K75916k52777B10779Q5102L74605l05816O8279j81578
13563B51371M0353l1695q6769K66562j28754H7440J50241L15374k06392A54911
13552B63754m4082Q3022J13468A24133J58029A23271K19698e5855B59268J06457
13542C65725J71372A19572K27994J2361C2715J64333n9417K07731j51255J83345
$$ y = [386598, 579792, 747545, 217031, 127612, 576770, 412426, 617978, 366761, 427258, 565412, 427435, 310010, 299693, 458189, 383758, 463028, 693523, 284503, 371581, 233759, 531096, 518831, 464022, 445287, 502855, 711630, 280310, 597184, 498870, 244004, 341693, 223518, 84498, 287288, 110471, 510629, 334434, 682417, 730549, 454401, 367199, 375758, 431193, 707109, 454332, 210779, 295881, 670486, 364670, 432949, 251371, 291724, 260029, 173260, 439822, 311068, 87440, 237681, 553055, 346663, 154911, 263754, 219672, 302694, 416162, 124133, 282162, 123271, 342969, -55855, 259268, 365725, 537097, 119572, 347566, 359927, 32715, 197048, 137631, 345362, 194107, 377452]
13532C77452Q0293O4842E157P0739N05187j65279l5297j25190A19965J13911K54843
13521D88719q7420o7020q060j47675J00511q5496J25533Q6276I235N47224B71268
13509B74882c0210D48443k00846J39663j13838J4845J68627j50659N5685l6173
13499C25747l9385L83933k51193B00190J5852L1351J14255D8077L22651j16053
13489B54675J07981a8166B61657C5237K30084M45630B82495K6901E2507a16611
13478C99177A98914A8650M44304C2328K92012O2472j90137Q4291Q1678A59136
13467H0553K41908J24594j71116K02870H0525K13036n2772G3282K42817j39774
13457A76325L2608J85529j53704A01552K77272J7622p1302h811j01531B59278
$$ y = [377452, 457745, 522587, 5157, 75896, 581083, 415804, 380507, 255317, 119965, 233876, 488719, 401299, 334279, 326219, 178544, 279055, 193559, 319092, 405368, 9235, 556459, 271268, 274882, -30210, 448443, 247597, 387260, 273422, 288267, 456894, 306235, 361920, 325747, 286362, 670295, 419102, 200190, 216042, 247393, 361648, 48077, 370728, 254675, 362656, -18166, 261657, 35237, 265321, 710951, 282495, 309396, 52507, -116611, 399177, 198914, 18650, 462954, 32328, 324340, 386812, 196675, 280966, 362644, 159136, 80553, 322461, 447055, 275939, 478809, 80525, 293561, 240789, 73282, 316099, 176325, 208933, 394462, 240758, 101552, 378824, 396446, 325144, -8811, -110342, 259278]
13446A72559L06405o7660d9088C51707j59184E9644L42053A69288j8694K56759
13436D07353J3600j21662j03697J28559B0856L43266B5032K39364N1711O2957
13426C79064E2702J28575P4674Q056J04553j00834l140H2948f9028A70113E5298
13414B83140j18302J63433K357j20390P2071J3693J48085O1467j54739A42644
13403B28376i3142C79028q3295N9416A56416L9224P2300l4557M0742D9461J23653
13392A73114o7103O1839L54940B48630q8745n705o4772K77754j31185p7386J2428
13381A71019a26974B32493L1475M7935j49012G5726Q8803p6316I65K66631o5755
13370B01841K49624L6540A18344a9420C04532J65393k05503a06440D02417H8034
$$ y = [172559, 478964, 411304, -49088, 351707, 192523, 59644, 401697, 169288, 150594, 407353, 420953, 299291, 195594, 324153, 20856, 364122, 25032, 264396, 316107, 379064, 52702, 181277, 255951, 264007, 368560, 267726, 264586, 82948, -69028, 170113, 55298, 283140, 164838, 328271, 330628, 210238, 282309, 296002, 444087, 505554, 350815, 142644, 228376, -93142, 379028, 295733, 355149, 156416, 195640, 267940, 233383, 274125, 49461, 173114, 106011, 167850, 522790, 248630, 159885, 154180, 89408, 367162, 235977, 158591, 171019, -126974, 232493, 263968, 311903, 162891, 75726, 164529, 88213, 965, 267596, 201841, 451465, 488005, 118344, -19420, 304532, 469925, 264422, -106440, 402417, 88034]
13359F1407J89160R9740j67062m3789a0039A87697a09835B81929j39066a41439
13348C02483J48604j90483j26732J87272A01155N7912A1018L16251B5308L73209
13338C98517G3095J46662K0752m7474a04550K9527B28348O0969J66417A92064
13327C07717J13233J9815p8154J14101A81807K35355I7079a34679D23416j65774
13317B57642a04916D50461j03839b77416E91187k68606A11016J17600H9434d2711
13306D58487A5249b0871A87819J11844p7050J5340M3782J11970a7218B50563J89599
13295D40162A02848i5077A03911a00611D60808A08109J64370o901E6190J96271
13285B52461j10203P8735J675N5581f0622n1478a1032A29703k8755K02728l0784
$$ y = [61407, 250567, 350307, 183245, 139456, -10039, 187697, -109835, 281929, 142863, -141439, 302483, 451087, 260604, 133872, 321144, 101155, 159067, 11018, 327269, 25308, 398517, 73095, 219757, 240509, 193035, -104550, -75023, 228348, 289317, 455734, 192064, 307717, 420950, 440765, 362611, 476712, 181807, 417162, 97079, -134679, 423416, 257642, -104916, 450461, 346622, -277416, 591187, 322581, 111016, 228616, 89434, -42711, 458487, 15249, -20871, 187819, 299663, 222613, 237953, 281735, 393705, -17218, 250563, 440162, 102848, -95077, 103911, -100611, 460808, 108109, 272479, 265578, 56190, 252461, 142258, 220993, 222668, 278249, -60622, -112100, -11032, 129703, 100948, 303676, 272892]
13274B72892H9387g1006B72708B1553K18335K14180b9810b471B41873B6125L92719
13263D18844B5795N6779a17768a5753k8042A50515J50430d2681A51871J05798
13253B57669J52673I6864d7606C66605a54744c4475A28298K97547A80155M9814
13243B29969a44148a9047A13201K8698O5303M5833b24145B28011K07406j69331
13233B66086a459C35033a81378B51739i7320C89882L7339A70694j2368Q3067j11038
13222A30355e3486j1695b9054C47331p0589d5574c633m3252B06859D7986a86558
13210E4934K39029I445g2171A32735m8265e9400p8956g025A90934G8863J32161
13199B11024A01995c0968M47E23544B02706E991K50475M9770A14359N9926N5584
$$ y = [272892, 89387, -71006, 272708, 21553, 239888, 454068, -29810, -2471, 241873, 26125, 418844, 25795, 82574, -117768, -15753, -43795, 150515, 300945, -42681, 151871, 257669, 410342, 96864, -47606, 366605, -154744, -34475, 128298, 425845, 180155, 229969, -144148, -19047, 113201, 141899, 207202, 253035, -224145, 228011, 435417, 266086, -1459, 335033, -181378, 251739, -97320, 389882, 427221, 170694, 158326, 241393, 130355, -53486, -65181, -29054, 347331, 276742, -45574, -3633, -46885, 206859, 47986, -186558, 54934, 293963, 9445, -72171, 132735, 84470, -59400, -138356, -7025, 190934, 78863, 211024, 101995, -30968, -30521, 523544, 202706, 5991, 256466, 306236, 114359, 174285, 229869]
13188B29869M4923o26A02394D4679G498P6263D930L35681D6716J59422K97176
13177E03314B37149l9264j1753G9108C9178J65939m7403m2320P2459k0500p0518
13166I6835M60738G0145b22518b337E2935k1686j3547a19161B6939Q4872c6080
13154B05977L7331G5350e8798C03843J3673N2935k3134j24574a03943g246n9618
13143f6864B04080r2166a31095H0578J10008b69323B67882A7916J4507J10198
13133A42621C0542J87111I356h6740H6828a28272A80269K03379A47462c81670
13122b13262j8589B64387Q8161a52188j3510M3184N1244J6226k6217I2513A1357
13110B086h911A3780K16380i9388p6241B04237d2098B33744E154b37592i4750
$$ y = [229869, 274792, 274166, 102394, 44679, 7498, 83761, 4930, 340611, 46716, 206138, 503314, 237149, 197885, 186132, 79108, 39178, 205117, 157714, 115394, 187853, 167353, 96835, 557573, 70145, -222518, -2337, 52935, 31249, 17702, -119161, 26939, 111811, -36080, 205977, 243308, 75350, -58798, 303843, 317516, 370451, 347317, 222743, -103943, -7246, -66864, 204080, 111914, -131095, 80578, 190586, -269323, 267882, 17916, 32423, 142621, 30542, 217653, 9356, -86740, 86828, -128272, 180269, 383648, 147462, -381670, -213262, -231851, 264387, 352548, -152188, -165698, -122514, -71270, -55044, -81261, 92513, 11357, 2086, -8911, 13780, 230160, -99388, -175629, 204237, -42098, 233744, 5154, -237592, -94750]
13098B89143h1586m8418j42996J14922b9049j15829j31589B11761F426b7205A45545
13086A45018K347e7957A49734J43488d8801A58521F950i4084B39798b5089B01698
13074C39229A31524D1949c30090i6665B85002e0431k5951B26253a16499D56994
13063a8192C3928M3443c49771B44777I9710K29315a1078B09695B0539g6971C87239
13051A41411O2427g9606F4805O4671J75995n0203n5753G8304J2772K14616I9435
13039E6884K33557A02203b0268A78316J69294E7566d7444A93190G4791K63115
13029C37906A824M34856a2199C10319A30692a10935A98552L0134a88824Q4244
13019a04580A70216R8862a09598D6830a16327B88716J50276A51911d7921F340
$$ y = [289143, -81586, -130004, -273000, -158078, -29049, -144878, -276467, 211761, 6426, -27205, 145545, 145018, 147365, -57957, 149734, 293222, -48801, 158521, 6950, -94084, 239798, -25089, 201698, 339229, 131524, 41949, -330090, -96665, 285002, -50431, -76382, 226253, -116499, 456994, -18192, 33928, 77371, -349771, 244777, 99710, 329025, -11078, 209695, 20539, -76971, 387239, 141411, 203838, -79606, 64805, 129476, 305471, 255268, 199515, 78304, 91076, 305692, 99435, 56884, 290441, 102203, -20268, 178316, 347610, 57566, -47444, 193190, 74791, 337906, 1824, 436680, -12199, 310319, 130692, -110935, 198552, 228686, -188824, -104580, 170216, 269078, -109598, 46830, -116327, 288716, 438992, 151911, -47921, 6340]
13008A17123J32061j6880K1145G7213f9914m5879C28149A05954e730G3251L6934
12997A10185j114J5035C2212d0509B1411M7533N5625i3433A03315a29564B14138
12985a44183f020A67522D6932N2615K03880j33103d9827j80409E9174L05607D3309
12973b16746A41484J07879l8499j02115C079a33417J8656D5019K55111A8522J31841
12962A50363c4435H1073g2456B50913I9997a13317A2848K47095N5920m1495b08517
12950A96980a30267O4305G5245M4786a65255D7914f9925A04715m2162J72543M6961
12939B82057l3956g6511j36311j64781f415A30865g1479l52190e5395A43549C8655
12927G3490A2772g8743D6828a88709O2814B2768a46450L8536F9821Q8418J2351
$$ y = [117123, 249184, 232304, 253449, 77213, -69914, -115793, 328149, 105954, -5730, 73251, 110185, 109071, 124106, 32212, -40509, 21411, 68944, 124569, -93433, 103315, -129564, 214138, -144183, -6020, 167522, 46932, 99547, 303427, 170324, -49827, -230236, 59174, 364781, 43309, -216746, 141484, 249363, 210864, 108749, 3079, -133417, -114761, 45019, 300130, 18522, 150363, -34435, 81073, -72456, 250913, 99997, -113317, 12848, 259943, 315863, 274368, -208517, 196980, -130267, -65962, 75245, 120031, -165255, 47914, -69925, 104715, 62553, 235096, 282057, 248101, -76511, -212822, -377603, -6415, 130865, -71479, -423669, -55395, 143549, 38655, 73490, 12772, -78743, 46828, -188709, -125895, 22768, -146450, -107914, 69821, 158239, 170590]
12916A70590a54879A2211J0083J07369g7758B1929J65308L1408K0517j14129a1213
12904c820C1967b42143O379N2899H577O1821F436d6358l3896n059A3512b8409
12891a8177A48163b5011B62442h4119G7824B460h4925r7832A05924J31542a1011
12879D22056A16213J39165f0714C4892c26479k8941A96719j8090b27400c8438
12868a80758P1339A10792C4298N9403b0826j27242l4179B78648Q2886a48279H7655
12856C10844c26750B69175C2340P7549E30f5652K2478C74552H4224K30460j51156
12845A63528e6848j30940A5641J99729o8345g2316D9442A5970J36617G0272I916
12833g2020J1474F8022a01350A76087d03307F9504a85706H425R4154a63965f3628
$$ y = [170590, -154879, 12211, 22294, 129663, -77758, 21929, 187237, 218645, 239162, 125033, -11213, -3820, 31967, -242143, -235764, -182865, 8577, 70398, 6436, -46358, -80254, -85313, 13512, -28409, -18177, 148163, -25011, 262442, -84119, 77824, 2460, -84925, -182757, 105924, 237466, -11011, 422056, 116213, 255378, -60714, 34892, -326479, -355420, 196719, 178629, -227400, -38438, -180758, -109419, 110792, 34298, 93701, -20826, -148068, -182247, 278648, 361534, -148279, 87655, 310844, -326750, 269175, 32340, 109889, 530, -65652, -43174, 374552, 84224, 314684, 163528, -56848, -187788, 15641, 215370, 147025, -72316, 49442, 15970, 152587, 70272, 9916, -72020, -60546, 68022, -101350, 176087, -403307, 69504, -185706, 8425, 102579, -163965, -63628]
12821C3720a1027F2295b52085C816b85911A51377a62294F63504g9963n1612k42887
12810c74462F3474b10126C87956A45393d5122j92195I7115f1315A42288a08490
12799d6997B05432f3789o2287A9539a98555m1006A65069c450A32552Q0343K3777
12788B36672p5470a89679A80184d0292H4468R5400c0087p3435A33982b00397B39644
12776D7298r091J12340a19483F9872J03252a06580k04171Q6372m1087A51509c24038
12764B7265e562l7882n0377C20270b02160F0835e2332j59269n0598B18390a73234
12752d8827F2599a2392C03737C7524h0656B52850a52733j6575b7532A61422f2919
12740A17178a31652A74787b56112B06335p0550a45019E5699a35881e0826B57516
$$ y = [33720, -11027, 62295, -252085, 3816, -285911, 151377, -162294, 663504, -79963, -131575, -374462, 63474, -210126, 387956, 145393, -45122, -237317, 97115, -61315, 142288, -108490, -46997, 205432, -63789, -126076, 19539, -198555, -239561, 165069, -3450, 132552, 212895, 236672, 161202, -189679, 180184, -40292, 84468, 179868, -30087, -103522, 133982, -200397, 239644, 47298, 38207, 150547, -119483, 69872, 173124, -106580, -310751, -224379, -265466, 151509, -324038, 27265, -5562, -43444, -93821, 320270, -202160, 60835, -52332, -211601, -262199, 218390, -173234, -48827, 62599, -12392, 303737, 37524, -80656, 252850, -152733, -169308, -27532, 161422, -62919, 117178, -131652, 174787, -256112, 206335, 135785, -145019, 55699, -135881, -50826, 257516]
12729E6785A1303d43124I3231K25262b22331k7278E3209e6547j82253D09555D6746
12717b5638I1263j0668N665P4613b17655a01284p8009C24255H2370l4527J23115
12706A70958D1633c5302B35764b20229B15555c21811d2227n7952B85368K10076
12696D95444f2517k35829C77265C8220M06563b9539D60999n6118j5311A40326
12685B67969a28509D37784k13625C9050a96772r2269B29039C1160a83100K2017
12675a61083A93027o7741M6915e436k03754A44173a28472A42524C1187N3272J55352
12664B39811F7282J5403R392f7846q5404A77426B0596L51424a60817j21909D4214
12652A63111k1561d0030D3228b55580B58277b22555I4525L241b69412D2479J23569
$$ y = [56785, 11303, -443124, 93231, 318493, -222331, -249609, 53209, -56547, -238800, 409555, 46746, -25638, 91263, 80595, 86260, 160873, -217655, -101284, -179293, 324255, 82370, 47843, 170958, 41633, -35302, 235764, -220229, 215555, -321811, -42227, -100179, 285368, 495444, -62517, -298346, 377265, 38220, 444783, -29539, 460999, 404881, 389570, 140326, 267969, -128509, 437784, 224159, 39050, -196772, -289041, 229039, 31160, -183100, -161083, 193027, 125286, 172201, -5436, -209190, 144173, -128472, 142524, 31187, 84459, 239811, 67282, 82685, 92077, -67846, -153250, 177426, 20596, 372020, -160817, -282726, 44214, 163111, 141550, -40030, 43228, -255580, 258277, -222555, 94525, 97766, -269412, 42479, 166048]
12641A66048c55283H6377J21655b19919A73977e5007B64753o8610K83159c3301
12630B43221D5413b94732J29377B24068C8970J23281b71486A00504K43085g5208
12619A35704j5048J30193j08679a52026A59673n6036L61536p1482A1645m302J92559
12608A99902p5993J99762H7309c08369b4887B07618h5277B3938N6887b59279A15048
12596a28705d6900j36969b8594i608m8517J3611C9063J65226b2737j39504a8972
12584A17246A1437R9298K60178d765D155P9347J01234A4509J31198L8341c13557
12572C814J07080a04295E4528J37179h2947G7831a5316A18385p118C3785a103
12560a10967E0553b02589G8791J09224A2331g1608m1555n7550B8883K31201K6743
$$ y = [166048, -355283, 86377, 208032, -219919, 173977, -55007, 264753, 196143, 479302, -33301, 243221, 45413, -294732, -165355, 224068, 38970, 162251, -271486, 100504, 343589, -75208, 135704, 120656, 250849, 142170, -152026, 159673, 103637, 465173, 393691, 11645, 7343, 199902, 123909, 323671, 87309, -308369, -24887, 207618, -85277, 23938, 80825, -259279, 115048, -128705, -46900, -183869, -28594, -9608, -58125, -44514, 39063, 204289, -22737, -162241, -18972, 117246, 11437, 110735, 370913, -4765, 4155, 83502, 184736, 14509, 145707, 184048, -313557, 3814, 110894, -104295, 54528, 191707, -82947, 77831, -15316, 118385, 111267, 33785, -1103, -110967, 50553, -202589, 78791, 188015, 12331, -71608, -113163, -170713, 28883, 260084, 286827]
12549B86827r0920a1924o0035B67223k7047b73972A46719K1098o9619L2893j8851
12538A12240a40478k7349A87530c32870a42810e7288k64280C85000A14733l519
12528A11214a02513j22532A45282N3899b98500c0613m6684j53046B30338c50143
12517b70865J09174P5575J8162l7471q5112B64775a78699M4073N5119q4636J9356
12506a44787h621E9058J36781q1483B3377g7510j82629a22423j93573J36898c3104
12494h5707B1807b2069A26200l9935a47918N5580l5362I8790g7955A04892j5445
12483H9447D589L7179K19897G3695L7904a08739r4310d1836j28914B39764b30877
12471a75552A20484b51322B2798a23388j46884f1985j36118q2585A37256n5727
$$ y = [286827, 195907, -11924, -71959, 267223, 240176, -273972, 146719, 167817, 98198, 131091, 112240, -140478, -167827, 187530, -332870, -142810, -57288, -321568, 385000, 114733, 111214, -102513, -225045, 145282, 199181, -298500, -30613, -77297, -230343, 230338, -350143, -270865, -161691, -86116, -67954, -105425, -190537, 264775, -178699, -134626, -79507, -164143, -144787, -8621, 59058, 195839, 114356, 23377, -77510, -260139, -122423, -315996, -179098, -33104, -85707, 21807, -22069, 126200, 86265, -147918, -92338, -127700, 98790, -77955, 104892, 89447, 4589, 41768, 261665, 73695, 111599, -108739, -203049, -41836, -170750, 239764, -230877, -175552, 120484, -251322, 22798, -123388, -270272, -61985, -198103, -280688, 137256, 81529]
12461H1529g4937A79314a80847A18734b64578B96515b25786A869e850j16081M2833
12450g9098A77721g0763A03808a80649A89881f6769B77345J65726b84822e2840
12439G5773N8055a68802A85603Q3309C145a88900A08263c9049a0352m61828a84298
12427a01241C8455b0720D3749a8115B47909a53950M8453l95408a28073k70549
12417c98622g2219b5152E2323i3538B1283d6794q9151G2106H00c66277B29988
12405G5229e0731a7154F3950a36349A44485A4699c4644k64259e847j35403q2243
12394b23493I1622A0334K17919F7020c7086B09994P6679c2060C342J23027b3982
12382B55861b40360I744K04330a69568B2097a05904A91257H9855J38811R0100
$$ y = [81529, -74937, 179314, -180847, 118734, -264578, 296515, -225786, 1869, -5850, -121931, -79098, 177721, -70763, 103808, -180649, 189881, -66769, 277345, 443071, -284822, -52840, 75773, 133828, -168802, 185603, 268912, 3145, -188900, 108263, -39049, -10352, -472180, -184298, -101241, 38455, -20720, 43749, -18115, 247909, -153950, -105497, -500905, -128073, -398622, -72219, -25152, 52323, -93538, 21283, -46794, -135945, 72106, 800, -366277, 229988, 75229, -50731, -17154, 63950, -136349, 144485, 14699, -34644, -298903, -5847, -141250, -223493, 91622, 10334, 228253, 67020, -37086, 209994, 286673, -32060, 3342, 126369, -23982, 255861, -240360, 9744, 214074, -169568, 22097, -105904, 191257, 89855, 228666, 318766]
12372C18766b32403f205A36539J45529r217c14491A84868C336a75082B40500K55086
12361D95586A53620J98028A68146c0265A81388h8647F1735a11810k53569h8288
12350B10092b0321q353C10050C0954N3859e4959l55448A41567h0615l10971b6608
12338a29463I7918a59165I6988a8150E7723K19395G5834b11461k9640P9022O4971
12327i7108A3892c34441f3888i617m7006j16276B53400n6929D8253L235a27965
12315H2954a10974C81718g0555D48120A77694O4266i39A64477n0823b4885B09231
12303C63153R5713j48625j06486L33770c3324C18312a66939C17691o0063E463
12292C02612I2052N796J2703h744C08846e020C19572A11452G139N9778a42557
$$ y = [318766, -232403, -6205, 136539, 282068, 272851, -314491, 184868, 3336, -175082, 240500, 495586, 153620, 351648, 168146, -30265, 181388, -88647, 61735, -111810, -365379, -88288, 210092, -20321, -28674, 310050, 30954, 84813, -54959, -410407, 141567, -80615, -391586, -26608, -129463, 97918, -159165, 96988, -18150, 57723, 277118, 75834, -211461, -241101, -162079, -97108, 13892, -334441, -63888, -9617, -56623, -172899, 253400, 196471, 48253, 51488, -127965, 82954, -110974, 381718, -70555, 448120, 177694, 241960, -939, 164477, 113654, -24885, 209231, 363153, 458866, 310241, 203755, 537525, -33324, 318312, -166939, 317691, 257628, 5463, 302612, 92052, 97848, 110551, -8744, 308846, -5020, 319572, 111452, 7139, 66917, -142557]
12280A59731E5115b64060A91228C8501P8131b1129G5337J16864j3516m500n6121
12269A18064J07374J18395H0194C1491J99876n6538p7339d3683A29788K37721
12259C67509D7586o372K4305L52566A76628K08689A02330P3819O5264n117k8575
12248B07721C0757L33902j47042F0520Q6273a09063C3095J87047B7081K02235
12238B29316a11039j42842e0265A39719N0628e9360E2844J03110J26058B3072
12227a81209A87205q8563a01938F7492J31967F5138a17203B57185g4021b567D4492
12215a69480B14415H9751c96252D89426A07684J28323a76231C10246A14686K25993
12205C40679A50131b4101B56604l6577F2885B2920Q7079J84340r7470k6887J11599
$$ y = [159731, 55115, -264060, 191228, 38501, 116632, -21129, 75337, 192201, 178685, 174185, 118064, 225438, 343833, 80194, 31491, 231367, 174829, 97490, -43683, 129788, 367509, 47586, 41214, 65519, 418085, 176628, 385317, 102330, 176149, 241413, 236296, 207721, 30757, 364659, 217617, 60520, 146793, -109063, 33095, 220142, 27081, 229316, -111039, -253881, -50265, 139719, 190347, -59360, 52844, 155954, 282012, 23072, -181209, 187205, 98642, -101938, 67492, 199459, 65138, -117203, 257185, -74021, -2567, 44492, -169480, 214415, 89751, -396252, 489426, 107684, 236007, -176231, 310246, 114686, 340679, 150131, -24101, 256604, 220027, 62885, 22920, 109999, 294339, 196869, 169982, 281581]
12194B81581F5854L02722p3022a07650A54728J38924H992J37608P2043M2708F9805
12182H9711l3408P6724k3145O4933m7940K3940J29412J21127g9835l2822D4285
12170a0525k23375k7546B77251j01457J18296a60854C62956F6536J36347c53309
12159A46246L8512N1222b6527B56578l7148K22742j66145h447D4154L7416Q1940
12148A63510m1763D6151K26419j3880J01362m4254l3292A7603Q0963B9059f7665
12136G9748B0313g7180A35401a10248B20833K15216b17234G3572c6184D8648O3441
12125A12089j8792M9K310b20816f2303H0333N5791K12063b61747e7811A91950
12113A44409B4099N505A3454J33872d8384B94760H7736L9656Q3896m7857J81824
$$ y = [281581, 65854, 368576, 295554, -107650, 154728, 293652, 8992, 146600, 218643, 261351, 69805, 89711, 56303, 133027, 109882, 174815, 126875, 150815, 280227, 401354, -79835, -112657, 44285, -10525, -233900, -261446, 277251, 175794, 294090, -160854, 362956, 66536, 202883, -353309, 146246, 184758, 235980, -26527, 256578, 219430, 442172, 276027, -8447, 44154, 81570, 163510, 121747, 46151, 272570, 258690, 360052, 315798, 282506, 17603, 98566, 29059, -67665, 79748, 20313, -77180, 135401, -110248, 220833, 436049, -217234, 73572, -36184, 48648, 112089, 93297, 93346, 95656, -220816, -62303, 80333, 136124, 348187, -261747, -57811, 191950, 144409, 24099, 29604, 13454, 147326, -48384, 294760, 87736, 127392, 211288, 163431, 345255]
12102C45255J23283B03787L3396H2929L00069b92861O6219b0886A23495a3060
12091B96635c3994F6470j8437b8683B46164J04686j14349g0865B0317b68771A12493
12079G0115K5439L61648j4760D6827a68634A29449M4761k337J60584e1659j10687
12068a62346A90729a3013A21292J34364R7452A29559J43831m4025q9168d0663
12057C3441M1856k4935K70222a01358B76549j20687M8290b01892B32620l3081
12047A99539C0962J89221l369J35317b3073C20887b7855P965j2931I358L9040
12036D8398J73935O5815b82931J34655m9797h7180B41558k2303b39032e0603j36528
12025a87131P0950C22845h5743E52b19062B18482j427D6491N710J36939h3032
$$ y = [345255, 468538, 203787, 237183, 82929, 382998, -292861, -226642, -20886, 123495, -13060, 296635, -33994, 66470, 48033, -28683, 246164, 350850, 236501, -70865, 20317, -268771, 112493, 70115, 95554, 457202, 442442, 46827, -168634, 129449, 174210, 171873, 332457, -51659, -162346, 190729, -13013, 121292, 255656, 353108, 129559, 273390, 229365, 140197, -40663, 33441, 75297, 50362, 320584, -101358, 276549, 155862, 204152, -201892, 232620, 199539, 30962, 220183, 216814, 352131, -23073, 320887, -27855, -19890, -32821, 9358, 48398, 222333, 288148, -282931, -148276, -198073, -87180, 241558, 219255, -239032, -50603, -187131, -116181, 322845, -85743, 552, -219062, 218482, 217055, 46491, 52201, 189140, -83032]
12013G7809a27963B96390i2344D3515d6240A50631a17809n8219C96730b74170
12002c9006m6732F5064k4747e3388E99983A0094J30536K01276A06797c55502f6466
11990a8990A51653E5604o577R8722E0625J85726B1689a43166j69507J08824b2664
11978e9543A02559N8150n6189K5555B1953b91251a01574a6301B35570e9461H9151
11966A11822a92348E2360L7706b14051A05034L53123b79903f7316k8365G9068
11955B31488E8001b88823B5887K36179A03189a76412G0844K5151a63069g3153
11944D6295P4310i7946r7913G7357b22639G6190j7964c559j31653M4268A67311
11932A77775q8304j3898k6239L789a16056D0619b76312C05389e88j97313C9368
$$ y = [77809, -127963, 296390, -92344, 43515, -46240, 150631, -117809, -176028, 396730, -274170, -39006, -85738, 65064, 40317, -53388, 599983, 10094, 140630, 341906, 106797, -355502, -66466, -18990, 151653, 55604, 49027, 147749, 50625, 236351, 21689, -143166, -312673, -203849, -22664, -59543, 102559, 160709, 104520, 130075, 21953, -291251, -101574, -16301, 235570, -59461, 89151, 111822, -192348, 52360, 90066, -214051, 105034, 458157, -279903, -67316, -95681, 79068, 231488, 58001, -288823, 25887, 262066, 103189, -176412, 70844, 95995, -163069, -73153, 46295, 120605, -97946, -195859, 77357, -222639, 76190, 58226, -3559, -135212, -90944, 167311, 177775, 89471, 75573, 49334, 53123, -116056, 40619, -276312, 305389, -588, -197901, 39368]
11920E19332A62033a34082B989K09857a24251e0541k03590d0231m1187A19810
11909b75821a8222j66372M6730j32096C28412a70629D2051b93563A10350D3920
11898a91058g3771J637A26207J28426a5656j8759n8998q767l1989d9308A59028
11886b01154B34221h5225p5317A42592E1806i322B97182i08A43264A4256L0849
11875D5105L8436a12889l15606A10738a15810K2627A81883f8122D28091b11807
11864I754a00514j44686F0493i1489B68437A08822a12246B2093c8655A43211b7766
11852A77050b20694c9298c994p5266n5451B03664r1993a7156A02034B8666J31720
11841A60386b8385j00703k93738A56312c77197a58407f3393C10404p6903C8560
$$ y = [519332, 162033, -134082, 2989, 212846, -124251, -50541, -254131, -40231, -81418, 119810, -275821, -18222, -184594, -137864, -269960, 328412, -170629, 42051, -293563, 110350, 43920, -191058, -73771, -72134, 126207, 254633, -15656, -34415, -93413, -102180, -134169, -49308, 159028, -201154, 234221, -85225, -160542, 142592, 51806, -9322, 297182, -908, 143264, 14256, 45105, 83541, -112889, -428495, 110738, -115810, -93183, 181883, -68122, 428091, -211807, 9754, -100514, -245200, 60493, -91489, 268437, 108822, -112246, 22093, -38655, 143211, -27766, 177050, -220694, -39298, -3994, -79260, -134711, 203664, 111671, -17156, 102034, 28666, 160386, -28385, -129088, -422826, 156312, -377197, -158407, -63393, 310404, 233501, 38560]
11830a46051A85051d2440A46248d8698A32598K34908G713a67701g9939k7503I4921
11818a36872k8083C687e3090A93420h8459b024A11498d37291H1526c47645A93456
11806A56772J55282b68924D8328B594b83144A86078a4226G7695b70078A24614
11795C97263c4049r1817N1728r82c1157A57818j3257a94535A31131i681D92419
11783a51012i999B00513b86579c1929n7116p8268j49657R3042F164R3103c6857
11771A93116b42529M9293m845b1968A40840b14677A73685a7345o4698A80734A8814
11759G6594J800M12940c41395A67959b9045O264j9405l10298a28908A12840f6477
11747a14884l19828f191B30741g9457J6930A37695B5968J3214K05865a55072p3343
$$ y = [-146051, 185051, -42440, 146248, -48698, 132598, 367506, 7713, -167701, -79939, -107442, 94921, -136872, -164955, 3687, -53090, 193420, -88459, -2024, 111498, -437291, 81526, -347645, 193456, 156772, 312054, -268924, 48328, 2594, -283144, 186078, -14226, 77695, -270078, 124614, 397263, -34049, -125866, -74138, -75120, -31157, 157818, 144561, -194535, 131131, -9681, 492419, -151012, -9999, 200513, -286579, -31929, -89045, -167313, -316970, -223928, 6164, 99267, -36857, 193116, -242529, -193236, -198081, -21968, 140840, -214677, 173685, -17345, -82043, 180734, 18814, 76594, 78394, 491334, -341395, 167959, -29045, -22781, -42186, -352484, -128908, 112840, -66477, -114884, -434712, -6191, 230741, -79457, -62527, 137695, 25968, 39182, 245047, -155072, -228415]
11736b28415a04315E9257A1437J55127i9953B0677o422Q4715b48371L0501M3169
11725a74701B94876A0991a0521j6609J1712E16144b82745a36747N9065A73317
11714a01790A90430L5767B4233K73227D1156e1886E2481e4329H004c9304D9362
11702G2150a38817A88246J32909A50668a6392L458k47723J22574j0414F6373k2922
11691D3451j7173J34043N1919J2392a34761q204j31966O8583o030e0619k01A53925
11678b1418k87720B16267b37867B38733q9904J9213a25066D0287b1227B99318
11667b76178e4844j23990A67103G3294d19933B15210A2354O281J1560Q3458l2207
11656H1446a23755A03202N9086a3203j32347c7008k5628D7187a29147A33961m4386
$$ y = [-228415, -104315, 59257, 11437, 166564, -99953, 20677, 14255, 98970, -248371, -217870, -174701, 294876, 10991, -10521, -27130, -15418, 516144, -282745, -136747, -77682, 173317, -101790, 190430, 226197, 24233, 297460, 41156, -51886, 52481, -54329, 8004, -39304, 49362, 72150, -138817, 188246, 321155, 150668, -16392, -12934, -260657, -138083, -148497, 66373, 43451, 26278, 160321, 212240, 224632, -134761, -142965, -274931, -206348, -212378, -50619, -50820, 153925, -21418, -309138, 216267, -237867, 238733, 148829, 168042, -125066, 40287, -21227, 299318, -276178, -54844, -178834, 167103, 73294, -419933, 215210, 12354, 18635, 30195, 113653, 81446, -123755, 103202, 162288, -13203, -145550, -37008, -62636, 47187, -129147, 133961, 89575]
11645H9575M1565l3435l4983f9442B99646b15844A21652D5005K107e929n7473
11634f3402j12791a7597l4435F1311J8189a07801B7593R2487k8567B8434b57303
11622B06495q7282d4141j04072H3192b08404C34766c99246f6557j95000G2251
11611A19333E1439a85679E623J15032C1981a14277F8098B6096a3113A66609a2746
11599A9830O6125a19947A68876a24350A20118A4059Q3716B7358J58106a02266
11588a4098d833p3090k8453B5036J03595R3775f3942A96667J35307A61973R7930
11577B59903j15778J30589a27784k741k29022A30517L3950B5221L24666j12454
11567B37433f862G7509J33223b2366f140r5719A2534R7459J34355b68446A08516
$$ y = [89575, 131140, 97705, 62722, -69442, 299646, -215844, 121652, 45005, 47112, -5929, -63402, -176193, -17597, -52032, 61311, 79500, -107801, 27593, 120080, 91513, 28434, -257303, 206495, 119213, -44141, -148213, 83192, -208404, 334766, -399246, -66557, -261557, 72251, 119333, 51439, -185679, 5623, 120655, 31981, -114277, 68098, 26096, -13113, 166609, -12746, 19830, 85955, -119947, 168876, -124350, 120118, 14059, 97775, 27358, 185464, -102266, -14098, -4833, -77923, -106376, 25036, 128631, 222406, -63942, 196667, 331974, 161973, 259903, 144125, 274714, -127784, -130525, -359547, 130517, 164467, 25221, 349887, 237433, -6862, 77509, 210732, -22366, -6140, -101859, 12534, 109993, 244348, -268446, 108516]
11555G3800e6131F3143h0677H6390B5026e8427A26886a80564C24854j58014a17330
11543A4751b2761A57495K49453A54480N4012K4080J15001g4288j55514E364N1050
11532E6414A3283J70368J00221F8461J12954a54932B53483a43460F6039J83766
11522B49805K22716h5622C33932a40285F2150j8117a98508A46037c3268F991M6611
11511E3602J10015l2656D7393J60275A1482f3125D5960c18482A90500L7581j08744
11500A19337a099B42218O5747B9411b5410A28277D4014f6900A2371b71591C62446
11488A23026f4979c1186B24911q8356h3327A69592F5850J68586j5771a97012J6903
11477a80109I3453a28712A73768p0703i975B06631a85363C5061R939b497j09320
$$ y = [73800, -56131, 63143, -80677, 86390, 25026, -58427, 126886, -180564, 324854, 166840, -117330, 14751, -22761, 157495, 406948, 154480, 208492, 232572, 347573, -74288, -229802, 5364, 56414, 13283, 183651, 283872, 68461, 181415, -154932, 253483, -143460, 66039, 249805, 472521, -85622, 333932, -140285, 62150, 44033, -198508, 146037, -33268, 6991, 53602, 163617, 130961, 47393, 207668, 11482, -63125, 45960, -318482, 190500, 228081, 119337, -1099, 242218, 307965, 29411, -25410, 128277, 44014, -66900, 12371, -271591, 362446, 123026, -64979, -31186, 224911, 136555, -83327, 169592, 65850, 234436, 218665, -197012, -180109, 93453, -128712, 173768, 103065, -9975, 206631, -185363, 35061, 45000, -2497, -111817]
11466a11817A64394f0030A64982G8471a02182A11750M6197l7090J27797a87555
11455B3865J76575m2777J9387f3914j10979j21194A58454b55589F506g3488B2806
11443D870c3A79859d8121j29334B43663i2324E9015K02311A7756O9243J06952
11432A93951E5735M49221k06331G3673c17070A38451e8159D2403a02304A85710
11421i0280c497D8773M4654e2527I9020K54189I0848b24198f5514A45060f4097
11409B7309c60139A51157C2225K75895a27069A22203B0295g4151B85997G6093
11398F4346G622a37705N6003E30a30184b049j10942A5912R5929e4179N286k26988
11386b75881H9307a29903j45149E5979J13259I463h5482j69145Q8182B0914a87460
$$ y = [-111817, 164394, -60030, 164982, 78471, -102182, 111750, 157947, 120857, 248654, -187555, 23865, 200440, 157663, 177050, -63914, -174893, -296087, 158454, -255589, 6506, -73488, 22806, 4870, -33, 179859, -48121, -177455, 243663, -92324, 59015, 261326, 17756, 86999, 193951, 55735, 504956, 298625, 73673, -317070, 138451, -58159, 42403, -102304, 185710, -90280, -3497, 48773, 93427, -52527, 99020, 353209, 90848, -224198, -65514, 145060, -64097, 27309, -360139, 151157, 32225, 308120, -127069, 122203, 20295, -74151, 285997, 76093, 64346, 7622, -137705, -81702, 530, -130184, -2049, -112991, 15912, 111841, -54179, -48893, -275881, 89307, -129903, -275052, 55979, 169238, 9463, -85482, -254627, -166445, 20914, -187460]
11374d8381A84594c40123d0810j30166j87229a05663A85610c05409a48653B5143
11363H7438A6039a18614A53173b78432A69335F1777b50202P4576N2032o2441c1021
11351g0359B6125J5599K3555R9174b6030p7702A69168o8741d6382I2545c02953
11339i5891b5500D5629e38959J11656A29527a92280j75428C4000a73459B28174
11328a25978N2641A84203j6403Q5913C536h575n7262c0159A38554a68380J3782
11317a54598B86165a29503J5331n5291c6043D6325a10935k7461B09452F5959a60996
11305f7177A14684d1701B97023f8284K366q0115O1522A94098b24820J09029A3045
11293B30627B5905J93308e882j19170j631C4380e7289j0690q5393B8024e6000
$$ y = [-48381, 184594, -340123, -40810, -170976, -358205, -105663, 185610, -305409, -148653, 25143, 87438, 16039, -118614, 153173, -278432, 169335, 61777, -250202, -175626, -123594, -186035, -31021, -70359, 26125, 41724, 65279, 164453, -26030, -103732, 169168, 100427, -46382, 92545, -302953, -95891, -25500, 45629, -538959, -427303, 129527, -192280, -367708, 34000, -173459, 228174, -125978, -73337, 184203, 167800, 253713, 3536, -8575, -65837, -30159, 138554, -168380, -154598, 286165, -129503, -114172, -169463, -36043, 46325, -110935, -138396, 209452, 65959, -160996, -67177, 114684, -41701, 297023, -68284, -65918, -146033, -84511, 194098, -224820, -115791, 13045, 230627, 25905, 219213, -5882, -125052, -126683, 34380, -57289, -67979, -153372, 28024, -56000]
11281d5740k24627H5705J48Q7878e5959l19955B91618E448N7222M4831a28674
11269a08133E2721N5219a5663G8959A9982R5101D941c57938g8095A26005i9488
11257a84230Q2714l182d4820k30670a09118q8357j25874h3009J061B95462b71864
11245A08724E921a48980M0434A0233P3576D1331M7044P0070O77C3631p68c16782
11232i3249A91901f3183a3724n8969r4404N0716D2306a10473k48874i7398L2498
11221f4900A662a07006A45515i8294K1009L2652C6009a19391J4444J5262g776
11209I1720K0152a18322c0484k66316A86770b01297I7485B3684R469b29500e0543
11197a6592j33107j02934k78001G2923J64374i6751J3884o6305o6819J3269n0560
$$ y = [-45740, -270367, 85705, 85853, 173731, -55959, -375914, 291618, 5448, 62670, 107501, -128674, -108133, 52721, 107940, -15663, 78959, 19982, 115083, 4941, -357938, -78095, 126005, -99488, -184230, -101516, -104698, -44820, -275490, -109118, -197475, -323349, -83009, -81948, 295462, -271864, 108724, 5921, -148980, -108546, 10233, 83809, 41331, 88375, 158445, 159122, 33631, 32863, -316782, -93249, 191901, -63183, -13724, -72693, -167097, -116381, 42306, -110473, -359347, -97398, -64900, 1662, -107006, 145515, -98294, -77285, -44633, 36009, -119391, -104947, -89685, -7776, 91720, 111872, -118322, -30484, -296800, 186770, -201297, 97485, 23684, 33153, -229500, -50543, -16592, -149699, -252633, -530634, 72923, 237297, -96751, -82867, -149172, -215991, -202722, -253282]
11186b53282G2489Q5792h3931n57136H8017b83070F45989C9254K36410b37633
11175a64341c2845j36315B20027b846B0816c60158J62697h4520A92109D352a63281
11163a59492e1772j18056d0603k94018I272J82077c40731A36989E2962d0185E2443
11151a68560A66646N7181c8940l5391o6316j5160f0390n9922I5K60667b13209
11139F5536K965N2401d671A96459a5902l73113A18120A9110J05640B826K01116
11128B03942b72857l2494a37030f4447k9527B95595j29667J60584B7423d0102
11117a21012b3482D54624A54620f4440o8824j13947a9515j23725j2048B36136
11106B7516j3134b18549h3589B83019a84393Q6318I6117j1874a7804m1693A2070
$$ y = [-253282, 72489, 158281, -83931, -641067, 88017, -283070, 645989, 39254, 275664, -237633, -164341, -32845, -169160, 220027, -2846, 20816, -360158, -197461, -84520, 192109, 4352, -163281, -159492, -51772, -169828, -40603, -334621, 9272, 191349, -340731, 136989, 52962, -40185, 52443, -168560, 166646, 223827, -38940, -74331, -140647, -155807, -60390, -120312, 95, 260762, -213209, 65536, 68501, 120902, -4671, 196459, -15902, -389015, 118120, 19110, 124750, 2826, 203942, -272857, -305351, -137030, -64447, -93974, 295595, 165928, 326512, 27423, -40102, -121012, -23482, 454624, 154620, -64440, -133264, -247211, -19515, -143240, -155288, 236136, 27516, 14382, -218549, -83589, 283019, -184393, -98075, 96117, 84243, -17804, -59497, 12070]
11094G0170c8094L720m686l3261F8297K9148J27809A7752b302j03879M96L5063
11082g0622n8393d2194j36507A6081J89775k6376b93176A55446K02205j24490
11072B33161q7800K8921a71570B2920a15048A7944J22743l0466Q319K03433p7801
11061B44172J66011B03855o8239J83420b79927B97298o8876G0486J63236c7612
11050A47598J36607A4037K17466q5403N5058B2675L13308J24438k16395P8599
11040C22625j7416J47023j51210J03389J52135A29159M53248K38850l15366M7987
11030E53878q6498J74604K18537k78109j02940O0675L5415J12785n2455J04214
11020G40106o2909Q2265o4225j70175O9743J10396l14963J78895L38929r3340
$$ y = [70170, -38094, -34374, -39060, -72321, 68297, 97445, 225254, 17752, -2302, -106181, -105685, -70622, -129015, -42194, -178701, 16081, 205856, 179480, -293176, 155446, 357651, 233161, 145361, 174282, -171570, 22920, -115048, 17944, 140687, 110221, 118540, 321973, 244172, 410183, 203855, 135616, 319036, -279927, 297298, 228422, 70486, 233722, -37612, 147598, 284205, 14037, 231503, 146100, 201158, 22675, 335983, 460421, 244026, 322625, 305209, 452232, 301022, 404411, 556546, 129159, 582407, 821257, 505891, 553878, 467380, 641984, 860521, 582412, 479472, 540147, 575562, 688347, 635892, 740106, 677197, 759462, 695237, 525062, 594805, 705201, 390238, 569133, 908062, 814722]
11010H14722C30512J85097B8549K67078K77175k53140J27611j75477K7214J66960
11000D65970J2086B04734n4601K68321j62627K93936J95364k65629K2802J60211
10990F62511B36948L44420B79704J82740M46806j99007k76927j31866Q0566J87606
10980E69622k5232L20037j36754J40057k47506J24137k48906j13849j70726P65895
10970I76775l05376j96696L07544j67784J31313K43092R5431K03868n34556L33305
10960A086916j18377N96991k33320L18091k41104L29230L25104j52661J20011
10951B030881k16434O872J8050o4427m10570O2097K718k92485L75076K45480m05216
10940A352042L42464R679q4653K13075j00920k60391K36541n54437j3174k40714
$$ y = [814722, 330512, 515609, 28549, 295627, 572802, 319662, 447273, 271796, 299010, 465970, 478056, 204734, 150133, 418454, 255827, 549763, 745127, 479498, 502300, 662511, 236948, 581368, 279704, 462444, 909250, 710243, 433316, 301450, 382016, 569622, 544390, 864427, 727673, 867730, 620224, 744361, 495455, 381606, 210880, 976775, 671399, 474703, 782247, 614463, 745776, 988868, 1084299, 1288167, 753611, 1086916, 968539, 1565530, 1332210, 1650301, 1409197, 1738427, 2063531, 1910870, 2030881, 1814447, 1821319, 1839369, 1774942, 1364372, 1426469, 1429187, 1136702, 1511778, 1757258, 1352042, 1694506, 1704185, 1619532, 1832607, 1731687, 1471296, 1707837, 1153400, 1140226, 899512]
10930H99512k17179n563k91094K71094B83988P638q3216L755L01862F9437M17503
10919D86940a65180B00350J74936b10172i8246B6807J52322m4547b76q0920A19582
10907A13860M3597a93062B669a51943m4581f4586B4718O0403b9041C86468b24748
10895H6649O1948r413F0649d736k75587B30462a63214I4170b13033B9230n930
10884B3300K2349K64611j27687a53405c5401j46731h7175b2716A28008B3925R3031
10873A16956B6377c7522A85408c10867a26074e8977j35554F5706a60692A77678
10862B91621c00208A28671m4213h9553B2793g5163M554G1487b31918q0555c9113
10850b16735H3206b51897d0379F9372k115g2531B74138b14100a232k39323k2735
$$ y = [899512, 682333, 676770, 385676, 656770, 283988, 291626, 208410, 212165, 514027, 69437, 486940, -165180, 200350, 375286, -210172, -98246, 26807, 179129, 134582, -276, -81196, 119582, 113860, 157457, -193062, 2669, -151943, -196524, -64586, 24718, 85121, -29041, 386468, -224748, 86649, 148597, 139184, 60649, -4736, -280323, 230462, -163214, 94170, -213033, 29230, 23300, 45649, 310260, 182573, -153405, -35401, -182132, -87175, -22716, 128008, 23925, 116956, 26377, -37522, 185408, -310867, -126074, -58977, -194531, 65706, -160692, 177678, 291621, -300208, 128671, 84458, -89553, 22793, -75163, -70609, 71487, -231918, -312473, -39113, -216735, 83206, -251897, -40379, 69372, 67257, -72531, 274138, -214100, -1232, -240555, -263290]
10839b63290B12887a68383A23323f9925Q035j3394C00859I5453A7166P1956C0815
10827B87822h9044l3900q3337b9452f841m26610a20897o9998F9407a55242b9841
10815h0596L7570C50739m6262b41806f0781k096k06748A92018b13292A30724b13903
10803d9970A5199K3028b21007A7292K38386K9240F0050Q7337d879A10631a12382
10791A199J13242D7284a53969F0632N1060R2707b11601J03025M4610F4812a79980
10779B9691h8911o5722B4377g8715q0055q8112e4770A1028b64621F4202a30989
10767b15002J5432m909j35263a0606q2812j20107B8978b13142j9934i5566F6183
10755A38769a06977A66275j12a74774A86730b14930A25986d1985A02452c3480
$$ y = [-263290, 212887, -168383, 123323, -69925, -61890, -75284, 300859, 95453, 17166, 89122, 30815, 287822, -89044, -122944, -206281, -29452, -6841, -433451, -120897, -190895, 69407, -155242, -29841, -80596, -43026, 350739, 304477, -241806, -60781, -62877, -269625, 192018, -213292, 130724, -213903, -49970, 15199, 38227, -221007, 17292, 255678, 284918, 60050, 147387, -4879, 110631, -112382, 1199, 114441, 47284, -153969, 60632, 111692, 204399, -211601, -108576, -63966, 64812, -179980, 29691, -88911, -154633, 24377, -78715, -158770, -246882, -54770, 11028, -264621, 64202, -130989, -215002, -199570, -204479, -339742, -10606, -93418, -213525, 28978, -213142, -233076, -95566, 66183, 138769, -106977, 166275, 166163, -174774, 186730, -214930, 125986, -41985, 102452, -33480]
10744c23316J12261R7425j77639j084A97113g2160q1038b3315j26918B4648a19023
10732A01125m3045a26096F4805b72186A29575N8412b31469B6684b20810H8113
10721F7874b72453a2678l3586J7386G1293J30183a00163j2880E1854J12705e14178
10709a4605B23398J2970a36920C49114e4859B45826h2969J679A82112c7512H4863
10697c28065e4610A11475D758L2878a17342H3821e8618j76410A38377c23393f9230
10685b03320B8176M3347J10493g7322j80529F5194K70484o0745j20857a70347
10674I065b56559m0687A89773c34957e4745j75684C66706a87575B00340b71402
10663a01429B2486e4209A47146a48768j34958b7604b49n0161J8598j02237l6198
$$ y = [-323316, -211055, -113630, -291269, -292353, 197113, -72160, -153198, -23315, -150233, 24648, -119023, 101125, 58080, -126096, 64805, -272186, 129575, 187987, -231469, 26684, -220810, 88113, 67874, -272453, -12678, -46264, -28878, 71293, 201476, -100163, -113043, 51854, 164559, -514178, -14605, 223398, 236368, -136920, 349114, -54859, 245826, -82969, -81290, 182112, -37512, 84863, -328065, -54610, 111475, 4758, 37636, -117342, 83821, -58618, -235028, 138377, -323393, -69230, -203320, 28176, 71523, 182016, -77322, -257851, 65194, 335678, 274933, 154076, -170347, 9065, -256559, -297246, 189773, -334957, -54745, -230429, 366706, -187575, 200340, -271402, -101429, 22486, -54209, 147146, -148768, -283726, -27604, -249, -50410, -31812, -134049, -170247]
10652a70247f2213F1466b54311A52730a52653B02448c36518a43067A42213a5783
10641b54744a09249m1768K7871m2052B12922f6944a115I8130a98091k4015c8251
10629c81930J51684I9817c23197J59175e3877l04007a20608m5572j2984j5343
10619a94507A12551c17459E9815K04232C1263g0681j29645B06060o8942J12633
10609B49751c30114i7663C028P2601a8701j02205C0531c6851A00875J10466e2628
10597b15858B40587d55479C68576c01583E3439J11603L4989c07237g9779b9099
10586E897d0551j64764R1169j43519a23800C25014d7545k538r6605k15330D0013
10574a05826j93139O0420B12287d3890H9458a07964A10839d9702A950K8449J19474
$$ y = [-170247, -62213, 61466, -254311, 152730, -152653, 202448, -336518, -143067, 142213, -15783, -254744, -109249, -151017, -123146, -165198, 212922, -66944, -1115, 98130, -198091, -222106, -38251, -381930, -230246, 99817, -323197, -164022, -53877, -357884, -120608, -166180, -179164, -194507, 112551, -317459, 59815, 264047, 31263, -70681, -200326, 206060, 137118, 249751, -330114, -97663, 3028, 75629, -18701, -120906, 30531, -36851, 100875, 211341, -52628, -215858, 240587, -455479, 368576, -301583, 53439, 165042, 200031, -307237, -79779, -29099, 5897, -40551, -205315, -114146, -257665, -123800, 325014, -47545, -50083, -146688, -362018, 40013, -105826, -298965, -238545, 212287, -43890, 89458, -107964, 110839, -49702, 1950, 30399, 149873]
10563A49873B6870a09990H2690a51009O791e2101B81045o2492K0618b4014A10580
10551g445q8751a4896B16817b66008b3771b984r1355d0747j73505B4004a91887
10539f1336l48435a75509j40006J52761f8129A91697a50576A12043b18850b474
10528B416J94490N4819a25952D1875O0941M398L3233a73675D0694a72608b247
10516a61223C2173J1831a74243N4932j18777g1781L952l3007B58140A18028b09512
10504g4310A73254b48828J3450e6707H7064f9888B00081q7432b09670r102H2971
10492A08410a67862m9059C9896c1984a134l7526k11224B06686m2207C0179L17843
10481C48022d1996A6687c66036J57288A2427N5170J57150f9925k9474C66974a73150
$$ y = [149873, 26870, -109990, 82690, -151009, -144218, -52101, 281045, 218553, 239171, -24014, 110580, -7445, -96196, -14896, 216817, -266008, -23771, -2984, -94339, -40747, -214252, 24004, -191887, -61336, -409771, -175509, -315515, -162754, -68129, 191697, -150576, 112043, -218850, -2474, 2416, 196906, 251725, -125952, 41875, 102816, 107214, 140447, -173675, 40694, -172608, -2247, -161223, 32173, 44004, -174243, -119311, -238088, -71781, -67829, -100836, 258140, 118028, -209512, -74310, 173254, -248828, -235378, -56707, 87064, -69888, 200081, 112649, -209670, -218772, 82971, 108410, -167862, -216921, 39896, -31984, -1134, -38660, -249884, 206686, 164479, 30179, 348022, -41996, 16687, -366036, -208748, 12427, 67597, 224747, -69925, -99399, 366974, -173150]
10469e6732m17127g1449C9694J54071P8951d5474C90816K9332j71008l6415L10223
10458E22948q8862r8985P2680o7836j63809K0619a00384I643a73045M5511f1339
10446b43150C43346a21850I438a85043B05180f3421j47742C45561f0354a5448
10435a12605L0868o005P493k57936A85742c80143A48292o2404a30407A64977L0764
10424A95741B2727J72293E2440J61267a68499l1646H7753J01065b65439M7380
10414b18059N0050j9904B6021a27860j9625H273d9740n7227G4527a61043B0454
10402a93560l3902P9611j7023g0365G4575A8513e93783F8506J11382c32179a47088
10390b26512B41895j20286k851c50156A36573a97763G8598a74491L3331L1985
$$ y = [-56732, -473859, -71449, 39694, 193765, 272716, -45474, 390816, 420148, 249140, 212725, 522948, 434086, 335101, 407781, 339945, 176136, 196755, -100384, 9643, -173045, -127534, -61339, -243150, 343346, -121850, 9438, -185043, 205180, -63421, -211163, 345561, -60354, -15448, -112605, -81737, -87742, -80249, -338185, 185742, -380143, 148292, 85888, -130407, 164977, 195741, 22727, 195020, 52440, 213707, -168499, -200145, 87753, 188818, -265439, -218059, -168009, -187913, 26021, -127860, -147485, 8273, -49740, -106967, 74527, -161043, 20454, -193560, -227462, -147851, -164874, -70365, 74575, 18513, -593783, 68506, 179888, -332179, -147088, -226512, 241895, 121609, 118758, -350156, 136573, -197763, 78598, -174491, -141160, -109175]
10380a09175A79309K56972A60311a8957B39669H9004d7626A22875a03125A84428
10369B81866j30888o0359a760p9928D1000L66380b43296A27588j1001K40820C9702
10357B53518b94503H5349K77774b23783C99221f3260B68759I6183K63973A19940
10346B39687N5359f4908C71514A64929H0122i8859M1520C47861j64719m0175J34025
10335B76992a2466B13605k3734D8994L84275j14211j26242d1150D93178k27878
10325B65300Q6122J85312D3709M31845A00516J73928c1119n1575A86058a69029
10314B93120E5131a19455A35755n6152a25961k3834f2947E0397J67069A5574b6077
10302I6471L4578a6277C61099a50313C82528j83154I2529r101M8901a50183j92905
$$ y = [-109175, 179309, 436281, 160311, -18957, 239669, 89004, -47626, 122875, -103125, 184428, 281866, 150978, 90619, -1760, -81688, 41000, 407380, -243296, 127588, 116587, 357407, 39702, 253518, -294503, 85349, 363123, -223783, 399221, -63260, 268759, 96183, 360156, 119940, 239687, 295046, -64908, 371514, 164929, 80122, -98859, -57339, 347861, 183142, 142967, 276992, -12466, 213605, 189871, 48994, 433269, 319058, 192816, -41150, 493178, 265300, 351422, 536734, 43709, 475554, 100516, 274444, -31119, -82694, 186058, -169029, 293120, 55131, -119455, 135755, 79603, -125961, -149795, -62947, 50397, 217466, 15574, -26077, 96471, 131049, -16277, 361099, -150313, 382528, 199374, 92529, 83428, 132329, -150183, -343088]
10291c43088B64570e15915A40672a28802A27914J16951e5540g024B05880C6257
10280a82469E3674g4667j40885j83335J83026d5628B61244I6229K465O7891j0602
10269A55983a08545j81637P2155H8165i8153n5145j22786J07074I6563g9772k79223
10258c58995a43913b8061k8405m3074B4375c10193A80861D7134a61704B18877
10247E0189a30035A35632c8661B79784B8649a60880K9846p992G5662J57860i2494
10235A39676N23357A28010b0833A51088M9672I1547a31450A22262b05859C4227
10224a35562m1183O468g3372k5628q7578G4450M5893a98009l35860a75263H1935
10212A36279n5048D057i0684n5033n4696a9324k17033D121a66291f7104A75524
$$ y = [-343088, 264570, -515915, 140672, -128802, 127914, 244865, -55540, -7024, 205880, 36257, -182469, 53674, -74667, -215552, -398887, -215861, -45628, 261244, 96229, 98694, 166585, 155983, -108545, -290182, -218027, 88165, -98153, -153298, -276084, -169010, 96563, -79772, -358995, -143913, -28061, -56466, -99540, 24375, -310193, 180861, 47134, -161704, 218877, 50189, -130035, 135632, -38661, 279784, 28649, -160880, -131034, -139026, 75662, 233522, -92494, 139676, 663033, 128010, -20833, 151088, 200760, 91547, -131450, 122262, -205859, 34227, -135562, -176745, -170277, -73372, -99000, -186578, 74450, 120343, -198009, -533869, -175263, 81935, 136279, 81231, 4057, -90684, -145717, -200413, -19324, -236357, 4121, -166291, -67104, 175524]
10200A35140D1630a36935N8151A00992N8096J9081b7983k6992a3850k4043A76323
10188I0038d12954a3798E284g4052j18637D41342a91712j72182C9539O0845g1744
10176A80467a02792A91561p1257a08412f335p705k28951R4779j19627j21B3838
10164D2989d60120A61826a60663M6712K1602B09962a22050l7438M4577M8937H8063
10152I4333B3064b81820R3565d8047j19964b9955j84346m7724g3922j20607m2265
10141b36794c6039B10553A3456a72844B09151g112C8844b43378g6997D5846I737
10129a28439E1284b0276m03349a95917g9959D4757M9261f8739q6992k3520A76755
10117E9796b00791j12434o5544a65258j91450A1542R5535a17255j92610J44997
$$ y = [135140, 41630, -136935, -78784, 100992, 159088, 178169, -27983, -54975, -13850, -37893, 176323, 90038, -412954, -13798, 5284, -74052, -192689, 441342, -191712, -363894, 39539, 100384, -71744, 180467, -102792, 191561, 120304, -108412, -6335, -14040, -242991, -148212, -267839, -267960, 23838, 42989, -460120, 161826, -160663, -113951, -92349, 209962, -122050, -159488, -114911, -65974, 88063, 94333, 23064, -281820, -188255, -48047, -168011, -29955, -214301, -262025, -73922, -194529, -236794, -36039, 210553, 13456, -172844, 209151, -7112, 38844, -243378, -76997, 45846, 9737, -128439, 51284, -20276, -423625, -195917, -79959, 44757, 94018, -68739, -155731, -179251, 176755, 59796, -200791, -313225, -378769, -165258, -356708, 11542, 107077, -117255, -309865, -164868]
10107a64868m4256Q3192N6190E0395b73544m1806B93745a6395n109F951c48138
10095a62354o4134R2530j93472J60587C2578a2832j21396A92403o915B0623a55285
10083D5498j9179b6914q8440a2762j02819j900K1902j19073H1626J39516A00978
10071A00613D6476b36009i2011m06972J49146a04877l00126J88287C44710b7123
10060a98715E0390k4333O289c20588A05882a14951j37125B95239e4035l6841k53154
10049c44030K1757j41690K22731J12046l530A93282m4649o2312e6043K6173B24692
10037b6358j68863B9926f0622B02186h5819K8477B60366G636a96677o2028E0236
10025c25856m7028d356k8201a363A0273K80524f102k24780A68216a57259q5109
$$ y = [-164868, -209124, -125932, -69742, 50395, -273544, -315350, 293745, -16395, -21504, 6951, -348138, -162354, -226488, -133958, -327430, -166843, 32578, -12832, -134228, 192403, 185488, 20623, -155285, 45498, 26319, -26914, -115354, -12762, -115581, -117481, -95579, -214652, 81626, 221142, 100978, 100613, 46476, -236009, -92011, -498983, -349837, -104877, -405003, -216716, 344710, -27123, -198715, 50390, 26057, 32346, -320588, 105882, -114951, -252076, 295239, -54035, -90876, -344030, -322273, -463963, -241232, -129186, -132716, 193282, 148633, 86321, -56043, -29870, 224692, -26358, -195221, 29926, -60622, 202186, -85819, -57342, 260366, 7636, -196677, -258705, 50236, -325856, -372884, -4356, -32557, -1363, 10273, 290797, -6102, -230882, 168216, -157259, -242368]
10014b42368A07134O027m7690a64343n9915h3645L7181j47785B6301b23921c8695
10002a00421A60352D5799g0031K8899j17140G3747c70379a22210B18921G4209
9991C61166A17652a52633H5649f6446j01665j3106N1795l72660H041b05979b9955
9979h8293L4653b3648A4926J61881f5950j71876R1950D2997K6621b38838L7326
9968b01512i9493A2429b68011A82028b42604A77712a40742k2092C3911b50533
9957c82606a27120A42057f1811q9979g5526H8273h4112n0972r5739J15172H9519
9945c54546a55442p8754l94498a2564B0549d972j64613j05106e1693k22468f6622
9933a32441r7812B19691c40475C12822a90778h3761m56833f9437j50921f0k34600
$$ y = [-242368, 107134, 113161, 65471, -164343, -224258, -83645, -46464, -194249, 26301, -223921, -38695, -100421, 160352, 45799, -70031, -41132, -158272, 73747, -370379, -122210, 218921, 74209, 361166, 117652, -152633, 85649, -66446, -168111, -181217, -129422, -502082, 8041, -205979, -29955, -88293, -53640, -23648, 14926, 176807, -65950, -237826, -145876, 42997, 69618, -238838, -201512, -99493, 12429, -268011, 182028, -242604, 177712, -140742, -162834, 33911, -250533, -382606, -127120, 142057, -61811, -151790, -75526, 88273, -84112, -135084, -230823, -115651, 89519, -354546, -155442, -234196, -628694, -12564, 20549, -4972, -169585, -274691, -51693, -274161, -66622, -132441, -230253, 219691, -340475, 312822, -190778, -83761, -540594, -69437, -220358, -60, -234660]
9922b34660i4469l2757n29C6146e26j40361M7328A63568k7921b2504m1882A1854
9909A4285i1464M1251k0258F9561a30911A42357E4856P414a64376F5524L6720
9898A02244j2531O7444a22688C6027e0900j43689P1059e9736C62157j01622b25600
9886A44044b65410A47275c38696a53919A37670b48856c2057j29880K7454I273
9875a41732D9453c13814a00291B88343I9152a86501b7245A89655b02783j50772
9865c53555a32002B77233a34423G5473d04873f9647n9594n613B2092c07259a39111
9853A48529K1255H0850g0047j82218J15025A08880a43227N1213p5L2254J0677
9842d9158A43351D8020d3607J8296j02256k07218A09416b65924h9440n3071j89707
$$ y = [-234660, -94469, -127226, -127755, 36146, -526, -140887, -93559, 163568, 135647, -22504, -64386, 11854, 14285, -91464, -50213, -70471, 69561, -130911, 142357, 54856, 62270, -164376, 65524, 102244, 89713, 157157, -122688, 36027, -50900, -194589, -123530, -59736, 362157, 260535, -225600, 144044, -265410, 147275, -338696, -153919, 137670, -248856, -32057, -161937, -134483, 9273, -141732, 49453, -313814, -100291, 288343, 99152, -186501, -27245, 189655, -202783, -353555, -132002, 277233, -134423, 75473, -404873, -69647, -129241, -134854, 22092, -307259, -139111, 148529, 169784, 80850, -70047, -252265, -137240, 108880, -143227, -92014, -92089, -59835, -49158, 143351, 48020, -43607, -25311, -127567, -334785, 109416, -265924, -89440, -142511, -332218]
9831c32218a45037j17450A06867m124b75241g3775n5156L7086A19054f3822C75563
9819H8842g0622J2320o0876D4479j8443a61070d2659j68958a4693k03188O0288
9808a57593P4464k15320d0451B15073a19813a1289l35051b4536l28166m1163A33768
9796d34309K16290H4372e34558K41135J42992j44733I6351b9194J336F2867g0470
9784b3418G1522b87750J37514A40384N0316D570P0129l5542o771N8293J55635
9773B46314a84819B32479F204g0256k94223i5969B77161j08189d06434a85127
9762a23846j5905k5916K9141d9630J1103j44137A5213K20593a17935j79030A20299
9750d33862a85930Q8423m80554D6773b7871k33456A7458J07373a05762A3831a00868
$$ y = [-332218, -145037, -262487, 106867, 102743, -275241, -73775, -128931, -91845, 119054, -63822, 375563, 88842, -70622, -58302, -119178, 44479, 26036, -161070, -42659, -211617, -14693, -217881, -157593, -83129, -298449, -40451, 215073, -119813, -11289, -346340, -24536, -352702, -393865, 133768, -434309, -218019, 84372, -534558, -293423, -150431, -295164, 96351, -29194, -27858, 62867, -70470, -23418, 71522, -287750, -150236, 140384, 190700, 4570, 74699, 39157, 32386, 90679, 246314, -184819, 232479, 6204, -70256, -364479, -95969, 277161, 168972, -406434, -185127, -123846, -139751, -165667, -136526, -49630, -38527, -182664, 15213, 235806, -117935, -296965, 120299, -433862, -185930, -97507, -578061, 46773, -27871, -261327, 17458, 124831, -105762, 13831, -100868]
9738b86725B87992a3741k51442A239K9830G419K72743a38510j18742N1277D50655
9726H7795a46265B18896a98979L6590r7740f8508B37066j13545f2305B37270c59021
9714b39623A02513b51546P4802G4651m896f0981o8363j42277F9764b38743Q3453
9703a55290P6307a1859j21158l7816j06537A00398A328M1418A9456c53266a0378
9691E224c17486B64370C3808L5115B0657a34748E6311j5261K08402D7475J15205
9680A62680D3842K52038I4426a93913j64899a45411j23140a22313m909r8713B17459
9668e7309F1465c06347b7l3678k66510b0270o6806J2806F5660L22505b03558K9843
9656a73715l9928j41832a608A88914a58507A80887C4679C7d4239I4639b54174
$$ y = [-286725, 287992, -13741, -265183, 1239, 31069, 7419, 280162, -138510, -257252, -205975, 450655, 87795, -146265, 218896, -198979, -162389, -260129, -68508, 237066, 123521, -62305, 237270, -359021, -239623, 102513, -251546, -176744, 74651, 69755, -60981, -129344, -271621, 69764, -238743, -155290, -78983, -11859, -133017, -170833, -277370, 100398, 1328, 42746, 19456, -353266, -10378, 5224, -317486, 264370, 33808, 68923, 20657, -134748, 56311, 41050, 249452, 47475, 162680, 43842, 295880, 94426, -193913, -358812, -145411, -268551, -122313, -127222, -225935, 217459, -57309, 61465, -306347, -27, -33705, -300215, -20270, -87076, -74270, 65660, 388165, -203558, -173715, -213643, -355475, -1608, 188914, -158507, 180887, 34679, 37, -44239, 94639, -254174]
9644a72336b4014A19340l4362M826b08994A75125a25596j02123C9883a93069A86564
9632H6616R7416a16243F0880a84693B4504a98202H6371a46744B4535J0223g4348
9620a69368b9500j58619K2854r213c7372j07354c6124k31202L8694e2358A75258
9608d0549j41378G1253d8453A33996L4973b99439A12230a31982C00692i6958k22957
9597c19915A38097b08511N4411e8057l98157a96301j48225N0036a772j94722F7758
9585b56433j0711c0951n9200J5847K1081I2624a44964j29974B4201L67807a30476
9573h7167a5439p19884A09819E4402a41977E0122K67210G412K00972c5984q8127
9562a24111b5637H7230g1754I9274b1407k02245D3591c0425A18827a26600n0618
$$ y = [-172336, -24014, 119340, 84978, 89804, -208994, 175125, -125596, -227719, 39883, -193069, 186564, 86616, 184032, -116243, 60880, -184693, 24504, -198202, 86371, -146744, 24535, 34758, -74348, -169368, -29500, -188119, -165265, -174478, -37372, -144726, -36124, -267326, -228632, -52358, 175258, -40549, -181927, 71253, -48453, 133996, 168969, -299439, 112230, -131982, 300692, -96958, -319915, 138097, -208511, -154100, -58057, -456214, -196301, -344526, -294490, -1772, -196494, 67758, -256433, -267144, -30951, -90151, -74304, -53223, 92624, -144964, -274938, 24201, 392008, -130476, -87167, -15439, -735323, 109819, 54402, -141977, 50122, 317332, 7412, 208384, -35984, -124111, -25637, 87230, -71754, 99274, -21407, -223652, 43591, -30425, 118827, -126600, -177218]
9551a77218K8871j99599A35493a50513I016b81174k2981j3843a05508n1049j53872
9540c10429C9733b46678c9312j1031n50209A83300D2158K96277A9154K50052I7347
9528G4398d50675a39889C7939J78982a49074A49455c52028A31316L7091N4612
9518B23019b18070A2496a23096A0598b0145C5908a3834c418A48020a98482A27806
9506I2619J58400b57679M3714l37976A68838p7232N0390b1385A17564D0233b14067
9494f6803j98406J11194A50119A6972j750c14707c088B8086j2218M35333h4378
9482b47981C41823G9976k5518c9783r8010L0612C3597f65438A9818b2784m42358
9471d65142B18957F2942j1889d5036j79355j16238a37917A12494o478i2611A92586
$$ y = [-177218, -148347, -347946, 135493, -150513, 9016, -281174, -304155, -317998, -105508, -156557, -310429, 39733, -246678, -39312, -50343, -600552, 183300, 42158, 338435, 19154, 269206, 97347, 74398, -450675, -139889, 37939, 216921, -149074, 149455, -352028, 131316, 168407, 223019, -218070, 12496, -123096, 10598, -20145, 35908, -13834, -3418, 148020, -198482, 127806, 92619, 251019, -257679, -213965, -551941, 168838, 91606, 141996, -21385, 117564, 40233, -214067, -66803, -265209, -154015, 150119, 16972, 15222, -314707, -3088, 28086, 15868, 451201, -84378, -247981, 341823, 79976, 54458, -39783, -137793, -107181, 33597, -665438, 19818, -22784, -465142, 218957, 62942, 51053, -45036, -224391, -340629, -137917, 112494, 106016, -92611, 192586]
9459A00317h7970E8975c56178a24106j62929a8357j01849M0715a8314H5100k0380
9448F4720a68425m153j65023A15664b01114C73189a67976f0707l17835N6746a07242
9436e0753m2496B80894b6103A7253c059A47912c39221B26314g0590B01561a04992
9424G3915k1725h8392l3320M2537A4163d45618A1734e26303b09946i8808j1488
9413a10296C38592A0088b25393A68925b02408j42247f8916J999B33121a03805
9402e73354C1188A0299i9117m67684a38705o8082C12722A45948Q2632E8150g1121
9390b2497r268j8269K3899k41236R4665A13808b96804J07543b7557j19487n0921
9379a97965M9343o5524k34493A05040c7424I1132a74564G2120J884a33220h63
$$ y = [100317, -87970, 58975, -356178, -124106, -287035, -18357, -120206, -79491, -18314, 85100, 64720, -168425, -172578, -337601, 115664, -201114, 373189, -167976, -60707, -378542, -321796, -107242, -50753, -93249, 280894, -26103, 17253, -3059, 147912, -339221, 226314, -70590, 201561, -104992, 73915, 52190, -88392, -121712, -79175, 14163, -445618, 11734, -526303, -209946, -98808, -110296, 338592, 10088, -225393, 168925, -202408, -344655, -68916, -66917, 233121, -103805, -573354, 31188, 10299, -99117, -566801, -138705, -206787, 312722, 145948, 228580, 58150, -71121, -22497, -31765, -50034, -26135, -267371, -172706, 113808, -296804, -189261, -27557, -147044, -197965, -148622, -214146, -448639, 105040, -37424, 91132, -174564, 72120, 74004, -133220, -863]
9367g3479B2612a09159i583B54909h2179A3301g4616j95549E925h5120E2894P4167
9355A27061a0668A61737c60794J32586A6588c01844d3886A83724c973j366l60712
9344c66051i3364o0164A70318a96406A23742a6450j39918O0067C4548J18652d471
9332A81525b69619p5621h131A24919a54540I066J75210o6403e098j21376j38552
9321b65026I6078a99819N0675j6305J1976C20894E8881J39374b10758A64113b05080
9309B43782c10655B15485a50935d6464j99039b4087j2147A52059K998d99415d9428
9297b49635e0154C39511g0049f450F2291e3357n1587A38574c15068J34243f3790
9285A57164M7838K0534a43797D4490L1986a76704M9177H2683b71116Q571H0711
$$ y = [-73479, 22612, -109159, -9583, 254909, -82179, 13301, -74616, -270165, 5925, -85120, 52894, 127061, -10668, 161737, -360794, -228208, 16588, -301844, -43886, 183724, -3973, -5339, -366051, -93364, -153528, 170318, -196406, 123742, -16450, -156368, -96301, 34548, 153200, -4471, 181525, -269619, -345240, -8131, 124919, -154540, 9066, 184276, 117873, -5098, -126474, -265026, 96078, -199819, -149144, -165449, -153473, 320894, 58881, 198255, -210758, 164113, -205080, 243782, -310655, 215485, -150935, -46464, -245503, -24087, -36234, 152059, 155057, -499415, -49428, -249635, -50154, 339511, -70049, -6450, 62291, -53357, -104944, 138574, -315068, -180825, -63790, 157164, 205002, 225536, -143797, 44490, 76476, -176704, -127527, 82683, -271116, -262545, 80711]
9273a51721F0656a78842j50260J32839l41141C00745a10707J3847A17846a80823
9262c0533j19983L6990r5575C0719b75863J0787C7999b39915j35i1387A5620a78720
9249b4154j24184L4772e6138M617A36928D2730b01769A31523A9752J2761b73991
9237a98215C7898f193k95501d4184G2632g7215m7918A35193d6080k59819c3620
9225a86338K6040I3485i2965k119R879L5602C1494b21753j43293J71314M0655
9214a53077d2104h190n1997A80107a56359g519j16699L6550J4645A06500a56374
9202B8127g0561H6900b71492g1439k4175a0323p093j97302G6157i2262j78351
9191b70613A25288a33698k49031A21483R5949c58383E4605e7478l4401B5441b67507
$$ y = [-151721, 60656, -178842, -329102, -196263, -537404, 300745, -110707, -96860, 117846, -180823, -30533, -150516, -113526, -209101, 30719, -275863, -265076, 37999, -239915, -240050, -91387, 15620, -178720, -24154, -148338, -113566, -56138, -51521, 136928, 42730, -201769, 131523, 19752, 32513, -273991, -198215, 37898, -6193, -301694, -44184, 72632, -77215, -125133, 135193, -46080, -305899, -33620, -186338, -160298, 93485, -92965, -95084, -85205, -49603, 31494, -221753, -365046, -193732, -153077, -42104, -8190, -60187, 180107, -156359, -7519, -124218, -87668, -73023, 106500, -156374, 28127, -70561, 86900, -271492, -71439, -95614, -10323, -17416, -214718, 76157, -92262, -270613, 125288, -133698, -382729, 121483, 217432, -358383, 54605, -57478, -91879, 25441, -267507]
9179a00117j07276g688l528G4058c18626G2937M5601E5554Q4133a04843A09801
9167F3675j7243i4801k65937J14720R5783A13978a76719F1119J94473H4411l6401
9156D8010a15009B16030b32289c9449G3060b86472N0697D9192J38378l1449e9937
9144A13131b3521N479l26382C1624c41246A64937b73762a24108C7071b42768B26186
9132a21968a4373A98606a17585b778l03788A7639f9786j01518A98517b01748A02317
9120B35686a93721N8410O4110j03051A59962g9579b1663j64988k9605J04757J6337
9109i5162J8795l1463H6030i0096k55167K0078A0765P5833c8888j20263A03441
9097b86773g7521A93242F8961g9846L0647l0405o2414B91883a34004c1410j53056
$$ y = [-100117, -207393, -7688, -11216, 74058, -318626, 72937, 118538, 55554, 139687, -104843, 109801, 63675, 46432, -94801, -360738, -246018, -150235, 113978, -176719, 61119, 255592, 84411, 48010, -115009, 216030, -232289, -39449, 73060, -286472, -235775, 49192, 187570, 156121, -59937, 113131, -23521, -18042, -344424, 31624, -341246, 164937, -273762, -124108, 37071, -242768, 226186, -121968, -14373, 198606, -117585, -2778, -306566, 17639, -69786, -171304, 198517, -201748, 102317, 235686, -193721, -135311, -71201, -174252, 159962, -79579, -21663, -186651, -216256, -111499, -95162, -76367, -107830, 86030, -90096, -345263, -325185, 10765, 86598, -38888, -159151, 103441, -286773, -77521, 193242, 68961, -79846, -49199, -79604, -142018, 291883, -134004, -31410, -184466]
9086a84466D0250L4425h0986j7374q1883L3860l54078c9980g92C1514L05405c2052
9073B4566a18410C48370e1173A07713q441D0627c6388I679N6844J64425a68963
9061d6808m1873j24327e2038j14372g2160D0914e9897k78747G9049a25842k28123
9050c53965A48457b1273q6435k32923i3922o3605A85077b98297a24283K6288b4483
9038a62075C7857b59060H6566l8635a02169b3986l44905J15560J04114A25960
9027A14790J08316c1424j19309m6444j98612a06930k36B0015J74767l0671K3872
9016A87983b32177j38615J79352F7718K86763b06082B6256A462b98746g2785G9687
9004b33657o0930J05237m4700A50296a9405q4782k3714k94344I5715J36647a72305
$$ y = [-184466, 40250, 74675, -80986, -98360, -180243, -146383, -500461, -39980, -792, 31514, 336919, -32052, 24566, -118410, 348370, -51173, 107713, 99272, 40627, -36388, 9679, 66523, 230948, -168963, -46808, -88681, -213008, -52038, -166410, -72160, 40914, -59897, -338644, 79049, -125842, -353965, 148457, -21273, -107708, -340631, -93922, -157527, 185077, -298297, -124283, -97995, -24483, -162075, 37857, -259060, 86566, 47931, -102169, -23986, -368891, -253331, -149217, 125960, 114790, 223106, -31424, -150733, -197177, -395789, -106930, -107166, 20015, 194782, 164111, 187983, -232177, -370792, -191440, 67718, 354481, -206082, 26256, 1462, -298746, -72785, 79687, -233657, -294587, -189350, -234050, 150296, -19405, -104187, -127901, -422245, 95715, 232362, -172305]
8992B45162b16300i9871j22373a8724j37557H3310a95997o261b5696j78149j05628
8981c09473a9154l75950H3480K8613D3974c66634o9407c5173I496L13433j53455
8970A69474Q7967g7951A11688p828L681c4776A50650J38009b05193a2523o6317
8959g8840K3487C8823i7518d5416k384K2016o426m409j20800A76200c73795e0599
8946A79737M9290a4795A70454E0960K41013f6926R825F9561J75972E5989A7718
8934d54730e6674h950q274p0287k05536g1366A5741c14922A11658a09475L3746
8923g5729j08001g508l1843k28282A4775J06669g5037A36252J46387K2255A3783
8911a62761F6142Q7415K87201o5365L19010K69665R59939J398697M068516l470134
$$ y = [245162, -216300, -99871, -222244, -18724, -156281, 83310, -195997, -202258, -25696, -203845, -309473, -19154, -395104, 83480, 112093, 43974, -366634, -436041, -35173, 9496, 322929, 169474, 257441, -77951, 111688, 103860, 107541, -34776, 150650, 288659, -205193, -12523, -78840, -55353, 38823, -97518, -45416, -47800, -25784, -32210, -36619, -157419, 176200, -373795, -50599, 179737, 229027, -14795, 170454, 50960, 291973, -66926, -57101, 69561, 245533, 55989, 17718, -454730, -56674, -8950, -17224, -87511, -293047, -71366, 15741, -314922, 111658, -109475, -75729, -183730, -7508, -39351, -267633, 14775, 121444, -75037, 136252, 282639, 304894, 13783, -162761, 66142, 153557, 440758, 375393, 694403, 964068, 1924007, 3322704, 7391220, 3921086]
8901C921086j950439q57014D32105j33199A07270K7824N292Q7471g7144j41676
8891b18820F7177J36852K4154B4008J43072b47821B22367a9081o92p4322b7093
8879d0405j39193j51056a14924A82811a2952D56057A3730i0451c7D0642g5080
8867a28606m2023f5441j71625a03712E4756b02770g6185j78996F76a57774A950
8855e3228D14075C7447a43080j65460J38636P7560j244j98199F9620K14832H0740
8843a10063K600d4836m8402D051g5096B06476b61956k8992Q889A86606d94168
$$ y = [3921086, 1970647, 1113633, 432105, 298906, 107270, 135094, 140386, 227857, -77144, -218820, 67177, 204029, 228183, 24008, 167080, -247821, 222367, -19081, -19773, -94095, -27093, -40405, -179598, -330654, -114924, 182811, -12952, 456057, 13730, -90451, -37, 40642, -75080, -128606, -170629, -65441, -237066, -103712, 54756, -202770, -76185, -255181, 676, -157774, 1950, -53228, 414075, 37447, -143080, -308540, -169904, -92344, -93588, -291787, 69620, 284452, 80740, -110063, -107463, -44836, -93238, 4051, -75096, 206476, -261956, -290948, -282059, 186606, -494168]
$$ [...]
##END NTUPLES=NMR SPECTRUM
##END=
