
##TITLE=AC1159_Tamara_5875076_Ygq0hIHIcJ
##JCAMPDX= 6.0         $$ Bruker NMR JCAMP-DX V2.0
##DATA TYPE= NMR SPECTRUM
##DATA CLASS= NTUPLES
##ORIGIN= BRUKER
##OWNER= Administrator
$$ 1.72 TOPSPIN		Version 2.1
$$ 2012-03-31 23:02:00.875 -0500  Administrator@TOPSPIN
$$ Compression mode = diff/dup
##.OBSERVE FREQUENCY= 400.13188235
##.OBSERVE NUCLEUS= ^1H
##.ACQUISITION MODE= SIMULTANEOUS (DQD)
##.ACQUISITION SCHEME= undefined
##.AVERAGES= 64
##.DIGITISER RES= 22
##SPECTROMETER/DATA SYSTEM= spect
##.PULSE SEQUENCE= noesygpps1d.comp
##.SOLVENT NAME= COFFEE_meoh
##.SHIFT REFERENCE= INTERNAL, COFFEE_meoh, 1, 14.96843
##AUDIT TRAIL= $$ (NUMBER, WHEN, WHO, WHERE, PROCESS, VERSION, WHAT)
$$ ##TITLE= Audit trail, TOPSPIN		Version 2.1
$$ ##JCAMPDX= 5.01
$$ ##ORIGIN= Bruker BioSpin GmbH
$$ ##OWNER= Administrator
$$ $$ C:\Bruker\TOPSPIN/data/COFFEE/nmr/AC1159_Tamara_5875076_Ygq0hIHIcJ/12/pdata/1/auditp.txt
$$ ##AUDIT TRAIL=  $$ (NUMBER, WHEN, WHO, WHERE, PROCESS, VERSION, WHAT)
(   1,<2012-03-31 23:01:55.718 -0500>,<Administrator>,<TOPSPIN>,<go>,<TOPSPIN 2.1>,
      <created by zg
	started at 2012-03-31 22:50:23.656 -0500,
	POWCHK enabled, PULCHK disabled,
       configuration hash MD5:
       1A 1E CE 29 27 FD 77 03 67 4E F0 E3 C4 B2 CB 90
       data hash MD5: 64K
       54 1E CC 8E 4D 36 94 E2 C9 1E 2B 72 5B 41 83 21>)
(   2,<2012-03-31 23:01:58.671 -0500>,<Administrator>,<TOPSPIN>,<proc1d>,<TOPSPIN 2.1>,
      <Start of raw data processing
       efp LB = 0.3 FT_mod = 6 PKNL = 1 PHC0 = 0 PHC1 = 0 SI = 128K 
       data hash MD5: 128K
       A8 73 63 1F 1A 18 67 8C 5C 21 49 C6 B6 24 BA 01>)
(   3,<2012-03-31 23:02:00.031 -0500>,<Administrator>,<TOPSPIN>,<proc1d>,<TOPSPIN 2.1>,
      <pk PHC0 = 38.33679 PHC1 = 0 
       data hash MD5: 128K
       B6 51 09 87 4D 4A 80 84 08 42 B5 B9 EC CD A4 96>)
(   4,<2012-03-31 23:02:00.515 -0500>,<Administrator>,<TOPSPIN>,<proc1d>,<TOPSPIN 2.1>,
      <abs ABSG = 1 
       data hash MD5: 128K
       40 B0 65 25 BC 19 11 FE 4E FF 0B B0 59 7B DF 94>)
(   5,<2012-03-31 23:02:00.593 -0500>,<Administrator>,<TOPSPIN>,<proc1d>,<TOPSPIN 2.1>,
      <abs ABSG = 2 
       data hash MD5: 128K
       65 49 ED 01 0B EB CB AE 70 BA D0 EF 5B 2C 48 2B>)
(   6,<2012-03-31 23:02:00.671 -0500>,<Administrator>,<TOPSPIN>,<proc1d>,<TOPSPIN 2.1>,
      <abs ABSG = 3 
       data hash MD5: 128K
       CC AD A3 6C 4E 14 CD 34 72 22 F4 E4 E2 48 84 4F>)
(   7,<2012-03-31 23:02:00.734 -0500>,<Administrator>,<TOPSPIN>,<proc1d>,<TOPSPIN 2.1>,
      <abs ABSG = 4 
       data hash MD5: 128K
       BB F9 3A 30 74 9B 7B 68 96 25 52 87 FC E3 87 78>)
(   8,<2012-03-31 23:02:00.781 -0500>,<Administrator>,<TOPSPIN>,<proc1d>,<TOPSPIN 2.1>,
      <abs ABSG = 5 
       data hash MD5: 128K
       99 57 66 F0 E3 41 66 32 FA E1 AE 4F 6B EC B8 D5>)
$$ ##END=
$$ 
$$ $$ hash MD5
$$ $$ 9C 48 EE 78 81 98 54 3F C4 47 97 C6 C7 EE 2D 10
##$RELAX= 
##$RELAX= 
##$RELAX= 
##$RELAX= 
##$RELAX= 
##$RELAX= 
##$RELAX= 
##$RELAX= 
$$ Bruker specific parameters
$$ [...]
##$TP07= 0
##$TPNAME0= <>
##$TPNAME1= <>
##$TPNAME2= <>
##$TPNAME3= <>
##$TPNAME4= <>
##$TPNAME5= <>
##$TPNAME6= <>
##$TPNAME7= <>
##$TPOAL= (0..7)
0.5 0.5 0.5 0.5 0.5 0.5 0.5 0.5
##$TPOFFS= (0..7)
0 0 0 0 0 0 0 0
##$TUNHIN= 0
##$TUNHOUT= 0
##$TUNXOUT= 0
##$USERA1= <user>
##$USERA2= <user>
##$USERA3= <user>
##$USERA4= <user>
##$USERA5= <user>
##$V9= 5
##$VALIST= <valist>
##$VCLIST= <CCCCCCCCCCCCCCC>
##$VD= 0
##$VDLIST= <DDDDDDDDDDDDDDD>
##$VPLIST= <PPPPPPPPPPPPPPP>
##$VTLIST= <TTTTTTTTTTTTTTT>
##$WBST= 2048
##$WBSW= 25
##$XGAIN= (0..3)
0 0 0 0
##$XL= 0
##$YL= 0
##$YMAX_a= 12725348
##$YMIN_a= -6735735
##$ZGOPTNS= <>
##$ZL1= 120
##$ZL2= 120
##$ZL3= 120
##$ZL4= 120
##$ABSF1= 14.96843
##$ABSF2= -5.584101
##$ABSG= 5
##$ABSL= 3
##$ALPHA= 0
##$AQORDER= 0
##$ASSFAC= 0
##$ASSFACI= 0
##$ASSFACX= 0
##$ASSWID= 0
##$AUNMP= <proc_prof1d_extract.lims>
##$AXLEFT= 0
##$AXNAME= <>
##$AXNUC= <1H>
##$AXRIGHT= 0
##$AXTYPE= 0
##$AXUNIT= <>
##$AZFE= 0.1
##$AZFW= 0.1
##$BCFW= 0
##$BC_mod= 0
##$BYTORDP= 0
##$COROFFS= 0
##$CY= 15
##$DATMOD= 1
##$DC= 0
##$DFILT= <>
##$DTYPP= 0
##$F1P= 0
##$F2P= 0
##$FCOR= 0.5
##$FTSIZE= 131072
##$FT_mod= 6
##$GAMMA= 0
##$GB= 0
##$INTBC= 1
##$INTSCL= 1
##$ISEN= 128
##$LB= 0.3
##$LEV0= 0
##$LPBIN= 0
##$MAXI= 10000
##$MC2= 0
##$MEAN= 0
##$ME_mod= 0
##$MI= 0
##$NCOEF= 0
##$NC_proc= -3
##$NLEV= 6
##$NOISF1= 0
##$NOISF2= 0
##$NSP= 0
##$NTH_PI= 0
##$NZP= 0
##$OFFSET= 14.96843
##$PC= 1
##$PHC0= 38.33679
##$PHC1= 0
##$PH_mod= 1
##$PKNL= yes
##$PPARMOD= 0
##$PPDIAG= 0
##$PPIPTYP= 0
##$PPMPNUM= 2147483647
##$PPRESOL= 1
##$PSCAL= 4
##$PSIGN= 0
##$PYNMP= <proc.py>
##$REVERSE= no
##$SF= 400.130004873388
##$SI= 131072
##$SIGF1= 0
##$SIGF2= 0
##$SINO= 400
##$SIOLD= 131072
##$SPECTYP= <>
##$SREGLST= <1H.CDCl3>
##$SSB= 0
##$STSI= 131072
##$STSR= 0
##$SW_p= 8223.68421052632
##$SYMM= 0
##$S_DEV= 0
##$TDeff= 65536
##$TDoff= 0
##$TI= <>
##$TILT= no
##$TM1= 0
##$TM2= 0
##$TOPLEV= 0
##$USERP1= <user>
##$USERP2= <user>
##$USERP3= <user>
##$USERP4= <user>
##$USERP5= <user>
##$WDW= 1
##$XDIM= 131072
##$YMAX_p= 519795992
##$YMIN_p= -542666322
##$CURPLOT= <Network HP LaserJet P1505>
##$CURPRIN= <$Network HP LaserJet P1505>
##$DFORMAT= <normdp>
##$LAYOUT= <+/1D_H.xwp>
##$LFORMAT= <normlp>
##$PFORMAT= <normpl>
##$SURQMSG= 1
$$ End of Bruker specific parameters
$$ ---------------------------------
##NTUPLES= NMR SPECTRUM
##VAR_NAME=  FREQUENCY,     SPECTRUM/REAL,   SPECTRUM/IMAG
##SYMBOL=    X,             R,               I
##VAR_TYPE=  INDEPENDENT,   DEPENDENT,       DEPENDENT
##VAR_FORM=  AFFN,          ASDF,            ASDF
##VAR_DIM=   131072,        131072,          131072
##UNITS=     HZ,            ARBITRARY UNITS, ARBITRARY UNITS
##FACTOR=    0.0627417313425165, 1,          1
##FIRST=     8223.62146879498, 814,          -95402
##LAST=      0,             4717,            -96851
##MIN=       0,             -542666322,      0
##MAX=       8223.62146879498, 519795992,    0
$$ Real data points
##PAGE= N=1
##DATA TABLE= (X++(R..R)), XYDATA
$$ [...]
$$ plain form
61761 2823147 2841391 2861395 2883914 2909136 2936949 2967409 3000899 3038032 3079598 3126347 3178437
61750 3178437 3235317 3296699 3363498 3437121 3517865 3604801 3697571 3797609 3907139 4027415 4158298
61739 4158298 4299072 4449069 4607822 4775342 4952540 5141233 5343586 5561322 5795197
61730 5795197 6045263 6311882 6596454 6900980 7227350 7577765 7955691 8365454 8810632
61721 8810632 9293592 9816899 10384586 11001875 11674527 12408836 13211203 14086824 15039330
61712 15039330 16072404 17191023 18399923 19700865 21091715 22566838 24115686 25719018
61704 25719018 27345452 28950149 30474833 31849043 32995088 33838212 34319188 34404141 34088630
61695 34088630 33396445 32374800 31086751 29601849 27987288 26302221 24595889 22907890
$$ packed form
61761B823147J8244K0004K2519K5222K7813L0460L3490L7133M1566M6749N2090
61750C178437N6880O1382O6799P3623Q0744Q6936R2770J00038J09530J20276J30883
61739D158298J40774J49997J58753J67520J77198J88693K02353K17736K33875
61730E795197K50066K66619K84572L04526L26370L50415L77926M09763M45178
61721H810632M82960N23307N67687O17289O72652P34309Q02367Q75621R52506
61712A5039330J033074J118619J208900J300942J390850J475123J548848J603332
61704B5719018J626434J604697J524684J374210J146045Q43124M80976Q4953l15511
61695C4088630o92185j021645j288049j484902j614561j685067j706332j687999
$$ plain form
61687 22907890 21268789 19700878 18219509 16834500 15550711 14368368 13284470 12295013
61679 12295013 11396234 10583888 9851932 9192333 8596309 8055896 7564835 7118469 6713080
61670 6713080 6345422 6012481 5711013 5437003 5186146 4955357 4743425 4549767 4373013
61661 4373013 4211406 4063743 3928810 3804382 3688167 3579587 3479224 3386519 3299662 3218064
61651 3218064 3143167 3075888 3014745 2957555 2903672 2853182 2805080 2758006 2712230 2669190 2629130
61640 2629130 2590603 2552291 2514031 2475927 2437696 2399257 2361050 2323425 2286522 2250889 2217184
61629 2217184 2184759 2151631 2116775 2081875 2049780 2021366 1994828 1968178 1941560 1916558 1893828
61618 1893828 1872297 1850670 1828848 1807582 1787567 1769592 1754896 1744167 1736182 1728529 1720032 1711719
$$ packed form
61687B2907890j639101j567911j481369j385009j283789j182343j083898r89457
61679A2295013q98779q12346p31956o59599n96024n40413m91061m46366m05389
61670F713080l67658l32941l01468k74010k50857k30789k11932j93658j76754
61661D373013j61607j47663j34933j24428j16215j08580j00363r2705q6857q1598
61651C218064p4897o7279o1143n7190n3883n0490m8102m7074m5776m3040m0060
61640B629130l8527l8312l8260l8104l8231l8439l8207l7625l6903l5633l3705
61629B217184l2425l3128l4856l4900l2095k8414k6538k6650k6618k5002k2730
61618A893828k1531k1627k1822k1266k0015j7975j4696j0729p985p653q497q313
$$ plain form
61606 1711719 1705116 1700377 1696509 1692651 1688458 1683752 1678486 1672841 1666900 1660450 1653350 1645798 1638125 1630873
61592 1630873 1625146 1621942 1620605 1618784 1614685 1608791 1602727 1597227 1592145 1587737 1584509 1581910 1578435 1573342
61578 1573342 1567598 1562967 1560636 1560629 1561805 1562441 1561629 1560417 1561037 1564656 1570170 1575432 1579407 1582877 1587198
61563 1587198 1592622 1598127 1602891 1607512 1613199 1619908 1626025 1630038 1631834 1632231 1632019 1631835 1632095 1632429 1631876
61548 1631876 1630068 1627588 1624736 1620971 1616280 1611901 1608541 1604796 1598827 1591035 1583586 1577524 1571894 1565718
61534 1565718 1559365 1553542 1548101 1542556 1537260 1533599 1533120 1536206 1541367 1546338 1550501 1555629 1563563 1574056
61520 1574056 1586078 1600355 1618767 1641511 1666768 1693433 1722440 1754875 1790365 1828126 1868175
61509 1868175 1910574 1954574 1999658 2046731 2097240 2151389 2207807 2264615 2320405 2374637 2427572
$$ packed form
61606A711719o603m739l868l858m193m706n266n645n941o450p100p552p673p252
61592A630873n727l204j337j821m099n894o064n500n082m408l228k599l475n093
61578A573342n744m631k331pJ176O36q12j212O20L619N514N262L975L470M321
61563A587198N424N505M764M621N687O709O117M013J796L97k12j84K60L34n53
61548A631876j808k480k852l765m691m379l360l745n969p792p449o062n630o176
61534A565718o353n823n441n545n296l661m79L086N161M971M163N128P934J0493
61520A574056J2022J4277J8412K2744K5257K6665K9007L2435L5490L7761M0049
61509A868175M2399M4000M5084M7073N0509N4149N6418N6808N5790N4232N2935
$$ plain form
61498 2427572 2479481 2529717 2577131 2621565 2664138 2705558 2744820 2780112 2810500 2836181 2857539
61487 2857539 2874551 2886936 2894515 2897594 2897118 2894138 2889021 2881589 2871976 2860759 2848184 2834012 2818401
61474 2818401 2802273 2786629 2772257 2760342 2752406 2749078 2749667 2753565 2761483 2774694 2793627 2817898
61462 2817898 2847243 2881779 2921805 2968156 3022519 3086613 3160926 3244581 3336482 3436523 3546046
61451 3546046 3667458 3803065 3953911 4119849 4300845 4497725 4711464 4942478 5191220
61442 5191220 5458904 5746618 6053524 6376321 6710376 7050850 7392475 7728409 8049238
61433 8049238 8343027 8596827 8799240 8942736 9024352 9044691 9006414 8913612 8772443 8591781
61423 8591781 8382233 8153688 7913717 7668193 7422586 7181862 6949730 6729285 6524285
$$ packed form
61498B427572N1909N0236M7414M4434M2573M1420L9262L5292L0388K5681K1358
61487B857539J7012J2385P579L079m76k980n117p432r613j1217j2575j4172j5611
61474B818401j6128j5644j4372j1915p936l328N89L898P918J3211J8933K4271
61462B817898K9345L4536M0026M6351N4363O4094P4313Q3655R1901J00041J09523
61451C546046J21412J35607J50846J65938J80996J96880K13739K31014K48742
61442E191220K67684K87714L06906L22797L34055L40474L41625L35934L20829
61433H049238K93789K53800K02413J43496Q1616K0339l8277r2802j41169j80662
61423H591781k09548k28545k39971k45524k45607k40724k32132k20445k05000
$$ plain form
61414 6524285 6338540 6173727 6028908 5902700 5795050 5706435 5636473 5584356 5550078 5534122
61404 5534122 5535999 5553766 5584935 5627421 5679794 5741097 5810563 5887251 5969966 6057393 6147945
61393 6147945 6239507 6329951 6418163 6504096 6587612 6667931 6744610 6818427 6890691 6962060 7032590
61382 7032590 7102537 7172367 7241919 7309921 7374330 7433084 7484965 7530147 7569818 7604973 7635582
61371 7635582 7660878 7679987 7692197 7697097 7694784 7685675 7670067 7648288 7621217 7589874 7554329 7513957
61359 7513957 7469343 7423157 7378347 7336114 7296430 7259986 7228442 7202786 7182441 7166198 7153356
61348 7153356 7143679 7136775 7131873 7127968 7123802 7117954 7109369 7098062 7085114 7071627 7057776 7043420 7029786
61335 7029786 7019771 7016007 7019379 7030528 7052290 7089272 7144958 7220452 7316115 7432962 7572085
$$ packed form
61414F524285j85745j64813j44819j26208j07650q8615o9962n2117l4278j5956
61404E534122J877J7767L1169M2486N2373O1303O9466P6688Q2715Q7427R0552
61393F147945R1562R0444Q8212Q5933Q3516Q0319P6679P3817P2264P1369P0530
61382G032590O9947O9830O9552O8002O4409N8754N1881M5182L9671L5155L0609
61371G635582K5296J9109J2210M900k313r109j5608k1779k7071l1343l5545m0372
61359G513957m4614m6186m4810m2233l9684l6444l1544k5656k0345j6243j2842
61348G153356r677o904m902l905m166n848q585j1307j2948j3487j3851j4356j3634
61335G029786j0015l764L372J1149K1762L6982N5686P5494R5663J16847J39123
$$ plain form
61324 7572085 7734194 7920570 8133176 8372830 8638184 8927251 9238719 9570652 9918930
61315 9918930 10278187 10643086 11006800 11358772 11685822 11975608 12218064 12404380 12527306
61306 12527306 12583616 12575147 12506544 12382511 12207412 11986256 11724824 11428772 11103051 10752485
61296 10752485 10383161 10003209 9621373 9244011 8873849 8512377 8162814 7829634 7515712
61287 7515712 7221566 6947476 6694780 6464551 6256416 6069598 5904166 5760234 5636595
61278 5636595 5531208 5442849 5371618 5317884 5281169 5259899 5251968 5255801 5271150 5298561 5337766
61267 5337766 5386885 5443456 5505869 5573434 5645364 5720197 5796126 5871663 5945927 6018228 6087144
61256 6087144 6150301 6205842 6254287 6297987 6338149 6373122 6400424 6419846 6433370 6442288 6445731 6442273
$$ packed form
61324G572085J62109J86376K12606K39654K65354K89067L11468L31933L48278
61315I918930L59257L64899L63714L51972L27050K89786K42456J86316J22926
61306A2527306N6310q469o8603j24033j75099k21156k61432k96052l25721l50566
61296A0752485l69324l79952l81836l77362l70162l61472l49563l33180l13922
61287G515712k94146k74090k52696k30229k08135j86818j65432j43932j23639
61278E636595j05387q8359p1231n3734l6715k1270p931L833J5349K7411L9205
61267E337766M9119N6571O2413O7565P1930P4833P5929P5537P4264P2301O8916
61256F087144O3157N5541M8445M3700M0162L4973K7302J9422J3524Q918L443l458
$$ plain form
61244 6442273 6431705 6414466 6390280 6358389 6318795 6272329 6219726 6161563 6098978 6033377 5965072
61233 5965072 5893096 5816883 5737466 5656530 5575016 5493412 5412865 5335052 5261114 5191488 5126611
61222 5126611 5067015 5012941 4964726 4923314 4889125 4860308 4833368 4806185 4779443 4754481 4730690
61211 4730690 4705961 4679067 4650656 4622240 4595190 4570591 4549242 4531552 4517877 4509008 4506047 4509870
61199 4509870 4521008 4539939 4567322 4604107 4651506 4710459 4780910 4862081 4953801 5057191 5173557
61188 5173557 5302820 5443226 5592069 5746263 5902653 6058125 6208816 6348501 6468277
61179 6468277 6558809 6613216 6627816 6600972 6532355 6423421 6278008 6102266 5904016 5691527
61169 5691527 5472012 5251025 5033114 4822235 4621024 4430444 4251118 4084599 3932410
$$ packed form
61244F442273j0568j7239k4186l1891l9594m6466n2603n8163o2585o5601o8305
61233E965072p1976p6213p9417q0936q1514q1604q0547p7813p3938o9626o4877
61222E126611n9596n4074m8215m1412l4189k8817k6940k7183k6742k4962k3791
61211D730690k4729k6894k8411k8416k7050k4599k1349j7690j3675q869k961L823
61199D509870J1138J8931K7383L6785M7399N8953P0451Q1171R1720J03390J16366
61188E173557J29263J40406J48843J54194J56390J55472J50691J39685J19776
61179F468277R0532N4407J4600k6844o8617j08934j45413j75742j98250k12489
61169E691527k19515k20987k17911k10879k01211j90580j79326j66519j52189
$$ plain form
61160 3932410 3794165 3667713 3551169 3444042 3346634 3259313 3182390 3115673 3057872 3007187
61150 3007187 2962673 2924435 2892524 2866453 2845875 2830751 2820577 2814314 2811526 2812859 2818854 2828889
61138 2828889 2841799 2856964 2874151 2892609 2910935 2927647 2941533 2951722 2958015 2961131 2962142 2961477
61126 2961477 2958581 2952440 2942195 2927438 2908400 2886074 2861776 2836199 2808949 2779455 2748337 2717357
61114 2717357 2687739 2658979 2629826 2600012 2570239 2540598 2510019 2477571 2443562 2408939 2374152
61103 2374152 2338940 2302626 2264255 2223069 2179450 2135013 2091377 2049152 2008328 1968874 1930479
61092 1930479 1892404 1854313 1816864 1780871 1746327 1712673 1679431 1645989 1611539 1576108 1541235
61081 1541235 1508785 1479430 1452924 1429305 1408930 1391680 1376976 1364399 1353777 1345077 1338701 1335256
$$ packed form
61160C932410j38245j26452j16544j07127r7408q7321p6923o6717n7801n0685
61150C007187m4514l8238l1911k6071k0578j5124j0174o263k788J333N995J0035
61138B828889J2910J5165J7187J8458J8326J6712J3886J0189O293L116J011o65
61126B961477k896o141j0245j4757j9038k2326k4298k5577k7250k9494l1118l0980
61114B717357k9618k8760k9153k9814k9773k9641l0579l2448l4009l4623l4787
61103B374152l5212l6314l8371m1186m3619m4437m3636m2225m0824l9454l8395
61092A930479l8075l8091l7449l5993l4544l3654l3242l3442l4450l5431l4873
61081A541235l2450k9355k6506k3619k0375j7250j4704j2577j0622q700o376l445
$$ plain form
61069 1335256 1334387 1334725 1335819 1339134 1345985 1355389 1365469 1376138 1388604 1402642 1416410 1429021 1441512
61056 1441512 1454903 1468842 1482586 1495972 1508941 1521266 1533193 1545363 1557854 1570217 1582560
61045 1582560 1595389 1608240 1619802 1629743 1639208 1648991 1658280 1665681 1670573 1673186 1674326 1675294 1677067
61032 1677067 1679190 1680360 1680138 1679047 1677063 1673525 1668689 1663660 1658232 1650405 1638938 1624998 1610487
61019 1610487 1596063 1581769 1568284 1556251 1545214 1534264 1523070 1511520 1499262 1486501 1474486
61008 1474486 1464386 1456349 1450103 1445323 1440689 1433967 1424327 1413719 1404742 1397935 1392248 1387266 1383580
60995 1383580 1381597 1381243 1382408 1384500 1386118 1386444 1386623 1388602 1392919 1398698 1405416 1413407 1422833 1433436
60981 1433436 1445339 1458978 1474161 1490212 1507230 1526305 1548225 1572703 1599172 1627747 1659068
$$ packed form
61069A335256q69L38J094L315O851R404J0080J0669J2466J4038J3768J2611J2491
61056A441512J3391J3939J3744J3386J2969J2325J1927J2170J2491J2363J2343
61045A582560J2829J2851J1562R941R465R783R289P401M892K613J140R68J773
61032A677067K123J170k22j091j984l538m836n029n428p827j1467j3940j4511
61019A610487j4424j4294j3485j2033j1037j0950j1194j1550j2258j2761j2015
61008A474486j0100q037o246m780m634o722r640j0608q977o807n687m982l686
60995A383580j983l54J165K092J618L26J79J979M317N779O718P991R426J0603
60981A433436J1903J3639J5183J6051J7018J9075K1920K4478K6469K8575L1321
$$ plain form
60970 1659068 1693527 1730909 1770688 1812589 1856776 1903352 1951853 2001725 2053205 2107036 2163227
60959 2163227 2221051 2280512 2342980 2409877 2481516 2557660 2638305 2723419 2813021 2908407 3012333
60948 3012333 3126822 3251307 3383924 3524184 3673560 3833832 4005744 4189080 4383582
60939 4383582 4590068 4810781 5047996 5302320 5573678 5864311 6179333 6523558 6899278
60930 6899278 7308085 7753386 8240255 8774877 9365827 10024440 10762459 11590875 12522138
60921 12522138 13570681 14749731 16072114 17558683 19242396 21158827 23337286 25807278
60913 25807278 28596751 31680911 34898302 37927747 40397735 42070366 42950068 43235038
60905 43235038 43184188 43028811 42958000 43096823 43427850 43730632 43647618 42865702 41274541 38984433
$$ packed form
60970A659068L4459L7382L9779M1901M4187M6576M8501M9872N1480N3831N6191
60959B163227N7824N9461O2468O6897P1639P6144Q0645Q5114Q9602R5386J03926
60948C012333J14489J24485J32617J40260J49376J60272J71912J83336J94502
60939D383582K06486K20713K37215K54324K71358K90633L15022L44225L75720
60930F899278M08807M45301M86869N34622N90950O58613P38019Q28416R31263
60921A2522138J048543J179050J322383J486569J683713J916431K178459K469992
60913B5807278K789473L084160L217391L029445K469988J672631Q79702K84970
60905D3235038n0850j55377p0811J38823L31027L02782q3014p81916j591161k290108
$$ plain form
60895 38984433 36224897 33233415 30203507 27277723 24548293 22058771 19816196 17809053
60887 17809053 16018835 14425004 13009933 11762243 10673541 9732286 8922445 8226250
60879 8226250 7625393 7100954 6636202 6220235 5846950 5510610 5204557 4923953 4666807
60870 4666807 4431369 4214478 4013328 3826924 3654303 3492520 3337863 3188555 3045164
60861 3045164 2908679 2779145 2656187 2539963 2431070 2329681 2235108 2146277 2062546 1983926
60851 1983926 1910658 1842836 1780344 1722683 1668836 1617847 1569909 1526419 1488448 1455264 1424649
60840 1424649 1394597 1364654 1335879 1309665 1286323 1264680 1243264 1221882 1201750 1184213 1169868
60829 1169868 1158721 1150252 1143211 1136293 1129421 1123569 1119106 1115435 1112753 1112725 1116219 1121397 1125470 1127702
$$ packed form
60895C8984433k759536k991482l029908k925784k729430k489522k242575k007143
60887A7809053j790218j593831j415071j247690j088702r41255q09841o96195
60879H226250o00857n24439m64752m15967l73285l36340l06053k80604k57146
60870D666807k35438k16891k01150j86404j72621j61783j54657j49308j43391
60861C045164j36485j29534j22958j16224j08893j01389r4573q8831q3731p8620
60851A983926p3268o7822o2492n7661n3847n0989m7938m3490l7971l3184l0615
60840A424649l0052k9943k8775k6214k3342k1643k1416k1382k0132j7537j4345
60829A169868j1147q469p041o918o872n852m463l671k682k8L494N178M073K232
$$ plain form
60815 1127702 1129290 1130909 1132241 1133760 1136871 1141594 1145829 1148035 1149441 1152221 1156350 1159824 1161724 1163336
60801 1163336 1165777 1167942 1167945 1165908 1163942 1163389 1163287 1162082 1159800 1157575 1155754 1153902 1152673 1154138 1159431
60786 1159431 1167061 1174652 1181934 1190982 1203442 1218271 1232374 1243006 1249495 1253254 1256478 1260523 1265196
60773 1265196 1269591 1273606 1278472 1285698 1295537 1306538 1316591 1324500 1330705 1336585 1343152 1350494 1358241
60760 1358241 1366154 1374208 1382526 1391465 1401357 1411832 1421701 1429929 1436547 1442196 1447022 1450557 1452623 1453692
60746 1453692 1454048 1453163 1450308 1445514 1439415 1432224 1423416 1412657 1400590 1388263 1375897 1362779 1348377
60733 1348377 1333032 1317178 1300447 1282366 1263928 1247680 1235686 1227558 1220779 1212930 1203567 1194244
60721 1194244 1187088 1183291 1182602 1183903 1186207 1189281 1193650 1200141 1209270 1220882 1234342 1249039 1264492
$$ packed form
60815A127702J588J619J332J519L111M723M235K206J406K780M129L474J900J612
60801A163336K441K165Lk037j966n53j02j205k282k225j821j852j229J465N293
60786A159431P630P591P282R048J2460J4829J4103J0632O489L759L224M045M673
60773A265196M395M015M866P226R839J1001J0053P909O205N880O567P342P747
60760A358241P913Q054Q318Q939R892J0475R869Q228O618N649M826L535K066J069
60746A453692L56q85k855m794o099p191q808j0759j2067j2327j2366j3118j4402
60733A348377j5345j5854j6731j8081j8438j6248j1994q128o779p849r363r323
60721A194244p156l797o89J301K304L074M369O491R129J1612J3460J4697J5453
$$ plain form
60708 1264492 1280116 1295477 1311040 1328056 1346994 1366413 1384089 1399170 1412596 1425592 1438635
60697 1438635 1451958 1466026 1480853 1495406 1508374 1519331 1528831 1537616 1546086 1554282 1562006 1569036
60685 1569036 1575460 1581709 1588091 1594426 1600164 1604640 1607249 1607765 1606586 1604311 1600909 1595678 1588252 1579378
60671 1579378 1570504 1562730 1556028 1549085 1540027 1528018 1514351 1501473 1490737 1481663 1473378 1465727 1458534
60658 1458534 1450897 1442261 1433529 1425976 1419391 1412440 1404737 1397452 1391677 1387210 1383341 1379963 1377301 1375084
60644 1375084 1372611 1369388 1365162 1359488 1351864 1342509 1332760 1324473 1318878 1315839 1314110 1312406 1310399 1308708
60630 1308708 1307942 1307902 1307926 1307882 1308373 1309716 1311039 1310987 1309352 1307348 1305833 1303760 1299035 1290772 1280071 1268595
60614 1268595 1257082 1245329 1232891 1219407 1204850 1189966 1176075 1163922 1153049 1142763 1133298
$$ packed form
60708A264492J5624J5361J5563J7016J8938J9419J7676J5081J3426J2996J3043
60697A438635J3323J4068J4827J4553J2968J0957R500Q785Q470Q196P724P030
60685A569036O424O249O382O335N738M476K609N16j179k275l402n231p426q874
60671A579378q874p774o702o943r058j2009j3667j2878j0736r074q285p651p193
60658A458534p637q636q732p553o585o951p703p285n775m467l869l378k662k217
60644A375084k473l223m226n674p624r355r749q287n595l039j729j704k007j691
60630A308708p66m0K4m4M91J343J323n2j635k004j515k073m725q263j0701j1476
60614A268595j1513j1753j2438j3484j4557j4884j3891j2153j0873j0286r465
$$ plain form
60603 1133298 1125287 1118364 1111338 1103954 1097581 1093479 1090918 1087923 1083738 1079684 1077331 1076647 1076640 1077166 1079042
60588 1079042 1082427 1086182 1089161 1091178 1092197 1091548 1088959 1085697 1083414 1082065 1080260 1077762 1076325 1077504
60574 1077504 1080557 1083301 1084549 1085146 1086986 1091598 1099402 1109760 1121678 1134512 1147924 1161351 1174105
60561 1174105 1186170 1198428 1211895 1227079 1244183 1263352 1284519 1307490 1332365 1359370 1388080
60550 1388080 1417380 1446412 1474945 1502621 1528555 1552041 1572883 1590609 1604169 1613154 1618625 1621809
60538 1621809 1622291 1618333 1608880 1594671 1577426 1558480 1538331 1517369 1496900 1479054 1465014 1453575
60526 1453575 1442435 1430994 1420783 1412808 1406003 1399135 1392781 1387995 1383994 1378967 1372750 1367117 1363491
60513 1363491 1361738 1361127 1361116 1360962 1359849 1357803 1355717 1354309 1353952 1355521 1360202 1367945 1376951 1385238 1392333
$$ packed form
60603A133298q011o923p026p384o373m102k561k995m185m054k353o84pN26J876
60588A079042L385L755K979K017J019o49k589l262k283j349j805k498j437J179
60574A077504L053K744J248N97J840M612P804J0358J1918J2834J3412J3427J2754
60561A174105J2065J2258J3467J5184J7104J9169K1167K2971K4875K7005K8710
60550A388080K9300K9032K8533K7676K5934K3486K0842J7726J3560Q985N471L184
60538A621809M82l958r453j4209j7245j8946k0149k0962k0469j7846j4040j1439
60526A453575j1140j1441j0211p975o805o868o354m786m001n027o217n633l626
60513A363491j753o11j1j54j113k046k086j408l57J569M681P743R006Q287P095
$$ plain form
60498 1392333 1399416 1408444 1421051 1437318 1455443 1473513 1491910 1513057 1538515 1567269 1597369 1628282
60486 1628282 1660893 1695923 1733322 1772982 1815342 1861284 1911646 1966590 2025206 2085925 2147377
60475 2147377 2208396 2267068 2320287 2364555 2396936 2415329 2418680 2407588 2384431 2352604 2315647
60464 2315647 2276749 2238181 2200962 2165809 2134647 2110309 2094296 2085672 2082815 2085525 2094714 2110681
60452 2110681 2132714 2159983 2191840 2227389 2265705 2306643 2350924 2399585 2453951 2515945 2587479
60441 2587479 2669364 2761517 2864567 2980659 3112297 3260870 3426702 3610156 3812056 4033053
60431 4033053 4272954 4530718 4804851 5093878 5397013 5714949 6049564 6401489 6766348
60422 6766348 7132286 7480669 7789117 8034730 8196810 8259667 8215300 8064565 7816502 7486903
$$ packed form
60498A392333P083R028J2607J6267J8125J8070J8397K1147K5458K8754L0100L0913
60486A628282L2611L5030L7399L9660M2360M5942N0362N4944N8616O0719O1452
60475B147377O1019N8672N3219M4268L2381J8393L351j1092k3157l1827l6957
60464B315647l8898l8568l7219l5153l1162k4338j6013q624k857K710R189J5967
60452B110681K2033K7269L1857L5549L8316M0938M4281M8661N4366O1994P1534
60441B587479Q1885R2153J03050J16092J31638J48573J65832J83454K01900K20997
60431D033053K39901K57764K74133K89027L03135L17936L34615L51925L64859
60422F766348L65938L48383L08448K45613J62080O2857m4367j50735k48063l29599
$$ plain form
60412 7486903 7096622 6668776 6224943 5782333 5353348 4946438 4566707 4216381 3895763
60403 3895763 3604137 3339962 3101240 2886673 2696067 2528753 2381942 2251727 2135760
60394 2135760 2033716 1944829 1866183 1794317 1727796 1667192 1612901 1563993 1519137 1477648 1439167
60383 1439167 1402897 1367725 1333012 1299013 1266595 1236655 1209691 1185727 1164554 1145903 1129298
60372 1129298 1114045 1099692 1086386 1074371 1063284 1052615 1042886 1035416 1030343 1025681 1019389 1012001
60360 1012001 1006162 1003715 1004287 1006694 1010208 1013908 1016229 1016511 1016322 1017965 1021947 1026983 1032215 1038168 1045393
60345 1045393 1053340 1061040 1068083 1074454 1080166 1085689 1092216 1100714 1110686 1120248 1127584 1132449 1136500 1141998
60331 1141998 1149689 1158025 1164953 1170342 1175789 1181977 1187452 1190694 1192498 1195169 1199707 1204729 1208064 1208625
$$ packed form
60412G486903l90281m27846m43833m42610m28985m06910l79731l50326l20618
60403C895763k91626k64175k38722k14567j90606j67314j46811j30215j15967
60394B135760j02044q8887p8646p1866o6521o0604n4291m8908m4856m1489l8481
60383A439167l6270l5172l4713l3999l2418k9940k6964k3964k1173j8651j6605
60372A129298j5253j4353j3306j2015j1087j0669r729p470n073m662o292p388
60360A012001n839k447N72K407L514L700K321K82j89J643L982N036N232N953P225
60345A045393P947P700P043O371N712N523O527Q498R972R562P336M865M051N498
60331A141998P691Q336O928N389N447O188N475L242J804K671M538N022L335N61
$$ plain form
60317 1208625 1206824 1203991 1201524 1199956 1198600 1196566 1194166 1192742 1192950 1193835 1193898 1192650 1190738 1188965 1187756
60302 1187756 1187416 1188401 1191169 1195971 1202760 1211102 1220266 1229733 1239702 1250800 1263124 1275783 1287712
60289 1287712 1298801 1309906 1321701 1333905 1345723 1356631 1366441 1374933 1381947 1387650 1392250 1395636
60277 1395636 1397905 1400066 1403274 1407064 1409266 1408415 1405797 1404333 1405713 1409311 1413619 1417839 1421921 1425982
60263 1425982 1430163 1434624 1439128 1442820 1444809 1445004 1444244 1443625 1443571 1443395 1441832 1438396 1434190 1430908 1428933
60248 1428933 1426926 1423614 1419407 1415622 1412514 1409035 1404667 1400609 1398513 1398509 1399180 1399436 1399671 1400769 1402548
60233 1402548 1403837 1404029 1403915 1404759 1406878 1409428 1411406 1412632 1413941 1416682 1421793 1428939 1436712 1444228 1452515
60218 1452515 1463618 1478073 1493941 1508897 1522835 1537739 1555297 1575478 1597385 1620542 1644989
$$ packed form
60317A208625j801k833k467j568j356k034k400j424K08Q85O3j248j912j773j209
60302A187756l40R85K768M802O789Q342R164R467R969J1098J2324J2659J1929
60289A287712J1089J1105J1795J2204J1818J0908R810Q492P014N703M600L386
60277A395636K269K161L208L790K202q51k618j464J380L598M308M220M082M061
60263A425982M181M461M504L692J989J95p60o19n4j76j563l436m206l282j975
60248A428933k007l312m207l785l108l479m368m058k096mO71K56K35J098J779
60233A402548J289J92j14Q44K119K550J978J226J309K741N111P146P773P516Q287
60218A452515J1103J4455J5868J4956J3938J4904J7558K0181K1907K3157K4447
$$ plain form
60207 1644989 1670866 1698512 1728514 1760984 1795073 1829924 1866073 1905309 1948985 1996924 2048147
60196 2048147 2102285 2160034 2222550 2290694 2364630 2443918 2528042 2617130 2712138 2814293 2924501
60185 2924501 3043296 3171003 3307608 3452634 3605536 3766186 3934595 4110015 4290563
60176 4290563 4473783 4657325 4838883 5015751 5184805 5342994 5487824 5617566 5731235
60167 5731235 5828315 5908203 5969862 6012328 6035781 6042053 6033979 6014342 5985461 5949518 5908919 5866471
60155 5866471 5825542 5789930 5763008 5746705 5741693 5748888 5770405 5808465 5863454 5933714 6017578 6115272
60143 6115272 6228411 6357773 6501891 6657754 6822344 6993157 7167421 7341283 7509843
60134 7509843 7667859 7810602 7934588 8037824 8119023 8176347 8207430 8211146 8188931 8143571 8076945
$$ packed form
60207A644989K5877K7646L0002L2470L4089L4851L6149L9236M3676M7939N1223
60196B048147N4138N7749O2516O8144P3936P9288Q4124Q9088R5008J02155J10208
60185B924501J18795J27707J36605J45026J52902J60650J68409J75420J80548
60176D290563J83220J83542J81558J76868J69054J58189J44830J29742J13669
60167E731235R7080P9888O1659M2466K3453O272q074j9637k8881l5943m0599m2448
60155E866471m0929l5612k6922j6303n012P195K1517L8060N4989P0260Q3864R7694
60143F115272J13139J29362J44118J55863J64590J70813J74264J73862J68560
60134G509843J58016J42743J23986J03236Q1199N7324L1083L716k2215m5360o6626
$$ plain form
60123 8076945 7990099 7885550 7768189 7643217 7514356 7385082 7260586 7146793 7047461 6963519
60113 6963519 6895458 6845270 6815602 6807862 6821719 6855989 6909519 6981396 7070487 7174610 7290188
60102 7290188 7412950 7538784 7663631 7783122 7893204 7990997 8074318 8140849 8189140 8220527
60092 8220527 8238719 8247069 8247344 8241389 8232648 8225406 8223851 8232606 8256792 8300289 8364933 8452506 8566401
60079 8566401 8709888 8883721 9087231 9321182 9587760 9888093 10221811 10589087 10991045
60070 10991045 11427421 11895403 12391411 12912519 13455159 14013742 14581762 15153215 15721410
60061 15721410 16276812 16807504 17302203 17752381 18151769 18494639 18774758 18985554 19121275
60052 19121275 19178402 19156079 19055147 18877245 18625590 18306704 17930733 17509650 17055144 16578095
$$ packed form
60123H076945q6846j04549j17361j24972j28861j29274j24496j13793r9332q3942
60113F963519o8061n0188k9668p740J3857L4270N3530P1877Q9091J04123J15578
60102G290188J22762J25834J24847J19491J10082R7793Q3321O6531M8291L1387
60092H220527J8192Q350K75n955q741p242j555Q755K4186M3497O4644Q7573J13895
60079H566401J43487J73833K03510K33951K66578L00333L33718L67276M01958
60070A0991045M36376M67982M96008N21108N42640N58583N68020N71453N68195
60061A5721410N55402N30692M94699M50178L99388L42870K80119K10796J35721
60052A9121275N7127k2323j00932j77902k51655l18886l75971m21083m54506m77049
$$ plain form
60042 16578095 16089350 15600088 15121157 14662311 14232208 13838604 13487824 13183925 12928797
60033 12928797 12723095 12566610 12457752 12393588 12371021 12387396 12439198 12520462 12623219 12739320
60023 12739320 12861148 12980816 13089976 13181175 13249130 13290508 13302932 13284538 13234317 13152579
60013 13152579 13041027 12902136 12738175 12550894 12342382 12115922 11875469 11624409 11365344
60004 11365344 11101127 10835654 10573661 10320037 10079019 9853325 9644151 9452793 9282391
59995 9282391 9137332 9020805 8933550 8875038 8844918 8842858 8867871 8918650 8994205 9093506 9214759
59984 9214759 9355471 9512809 9683049 9860701 10038945 10211312 10372661 10518398 10643211
59975 10643211 10741228 10807637 10839998 10837985 10802225 10733586 10633229 10502823 10344930 10163837
$$ packed form
60042A6578095m88745m89262m78931m58846m30103l93604l50780l03899k55128
60033A2928797k05702j56485j08858o4164k2567J6375N1802Q1264J02757J16101
60023A2739320J21828J19668J09160R1199O7955M1378J2424j8394n0221q1738
60013A3152579j11552j38891j63961j87281k08512k26460k40453k51060k59065
60004A1365344k64217k65473k61993k53624k41018k25694k09174j91358j70402
59995I282391j45059j16527q7255n8512l0120k060K5013N0779P5555R9301J21253
59984I214759J40712J57338J70240J77652J78244J72367J61349J45737J24813
59975A0643211R8017O6409L2361k013l5760o8639j00357j30406j57893j81093
$$ plain form
59965 10163837 9965804 9757525 9544065 9329164 9117765 8916815 8732517 8567638 8422633
59956 8422633 8298625 8197911 8122159 8071887 8047778 8051068 8082386 8141355 8227561 8340787 8480168
59945 8480168 8644264 8832054 9042473 9272605 9517640 9772903 10034348 10296231 10549834
59936 10549834 10785769 10996912 11178642 11327721 11442302 11521823 11565200 11569616 11532541 11454745
59926 11454745 11340308 11194188 11021179 10826964 10618574 10403276 10187828 9978793 9782363
59917 9782363 9603273 9444562 9308830 9199136 9118140 9066779 9044391 9050054 9083366 9143772 9229481
59906 9229481 9337653 9465788 9612325 9775284 9950784 10133848 10320552 10508287 10693895
59897 10693895 10872954 11041527 11197508 11339623 11466437 11577721 11675922 11764832 11847057 11923964
$$ packed form
59965A0163837j98033k08279k13460k14901k11399k00950j84298j64879j45005
59956H422633j24008j00714p5752n0272k4109L290L1318N8969Q6206J13226J39381
59945H480168J64096J87790K10419K30132K45035K55263K61445K61883K53603
59936A0549834K35935K11143J81730J49079J14581P9521M3377M416l7075p7796
59926A1454745j14437j46120j73009j94215k08390k15298k15448k09035j96430
59917I782363j79090j58711j35732j09694q0996n1361k2388N663L3312O0406Q5709
59906I229481J08172J28135J46537J62959J75500J83064J86704J87735J85608
59897A0693895J79059J68573J55981J42115J26814J11284R8201Q8910Q2225P6907
$$ plain form
59887 11923964 11997862 12073108 12155299 12250395 12364368 12502389 12668097 12864487 13095403 13365184
59877 13365184 13676742 14030864 14427332 14865491 15343254 15856349 16398777 16962986 17538923
59868 17538923 18113227 18669548 19189272 19652315 20038857 20331682 20517412 20586587 20534611 20363686
59858 20363686 20082998 19706046 19248185 18726860 18162149 17574355 16980230 16392253 15821269
59849 15821269 15278142 14772099 14308749 13891010 13521504 13202983 12936831 12722634 12559676
59840 12559676 12447860 12386481 12372872 12403104 12473663 12581609 12723302 12893706 13086567 13294049
59830 13294049 13505954 13710327 13895535 14051251 14167270 14232556 14236783 14173039 14038925 13835778
59820 13835778 13567840 13242045 12867653 12455366 12016352 11561285 11099405 10638241 10184408
$$ packed form
59887A1923964P3898P5246Q2191R5096J13973J38021J65708J96390K30916K69781
59877A3365184L11558L54122L96468M38159M77763N13095N42428N64209N75937
59868A7538923N74304N56321N19724M63043L86542K92825J85730O9175n1976j70925
59858B0363686k80688l76952m57861n21325n64711n87794n94125n87977n70984
59849A5821269n43127n06043m63350m17739l69506l18521k66152k14197j62958
59840A2559676j11816o1379j3609L0232P0559J07946J41693J70404J92861K07482
59830A3294049K11905K04373J85208J55716J16019O5286M227o3744j34114k03147
59820A3835778k67938l25795l74392m12287m39014m55067m61880m61164m53833
$$ plain form
59811 10184408 9744445 9324394 8928615 8559315 8217216 7902512 7615525 7356847 7126700
59802 7126700 6923787 6745050 6587209 6448588 6328985 6227768 6142650 6070398 6008052 5952993
59792 5952993 5902364 5853411 5804736 5756689 5710058 5664613 5619509 5575029 5533060 5495449 5462431
59781 5462431 5433056 5406255 5380546 5353276 5321442 5283372 5238779 5187614 5130259 5068794 5006440
59770 5006440 4945175 4885222 4827355 4774120 4727844 4688888 4657160 4634190 4621979 4620376 4627085 4639979
59758 4639979 4658235 4681628 4710255 4745153 4788126 4840662 4903424 4976288 5057895 5145413 5235877
59747 5235877 5327944 5421723 5517017 5612393 5705631 5794231 5875795 5948972 6013981 6071571 6121809
59736 6121809 6164805 6202231 6237095 6272171 6309607 6351618 6400313 6457086 6523508 6602657 6698178
$$ packed form
59811A0184408m39963m20051l95779l69300l42099l14704k86987k58678k30147
59802G126700k02913j78737j57841j38621j19603j01217q5118p2252o2346n5059
59792E952993n0629m8953m8675m8047m6631m5445m5104m4480m1969l7611l3018
59781E462431k9375k6801k5709k7270l1834l8070m4593n1165n7355o1465o2354
59770E006440o1265n9953n7867n3235m6276l8956l1728k2970j2211j603O709J2894
59758D639979J8256K3393K8627L4898M2973N2536O2762P2864Q1607Q7518R0464
59747E235877R2067R3779R5294R5376R3238Q8600Q1564P3177O5009N7590N0238
59736F121809M2996L7426L4864L5076L7436M2011M8695N6773O6422P9149R5521
$$ plain form
59725 6698178 6812115 6945182 7099123 7276986 7480640 7709897 7965021 8248728 8564716
59716 8564716 8915375 9301809 9724725 10183620 10675239 11193129 11727128 12261154 12771131
59707 12771131 13226343 13594533 13848511 13972251 13964583 13838205 13614282 13316755 12969928 12597989
59697 12597989 12223156 11862709 11527931 11225672 10960120 10733354 10545825 10397569 10289084
59688 10289084 10220866 10192376 10201810 10246912 10326024 10438658 10585287 10766582 10982616 11232526
59678 11232526 11514810 11828235 12172966 12551044 12965599 13419418 13914239 14451161 15031255
59669 15031255 15655716 16325952 17043920 17812168 18633223 19508867 20439839 21425615 22463791
59660 22463791 23549360 24674591 25829591 27002934 28181810 29352046 30499104 31610599
$$ packed form
59725F698178J13937J33067J53941J77863K03654K29257K55124K83707L15988
59716H564716L50659L86434M22916M58895M91619N17890N33999N34026N09977
59707A2771131M55212L68190K53978J23740p668j26378k23923k97527l46827l71939
59697A2597989l74833l60447l34778l02259k65552k26766j87529j48256j08485
59688A0289084o8218k8490R434M5102P9112J12634J46629J81295K16034K49910
59678A1232526K82284L13425L44731L78078M14555M53819M94821N36922N80094
59669A5031255O24461O70236P17968P68248Q21055Q75644R30972R85776J038176
59660B2463791J085569J125231J155000J173343J178876J170236J147058J111495
$$ plain form
59652 31610599 32679070 33702840 34684678 35630297 36548035 37448479 38342596 39239502 40145580
59643 40145580 41064144 41993810 42926394 43846951 44736215 45572998 46335452 47002580 47556582
59634 47556582 47984549 48278873 48437940 48467800 48382841 48203720 47953896 47657440 47338647 47021953
59624 47021953 46730969 46487018 46308252 46209898 46205119 46305393 46520094 46856165 47318473 47909901
59614 47909901 48630398 49476103 50439647 51510366 52672566 53902790 55168753 56430060
59606 56430060 57638606 58738571 59668806 60368845 60785965 60880439 60629021 60027788 59093652
59597 59093652 57862773 56385421 54718948 52921393 51047568 49147305 47263908 45431946
59589 45431946 43676096 42012190 40448371 38983838 37606587 36293971 35016851 33744982
$$ packed form
59652C1610599J068471J023770R81838R45619R17738R00444Q94117Q96906R06078
59643D0145580R18564R29666R32584R20557Q89264Q36783P62454O67128N54002
59634D7556582M27967K94324J59067K9860q4959j79121k49824k96456l18793l16694
59624D7021953k90984k43951j78766r8354m779J00274K14701L36071M62308N91428
59614D7909901P20497Q45705R63544J070719J162200J230224J265963J261307
59606E6430060J208546J099965R30235P00039M17120R4474k51418o01233r34136
59597E9093652j230879j477352j666473j797555j873825j900263j883397j831962
59589D5431946j755850j663906j563819j464533j377251j312616j277120j271869
$$ plain form
59581 33744982 32452429 31123238 29755418 28359960 26955481 25562964 24202883 22892852
59573 22892852 21645228 20467022 19362507 18334839 17384739 16509443 15704616 14966775 14292936
59564 14292936 13679107 13120782 12614547 12157801 11747051 11377661 11045274 10746470 10478004
59555 10478004 10236399 10018587 9822248 9645070 9483870 9334491 9192453 9053976 8916736
59546 8916736 8779544 8641094 8499345 8352367 8199459 8041258 7879318 7715915 7553596
59537 7553596 7394127 7238151 7086347 6940597 6803492 6677012 6562126 6459190 6368046 6288038
59527 6288038 6218765 6160789 6115129 6082095 6061088 6051291 6052000 6062509 6082310 6111412 6149856 6196774
59515 6196774 6250348 6308904 6371790 6439058 6510542 6585455 6662975 6743222 6827609 6918094 7016223
$$ packed form
59581C3744982j292553j329191j367820j395458j404479j392517j360081j310031
59573B2892852j247624j178206j104515j027668r50100q75296q04827p37841o73839
59564A4292936o13829n58325n06235m56746m10750l69390l32387k98804k68466
59555A0478004k41605k17812j96339j77178j61200j49379j42038j38477j37240
59546H916736j37192j38450j41749j46978j52908j58201j61940j63403j62319
59537G553596j59469j55976j51804j45750j37105j26480j14886j02936r1144q0008
59527F288038o9273n7976m5660l3034k1007r797P09J0509J9801K9102L8444M6918
59515F196774N3574N8556O2886O7268P1484P4913P7520Q0247Q4387R0485R8129
$$ plain form
59504 7016223 7123106 7240064 7368638 7509857 7664086 7831879 8014538 8213614 8430279
59495 8430279 8665396 8919779 9194199 9489561 9807174 10148248 10512738 10899139 11305576
59486 11305576 11730449 12171666 12625925 13089246 13557682 14026930 14491663 14945820 15383494
59477 15383494 15799486 16189618 16550820 16880398 17174990 17431158 17647685 17826835 17972866
59468 17972866 18089911 18181784 18253034 18309180 18356181 18400242 18447640 18504000 18573862 18660880 18767106
59457 18767106 18890742 19025039 19160310 19286593 19393598 19469246 19500385 19475400 19385200 19222134
59447 19222134 18980214 18657738 18259053 17792953 17269788 16700319 16096182 15469953 14834436
59438 14834436 14202067 13584600 12992367 12433188 11911744 11429965 10988143 10586116 10223928
$$ packed form
59504G016223J06883J16958J28574J41219J54229J67793J82659J99076K16665
59495H430279K35117K54383K74420K95362L17613L41074L64490L86401M06437
59486A1305576M24873M41217M54259M63321M68436M69248M64733M54157M37674
59477A5383494M15992L90132L61202L29578K94592K56168K16527J79150J46031
59468A7972866J17045R1873P1250N6146M7001M4061M7398N6360O9862Q7018J06226
59457A8767106J23636J34297J35271J26283J07005P5648L1139k4985r0200j63066
59447A9222134k41920l22476l98685m66100n23165n69469o04137o26229o35517
59438A4834436o32369o17467n92233n59179n21444m81779m41822m02027l62188
$$ plain form
59429 10223928 9901566 9618218 9371916 9160103 8980694 8832649 8715605 8629102 8572306 8544369
59419 8544369 8544635 8572252 8626014 8705118 8809949 8941684 9101138 9288349 9502939 9744016
59409 9744016 10009574 10296626 10602083 10922932 11255336 11594121 11933080 12264894 12580398
59400 12580398 12868904 13120119 13325445 13477059 13566626 13586291 13531459 13402598 13204639 12945052
59390 12945052 12632268 12275260 11883829 11468426 11038852 10602912 10166573 9735312 9314740
59381 9314740 8909867 8524305 8160273 7818836 7500085 7203757 6930027 6679426 6452044
59372 6452044 6247204 6063722 5899942 5753920 5624470 5511748 5415735 5334398 5264744 5205739
59362 5205739 5158756 5124967 5103732 5093751 5094013 5103040 5119016 5141743 5172919 5213393 5261826 5317404
$$ packed form
59429A0223928l22362k83348k46302k11813j79409j48045j17044q6503n6796k7937
59419H544369K66K7617N3762P9104J04831J31735J59454J87211K14590K41077
59409I744016K65558K87052L05457L20849L32404L38785L38959L31814L15504
59400A2580398K88506K51215K05326J51614Q9567J9665n4832j28861j97959k59587
59390A2945052l12784l57008l91431m15403m29574m35940m36339m31261m20572
59381I314740m04873l85562l64032l41437l18751k96328k73730k50601k27382
59372F452044k04840j83482j63780j46022j29450j12722r6013q1337o9654n9005
59362E205739m6983l3789k1235r981K62R027J5976K2727L1176M0474M8433N5578
$$ plain form
59350 5317404 5382023 5457279 5539856 5622205 5698337 5768142 5836393 5908810 5989100 6078647 6178466
59339 6178466 6291219 6420696 6568860 6734092 6912739 7101566 7298547 7503190 7717891
59330 7717891 7948279 8200597 8478722 8784309 9119034 9485664 9887712 10329249 10814380
59321 10814380 11345587 11922885 12545627 13214457 13930244 14691454 15493506 16329859 17192026
59312 17192026 18068610 18945724 19808798 20643771 21437561 22179042 22860088 23475622 24023363
59303 24023363 24503964 24920140 25274348 25567760 25801769 25978626 26098883 26159334 26155298 26084084
59293 26084084 25944662 25735280 25454249 25103177 24687589 24214544 23691475 23127013 22530482
59284 22530482 21909599 21269508 20613702 19944393 19262249 18567630 17862546 17150497 16435217
$$ packed form
59350E317404O4619P5256Q2577Q2349P6132O9805O8251P2417Q0290Q9547R9819
59339F178466J12753J29477J48164J65232J78647J88827J96981K04643K14701
59330G717891K30388K52318K78125L05587L34725L66630M02048M41537M85131
59321A0814380N31207N77298O22742O68830P15787P61210Q02052Q36353Q62167
59312A7192026Q76584Q77114Q63074Q34973P93790P41481O81046O15534N47741
59303B4023363M80601M16176L54208K93412K34009J76857J20257O0451m036p1214
59293B6084084j39422k09382k81031l51072m15588m73045n23069n64462n96531
59284B2530482o20883o40091o55806o69309o82144o94619p05084p12049p15280
$$ plain form
59275 16435217 15721379 15016131 14327695 13662121 13022850 12413034 11835943 11293007 10783815
59266 10783815 10308718 9869495 9466759 9098559 8762355 8456758 8180695 7932508 7710880
59257 7710880 7515282 7344681 7196878 7069763 6962137 6872870 6800479 6743959 6702848 6676214
59247 6676214 6662937 6663220 6678223 6707707 6749582 6802276 6866045 6941490 7028667 7128341 7242118
59236 7242118 7370102 7510012 7659832 7819791 7990431 8170335 8357496 8551767 8753897
59227 8753897 8962647 9174576 9386599 9597410 9806354 10012021 10212297 10405465 10591286
59218 10591286 10771089 10946328 11116745 11280523 11436518 11585548 11728863 11865692 11992484
59209 11992484 12103742 12193071 12254198 12282121 12273895 12228778 12148180 12035265 11893903 11727901
$$ packed form
59275A6435217p13838p05248o88436o65574o39271o09816n77091n42936n09192
59266A0783815m75097m39223m02736l68200l36204l05597k76063k48187k21628
59257G710880j95598j70601j47803j27115j07626q9267p2391n6520m1111k6634
59247F676214j3277K83J5003K9484M1875N2694O3769P5445Q7177R9674J13777
59236G242118J27984J39910J49820J59959J70640J79904J87161J94271K02130
59227H753897K08750K11929K12023K10811K08944K05667K00276J93168J85821
59218A0591286J79803J75239J70417J63778J55995J49030J43315J36829J26792
59209A1992484J11258Q9329O1127K7923q226m5117q0598j12915j41362j66002
$$ plain form
59199 11727901 11541684 11341141 11132750 10922058 10714006 10514203 10328168 10159142 10008084
59190 10008084 9876078 9765429 9678181 9615078 9576466 9562897 9574365 9610101 9669426 9751497 9853982
59179 9853982 9973627 10108706 10259473 10425756 10605671 10797397 11000484 11214652 11439028
59170 11439028 11673767 11920953 12182539 12458555 12748629 13054248 13378242 13722732 14088356
59161 14088356 14474335 14877691 15292672 15711569 16125366 16522785 16889324 17208168 17462019
59152 17462019 17634671 17712816 17687840 17555755 17315642 16969689 16525186 15994833 15394161 14739659
59142 14739659 14049341 13342281 12635130 11939543 11263707 10614886 9999184 9420399 8880889
59133 8880889 8382599 7925583 7506495 7120672 6765703 6441825 6149200 5886119 5649635
$$ packed form
59199A1727901j86217k00543k08391k10692k08052j99803j86035j69026j51058
59190A0008084j32006j10649q7248o3103l8612j3569J1468L5736N9325Q2071J02485
59179I853982J19645J35079J50767J66283J79915J91726K03087K14168K24376
59170A1439028K34739K47186K61586K76016K90074L05619L23994L44490L65624
59161A4088356L85979M03356M14981M18897M13797L97419L66539L18844K53851
59152A7462019J72652P8145k4976j32085k40113l45953m44503n30353o00672o54502
59142A4739659o90318p07060p07151o95587o75836o48821o15702n78785n39510
59133H880889m98290m57016m19088l85823l54969l23878k92625k63081k36484
$$ plain form
59124 5649635 5436725 5244612 5070705 4912429 4767275 4633653 4511710 4402276 4304683 4216722
59114 4216722 4137052 4066246 4004836 3951734 3905454 3865451 3831268 3801670 3775892 3754832 3740037
59103 3740037 3732338 3731993 3738818 3751502 3768433 3790144 3819246 3856787 3900525 3948309 4001334 4062135
59091 4062135 4130903 4205805 4285728 4370565 4459923 4553810 4653927 4762146 4878195 5000629
59081 5000629 5129498 5266070 5410339 5560757 5716212 5876573 6041447 6210084 6382335
59072 6382335 6558151 6736026 6913223 7087526 7257872 7423563 7583850 7737891 7884306
59063 7884306 8021335 8148234 8265805 8375065 8476728 8572916 8667574 8763751 8862119 8963881
59053 8963881 9073254 9194698 9329203 9475936 9636280 9813104 10006630 10213889 10431778
$$ packed form
59124E649635k12910j92113j73907j58276j45154j33622j21943j09434r7593q7961
59114D216722p9670p0806o1410n3102m6280m0003l4183k9598k5778k1060j4795
59103C740037p699l45O825J2684J6931K1711K9102L7541M3738M7784N3025O0801
59091D062135O8768P4902P9923Q4837Q9358R3887J00117J08219J16049J22434
59081E000629J28869J36572J44269J50418J55455J60361J64874J68637J72251
59072F382335J75816J77875J77197J74303J70346J65691J60287J54041J46415
59063G884306J37029J26899J17571J09260J01663R6188R4658R6177R8368J01762
59053H963881J09373J21444J34505J46733J60344J76824J93526K07259K17889
$$ plain form
59044 10431778 10657482 10885696 11108299 11317204 11504997 11662451 11778390 11843568 11853343 11806474
59034 11806474 11703924 11550126 11353544 11124200 10871076 10602124 10325361 10048883 9780019
59025 9780019 9524357 9284753 9061593 8855008 8666340 8496229 8342010 8198824 8062963
59016 8062963 7932375 7804496 7675906 7544244 7408331 7266280 7115647 6955797 6788052
59007 6788052 6613068 6430085 6239343 6043258 5844534 5644895 5446292 5251387 5061865
58998 5061865 4877724 4698927 4526298 4360366 4201165 4049831 3908564 3777966 3655936
58989 3655936 3540039 3429529 3324396 3224335 3129661 3041501 2959718 2882215 2807681 2737685
58979 2737685 2674452 2617685 2565121 2515500 2469505 2428243 2392016 2360240 2331722 2305399 2281425
$$ packed form
59044A0431778K25704K28214K22603K08905J87793J57454J15939O5178R775m6869
59034A1806474j02550j53798j96582k29344k53124k68952k76763k76478k68864
59025I780019k55662k39604k23160k06585j88668j70111j54219j43186j35861
59016H062963j30588j27879j28590j31662j35913j42051j50633j59850j67745
59007F788052j74984j82983j90742j96085j98724j99639j98603j94905j89522
58998E061865j84141j78797j72629j65932j59201j51334j41267j30598j22030
58989C655936j15897j10510j05133j00061r4674q8160q1783p7503p4534o9996
58979B737685o3233n6767n2564m9621m5995m1262l6227l1776k8518k6323k3974
$$ plain form
58968 2281425 2260986 2244552 2231154 2219954 2211419 2205973 2202523 2199479 2196499 2194016 2191692 2188764 2185718
58955 2185718 2184278 2185399 2188128 2190744 2192470 2193799 2195563 2198130 2201535 2206071 2212323 2220450 2229801 2239561
58941 2239561 2249531 2259921 2270804 2282338 2295165 2309844 2326120 2343352 2361396 2380402 2400163
58930 2400163 2420571 2442370 2466447 2492620 2519975 2548063 2576744 2605295 2633101 2661135 2691329
58919 2691329 2724267 2758716 2793665 2829680 2867971 2909093 2952824 2998443 3044941 3091806 3139755
58908 3139755 3190006 3242887 3297900 3354832 3413894 3475059 3538343 3604469 3674197 3747319 3823387
58897 3823387 3902932 3986607 4073647 4162779 4254410 4350411 4452092 4560013 4675309 4799227
58887 4799227 4931522 5071338 5219546 5378018 5546557 5722973 5906742 6100526 6307508
$$ packed form
58968B281425k0439j6434j3398j1200q535n446l450l044k980k483k324k928l046
58955B185718j440J121K729K616J726J329J764K567L405M536O252Q127R351R760
58941B239561R970J0390J0883J1534J2827J4679J6276J7232J8044J9006J9761
58930B400163K0408K1799K4077K6173K7355K8088K8681K8551K7806K8034L0194
58919B691329L2938L4449L4949L6015L8291M1122M3731M5619M6498M6865M7949
58908C139755N0251N2881N5013N6932N9062O1165O3284O6126O9728P3122P6068
58897C823387P9545Q3675Q7040Q9132R1631R6001J01681J07921J15296J23918
58887D799227J32295J39816J48208J58472J68539J76416J83769J93784K06982
$$ plain form
58878 6307508 6529249 6766602 7020465 7290788 7576816 7879273 8200596 8542562 8905779
58869 8905779 9292191 9705715 10149263 10623356 11128892 11669059 12246978 12863596 13519792
58860 13519792 14218771 14964303 15757876 16599367 17489149 18427384 19411833 20437798 21499255
58851 21499255 22588240 23693372 24799706 25888924 26938412 27921278 28808926 29573496
58843 29573496 30188068 30627535 30872743 30914402 30752566 30393913 29851366 29145154 28301330
58834 28301330 27348007 26312716 25221462 24097688 22961625 21831398 20724054 19653974
58826 19653974 18630455 17658165 16739981 15878511 15075254 14329660 13639361 13000759 12409712
58817 12409712 11862556 11356718 10890041 10459787 10062627 9695088 9353768 9035909 8740325
$$ packed form
58878F307508K21741K37353K53863K70323K86028L02457L21323L41966L63217
58869H905779L86412M13524M43548M74093N05536N40167N77919O16618O56196
58860A3519792O98979P45532P93573Q41491Q89782R38235R84449J025965J061457
58851B1499255J088985J105132J106334J089218J049488R82866Q87648P64570
58843B9573496O14572M39467K45208M1659j61836l58653n42547p06212q43824
58834B8301330r53323j035291j091254j123774j136063j130227j107344j070080
58826A9653974j023519r72290r18184q61470q03257p45594o90299o38602n91047
58817A2409712n47156n05838m66677m30254l97160l67539l41320l17859k95584
$$ plain form
58808 8740325 8467018 8215270 7982823 7767552 7569011 7387455 7222063 7071095 6933375
58799 6933375 6808734 6697373 6599362 6514387 6441486 6379513 6328294 6288734 6261480 6246213 6242511
58788 6242511 6250427 6269741 6299707 6340205 6392300 6457024 6534434 6624427 6727565 6844486 6975364
58777 6975364 7120434 7280067 7453968 7641548 7843700 8062984 8301306 8558554 8834177
58768 8834177 9128778 9443468 9779190 10137764 10522299 10935388 11377946 11850729 12355697
58759 12355697 12894952 13469856 14082556 14737005 15436891 16183536 16977025 17818005 18706596
58750 18706596 19640359 20614590 21623188 22657029 23701996 24740137 25752002 26716073
58742 26716073 27606592 28394253 29049802 29546976 29864066 29986023 29906617 29628426 29161342
$$ packed form
58808H740325k73307k51748k32447k15271j98541j81556j65392j50968j37720
58799F933375j24641j11361r8011q4975p2901o1973n1219l9560k7254j5267l702
58788F242511P916J9314K9966M0498N2095O4724P7410Q9993J03138J16921J30878
58777F975364J45070J59633J73901J87580K02152K19284K38322K57248K75623
58768H834177K94601L14690L35722L58574L84535M13089M42558M72783N04968
58759A2355697N39255N74904O12700O54449O99886P46645P93489Q40980Q88591
58750A8706596R33763R74231J008598J033841J044967J038141J011865R64071
58742B6716073Q90519P87661O55549M97174L17090J21957p9406k78191m67084
$$ plain form
58733 29161342 28521875 27732659 26820050 25810910 24731341 23606906 22461636 21315849
58725 21315849 20185201 19081556 18014223 16990835 16017822 15099812 14238426 13432673 12681245
58716 12681245 11983483 11337528 10739005 10182945 9666127 9186308 8740246 8324082 7935044
58707 7935044 7571333 7230910 6911842 6613319 6334858 6074781 5830801 5601878 5388307
58698 5388307 5190105 5006270 4835350 4675886 4526615 4387043 4257520 4138215 4028549
58689 4028549 3928019 3836444 3752725 3674585 3600615 3531483 3467963 3408967 3352787 3299237 3249094
58678 3249094 3202423 3158833 3118298 3080102 3041969 3002222 2962139 2924307 2889088 2854454 2818955
58667 2818955 2783031 2747485 2712332 2677243 2641758 2604948 2565944 2524880 2482516 2439136 2394535
$$ packed form
58733B9161342o39467p89216r12609j009140j079569j124435j145270j145787
58725B1315849j130648j103645j067333j023388r73013r18010q61386q05753p51428
58716A2681245o97762o45955n98523n56060n16818m79819m46062m16164l89038
58707G935044l63711l40423l19068k98523k78461k60077k43980k28923k13571
58698E388307j98202j83835j70920j59464j49271j39572j29523j19305j09666
58689D028549j00530r1575q3719p8140p3970o9132o3520n8996n6180n3550n0143
58678C249094m6671m3590m0535l8196l8133l9747m0083l7832l5219l4634l5499
58667B818955l5924l5546l5153l5089l5485l6810l9004m1064m2364m3380m4601
$$ plain form
58656 2394535 2348648 2301539 2253462 2205629 2159970 2117154 2075786 2034549 1994044 1955395 1918459
58645 1918459 1882999 1850321 1821701 1795928 1770304 1743632 1716587 1689857 1663693 1638833 1616085
58634 1616085 1595175 1575332 1556504 1538770 1521342 1503638 1486503 1470847 1456090 1441724 1429218
58623 1429218 1420206 1413691 1407538 1402067 1399471 1399981 1401426 1402790 1405504 1410448 1416115 1420898 1425432 1431350
58609 1431350 1438728 1445706 1450003 1450454 1447778 1444157 1441595 1440616 1440765 1441700 1443134 1444563 1446083 1448808 1453488
58594 1453488 1459549 1466490 1475122 1486159 1498803 1512313 1527767 1546367 1567145 1588572 1611644 1638990
58582 1638990 1671401 1707556 1746889 1790309 1837952 1888321 1940075 1993230 2048734 2108352 2174631
58571 2174631 2249087 2330413 2416011 2505222 2599818 2701951 2813213 2935001 3067839 3210722
$$ packed form
58656B394535m5887m7109m8077m7833m5659m2816m1368m1237m0505l8649l6936
58645A918459l5460l2678k8620k5773k5624k6672k7045k6730k6164k4860k2748
58634A616085k0910j9843j8828j7734j7428j7704j7135j5656j4757j4366j2506
58623A429218r012o515o153n471k596N10J445J364K714M944N667M783M534N918
58609A431350P378O978M297M51k676l621k562r79J49R35J434J429J520K725M680
58594A453488O061O941Q632J1037J2644J3510J5454J8600K0778K1427K3072K7346
58582A638990L2411L6155L9333M3420M7643N0369N1754N3155N5504N9618O6279
58571B174631P4456Q1326Q5598Q9211R4596J02133J11262J21788J32838J42883
$$ plain form
58561 3210722 3362979 3526439 3704093 3897318 4106315 4332314 4576874 4839351 5117446
58552 5117446 5409888 5716056 6032951 6354689 6674597 6985133 7275569 7532411 7742951
58543 7742951 7897226 7987545 8009349 7963269 7854174 7687844 7470652 7212438 6926578 6625610
58533 6625610 6318009 6009428 5704972 5409390 5126453 4858857 4607832 4373050 4154363
58524 4154363 3953387 3771945 3609529 3464017 3334301 3220048 3119509 3029968 2950010 2878927
58514 2878927 2814282 2752919 2694440 2640922 2592897 2548121 2504674 2462746 2423036 2385777 2351618
58503 2351618 2320927 2291762 2261029 2228247 2195904 2165576 2135931 2104995 2072131 2037300 2000669
58492 2000669 1963481 1927241 1891615 1855064 1817545 1780484 1744278 1708470 1674232 1643714 1616672
$$ packed form
58561C210722J52257J63460J77654J93225K08997K25999K44560K62477K78095
58552E117446K92442L06168L16895L21738L19908L10536K90436K56842K10540
58543G742951J54275R0319K1804m6080j09095j66330k17192k58214k85860l00968
58533F625610l07601l08581l04456k95582k82937k67596k51025k34782k18687
58524D154363k00976j81442j62416j45512j29716j14253j00539q9541p9958p1083
58514B878927o4645o1363n8479n3518m8025m4776m3447m1928l9710l7259l4159
58503B351618l0691k9165l0733l2782l2343l0328k9645l0936l2864l4831l6631
58492B000669l7188l6240l5626l6551l7519l7061l6206l5808l4238l0518k7042
$$ plain form
58481 1616672 1590739 1565439 1542847 1523683 1505809 1487488 1469157 1451073 1432173 1412544 1394271
58470 1394271 1378505 1364003 1349637 1335961 1323366 1311107 1299118 1288359 1278437 1267425 1255022
58459 1255022 1243448 1234234 1226567 1219733 1214515 1211096 1208146 1205194 1203466 1203286 1203108 1202259 1202175 1203790 1205992
58444 1205992 1207623 1208635 1208447 1205756 1200891 1195724 1190421 1183134 1173809 1165221 1158959 1153374 1146732 1139396
58430 1139396 1131552 1121979 1110760 1100262 1091720 1083636 1075052 1067398 1061395 1055280 1048060 1041502 1036848
58417 1036848 1032513 1027266 1022779 1020614 1019289 1016746 1013292 1009831 1005721 1000809 997137 995978 995252 992371
58403 992371 987786 983545 980236 977509 975772 975251 975117 975296 977229 981181 984952 986992 988646 991606 995468
58388 995468 999530 1004580 1011060 1017932 1025138 1034479 1046053 1056614 1063715 1068674 1073063 1075212 1073194 1068858
$$ packed form
58481A616672k5933k5300k2592j9164j7874j8321j8331j8084j8900j9629j8273
58470A394271j5766j4502j4366j3676j2595j2259j1989j0759r922j1012j2403
58459A255022j1574r214p667o834n218l419k950k952j728j80j78q49q4J615K202
58444A205992J631J012j88k691m865n167n303p287r325q588o262n585o642p336
58430A139396p844r573j1219j0498q542q084q584p654o003o115p220o558m654
58417A036848m335n247m487k165j325k543l454l461m110m912l672j159p26k881
58403I92371m585m241l309k727j737n21j34J79J933L952L771K040J654K960L862
58388I95468M062N050O480O872P206R341J1574J0561P101M959M389K149k018m336
$$ plain form
58374 1068858 1065668 1064252 1062736 1059884 1055546 1049634 1042847 1036831 1031842 1026118 1019031 1012465 1007477 1002469
58360 1002469 996639 992185 990596 989670 987023 983917 982772 983339 984151 985451 987894 990620 993419 998522 1007410
58345 1007410 1017921 1027196 1035306 1043444 1050976 1057245 1064090 1073508 1084565 1095173 1104982 1114219 1122005
58332 1122005 1128405 1135904 1146333 1158472 1170888 1184543 1200220 1216098 1230424 1243862 1256777 1267287
58320 1267287 1274697 1281616 1289801 1297117 1301548 1304771 1308485 1310777 1309903 1308280 1308785 1310163 1310077 1309694 1311193
58305 1311193 1313651 1315475 1317976 1322512 1327017 1329596 1332654 1339164 1347723 1355495 1362936 1371107 1377703 1380747
58291 1380747 1383307 1389299 1397271 1403409 1407938 1413166 1417960 1420025 1421448 1426179 1433780 1441211 1448978 1459815
58277 1459815 1472929 1485289 1497350 1511990 1528893 1545307 1561278 1578960 1597725 1614933 1630508
$$ packed form
58374A068858l190j416j516k852m338n912o787o016m989n724p087o566m988n008
58360A002469n830m454j589r26k647l106j145N67Q12J300K443K726K799N103Q888
58345A007410J0511R275Q110Q138P532O269O845R418J1057J0608R809R237P786
58332A122005O400P499J0429J2139J2416J3655J5677J5878J4326J3438J2915J0510
58320A267287P410O919Q185P316M431L223L714K292q74j623N05J378q6l83J499
58305A311193K458J824K501M536M505K579L058O510Q559P772P441Q171O596L044
58291A380747K560N992P972O138M529N228M794K065J423M731P601P431P767J0837
58277A459815J3114J2360J2061J4640J6903J6414J5971J7682J8765J7208J5575
$$ plain form
58266 1630508 1646168 1661480 1675434 1690306 1709020 1730064 1749773 1768071 1787269 1807107 1826025
58255 1826025 1845376 1867130 1889184 1908263 1925752 1945393 1967044 1988051 2008916 2032050 2056707
58244 2056707 2080595 2104792 2131656 2159878 2186978 2214552 2245475 2278292 2310338 2344019 2383779
58233 2383779 2428959 2475715 2523578 2573874 2624291 2671784 2718552 2768390 2819534 2868057 2915784
58222 2915784 2967599 3023427 3080293 3139707 3205067 3274090 3342050 3410588 3485263 3566267 3649573
58211 3649573 3735213 3826303 3921999 4019790 4122536 4234749 4354275 4476453 4604039 4743916
58201 4743916 4896629 5058711 5232682 5424453 5632906 5852294 6082796 6328407 6586867
58192 6586867 6852701 7128030 7419190 7724908 8039403 8364750 8707929 9067869 9438183
$$ packed form
58266A630508J5660J5312J3954J4872J8714K1044J9709J8298J9198J9838J8918
58255A826025J9351K1754K2054J9079J7489J9641K1651K1007K0865K3134K4657
58244B056707K3888K4197K6864K8222K7100K7574L0923L2817L2046L3681L9760
58233B383779M5180M6756M7863N0296N0417M7493M6768M9838N1144M8523M7727
58222B915784N1815N5828N6866N9414O5360O9023O7960O8538P4675Q1004Q3306
58211C649573Q5640R1090R5696R7791J02746J12213J19526J22178J27586J39877
58201D743916J52713J62082J73971J91771K08453K19388K30502K45611K58460
58192F586867K65834K75329K91160L05718L14495L25347L43179L59940L70314
$$ plain form
58183 9438183 9820621 10222554 10643021 11075263 11521845 11993346 12493395 13019227 13575492
58174 13575492 14172278 14810231 15482740 16192037 16948140 17753691 18606373 19514689 20493918
58165 20493918 21547523 22670068 23866382 25148357 26514608 27954459 29471401 31081263
58157 31081263 32788668 34589260 36495439 38535368 40725828 43071122 45588741 48308709
58149 48308709 51247059 54409427 57822814 61535080 65585643 70012891 74890940 80319969
58141 80319969 86379283 93134159 100693337 109214798 118855064 129766668 142141369 156180293
58133 156180293 172009381 189703442 209417505 231447446 256240166 284529922 317327424
58126 317327424 355061736 395926875 434927245 465178231 481007857 480496494 465621269
$$ packed form
58183I438183L82438M01933M20467M32242M46582M71501N00049N25832N56265
58174A3575492N96786O37953O72509P09297P56103Q05551Q52682R08316R79229
58165B0493918J053605J122545J196314J281975J366251J439851J516942J609862
58157C1081263J707405J800592J906179K039929K190460K345294K517619K719968
58149D8308709K938350L162368L413387L712266M050563M427248M878049N429029
58141H0319969O059314O754876P559178Q521461R640266J0911604J2374701J4038924
58133A56180293J5829088J7694061J9714063K2029941K4792720K8289756L2797502
58126C17327424L7734312M0865139L9000370L0250986J5829626n11363j4875225
$$ plain form
58119 465621269 440458373 409246221 375417253 341417901 308785459 278316052 250321495
58112 250321495 224853314 201811021 181021907 162352478 145759437 131221473 118657497
58105 118657497 107934692 98913581 91443090 85340213 80425883 76574418 73687021 71628233
58097 71628233 70259767 69572002 69708061 70726953 72276972 73552577 73670597 72155283
58089 72155283 69105637 64973787 60254307 55344893 50547298 46065445 41986813 38311896
58081 38311896 35014029 32061141 29406649 27004093 24835339 22901624 21190205 19671835
58073 19671835 18325359 17139566 16092358 15151589 14297500 13524448 12820558 12165546 11549834
58064 11549834 10977185 10446206 9945940 9471497 9027853 8615730 8228322 7863888 7527454
$$ packed form
58119D65621269k5162896l1212152l3828968l3999352l2632442l0469407k7994557
58112B50321495k5468181k3042293k0789114j8669429j6593041j4537964j2563976
58105A18657497j0722805r021111p470491o102877m914330l851465k887397k058788
58097G1628233j368466o87765J36059J018892J550019J275605J18020j515314
58089G2155283l049646m131850m719480m909414m797595m481853m078632l674917
58081C8311896l297867k952888k654492k402556k168754j933715j711419j518370
58073A9671835j346476j185793j047208r40769q54089p73052p03890o55012o15712
58064A1549834n72649n30979n00266m74443m43644m12123l87408l64434l36434
$$ plain form
58055 7527454 7218122 6927812 6653640 6398294 6157275 5919647 5683341 5456820 5243767
58046 5243767 5038708 4839285 4649716 4469563 4291750 4114934 3946232 3788698 3637213
58037 3637213 3489650 3351025 3223422 3102444 2986823 2881190 2785994 2694735 2604687 2520726
58027 2520726 2445178 2373420 2303101 2238285 2180417 2123981 2065353 2007899 1954453 1902638 1851375
58016 1851375 1804291 1762719 1722558 1681840 1644545 1613343 1585190 1557303 1530919 1506115 1479639
58005 1479639 1451114 1424950 1403097 1382258 1361045 1343097 1329970 1317529 1302796 1288128 1275370
57994 1275370 1262101 1247014 1232879 1220742 1207172 1190688 1174979 1162231 1149170 1133483 1118447
57983 1118447 1107122 1097261 1086043 1074986 1066178 1058375 1050746 1046056 1046197 1048564 1050357 1052492 1055978
$$ packed form
58055G527454l09332k90310k74172k55346k41019k37628k36306k26521k13053
58046E243767k05059j99423j89569j80153j77813j76816j68702j57534j51485
58037C637213j47563j38625j27603j20978j15621j05633r5196r1259r0048q3961
58027B520726p5548p1758p0319o4816n7868n6436n8628n7454n3446n1815n1263
58016A851375m7084m1572m0161m0718l7295l1202k8153k7887k6384k4804k6476
58005A479639k8525k6164k1853k0839k1213j7948j3127j2441j4733j4668j2758
57994A275370j3269j5087j4135j2137j3570j6484j5709j2748j3061j5687j5036
57983A118447j1325r861j1218j1057q808p803p629m690J41K367J793K135L486
$$ plain form
57970 1055978 1058616 1058839 1058932 1060946 1062999 1062762 1060992 1058479 1053242 1044023 1033238 1023412 1013841 1003446
57956 1003446 993490 984723 975294 964281 954033 946336 939587 932360 926197 921888 916377 906643 894082
57943 894082 882229 872642 865401 860875 858395 855609 851509 847909 846206 845283 844214 844105 845449 846599
57929 846599 846658 847011 848272 848617 846839 844190 841790 839359 837802 839513 844343 848705 850314 850544 850652 849533
57913 849533 846952 845059 844520 842904 838974 834736 830988 824903 814722 803122 793121 784123 774800 766331
57899 766331 759749 753291 745483 737980 732516 727858 722432 716960 711868 705210 696120 687346 681382 676892
57885 676892 671854 667372 665220 664206 662220 659738 658522 658996 661321 666489 673685 679090 680180 678950
57871 678950 678418 678339 676847 673692 669177 662488 653876 646079 640902 636742 631916 627657 625259 623331 620827
$$ packed form
57970A055978K638K23R3K014K053k37j770k513n237r219j0785r826r571j0395
57956A003446r956q767r429j1013j0248p697o749p227o163m309n511r734j2561
57943H94082j1853r587p241m526k480k786m100l600j703r23j069j09J344J150
57929H46599N9L53J261L45j778k649k400k431j557J711M830M362J609K30J08j119
57913H49533k581j893n39j616l930m238l748o085j0181j1600j0001q998r323q469
57899G66331o582o458p808p503n464m658n426n472n092o658r090q774n964m490
57885F76892n038m482k152j014j986k482j216M74K325N168P196N405J090j230
57871F78950n32p9j492l155m515o689q612p797n177m160m826m259k398j928k504
$$ plain form
57856 620827 619814 622003 625429 628039 631756 639197 648865 657541 665318 674275 684013 692397 699180 705172
57842 705172 709306 710184 709286 709177 709665 708920 707029 705159 702534 697675 691510 686029 680909 674569 667444
57827 667444 660935 654260 645684 636108 628236 622726 618026 613375 609208 605307 601201 597709 595529 593138
57813 593138 588655 582964 578625 576641 576605 578807 583537 589354 594623 599762 605598 610915 614355 617367 622208
57798 622208 628009 631804 632676 632165 631464 630908 631140 631842 630244 624016 615021 607359 602262 597580 591456 583718
57782 583718 574414 564013 554572 547862 542673 536478 529102 522168 515863 509107 502161 495979 489643 481508
57768 481508 472481 465067 459563 454134 448211 442672 436992 429580 420976 413524 407664 401629 395153 390269
57754 390269 387716 385407 381477 376524 371960 368271 365718 364926 365872 367592 369295 370836 372231 373784 376106
$$ packed form
57856F20827j013K189L426K610L717P441R668Q676P777Q957R738Q384O783N992
57842G05172M134Q78q98j09M88p45j891j870k625m859o165n481n120o340p125
57827F67444o509o675q576r576p872n510m700m651m167l901m106l492k180k391
57813E93138m483n691m339j984l6K202M730N817N269N139N836N317L440L012M841
57798F22208N801L795Q72n11p01n56K32P02j598o228q995p662n097m682o124p738
57782E83718r304j0401r441o710n189o195p376o934o305o756o946o182o336q135
57768D81508r027p414n504n429n923n539n680p412q604p452n860o035o476m884
57754C90269k553k309l930m953m564l689k553p92R46J720J703J541J395J553K322
$$ plain form
57739 376106 378817 380372 380795 383173 390146 400058 409077 415893 421445 425221 425435 422569 419311 416960 414887
57724 414887 413443 414023 415956 416704 415918 416270 419361 423485 426291 427133 425967 422506 417619 413419 410833
57709 410833 408777 406430 404470 403533 403275 403519 404590 406165 407709 410322 416010 424541 432996 439091 443244
57694 443244 446968 451182 456698 464396 473958 483790 492812 501172 509074 516330 523083 529427 534435 537289
57680 537289 539250 542629 547794 553138 558012 563542 570363 577707 585207 593776 604141 615979 628668
57667 628668 641521 653505 664349 675629 689112 704560 720978 739017 759627 781298 801803
57656 801803 822177 845496 871793 897793 922125 947046 974235 1002668 1032072 1064790 1102084
57645 1102084 1141677 1181369 1222611 1268116 1318006 1370745 1426206 1485456 1548742 1615864 1687765
$$ packed form
57739C76106K711J555M23K378O973R912R019O816N552L776K14k866l258k351k073
57724D14887j444N80J933P48p86L52L091M124K806Q42j166l461m887m200k586
57709D10833k056k347j960r37k58K44J071J575J544K613N688Q531Q455O095M153
57694D43244L724M214N516P698R562R832R022Q360P902P256O753O344N008K854
57680E37289J961L379N165N344M874N530O821P344P500Q569J0365J1838J2689
57667F28668J2853J1984J0844J1280J3483J5448J6418J8039K0610K1671K0505
57656H01803K0374K3319K6297K6000K4332K4921K7189K8433K9404L2718L7294
57645A102084L9593L9692M1242M5505M9890N2739N5461N9250O3286O7122P1901
$$ plain form
57634 1687765 1765943 1850860 1942255 2040492 2146555 2261246 2385151 2518872 2663059 2819045
57624 2819045 2989414 3176564 3380480 3599252 3831867 4078793 4339655 4612079 4892907
57615 4892907 5178268 5461849 5735179 5990416 6221236 6420993 6582756 6702048 6777031 6804833
57605 6804833 6780170 6699184 6562825 6375592 6143797 5877087 5589178 5293914 5000935 4716253
57595 4716253 4445158 4192213 3959368 3746312 3552641 3378573 3224171 3089073 2972534
57586 2972534 2873017 2788406 2717259 2659077 2612941 2577062 2550158 2531959 2521820 2518382 2521359 2532110
57574 2532110 2551560 2578986 2613828 2657224 2710661 2774318 2847638 2930318 3022070 3122883 3234314
57563 3234314 3358925 3497531 3648455 3810253 3983270 4167376 4359976 4557553 4757340
$$ packed form
57634A687765P8178Q4917R1395R8237J06063J14691J23905J33721J44187J55986
57624B819045J70369J87150K03916K18772K32615K46926K60862K72424K80828
57615D892907K85361K83581K73330K55237K30820J99757J61763J19292P4983K7802
57605F804833k4663q0986j36359j87233k31795k66710k87909k95264k92979k84682
57595D716253k71095k52945k32845k13056j93671j74068j54402j35098j16539
57586B972534r9517q4611p1147n8182m6136l5879k6904j8199j0139l438K977J0751
57574B532110J9450K7426L4842M3396N3437O3657P3320Q2680R1752J00813J11431
57563C234314J24611J38606J50924J61798J73017J84106J92600J97577J99787
$$ plain form
57554 4757340 4955657 5145831 5319402 5468389 5585251 5662319 5693503 5676554 5612897 5506095
57544 5506095 5361162 5184173 4981465 4759890 4527831 4293842 4063129 3836864 3615976
57535 3615976 3403742 3203400 3015274 2838174 2672296 2518932 2378441 2250207 2133663
57526 2133663 2027898 1931271 1842774 1762820 1691475 1627095 1567922 1513691 1464264 1418120 1373888
57515 1373888 1332238 1294652 1261438 1232445 1208389 1189519 1173894 1158919 1143991 1130163 1118025
57504 1118025 1107556 1099312 1094113 1091952 1092350 1095088 1099575 1104638 1110157 1117657 1127866 1139144 1150110
57491 1150110 1162535 1179471 1201365 1226100 1252139 1279530 1308407 1338766 1371593 1408370 1449400
57480 1449400 1494048 1542339 1594913 1651785 1712656 1778173 1849416 1926557 2009459 2099211 2197581
$$ packed form
57554D757340J98317J90174J73571J48987J16862P7068L1184j6949o3657j06802
57544E506095j44933j76989k02708k21575k32059k33989k30713k26265k20888
57535C615976k12234k00342j88126j77100j65878j53364j40491j28234j16544
57526B133663j05765r6627q8497p9954p1345o4380n9173n4231m9427m6144m4232
57515A373888m1650l7586l3214k8993k4056j8870j5625j4975j4928j3828j2138
57504A118025j0469q244n199k161L98K738M487N063N519P500J0209J1278J0966
57491A150110J2425J6936K1894K4735K6039K7391K8877L0359L2827L6777M1030
57480A449400M4648M8291N2574N6872O0871O5517P1243P7141Q2902Q9752R8370
$$ plain form
57469 2197581 2305213 2421651 2546711 2680351 2821617 2969242 3123043 3283115 3447518
57460 3447518 3611795 3770521 3918262 4049477 4158915 4242185 4295174 4313589 4294497 4238316
57450 4238316 4148617 4030571 3890330 3734767 3570070 3400711 3230605 3064281 2905453 2755156
57440 2755156 2612880 2479106 2355372 2242458 2140092 2048171 1966889 1895985 1835075 1784257
57430 1784257 1743065 1709348 1680640 1656355 1637471 1624540 1617296 1615644 1619620 1628765 1642791 1662332
57418 1662332 1687843 1718459 1753394 1793749 1841328 1896304 1957685 2025455 2100523 2183034 2272613
57407 2272613 2369839 2475614 2589327 2709616 2836753 2972202 3115378 3262283 3407492 3546003
57397 3546003 3673072 3783748 3873017 3935645 3966229 3960751 3918248 3840310 3729819 3591440 3432322
$$ packed form
57469B197581J07632J16438J25060J33640J41266J47625J53801J60072J64403
57460C447518J64277J58726J47741J31215J09438Q3270N2989J8415j9092n6181
57450D238316q9699j18046j40241j55563j64697j69359j70106j66324j58828j50297
57440B755156j42276j33774j23734j12914j02366r1921q1282p0904o0910n0818
57430A784257m1192l3717k8708k4285j8884j2931p244j652L976R145J4026J9541
57418A662332K5511L0616L4935M0355M7579N4976O1381O7770P5068Q2511Q9579
57407B272613R7226J05775J13713J20289J27137J35449J43176J46905J45209J38511
57397C546003J27069J10676Q9269O2628L0584n478m2503p7938j10491j38379j59118
$$ plain form
57386 3432322 3260126 3080245 2896185 2711873 2531603 2358000 2192043 2034966 1888310
57377 1888310 1752294 1626188 1510232 1405181 1309879 1221500 1138627 1062179 992869 929794
57367 929794 872153 820371 774432 732702 693492 656622 622551 591093 561942 535545 512455
57356 512455 492221 473499 454950 435947 416870 398727 381992 366057 350366 335518 322267
57345 322267 310026 297637 285214 273807 263471 253199 242757 233208 225496 219622 215218 211704
57333 211704 207964 203101 197536 192319 187491 182215 176230 169966 163606 157281 151774 147540 143388 137616
57319 137616 130128 121929 113158 103491 94016 86536 81011 75706 69908 64448 59528 54254 48738 44457
57305 44457 41842 39380 35920 32182 29271 27214 25589 24167 22241 18677 13316 7301 1696 -3090
$$ packed form
57386C432322j72196j79881j84060j84312j80270j73603j65957j57077j46656
57377A888310j36016j26106j15956j05051r5302q8379q2873p6448o9310o3075
57367I29794n7641n1782m5939m1730l9210l6870l4071l1458k9151k6397k3090
57356E12455k0234j8722j8549j9003j9077j8143j6735j5935j5691j4848j3251
57345C22267j2241j2389j2423j1407j0336j0272j0442r549p712n874m404l514
57333B11704l740m863n565n217m828n276n985o264o360o325n507m234m152n772
57319A37616p488q199q771r667r475p480n525n305n798n460m920n274n516m281
57305D4457k615k462l460l738k911k057j625j422j926l564n361o015A696c090
$$ plain form
57290 -6525 -8023 -7990 -7481 -6813 -5910 -5657 -6936 -8428 -7655 -4528 -1619 -339 868 3743 7765 11618 15281
57273 15281 19466 24315 29541 34529 37816 38150 36719 36514 38743 41611 43464 45059 47563 50287 52021
57258 52021 53181 54962 57437 59801 61616 62803 63434 64425 67287 72231 77709 82786 88631 96435 105171
57243 105171 112922 119586 126735 135397 145361 156422 169054 183682 200036 217360 235117 253522
57231 253522 273376 295269 319306 345931 376144 410010 445723 481515 517825 556129 596362
57220 596362 637353 679310 723654 770645 819352 869780 922409 975306 1024276 1066620 1102610
57209 1102610 1132753 1155948 1170991 1177534 1174716 1161258 1138038 1108484 1075316 1038900 999500 958704
57197 958704 917463 875118 831897 790371 753011 720236 691964 668889 650785 635784 623001
$$ packed form
57290f525j498L3N09O68R03K53j279j492P73L127a619c39H68K875M022L853L663
57273A5281M185M849N226M988L287L34j431k05K229K868J853J595K504K724J734
57258E2021J160J781K475K364J815J187O31R91K862M944N478N077N845P804Q736
57243A05171P751O664P149Q662R964J1061J2632J4628J6354J7324J7757J8405
57231B53522J9854K1893K4037K6625L0213L3866L5713L5792L6310L8304M0233
57220E96362M0991M1957M4344M6991M8707N0428N2629N2897M8970M2344L5990
57209A102610L0143K3195J5043O543k818j3458k3220k9554l3168l6416l9400m0796
57197I58704m1241m2345m3221m1526l7360l2775k8272k3075j8104j5001j2783
$$ plain form
57186 623001 613815 608861 605784 601862 597109 592994 589962 588148 588844 593109 600109 608615 618904 631678
57172 631678 646496 662903 681662 703189 726106 749036 772568 797784 824097 850220 876243
57161 876243 903200 931478 960747 990414 1019377 1046832 1074292 1105030 1140473 1178860 1218351
57150 1218351 1259337 1302588 1347526 1393797 1442112 1491798 1539957 1585047 1629053 1674123 1719453
57139 1719453 1763730 1808153 1854352 1901331 1947181 1991961 2036182 2078228 2116277 2151473 2186519
57128 2186519 2222320 2258387 2295090 2332896 2370557 2406588 2441478 2476168 2509455 2539043 2564106
57117 2564106 2584948 2601551 2614333 2624837 2633823 2640365 2644433 2648132 2652433 2655207 2654697 2652302 2649345
57104 2649345 2643924 2633884 2620118 2603667 2582480 2554935 2524073 2494288 2466032 2437883 2411515
$$ packed form
57186F23001r186m954l077l922m753m115l032j814O96M265P000Q506J0289J2774
57172F31678J4818J6407J8759K1527K2917K2930K3532K5216K6313K6123K6023
57161H76243K6957K8278K9269K9667K8963K7455K7460L0738L5443L8387L9491
57150A218351M0986M3251M4938M6271M8315M9686M8159M5090M4006M5070M5330
57139A719453M4277M4423M6199M6979M5850M4780M4221M2046L8049L5196L5046
57128B186519L5801L6067L6703L7806L7661L6031L4890L4690L3287K9588K5063
57117B564106K0842J6603J2782J0504Q986O542M068L699M301K774n10k395k957
57104B649345n421j0040j3766j6451k1187k7545l0862k9785k8256k8149k6368
$$ plain form
57093 2411515 2389749 2371090 2350679 2325483 2294259 2253575 2198290 2125378 2033554 1920328 1783428
57082 1783428 1624183 1445595 1247936 1029640 790881 532190 250840 -57383 -394141 -759843
57072 -759843 -1157010 -1588055 -2051866 -2547448 -3079444 -3655833 -4282526 -4965282 -5714437 -6541603
57062 -6541603 -7453181 -8452771 -9548366 -10751308 -12069975 -13510765 -15084031 -16803000
57054 -16803000 -18678732 -20723124 -22956069 -25403794 -28092296 -31049071 -34308833 -37909677
57046 -37909677 -41885291 -46268510 -51100621 -56430406 -62309097 -68797758 -75978503 -83949490
57038 -83949490 -92811628 -102668055 -113627690 -125791764 -139237267 -154023923 -170209010
57031 -170209010 -187840696 -206950604 -227572122 -249733782 -273378726 -298319756 -324404224
$$ packed form
57093B411515k1766j8659k0411k5196l1224m0684n5285p2912r1824j13226j36900
57082A783428j59245j78588j97659k18296k38759k58691B50840e7383l36758l65702
57072g59843l97167m31045m63811m95582n31996n76389o26693o82756p49155q27166
57062f541603r11578r99590j095595j202942j318667j440790j573266j718969
57054a6803000j875732k044392k232945k447725k688502k956775l259762l600844
57046c7909677l975614m383219m832111n329785n878691o488661p180745p970987
57038h3949490q862138r856427j0959635j2164074j3445503j4786656j6185087
57031a70209010j7631686j9109908k0621518k2161660k3644944k4941030k6084468
$$ plain form
57024 -324404224 -351803172 -381020381 -412345109 -445044016 -476977820 -505062791 -526337352
57017 -526337352 -538971488 -542666322 -538338435 -527416062 -511237272 -490851927 -467152208
57010 -467152208 -441029429 -413361307 -384888016 -356133764 -327432640 -299013690 -271092962
57003 -271092962 -243940770 -217892863 -193298904 -170452693 -149554944 -130710000 -113929605
56996 -113929605 -99140083 -86205446 -74958103 -65217416 -56797896 -49521307 -43229249
56989 -43229249 -37783629 -33060460 -28950821 -25365300 -22229961 -19478639 -17053790 -14911045
56981 -14911045 -13014846 -11329939 -9822368 -8466677 -7245540 -6142771 -5142106 -4231730
56973 -4231730 -3403854 -2649498 -1958232 -1322687 -738732 -201576 293890 749563 1165740
$$ packed form
57024c24404224k7398948k9217209l1324728l2698907l1933804k8084971k1274561
57017e26337352j2634136l694834M327887J0922373J6178790K0385345K3699719
57010d67152208K6122779K7668122K8473291K8754252K8701124K8418950K7920728
57003b71092962K7152192K6047907K4593959K2846211K0897749J8844944J6780395
56996a13929605J4789522J2934637J1247343R740687Q419520P276589O292058
56989d3229249N445620M723169M109639L585521L135339K751322K424849K142745
56981a4911045J896199J684907J507571J355691J221137J102769J000665R10376
56973d231730Q27876P54356O91266O35545N83955b01576B93890M55673M16177
$$ plain form
56964 1165740 1546646 1900268 2232711 2546337 2842911 3123838 3386643 3625309 3835580
56955 3835580 4017603 4173485 4305547 4417251 4512485 4593039 4659160 4712787 4757585 4795605
56945 4795605 4826624 4851152 4872046 4893853 4923531 4970172 5036903 5108519 5149826 5121756 5002858
56934 5002858 4798275 4531910 4231895 3920850 3614350 3323334 3054683 2809164 2581315
56925 2581315 2363982 2153384 1949488 1753029 1564066 1382771 1209590 1044613 888147
56916 888147 741547 606049 481095 365190 257943 159811 70378 -11316 -84926 -148862
56906 -148862 -202156 -244993 -277782 -301159 -316497 -324834 -325658 -318202 -303514 -283676 -259647 -231879
56894 -231879 -202663 -175597 -152657 -133765 -119215 -110200 -106534 -106070 -107291 -110714 -116834 -124269 -130948
$$ packed form
56964A165740L80906L53622L32443L13626K96574K80927K62805K38666K10271
56955C835580J82023J55882J32062J11704R5234Q0554O6121N3627M4798L8020
56945D795605L1019K4528K0894K1807K9678M6641O6731P1616M1307k8070j18898
56934E002858k04583k66365l00015l11045l06500k91016k68651k45519k27849
56925B581315k17333k10598k03896j96459j88963j81295j73181j64977j56466
56916H88147j46600j35498j24954j15905j07247r8132G0378a1316p3610o3936
56906a48862n3294m2837l2789k3377j5338q337q24P456J4688J9838K4029K7768
56894b31879K9216K7066K2940J8892J4550R015L666M64j221l423o120p435o679
$$ plain form
56881 -130948 -136093 -140145 -143609 -146484 -147936 -146186 -139702 -128717 -114436 -96560 -73096 -43248 -9472
56867 23751 51872 70745 77218 70980 55282 34709 12559 -9283 -29171 -45844 -59457 -71291
56855 -71291 -82288 -92395 -101216 -108691 -115075 -120584 -125180 -128654 -130970 -132478 -133586 -134284 -134306 -133640 -132564
56840 -132564 -131244 -129714 -128036 -125929 -122393 -116515 -108777 -100814 -93587 -86248 -77083 -65153 -50778 -34711
56826 -34711 -17036 3214 27024 53414 78758 98956 112667 121919 129463 136225 141624 145562 149220
56813 149220 154128 161094 170144 181118 194109 209375 226985 246793 268956 294358 324183 359013
56801 359013 398566 442303 489749 539588 588380 630759 661656 678856 683616 679095 668607 655057
56789 655057 640783 626835 612958 599477 589110 585633 590460 601675 616789 635336 658249 686123
$$ packed form
56881a30948n145m052l464k875j452J750O484J0985J4281J7876K3464K9848i472
56867B3751K8121J8873O473o238j5698k0573A2559i283j9888j6673j3613j1834
56855g1291j0997j0107q821p475o384n509m596l474k316j508j108o98k2O66J076
56840a32564J320J530J678K107L536N878P738P963P227P339R165J1930J4375J6067
56826c4711a7036C214K3810K6390K5344K0198J3711R252P544O762N399L938L658
56813A49220M908O966R050J0974J2991J5266J7610J9808K2163K5402K9825L4830
56801C59013L9553M3737M7446M9839M8792M2379L0897J7200M760m521j0488j3550
56789F55057j4274j3948j3877j3481j0367l477M827J1215J5114J8547K2913K7874
$$ plain form
56777 686123 719286 758611 804805 857270 914540 975094 1036163 1092066 1135462 1160936 1166903 1154516
56765 1154516 1126265 1085975 1038714 989538 942435 900326 864915 835975 811689 790648 773176
56754 773176 760389 752856 751040 756266 769765 790831 817371 848658 886053 929630 974580 1012212
56742 1012212 1034670 1038274 1023255 992334 950205 902631 854293 807561 763769 724593 691036
56731 691036 662030 635847 612717 594580 582446 575624 573701 577467 587286 602069 620720 643253
56719 643253 669344 696530 720639 737430 743589 737534 720407 695590 666412 634804 602384 571427
56707 571427 543655 518990 496553 476114 457689 440642 424379 409247 395710 383366 371848
56696 371848 361889 354342 348796 344269 340504 337316 333542 328229 322364 317819 314937 312627 310422 308815
$$ packed form
56777F86123L3163L9325M6194N2465N7270O0554O1069N5903M3396K5474N967j2387
56765A154516k8251m0290m7261m9176m7103m2109l5411k8940k4286k1041j7472
56754G73176j2787p533j816N226J3499K1066K6540L1287L7395M3577M4950L7632
56742A012212K2458L604j5019l0921m2129m7574m8338m6732m3792l9176l3557
56731F91036k9006k6183k3130j8137j2134o822j923L766R819J4783J8651K2533
56719F43253K6091K7186K4109J6791O159o055j7127k4817k9178l1608l2420l0957
56707E71427k7772k4665k2437k0439j8425j7047j6263j5132j3537j2344j1518
56696C71848r959p547n546m527l765l188l774n313n865m545k882k310k205j607
$$ plain form
56682 308815 307847 307076 306770 307307 307314 304441 298588 292733 289774 289837 291245 292696 293471 292680 289712 285137 280412
56665 280412 276840 274987 274559 274536 274028 273269 273123 273448 272777 270110 266344 263396 262335 262813 263818 264559 264879
56648 264879 265113 265347 264879 262918 259859 257200 255952 255632 255058 253562 251263 248864 247645 249008 253265
56633 253265 258942 263791 266543 267501 267574 267072 265655 263363 261386 261318 263569 266927 269936 272200 273944 274864
56617 274864 274304 272365 270009 267980 266365 265354 265703 267907 271211 273913 274776 274026 272875 272095 271361 270245
56601 270245 269427 270168 272618 275629 278459 281693 285972 290766 295134 298902 302318 305325 308090 311510 316138
56586 316138 321160 325391 328708 331437 332968 332337 329818 326752 323996 321620 319704 318151 315961 312053
56572 312053 306739 301246 296010 290778 286123 283207 281935 280866 279241 277654 276319 274161 270345 265669
$$ packed form
56682C08815r68p71l06N37Pk873n853n855k959O3J408J451P75p91k968m575m725
56665B80412l572j853m28k3n08p59j46L25o71k667l766k948j061M78J005P41L20
56648B64879K34K34m68j961l059k659j248l20n74j496k299k399j219J363M257
56633B53265N677M849K752R58P3n02j417k292j977o8K251L358L009K264J744R20
56617B74864n60j939k356k029j615j011L49K204L304K702Q63p50j151p80p34j116
56601B70245q18P41K450L011K830L234M279M794M368L768L416L007K765L420M628
56586C16138N022M231L317K729J531o31k519l066k756k376j916j553k190l908
56572C12053n314n493n236n232m655k916j272j069j625j587j335k158l816m676
$$ plain form
56558 265669 261813 259909 260096 261555 262691 262274 260784 259894 260579 262591 265593 269356 272741 274157 273612
56543 273612 272885 273045 273158 272245 271053 270734 270908 270395 269203 268503 269032 270460 272080 273307 273722 273369 272880
56526 272880 272905 273603 274822 276240 277146 276840 275706 275162 276009 277497 278537 279218 280490 283022 287117 293164
56510 293164 301123 309741 317196 322729 327267 332380 338920 346612 354708 362939 371743 381450 391450 400675
56496 400675 408874 416859 425409 434473 443633 452804 462015 470781 478072 483007 485687 487275 488886 490295
56482 490295 490385 489080 487708 486648 483877 477531 469089 461962 457086 452081 445093 437248 430369 424110 416936
56467 416936 408775 401288 395990 393050 391355 389021 384424 377589 370194 363872 359146 356088 354700 353911
56453 353911 351494 346149 338915 331568 324489 317317 310883 306956 306177 307421 309185 310662 311589 312001 312364
$$ packed form
56558B65669l856j904J87J459J136m17j490q90O85K012L002L763L385J416n45
56543B73612p27J60J13r13j192l19J74n13j192p00N29J428J620J227M15l53m89
56526B72880K5O98J219J418R06l06j134n44Q47J488J040O81J272K532M095O047
56510B93164P959Q618P455N533M538N113O540P692Q096Q231Q804R707J0000R225
56496D00675Q199P985Q550R064R160R171R211Q766P291M935K680J588J611J409
56482D90295R0j305j372j060k771o346q442p127m876n005o988p845o879o259p174
56467D16936q161p487n298k940j695k334m597o835p395o322m726l058j388p89
56453C53911k417n345p234p347p079p172o434l927p79J244J764J477R27M12L63
$$ plain form
56438 312364 313225 314514 315557 315766 314974 313274 311116 309428 308978 309496 309871 309475 309052 309994 312784 316410
56422 316410 319511 321931 324671 328351 332417 336200 339858 343520 346297 347485 348273 350763 355345 360524
56408 360524 365478 371141 378173 385455 391718 397608 404825 413758 423050 431305 438410 445166 452113 458887
56394 458887 464750 469792 475175 481593 487884 492085 493744 494169 494389 494028 492352 489305 485248 480743 476838
56379 476838 474400 472911 471064 468798 467357 466997 466160 463619 459955 456069 451753 446841 442356 439021 435736
56364 435736 431074 425544 420845 417310 413589 408688 403036 397394 391793 385890 379911 374912 372018 371147
56350 371147 370584 368490 364863 361237 358386 355498 351983 348786 347034 346391 345832 345292 345465 346365 347080 346946
56334 346946 346409 346727 348908 352582 355934 357361 357124 356594 356080 354699 352543 351521 353376 357828 363082
$$ packed form
56438C12364Q61J289J043K09p92j700k158j688m50N18L75l96m23R42K790L626
56422C16410L101K420K740L680M066L783L658L662K777J188P88K490M582N179
56408C60524M954N663P032P282O263N890P217Q933R292Q255P105O756O947O774
56394D58887N863N042N383O418O291M201J659M25K20l61j676l047m057m505l905
56379D76838k438j489j847k266j441l60q37k541l664l886m316m912m485l335l285
56364D35736m662n530m699l535l721m901n652n642n601n903n979m999k894q71
56350C71147n63k094l627l626k851k888l515l197j752o43n59n40J73R00P15j34
56334C46946n37L18K181L674L352J427k37n30n14j381k156j022J855M452N254
$$ plain form
56319 363082 367203 368826 367931 366440 366735 369055 371548 373234 375253 378715 383166 388031 393655 399781 404874
56304 404874 408458 412466 418529 425362 430670 434506 438847 444640 451016 456743 460935 463066 463879 465576
56290 465576 469526 474255 477170 477731 477585 478170 479692 481967 484726 487295 489269 491345 494455 498374 502142
56275 502142 505453 508737 512366 516639 522000 528483 535622 543549 553198 564643 576456 587692 599217
56262 599217 611886 624840 637097 649485 663092 676853 688761 698759 708575 719277 730855 743666
56250 743666 758252 773848 788805 802505 815612 828731 842107 856118 870588 883998 894997
56239 894997 904351 914103 925192 937186 949728 962670 975283 987122 999431 1014065 1031131 1049215
56227 1049215 1067774 1087799 1110136 1134580 1160822 1189203 1220440 1255369 1294683 1338146 1384525
$$ packed form
56319C63082M121J623q95j491K95K320K493J686K019L462M451M865N624O126N093
56304D04874L584M008O063O833N308L836M341N793O376N727M192K131Q13J697
56290D65576L950M729K915N61j46N85J522K275K759K569J974K076L110L919L768
56275E02142L311L284L629M273N361O483P139P927R649J1445J1813J1236J1525
56262E99217J2669J2954J2257J2388J3607J3761J1908R998R816J0702J1578J2811
56250G43666J4586J5596J4957J3700J3107J3119J3376J4011J4470J3410J0999
56239H94997R354R752J1089J1994J2542J2942J2613J1839J2309J4634J7066J8084
56227A049215J8559K0025K2337K4444K6242K8381L1237L4929L9314M3463M6379
$$ plain form
56216 1384525 1433115 1484655 1539992 1598830 1660925 1727442 1799735 1877726 1961023 2050723 2148438
56205 2148438 2254308 2367692 2489286 2620894 2763593 2917649 3083719 3262718 3455067
56196 3455067 3661301 3882491 4118532 4366927 4624756 4890790 5163964 5441010 5717559
56187 5717559 5990262 6255378 6506338 6735558 6938191 7111548 7251354 7351645 7408764 7423209
56177 7423209 7397491 7334505 7238256 7113808 6965684 6797791 6615017 6423128 6226664 6028180
56167 6028180 5829342 5631274 5434106 5237936 5044193 4854657 4669435 4487385 4308040
56158 4308040 4131633 3958003 3787321 3621081 3460302 3303458 3148520 2996536 2850790
56149 2850790 2712827 2581852 2457881 2342700 2237203 2139988 2049176 1964087 1884942 1812398
$$ packed form
56216A384525M8590N1540N5337N8838O2095O6517P2293P7991Q3297Q9700R7715
56205B148438J05870J13384J21594J31608J42699J54056J66070J78999J92349
56196C455067K06234K21190K36041K48395K57829K66034K73174K77046K76549
56187E717559K72703K65116K50960K29220K02633J73357J39806J00291N7119J4445
56177G423209k5718o2986r6249j24448j48124j67893j82774j91889j96464j98484
56167F028180j98838j98068j97168j96170j93743j89536j85222j82050j79345
56158D308040j76407j73630j70682j66240j60779j56844j54938j51984j45746
56149B850790j37963j30975j23971j15181j05497r7215r0812q5089p9145p2544
$$ plain form
56139 1812398 1747163 1688591 1634146 1581870 1532806 1489184 1451059 1416731 1385518 1357675 1332312
56128 1332312 1308025 1285126 1264801 1246612 1229417 1214170 1202927 1195339 1188875 1182337 1176555 1171982
56116 1171982 1168426 1166852 1168435 1171874 1174597 1176724 1181046 1189043 1199658 1211980 1226212 1241845 1257675
56103 1257675 1273771 1290801 1307573 1322246 1335817 1351254 1368922 1385979 1400539 1413370 1425227
56092 1425227 1435635 1444935 1454752 1465941 1478541 1493730 1513119 1536197 1561241 1588419 1618954 1651875
56080 1651875 1685321 1720957 1763303 1814542 1873641 1940549 2017043 2102921 2195308 2292351 2393728
56069 2393728 2496893 2596803 2690350 2777578 2858178 2930828 2996591 3058521 3116597 3166704 3205549
56058 3205549 3232795 3247820 3248906 3237036 3216393 3189708 3156710 3117766 3074534 3025855 2967664
$$ packed form
56139A812398o5235n8572n4445n2276m9064m3622l8125l4328l1213k7843k5363
56128A332312k4287k2899k0325j8189j7195j5247j1243p588o464o538n782m573
56116A171982l556j574J583L439K723K127M322P997J0615J2322J4232J5633J5830
56103A257675J6096J7030J6772J4673J3571J5437J7668J7057J4560J2831J1857
56092A425227J0408R300R817J1189J2600J5189J9389K3078K5044K7178L0535L2921
56080A651875L3446L5636M2346N1239N9099O6908P6494Q5878R2387R7043J01377
56069B393728J03165R9910R3547Q7228Q0600P2650O5763O1930N8076N0107L8845
56058C205549K7246J5025J086j1870k0643k6685l2998l8944m3232m8679n8191
$$ plain form
56047 2967664 2898655 2821933 2740007 2652934 2563008 2476208 2396542 2323215 2255548 2196151 2146674
56036 2146674 2104714 2067801 2036886 2013471 1996775 1985906 1981045 1980212 1978525 1973174 1965990 1959300 1952729
56023 1952729 1945724 1939366 1933826 1927776 1922037 1919872 1922057 1925734 1929740 1936590 1947470 1959815 1971780
56010 1971780 1984552 1998398 2011250 2023275 2037968 2056542 2076084 2095299 2116821 2141652 2166941
55999 2166941 2192015 2221015 2256307 2294402 2331650 2369094 2408778 2450200 2493269 2539679 2588499
55988 2588499 2635648 2680442 2727294 2778349 2830264 2881078 2934101 2991937 3052892 3116343 3185091
55977 3185091 3258968 3332834 3404633 3478840 3558549 3641260 3726128 3817589 3917500 4021426 4127321
55966 4127321 4240021 4362405 4490367 4621892 4762767 4917554 5083393 5258819 5449885
$$ packed form
56047B967664o9009p6722q1926q7073q9926q6800p9666p3327o7667n9397m9477
56036B146674m1960l6913l0915k3415j6696j0869m861q33j687n351p184o690o571
56023A952729p005o358n540o050n739k165K185L677M006O850J0880J2345J1965
56010A971780J2772J3846J2852J2025J4693J8574J9542J9215K1522K4831K5289
55999B166941K5074K9000L5292L8095L7248L7444L9684M1422M3069M6410M8820
55988B588499M7149M4794M6852N1055N1915N0814N3023N7836O0955O3451O8748
55977C185091P3877P3866P1799P4207P9709Q2711Q4868R1461R9911J03926J05895
55966D127321J12700J22384J27962J31525J40875J54787J65839J75426J91066
$$ plain form
55957 5449885 5660447 5884817 6117442 6361703 6621567 6892773 7170414 7457614 7758789
55948 7758789 8072068 8396228 8736968 9097999 9473885 9859961 10261010 10681871 11118387
55939 11118387 11566782 12033223 12524906 13040745 13580463 14153454 14768400 15423093 16114291
55930 16114291 16847844 17629449 18456752 19331897 20270467 21285886 22376140 23537702 24779716
55921 24779716 26111081 27526892 29022687 30609391 32299312 34091643 35988587 38012048
55913 38012048 40187422 42525612 45038494 47755578 50706118 53902439 57362298 61130296
55905 61130296 65257731 69785444 74773065 80322043 86542306 93522933 101366997 110224675
55897 110224675 120254760 131587134 144367200 158805607 175150153 193674080 214758715
$$ packed form
55957E449885K10562K24370K32625K44261K59864K71206K77641K87200L01175
55948G758789L13279L24160L40740L61031L75886L86076M01049M20861M36516
55939A1118387M48395M66441M91683N15839N39718N72991O14946O54693O91198
55930A6114291P33553P81605Q27303Q75145R38570J015419J090254J161562J242014
55921B4779716J331365J415811J495795J586704J689921J792331J896944K023461
55913C8012048K175374K338190K512882K717084K950540L196321L459859L767998
55905F1130296M127435M527713M987621N548978O220263O980627P844064Q857678
55897A10224675J0030085J1332374J2780066J4438407J6344546J8523927K1084635
$$ plain form
55890 214758715 238913706 266615805 298186225 333857893 373577613 416034894 457521686
55883 457521686 492147154 513998001 519795992 509966475 487615461 456726515 420958684
55876 420958684 383257189 345797434 310007064 276698000 246256055 218768873 194117654
55869 194117654 172108255 152580239 135402506 120413512 107414993 96203385 86567544
55862 86567544 78274478 71099121 64864520 59431592 54667793 50454482 46710400 43378040
55854 43378040 40394597 37698149 35250073 33026256 30993564 29115699 27373951 25762070
55846 25762070 24267743 22876961 21588416 20404803 19315666 18304638 17366431 16500848
55838 16500848 15697144 14940505 14228043 13563251 12940329 12348716 11787653 11261852 10767618
$$ packed form
55890B14758715K4154991K7702099L1570420L5671668L9719720M2457281M1486792
55883D57521686L4625468K1850847N797991r829517k2351014l0888946l5767831
55876D20958684l7701495l7459755l5790370l3309064l0441945k7487182k4651219
55869A94117654k2009399j9528016j7177733j4988994j2998519j1211608r635841
55862H6567544q293066p175357o234601n432928m763799m213311l744082l332360
55854D3378040k983443k696448k448076k223817k032692j877865j741748j611881
55846B5762070j494327j390782j288545j183613j089137j011028r38207q65583
55838A6500848q03704p56639p12462o64792o22922n91613n61063n25801m94234
$$ plain form
55829 10767618 10296960 9850744 9434228 9043650 8670113 8312881 7976426 7658117 7351223
55820 7351223 7056848 6781017 6522657 6275637 6039994 5820184 5614636 5417467 5228447
55811 5228447 5051329 4884477 4722713 4566473 4420004 4282304 4148377 4017377 3891372
55802 3891372 3768524 3645712 3525532 3412706 3306122 3202364 3103999 3015671 2934311 2851908
55792 2851908 2766366 2681648 2599008 2516140 2433535 2354060 2277565 2202870 2133159 2072196 2017114
55781 2017114 1962210 1908033 1859535 1817309 1778317 1743487 1716537 1696248 1677396 1658631 1642390
55770 1642390 1627949 1611648 1593236 1574947 1554927 1528716 1497097 1465697 1436621 1406703 1374028
55759 1374028 1340169 1305914 1270534 1235433 1203193 1173181 1143120 1114301 1089979 1069413 1049053
$$ packed form
55829A0767618m70658m46216m16516l90578l73537l57232l36455l18309l06894
55820G351223k94375k75831k58360k47020k35643k19810k05548j97169j89020
55811E228447j77118j66852j61764j56240j46469j37700j33927j31000j26005
55802C891372j22848j22812j20180j12826j06584j03758r8365q8328q1360q2403
55792B851908q5542q4718q2640q2868q2605p9475p6495p4695o9711o0963n5082
55781B017114n4904n4177m8498m2226l8992l4830k6950k0289j8852j8765j6241
55770A642390j4441j6301j8412j8289k0020k6211l1619l1400k9076k9918l2675
55759A374028l3859l4255l5380l5101l2240l0012l0061k8819k4322k0566k0360
$$ plain form
55748 1049053 1028868 1011879 998048 984412 970859 960122 952236 944552 937172 932907 931859 931159 930011
55735 930011 929880 929927 927433 922697 918529 914946 909317 901510 893769 885652 874358 860248 846862 835135
55721 835135 822525 808336 795082 784121 774464 766308 761087 757389 751169 740776 728045 714262
55709 714262 699053 683268 668878 655818 642708 630437 621009 613193 603636 592166 581711 573149
55697 573149 564542 555285 546550 537599 526129 512487 499454 487911 476879 467431 461968 459662 457180
55684 457180 453856 451596 449935 446135 440335 435558 432349 428373 423601 420662 419351 416086 409874 403828
55670 403828 399660 395545 390627 386707 384037 380274 375086 371077 368605 364384 356942 348750 341127 331947
55656 331947 320709 311135 305783 302130 297064 291790 289356 290233 292943 296383 299351 300477 300733 303499
$$ packed form
55748A049053k0185j6989j3831j3636j3553j0737p886p684p380m265j048p00j148
55735I30011j31M7k494m736m168l583n629p807p741q117j1294j4110j3386j1727
55721H35135j2610j4189j3254j0961r657q156n221l698o220j0393j2731j3783
55709G14262j5209j5785j4390j3060j3110j2271r428p816r557j1470j0455q562
55697E73149q607r257q735q951j1470j3642j3033j1543j1032r448n463k306k482
55684D57180l324k260j661l800n800m777l209l976m772k939j311l265o212o046
55670D03828m168m115m918l920k670l763n188m009k472m221p442q192p623r180
55656C31947j1238r574n352l653n066n274k434Q77K710L440K968J126K56K766
$$ plain form
55642 303499 310199 318194 324374 328186 329935 329306 327298 326666 328515 330839 331720 331496 330858 329901 330108 333861
55626 333861 340586 346708 350793 355258 361431 366747 369052 370039 371846 373404 373004 371729 371422 371398 369835
55611 369835 366751 363402 360253 357290 354795 352464 349418 346018 343687 342364 340691 339216 340147 343008
55597 343008 344183 342299 340312 340341 340292 338216 336376 337719 341174 343702 344642 344824 343630 340277 336309 333613
55581 333613 331159 326434 318972 310024 300028 288848 277464 267085 257359 247289 237050 227333 218068
55568 218068 209322 202204 197431 194199 191622 189669 187608 183640 177639 172203 169219 167389 164931 162548
55554 162548 161582 161248 160146 158803 158328 158037 156765 155236 154853 155290 155365 155164 155268 154984 153249 150237 146394
55537 146394 141385 135868 132645 133642 136834 138425 137149 134465 131698 129233 127614 127049 126354 124340 121713
$$ packed form
55642C03499O700P995O180L812J749o29k008o32J849K324Q81k24o38r57K07L753
55626C33861O725O122M085M465O173N316K305R87J807J558m00j275l07k4j563
55611C69835l084l349l149k963k495k331l046l400k331j323j673j475R31K861
55597C43008J175j884j987K9m9k076j840J343L455K528R40J82j194l353l968k696
55581C33613k454m725p462q948r996j1180j1384j0379r726j0070j0239r717r265
55568B18068q746p118m773l232k577j953k061l968o001n436k984j830k458k383
55554A62548r66l34j102j343m75k91j272j529l83M37P5k01J04k84j735l012l843
55537A46394n009n517l223R97L192J591j276k684k767k465j619n65o95k014k627
$$ plain form
55522 121713 119912 118837 117396 115450 113483 111210 108347 105932 105081 105158 104883 104449 104814 105710 106193 106437
55506 106437 107201 108194 108750 109424 111097 113096 114078 114249 114793 115442 114650 112233 110092 109908 111300 112495 112026
55489 112026 109788 107121 105691 105873 106590 106976 107247 107546 107240 106194 105510 105996 107085 108220 109973 112563
55473 112563 114631 115023 114734 115533 117450 119225 120666 123139 127886 134599 141317 145521 146346 146058 147927
55458 147927 152149 155588 156075 154758 153154 150508 146094 141968 140769 141963 142602 140941 137327 132463 126842
55443 126842 121252 116060 110600 104588 99174 95130 91234 86167 80826 76949 74578 72781 71676 71645 71562
55428 71562 69947 67100 64098 60634 55997 51216 47912 45807 43745 42375 43169 45249 45957 44522 42627
55413 42627 41250 39506 37020 35086 34730 35431 36382 37414 38163 37882 36603 35193 33915 32205 30138 28774
$$ packed form
55522A21713j801j075j441j946j967k273k863k415q51P7k75m34L65Q96M83K44
55506A06437P64R93N56O74J673J999R82J71N44O49p92k417k141j84J392J195m69
55489A12026k238k667j430J82P17L86K71K99l06j046o84M86J089J135J753K590
55473A12563K068L92k89P99J917J775J441K473M747O713O718M204Q25k88J869
55458A47927M222L439M87j317j604k646m414m126j199J194O39j661l614m864n621
55443A26842n590n192n460o012n414m044l896n067n341l877k371j797j105l1q3
55428G1562j615k847l002l464m637m781l304k105k062j370P94K080P08j435j895
55413D2627j377j744k486j934l56P01R51J032P49k81j279j410j278j710k067j364
$$ plain form
55397 28774 28649 29104 29485 30014 31131 32764 34519 35926 36517 36257 35773 35643 35723 35602 35141 34051 31865
55380 31865 29081 27397 27794 29338 30858 32660 35332 38029 39550 40175 40851 41471 41617 42029 43386 44373
55364 44373 43025 39631 36391 34521 33492 32810 32717 33201 33844 34531 35026 34407 32446 30867 31453 33465 34805
55347 34805 35093 35560 36400 36702 36860 38535 41807 44572 45432 45349 45714 46343 46162 44737 42506 40304 38846
55330 38846 38017 36883 35150 33888 33692 33042 30198 26052 23204 22645 23278 24276 25680 26837 26548 25032
55314 25032 23769 23197 22567 22217 23736 27287 30812 32736 33768 35211 36959 37995 37710 36150 33899
55299 33899 31962 30753 29315 26809 24490 24509 26894 29516 31017 31730 31665 30013 27329 25862 26523 27379
55283 27379 26443 24432 23470 24257 25759 26916 27573 28227 29431 31005 31771 30783 28717 27017 25944 24797
$$ packed form
55397B8774j25M55L81N29J117J633J755J407N91k60m84j30Q0j21m61j090k186
55380C1865k784j684L97J544J520J802K672K697J521O25O76O20J46M12J357R87
55364D4373j348l394l240j870j029o82r3M84O43O87M95o19j961j579N86K012J340
55347C4805K88M67Q40L02J58J675L272K765Q60q3L65O29j81j425k231k202j458
55330C8846q29j134j733j262j96o50k844m146k848n59O33R98J404J157k89j516
55314B5032j263n72o30l50J519L551L525J924J032J443J748J036k85j560k251
55299C3899j937j209j438k506k319J9K385K622J501P13o5j652k684j467O61Q56
55283B7379r36k011r62P87J502J157O57O54J204J574P66r88k066j700j073j147
$$ plain form
55267 24797 23730 23498 23488 22233 20342 20681 24538 29444 32044 31725 30210 28859 27764 26726 25927 25898
55251 25898 27240 29863 32387 33223 32365 31116 30187 29435 29415 31201 34216 36119 35618 33712 31369 27852
55235 27852 22543 16823 12679 10691 10652 12922 17606 23194 27486 29499 29628 28656 27524 27278 28133 28993
55219 28993 28702 27310 25513 23581 21609 20162 19842 20605 22006 23623 24892 25237 24819 24444 24316 23690
55203 23690 22124 20308 19306 19809 22316 26732 31378 33843 33745 33426 34999 37770 39685 40184 40236 40295 39743
55186 39743 38200 36152 34209 32484 30854 29383 28454 28582 29742 30901 30806 29429 27996 27469 27641 27864
55170 27864 27768 27061 25555 23750 22562 22155 21859 21417 21355 21842 22326 22636 23316 24405 25060 24933 24826 25423
55152 25423 26540 28144 30758 34031 36214 36100 34484 32820 31518 30522 30386 31391 32450 32258 30969
$$ packed form
55267B4797j067k32j0j255j891L39L857M906K600l19j515j351j095j038p99k9
55251B5898J342K623K524Q36q58j249r29p52k0J786L015J903n01j906k343l517
55235B7852n309n720m144j988l9K270M684N588M292K013J29r72j132k46Q55Q60
55219B8993k91j392j797j932j972j447l20P63J401J617J269L45m18l75j28o26
55203B3690j566j816j002N03K507M416M646K465r8l19J573K771J915M99N2N9n52
55186C9743j543k048j943j725j630j471r29J28J160J159r5j377j433n27J72K23
55170B7864r6p07j506j805j188m07k96m42o2M87M84L10O80J089O55j27j07N97
55152B5423J117J604K614L273K183j14j616j664j302r96j36J005J059j92j289
$$ plain form
55137 30969 29654 28772 28389 29235 32029 35955 39091 40429 40545 40280 39716 38611 37150 35897 35250 35018
55121 35018 34523 33325 31929 31466 32569 34800 37007 37793 36038 31989 27824 26033 27004 29127 31250
55106 31250 33667 36403 38131 37752 35867 33772 31914 30230 29098 28976 29735 31078 32946 34802 35385
55091 35385 34057 31778 30027 29312 29335 29853 30584 30831 30061 28574 27231 26846 27836 29673 30774 30113 29056
55074 29056 30072 33222 35662 35408 33849 33379 34183 34928 35309 36046 37153 37855 37800 37124 35965 35127 36399
55057 36399 40636 46014 49586 50279 49207 47631 46113 45289 45871 47680 49757 51517 53072 54601 56186
55042 56186 57907 59452 60131 60064 60585 62425 64197 64010 62206 61176 62691 66449 70891 74266 75306 74217
55026 74217 72878 72908 73720 73679 72821 72831 74360 76046 76726 77129 78558 80939 83192 84879 86476 88140 89063
$$ packed form
55137C0969j315q82l83Q46K794L926L136J338J16k65n64j105j461j253o47k32
55121C5018m95j198j396m63J103K231K207P86j755m049m165j791R71K123K123
55106C1250K417K736J728l79j885k095j858j684j132j22P59J343J868J856N83
55091C5385j328k279j751p15K3N18P31K47p70j487j343l85R90J837J101o61j057
55074B9056J016L150K440k54j559m70Q04P45L81P37J107P02n5o76j159q38J272
55057C6399M237N378L572O93j072j576j518q24N82J809K077J760J555J529J585
55042E6186J721J545O79o7N21J840J772j87j804j030J515L758M442L375J040j089
55026G4217j339L0Q12m1q58J0J529J686O80M03J429K381K253J687J597J664R23
$$ plain form
55009 89063 88395 86477 84603 83460 82339 80464 78610 78243 79063 78825 76162 72353 69359 67210 64576
54994 64576 61105 57837 55703 54832 55105 56236 57345 57437 56401 54979 53877 53348 53240 52933 51808 50381
54978 50381 50254 52069 54262 54862 53938 53136 53386 54379 55898 58224 61226 64214 66742 68628 69366 68580
54962 68580 67037 66163 66470 67314 68153 69139 70455 71935 73423 74807 75761 76127 76364 76860 77080 76356 75305
54945 75305 75341 76725 78134 78420 77947 77840 78533 79511 80167 80619 81626 83572 85694 86891 87282 87969 88889
54928 88889 88192 84708 80022 76841 76009 76395 77032 77837 78689 79416 80631 83111 86232 88320 88745 88541 88808
54911 88808 89592 90499 91380 92144 92749 93549 94836 96079 96485 96324 96709 98062 99816 101762 104643 109011 114277
54894 114277 119261 123318 126921 131567 138785 148441 158354 166488 173375 181416 192057 204791 218755
$$ packed form
55009H9063o68j918j874j143j121j875j854l67Q20k38k663l809k994k149k634
54994F4576l471l268k134q71K73J131J109R2j036j422j102n29j08l07j125j427
54978E0381j27J815K193O00r24q02K50R93J519K326L002K988K528J886P38p86
54962F8580j543q74L07Q44Q39R86J316J480J488J384R54L66K37M96K20p24j051
54945G5305L6J384J409K86m73j07O93R78O56M52J007J946K122J197L91O87R20
54928H8889o97l484m686l181q32L86O37Q05Q52P27J215K480L121K088M25k04K67
54911H8808P84R07Q81P64O05Q00J287J243M06j61L85J353J754J946K881M368N266
54894A14277M984M057L603M646P218R656R913Q134O887Q041J0641J2734J3964
$$ plain form
54881 218755 233856 249974 266177 281189 293876 303080 307931 308644 306107 300368 290480 276385 260191
54868 260191 244836 231742 220199 208847 197357 186589 177266 168937 160765 153163 147550 144152 141336
54855 141336 137976 135327 135217 137270 139515 141161 143074 145842 149231 153566 159815 167946 176774 185951
54841 185951 196621 209386 222876 235164 245673 254974 263451 270865 276661 280107 280549 277952 272906
54828 272906 265943 257086 246054 232650 217231 201188 186475 174007 163029 152792 144055 137761
54816 137761 132963 127687 121551 115922 111594 107995 104773 102391 100788 99070 97000 95377 94510 93827 93472
54801 93472 94620 97410 100091 101203 101279 101325 100900 98992 95920 92930 90400 87600 84036 80242 77291 75989
54785 75989 76157 76440 75375 73072 71249 71143 71999 72164 71086 69637 68899 69276 70625 72692 75168 77355
$$ packed form
54881B18755J5101J6118J6203J5012J2687R204M851P13k537n739r888j4095j6194
54868B60191j5355j3094j1543j1352j1490j0768r323q329q172p602n613l398k816
54855A41336l360k649j10K053K245J646J913K768L389M335O249Q131Q828R177
54841A85951J0670J2765J3490J2288J0509R301Q477P414N796L446M42k597n046
54828B72906o963q857j1032j3404j5419j6043j4713j2468j0978j0237q737o294
54816A37761m798n276o136n629m328l599l222k382j603j718k070j623q67o83l55
54801I3472J148K790K681J112P6M6m25j908l072k990k530k800l564l794k951j302
54785G5989J68K83j065k303j823j06Q56J65j078j449p38L77J349K067K476K187
$$ plain form
54769 77355 78057 76481 73551 71472 71211 71233 69885 68163 68442 70991 73849 76119 79077 83458 87870 91069
54753 91069 93947 97786 102031 105291 107504 109494 111106 111303 109843 107815 106797 108164 112596 119380 126696
54738 126696 133442 140359 148620 158045 167601 177063 187012 197492 207843 217969 228884 241741 256645
54725 256645 272448 287364 299883 309400 316068 320109 321432 319786 314996 307287 297828 288523 280411
54712 280411 272590 263691 254080 245365 237933 230676 223285 217020 212641 209299 206336 204496 204234 204358 203865
54697 203865 203916 206314 210822 215512 219220 222265 225294 228975 234555 243253 254929 268345 282637 297618
54683 297618 312843 327541 341570 355388 368785 380386 388796 393704 395619 394870 391128 383783 372663
54670 372663 358468 342544 326256 310505 295479 280564 264974 249091 234845 223955 216107 209822
$$ packed form
54769G7355P02j576k930k079k61K2j348j722K79K549K858K270K958M381M412L199
54753I1069K878L839M245L260K213J990J612J97j460k028j018J367M432O784P316
54738A26696O746O917Q261R425R556R462R949J0480J0351J0126J0915J2857J4904
54725B56645J5803J4916J2519R517O668M041J323j646m790p709r459r305q112
54712B80411p821q899r611q715p432p257p391o265m379l342k963j840k62J24m93
54697B03865N1K398M508M690L708L045L029L681N580Q698J1676J3416J4292J4981
54683B97618J5225J4698J4029J3818J3397J1601Q410M908J915p49l742p345j1120
54670C72663j4195j5924j6288j5751j5026j4915j5590j5883j4246j0890p848o285
$$ plain form
54658 209822 204636 200925 197737 192876 185831 178909 174386 171889 169697 167348 165553 164397 163137 161449
54644 161449 159769 158585 158064 158024 157859 157189 156885 158379 161306 163161 162277 159936 158308 157479 156121 154166
54628 154166 152926 152975 153670 154726 156634 159268 161366 161835 160877 159670 159535 161326 164949 169466 174066 178634
54612 178634 182997 186365 188323 189909 192788 197570 203528 209509 214567 218290 221213 224348 227768 230486
54598 230486 232436 235444 241086 248529 255711 261711 266556 269671 270520 270248 270712 271942 272441 272000 272317 274326
54582 274326 276665 277618 277349 277385 278796 281603 285357 289612 294146 299049 304505 310614 317709 326435 336797
54567 336797 347469 356839 364544 371221 376957 380834 381833 379463 373715 365250 355404 345153 334241 322112
54553 322112 309398 297689 288182 281342 277283 275340 273829 271557 269192 267898 267142 265491 263132 261567
$$ packed form
54658B09822n186l711l188m861p045o922m523k497k192k349j795j156j260j688
54644A61449j680j184n21m0j65o70l04J494K927J855q84k341j628q29j358j955
54628A54166j240M9O95J056J908K634K098M69r58j207j35J791L623M517M600M568
54612A78634M363L368J958J586K879M782N958N981N058L723K923L135L420K718
54598B30486J950L008N642P443P182O000M845L115Q49k72M64J230M99m41L17K009
54582B74326K339R53k69L6J411K807L754M255M534M903N456O109P095Q726J0362
54567C36797J0672R370P705O677N736L877R99k370n748q465r846j0251j0912j2129
54553C22112j2714j1709r507o840m059j943j511k272k365j294p56j651k359j565
$$ plain form
54539 261567 260835 259179 255844 252153 248991 245264 240102 234913 231558 229504 226478 221455 215591 210344
54525 210344 205867 201293 195784 189095 181740 174799 169270 165451 162929 160973 158873 156144 152643 148466
54511 148466 143811 139050 134800 131650 129938 129858 131307 133230 133697 131455 127260 123098 120297 118885 118370
54496 118370 118218 117807 116778 115504 114633 114368 114658 115522 116319 115391 111884 107702 106229 108874 113983 119116
54480 119116 123104 125716 126836 126743 126262 125916 125521 124920 124464 124506 125115 126415 128538 131187 134090 137768 142882
54463 142882 148786 153948 158023 162292 167712 173687 179101 183336 185783 185726 183591 181158 179526 177719 174228
54448 174228 169223 164211 160061 156295 152086 147213 142253 138296 136201 135660 135339 134232 132506 130811 129342
54433 129342 127861 126089 123734 120750 117832 115951 115061 113965 111920 109653 108344 108237 108715 109082 108855
$$ packed form
54539B61567p32j656l335l691l162l727n162n189l355k054l026n023n864n247
54525B10344m477m574n509o689p355o941n529l819k522j956k100k729l501m177
54511A48466m655m761m250l150j712q0J449J923M67k242m195m162k801j412n15
54496A18370j52m11j029j274q71k65K90Q64P97r28l507m182j473K645N109N133
54480A19116L988K612J120r3m81l46l95o01m56M2O09J300K123K649K903L678N114
54463A42882N904N162M075M269N420N975N414M235K447n7k135k433j632j807l491
54448A74228n005n012m150l766m209m873m960l957k095n41l21j107j726j695j469
54433A29342j481j772k355k984k918j881q90j096k045k267j309j07M78L67k27
$$ plain form
54418 108855 108076 107881 109889 114189 118519 120324 119337 117480 116626 117182 118554 120213 122174 124719 127699
54403 127699 130157 131066 130469 129313 128150 126786 125390 124908 125732 126879 127309 127400 128169 129477 130032 129159 127811
54386 127811 127654 129491 132538 135048 135708 134537 132363 129732 126885 124472 123240 122797 121739 119447 116902
54371 116902 115226 114241 113088 111420 109401 107367 106223 107270 110663 114749 117841 119978 121916 123152
54357 123152 122438 120047 118134 118608 121511 125534 129143 131093 130933 129571 128886 130330 134062 139314 145199
54342 145199 151149 157089 163300 169802 175800 180096 182207 183082 184766 189200 196780 205690 213202 218223
54328 218223 222365 227982 235383 242578 247613 250409 252117 253273 253110 250546 245556 239406 233591 228695
54314 228695 224375 220192 216063 212048 208177 204494 200824 196584 191425 186026 181506 178008 174752 171649
$$ packed form
54418A08855p79j95K008M300M330J805r87j857q54N56J372J659J961K545K980
54403A27699K458R09n97j156j163j364j396m82Q24J147M30R1P69J308N55q73j348
54386A27811j57J837L047K510O60j171k174k631k847k413j232m43j058k292k545
54371A16902j676r85j153j668k019k034j144J047L393M086L092K137J938J236
54357A23152p14k391j913M74K903M023L609J950j60j362o85J444L732N252N885
54342A45199N950N940O211O502N998M296K111Q75J684M434P580Q910P512N021
54328B18223M142N617P401P195N035K796J708J156j63k564m990o150n815m896
54314B28695m320m183m129m015l871l683l670m240n159n399m520l498l256l103
$$ plain form
54300 171649 169761 169585 169899 169099 166955 164245 161463 158878 157291 157503 159184 161132 162503 163103 162869 162101
54284 162101 161973 163738 167227 170985 173958 176300 178499 180740 183462 187641 193798 201142 208202 214165
54270 214165 219151 223370 226469 227910 227780 226860 225807 224519 222593 220168 217786 215475 212565 208556 203620
54255 203620 198127 192364 186925 182501 178816 174567 169084 163283 158267 153728 148729 143467 139036 135747
54241 135747 132844 129714 126253 122071 116671 110682 105812 103001 101437 99859 98052 96536 95513 94889
54227 94889 94864 95721 97224 98887 100655 102620 104081 103695 101040 97437 94596 92731 90786 88446 86866
54212 86866 87012 88218 89287 90255 91889 93955 95482 96621 98535 101165 102846 102877 102834 104185 106072 106911
54196 106911 106939 107347 107783 106731 104070 101336 99437 97872 96327 95396 95265 95202 94851 94816 95448 96252 96937 97824
$$ packed form
54300A71649j888j76L14q00k144k710k782k585j587K12J681J948J371O00k34p68
54284A62101j28J765L489L758K973K342K199K241K722M179O157P344P060N963
54270B14165M986M219L099J441j30r20j053j288j926k425k382k311k910m009m936
54255B03620n493n763n439m424l685m249n483n801n016m539m999n262m431l289
54241A35747k903l130l461m182n400n989m870k811j564j578j807j516j023o24
54227I4889k5Q57J503J663J768J965J461l86k655l603k841j865j945k340j580
54212H6866J46J206J069R68J634K066J527J139J914K630J681L1m3J351J887Q39
54196A06911K8M08M36j052k661k734j899j565j545r31j31o3l51l5O32Q04O85Q87
$$ plain form
54178 97824 98736 98852 98409 99208 102384 106596 109504 110288 109837 109238 109110 109730 110682 110789 109360 107112 105079
54161 105079 103242 101232 99661 99355 99698 99225 97757 96533 96231 96415 97133 99297 102820 105902 107240 107757
54145 107757 109011 110974 112699 114263 116371 118560 119582 119475 119578 120222 120022 118076 115474 113829 113486
54130 113486 114022 115300 116776 116730 113818 108989 104521 101358 98726 96216 94729 95035 96692 98888 101277
54115 101277 103447 104611 104630 104518 105131 105950 105926 104934 103557 101913 99676 97157 95458 95328 96391 97635
54099 97635 98344 98530 98809 99845 101638 103311 103782 102659 100422 97954 96016 94878 94162 93234 91957 90914
54083 90914 90671 91053 91360 91144 90555 90095 90115 90330 89810 87879 85169 83304 83278 84639 86526 88833 91754
54066 91754 94706 96590 97053 96911 97327 98928 101512 104048 105086 103810 100909 98034 96252 95265 94173
$$ packed form
54178I7824R12J16m43P99L176M212K908P84m51n99j28O20R52J07j429k248k033
54161A05079j837k010j571l06L43m73j468j224l02J84P18K164L523L082J338N17
54145A07757J254J963J725J564K108K189J022j07J03O44k00j946k602j645l43
54130A13486N36J278J476m6k912m829m468l163k632k510j487L06J657K196K389
54115A01277K170J164J9j12O13Q19k4r92j377j644k237k519j699j30J063J244
54099I7635P09J86K79J036J793J673M71j123k237k468j938j138p16r28j277j043
54083I0914k43L82L07k16n89m60K0K15n20j931k710j865k6J361J887K307K921
54066I1754K952J884M63j42M16J601K584K536J038j276k901k875j782r87j092
$$ plain form
54051 94173 92730 91687 91928 93315 94525 94253 92465 90173 88111 86263 84720 84172 85019 86577 87902
54036 87902 89045 90823 93486 96183 97829 98166 97928 98169 99272 100493 100664 99484 97894 97067 97343 98168
54020 98168 98531 97433 94621 91327 89596 90325 92375 94076 95084 96196 97822 99386 100060 99621 98646 98066
54004 98066 98262 98550 98189 97884 99252 102349 104901 104844 102671 100356 98985 98721 100138 103758 108517 112405
53988 112405 114802 116894 119628 122521 124901 127169 130194 134178 138600 142906 147042 151576 157215 163771
53974 163771 169892 174427 177819 181505 186314 192251 199372 207631 215997 223072 228846 234780 241905 249790
53960 249790 257626 265222 272573 279393 285589 291362 296403 299819 301441 302466 304111 306041 306770 305392
53946 305392 302483 299523 297739 297399 297972 298883 299930 300883 301188 300567 299508 298562 297540 296136 294888 294440
$$ packed form
54051I4173j443j043K41J387J210k72j788k292k062j848j543n48Q47J558J325
54036H7902J143J778K663K697J646L37k38K41J103J221J71j180j590q27K76Q25
54020I8168L63j098k812l294j731P29K050J701J008J112J626J564O74m39r75n80
54004I8066J96K88l61l05J368L097K552n7k173k315j371k64J417L620M759L888
53988A12405K397K092K734K893K380K268L025L984M422M306M136M534N639O556
53974A63771O121M535L392L686M809N937P121Q259Q366P075N774N934P125P885
53960B49790P836P596P351O820O196N773N041L416J622J025J645J930P29j378
53946C05392k909k960j784l40N73R11J047R53L05o21j059r46j022j404j248m48
$$ plain form
53930 294440 294076 292119 287793 281708 274603 266951 259835 254711 251623 248791 244684 239563 234444 229581
53916 229581 224851 220727 217805 215891 214426 213445 213187 213063 211947 209602 207232 206445 207999 211531 216058
53901 216058 220467 223693 224979 224493 223602 223749 224701 224626 222566 220084 219495 221089 223439 226126 230420 237000
53885 237000 244487 250949 255861 259949 264055 268729 274192 280031 285568 290922 297010 304083 311188 317619
53871 317619 324138 331975 341199 350702 359442 367190 374376 381499 388316 393544 395988 396055 395390 394814 393597
53856 393597 391193 388690 387813 389103 391697 394390 396453 397966 399829 403025 407483 412063 415831 418849
53842 418849 421740 425091 429224 433630 436726 437263 436012 434846 434139 432604 429841 427158 425223 422753 418501
53827 418501 412890 406638 399491 391655 384755 379566 374174 366302 356447 346849 338345 330264 322662 316399
$$ packed form
53930B94440l64j957m326o085p105p652p116n124l088k832m107n121n119m863
53916B29581m730m124k922j914j465r81k58j24j116k345k370p87J554L532M527
53901B16058M409L226J286m86q91J47R52p5k060k482n89J594K350K687M294O580
53885B37000P487O462M912M088M106M674N463N839N537N354O088P073P105O431
53871C17619O519P837R224R503Q740P748P186P123O817N228K444O7o65n76j217
53856C93597k404k503q77J290K594K693K063J513J863L196M458M580L768L018
53842D18849K891L351M133M406L096N37j251j166p07j535k763k683j935k470m252
53827D18501n611o252p147p836o900n189n392p872r855r598q504q081p602o263
$$ plain form
53813 316399 311164 305448 298521 290919 283182 275758 269956 267098 266511 265907 263934 260909 257026 251614 244596
53798 244596 237169 230324 223843 217220 210529 204027 197865 192539 188585 185598 182635 179910 178786 179564
53784 179564 180479 179707 177570 175913 175857 176781 177060 175393 171843 168011 165756 165360 165327 164167 161998 160166
53768 160166 159679 160250 160657 160038 158897 158566 159362 159938 159130 157846 158004 159926 162046 163207 163967 165387 167506
53751 167506 169463 170444 170416 170548 172728 177683 183677 188169 190825 193717 198456 204518 210678 216684 222782
53736 222782 228731 234112 238850 242853 245951 248754 252698 258524 265275 271252 275462 277907 279262 280533
53722 280533 282198 283518 283626 283282 284181 286260 287382 286303 284279 282859 281781 280304 278954 278263 277146
53707 277146 274485 271304 269376 268417 266687 263814 260780 257427 252394 245850 240074 236610 234690 233167
$$ packed form
53813C16399n235n716o927p602p737p424n802k858n87o04j973l025l883n412p018
53798B44596p427o845o481o623o691o502o162n326l954k987k963k725j124P78
53784A79564R15p72k137j657n6R24K79j667l550l832k255l96l3j160k169j832
53768A60166m87N71M07o19j141l31P96N76q08j284J58J922K120J161P60J420K119
53751A67506J957R81k8J32K180M955N994M492K656K892M739O062O160O006O098
53736B22782N949N381M738M003L098K803L944N826O751N977M210K445J355J271
53722B80533J665J320J08l44Q99K079J122j079k024j420j078j477j350o91j117
53707B77146k661l181j928r59j730k873l034l353n033o544n776l464j920j523
$$ plain form
53693 233167 232230 232252 232596 232853 233813 235759 236883 235138 231082 227168 224416 221475 217262 213024 210864 211141
53677 211141 212395 213503 214831 217058 219695 221526 222278 223134 225329 228747 232210 234743 236104 236424 236111
53662 236111 236188 238064 242555 249209 256602 263161 267906 270909 273134 275542 278299 281031 283548 285812 287402
53647 287402 287852 287584 287644 288281 288653 288360 288334 289420 290807 290967 289857 289101 289909 291747 293295 293917 293803 293288
53629 293288 292659 292376 292940 294516 296906 299741 302537 304691 305728 305659 305001 304452 304497 305151 306064 307048 308489
53612 308489 310880 313840 316028 316546 316246 317082 320049 324226 328056 331024 333571 335741 336838 336666 336317
53597 336317 336960 338179 338361 336733 334272 332377 331337 330551 329582 328234 326113 323024 319602 316674 314130
53582 314130 311374 308842 307819 308422 309042 308535 307848 308472 310226 311905 313486 316095 319881 323484 325933
$$ packed form
53693B33167r37K2L44K57R60J946J124j745m056l914k752k941m213m238k160K77
53677B11141J254J108J328K227K637J831P52Q56K195L418L463K533J361L20l13
53662B36111P7J876M491O654P393O559M745L003K225K408K757K732K517K264J590
53647B87402M50k68O0O37L72k93k6J086J387J60j110p56Q08J838J548O22j14n15
53629B93288o29k83N64J576K390K835K796K154J037o9o58n49M5O54R13R84J441
53612C08489K391K960K188N18l00Q36K967M177L830K968K547K170J097j72l49
53597C36317O43J219J82j628k461j895j040p86r69j348k121l089l422k928k544
53582C14130k756k532j023O03O20n07o87O24J754J679J581K609L786L603K449
$$ plain form
53567 325933 327936 330772 334801 339432 343722 346619 347500 346960 346379 346409 346716 347561 350384 355885 362522 368141
53551 368141 372491 376916 382012 387052 391702 396896 403411 410545 416817 421519 425132 428660 432977 438592
53537 438592 445595 453632 461863 469149 474814 479622 485400 492984 500803 506441 509468 511767 515036 519122
53523 519122 523207 527299 531526 534776 535509 533800 531490 530137 529667 529279 528841 528880 529756 531508 534160 537485
53507 537485 540555 542183 542010 540813 539595 538802 538650 539678 542369 546230 549884 552278 553654 555162 557635
53492 557635 560810 563701 565745 567638 570881 576358 583529 591219 598856 606490 614012 621168 628304 636207
53478 636207 644908 653427 661155 668752 677087 685959 694653 703365 713048 723946 735171 745997 756880
53465 756880 768779 781882 795538 809414 824271 841262 860498 880677 900379 919443 938679
$$ packed form
53567C25933K003K836M029M631M290K897Q81n40n81L0L07Q45K823N501O637N619
53551C68141M350M425N096N040M650N194O515P134O272M702L613L528M317N615
53537D38592P003Q037Q231P286N665M808N778P584P819N638L027K299L269M086
53523E19122M085M092M227L250P33j709k310j353m70l88m38L9Q76J752K652L325
53507E37485L070J628j73j197j218p93j52J028K691L861L654K394J376J508K473
53492E57635L175K891K044J893L243N477P171P690P637P634P522P156P136P903
53478F36207Q701Q519P728P597Q335Q872Q694Q712R683J0898J1225J0826J0883
53465G56880J1899J3103J3656J3876J4857J6991J9236K0179J9702J9064J9236
$$ plain form
53454 938679 958542 978794 999366 1020645 1042737 1065374 1088905 1114441 1142431 1171955 1202111
53443 1202111 1233165 1265409 1297797 1329094 1359806 1391604 1425154 1459887 1495620 1532675 1570236
53432 1570236 1606355 1640383 1674168 1709968 1748020 1786803 1824833 1861406 1896351 1929870 1962283
53421 1962283 1993417 2022840 2051141 2080122 2110934 2142576 2173043 2201337 2227608 2252061 2275006
53410 2275006 2297568 2320855 2344252 2365752 2384237 2400340 2414667 2426533 2435328 2442076 2448271 2453609
53398 2453609 2456173 2454826 2450151 2442810 2432314 2418178 2401263 2383019 2364039 2344425 2324947 2306388
53386 2306388 2287822 2267037 2243114 2217397 2191451 2165258 2138205 2110788 2084189 2058803 2034171
53375 2034171 2009889 1985692 1961234 1936801 1913712 1892923 1873691 1854890 1837240 1822779 1812295
$$ packed form
53454I38679J9863K0252K0572K1279K2092K2637K3531K5536K7990K9524L0156
53443A202111L1054L2244L2388L1297L0712L1798L3550L4733L5733L7055L7561
53432A570236L6119L4028L3785L5800L8052L8783L8030L6573L4945L3519L2413
53421A962283L1134K9423K8301K8981L0812L1642L0467K8294K6271K4453K2945
53410B275006K2562K3287K3397K1500J8485J6103J4327J1866Q795O748O195N338
53398B453609K564j347m675p341j0496j4136j6915j8244j8980j9614j9478j8559
53386B306388j8566k0785k3923k5717k5946k6193k7053k7417k6599k5386k4632
53375B034171k4282k4197k4458k4433k3089k0789j9232j8801j7650j4461j0484
$$ plain form
53364 1812295 1804772 1799341 1796065 1794464 1793079 1791385 1790756 1792545 1796406 1801582 1808727 1819011 1832028 1845954
53350 1845954 1859650 1873567 1888739 1905836 1925189 1946931 1970956 1997173 2025745 2056669 2089409
53339 2089409 2123509 2159388 2197949 2239489 2283511 2329534 2377492 2427307 2478556 2530765 2583912
53328 2583912 2638700 2696361 2757751 2822273 2887952 2952986 3017112 3081307 3146579 3213303 3281098
53317 3281098 3348592 3413742 3475340 3534265 3592555 3651175 3709176 3764801 3816620 3863506 3904604
53306 3904604 3939972 3970634 3997180 4018507 4032538 4038246 4036563 4029236 4017255 4000528 3978574 3950947
53294 3950947 3917144 3876853 3830683 3780209 3726845 3670882 3612122 3551162 3489369 3427699 3366278
53283 3366278 3305317 3245590 3187606 3130956 3075072 3020174 2966840 2915028 2864266 2814607 2766660
$$ packed form
53364A812295p523n431l276j601j385j694o29J789L861N176P145J0284J3017J3926
53350A845954J3696J3917J5172J7097J9353K1742K4025K6217K8572L0924L2740
53339B089409L4100L5879L8561M1540M4022M6023M7958M9815N1249N2209N3147
53328B583912N4788N7661O1390O4522O5679O5034O4126O4195O5272O6724O7795
53317C281098O7494O5150O1598N8925N8290N8620N8001N5625N1819M6886M1098
53306C904604L5368L0662K6546K1327J4031N708j683p327j1981j6727k1954k7627
53294C950947l3803m0291m6170n0474n3364n5963n8760o0960o1793o1670o1421
53283C366278o0961n9727n7984n6650n5884n4898n3334n1812n0762m9659m7947
$$ plain form
53272 2766660 2720613 2675928 2632290 2590371 2551219 2515099 2481217 2448556 2416735 2386093 2357258
53261 2357258 2330878 2307622 2287905 2271349 2256721 2242708 2228623 2214260 2199540 2184733 2170627
53250 2170627 2157705 2145347 2132644 2119909 2108421 2098543 2089141 2079176 2068952 2059342 2050846 2044023
53238 2044023 2039760 2038059 2037465 2037006 2038086 2043005 2051779 2061876 2071279 2080605 2091891 2106377 2123947
53225 2123947 2143820 2165217 2187980 2213019 2241451 2272894 2305242 2336667 2367101 2397128 2426222
53214 2426222 2453246 2478248 2502389 2525926 2547401 2565304 2579525 2590508 2597826 2600730 2599842 2597145
53202 2597145 2594060 2590332 2584964 2577399 2567304 2553973 2536733 2515645 2491261 2464102 2434992 2405376
53190 2405376 2376371 2347612 2317907 2286932 2255365 2223483 2190855 2157747 2125545 2094967 2064818
$$ packed form
53272B766660m6047m4685m3638m1919l9152l6120l3882l2661l1821l0642k8835
53261B357258k6380k3256j9717j6556j4628j4013j4085j4363j4720j4807j4106
53250B170627j2922j2358j2703j2735j1488r878r402r965j0224r610q496o823
53238B044023m263j701n94m59J080M919Q774J0097R403R326J1286J4486J7570
53225B123947J9873K1397K2763K5039K8432L1443L2348L1425L0434L0027K9094
53214B426222K7024K5002K4141K3537K1475J7903J4221J0983P318K904q88k697
53202B597145l085l728n368p565j0095j3331j7240k1088k4384k7159k9110k9616
53190B405376k9005k8759k9705l0975l1567l1882l2628l3108l2202l0578l0149
$$ plain form
53179 2064818 2033640 2002034 1972259 1945633 1921280 1897561 1873982 1851363 1830534 1811183 1791899
53168 1791899 1771411 1749888 1729019 1710682 1695539 1682839 1671187 1659400 1647056 1634631 1623033
53157 1623033 1612745 1603496 1594724 1586086 1577411 1568479 1558929 1548148 1535401 1520565 1504591 1488427
53145 1488427 1471489 1452203 1430391 1408032 1387026 1367204 1347315 1327012 1306720 1286340 1265552
53134 1265552 1245072 1226286 1209416 1193063 1175611 1156420 1135755 1114466 1093626 1073536 1053057
53123 1053057 1030740 1006638 982174 958397 935545 914311 896024 880888 867091 852490 836535
53112 836535 819934 803207 786399 769675 753342 737528 722540 709261 698515 689992 682253 673800
53100 673800 663937 652841 641244 629994 619554 609905 600987 592978 585914 579313 572484 565053 556972
$$ packed form
53179B064818l1178l1606k9775k6626k4353k3719k3579k2619k0829j9351j9284
53168A791899k0488k1523k0869j8337j5143j2700j1652j1787j2344j2425j1598
53157A623033j0288r249q772q638q675q932r550j0781j2747j4836j5974j6164
53145A488427j6938j9286k1812k2359k1006j9822j9889k0303k0292k0380k0788
53134A265552k0480j8786j6870j6353j7452j9191k0665k1289k0840k0090k0479
53123A053057k2317k4102k4464k3777k2852k1234j8287j5136j3797j4601j5955
53112H36535j6601j6727j6808j6724j6333j5814j4988j3279j0746q523p739q453
53100F73800r863j1096j1597j1250j0440r649q918q009p064o601o829p431q081
$$ plain form
53087 556972 548340 539505 531089 523408 516059 508508 501035 494607 489830 486454 483855 481422 478295 473359
53073 473359 466174 457852 450589 446068 444266 443617 442250 439308 435343 431458 427970 424213 419825 415749
53059 415749 413242 412131 411050 409566 408992 410374 412537 413272 412088 410571 410041 410092 409736 408959 408459 408634
53043 408634 409564 411489 414524 418100 421296 423720 425766 428115 431268 435334 439974 444510 448138 449913
53029 449913 448872 444838 439127 433595 428732 423417 416810 409497 402221 394573 385980 377214 369684 363596
53015 363596 357946 352038 345880 339428 332764 327022 323584 321852 319067 313288 305805 299756 296725 295339
53001 295339 292919 287924 280948 273855 268094 263776 260353 257846 256786 256829 256253 253537 249172 245241 243236
52986 243236 242745 242326 241122 239283 237248 235235 233408 231962 230800 229526 228134 227351 227749 228792 229363
$$ packed form
53087E56972q632q835q416p681p349p551p473o428m777l376k599k433l127m936
53073D73359p185q322p263m521j802o49j367k942l965l885l488l757m388m076
53059D15749k507j111j081j484n74J382K163P35j184j517n30N1l56p77n00J75
53043D08634R30J925L035L576L196K424K046K349L153M066M640M536L628J775
53029D49913j041m034n711n532m863n315o607p313p276p648q593q766p530o088
53015C63596n650n908o158o452o664n742l438j732k785n779p483o049l031j386
53001B95339k420m995o976p093n761m318l423k507j060M3n76k716m365l931k005
52986B43236m91m19j204j839k035k013j827j446j162j274j392p83L98J043N71
$$ plain form
52971 229363 229144 228735 228456 227907 226955 226218 226038 225762 224744 223521 223192 223957 224932 225219 224601 223412 222302
52954 222302 221929 222408 223115 223401 223260 223071 223065 223398 224263 225471 226378 226731 227207 228685 231392 235002 238861 241766
52936 241766 242561 241677 241060 241638 241908 240311 237995 237470 239051 240506 240134 238443 236785 235990 236614 238883
52920 238883 241802 243657 243983 243946 244421 245040 245704 247643 251921 257695 262840 265818 266476 265765 265300 266566
52904 266566 269899 274454 279261 283760 287464 290258 293351 298810 307462 317992 328526 338227 346901 354184
52890 354184 360021 365231 370764 376775 382944 389078 394837 399525 402703 404476 404708 402795 398795 394032
52876 394032 389795 386096 382421 379051 376643 374867 372434 368453 363314 358357 354904 353187 351889 349280
52862 349280 345091 340720 337357 334823 332606 330860 329463 327216 323311 319016 316452 315893 315477 313638 310821
$$ packed form
52971B29363k19m09k79n49r52p37j80k76j018j223l29P65R75K87o18j189j110
52954B22302l73M79P07K86j41j89oL33Q65J208R07L53M76J478K707L610L859K905
52936B41766P95q84o17N78K70j597k316n25J581J455l72j691j658p95O24K269
52920B38883K919J855L26l7M75O19O64J939M278N774N145K978O58p11m65J266
52904B66566L333M555M807M499L704K794L093N459Q652J0530J0534R701Q674P283
52890C54184N837N210N533O011O169O134N759M688L178J773K32j913m000m763
52876C94032m237l699l675l370k408j776k433l981n139m957l453j717j298k609
52862C49280m189m371l363k534k217j746j397k247l905m295k564n59m16j839k817
$$ plain form
52847 310821 308636 308135 309041 310113 310150 309007 307662 306999 306905 306911 307143 307951 308999 309665 310133 311254 313357 315890
52829 315890 318198 319912 320682 320343 319529 319381 320332 321670 322565 323042 323689 324748 325885 326761 327580 328995 331406
52812 331406 334415 337095 338857 339861 340551 341128 341520 341541 340951 339745 338568 338353 339322 340784 342183 343766
52796 343766 345791 347674 348565 348492 348366 348997 350519 352541 354475 356016 357636 360298 364364 369137 373804
52781 373804 378260 382492 385819 387677 388893 391225 395513 400960 406344 411308 416239 421352 426353 430890
52767 430890 435041 439170 443331 447005 449556 450664 450118 447626 443511 439188 435964 433413 429926 425049
52753 425049 420138 416359 413179 409402 404633 398984 392305 384589 376401 368178 359872 351934 345633 341420
52739 341420 337941 333781 329315 325682 322835 320015 317310 315122 312730 309193 305298 302691 301196 298980
$$ packed form
52847C10821k185n01R06J072L7j143j345o63r4OK32Q08J048O66M68J121K103K533
52829C15890K308J714P70l39q14j48R51J338Q95M77O47J059J137Q76Q19J415K411
52812C31406L009K680J762J004O90N77L92K1n90j206j177k15R69J462J399J583
52796C43766K025J883Q91p3j26O31J522K022J934J541J620K662M066M773M667
52781C73804M456M232L327J858J216K332M288N447N384M964M931N113N001M537
52767D30890M151M129M161L674K551J108n46k492m115m323l224k551l487m877
52753D25049m911l779l180l777m769n649o679p716q188q223q306p938o301m213
52739C41420l479m160m466l633k847k820k705k188k392l537l895k607j495k216
$$ plain form
52725 298980 295583 292798 291917 291856 290783 288179 284394 279594 274332 270046 267664 266310 264518 262212 260416
52710 260416 259381 258105 255701 252391 249075 246591 245542 246205 248151 250096 250432 248161 243525 237892 232824
52695 232824 229035 226168 223540 221029 219060 217794 216436 213721 209224 204034 199703 196614 193869 190758
52681 190758 187600 184868 182223 179032 175359 171927 169458 168486 169215 170956 172237 172224 171532 170923 169836 167298
52665 167298 163870 161408 160932 161824 163169 164721 166257 167026 166429 164619 162085 159087 155839 152762 150321
52650 150321 148876 148678 149610 150913 151650 151453 150561 149331 148248 148095 149396 151730 154179 156275 158028 159416
52634 159416 160664 162701 166258 170591 174060 176009 177107 177902 178229 178394 179862 184073 190998 199144 206598
52619 206598 212189 216264 220336 225278 230028 232931 234105 235352 237631 239823 240262 238379 234588 229661
$$ packed form
52725B98980l397k785q81o1j073k604l785m800n262m286k382j354j792k306j796
52710B60416j035j276k404l310l316k484j049O63J946J945L36k271m636n633n068
52695B32824l789k867k628k511j969j266j358k715m497n190m331l089k745l111
52681A90758l158k732k645l191l673l432k469r72P29J741J281j3o92o09j087k538
52665A67298l428k462m76Q92J345J552J536P69n97j810k534k998l248l077k441
52650A50321j445j98R32J303P37j97q92j230j083j53J301K334K449K096J753J388
52634A59416J248K037L557M333L469J949J098P95L27J65J468M211O925Q146P454
52619B06598N591M075M072M942M750K903J174J247K279K192M39j883l791m927
$$ plain form
52605 229661 224643 220305 216098 210591 203408 195795 188820 182105 175009 168090 162601 159250 158098 158822
52591 158822 160324 160931 159797 157587 155193 152677 150159 148648 148677 148768 146699 142173 137133 133528 131788
52576 131788 131403 131914 132860 133472 132979 131151 128503 126091 124922 125204 126243 127133 127317 126497 124658 122557
52560 122557 121574 122354 123958 124932 124995 125129 126250 128389 130973 133256 134491 134315 133189 132167 132047 132830
52544 132830 133908 134576 134435 133588 132537 131853 131909 132733 133899 134685 134691 134252 133888 133579 133129 132999 133886 135375
52526 135375 136023 135228 134175 134334 135694 137176 138245 139329 140927 143030 145324 147423 148926 149676 150036
52511 150036 150728 152360 154993 157901 159939 160687 161212 162919 165574 167419 167646 167754 169668 173140 175941
52496 175941 176317 174511 172173 171015 171863 174254 176806 178350 178786 178787 179043 180030 182052 184960 188024 190438
$$ packed form
52605B29661n018m338m207n507p183p613o975o715p096o919n489l351j152P24
52591A58822J502O07j134k210k394k516k518j511K9R1k069m526n040l605j740
52576A31788l85N11R46O12m93j828k648k412j169K82J039Q90J84q20j839k101
52560A22557r83P80J604R74O3J34J121K139K584K283J235j76j126j022j20P83
52544A32830J078O68j41q47j051o84N6Q24J166P86Om39l64l09m50j30Q87J489
52526A35375O48p95j053J59J360J482J069J084J598K103K294K099J503P50L60
52511A50036O92J632K633K908K038P48N25J707K655J845K27J08J914L472K801
52496A75941L76j806k338j158Q48K391K552J544M36JK56R87K022K908L064K414
$$ plain form
52480 190438 191804 192018 191247 190357 190746 193066 196379 199122 200731 201807 202968 204138 205003 205786 207369 210530
52464 210530 214836 218520 220064 219959 220208 221916 224136 225380 225431 225187 225420 226310 227536 228311 227912 226699
52448 226699 225893 225899 225708 224566 223151 222225 221152 219047 216573 215147 214947 215212 216119 218648 222604 226341
52432 226341 228772 230324 231581 232356 232568 232813 233335 233429 232645 231827 232125 233403 234386 234113 232745 231189 230400
52415 230400 230813 232110 233632 235178 237130 239623 242003 243431 243767 243516 243125 242747 242606 243096 244323 245788
52399 245788 246918 247949 249965 253719 258583 263022 266086 268051 269594 270854 271579 271728 271568 271524 272174 274034
52383 274034 276951 279889 281627 281664 280480 279255 279207 280517 281853 281678 280201 279161 279468 280185 280392 280810
52367 280810 282530 285051 286824 287123 286258 284570 282523 281307 281873 283547 284868 285679 287022 289090 290745
$$ packed form
52480A90438J366K14p71q90L89K320L313K743J609J076J161J170Q65P83J583L161
52464B10530M306L684J544j05K49J708K220J244N1k44K33Q90J226P75l99j213
52448B26699q06Oj91j142j415r26j073k105k474j426k00K65R07K529L956L737
52432B26341K431J552J257P75K12K45N22R4p84q18K98J278R83k73j368j556p89
52415B30400M13J297J522J546J952K493K380J428L36k51l91l78j41M90J227J465
52399B45788J130J031K016L754M864M439L064J965J543J260P25J49j60m4O50J860
52383B74034K917K938J738L7j184j225m8J310J336j75j477j040L07P17K07M18
52367B80810J720K521J773K99q65j688k047j216N66J674J321Q11J343K068J655
$$ plain form
52352 290745 291257 291246 291622 292817 295278 299369 304260 308204 310612 312842 316236 320338 323817 326286 328305
52337 328305 330284 332257 334320 336495 338437 339928 341347 343169 345336 347670 350470 354077 358079 361554
52323 361554 363866 364703 363595 360120 354700 348735 343900 341454 341923 344757 348287 350619 351004 350190 349330
52308 349330 348883 348757 349080 350325 352661 355694 358873 361703 363456 363466 362350 362276 364931 369420 373282 375570
52292 375570 377649 380792 384549 388292 392807 398857 405225 409900 412734 415280 418295 421094 423470 426582
52278 426582 431364 437217 442838 447504 451225 454606 458853 465009 472765 480720 488030 495000 502089 509393
52264 509393 517238 526022 535151 543525 551552 561196 573151 585373 595694 604767 615022 627534 641456
52251 641456 655997 671295 687402 703931 721006 739477 759869 781903 805225 829849 855636
$$ packed form
52352B90745N12j1L76J195K461M091M891L944K408K230L394M102L479K469K019
52337C28305J979J973K063K175J942J491J419J822K167K334K800L607M002L475
52323C61554K312Q37j108l475n420n965m835k446M69K834L530K332L85q14q60
52308C49330m47j26L23J245K336L033L179K830J753J0j116p4K655M489L862K288
52292C75570K079L143L757L743M515O050O368M675K834K546L015K799K376L112
52278D26582M782N853N621M666L721L381M247O156P756P955P310O970P089P304
52264E09393P845Q784R129Q374Q027R644J1955J2222J0321R073J0255J2512J3922
52251F41456J4541J5298J6107J6529J7075J8471K0392K2034K3322K4624K5787
$$ plain form
52240 855636 882163 909450 938236 969114 1001745 1035113 1068193 1100275 1131288 1162242 1194892
52229 1194892 1230241 1267305 1303799 1338315 1371653 1405703 1441078 1476184 1508880 1538708 1567004
52218 1567004 1595031 1622745 1649481 1674967 1698990 1720594 1738544 1752536 1763315 1771576 1777537 1781868
52206 1781868 1786237 1791969 1798236 1802420 1802756 1800157 1796862 1793694 1789639 1784124 1778455 1774177 1770993 1767611
52192 1767611 1764270 1762984 1765149 1770239 1777274 1786299 1797507 1809945 1822388 1835145 1849880 1867677
52180 1867677 1888199 1910756 1935214 1961371 1987997 2013224 2035959 2056771 2077369 2099137 2121972
52169 2121972 2144467 2165309 2184418 2202448 2219152 2232611 2240529 2242322 2239630 2234573 2227805 2218539
52157 2218539 2206082 2190631 2172645 2152292 2129881 2106098 2081211 2054650 2026064 1996262 1966238
$$ packed form
52240H55636K6527K7287K8786L0878L2631L3368L3080L2082L1013L0954L2650
52229A194892L5349L7064L6494L4516L3338L4050L5375L5106L2696K9828K8296
52218A567004K8027K7714K6736K5486K4023K1604J7950J3992J0779Q261N961M331
52206A781868M369N732O267M184L36k599l295l168m055n515n669m278l184l382
52192A767611l341j286K165N090P035R025J1208J2438J2443J2757J4735J7797
52180A867677K0522K2557K4458K6157K6626K5227K2735K0812K0598K1768K2835
52169B121972K2495K0842J9109J8030J6704J3459P918J793k692n057o768r266
52157B218539j2457j5451j7986k0353k2411k3783k4887k6561k8586k9802l0024
$$ plain form
52146 1966238 1935726 1903867 1871138 1839477 1810235 1782892 1756068 1729048 1702169 1676504 1653378
52135 1653378 1633302 1615083 1596856 1578383 1561502 1547791 1536667 1526374 1516121 1506465 1498175 1491476
52123 1491476 1486022 1480909 1474995 1467754 1459739 1451918 1444873 1438832 1433877 1429699 1425640 1421316 1416757 1411741
52109 1411741 1405815 1399269 1393019 1386948 1379555 1370309 1361230 1354688 1350286 1345562 1339368 1332909 1327440 1322648
52095 1322648 1317770 1312948 1308811 1305733 1304088 1304240 1305504 1305849 1303516 1298609 1292649 1286942 1281917 1277596
52081 1277596 1274025 1271235 1269132 1267451 1265789 1263944 1262223 1261027 1260141 1259100 1258359 1259129 1261502 1263660 1263987
52066 1263987 1263358 1264007 1266277 1267889 1266919 1264346 1262878 1264134 1268009 1274179 1282805 1293651 1305643 1317936
52052 1317936 1330679 1344245 1358270 1372144 1386185 1401675 1419670 1440050 1461599 1482894 1503534
$$ packed form
52146A966238l0512l1859l2729l1661k9242k7343k6824k7020k6879k5665k3126
52135A653378k0076j8219j8227j8473j6881j3711j1124j0293j0253r656q290o699
52123A491476n454n113n914p241q015p821p045o041m955m178m059m324m559n016
52109A411741n926o546o250o071p393r246r079o542m402m724o194o459n469m792
52095A322648m878m822m137l078j645J52J264L45k333m907n960n707n025m321
52081A277596l571k790k103j681j662j845j721j196q86j041p41P70K373K158L27
52066A263987o29O49K270J612r70k573j468J256L875O170Q626J0846J1992J2293
52052A317936J2743J3566J4025J3874J4041J5490J7995K0380K1549K1295K0640
$$ plain form
52041 1503534 1524852 1549049 1577165 1608242 1640923 1675320 1712470 1752412 1793915 1836009 1878545
52030 1878545 1921049 1962280 2001554 2039560 2077147 2113955 2148930 2181595 2212088 2240432 2266571
52019 2266571 2290778 2313144 2332764 2348121 2358369 2363832 2365357 2363626 2359114 2352236 2343328 2332505
52007 2332505 2319554 2304050 2286027 2266536 2247006 2227785 2207942 2186937 2165785 2145851 2127092
51996 2127092 2108521 2090241 2073946 2061127 2051572 2044130 2038480 2035589 2036486 2040883 2047132 2053511 2059586
51983 2059586 2066309 2074944 2086054 2099291 2113602 2127534 2139998 2151226 2162684 2175566 2189499 2203010
51971 2203010 2214919 2224841 2232605 2237839 2240342 2240565 2239490 2237843 2235275 2230355 2221690 2209053 2193175
51958 2193175 2174670 2153783 2131082 2107402 2082793 2056377 2027698 1997364 1965874 1932734 1897502
$$ packed form
52041A503534K1318K4197K8116L1077L2681L4397L7150L9942M1503M2094M2536
52030A878545M2504M1231L9274L8006L7587L6808L4975L2665L0493K8344K6139
52019B266571K4207K2366J9620J5357J0248N463J525j731m512o878q908j0823
52007B332505j2951j5504j8023j9491j9530j9221j9843k1005k1152j9934j8759
51996B127092j8571j8280j6295j2819r555p442n650k891Q97M397O249O379O075
51983B059586O723Q635J1110J3237J4311J3932J2464J1228J1458J2882J3933J3511
51971B203010J1909R922P764N234K503K23j075j647k568m920q665j2637j5878
51958B193175j8505k0887k2701k3680k4609k6416k8679l0334l1490l3140l5232
$$ plain form
51947 1897502 1860758 1823014 1783565 1741838 1699379 1658784 1620580 1582593 1542840 1501857 1461628
51936 1461628 1423184 1386009 1349264 1312794 1277021 1242244 1208096 1173715 1138549 1102903 1067595
51925 1067595 1033423 1001184 971563 944232 917606 890479 863615 838579 815277 792226 769417
51914 769417 749101 732679 718257 702782 685805 669483 655223 642105 628920 616150 604915
51903 604915 595043 585491 576105 567616 559824 551232 541147 531203 523729 519020 515178 510478 504915 499406
51889 499406 494467 489979 485431 480066 473526 466717 461158 456907 451965 444535 435268 426476 419708 414905
51875 414905 411321 408137 404455 399822 394806 390315 386485 383075 380659 380239 381526 382646 381901 379136 375185
51860 375185 370817 366611 363165 360866 359678 359325 359367 359115 357959 355884 353278 350274 346764 342971 339368
$$ packed form
51947A897502l6744l7744l9449m1727m2459m0595l8204l7987l9753m0983m0229
51936A461628l8444l7175l6745l6470l5773l4777l4148l4381l5166l5646l5308
51925A067595l4172l2239k9621k7331k6626k7127k6864k5036k3302k3051k2809
51914G69417k0316j6422j4422j5475j6977j6322j4260j3118j3185j2770j1235
51903F04915r872r552r386q489p792q592j0085r944p474m709l842m700n563n509
51889D99406m939m488m548n365o540o809n559m251m942p430r267q792o768m803
51875D14905l584l184l682m633n016m491l830l410k416m20J287J120p45k765l951
51860C75185m368m206l446k299j188l53M2k52j156k075k606l004l510l793l603
$$ plain form
51845 339368 335980 332336 328164 323641 319017 314612 311099 309089 308351 308070 307782 307348 306225 303841 300784
51830 300784 298501 297501 296867 295884 295098 295043 294973 293834 291924 290581 290434 290762 290497 289348 287906 287000 286972
51813 286972 287484 288117 289007 290551 292657 294907 297341 300231 303062 304681 304844 304697 305252 306232 307011 307884
51797 307884 309607 312249 315254 318106 320253 321017 320464 319911 320551 321920 322735 323067 324470 327820 332128 336026
51781 336026 339567 343779 348817 353385 356094 356884 356843 356871 356878 356291 354921 353136 351482 350571 351055 353072 355657
51764 355657 357265 357154 355886 354414 353071 351562 349495 346723 343559 340743 338787 337416 336122 335162 335176
51749 335176 335887 336353 336801 338800 342793 346609 347742 346432 345106 345134 345551 345061 343990 343619 344380 345481
51733 345481 346156 346840 348720 351995 354860 355019 352416 349566 348538 348435 346894 343537 340575 340101 341998
$$ packed form
51845C39368l388l644m172m523m624m405l513k010p38k81k88m34j123k384l057
51830C00784k283j000o34r83p86n5p0j139j910j343j47L28k65j149j442r06k8
51813B86972N12O33Q90J544K106K250K434K890K831J619J63j47N55R80P79Q73
51797C07884J723K642L005K852K147P64n53n53O40J369Q15L32J403L350M308L898
51781C36026L541M212N038M568K709P90m1K8Pn87j370j785j654r11M84K017K585
51764C55657J608j11j268j472j343j509k067k772l164k816j956j371j294r60J4
51749C35176P11M66M48J999L993L816J133j310j326K8M17m90j071l71P61J101
51733C45481O75O84J880L275K865J59k603k850j028j03j541l357k962m74J897
$$ plain form
51718 341998 344734 347095 348634 349228 348913 347876 346383 344909 344272 345031 346718 348407 350200 353295 358074
51703 358074 362784 364915 363773 361265 360172 361800 365074 367746 368675 369008 370845 374811 379479 383243 385949
51688 385949 388290 390466 392368 394573 398063 402912 408123 412798 416715 419722 421639 423260 426466 432421
51674 432421 440143 447690 454270 460326 466072 471466 477572 486254 497703 509596 519718 528420 537293
51661 537293 546454 554831 562548 570973 580270 588786 595517 601390 607191 611752 613713 614000 614819 616611 617537
51646 617537 615959 612123 607288 602413 598107 594928 592917 591180 588421 584062 578915 574756 572848 572710
51632 572710 572793 572642 573565 576510 580196 582597 583657 585020 587286 589291 590457 592167 595973 601653 608010
51617 608010 614521 621073 626759 630243 631081 629790 626920 622924 618760 615667 614172 613837 613943 613969 613564 612651
$$ packed form
51718C41998K736K361J539N94l15j037j493j474o37P59J687J689J793L095M779
51703C58074M710K131j142k508j093J628L274K672R29L33J837L966M668L764K706
51688C85949K341K176J902K205L490M849N211M675L917L007J917J621L206N955
51674D32421P722P547O580O056N746N394O106Q682J1449J1893J0122Q702Q873
51661E37293R161Q377P717Q425R297Q516O731N873N801M561J961K87Q19J792R26
51646F17537j578l836m835m875m306l179k011j737k759m359n147m159j908j38
51632E72710Q3j51R23K945L686K401J060J363K266K005J166J710L806N680O357
51617F08010O511O552N686L484Q38j291k870l996m164l093j495l35J06K6m05r13
$$ plain form
51601 612651 611509 610331 608874 607029 605428 604882 605474 606910 609414 613306 617818 621474 623818 625619 627022
51586 627022 626689 623588 618689 613875 609788 605733 601252 596562 591546 585521 578377 571108 564662 558788
51572 558788 552484 545312 537872 531068 525140 519436 513062 505827 498431 491657 485533 479466 473078 466656
51558 466656 460995 456978 454899 453704 451293 446394 440086 434725 431357 428910 426009 422670 419826 417972
51544 417972 416812 415804 414633 413496 413038 413521 413977 413021 410744 408873 408599 409290 409963 410889 412603 414316
51528 414316 414780 414316 414566 416442 419535 423365 427822 432357 436120 439251 442810 447071 450995 453905 456600
51513 456600 460154 464459 468647 472279 475467 478327 480934 483426 485734 487549 488912 490323 491988 493349
51499 493349 493565 491973 488006 481537 473645 466171 459982 454335 448455 442967 439107 437176 436512 436503 436926 437809
$$ packed form
51601F12651j142j178j457j845j601n46N92J436K504L892M512L656K344J801J403
51586F27022l33l101m899m814m087m055m481m690n016o025p144p269o446n874
51572E58788o304p172p440o804n928n704o374p235p396o774o124o067o388o422
51558D66656n661m017k079j195k411m899o308n361l368k447k901l339k844j854
51544D17972j160j008j171j137m58M83M56r56k277j871k74O91O73R26J714J713
51528D14316M64m64K50J876L093L830M457M535L763L131L559M261L924K910K695
51513D56600L554M305M188L632L188K860K607K492K308J815J363J411J665J361
51499D93349K16j592l967o469p892p474o189n647n880n488l860j931o64rM23Q83
$$ plain form
51483 437809 439597 442936 447548 451909 454905 457390 461112 466455 472231 477522 482617 488152 494341 501210
51469 501210 508578 515451 520287 522534 523430 524735 526832 528464 528173 525725 522145 518589 515336 511904 507995
51454 507995 503996 500464 497590 495418 494175 493880 493882 493470 492918 493370 495589 499123 502787 505520 506753 506465
51438 506465 505316 504486 504897 506367 507773 508277 508332 509092 510717 511761 510728 507868 504830 502771 501603 500958
51422 500958 500778 500636 499478 496672 492650 488155 483720 480333 479405 480974 482914 483284 482890 484066 487276
51407 487276 490589 492588 494135 496705 500336 504119 507774 511723 516217 521274 527132 533996 541465 548891
51393 548891 556208 563828 571786 579589 587061 594813 603440 612551 621016 628209 634597 640874 646747 651030
51379 651030 652887 652604 651042 648770 646085 643566 642123 642337 643958 646158 648238 650027 651516 652157 650929
$$ packed form
51483D37809J788L339M612M361K996K485L722N343N776N291N095N535O189O869
51469E01210P368O873M836K247Q96J305K097J632k91k448l580l556l253l432l909
51454E07995l999l532k874k172j243k95Km12n52M52K219L534L664K733J233k88
51438E06465j149q30M11J470J406N04N5P60J625J044j033k860l038k059j168o45
51422E00958j80j42j158k806m022m495m435l387r28J569J940L70l94J176L210
51407D87276L313J999J547K570L631L783L655L949M494N057N858O864P469P426
51393E48891P317P620P958P803P472P752Q627R111Q465P193O388O277N873M283
51379F51030J857k83j562k272k685k519j443K14J621K200K080J789J489O41j228
$$ plain form
51364 650929 647514 643240 640204 639355 639911 640782 642026 644633 649276 655534 661941 666558 667962 666047 661750
51349 661750 656029 649638 643719 639542 637191 635258 632413 628630 624337 619191 612558 604665 596437 588547
51335 588547 581365 575408 571002 567621 564194 559951 554685 548699 542914 538325 534734 530760 525872 521578
51321 521578 519577 519485 519598 519271 519078 519064 518512 517425 516692 516505 515919 514294 512050 509692 507146 504390 501699
51304 501699 498821 494737 488714 481045 472670 464644 457767 451692 444527 434596 422758 411774 403107 395633
51290 395633 387829 379724 372015 364735 357956 352696 349847 348713 347664 345701 342491 337565 330756 323224
51276 323224 316842 312338 308741 304802 300383 296331 293468 291992 291602 291933 292725 293532 293520 291961 289042 285958
51260 285958 284107 284322 286596 290083 293414 295568 296575 297085 297410 297505 297694 298706 300837 303655 306595 309382
$$ packed form
51364F50929l415m274l036q49N56Q71J244K607M643O258O407M617J404j915m297
51349F61750n721o391n919m177k351j933k845l783m293n146o633p893q228p890
51335E88547p182n957m406l381l427m243n266n986n785m589l591l974m888m294
51321E21578k001r2J13l27j93j4n52j087p33j87n86j625k244k358k546k756k691
51304E01699k878m084o023p669q375q026o877o075p165r931j1838j0984q667p474
51290C95633p804q105p709p280o779n260k849j134j049j963l210m926o809p532
51276C23224o382m504l597l939m419m052k863j476l90L31P92Q07j2j559k919l084
51260B85958j851K15K274L487L331K154J007N10L25R5J89J012K131K818K940K787
$$ plain form
51244 309382 311923 314357 317192 320769 324576 327580 329222 329687 329701 330676 334345 340938 348101 353093 355936
51229 355936 358905 363023 366880 369230 370794 372592 374151 374446 373381 371176 367389 361663 354630 347160
51215 347160 339587 332444 326817 322822 318705 312707 305217 298125 292711 288995 286237 283039 277969 271347
51201 271347 265602 262535 260993 258592 254993 251820 249885 248296 246210 243865 241703 239709 237818 235917
51187 235917 233487 230209 226936 225049 224969 226137 228157 230800 233159 234153 233939 233649 233748 233818 233959 234981 236914
51170 236914 238606 239330 239810 241153 243586 246648 249855 252884 255640 258258 260367 260640 258195 254510 252578
51155 252578 253713 256164 257319 256292 253988 251845 251239 253084 256949 261061 263919 265523 266676 267783
51141 267783 268842 269960 271120 272003 272667 273819 275709 277203 276748 274069 270416 267463 266421 267634 270130
$$ packed form
51244C09382K541K434K835L577L807L004J642M65J4R75L669O593P163M992K843
51229C55936K969M118L857K350J564J798J559K95j065k205l787n726p033p470
51215C47160p573p143n627l995m117n998p490p092n414l716k758l198n070o622
51201B71347n745l067j542k401l599l173j935j589k086k345k162j994j891j901
51187B35917k430l278l273j887q0J168K020K643K359R94k14k90R9P0J41J022J933
51170B36914J692P24M80J343K433L062L207L029K756K618K109K73k445l685j932
51155B52578J135K451J155j027k304k143o06J845L865M112K858J604J153J107
51141B67783J059J118J160Q83O64J152J890J494m55k679l653k953j042J213K496
$$ plain form
51126 270130 271780 270831 267492 263640 260969 259839 259673 259818 259940 260062 260454 261154 261528 260679 258444 255780
51110 255780 253913 253142 252604 251229 248863 246415 244872 244313 244037 243515 242851 242248 241448 240030 238155 236670
51094 236670 236345 237039 237692 237232 235605 233850 233055 233316 233907 234338 234866 235859 236956 237138 235576 232402 228714
51077 228714 225880 224678 224868 225457 225398 224239 222475 221226 221240 222039 222423 222017 221848 222982 225063 226906 228296
51060 228296 230326 233697 237433 239808 240352 240507 242103 245290 248205 248990 248046 247669 249299 251965 254078
51045 254078 255897 258892 262973 265980 266399 265384 265181 266401 267842 268534 268872 269711 271210 272924 274536
51030 274536 276087 277611 278957 280070 281244 282769 284281 284904 284354 283593 283819 284886 285352 284217 282045
51015 282045 280140 279189 279138 279915 281568 283689 285258 285317 283728 281228 278884 277547 277680 279338 282014 284535
$$ packed form
51126B70130J650r49l339l852k671j130j66J45J22J22L92P00L74q49k235k664
51110B55780j867p71n38j375k366k448j543n59k76n22o64o03q00j418j875j485
51094B36670l25O94O53m60j627j755p95K61N91M31N28R93J097J82j562l174l688
51077B28714k834j202J90N89n9j159j764j249J4P99L84m06j69J134K081J843J390
51060B28296K030L371L736K375N44J55J596L187K915P85r44l77J630K666K113
51045B54078J819K995M081L007M19j015k03J220J441O92L38Q39J499J714J612
51030B74536J551J524J346J113J174J525J512O23n50p61K26J067M66j135k172
51015B82045j905r51n1P77J653K121J569N9j589k500k344j337J33J658K676K521
$$ plain form
50999 284535 285617 284914 283309 281832 280534 278840 276776 275182 274726 275339 276668 278363 279665 279487 277552
50984 277552 275026 273450 273285 274001 275296 277497 280739 284477 288186 292198 297328 303711 310351 315990 320272
50969 320272 323818 327282 330729 334055 337495 341248 344920 348078 351277 355717 361644 367767 372715 376427
$$ packed form
50999B84535J082p03j605j477j298j694k064j594m56O13J329J695J302j78j935
50984B77552k526j576j65P16J295K201L242L738L709M012N130O383O640N639M282
50969C20272L546L464L447L326L440L753L672L158L199M440N927O123M948L712
$$ [...]
##END NTUPLES=NMR SPECTRUM
##END=
