
##TITLE=AC1160_Rove100-14_6524090_qxO8nUWJPk
##JCAMPDX= 6.0         $$ Bruker NMR JCAMP-DX V2.0
##DATA TYPE= NMR SPECTRUM
##DATA CLASS= NTUPLES
##ORIGIN= BRUKER
##OWNER= Administrator
$$ 1.72 TOPSPIN		Version 2.1
$$ 2012-07-14 17:22:19.062 -0500  Administrator@TOPSPIN
$$ Compression mode = diff/dup
##.OBSERVE FREQUENCY= 400.02188249412
##.OBSERVE NUCLEUS= ^1H
##.ACQUISITION MODE= SIMULTANEOUS (DQD)
##.ACQUISITION SCHEME= undefined
##.AVERAGES= 8
##.DIGITISER RES= 22
##SPECTROMETER/DATA SYSTEM= spect
##.PULSE SEQUENCE= zg30
##.SOLVENT NAME= COFFEE_meoh
##.SHIFT REFERENCE= INTERNAL, COFFEE_meoh, 1, 14.98509
##AUDIT TRAIL= $$ (NUMBER, WHEN, WHO, WHERE, PROCESS, VERSION, WHAT)
$$ ##TITLE= Audit trail, TOPSPIN		Version 2.1
$$ ##JCAMPDX= 5.01
$$ ##ORIGIN= Bruker BioSpin GmbH
$$ ##OWNER= Administrator
$$ $$ C:\Bruker\TOPSPIN/data/COFFEE/nmr/AC1160_Rove100-14_6524090_qxO8nUWJPk/10/pdata/1/auditp.txt
$$ ##AUDIT TRAIL=  $$ (NUMBER, WHEN, WHO, WHERE, PROCESS, VERSION, WHAT)
(   1,<2012-07-14 17:22:10.578 -0500>,<Administrator>,<TOPSPIN>,<go>,<TOPSPIN 2.1>,
      <created by zg
	started at 2012-07-14 17:21:03.781 -0500,
	POWCHK enabled, PULCHK disabled,
       configuration hash MD5:
       6B 1B 68 BB D9 2E 58 E2 7F 35 AD 54 07 DF 0E 41
       data hash MD5: 64K
       20 1A AD FE AF F4 D9 DC 03 2B 55 AF F0 3E 0E 7F>)
(   2,<2012-07-14 17:22:14.343 -0500>,<Administrator>,<TOPSPIN>,<proc1d>,<TOPSPIN 2.1>,
      <Start of raw data processing
       efp LB = 0 FT_mod = 6 PKNL = 1 PHC0 = 0 PHC1 = 0 SI = 32K 
       data hash MD5: 32K
       26 5A B3 F3 8D A0 58 90 2F 73 0C 60 8C 65 E5 F7>)
(   3,<2012-07-14 17:22:14.765 -0500>,<Administrator>,<TOPSPIN>,<proc1d>,<TOPSPIN 2.1>,
      <pk PHC0 = 176.1273 PHC1 = 0 
       data hash MD5: 32K
       9E 7D CE 65 D4 7E 05 40 FC 5E BE EE 87 50 0E 67>)
(   4,<2012-07-14 17:22:14.875 -0500>,<Administrator>,<TOPSPIN>,<proc1d>,<TOPSPIN 2.1>,
      <abs ABSG = 1 
       data hash MD5: 32K
       43 FC 1A 86 83 32 17 F9 D8 1A 20 37 8D 0B 25 23>)
(   5,<2012-07-14 17:22:14.906 -0500>,<Administrator>,<TOPSPIN>,<proc1d>,<TOPSPIN 2.1>,
      <abs ABSG = 2 
       data hash MD5: 32K
       FF 1E 25 57 E7 96 BF DC 37 49 8C 12 3A EC DD C1>)
(   6,<2012-07-14 17:22:14.953 -0500>,<Administrator>,<TOPSPIN>,<proc1d>,<TOPSPIN 2.1>,
      <abs ABSG = 3 
       data hash MD5: 32K
       B7 A1 64 4F FC 2D D1 23 8D 78 24 05 B7 86 92 C2>)
(   7,<2012-07-14 17:22:14.984 -0500>,<Administrator>,<TOPSPIN>,<proc1d>,<TOPSPIN 2.1>,
      <abs ABSG = 4 
       data hash MD5: 32K
       C0 3B 75 5E 22 D6 E1 D4 81 F5 ED 40 05 A1 12 11>)
(   8,<2012-07-14 17:22:15.015 -0500>,<Administrator>,<TOPSPIN>,<proc1d>,<TOPSPIN 2.1>,
      <abs ABSG = 5 
       data hash MD5: 32K
       9D D4 BF F1 38 76 A0 47 14 E2 EB 02 D3 12 D1 6F>)
$$ ##END=
$$ 
$$ $$ hash MD5
$$ $$ C3 C9 34 14 00 CB 85 B2 90 42 CB FE 7F 02 57 9D
##$RELAX= 
##$RELAX= 
##$RELAX= 
##$RELAX= 
##$RELAX= 
##$RELAX= 
##$RELAX= 
$$ Bruker specific parameters
$$ --------------------------
$$ [...]
150 150 150 150 150 150 150 150
##$TP07= 0
##$TPNAME0= <>
##$TPNAME1= <>
##$TPNAME2= <>
##$TPNAME3= <>
##$TPNAME4= <>
##$TPNAME5= <>
##$TPNAME6= <>
##$TPNAME7= <>
##$TPOAL= (0..7)
0.5 0.5 0.5 0.5 0.5 0.5 0.5 0.5
##$TPOFFS= (0..7)
0 0 0 0 0 0 0 0
##$TUNHIN= 0
##$TUNHOUT= 0
##$TUNXOUT= 0
##$USERA1= <user>
##$USERA2= <user>
##$USERA3= <user>
##$USERA4= <user>
##$USERA5= <user>
##$V9= 5
##$VALIST= <valist>
##$VCLIST= <CCCCCCCCCCCCCCC>
##$VD= 0
##$VDLIST= <DDDDDDDDDDDDDDD>
##$VPLIST= <PPPPPPPPPPPPPPP>
##$VTLIST= <TTTTTTTTTTTTTTT>
##$WBST= 2048
##$WBSW= 25
##$XGAIN= (0..3)
0 0 0 0
##$XL= 0
##$YL= 0
##$YMAX_a= 516637
##$YMIN_a= -655376
##$ZGOPTNS= <>
##$ZL1= 120
##$ZL2= 120
##$ZL3= 120
##$ZL4= 120
##$ABSF1= 14.98509
##$ABSF2= -5.573092
##$ABSG= 5
##$ABSL= 3
##$ALPHA= 0
##$AQORDER= 0
##$ASSFAC= 0
##$ASSFACI= 0
##$ASSFACX= 0
##$ASSWID= 0
##$AUNMP= <proc_prof1d_extract_pilot.lims>
##$AXLEFT= 0
##$AXNAME= <>
##$AXNUC= <1H>
##$AXRIGHT= 0
##$AXTYPE= 0
##$AXUNIT= <>
##$AZFE= 0.1
##$AZFW= 0.1
##$BCFW= 0
##$BC_mod= 0
##$BYTORDP= 0
##$COROFFS= 0
##$CY= 15
##$DATMOD= 1
##$DC= 0
##$DFILT= <>
##$DTYPP= 0
##$F1P= 0
##$F2P= 0
##$FCOR= 0.5
##$FTSIZE= 32768
##$FT_mod= 6
##$GAMMA= 0
##$GB= 0
##$INTBC= 1
##$INTSCL= 1
##$ISEN= 128
##$LB= 0
##$LEV0= 0
##$LPBIN= 0
##$MAXI= 10000
##$MC2= 0
##$MEAN= 0
##$ME_mod= 0
##$MI= 0
##$NCOEF= 0
##$NC_proc= -8
##$NLEV= 6
##$NOISF1= 0
##$NOISF2= 0
##$NSP= 0
##$NTH_PI= 0
##$NZP= 0
##$OFFSET= 14.98509
##$PC= 1
##$PHC0= 176.1273
##$PHC1= 0
##$PH_mod= 1
##$PKNL= yes
##$PPARMOD= 0
##$PPDIAG= 0
##$PPIPTYP= 0
##$PPMPNUM= 2147483647
##$PPRESOL= 1
##$PSCAL= 4
##$PSIGN= 0
##$PYNMP= <proc.py>
##$REVERSE= no
##$SF= 400.02
##$SI= 32768
##$SIGF1= 0
##$SIGF2= 0
##$SINO= 400
##$SIOLD= 32768
##$SPECTYP= <>
##$SREGLST= <1H.CDCl3>
##$SSB= 0
##$STSI= 32768
##$STSR= 0
##$SW_p= 8223.68421052631
##$SYMM= 0
##$S_DEV= 0
##$TDeff= 65536
##$TDoff= 0
##$TI= <>
##$TILT= no
##$TM1= 0
##$TM2= 0
##$TOPLEV= 0
##$USERP1= <user>
##$USERP2= <user>
##$USERP3= <user>
##$USERP4= <user>
##$USERP5= <user>
##$WDW= 1
##$XDIM= 32768
##$YMAX_p= 476647961
##$YMIN_p= -724797
##$CURPLOT= <Network HP LaserJet P1505>
##$CURPRIN= <$Network HP LaserJet P1505>
##$DFORMAT= <normdp>
##$LAYOUT= <+/1D_H.xwp>
##$LFORMAT= <normlp>
##$PFORMAT= <normpl>
##$SURQMSG= 1
$$ End of Bruker specific parameters
$$ ---------------------------------
##NTUPLES= NMR SPECTRUM
##VAR_NAME=  FREQUENCY,     SPECTRUM/REAL,   SPECTRUM/IMAG
##SYMBOL=    X,             R,               I
##VAR_TYPE=  INDEPENDENT,   DEPENDENT,       DEPENDENT
##VAR_FORM=  AFFN,          ASDF,            ASDF
##VAR_DIM=   32768,         32768,           32768
##UNITS=     HZ,            ARBITRARY UNITS, ARBITRARY UNITS
##FACTOR=    0.250966925370066, 1,           1
##FIRST=     8223.43324360094, -61664,       -61254
##LAST=      0,             -125746,         -51291
##MIN=       0,             -724797,         0
##MAX=       8223.43324360094, 476647961,    0
$$ Real data points
##PAGE= N=1
##DATA TABLE= (X++(R..R)), XYDATA
$$ [...]
19523A60503J3630p9842a17659D1240d13427e2532A96581a79817A901J15751n750
$$ 160503 174133 94291 -117659 41240 -413427 -52532 196581 -179817 1901 117652 111902
19512A11902K21015A15077h2437j80664b2740C06607G216c71788b3382k14465
$$ 111902 332917 115077 -82437 -263101 -22740 306607 7216 -371788 -23382 -237847
19502b37847B44618M538f0677m8565a6353A68224a39151o3956B41322d6157j23757
$$ -237847 244618 249156 -60677 -109242 -16353 168224 -139151 -203107 241322 -46157 -169914
19491a69914C1276h7626E639g3998j49890J8845H0549c05237P1529C06793F5327
$$ -169914 31276 -87626 5639 -73998 -223888 -205043 80549 -305237 -233708 306793 65327
19479a90300C08042P0085a45541C8332b26276r1645c0188m6632j79648B39044
$$ -190300 308042 378127 -145541 38332 -226276 -317921 -30188 -76820 -256468 239044
19468h3389E0763a88557m1140B70530e143l04021m0816J16421A15159b5899A52170
$$ -83389 50763 -188557 -229697 270530 -5143 -309164 -349980 -233559 115159 -25899 152170
19456g3084j57619H8482L9596d87017K24296A16122b37261A98073c1427j47724
$$ -73084 -230703 88482 128078 -487017 -262721 116122 -237261 198073 -31427 -179151
19446a79151L910A12932c12064J37756k65605G6371a56464n5398m8164C59057
$$ -179151 -175241 112932 -312064 -174308 -439913 76371 -156464 -211862 -260026 359057
19435I8024g4698k76524A82070e0465B07131h2159j09772f076F1551K31694K3929
$$ 98024 -74698 -351222 182070 -50465 207131 -82159 -191931 -6076 61551 293245 317174
19424C17174f1155o4645A11115i1051d946C3112h3548A32044b89476h5528r8261
$$ 317174 -61155 -125800 111115 -91051 -4946 33112 -83548 132044 -289476 -85528 -183789
19413a83789a7470j15314L3136I5867b40804J02024B00786a44610D7323a80635
$$ -183789 -17470 -132784 -99648 95867 -240804 -138780 200786 -144610 47323 -180635
19402a64394B24095F2288L4033a03480j39615B7528d22799C2657b29239k4905
$$ -164394 224095 62288 96321 -103480 -243095 27528 -422799 32657 -229239 -254144
19392b54144A891b78681d8090m709j84644j35942b0846q0346A7809a44659b4856
$$ -254144 1891 -278681 -48090 -52799 -237443 -373385 -20846 -101192 17809 -144659 -24856
19380b65677D3861K02498b28734D0163b16495k490a01627M6825q0548o2498i876
$$ -265677 43861 246359 -228734 40163 -216495 -218985 -101627 -54802 -135350 -197848 -9876
19368G7319a18844E9932a81690J8941j10990a01521B810Q7194a04698J721k11317
$$ 77319 -118844 59932 -181690 -162749 -273739 -101521 2810 90004 -104698 -102977 -314294
19357c14294Q0965L7367B00243c34126F669b2602j81230D759K31735c84798A47022
$$ -314294 -233329 -195962 200243 -334126 6669 -22602 -203832 4759 236494 -384798 147022
19345H1883h400j82312B91787I3721a24109K9544d0541A36375j6078i8117j10173
$$ 81883 -8400 -190712 291787 93721 -124109 -94565 -40541 136375 120297 -98117 -208290
19334b08290E3929R357J98973b5079I53J68157a38776B08245n7539c01975j4035
$$ -208290 53929 63286 262259 -25079 953 169110 -138776 208245 150706 -301975 -316010
19323c16010F6782c51227A75020d6030A14943a11964e359B64757a82522f2557
$$ -316010 66782 -351227 175020 -46030 114943 -111964 -5359 264757 -182522 -62557
19312A29734c37477D9515b1931B4638K0340g6922E1767i571j43319C062a90557
$$ 129734 -337477 49515 -21931 24638 44978 -76922 51767 -9571 -152890 3062 -190557
19300a07953J3864j07889d6589B87085d15303i9258A63676b66697A12776Q9604
$$ -107953 -94089 -201978 -46589 287085 -415303 -99258 163676 -266697 112776 202380
19290B02380e4597A27792b45765A04319m0166a09229p5561l6300l7735e9612l78436
$$ 202380 -54597 127792 -245765 104319 64153 -109229 -184790 -221090 -258825 -59612 -438048
19279d38048C6462a31745Q758j444A29712a1323H6352b96669k6072f8822A10211
$$ -438048 36462 -131745 -122987 -124431 129712 -11323 86352 -296669 -322741 -68822 110211
19267a99557j54763D6544f9021K1340p7746e9794j53958H086e9969r1011j28203
$$ -199557 -354320 46544 -69021 -47681 -125427 -59794 -213752 8086 -59969 -150980 -279183
19256b79183J38874G3539a05167M0745B7548J2160d1300r1136B02250A0954a84065
$$ -279183 -140309 73539 -105167 -64422 27548 39708 -41300 -132436 202250 10954 -184065
19244A39477a8892m1188B06837a65137k38065K1650B11681C4232b91770c9895
$$ 139477 -18892 -60080 206837 -165137 -403202 -381552 211681 34232 -291770 -39895
19233b54705c8146q5740j59698a06498p931A02716a05038J7886B16018E4876K216
$$ -254705 -38146 -123886 -283584 -106498 -114429 102716 -105038 -87152 216018 54876 57092
19222E7092A0976a53782B8941a29860C83522b94951b1473r1073I5004c10809A10300
$$ 57092 10976 -153782 28941 -129860 383522 -294951 -21473 -112546 95004 -310809 110300
19210C33107b04686n2517A40401E5029P0481c15501B09484e7868j94802A16793
$$ 333107 -204686 -257203 140401 55029 125510 -315501 209484 -57868 -252670 116793
19199E7336L3988f4309b6768C2562a91832m3712B00003b9422j00300B27932d9341
$$ 57336 91324 -64309 -26768 32562 -191832 -235544 200003 -29422 -129722 227932 -49341
19187b95841e1428B261J13256a45167c257A03473b08197B07146K60195c30261
$$ -295841 -51428 2261 115517 -145167 -3257 103473 -208197 207146 467341 -330261
19176E3343N6932F023a63321a9678m4076j1365a0363A96587f9130Q090j58283
$$ 53343 110275 6023 -163321 -19678 -63754 -75119 -10363 196587 -69130 -61040 -219323
19165b19323k5050J12037f3271A25K0913L37256a27333E1648c1078p8549j01893
$$ -219323 -244373 -132336 -63271 125 21038 358294 -127333 51648 -31078 -109627 -211520
19154b11520K7347q910B79671b34652h9549E6541b56327H4308b7742j26957C26148
$$ -211520 -184173 -193083 279671 -234652 -89549 56541 -256327 84308 -27742 -154699 326148
19142B05763c59096c5193l8676A8042a68876k82431d4446j04794K2739H1310j9950
$$ 205763 -359096 -35193 -73869 18042 -168876 -451307 -44446 -149240 -126501 81310 61360
19131F1360c8784C51535a6417A13563d768B4476b0212C4542J35557a08590l8407
$$ 61360 -38784 351535 -16417 113563 -4768 24476 -20212 34542 170099 -108590 -146997
19120a46997b2707A76041a58388b8903h537I6955a64637B49205a03077l37B49400
$$ -146997 -22707 176041 -158388 -28903 -8537 96955 -164637 249205 -103077 -103414 249400
19108B74536d00826R7056L4265j13256A65832M8625a57629B1125Q3717a97855
$$ 274536 -400826 -303770 -269505 -382761 165832 214457 -157629 21125 104842 -197855
19097b43237C1728a51685j15744h389j15569k34373a00658c2770n27458K42963
$$ -243237 31728 -151685 -267429 -8389 -123958 -358331 -100658 -32770 -560228 -317265
19087c17265H7838J1872a18529G226Q2206a7309B57282a53572c9872A08787b12009
$$ -317265 87838 99710 -118529 7226 89432 -17309 257282 -153572 -39872 108787 -212009
19075a30449f0804A28841A4813d16738h5194j8729j86183b3017G2731b04203A53916
$$ -130449 -60804 128841 14813 -416738 -85194 -103923 -290106 -23017 72731 -204203 153916
19063G6755b6982C80505E1316Q9002C9352a31784B11484f6460j34510A939O0305
$$ 76755 -26982 380505 51316 140318 39352 -131784 211484 -66460 -200970 1939 62244
19052F2244c288m92327a90940B0234a20107D0467c23336G2286f889j19662A25416
$$ 62244 -3288 -495615 -190940 20234 -120107 40467 -323336 72286 -6889 -126551 125416
19040G0268c068B42858f9479j13605I8522C1223N3176M2764J7141e20664E3211
$$ 70268 -3068 242858 -69479 -183084 98522 31223 84399 127163 144304 -520664 53211
19028f7667D2202a89725b8819m2156B66808e1837l11506b4717k5916k41055O7917
$$ -67667 42202 -189725 -28819 -70975 266808 -51837 -363343 -24717 -50633 -291688 -223771
19017b23771f5657H5675K01336a9229A04998c93297a00040j49343k1668H2854
$$ -223771 -65657 85675 287011 -19229 104998 -393297 -100040 -249383 -271051 82854
19006B60077e10564K17187O9735l6253J05796A1293b90819A46782c18665B71942
$$ 260077 -510564 -293377 -223642 -259895 -154099 11293 -290819 146782 -318665 271942
18995I370K21143c41369e1032j53263F5778a14371M0511J1546r9892A5251d42234
$$ 9370 230513 -341369 -51032 -204295 65778 -114371 -73860 -62314 -162206 15251 -442234
18983B04956a64047b3942j09036I2303a87772k68332A45049c64535B00140a22321
$$ 204956 -164047 -23942 -132978 92303 -187772 -456104 145049 -364535 200140 -122321
18972A42077A0236J09248B1062a52219H4042A0650a20875O0310j05542k2256N0106
$$ 142077 10236 119484 21062 -152219 84042 10650 -120875 -60565 -166107 -188363 -138257
18961a38257A73710K14335A10841J7093d5070l83671A43374b43532j8657a28804
$$ -138257 173710 388045 110841 127934 -45070 -428741 143374 -243532 -262189 -128804
18950a85148p6973J11079B00033o4392a3938k03481i4252b9391d181k74259C38389
$$ -185148 -262121 -151042 200033 135641 -13938 -217419 -94252 -29391 -4181 -278440 338389
18938B98135e1881C09117c78404C0498a01899A23236g2302j356j61723M1152r0242
$$ 298135 -51881 309117 -378404 30498 -101899 123236 -72302 -73658 -235381 -194229 -284471
18927b84471N7132i0776J3442j31516J01972j87401B659O6116f4813A93435E4635
$$ -284471 -227339 -90776 -77334 -208850 -106878 -294279 2659 68775 -64813 193435 54635
18915a63626C669a1271B0437I443N14838C1821P8991K81413A548K21139j2949
$$ -163626 3669 -11271 20437 9443 524281 31821 110812 392225 1548 222687 209738
18904B09738f1655C05873K827m8141P5699d5497D1362L96649f1438q7338O9754
$$ 209738 -61655 305873 308700 260559 336258 -45497 41362 438011 -61438 -148776 -79022
18893g9022l11629D4687L34546j29942a29295B17870b17839Q3673r8281a13789
$$ -79022 -390651 44687 379233 249291 -129295 217870 -217839 -134166 -232447 -113789
18882A77235d9440A4282a24490r0042g8083j56566F199a88193j30062J36240j82724
$$ 177235 -49440 14282 -124490 -214532 -78083 -234649 6199 -188193 -318255 -182015 -364739
18871c64739H0138f5366n7972I8673b10910B11635l0695a62835j24947E8863b72154
$$ -364739 80138 -65366 -123338 98673 -210910 211635 180940 -162835 -287782 58863 -272154
18859a06882J4004A53175b5658A54635P227a85389b4821k24250C093e14428a57375
$$ -106882 -92878 153175 -25658 154635 161862 -185389 -24821 -249071 3093 -514428 -157375
18847A61704g4584J8256J6137j57837R315j40169h881l14799J49879Q5049k53148
$$ 161704 -74584 -56328 -40191 -198028 -188713 -328882 -8881 -323680 -173801 -88752 -341900
18836c41900A44317i3090A6505A553O4995O2638c13241a13138j0929e1477j51378
$$ -341900 144317 -93090 16505 1553 66548 129186 -313241 -113138 -124067 -51477 -202855
18825b02855C386h0212C43704d24651B7895O160q980o016e28672A45827E2031
$$ -202855 3386 -80212 343704 -424651 27895 34055 25075 19059 -528672 145827 52031
18813g8491A69981J72301j07552K2045b66132A00583a8412A96696N2222b63578
$$ -78491 169981 342282 234730 256775 -266132 100583 -18412 196696 248918 -263578
18802A01498k023b19472J07595j8515A35390C3997b12634k47473A52831c45180
$$ 101498 99475 -219472 -111877 -130392 135390 33997 -212634 -460107 152831 -345180
18791B13821A06152l1952c49224a24730E901b23961Q8553A47286b45274j47459
$$ 213821 106152 74200 -349224 -124730 5901 -223961 -135408 147286 -245274 -392733
18781c92733B9040b99904a06585k02015a3161D1046b5387n09626D2776J81102
$$ -392733 29040 -299904 -106585 -308600 -13161 41046 -25387 -535013 42776 223878
18771B23878a39736e5576p382H6103a10768a7710k58298B2597e5855H1919J61309
$$ 223878 -139736 -55576 -62958 86103 -110768 -17710 -276008 22597 -55855 81919 243228
18760B43228b69120d4933o3203j18876A3270b04569a02125C07075A41648h799
$$ 243228 -269120 -44933 -108136 -227012 13270 -204569 -102125 307075 141648 -8799
18749A45886E716J82100a35276A52285N8779o4759a14240j28191b7343q1961C4601
$$ 145886 5716 187816 -135276 152285 211064 146305 -114240 -242431 -27343 -109304 34601
18737A07718c6404a0047p0974D8580a98108c715j29083G6399M5634c8277E697
$$ 107718 -36404 -10047 -81021 48580 -198108 -3715 -132798 76399 122033 -38277 5697
18725h447k13829A71368d64469d6139m8364l3867F3837K43787b4419k11389B30200
$$ -8447 -222276 171368 -464469 -46139 -94503 -128370 63837 307624 -24419 -235808 230200
18713C36558F9852J79533b87714c9394p0983k06605h6786l3162m6368g8001j82449
$$ 336558 69852 249385 -287714 -39394 -110377 -316982 -86786 -119948 -166316 -78001 -260450
18702b60450A44563d0169k13971M4249Q96i7396C06938A6635h1032A23484g3264
$$ -260450 144563 -40169 -254140 -209891 -208995 -97396 306938 16635 -81032 123484 -73264
18690g2458q0445j70348A48493d877k01705B8978c08463C24311E7159a4070H3769
$$ -72458 -152903 -323251 148493 -4877 -206582 28978 -308463 324311 57159 -14070 83769
18678i5956d072l30870H1096M3775h3451A21613a74670j218k11558G9635c54810
$$ -95956 -4072 -334942 81096 124871 -83451 121613 -174670 -175888 -387446 79635 -354810
18666a78777A5490g8197j9245a2618k96732e4078k5932r4943L7539M0703C86577
$$ -178777 15490 -78197 -97442 -12618 -309350 -54078 -80010 -174953 -137414 -96711 386577
18654a9256A27735a77559D114a28006I1988B4961M38453B03426G7770a52186m8601
$$ -19256 127735 -177559 4114 -128006 91988 24961 463414 203426 77770 -152186 -200787
18643b00787A01002b18916C44456b44351D5606A8010K18756j3503b97397D5181
$$ -200787 101002 -218916 344456 -244351 45606 18010 236766 223263 -297397 45181
18632H6534b09692H2393c00741B11403H9056h8008M0313k56113a8531A95426g6799
$$ 86534 -209692 82393 -300741 211403 89056 -88008 -47695 -303808 -18531 195426 -76799
18620a22064A04815b37190Q310J10158k84073B03570c41876h4716A09505a48258
$$ -122064 104815 -237190 -228880 -118722 -402795 203570 -341876 -84716 109505 -148258
18609c5670A53437a41397k17611J30379D2344M4308b53274a23255j4191A51527
$$ -35670 153437 -141397 -359008 -228629 42344 86652 -253274 -123255 -137446 151527
18598a53421E6185c5966K361G7073l7912R9443d0878j83411l6332A6688b635A7693
$$ -153421 56185 -35966 -33605 77073 39161 138604 -40878 -224289 -260621 16688 -2635 17693
18585d09526d4493C1956J87036r8365n1096b36601f0383B06854b44108f4124A38173
$$ -409526 -44493 31956 218992 120627 69531 -236601 -60383 206854 -244108 -64124 138173
18573a67656A33736a1290E7206M9276c7040B25545q9702E9436c19816N5363E248
$$ -167656 133736 -11290 57206 106482 -37040 225545 135843 59436 -319816 -264453 5248
18561h790l7191j08423H9507e6863k0110a331j0883m0069j48925g445j55729A7771
$$ -8790 -45981 -154404 89507 -56863 -76973 -1331 -12214 -52283 -201208 -7445 -163174 17771
18548a65975d0199H3674a90912a5070E7145G467b02184R3246k07817f4828C58774
$$ -165975 -40199 83674 -190912 -15070 57145 7467 -202184 -108938 -316755 -64828 358774
18536C21273c9260H8000j9081b49351e5219A97402b79409a01453j02970B67617
$$ 321273 -39260 88000 68919 -249351 -55219 197402 -279409 -101453 -204423 267617
18525A32347M3403B4277K70134A147Q3064J40411B1149c46251D006f2538C1445
$$ 132347 175750 24277 294411 1147 84211 224622 21149 -346251 4006 -62538 31445
18513b39590e4490A20768J0338J2182a31041b5677k36134B40115b9717B29275
$$ -239590 -54490 120768 131106 143288 -131041 -25677 -261811 240115 -29717 229275
18502a52160g284j43259O618N9356A39057d6743C0302i8828j25189N071h7218
$$ -152160 -7284 -150543 -143925 -84569 139057 -46743 30302 -98828 -224017 -218946 -87218
18490A4017b36586a3782j56835C4527L3646a46j88937e0230g918k117j15568o2269
$$ 14017 -236586 -13782 -170617 34527 68173 -146 -189083 -50230 -7918 -10035 -125603 -187872
18478a87872n6701n1693F7750B875b34894F5161b3926l26357J53162r0632a03685
$$ -187872 -244573 -296266 67750 2875 -234894 65161 -23926 -350283 -197121 -287753 -103685
18466C9335e4037B20949c0476m2066j6271j42132B41601b71889a20479j41517
$$ 39335 -54037 220949 -30476 -72542 -88813 -230945 241601 -271889 -120479 -261996
18456b61996o2131b1143A05999e8897F0179b80273a24362k5864E4630f783k87725
$$ -261996 -324127 -21143 105999 -58897 60179 -280273 -124362 -150226 54630 -6783 -294508
18445b94508E3739c19539f5076A67485a29497A11078a80390n2182D3225R5920
$$ -294508 53739 -319539 -65076 167485 -129497 111078 -180390 -232572 43225 139145
18435A39145d2052k57337a07265J3422k13279B82671C2050a22817j52281J23014
$$ 139145 -42052 -299389 -107265 -93843 -307122 282671 32050 -122817 -275098 -152084
18425a52084j95949b752j55614O8716p7884C5122i6244K2359k67467a69335j64774
$$ -152084 -348033 -2752 -158366 -89650 -167534 35122 -96244 -73885 -341352 -169335 -334109
18414c34109H286a15004n1049g9514k3640A1832a04361c7351p7071j4933D4518
$$ -334109 8286 -115004 -166053 -79514 -103154 11832 -104361 -37351 -114422 -129355 44518
18402i7344E5072J9573c30564B99230I8294a43250C3535A1918a00329j91535d4167
$$ -97344 55072 74645 -330564 299230 98294 -143250 33535 11918 -100329 -291864 -44167
18390G3122b01978i407j89789A82952d13724A59774C5227a40449A72386b9530
$$ 73122 -201978 -9407 -199196 182952 -413724 159774 35227 -140449 172386 -29530
18379C9731j9483b10881J9902C5142b42995B96737D9936e6811j97014k0522A03852
$$ 39731 20248 -210881 -190979 35142 -242995 296737 49936 -56811 -253825 -274347 103852
18367b8172m0246D10429a69891d3234n4423B32268a12942j63490a4440j01470
$$ -28172 -68418 410429 -169891 -43234 -97657 232268 -112942 -276432 -14440 -115910
18357a15910A67569p3372j4755c6619k43549E3976a73474j13693a25925J0153
$$ -115910 167569 94197 79442 -36619 -280168 53976 -173474 -287167 -125925 -115772
18347a15772J9648H2210c21247a54785m175o3683a2739k29483a9753j22691b1431
$$ -115772 -96124 82210 -321247 -154785 -158960 -222643 -12739 -242222 -19753 -142444 -21431
18335H0396a47900o5276j8153A3457J05758J3891D9891A5439b23685k1175d8615
$$ 80396 -147900 -213176 -231329 13457 119215 133106 49891 15439 -223685 -244860 -48615
18323B86416k1454j05814e9664b1215m6015k74597A33251D0851A1439a31474r1855
$$ 286416 264962 159148 -59664 -21215 -67230 -341827 133251 40851 11439 -131474 -223329
18312b23329J08444B7885c66081A7349K4888e0213I4693b27945E4145a11549G0935
$$ -223329 -114885 27885 -366081 17349 42237 -50213 94693 -227945 54145 -111549 70935
18300A47526b0545k87154Q4860A97765p7807a15512L4978j9112E5932g1795E7489
$$ 147526 -20545 -307699 -222839 197765 119958 -115512 -80534 -99646 55932 -71795 57489
18288B16383a11967A91244a38590r8096D85923i3570k18032J42686f8487m2885
$$ 216383 -111967 191244 -138590 -236686 485923 -93570 -311602 -168916 -68487 -111372
18278a11372l36470A16243J15041a12664k25733R5656C7620M9240c4855A57258
$$ -111372 -447842 116243 231284 -112664 -338397 -242741 37620 86860 -34855 157258
18267B0512d93406b08558h3341J9355H4742B1991J72386n0287F2877j5350e2439
$$ 20512 -493406 -208558 -83341 -63986 84742 21991 194377 144090 62877 47527 -52439
18255c23279B9709P149J67800a00062a8434l04290A19406a08968D4429a57532
$$ -323279 29709 36858 204658 -100062 -18434 -322724 119406 -108968 44429 -157532
18244a25767A06426M192b33724g071k36309h0354j86259B06958a59865O4634r3459
$$ -125767 106426 110618 -233724 -7071 -243380 -80354 -266613 206958 -159865 -95231 -188690
18233a88690E7755a97228m414f8453l6954i567j19965j74525a37807j08963O5315
$$ -188690 57755 -197228 -201642 -68453 -105407 -9567 -129532 -304057 -137807 -246770 -181455
18222a81455A1895l576a40564N05I8848l9908M0515M5324d5759k1454A4599a81184
$$ -181455 11895 8319 -140564 -140059 98848 58940 99455 144779 -45759 -67213 14599 -181184
18209d77821E7517h7064k34933J08594d8281C28090D9352h4783K8423j1209A6685
$$ -477821 57517 -87064 -321997 -213403 -48281 328090 49352 -84783 -56360 -67569 16685
18197E919a02131A41655b00185j51340D6992A3544b91655f0607A06403r942e5645
$$ 5919 -102131 141655 -200185 -351525 46992 13544 -291655 -60607 106403 96461 -55645
18185f1880B32157I0422b16145j96556E7651J16174a8956j45645a6550j46111
$$ -61880 232157 90422 -216145 -412701 57651 173825 -18956 -164601 -16550 -162661
18175a62661f0247A63174G1317P483b50234A03493c2013A6346g9491A3146i4821
$$ -162661 -60247 163174 71317 78800 -250234 103493 -32013 16346 -79491 13146 -94821
18163h1563H9756J26072g9830c2850B76915a86958J763M5866I370c9577q8372
$$ -81563 89756 215828 -79830 -32850 276915 -186958 -185195 -139329 9370 -39577 -127949
18152a27949M3782A36140K18425D2605b54404A04003c2159j10861C6746J36408
$$ -127949 -84167 136140 354565 42605 -254404 104003 -32159 -143020 36746 173154
18142A73154a91384E6617R328a57197P1047D3609f8918k06630A21479d968k62100
$$ 173154 -191384 56617 65945 -157197 -86150 43609 -68918 -275548 121479 -4968 -267068
18131b67068q2388d0525k39584A4978L8256b1817A38883A9124L3800a69314A81074
$$ -267068 -349456 -40525 -280109 14978 53234 -21817 138883 19124 52924 -169314 181074
18119b23483A45103a60489A8311a79827g231n4358A68818J86100c95474Q0595
$$ -223483 145103 -160489 18311 -179827 -7231 -61589 168818 354918 -395474 -314879
18109c14879r5792h3684A40563M7409R7904E6050c56267a64733c9843A5113b48601
$$ -314879 -410671 -83684 140563 187972 285876 56050 -356267 -164733 -39843 15113 -248601
18097C1940J52079K4938k5938J15115a50663p6217L8579h4037A53281j2498a27927
$$ 31940 184019 208957 183019 298134 -150663 -226880 -188301 -84037 153281 140783 -127927
18085A02108b06442d7613j0595E5300h5564b9658B95907e9249k17444a0718A15937
$$ 102108 -206442 -47613 -58208 55300 -85564 -29658 295907 -59249 -276693 -10718 115937
18073A66205c37777h6130A59232h9732K162p3061f5892H6322b30518A77903c42129
$$ 166205 -337777 -86130 159232 -89732 -87570 -160631 -65892 86322 -230518 177903 -342129
18061g3881C0646A3725c56749B0595f04803a32134I8964a68292k07720a33A63771
$$ -73881 30646 13725 -356749 20595 -604803 -132134 98964 -168292 -376012 -133 163771
18049c43059H8793e6284B15689c8214A89601a62282o6861J01956k22372c0543
$$ -343059 88793 -56284 215689 -38214 189601 -162282 -229143 -127187 -349559 -30543
18038i0087A773N3992a00395A15365k6979c91603B09587J49272A37846b27583
$$ -90087 1773 55765 -100395 115365 88386 -391603 209587 358859 137846 -227583
18027f7174B13010q8814a06296A77821E6484P2690b81066f5933B93016A05187
$$ -67174 213010 124196 -106296 177821 56484 129174 -281066 -65933 293016 105187
18016a1352k00626R7962E5483K44641a16039j5621l17578a48286d2029k45381
$$ -11352 -211978 -114016 55483 300124 -116039 -131660 -449238 -148286 -42029 -287410
18006b87410F3488j0899M0950h6893k89341g3346k585A97353G5507g2639m45070
$$ -287410 63488 52589 93539 -86893 -376234 -73346 -75931 197353 75507 -72639 -517709
17995e17709I820Q8527O3557a31102A2292J72318b31226A9489K8918b49720h41
$$ -517709 9820 98347 161904 -131102 12292 184610 -231226 19489 48407 -249720 -841
17983b62610q6488a64502L9220a3290D8743a66551a487r7738D4247L54449a40983
$$ -262610 -349098 -164502 -125282 -13290 48743 -166551 -1487 -99225 44247 398696 -140983
17971A36999J51787c92124d399j1334j31078B31957h5841A02133J58860a3917
$$ 136999 288786 -392124 -4399 -15733 -146811 231957 -85841 102133 260993 -13917
17960b40065K8230E4126f3946D9183J20425a9770B60197D2336G400d7177A4855
$$ -240065 -211835 54126 -63946 49183 169608 -19770 260197 42336 7400 -47177 14855
17948b47397M8242C09682a19771C9262e5847A86378p3499f0087p6188l6806k8565
$$ -247397 -199155 309682 -119771 39262 -55847 186378 112879 -60087 -136275 -173081 -201646
17937b01646A64895F3013J44193J17962g6295D724b48205A4387a72719C6076a76505
$$ -201646 164895 63013 207206 325168 -76295 4724 -248205 14387 -172719 36076 -176505
17925F9323K5018b85802M6159d1115a3839n9154l9670d4225C48562a55748D46
$$ 69323 94341 -285802 -239643 -41115 -13839 -72993 -112663 -44225 348562 -155748 446
17913e32669D1695q517i9310n6605A40204a7777j56101k52297F8759a06449j1158
$$ -532669 41695 33178 -99310 -155915 140204 -17777 -173878 -426175 68759 -106449 -117607
17902a17607l4955P4408j2060a3926j24369q7727j26775n8763D4984h3520L7154
$$ -117607 -152562 -78154 -90214 -13926 -138295 -226022 -352797 -411560 44984 -83520 -46366
17891d6366j2209k2394B53247f5230I8257d01695J95748B46782d3871C8417g09
$$ -46366 -58575 -80969 253247 -65230 98257 -401695 -205947 246782 -43871 38417 -709
17879D6017O6631b83403E8151N4314b38662j13528F7710a10104B32999b39877
$$ 46017 112648 -283403 58151 112465 -238662 -352190 67710 -110104 232999 -239877
17868A69203a15757A04038N6825b5490r4043A17511Q373a92133j07348D2226P6181
$$ 169203 -115757 104038 160863 -25490 -119533 117511 125884 -192133 -299481 42226 118407
17857A18407g0939A02813B6873a80814A77395K1999d3133D9191a62065g809m66946
$$ 118407 -70939 102813 26873 -180814 177395 199394 -43133 49191 -162065 -7809 -474755
17846d74755C10199b14151a0505C9189N8787b16112B0245J99059p9832J03700
$$ -474755 310199 -214151 -10505 39189 97976 -216112 20245 219304 139472 243172
17836B43172A3424g6506K1756k52633b8855a3560G1769a64504A74984b18874A14262
$$ 243172 13424 -76506 -54750 -307383 -28855 -13560 71769 -164504 174984 -218874 114262
17824D3617L09402G7965J23304q0139k0066m1355K75511j2269A07762m8645c71463
$$ 43617 353019 77965 201269 121130 101064 59709 335220 322951 107762 59117 -371463
17812c5026D8110J8673b06243A07477g6063J1650A20427Q9618c0079B73463a80543
$$ -35026 48110 66783 -206243 107477 -76063 -64413 120427 210045 -30079 273463 -180543
17800a6597l42458N8517R9911r3478A97777J18237b06667j35629C2330a06551
$$ -16597 -359055 -300538 -200627 -294105 197777 316014 -206667 -342296 32330 -106551
17789a64030r2749a520B02989g6048j6904F4787a65623A64657q930b42689A22995
$$ -164030 -256779 -1520 202989 -76048 -92952 64787 -165623 164657 155727 -242689 122995
17777B6681P5523C3295Q7819C9721K56495G1466J19587j0947a78199e0333A01231
$$ 26681 102204 33295 121114 39721 296216 71466 191053 180106 -178199 -50333 101231
17765G6607b97186C08913g7598I2458a12834D41392A87980J35830C8335e5689
$$ 76607 -297186 308913 -77598 92458 -112834 441392 187980 323810 38335 -55689
17754A40417c1904B83485b63530K0943h6101H5171P4029a88756d144l15230J01936
$$ 140417 -31904 283485 -263530 -242587 -86101 85171 159200 -188756 -4144 -319374 -217438
17743b17438E9984J15964g4899a8486j21672N1163q1807j05588B55852j12956
$$ -217438 59984 175948 -74899 -18486 -140158 -88995 -170802 -276390 255852 142896
17733A42896b10294d5970j19397F0855b24841J01905K8954A42743N4830K8786
$$ 142896 -210294 -45970 -165367 60855 -224841 -122936 -93982 142743 197573 226359
17723B26359A1784m389a96843B77160a33848A21990j4474J82533j05219B4693
$$ 226359 11784 7395 -196843 277160 -133848 121990 107516 290049 184830 24693
17712g0580k80355J05384A11998c40107A68966D8055Q9598j8092f2076B70596
$$ -70580 -350935 -245551 111998 -340107 168966 48055 137653 119561 -62076 270596
17701B45534d1363m11590I0081O6228A6798i6610K5477A63036g5236I1475b23965
$$ 245534 -41363 -452953 90081 156309 16798 -96610 -71133 163036 -75236 91475 -223965
17689A29071d27022B8472j0091e0217C8202c3403j94196D3860c42042C533J6962
$$ 129071 -427022 28472 18381 -50217 38202 -33403 -227599 43860 -342042 3533 20495
17678B0495b45224b7806H8387D3620J06708J20219b62560A10204b27173L4483
$$ 20495 -245224 -27806 88387 43620 150328 270547 -262560 110204 -227173 -192690
17668a92690R2591a1632k33776A24232c818m5503j4491m6324e3049A6501J47021
$$ -192690 -100099 -11632 -245408 124232 -3818 -49321 -63812 -110136 -53049 16501 163522
17657A63522k6913m4124b07680a4617A40956d3263m0734A02340p123C1507a16557
$$ 163522 136609 92485 -207680 -14617 140956 -43263 -83997 102340 95217 31507 -116557
17645B00482a89588A23987n0416L8982a20601q8691j1974a4704j80087a2345B930
$$ 200482 -189588 123987 73571 112553 -120601 -209292 -221266 -14704 -194791 -12345 2930
17633F9310N1868Q4358a81533A89618E0468K82779B7436a55364A85694a401q1442
$$ 69310 121178 205536 -181533 189618 50468 333247 27436 -155364 185694 -1401 -82843
17622h2843j84939b0425I0649j9928J9600J6549J21771o8387J05323p6637F390
$$ -82843 -267782 -20425 90649 70721 90321 106870 228641 160254 265577 188940 6390
17610h4818b6113E9122J32210e7780E7342i8279A58129K44015j36408C102O8273
$$ -84818 -26113 59122 191332 -57780 57342 -98279 158129 402144 265736 3102 71375
17599G1375J11083J34890E7934b49203A67501F4033R2127f2154A37437C5187b22075
$$ 71375 182458 317348 57934 -249203 167501 64033 156160 -62154 137437 35187 -222075
17587I3012Q8272n915c0744A673b62970A31390E8675j8302g1950A39963D0821
$$ 93012 181284 175369 -30744 1673 -262970 131390 58675 40373 -71950 139963 40821
17575B84270a56664P597B40379K8695a43468A56854P4956C4742a24602C90668
$$ 284270 -156664 -149067 240379 269074 -143468 156854 231810 34742 -124602 390668
17564h4383A32197i3957B10647m2170B2970h1977G609e0867f982C78511A55899
$$ -84383 132197 -93957 210647 168477 22970 -81977 7609 -50867 -6982 378511 155899
17552a64037c7190A05438J39736m9583K64666j70622B335J87653a4900A85446
$$ -164037 -37190 105438 245174 195591 460257 289635 2335 189988 -14900 185446
17541D14504e8563I4476M0272F3198J117K3706K7839J83663E9598k3638b8688
$$ 414504 -58563 94476 134748 63198 64315 88021 115860 299523 59598 35960 -28688
17529e1201K3068B09339r7083D9716K29680A19594F021N3402a68769B28027q1908
$$ -51201 -28133 209339 112256 49716 279396 119594 6021 59423 -168769 228027 146119
17518A46119K28609E4473J49747n7778O9309J57163j66461a66955F3455a64441
$$ 146119 374728 54473 204220 146442 215751 372914 206453 -166955 63455 -164441
17507A73384D104L33657a49063B45605a07251m1582O9291K1037K5167A22097D0981
$$ 173384 4104 337761 -149063 245605 -107251 -148833 -79542 -58505 -33338 122097 40981
17495A70592J39222j27672l982J11115K2355q5599o6753a20335M5796B69431C8883
$$ 170592 309814 182142 178160 289275 311630 226031 159278 -120335 -74539 269431 38883
17483B1876a06763H9033C1031a1011k7354k67947b8084C45230A10532Q7100b31871
$$ 21876 -106763 89033 31031 -11011 -38365 -306312 -28084 345230 110532 197632 -231871
17471A9654a85412D29929H2883Q2895K16821I0162b49657A00714J9040N9737a2551
$$ 19654 -185412 429929 82883 165778 382599 90162 -249657 100714 119754 179491 -12551
17459A8928J56840R2333a39423B5696M944J63028k0239l8495N11337k47124o7127
$$ 18928 175768 268101 -139423 25696 30640 193668 173429 134934 646271 399147 332020
17448C32020O0874h6555B97525d7290H1867K09870q8042a41812B16086h1645B00733
$$ 332020 392894 -86555 297525 -47290 81867 291737 203695 -141812 216086 -81645 200733
17436H4273L03079A16504K25567I5972R1907G8315N7936d4009J4366m0901E36452
$$ 84273 387352 116504 342071 95972 187879 78315 136251 -44009 -29643 -70544 536452
17424C48768A54667K98164j89952j03356a46729D52663j6235j16773A03211l7994
$$ 348768 154667 452831 262879 159523 -146729 452663 436428 319655 103211 65217
17414F5217R9357o3744M95610H3370a48769D725R9157J99248c5642A62474J18087
$$ 65217 164574 100830 596440 83370 -148769 4725 103882 303130 -35642 162474 280561
17403B80561I0393J92581r7320q2800D9745b3878A81230J28759m1138b77308C01407
$$ 280561 90393 282974 185654 102854 49745 -23878 181230 309989 268851 -277308 301407
17391C5986j3129J01568a55145A07006f4805C199P2830J97622i8980A09569J03288
$$ 35986 22857 124425 -155145 107006 -64805 3199 76029 273651 -98980 109569 212857
17380B12857F3594Q7220J66419A29701L10917A78052n5932l0508j8095i570E3531
$$ 212857 63594 150814 317233 129701 440618 178052 122120 91612 73517 -9570 53531
17368A98128D7764R1498J4809O1408P0212A7898J08185a29659m2523B82682i8343
$$ 198128 47764 139262 154071 215479 285691 17898 126083 -129659 -172182 282682 -98343
17356B77048d5524H4630J36554b6110C49222L9336E067a24986C10023o5551n0352
$$ 277048 -45524 84630 221184 -26110 349222 388558 5067 -124986 310023 244472 194120
17345A94120K18310B00743J3755O1137q0865A6088J64666O7799H819M4520b93377
$$ 194120 412430 200743 214498 275635 194770 16088 180754 248553 8819 53339 -293377
17333b38248A93452I1002k5225L9907m0193P5698M0875q4172Q9256M18381B44160
$$ -238248 193452 91002 65777 105684 65491 141189 182064 97892 187148 605529 244160
17321A09512K76498A48341K32247d5611a3472C90547B3597J95804G8057H093K30527
$$ 109512 386010 148341 380588 -45611 -13472 390547 23597 219401 78057 8093 238620
17310B38620R6439p7084B2806M41186k05599G4902C6342K76118A37426l5098N7000
$$ 238620 335059 257975 22806 463992 258393 74902 36342 312460 137426 102328 159328
17299A59328L7127n4203J28342J41180j21692B0972J51372C2528K52132C4902
$$ 159328 196455 142252 270594 411774 290082 20972 172344 32528 284660 34902
17288d404B88691l4808J00569F8361K78087d2825C45925f7738E6638M01468F2758
$$ -4404 288691 253883 354452 68361 346448 -42825 345925 -67738 56638 458106 62758
17276A24809a91555B59275B8063N27936j87715B7525g3591A38640M09201j73390
$$ 124809 -191555 259275 28063 555999 368284 27525 -73591 138640 547841 374451
17266C74451k0263b10390C03760a53027F1821b26286G52965B17006E0479e5409
$$ 374451 354188 -210390 303760 -153027 61821 -226286 752965 217006 50479 -55409
17255C36895a82128e1260A64161i9512E9176K6299N2935J04243M9951r8484L8028
$$ 336895 -182128 -51260 164161 -99512 59176 85475 138410 242653 292604 194120 232148
17244B32148e2468A83856m5401F2931L36120q7085j42563J36702B6993K7685N7242
$$ 232148 -52468 183856 138455 62931 399051 311966 169403 306105 26993 54678 111920
17233A11920N50486a73705C07360m9622L1522h9762A48258k6152J7397J37375
$$ 111920 662406 -173705 307360 257738 289260 -89762 148258 122106 139503 276878
17223B76878a43280A25200J02501b1745A94156a1203B61358E1822N8897J15218
$$ 276878 -143280 125200 227701 -21745 194156 -11203 261358 51822 110719 225937
17213B25937L68906k55207J82166k59261Q6084g513B65309E8836J29411a08421
$$ 225937 594843 339636 521802 262541 348625 -7513 265309 58836 188247 -108421
17202B26508J77076j8723r4040Q2105E9087K99806I9701J01320N2800Q2134m0397
$$ 226508 403584 384861 290821 372926 59087 358893 99701 201021 253821 335955 295558
17191B95558n4863C5769L55583q1457J8815O3098B0919J32783K94813A86962L34915
$$ 295558 240695 35769 391352 309895 328710 391808 20919 153702 448515 186962 521877
17180E21877j49768J65273f2253B89967j32082m1628K71960k3203m2208J77930
$$ 521877 372109 537382 -62253 289967 157885 116257 388217 365014 322806 500736
17170E00736k28903M37761C6602K12910N8774i317A95503K21387H7491j2332J76755
$$ 500736 271833 709594 36602 249512 308286 -9317 195503 416890 87491 75159 251914
17159B51914M7641A44909F9035L2633K84850j33931j09339M04723A07762K41436
$$ 251914 299555 144909 69035 101668 386518 252587 143248 547971 107762 349198
17149C49198A67361H0883Q0774J93909j658R9421b70026A14273L37395j08829
$$ 349198 167361 80883 161657 355566 353908 453329 -270026 114273 451668 342839
17139C42839K34419k24554A75918K52427j34287J63538J07644A73254K36835p1751
$$ 342839 577258 352704 175918 428345 294058 457596 565240 173254 410089 338338
17129C38338A59308K42787A35980A0162L70749m4336j11560J85417A56278P0573
$$ 338338 159308 402095 135980 10162 380911 336575 225015 410432 156278 226851
17119B26851K56550B19269O6977N666j13854K96643j36553P1119j5075J91587
$$ 226851 483401 219269 286246 291912 178058 474701 338148 409267 394192 585779
17109E85779B50070p9748J90846m9270K44909j96124j22384k3924P7226O5597
$$ 585779 250070 170322 361168 311898 556807 360683 238299 214375 291601 357198
17099C57198p3990J26676A99339K48020j25124a7440G57992l59468O061j49156
$$ 357198 283208 409884 199339 447359 322235 -17440 757992 398524 404585 255429
17089B55429N4139K98383j97238K12112q1926j08389N4472Q7933l2880p8335q5540
$$ 255429 309568 607951 410713 622825 540899 432510 486982 574915 542035 463700 378160
17078C78160j72781m104K32098J24005G5404K69392L2227J56456r1234q9406L57751
$$ 378160 205379 201275 433373 557378 75404 344796 377023 533479 442245 352839 710590
17067G10590k15348k07757N00581l53988j12117J99433A96397M42677M0667C31141
$$ 710590 495242 287485 788066 434078 321961 521394 196397 639074 679741 331141
17056A97626K96147j82887J97957j2539p2343L7728j14809j02084N10295M8515
$$ 197626 493773 310886 508843 496304 423961 461689 346880 244796 755091 803606
17046H03606l92990j90367k2646J31214l2261O2151J47405j36740l273J98029
$$ 803606 410616 220249 197603 328817 296556 358707 506112 369372 366099 564128
17036E64128j42539M57090l34305q7709j65955J57765M4737K51633j31385P3506
$$ 564128 421589 878679 544374 456665 290710 448475 493212 744845 613460 686966
17026F86966J2114L61472m95657R2699J5914k6756m4176k21719M2420M94637k57532
$$ 686966 699080 1060552 564895 657594 673508 646752 602576 380857 423277 917914 660382
17015F60382p9548B29416M28584l6774q3699m1605J08404j28016K61823M6211
$$ 660382 580834 229416 658000 621226 537527 495922 604326 476310 738133 784344
17005G84344J75959k44234J27210l23749K18801J58798m17042J11506K54047k79241
$$ 784344 960303 716069 843279 519530 738331 897129 480087 591593 845640 566399
16995E66399P4875J25478P0582l06869K48749j16865J45739N9913k86724L14965
$$ 566399 641274 766752 837334 530465 779214 662349 808088 868001 581277 896242
16985H96242j45007Q5944l73524J99105J41704l89908L66039j321k74679K25399
$$ 896242 751235 837179 463655 662760 804464 414556 780595 779274 504595 729994
16975G29994j70982L3842M78221J75006k64570m67793L81559K12996j79883q9639
$$ 729994 559012 592854 1071075 1246081 981511 513718 895277 1108273 928390 838751
16965H38751k71631K41128M32j0025j99313K57744K32763k02079J69401k41063
$$ 838751 567120 808248 808680 798655 599342 857086 1089849 887770 1057171 816108
16955H16108M8970j7189J81718j54804P0275j21109M1388K44103K51230k48500
$$ 816108 865078 847889 1029607 874803 945078 823969 865357 1109460 1360690 1112190
16945A112190J74100l83832K90525k64167K70124j19506K39416l9302O1574j00613
$$ 1112190 1286290 902458 1192983 928816 1198940 1079434 1318850 1279548 1341122 1240509
16935A240509m20869L96775l05768M06062p9725j70286L10204k86855O6522K3348
$$ 1240509 819640 1216415 910647 1316709 1236984 1066698 1376902 1090047 1156569 1179917
16925A179917K22952p8587j34508Q0343K18841j90075M26563l27925l4470K03251
$$ 1179917 1402869 1324282 1189774 1270117 1488958 1298883 1725446 1397521 1363051 1566302
16915A566302j49752l6692k07990M2775J39983M72780l12742j20566J95182n6919
$$ 1566302 1416550 1379858 1171868 1214643 1354626 1827406 1514664 1394098 1589280 1532361
16905A532361M2894J21231m1154j50371R9330K74360J9381k76604m7770J06536
$$ 1532361 1575255 1696486 1655332 1504961 1604291 1878651 1898032 1621428 1573658 1680194
16895A680194J96534k04167K51436l32783K96340K30985l05142m8661J31260j67543
$$ 1680194 1876728 1672561 1923997 1591214 1887554 2118539 1813397 1764736 1895996 1728453
16885A728453M7924K27667q5342J42054r7073l10036N82477m40462K84018R1457
$$ 1728453 1776377 2004044 1918702 2060756 1963683 1653647 2236124 1795662 2079680 2171137
16875B171137k69897J50996K93775J90994k73649J15954M70879o12138L04155
$$ 2171137 1901240 2052236 2346011 2537005 2263356 2379310 2850189 2238051 2542206
16866B542206L6693J24127j66956j05578K65856l57874L29726M2844o1343R1145
$$ 2542206 2578899 2703026 2536070 2430492 2696348 2338474 2668200 2711044 2649701 2740846
16856B740846j9546j75554K30817L67078j73062j34628N33818k08366k51481J99050
$$ 2740846 2721300 2545746 2776563 3143641 2970579 2835951 3369769 3161403 2909922 3108972
16846C108972N81870m07832j65284N612j56402O64368n9206j49107J54262K16849
$$ 3108972 3690842 3283010 3117726 3123338 2966936 3631304 3572098 3422991 3577253 3794102
16836C794102r0346n1726K51386o2153K5780L77980m02139M29421Q1339m3905
$$ 3794102 3703756 3652030 3903416 3841263 3867043 4245023 3842884 4272305 4353644 4309739
16826D309739L5598K17905j80492K50679L15834k04206M91666Q7406j01324P1633
$$ 4309739 4345337 4563242 4382750 4633429 4949263 4745057 5236723 5324129 5222805 5294438
16816E294438k5239j58963K50466N38033j27072j81044M82916j90294O6877K54132
$$ 5294438 5269199 5110236 5360702 5898735 5771663 5590619 6073535 5883241 5950118 6204250
16806F204250J66124m264Q3651N48218J70872k73650N02420Q350K94327L04706
$$ 6204250 6370374 6366110 6449761 6997979 7168851 6895201 7397621 7405971 7700298 8005004
16796H005004L8406J27866L9635O37130q045L47561K6683K03726K88129J66499
$$ 8005004 8043410 8171276 8210911 8848041 8839996 9187557 9214240 9417966 9706095 9872594
16786I872594M35894M38574R3644K26183M52728K68956M57587L85411J44544P29113
$$ 9872594 10308488 10747062 10840706 11066889 11519617 11788573 12246160 12631571 12776115 13505228
16776A3505228N5161M08601P31603N68581K59004M45359O31619M83150P44172
$$ 13505228 13560389 13968990 14700593 15269174 15528178 15973537 16605156 17088306 17832478
16767A7832478L65674P13748Q85950J051413J13867R09263P99949J045189R48614
$$ 17832478 18198152 18911900 19797850 20849263 20963130 21872393 22672342 23717531 24666145
16758B4666145O66457J021037J156692J339226J016863J412357J328486J840988
$$ 24666145 25332602 26353639 27510331 28849557 29866420 31278777 32607263 34448251
16750C4448251J369666J625905J937709K052504J853375K162722K288631K589056
$$ 34448251 35817917 37443822 39381531 41434035 43287410 45450132 47738763 50327819
16742E0327819L079443K943104K922443L354271L830877M076834M272849M634160
$$ 50327819 53407262 56350366 59272809 62627080 66457957 70534791 74807640 79441800
16734G9441800M910110N399873N602447O787989N952893P523016P619726P997814
$$ 79441800 84351910 89751783 95354230 102142219 108095112 115618128 123237854 131235668
16726A31235668Q361554Q710815R075941R413358R532586R119521Q936621P912559
$$ 131235668 139597222 148308037 157383978 166797336 176329922 185449443 194386064 202298623
16718B02298623P261130N932727M867594K841879J500598r85094k503129m131276
$$ 202298623 209559753 215492480 220360074 223201953 224702551 223717457 221214328 217083052
16710B17083052n627047p233654p966997q781160r380656r819544r384227r598617
$$ 217083052 211456005 204222351 196255354 187474194 178093538 168273994 158889767 149291150
16702A49291150r318759q701588q456917q107575p448242o771597o483102o248456
$$ 149291150 139972391 131270803 122813886 114706311 107258069 100486472 94003370 87754914
16694H7754914n673190n128926m550899m510366m383572l291084l663530l023893
$$ 87754914 82081724 76952798 72401899 67891533 63507961 60216877 56553347 53529454
16686E3529454l320971k658477k720886k321389k131922k148262j754970j748876
$$ 53529454 50208483 47550006 44829120 42507731 40375809 38227547 36472577 34723701
16678C4723701j799516j484467j539502j403895j094162j209846j100267r53321
$$ 34723701 32924185 31439718 29900216 28496321 27402159 26192313 25092046 24138725
16670B4138725j414024q16221j044712n13346p57894r09156n75243n11224o86498
$$ 24138725 22724701 21908480 20863768 20350422 19592528 18683372 18108129 17596905 16910407
16661A6910407r06756k22294n42097o17733m21406n00953p56116j63270k28677
$$ 16910407 16003651 15781357 15239260 14621527 14200121 13699168 12943052 12779782 12551105
16652A2551105n12360o31540m15813m8394O4895o70322k09181k42529p35806j89429
$$ 12551105 12038745 11407205 10991392 10942998 11007893 10337571 10128390 9885861 9150055 8960626
16642H960626k9501m50073j834m53304r0525J34994n78180j87987l51890n3484
$$ 8960626 8931125 8481052 8479218 8025914 7935389 8070383 7492203 7304216 6952326 6898842
16632F898842K574j44298k13380q7874j03444m47927R1935J24896m85108k9367
$$ 6898842 6901416 6757118 6543738 6455864 6352420 5904493 5996428 6121324 5636216 5606849
16622E606849j37879r7482m4728l21403n47478N89489k92252j93139l17826j17960
$$ 5606849 5468970 5371488 5326760 5005357 4457879 5047368 4755116 4561977 4244151 4126191
16612D126191J73963q4056k39539J43923q3493k49558K0764n3551j86928j09950
$$ 4126191 4300154 4216098 3976559 4120482 4036989 3787431 3808195 3754644 3567716 3457766
16602C457766O0383m9188k96421L49699k43596l0941j4444n3032k47770l080J77141
$$ 3457766 3518149 3468961 3172540 3522239 3278643 3247702 3233258 3180226 2932456 2929376 3106517
16591C106517m5317n08163R829p8510J00465j01410L1078K28006j90712M4706
$$ 3106517 3061200 2553037 2562866 2484356 2584821 2483411 2514489 2742495 2551783 2596489
16581B596489M0119J57432m15991o9872J90153j73305J48398j07835k8029J07733
$$ 2596489 2636608 2794040 2378049 2308177 2498330 2325025 2473423 2365588 2337559 2445292
16571B445292q0324k81102K414J12245l94614J04568J77898K0699k70570M0676
$$ 2445292 2364968 2083866 2086280 2198525 1803911 1908479 2086377 2107076 1836506 1877182
16561A877182k73448L79910k46018J93759l63685j43700L42936K10738m55051
$$ 1877182 1603734 1983644 1737626 1931385 1567700 1424000 1766936 1977674 1522623
16552A522623M83808n89672N12568o12351J94116J91614l97435K97592l30815
$$ 1522623 2006431 1416759 1929327 1316976 1511092 1702706 1305271 1602863 1272048
16543A272048o4526J45110o6613K62214l23632Q5475j53383J03788k61359m8079
$$ 1272048 1207522 1352632 1286019 1548233 1224601 1310076 1156693 1260481 999122 951043
16533I51043J67349O6314M3012j24333r9158L4610J98314k53222J57144j42686
$$ 951043 1118392 1184706 1227718 1103385 1004227 1038837 1237151 983929 1141073 998387
16523I98387J91146q1057J7329M5398j61007l0395J78181L889l14195J25155J10832
$$ 998387 1189533 1108476 1125805 1171203 1010196 979801 1157982 1161871 847676 972831 1083663
16512A083663l18596M66413l18999n4251J87768j90355M6141Q7886q8716J88049
$$ 1083663 765067 1231480 912481 858230 1045998 855643 901784 989670 900954 1089003
16502A089003q9090l33547J10925J5540j8207K28040k00781J6305l6947P3773
$$ 1089003 999913 666366 777291 792831 774624 1002664 801883 818188 781241 855014
16492H55014C89841L39160N0859j8924q0174j03850Q6204J1105j47966K14663
$$ 855014 389841 729001 779860 760936 680762 576912 663116 674221 526255 740918
16482G40918q8568k7685o4363K2355K80642k22761j80179K88476j51483O4368
$$ 740918 652350 624665 560302 582657 863299 640538 460359 748835 597352 661720
16472F61720j08290J45646k50126j0002J98115K06651l28315j37520K45106L4088
$$ 661720 553430 699076 448950 438948 637063 843714 515399 377879 622985 657073
16462F57073o2909J13094J22464C71063L13710l7182j92894k7195M00082l23644
$$ 657073 594164 707258 829722 371063 684773 647591 454697 427502 827584 503940
16452E03940K10868j04536k77445M37407N7488C87102J23013L52977l57939J6857
$$ 503940 714808 610272 332827 770234 827722 387102 510115 863092 505153 522010
16442E22010k53903r2488L05965M2159k48762Q0837L68540A91425P41525B75990
$$ 522010 268107 175619 481584 523743 274981 355818 724358 191425 932950 275990
16431F89114A91123J16826j9110K84793m2508k39618K5548K66612j92277A31000
$$ 689114 191123 307949 288839 573632 531124 291506 317054 583666 391389 131000
16420F40713J09593J30286D24124N4461K07248A84431J97020B3231L48765R0123
$$ 640713 750306 880592 424124 478585 685833 184431 381451 23231 371996 462119
16410D62119B5038O38975j84194A90825K04391j95682L5684J51420A34848M29846
$$ 462119 25038 664013 479819 190825 395216 199534 235218 386638 134848 564694
16400E64694j01712j95095p0322j4936O4883a31074b6B19473K73922k11415L5773
$$ 564694 462982 267887 197565 182629 247512 -131074 -26 219473 493395 281980 317753
16389C17753n6371J9221N1559A40623L2452J46500K37699k29368j23256r7872
$$ 317753 261382 280603 332162 140623 173075 319575 557274 327906 204650 106778
16379A06778J68638j11487R8815J19993L71445B11559j05598N6369J55795K20391
$$ 106778 275416 163929 262744 382737 754182 211559 105961 162330 318125 538516
16369E38516B36738L35529B04562n1050B4921L84181J19754A22553L80450D2898
$$ 538516 236738 572267 204562 153512 24921 409102 528856 122553 503003 42898
16358I1000K6154o839a48920E39540j28913J25765B21098J91018O579A46720J24879
$$ 91000 117154 110315 -148920 539540 410627 536392 221098 412116 418695 146720 271599
16347B71599h7146B05640K23471C8947J7855a45114A44440K95589L2682A67102
$$ 271599 -87146 205640 429111 38947 56802 -145114 144440 440029 472711 167102
16336g0965C12033A48267n1835J62002J7929L1614d2056G3056p46J31980J50637
$$ -70965 312033 148267 96432 258434 276363 307977 -42056 73056 72310 204290 354927
16325C54927q487j8479m6108g1262A33109J29072I4584l0955L86001F4628J21232
$$ 354927 346440 327961 281853 -71262 133109 262181 94584 63629 449630 64628 185860
16314A85860P8017a1942m089B76616p9970k5895J27523N1946J8186p7828J12319
$$ 185860 263877 -11942 -16031 276616 196646 170751 298274 350220 368406 290578 402897
16303D02897C8145J88285K55814A87708J27262A44645K6433b8379D76183k6317
$$ 402897 38145 226430 482244 187708 314970 144645 171078 -28379 476183 449866
16293D49866b76660A33358L62851k03140N043k146H1026M75741B26135a03137
$$ 449866 -276660 133358 496209 293069 298112 295966 81026 556767 226135 -103137
16282B2994a54584C48280A52770N23393B9915K08563M1085L4144g2499D61114
$$ 22994 -154584 348280 152770 676163 29915 238478 279563 313707 -72499 461114
16271C63611N0467F2858L33411A6743J19669r378J75923I2420c12089A62094Q340
$$ 363611 414078 62858 396269 16743 136412 127034 302957 92420 -312089 162094 170434
16260A70434j2327J8261N0027i5892b4603B91794E3738J86041H4834O3984k8746
$$ 170434 158107 176368 226395 -95892 -24603 291794 53738 239779 84834 148818 120072
16249A20072K3012a846D08449j40727D8943O6313a59047A91025k8217d99B56246
$$ 120072 143084 -1846 408449 267722 48943 115256 -159047 191025 162808 -499 256246
16237a05016l1827r3468i5866A51904C1199A1810e1774B932K29597j14191L864
$$ -105016 -136843 -230311 -95866 151904 31199 11810 -51774 2932 232529 118338 122202
16226A22202K42287H294c90555M1830F2043f3590B81041n6445P4672b20576B4002
$$ 122202 364489 8294 -390555 -348725 62043 -63590 281041 224596 299268 -220576 24002
16214c43950A33851d3632j16459A56843c18982g199k6199B3g9889E3818Q0654
$$ -343950 133851 -43632 -160091 156843 -318982 -7199 -33398 23 -79889 53818 134472
16203A34472k9383o425a31513L2148B06792n6293m2546L10648j40533e4006C75493
$$ 134472 105089 98664 -131513 -99365 206792 150499 107953 418601 278068 -54006 375493
16191A30701g6388E8928a86148B272b9243A28695L8348e1149B09004f3444q4477
$$ 130701 -76388 58928 -186148 2272 -29243 128695 167043 -51149 209004 -63444 -147921
16180a47921B18527b33527J03131M2712j55959B89455A03021a15971e206k05987
$$ -147921 218527 -233527 -130396 -87684 -243643 289455 103021 -115971 -5206 -211193
16170b11193O2510C57083C1801b91240B12550a75207B2218d1875B04923C9678
$$ -211193 -148683 357083 31801 -291240 212550 -175207 22218 -41875 204923 39678
16159A39380l8598J28765a39129G5055a80545B46625a39068B9212i4768C59840
$$ 139380 100782 229547 -139129 75055 -180545 246625 -139068 29212 -94768 359840
16148D1852J61899e7001o2412B02127a32704L8658D4952B2468h7092C74051i6875
$$ 41852 203751 -57001 -119413 202127 -132704 -94046 44952 22468 -87092 374051 -96875
16136A83491b15922C36904A07400b78642k01495a3477f344p6495B23067c9932
$$ 183491 -215922 336904 107400 -278642 -480137 -13477 -6344 -82839 223067 -39932
16125G4024m665a18908c1045A51545a13033E2544c5757A21282b2652k13289E9330
$$ 74024 69359 -118908 -31045 151545 -113033 52544 -35757 121282 -22652 -235941 59330
16113e6467K2713B26859a32626d8798B3856O7649B9120K83709i5974M3666l8741
$$ -56467 -33754 226859 -132626 -48798 23856 91505 29120 312829 -95974 -52308 -91049
16102i1049A41615K93701p0974c1671A84215E5803j008J33570a5111o4198q2343
$$ -91049 141615 435316 364342 -31671 184215 55803 54795 188365 -15111 -79309 -161652
16091a61652D4715a57944A81574a3907q8834l37795a29943B92387e4974j44939
$$ -161652 44715 -157944 181574 -13907 -102741 -440536 -129943 292387 -54974 -199913
16081a99913g1461b8278A5965L78417G1208g0981j1189J7746E057g3536r0223
$$ -199913 -71461 -28278 15965 394382 71208 -70981 -82170 -64424 5057 -73536 -163759
16070a63759A78695c2741A9585a40393M5014O269H1430a92473A93149b41675F3051
$$ -163759 178695 -32741 19585 -140393 -95379 -89110 81430 -192473 193149 -241675 63051
16058D9278J57775a97684A85754H8215f0430F3988a99899j10281h0030o54I3903
$$ 49278 207053 -197684 185754 88215 -60430 63988 -199899 -310180 -80030 -80684 93903
16046f6360A09967J35427C5348a999q6866B53415a23302M630H334c52517B87867
$$ -66360 109967 245394 35348 -1999 -88865 253415 -123302 -118672 8334 -352517 287867
16034b59425f6243B69277B911b04758i0227N822k29014B0393M6586b3556q5084
$$ -259425 -66243 269277 2911 -204758 -90227 -84405 -313419 20393 66979 -23556 -108640
16023a08640B42078a85892o9115A99860h3426I6293b68911g1535A1387Q5658b43788
$$ -108640 242078 -185892 -255007 199860 -83426 96293 -268911 -71535 11387 97045 -243788
16011a06532o3224b2916k7611l9081D76952k36650c0185A91244F031b10948g0983
$$ -106532 -169756 -22916 -50527 -89608 476952 240302 -30185 191244 6031 -210948 -70983
15999D6697B2133N4071b12371e2820r8353o7493A79960C7532d5610k54941J12631
$$ 46697 22133 76204 -212371 -52820 -151173 -218666 179960 37532 -45610 -300551 -187920
15988a87920a7213m6305k31942n5155a12732e0062k7583A7886J29850J0873g7461
$$ -187920 -17213 -63518 -295460 -350615 -112732 -50062 -77645 17886 147736 158609 -77461
15976B34676j16809J22122G1105b17952A93754m5060a20588j4788C19213j21347
$$ 234676 117867 239989 71105 -217952 193754 148694 -120588 -135376 319213 197866
15966A97866a18633M9473j62783m3583B10937m2453p8611a6917A93581J09090
$$ 197866 -118633 -69160 -231943 -275526 210937 168484 89873 -16917 193581 302671
15956C02671I8018r238c6138j33692g5422k4743C14294C3811i0817p7748K8704
$$ 302671 98018 88780 -36138 -169830 -75422 -100165 314294 33811 -90817 -168565 -139861
15945a39861b2009B05148b6981k04947e2361b016m9867n2493l35694a44705D0341
$$ -139861 -22009 205148 -26981 -231928 -52361 -2016 -51883 -104376 -440070 -144705 40341
15933b20503j10342A68577H3609g1471q8871L6612n5067k52221c5595j63441O3980
$$ -220503 -330845 168577 83609 -71471 -160342 -123730 -178797 -431018 -35595 -199036 -135056
15922a35056N8615k69924a67250g9529C1113J53815q1379J44553G7584A3262g9195
$$ -135056 -76441 -346365 -167250 -79529 31113 184928 103549 248102 77584 13262 -79195
15910b10328G831b58008J08763K0426A58732a95689q9710j28834e9058a6096B6917
$$ -210328 7831 -258008 -149245 -128819 158732 -195689 -285399 -414233 -59058 -16096 26917
15898c8885A88368q0188e2938C8014f3969A20470h7799A35872c0852q7707A01644
$$ -38885 188368 108180 -52938 38014 -63969 120470 -87799 135872 -30852 -118559 101644
15886g1438k5018K6519j82224A15235b02877d0860l72102e5394m5321j05988A56710
$$ -71438 -96456 -69937 -252161 115235 -202877 -40860 -412962 -55394 -100715 -206703 156710
15874B41892g7955j43098A38927R0421c91726b8284E1527c01238i5064l0838G5461
$$ 241892 -77955 -221053 138927 229348 -391726 -28284 51527 -301238 -95064 -125902 75461
15862A10467c95507C5298i2630L7582G6117a46691C4485e8740a4766k7975k39839
$$ 110467 -395507 35298 -92630 -55048 76117 -146691 34485 -58740 -14766 -42741 -282580
15851b82580D2917J7787a84939B48302n9166a19672A5494M8452d9500r9581q5616
$$ -282580 42917 60704 -184939 248302 189136 -119672 15494 63946 -49500 -149081 -234697
15840b34697g0214B755J62550b22306H370J51458C5293b86559E5242c05164A65619
$$ -234697 -70214 2755 165305 -222306 8370 159828 35293 -286559 55242 -305164 165619
15828B38356B6215J21678o623g7035j4344d2311j88550a02763j23329I5707b61063
$$ 238356 26215 147893 141270 -77035 -91379 -42311 -230861 -102763 -226092 95707 -261063
15816A64298l6603O2884h7157A80097a01741J7041K0031m7276C23973B3151a01165
$$ 164298 127695 190579 -87157 180097 -101741 -84700 -64669 -111945 323973 23151 -101165
15804b11577B43698e589k08251j94355C32944j17209j7725n4534E7489d9762k69240
$$ -211577 243698 -5589 -213840 -408195 332944 215735 198010 143476 57489 -49762 -319002
15793c19002a37158A42497i3438j28413l6515h0453B52208A4272a67094B46087
$$ -319002 -137158 142497 -93438 -221851 -258366 -80453 252208 14272 -167094 246087
15782A05868a28585k0712A27118b14932C93453j32418j20411m498m5429b09095
$$ 105868 -128585 -149297 127118 -214932 393453 261035 140624 136126 90697 -209095
15771i7180G0741b72941E9841a83922J148e3992A386a69558O9018m1557r7238
$$ -97180 70741 -272941 59841 -183922 -182774 -53992 1386 -169558 -100540 -142097 -239335
15760b39335a6411q487m2708a7750j50055A4999a40290A7848i0228J413C26599
$$ -239335 -16411 -24898 -67606 -17750 -167805 14999 -140290 17848 -90228 -88815 326599
15748g6061p537C40718d56365D607c79892d5465B22366a33390j99638G4764J7243
$$ -76061 -83598 340718 -456365 4607 -379892 -45465 222366 -133390 -333028 74764 92007
15737I2007b01477i2651F2885A6890h7518D56184c8765l45876d6363n7947q1130
$$ 92007 -201477 -92651 62885 16890 -87518 456184 -38765 -384641 -46363 -104310 -185440
15726a85440P9500o3165L7283b5173j67666c3778k37019B06974M8149e5583r5671
$$ -185440 -105940 -169105 -131822 -25173 -192839 -33778 -270797 206974 255123 -55583 -151254
15715a51254Q052E3693a93355b0494C49287h0378A0200a14648k1303K9491M6530
$$ -151254 -143202 53693 -193355 -20494 349287 -80378 10200 -114648 -135951 -106460 -59930
15704e9930a707j84642L6421j12687O7718J6560E1226c16082A65210a05249B67223
$$ -59930 -1707 -186349 -149928 -262615 -194897 -178337 51226 -316082 165210 -105249 267223
15692C8734c8831l5557A3712Q2816M9346f6968A70254a48745j90350J60010B4643
$$ 38734 -38831 -74388 13712 96528 145874 -66968 170254 -148745 -339095 -179085 24643
15680b77170O0766A1301G30a41176A72732d5653E8575h3304C0498F715b09041
$$ -277170 -216404 11301 730 -141176 172732 -45653 58575 -83304 30498 6715 -209041
15668A42161L0445b27074B15715B3601d49479h016D0563J89457k1478g0495G1922
$$ 142161 172606 -227074 215715 23601 -449479 -8016 40563 230020 208542 -70495 71922
15656A11797e2688a0496I2789d8732A8700a26366O0430D9283c6653D8472g4248
$$ 111797 -52688 -10496 92789 -48732 18700 -126366 -65936 49283 -36653 48472 -74248
15644b41203O2932h6522k76927j19880F1008b23501a7657E3314q185a48715D5080
$$ -241203 -178271 -86522 -363449 -483329 61008 -223501 -17657 53314 45129 -148715 45080
15632F7319a5957A39079K0676b23997d252k19590d6725j88395G8739h1549r3718
$$ 67319 -15957 139079 159755 -223997 -4252 -223842 -46725 -235120 78739 -81549 -175267
15621a75267k3918H7693e5757j62143J08280A8153J74394l0900n9377a6847l2309
$$ -175267 -199185 87693 -55757 -217900 -109620 18153 192547 161647 102270 -16847 -49156
15610d9156q638J5810A95872c88861f676A18999i6198n8732B34751c4590k26367
$$ -49156 -57794 -41984 195872 -388861 -6676 118999 -96198 -154930 234751 -34590 -260957
15599b60957c4005A08913o076J17338f4262A19127k4281a30175n8943N0853j52732
$$ -260957 -34005 108913 102837 220175 -64262 119127 94846 -130175 -189118 -138265 -290997
15588b90997J27226j06668I0696a66601j6916j56991H0682i8640l00364I508e0332
$$ -290997 -163771 -270439 90696 -166601 -183517 -340508 80682 -98640 -399004 9508 -50332
15576a12524G1623Q5855e0208n33975g2490B8720J45226P0413K16192E0387L002
$$ -112524 71623 157478 -50208 -584183 -72490 28720 173946 244359 460551 50387 53389
15565E3389a78969F7573L40881G2439L96438E2712g2287C55812g338l55561D5258
$$ 53389 -178969 67573 408454 72439 468877 52712 -72287 355812 -7338 -362899 45258
15553A25611e17474A24993n5744K6678a31261j03146E4539A4743a59366A24764
$$ 125611 -517474 124993 69249 95927 -131261 -234407 54539 14743 -159366 124764
15542B924b21197I2165a85623B65793k220j520q5733O9751o3929K7854m556a33295
$$ 2924 -221197 92165 -185623 265793 263573 262053 176320 246071 182142 209996 205440 -133295
15529f1698q6746a2176A34922N8634l7083e7557A84524H9424b5684A26373a39932
$$ -61698 -148444 -12176 134922 193556 156473 -57557 184524 89424 -25684 126373 -139932
15517A4766a62458B31763d9706k06105j6276J23059A30887L0482a18785A74086
$$ 14766 -162458 231763 -49706 -255811 -272087 -149028 130887 161369 -118785 174086
15506i1097j1118c9132A81786n2736c3925E2126b08782A38735a1428j63686j61078
$$ -91097 -102215 -39132 181786 129050 -33925 52126 -208782 138735 -11428 -175114 -336192
15495c36192D1564Q6308J02451L2821A4815b7560F0742a05318j70745E3021b43718
$$ -336192 41564 127872 230323 263144 14815 -27560 60742 -105318 -276063 53021 -243718
15483d39933g037j21517b7957q3206B47644a34602e6045k87532B48588n2576a32183
$$ -439933 -7037 -128554 -27957 -111163 247644 -134602 -56045 -343577 248588 196012 -132183
15471B88835f1726A26037f8911j23524p1626A12564I322K7678N5217J92785g9659
$$ 288835 -61726 126037 -68911 -192435 -264061 112564 9322 37000 92217 285002 -79659
15459f0361A18049K11923a53740P3073j3960H0665G62d7479C12036b02530A52839
$$ -60361 118049 329972 -153740 -80667 -94627 80665 762 -47479 312036 -202530 152839
15447C5491a00489L6530B5421d3730r711A08561l0632O6588c11676d7814m52571
$$ 35491 -100489 -63959 25421 -43730 -53441 108561 77929 144517 -311676 -47814 -500385
15436e00385A23487a14654j01499A87956M771K44427h3599O879A05465a91850
$$ -500385 123487 -114654 -216153 187956 192727 437154 -83599 -76720 105465 -191850
15425G2671a27868A20248J2263b45310b3655n3795l7217A40537b84820Q3593I9458
$$ 72671 -127868 120248 132511 -245310 -23655 -77450 -114667 140537 -284820 -201227 99458
15413G1257a53923J5984j52083b0713l1325j29632A20495b62894A300a9922r5537
$$ 71257 -153923 -137939 -290022 -20713 -52038 -181670 120495 -262894 1300 -19922 -115459
15402a15459R708A04406O0483J45846A33759m1092a11988n732k00835M1731B8382
$$ -115459 -105751 104406 164889 310735 133759 92667 -111988 -117720 -318555 -276824 28382
15390G9331J44137a22044B28258a74701B28812c919l18159J11640K6682E9925
$$ 79331 223468 -122044 228258 -174701 228812 -3919 -322078 -210438 -183756 59925
15379C25156e4011j05279d7541A8409d0637A40935k2095R9229m8121o0943a99600
$$ 325156 -54011 -159290 -47541 18409 -40637 140935 118840 218069 169948 109005 -199600
15367B82583c0675k6936j44810A89045p2605J41749A9542J73242F4145J0761a85289
$$ 282583 -30675 -57611 -202421 189045 116440 258189 19542 192784 64145 74906 -185289
15355A18918b31668B11683b1573A77477c2125l94671C83580a35676A84443c8973
$$ 118918 -231668 211683 -21573 177477 -32125 -426796 383580 -135676 184443 -38973
15344C7836e6519B51481b8939j08595N1980B97517A42619M5484G0669K57584j30593
$$ 37836 -56519 251481 -28939 -137534 -85554 297517 142619 188103 70669 328253 197660
15333A97660B9900e9880r2496B9503a71744o6756B23833b79440k08941f7572C86552
$$ 197660 29900 -59880 -152376 29503 -171744 -238500 223833 -279440 -488381 -67572 386552
15321A58765b03353L6077p4399L3469C32699A35292a43166C2123B521g9376H6334
$$ 158765 -203353 -167276 -241675 -208206 332699 135292 -143166 32123 2521 -79376 86334
15309A08707J6926a39443B13577b1234A69251D5206a13703G3284J58589f4173
$$ 108707 125633 -139443 213577 -21234 169251 45206 -113703 73284 231873 -64173
15298b53090b4412m4257j47207Q8905a0484C8835L6720B8882b3692F5106k3012
$$ -253090 -24412 -68669 -215876 -126971 -10484 38835 75555 28882 -23692 65106 42094
15287D2094o851a1618C30898A53918O7248L9733A3758R6290J41224B0999e5012
$$ 42094 35243 -11618 330898 153918 221166 260899 13758 110048 251272 20999 -55012
15275b71061g9320F3630J60219b74724I8414d377A96082i8102C47154j45279K506
$$ -271061 -79320 63630 223849 -274724 98414 -4377 196082 -98102 347154 201875 204381
15264B04381a83674a7516j3122H2394K07438r4940P601K36358j61545I5746N7397
$$ 204381 -183674 -17516 -30638 82394 289832 194892 202493 438851 277306 95746 153143
15253A53143f3173I221L81582a34147A25594J97659j43822K60371J472045P07224
$$ 153143 -63173 9221 390803 -134147 125594 323253 179431 439802 1911847 2619071
15243B619071j014752J050840l71546G23920l48696j75981k9108P8735J84941
$$ 2619071 1604319 2655159 2283613 723920 375224 199243 170135 248870 433811
15234D33811G242a20359B58653E0382Q0181J06874c6062A30922M8594E1416c41335
$$ 433811 7242 -120359 258653 50382 130563 237437 -36062 130922 179516 51416 -341335
15222i7510A40694J1439F2021a7471A50355E0895K8522O9651D0304K95570o8311
$$ -97510 140694 152133 62021 -17471 150355 50895 79417 149068 40304 335874 267563
15211B67563r7051h4097G2094a01336A1981K64172E6873N8092K3386M8186g103
$$ 267563 170512 -84097 72094 -101336 11981 276153 56873 114965 138351 186537 -7103
15199B44806j11386a93281C5728L0925J24514g0797j03863B9700J7462a09253
$$ 244806 133420 -193281 35728 66653 191167 -70797 -174660 29700 47162 -109253
15188G9782d2472F0236J58314F3001a01661G0794a3626E8774b12612B23664B6524
$$ 79782 -42472 60236 218550 63001 -101661 70794 -13626 58774 -212612 223664 26524
15176B03095d6346B16096D0270i8013A27469L8411C2243d2418j38826A80143o2503
$$ 203095 -46346 216096 40270 -98013 127469 165880 32243 -42418 -181244 180143 117640
15165A17640a9205I5696I604J11825a89154C42463c5190j74372G4423K90369D5165
$$ 117640 -19205 95696 9604 121429 -189154 342463 -35190 -209562 74423 364792 45165
15153c885k03691A6434L36630A28841O2609P2238a30345D23150A29103k6401N6759
$$ -3885 -207576 16434 353064 128841 191450 263688 -130345 423150 129103 102702 159461
15142A59461K447A5948J4748d7852j3891i560A47040c4926A674g4394A80500j8812
$$ 159461 161908 15948 30696 -47852 -61743 -9560 147040 -34926 1674 -74394 180500 161688
15130A61688F7196b11997B53829A19201c7786B03403M7642j12567M0202p5018
$$ 161688 67196 -211997 253829 119201 -37786 203403 251045 138478 178680 103662
15120A03662K6909J14844p2935G2762r220M04551k23821b0118B94569j9418p1993
$$ 103662 130571 245415 172480 72762 63542 468093 244272 -20118 294569 275151 203158
15109B03158E948b15432D15151j15632k9170a69105k9213A54750J42638H0692
$$ 203158 5948 -215432 415151 299519 270349 -169105 -198318 154750 297388 80692
15098A66247R5496a86641E0145J95698a76929A1556b00657B78367a12253B31495
$$ 166247 261743 -186641 50145 245843 -176929 11556 -200657 278367 -112253 231495
15087A42952E5569q816L01178e2823C9318M12612A46152o0035N8123a05335C98334
$$ 142952 55569 46753 347931 -52823 39318 451930 146152 86117 144240 -105335 398334
15075C61617j61834J16964a04045F14901A95265e5100B09419L21879B59079b06854
$$ 361617 199783 316747 -104045 614901 195265 -55100 209419 531298 259079 -206854
15064A46712K01656d2906A53014A8578J32783J87741J6692A63082G3538a16410
$$ 146712 348368 -42906 153014 18578 151361 339102 355794 163082 73538 -116410
15053F34639B56877b31208D79841A41169o5400M1207J93923A31320c36680F7628
$$ 634639 256877 -231208 479841 141169 75769 116976 310899 131320 -336680 67628
15042A0720d0599B43706J19436C9693L48690C4422K74885m7632L9367b4233D65810
$$ 10720 -40599 243706 363142 39693 388383 34422 309307 261675 301042 -24233 465810
15030i8121Q296A48166K63285k00950R1836R3544p7246E6236g5977B18880r7995
$$ -98121 -89825 148166 411451 210501 302337 395881 318635 56236 -75977 218880 120885
15019A20885B5583J17993M2876K68376B07634J93758L5453r0770J11871d7780
$$ 120885 25583 143576 186452 454828 207634 401392 436845 346075 457946 -47780
15008A56252L4201K29744A43858d4975C3831J61530M6471a68518D8072J9632K47511
$$ 156252 190453 420197 143858 -44975 33831 195361 241832 -168518 48072 67704 315215
14997C15215k4069L3325F5109c09470F85562B40221J12655j29243a9055j62213
$$ 315215 291146 324471 65109 -309470 685562 240221 352876 223633 -19055 -181268
14987a81268g6603B63644R4656m2823N0372j07603a22534C9747L78885j84412
$$ -181268 -76603 263644 358300 315477 365849 258246 -122534 39747 418632 234220
14977B34220J04297A07154b87507C87449K0530k00292b2172B55749O1260p554
$$ 234220 338517 107154 -287507 387449 407979 207687 -22172 255749 317009 309455
14967C09455C6477K20619l3964K05493j03828P6698j44895a00687D11389R4909
$$ 309455 36477 257096 223132 428625 324797 401495 256600 -100687 411389 506298
14957E06298A82587J72868o777o7500K06551g6295c7099A80295K77194J68757
$$ 506298 182587 355455 348678 281178 487729 -76295 -37099 180295 457489 626246
14947F26246K96540D12633K3138A33622J35788m308j27706K69471j23590E1246
$$ 626246 922786 412633 435771 133622 269410 265102 137396 406867 283277 51246
14936H5522Q7962J5130G2126N0439K531L80633B09678q781K04684l4185A21825
$$ 85522 173484 188614 72126 122565 125096 505729 209678 200897 405581 371396 121825
14924D46093J68559j96138p9118q4101r4649K41756r5910O8495j41914K16552
$$ 446093 614652 418514 339396 255295 160646 402402 306492 374987 233073 449625
14914D49625A79048K39681m0328j40730J85J10678I8995K02987A22585K41048
$$ 449625 179048 418729 378401 237671 237856 348534 98995 301982 122585 363633
14904C63633j66880L42930A64298M81635A27595M63779A88527j0314J82759M5770
$$ 363633 196753 539683 164298 645933 127595 591374 188527 178213 360972 406742
14894D06742O3251J25070B53438K4275J70475J9130L2069q4590n1289J28362k30858
$$ 406742 469993 595063 253438 277713 448188 467318 499387 414797 363508 491870 261012
14883B61012j13585A3044K33407K6682O7434j35866J65567M07557l06876j88630
$$ 261012 147427 13044 246451 273133 340567 204701 370268 777825 470949 282319
14873B82319J69589A35131K12324K0298m8406m4611L32362L6096k41073M6729
$$ 282319 451908 135131 347455 367753 319347 274736 607098 643194 402121 448850
14863D48850J07146j25984r6130L70845k75755A35046K46684j3264a33145D17525
$$ 448850 555996 430012 333882 704727 428972 135046 381730 368466 -133145 417525
14852B89462m4843K46715l6433M760j67935K77769k34520J95284n2872J0241o4966
$$ 289462 244619 491334 454901 459661 291726 569495 334975 530259 477387 487628 422662
14841D22662J57431j52357j98076J74400J01619l9225r0868m0664R1525K51749
$$ 422662 580093 427736 229660 404060 505679 466454 375586 334922 426447 678196
14831F78196l07085j30855J11621R5092J06463m3015A52741J46599J71472n6266
$$ 678196 371111 240256 351877 446969 553432 510417 152741 299340 470812 414546
14821D14546J55315K32708m2724l28258L5462l1863K91948j26493j08430M2659
$$ 414546 569861 802569 759845 431587 467049 435186 727134 600641 492211 534870
14811E34870j23986J07070J0248M5520n6770J70072j77728L34260l84430J33159
$$ 534870 410884 517954 528202 573722 516952 687024 509296 843556 459126 592285
14801E92285o2067j59709K40439k15311J29843k06437J64281j72979J98240j80299
$$ 592285 530218 370509 610948 395637 525480 319043 483324 310345 508585 328286
14791C28286N3581P3528K49722l45684M18475l54681L37962Q0785j14163M2496
$$ 328286 381867 455395 705117 359433 777908 423227 761189 841974 727811 770307
14781G70307j79959q1249j92812L24981o5303Q5492j41808N3930R3168m8722k1563
$$ 770307 590348 509099 316287 641268 575965 661457 519649 573579 666747 618025 596462
14770E96462J48264j33517K42158k11522j02391J61322j51049j26194R7360K17926
$$ 596462 744726 611209 853367 641845 539454 700776 549727 423533 520893 738819
14760G38819k03702J58097M9276j90705J85064l17754J89286J59425j73871K87130
$$ 738819 535117 693214 742490 551785 736849 419095 608381 767806 593935 881065
14750H81065j80297L87575k82077M7680j0860j16976J90652C56569M58733n2631
$$ 881065 700768 1088343 806266 853946 843086 726110 916762 356569 815302 762671
14740G62671n460j12549K54610j67176j82290K34517k29394N1388J29303M03396
$$ 762671 757211 644662 899272 732096 549806 784323 554929 606317 735620 1139016
14730A139016k29120j00778P1171J50919C80061P60054k20368J30611l17961J83751
$$ 1139016 909896 809118 880289 1031208 380061 1140115 919747 1050358 732397 916148
14720I16148J5926o8281j63300N02621D69509N33358k46225J86663o2486l08468
$$ 916148 932074 863793 700493 1203114 469509 1002867 756642 943305 880819 572351
14710E72351J00590K81791q8714j28662J02671m5732J92829l1849j6390J52695
$$ 572351 672941 954732 866018 737356 840027 794295 987124 955275 938885 1091580
14700A091580j36615J18967J20083m34537J76247j04516K74492J31277k57976
$$ 1091580 954965 1073932 1194015 759478 935725 831209 1105701 1236978 979002
14691I79002J89557O8207m42839K28038Q4087J39194k90641K33102j40437k6880
$$ 979002 1168559 1236766 793927 1021965 1106052 1245246 954605 1187707 1047270 1020390
14681A020390L9050l91529L36532Q5942J37905l26080k141K91077K20532o67903
$$ 1020390 1059440 667911 1004443 1090385 1228290 902210 900069 1191146 1411678 743775
14671G43775K33307O59795n09797J48651L1961K8438j27202m77801K21563K2494
$$ 743775 977082 1636877 1127080 1275731 1307692 1336130 1208928 731127 952690 975184
14661I75184O44798m56294j12364K56642l96195N21445l74999J49189j73248J57940
$$ 975184 1619982 1163688 1051324 1307966 911771 1433216 1058217 1207406 1034158 1192098
14651A192098j10697K28183R0101j92422K0574L98491l37368K25238j4936l58113
$$ 1192098 1081401 1309584 1399685 1207263 1227837 1626328 1288960 1514198 1499262 1141149
14641A141149J10216m4982O7881M7404k76307L32199k19139N13137k77903n7214
$$ 1141149 1251365 1206383 1274264 1321668 1045361 1377560 1158421 1671558 1393655 1336441
14631A336441J81397m66372O45970P2132l10836J6938O8778k38067l6198M42748
$$ 1336441 1517838 1051466 1697436 1769568 1458732 1475670 1544448 1306381 1270183 1712931
14621A712931j54840j0306K09380k4914N4400J52513k01888J02934J0649j83931
$$ 1712931 1558091 1547785 1757165 1732251 1786651 1939164 1737276 1840210 1850859 1666928
14611A666928K51180l75536J36105J56466k73881J39828k45624M22629l78587
$$ 1666928 1918108 1542572 1678677 1835143 1561262 1701090 1455466 1878095 1499508
14602A499508M37698k76227L53614j72672j19168J00859j36618j0374M17841R4336
$$ 1499508 1937206 1660979 2014593 1841921 1722753 1823612 1686994 1676620 2094461 2188797
14592B188797l98615p514J19733j67791K61787J30804m3398p7893J64999j30531
$$ 2188797 1790182 1782668 1902401 1734610 1996397 2127201 2083803 2005910 2170909 2040378
14582B040378R1191K14338k43567J32971J59493k79541M5615J43316J32048L453
$$ 2040378 2131569 2345907 2102340 2235311 2394804 2115263 2160878 2304194 2436242 2439695
14572B439695k58532K05609k3335l8738J33574j40027L45234N7760l8756k28657
$$ 2439695 2181163 2386772 2363437 2324699 2458273 2318246 2663480 2721240 2682484 2453827
14562B453827J53627M13170p9129J30668M58050j11597o556L88648J15624K99582
$$ 2453827 2607454 3020624 2941495 3072163 3530213 3418616 3412060 3800708 3916332 4215914
14552D215914L51519N29646J200048J733897M051457P314391J4801980J0215234
$$ 4215914 4567433 5097079 6297127 8031024 12082481 19396872 34198852 44414086
14544D4414086j7990628A1447969m851977n31124J455570r30922C167984l21616
$$ 44414086 26423458 11447969 6595992 6064868 7520438 6589516 3167984 2846368
14536B846368o89865M40840k06290q7758J53278q5664K88001m10703K33805Q8791
$$ 2846368 2156503 2597343 2391053 2303295 2456573 2370909 2658910 2248207 2482012 2570803
14526B570803J1679K1038K53422l97000L07096o0439r4966L4629L80133k34528
$$ 2570803 2582482 2603520 2856942 2459942 2767038 2706599 2611633 2646262 3026395 2791867
14516B791867k23534O8610K53485j28241K72540k57154L0802K87701K30118j24683
$$ 2791867 2568333 2636943 2890428 2762187 3034727 2777573 2808375 3096076 3326194 3201511
14506C201511l37206L64569k4165l0055L95693p5626l1306l34468O25303j35059
$$ 3201511 2864305 3228874 3204709 3174654 3570347 3494721 3463415 3128947 3754250 3619191
14496C619191m2869J05758O9066P962M18996n25428J59389J21042J42225k14745
$$ 3619191 3576322 3682080 3751146 3759108 4178104 3652676 3812065 3933107 4075332 3860587
14486C860587k5397K35243J99666k12483O9623m2898K58417n5903J76637R7227
$$ 3860587 3835190 4070433 4270099 4057616 4127239 4084341 4342758 4286855 4463492 4560719
14476D560719m01949K16831J22601K16141o9117r5871K32408K99499n66513K46550
$$ 4560719 4158770 4375601 4498202 4714343 4645226 4549355 4781763 5081262 4514749 4761299
14466D761299K04722j01801K82612j91540N20012j09389n2540K26751n60242N91702
$$ 4761299 4966021 4864220 5146832 4955292 5475304 5365915 5313375 5540126 4979884 5571586
14456E571586M81167r1493l61333J52841K76975l79360K98405K85949l88134L71139
$$ 5571586 6052753 5961260 5599927 5752768 6029743 5650383 5948788 6234737 5846603 6217742
14446F217742J66739L8345j75889K32875r7176J92078K02962j95506Q8488O08888
$$ 6217742 6384481 6422826 6246937 6479812 6382636 6574714 6777676 6582170 6670658 7279546
14436G279546n6969J2124N9092K96927K57502l10453k76220N50349M03717k87384
$$ 7279546 7222577 7234701 7293793 7590720 7848222 7537769 7261549 7811898 8215615 7928231
14426G928231J18666J47240K90575j37119L0527L32324q2472M82719r8101J08636
$$ 7928231 8046897 8194137 8484712 8347593 8378120 8710444 8627972 9110691 9012590 9121226
14416I121226j42826L66659K53734l277J04561M19916L14064k12888M27343j62843
$$ 9121226 8978400 9345059 9598793 9595516 9700077 10119993 10434057 10221169 10648512 10485669
14406A0485669K25803K87421M00492k08106O18219k85115M96578l2994J99969
$$ 10485669 10711472 10998893 11399385 11191279 11809498 11524383 12020961 11987967 12187936
14397A2187936J5039L94278M1330K60040K34437M67486j49105M22355M46400J2012
$$ 12187936 12202975 12597253 12638583 12898623 13133060 13600546 13451441 13873796 14320196 14332208
14387A4332208K67116O37849j41269L93939k613N11381N29556L11318Q0169N305
$$ 14332208 14599324 15237173 15095904 15489843 15487230 15998611 16528167 16839485 16919654 16924959
14377A6924959R24884J43499K96937L27593R0595P77376M32177j08096O26257
$$ 16924959 17849843 17993342 18290279 18617872 18708467 19485843 19918020 19809924 20436181
14368B0436181K26358P48298J218523j10295J76736P22811M40719K57241J026663
$$ 20436181 20662539 21410837 22629360 22519065 22695801 23418612 23859331 24116572 25143235
14359B5143235K10270P01668P58255N43194N84005O07846N27982O15761P74200
$$ 25143235 25353505 26055173 26813428 27356622 27940627 28548473 29076455 29692216 30466416
14350C0466416R08303P01349R51793M06683J244019O58578R17337J112046R63368
$$ 30466416 31374719 32076068 33027861 33434544 34678563 35337141 36254478 37366524 38329892
14341C8329892J093961R53510J004920J270405J119567J398089J276653Q81155
$$ 38329892 39423853 40377363 41382283 42652688 43772255 45170344 46446997 47328152
14333D7328152J506311J931985J418158J620658J713877J857850J849439J530358
$$ 47328152 48834463 50766448 52184606 53805264 55519141 57376991 59226430 60756788
14325F0756788J949090K292121J984316K389374K410356K490363K626527K686404
$$ 60756788 62705878 64997999 66982315 69371689 71782045 74272408 76898935 79585339
14317G9585339L270902K863984L607075L382022L287124L696741M200868M304230
$$ 79585339 82856241 85720225 89327300 92709322 95996446 99693187 103894055 108198285
14309A08198285M065194M587565M810805N290511N722140N811674O010068O186081
$$ 108198285 112263479 116851044 121661849 126952360 132674500 138486174 144496242 150682323
14301A50682323O794791P018620P707675Q139746Q135380R244353R098545J0191166
$$ 150682323 157477114 164495734 172203409 180343155 188478535 197722888 206821433 217012599
14293B17012599J0142000J1299588J1500354J1866556J2619678J3415679J3376334
$$ 217012599 227154599 238454187 249954541 261821097 274440775 287856454 301232788
14286C01232788J3869587J4328588J4638081J5079322J4731991J4796638J4714478
$$ 301232788 315102375 329430963 344069044 359148366 373880357 388676995 403391473
14279D03391473J4053403J3454242J2453117J1136421R778552P707266M092131
$$ 403391473 417444876 430899118 443352235 454488656 464267208 471974474 476066605
14272D76066605N81356q73114j342063n97958k995493o465735q698250j0397150
$$ 476066605 476647961 475774847 474432784 473834826 470839333 464373598 455675348 445278198
14264D45278198j1046321j2511889j3679624j4422200j5123362j5388756j5559774
$$ 445278198 434231877 421719988 408040364 393618164 378494802 363106046 347546272
14257C47546272j5252728j5326495j5122136j4389746j3838024j3418477j1822242
$$ 347546272 332293544 316967049 301844913 287455167 273617143 260198666 248376424
14250B48376424j0913760j1357271j1413513j0088150j0022606q972688q583302
$$ 248376424 237462664 226105393 214691880 204603730 194581124 185608436 177025134
14243A77025134p939231p846870p456010p123475o137144n796904n524178n505506
$$ 177025134 169085903 161239033 153783023 146659548 140522404 134725500 129201322 123695816
14235A23695816n607105m774397m875130l662524m260162l799435l741708l776359
$$ 123695816 118088711 113314314 108439184 104776660 100516498 96717063 92975355 89198996
14227H9198996l255558k881167l282891k792307k642405k625567k217644k814001
$$ 89198996 85943438 83062271 79779380 76987073 74344668 71719101 69501457 66687456
14219F6687456j734582k331405j954807j806316j995772j809416j389590j535790
$$ 66687456 64952874 62621469 60666662 58860346 56864574 55055158 53665568 52129778
14211E2129778j560269j721756j257494r62266j107051j332194j129357j229501
$$ 52129778 50569509 48847753 47590259 46627993 45520942 44188748 43059391 41829890
14203D1829890j492909j155368q43455q70623o76056j296121j181571p31089p11203
$$ 41829890 40336981 39181613 38338158 37467535 36791479 35495358 34313787 33582698 32871495
14194C2871495o92675p40866r81706q54454o53625n49968o40646o61203p44460
$$ 32871495 32178820 31437954 30456248 29601794 28948169 28398201 27757555 27096352 26351892
14185B6351892l74155n38801n85994o76661n58897l38533k81283n23486p12531
$$ 26351892 25977737 25438936 24852942 24176281 23617384 23278851 22997568 22474082 21761551
14176B1761551p8557m45138o00835j47549r48331k19297m51213l37325j32493
$$ 21761551 21682994 21237856 20637021 20489472 19541141 19321844 18870631 18533306 18400813
14167A8400813n19860k38243k42559m08672m47161L1438k96129l90942l18298
$$ 18400813 17880953 17642710 17400151 16991479 16544318 16575756 16279627 15888685 15570387
14158A5570387j73207n27999J19940m46118J91585m97978l46434l54286P3965
$$ 15570387 15397180 14869181 14989121 14543003 14734588 14236610 13890176 13535890 13609855
14149A3609855n57735J81845q86753K14952O337j26766n09226j88782q4857j50329
$$ 13609855 13052120 13233965 12347212 12562164 12568501 12441735 11932509 11743727 11658870 11508541
14139A1508541l1055k36142q0094l82751L2540j43403k20360l20519j44677J80038
$$ 11508541 11477486 11241344 11161250 10778499 10811039 10667636 10447276 10126757 9982080 10162118
14129A0162118l17315k52126r5444K42051k44713o40577K38009l66900P0104K70340
$$ 10162118 9844803 9592677 9497233 9739284 9494571 8853994 9092003 8725103 8795207 9065547
14119I065547o93583p4697k76981L29905m23346K60265l88319l18004R6770R6108
$$ 9065547 8371964 8297267 8020286 8350191 7926845 8187110 7798791 7480787 7577557 7673665
14109G673665j71072k41375j29101K40913j85671j94895q1112m46294N02066l59016
$$ 7673665 7502593 7261218 7132117 7373030 7187359 6992464 6911352 6465058 6967124 6608108
14099F608108Q8173K48274l60482l49165L81671j24475j00655j77502k42334J33985
$$ 6608108 6696281 6944555 6584073 6234908 6616579 6492104 6391449 6213947 5971613 6105598
14089F105598m53560O5741L45133k17172j31361K5984J06800n56783M09979l22606
$$ 6105598 5652038 5717779 6062912 5845740 5714379 5740363 5847163 5290380 5700359 5377753
14079E377753j35710n0279J29591j09988k22119j17079j51456R0556j87549K30144
$$ 5377753 5242043 5191764 5321355 5211367 4989248 4872169 4720713 4811269 4623720 4853864
14069D853864j97770R0115j46125j00127k4302l3877l3888j39987L79369l41911
$$ 4853864 4656094 4746209 4600084 4499957 4475655 4441778 4407890 4267903 4647272 4305361
14059D305361q1334k1468N1313m7508J23101l83671Q1742L0682j70427J12794
$$ 4305361 4224027 4202559 4253872 4206364 4329465 3945794 4027536 4058218 3887791 4000585
14049D000585m4147r4631l9985P8722j05671m09720M64477l11359N43058k81562
$$ 4000585 3956438 3861807 3821822 3900544 3794873 3385153 3849630 3538271 4081329 3799767
14039C799767k15850k52529K80527j73995J15463l01560N31574l35170R0509p2143
$$ 3799767 3583917 3331388 3611915 3437920 3553383 3251823 3783397 3448227 3538736 3466593
14029C466593k1604J34079m1068J44275l23605l19667J52984j41291N3574P4808
$$ 3466593 3444989 3579068 3538000 3682275 3358670 3039003 3191987 3050696 3104270 3179078
14019C179078r5883J48206R0512o75067N4500M67553m91943M67456l02854p3164
$$ 3179078 3083195 3231401 3321913 2646846 2701346 3168899 2676956 3144412 2841558 2768394
14009B768394j42636K73442l40458j30210K49802k18340K53358o3175k72007j7645
$$ 2768394 2625758 2899200 2558742 2428532 2678334 2459994 2713352 2650177 2378170 2360525
13999B360525J36166j93706K91887o1893J96808q285J7k6204J37181M52951J510302
$$ 2360525 2496691 2302985 2594872 2532979 2729787 2721502 2721519 2695315 2832496 3285447 4795749
13988D795749K678755N971910J4105874J5881503j1855340j5398510o324887k500240
$$ 4795749 7474504 13446414 27552288 43433791 31578451 16179941 9855054 7354814
13980G354814j655455q73540l49769m35414m37098k12721r1445m49178K92785
$$ 7354814 5699359 4825819 4476050 4040636 3603538 3390817 3299372 2850194 3142979
13971C142979k38296J85866m0380m78444J00383K85290m6216m36682L06119J33999
$$ 3142979 2904683 3090549 3050169 2571725 2672108 2957398 2911182 2474500 2780619 2914618
13961B914618o25251J50785j1890l3347k38567K80652k61818k0722L39771O8604
$$ 2914618 2289367 2440152 2428262 2394915 2156348 2437000 2175182 2154460 2494231 2562835
13951B562835o79082K63013J66222j67641N3922j82244J44690j93791j75538L10799
$$ 2562835 1883753 2146766 2312988 2145347 2199269 2017025 2161715 1967924 1792386 2103185
13941B103185k78736p1557M1731K75552p548j44284p3246r6109K23101o5184o684
$$ 2103185 1824449 1752892 1794623 2070175 2062627 1918343 1845097 1748988 1972089 1906905 1900221
13930A900221K50940j7504l10686J70822o1779j18410j06745K48647j50272j8405
$$ 1900221 2151161 2133657 1822971 1993793 1932014 1813604 1706859 1955506 1805234 1786829
13920A786829L39887k85807l58448P5019j74642M96711j49458k64657O4221J53317
$$ 1786829 2126716 1840909 1482461 1557480 1382838 1879549 1730091 1465434 1529655 1682972
13910A682972k47299k4872J02684J54917K5632j13195J3180O9172N3721j03153
$$ 1682972 1435673 1410801 1513485 1668402 1694034 1580839 1594019 1663191 1716912 1613759
13900A613759K4293n4506R0876k06225L20402J7575j89590o1172J04980k33374
$$ 1613759 1638052 1583546 1674422 1468197 1788599 1806174 1616584 1555412 1660392 1427018
13890A427018n6136j06328K49334N7302k75748J28091m93297M59147p1448J94796
$$ 1427018 1370882 1264554 1513888 1571190 1295442 1423533 930236 1389383 1317935 1512731
13880A512731m08804J157L39297l3580o6806j02431J80236J99084m34715K40430
$$ 1512731 1103927 1105084 1444381 1410801 1343995 1241564 1421800 1620884 1186169 1426599
13870A426599j43500j12423J13748J43454l91191L50959j04334O2998J09483J90265
$$ 1426599 1283099 1170676 1284424 1427878 1036687 1387646 1283312 1346310 1455793 1646058
13860A646058m35317j65358K16242m4830j16508n2539K11997k54289K79153k02061
$$ 1646058 1210741 1045383 1261625 1216795 1100287 1047748 1259745 1005456 1284609 1082548
13850A082548L20056k37618K19594l60045O3745k75246L58129j91393O2722M1866
$$ 1082548 1402604 1164986 1384580 1024535 1088280 813034 1171163 979770 1042492 1084358
13840A084358J39885K47280l69161J9087k14387K18666j82220K80123J18831L7212
$$ 1084358 1224243 1471523 1102362 1121449 907062 1125728 943508 1223631 1342462 1379674
13830A379674n5470l26629p9570J52388n25568M82884P9313j07569K9082J00248
$$ 1379674 1324204 997575 918005 1070393 544825 1027709 1107022 999453 1028535 1128783
13820A128783m63287L40200j06582J35049K7091m3811j51565j56545J97037K1167
$$ 1128783 665496 1005696 899114 1034163 1061254 1017443 865878 709333 906370 927537
13810I27537K77197m04890L07911l80605J95927J11566j09610L2514J49872l03681
$$ 927537 1204734 799844 1107755 727150 923077 1034643 925033 957547 1107419 803738
13800H03738L79613k95559j5399K34923j46130n4946l68935N31625k01624j18980
$$ 803738 1183351 887792 872393 1107316 961186 906240 537305 1068930 867306 748326
13790G48326L17568m03133L85198L5470k23392L2J34855m7302l3451O1289j17476
$$ 748326 1065894 662761 1047959 1083429 860037 860069 994924 947622 914171 975460 857984
13779H57984j64731K70195o8701k71703J15102J92195j39620P4159L7755j13014
$$ 857984 693253 963448 894747 623044 738146 930341 790721 864880 902635 789621
13769G89621M17622m33688j87634N87999n75843K58588l85568M85650n891j17166
$$ 789621 1207243 773555 585921 1173920 598077 856665 471097 956747 950856 833690
13759H33690j42572L23635m7212l28261N54248n00485j48716l0191K98763j80238
$$ 833690 691118 1014753 967541 639280 1193528 693043 544327 514136 812899 632661
13749F32661P972Q3342k95116J67194K4629J10184k2687n1K90172D58665L07828
$$ 632661 640633 723975 428859 596053 620682 730866 708179 708128 998300 458665 766493
13738G66493Q822j48332j97830L4826M33842k89920O1825O9709k7132l9125P8881
$$ 766493 775315 626983 429153 463979 897821 607901 669726 739435 712303 673178 752059
13727G52059k52466M45708k6381m54730N36358k70988B76381L20781j43055J75355
$$ 752059 499593 945301 918920 464190 1000548 729560 276381 597162 454107 629462
13717F29462j9360L3382J26700k98863J60657k4353K64704l04246N4956q47L6137
$$ 629462 610102 643484 770184 471321 631978 607625 872329 568083 623039 622192 658329
13706F58329M4857l07342L56494k50599B17320M89715k484N3734J85355B55864
$$ 658329 703186 395844 752338 501739 217320 707035 704551 758285 943640 255864
13695F28072K38364k38930p1740J03204l14381M424K01520L87362k22504l8154
$$ 628072 866436 627506 555766 658970 344589 349013 550533 937895 715391 677237
13685F77237j50586k08710N15561k72160K57629B47118K61705K97237j97826k63892
$$ 677237 526651 317941 833502 561342 818971 247118 508823 806060 608234 344342
13675C44342P0047N9398J03942L41901l68650J1080p5313K35588C45546K42793
$$ 344342 414389 473787 577729 919630 550980 562060 486747 722335 345546 588339
13665E88339j82261N95589l12801k10460q5433L5576K95661R9200k52037k48877
$$ 588339 406078 1001667 688866 478406 392973 428549 724210 823410 571373 322496
13655C22496Q3679L84999j57383j25867j2536k13790K45135m4061O8162k53314
$$ 322496 406175 791174 633791 507924 495388 281598 526733 482672 550834 297520
13645B97520J95112O0839M139k66690M64692B26826J82454L11521k69071j30996
$$ 297520 492632 553471 557610 290920 755612 226826 409280 720801 451730 320734
13635C20734j657j24790L0513K92589j04201j26493K42558f8093E65709q3695
$$ 320734 319077 194287 224800 517389 413188 286695 529253 -68093 565709 482014
13625D82014R3511l5046j83876L8682J61069K66945k15951p1840R5896j39679
$$ 482014 575525 540479 356603 395285 556354 823299 607348 535508 631404 491725
13615D91725r8313A55614P9592L38921j55319K89234B45038K11683m8823l1J05207
$$ 491725 393412 155614 235206 574127 418808 708042 245038 456721 407898 407867 513074
13604E13074m5778J94182r3361o4431j32309j66103K22366r9477j06557M86570
$$ 513074 467296 661478 568117 503686 371377 205274 427640 328163 221606 708176
13594G08176B76647j1406K34177j13547O7357j68088H2087J00413M52462A66596
$$ 708176 276647 265241 499418 385871 453228 285140 82087 182500 634962 166596
13583F85859l36886M6725J59288m1631k16652J63305j07382j03588M27984k50725
$$ 685859 348973 395698 554986 513355 296703 460008 352626 249038 677022 426297
13573D26297J14066j23746k05457L52956A78559K05421K12373R4699j89405j76382
$$ 426297 540363 416617 211160 564116 178559 383980 596353 691052 501647 325265
13563C25265M86807B66258J67347J000m9320o3510j38821R0044J88174J68820
$$ 325265 812072 266258 433605 434605 385285 321775 182954 272998 461172 629992
13553F29992A83798J79696R0207j02396O0862c5901E22471j8292j38972L07159
$$ 629992 183798 363494 453701 351305 412167 -35901 522471 504179 365207 672366
13543F72366k84145A70463N49342C34538J20645J50443k49422L23471j72273p7283
$$ 672366 388221 170463 719805 334538 455183 605626 356204 679675 507402 430119
13533D30119J98674G6804L74987A80957J67308J84606J1063P7187k11861A87490
$$ 430119 628793 76804 451791 180957 348265 532871 543934 621121 409260 187490
13522D45059K28618k36648A82083M4460n2409P4887K25762k26107k3832K7084
$$ 445059 673677 437029 182083 226543 174134 249021 474783 248676 224844 251928
13512B51928k4523M9773R6106A52886f4430D22581A21187L36949B15275M851K44782
$$ 251928 227405 277178 373284 152886 -64430 422581 121187 458136 215275 220126 464908
13501D64908o2978A57105L26291k5383k27975j09238K56432j65287D4794K48676
$$ 464908 401930 157105 483396 458013 230038 120800 377232 211945 44794 293470
13491B93470j06420P2838G8915K71675J68695q1354J02807j64041l920A22928
$$ 293470 187050 259888 78915 350590 519285 437931 540738 376697 372777 122928
13480B61023L3469L07218A25008K56974j79873r7248P0248L30099j63804M53935
$$ 261023 294492 601710 125008 381982 202109 104861 175109 505208 341404 795339
13470G95339A69754J22564M6615L6000b71017a3430C50447l9119M31946A53759
$$ 795339 169754 292318 338933 374933 -271017 -13430 350447 311328 743274 153759
13459C81338K85013A42554J47249q8591j8019a2845B21259j432J36469A27713
$$ 381338 666351 142554 289803 201212 183193 -12845 221259 219827 356296 127713
13448B24237n4603J11833p1855p4410J15168J70050n4668j19760D4159K12862
$$ 224237 169634 281467 209612 135202 250370 420420 365752 245992 44159 257021
13438B57021k6074J72716J15082k04027j02624J0804e4531g116B47436k6454R2026
$$ 257021 230947 403663 518745 314718 212094 222898 -54531 -7116 247436 220982 313008
13427C13008J85655A98888J13135G2008j7209K40748j028a88100B12624L88693
$$ 313008 498663 198888 312023 72008 54799 295547 294519 -188100 212624 601317
13417F01317f9755C63275a838E09008I2603j5577P5078R0520J88784N6881a14115
$$ 601317 -69755 363275 -1838 509008 92603 77026 152104 242624 431408 488289 -114115
13405A65395K36927G8613J12196M3156J40345M2322A29282O1122E4326K10384
$$ 165395 402322 78613 190809 233965 374310 416632 129282 190404 54326 264710
13395B64710A15101a9072B0483L89192j00957j12728O06430B59793D6957M39056
$$ 264710 115101 -19072 20483 409675 308718 195990 802420 259793 46957 486013
13385D86013j82590G3546J22807l7350j628L70529j44696k5401k3537D2809J87293
$$ 486013 303423 73546 196353 159003 157375 527904 383208 357807 334270 42809 230102
13374B30102K7264N2044B1J39652n4849J55899j2201o1836O5184j06739Q5733
$$ 230102 257366 309410 21 139673 84824 240723 228522 166686 231870 125131 210864
13363B10864J09005J15809o350G9663J67686P872K8520K79933A30452o1917K42564
$$ 210864 319869 435678 429328 79663 247349 255221 283741 563674 130452 68535 311099
13352C11099q2640J26483J42884B47966j08498J80147M1218K7324L02649j54628
$$ 311099 228459 354942 497826 247966 139468 319615 360833 388157 690806 536178
13342E36178J31421k66743j49535J85147B15057Q85o0612J38785a1090A15164
$$ 536178 667599 400856 251321 436468 215057 215942 155330 294115 -11090 115164
13331A53114J1063O1365J74241j71389A01554Q9874R897b43421G1418K15206J47816
$$ 153114 164177 225542 399783 228394 101554 191428 201325 -243421 71418 286624 434440
13320D34440i766A81693l3069J47461N8619m6660l9539A02516J77739G3251J62711
$$ 434440 -9766 181693 148624 296085 354704 308044 268505 102516 280255 73251 235962
13309B35962A17269K3350E1542N3405e7724B57681G5549B5207P6299J39962o1332
$$ 235962 117269 140619 51542 104947 -57724 257681 75549 25207 101506 241468 180136
13298A80136b4286A31281m3901J99531l2565K12042H3715K00734I6320a94154
$$ 180136 -24286 131281 87380 286911 254346 466388 83715 284449 96320 -194154
13287A48138K2563R2258p1709p3847N8849D7901L1225J31584K37360A27126N0662
$$ 148138 170701 262959 191250 117403 176252 47901 79126 210710 448070 127126 177788
13276A77788K1555A6551L30114a50122B39023M1827G4440M0729C465K41539A2630
$$ 177788 199343 16551 346665 -150122 239023 280850 74440 115169 3465 245004 12630
13264G2211J2982l4739b6515C57512a07119g693H2368R4398k7307K66269C1373
$$ 72211 85193 50454 -26515 357512 -107119 -7693 82368 176766 149459 415728 31373
13252B01269J25567a56642B23108H187L60197F3242J05783J51384m3924L831B8085
$$ 201269 326836 -156642 223108 8187 368384 63242 169025 320409 276485 280316 28085
13240i719B03063G1753B4991J55896b00480A63417g338j65532A34836J22373N6323
$$ -9719 203063 71753 24991 180887 -200480 163417 -7338 -172870 134836 257209 313532
13229C13532n4115J84876b46068B61474L7228a76626j43701C62852j60239b76176
$$ 313532 259417 444293 -246068 261474 298702 -176626 -320327 362852 202613 -276176
13218A61530F2211J96705J59541A14599M99764A53429K71940E8920K30017D65
$$ 161530 62211 258916 418457 114599 614363 153429 425369 58920 288937 465
13207h4608B64104j18601I332K03949o3531J14208J39114A83635l2718B3019f6951
$$ -84608 264104 145503 9332 213281 149750 263958 403072 183635 150917 23019 -66951
13195A0932K91182C2486O0942J48668j3559L7710A3455M39093B14671E831N39810
$$ 10932 302114 32486 93428 242096 228537 266247 13455 452548 214671 5831 545641
13184E45641A99199a69615P106J1652a0392B73166P3135E5832a48472B66024O3169
$$ 545641 199199 -169615 -162509 -150857 -10392 273166 346301 55832 -148472 266024 329193
13173C29193A2687d4922F1289j3666M09798J43408B66230o8098d5049B41021K93463
$$ 329193 12687 -44922 61289 47623 457421 600829 266230 198132 -45049 241021 534484
13162E34484F3408a16415L2220b0459A66240K16965a36648A50040J80407a01173
$$ 534484 63408 -116415 -84195 -20459 166240 383205 -136648 150040 330447 -101173
13151b4686A17516Q727P2922b45965B9089a11361B00968C5525K32208K05059B18014
$$ -24686 117516 126243 199165 -245965 29089 -111361 200968 35525 267733 472792 218014
13139a14136I9251J86606A28395h9125C7621K44219R6025H5348J45135K89153
$$ -114136 99251 285857 128395 -89125 37621 281840 377865 85348 230483 519636
13129E19636A20748C7681P8068l3372j8575K40006n0962A02982L0964h7440C12023
$$ 519636 120748 37681 115749 82377 63802 303808 252846 102982 133946 -87440 312023
13117A05547A370K50640H4429B1816K7562d0945j37585B03968e3640A11754J16643
$$ 105547 1370 252010 84429 21816 49378 -40945 -178530 203968 -53640 111754 228397
13106B28397a23722j65328J17738B74932a71343B41605d4531G5186J38397B4275
$$ 228397 -123722 -289050 -171312 274932 -171343 241605 -44531 75186 213583 24275
13095H1550N0582R3156h6332a1199j31855A32247B7691i0773B05628A6512O3306
$$ 81550 132132 225288 -86332 -11199 -143054 132247 27691 -90773 205628 16512 79818
13084G9818l8163K12887F0422N8698J63387a05690A30054R0762J42541a02981
$$ 79818 41655 254542 60422 119120 282507 -105690 130054 220816 363357 -102981
13073d09607a60915B87640A36594J34650Q4345A40742E2673R313J77048i229o6224
$$ -409607 -160915 287640 136594 271244 355589 140742 52673 61986 239034 -9229 -75453
13062g5453q8348C44944A22826A7192c3513l1604I7758K25904k9536b55473A151
$$ -75453 -163801 344944 122826 17192 -33513 -65117 97758 323662 294126 -255473 1151
13050A14817a74590f4956A71990J30109J10663A92450C3863K60610h8777m5140
$$ 114817 -174590 -64956 171990 302099 412762 192450 33863 294473 -88777 -133917
13040a33917B58256i8568c9413B47393I3229M00768A47325K18331p7458K76381
$$ -133917 258256 -98568 -39413 247393 93229 493997 147325 365656 288198 564579
13030E64579b8739j81765A52830h0201B38259b79885C10263q219c4859G7650A7105
$$ 564579 -28739 -210504 152830 -80201 238259 -279885 310263 302044 -34859 77650 17105
13018C97771A56857J24743F797A513c23653D3140J57335P4431b33176A57903j1184
$$ 397771 156857 281600 6797 1513 -323653 43140 200475 274906 -233176 157903 146719
13007A46719J12278E0259J10128c14045h101B97308m560j06049G2424J57412g7611
$$ 146719 258997 50259 160387 -314045 -8101 297308 292748 186699 72424 229836 -77611
12995G3253d4678j29417H2854J82279a12110A60648L0542j9117M850Q9009P6205
$$ 73253 -44678 -174095 82854 265133 -112110 160648 191190 172073 176923 265932 342137
12984C42137E5932J14675K47699B6318a61872A71300m0069n3473J26176C6029
$$ 342137 55932 170607 418306 26318 -161872 171300 131231 77758 203934 36029
12973b42693I7508e9595A57560n1166b92434B59293A05505J04764G7928K29710
$$ -242693 97508 -59595 157560 106394 -292434 259293 105505 210269 77928 307638
12963C07638A34274O6292J79047j44610C8450L36554c2942G3730R8298C1346K8395
$$ 307638 134274 200566 379613 235003 38450 375004 -32942 73730 172028 31346 59741
12952E9741J15532a29240B22474I6780A9926J1724a7596l1304H5185J56083e7655
$$ 59741 175273 -129240 222474 96780 19926 31650 -17596 -48900 85185 241268 -57655
12940C35844a07364A20419J02786j04392f2143G3136K837K46630p9469J17118
$$ 335844 -107364 120419 223205 118813 -62143 73136 75973 322603 243134 360252
12930C60252a40811B15251b35163B20241f2764B95510j08881b7885B17219L2407
$$ 360252 -140811 215251 -235163 220241 -62764 295510 186629 -27885 217219 249626
12920B49626b37975a0615F0665a18305D6791j8924P5749L2809k5929J84755A9395
$$ 249626 -237975 -10615 60665 -118305 46791 27867 103616 136425 110496 295251 19395
12908b7359k40408G8125R1902b977C37698H4881f4692C7412M3210d980m7756D0755
$$ -27359 -267767 78125 170027 -2977 337698 84881 -64692 37412 80622 -4980 -52736 40755
12895B15672D3830B244M6075a21012B04197b18352H443a66010D5578f0263q293
$$ 215672 43830 2244 48319 -121012 204197 -218352 8443 -166010 45578 -60263 -68556
12884f8556B31920a28850A69404C8246a84139d1958C6162K0517J64403a24365
$$ -68556 231920 -128850 169404 38246 -184139 -41958 36162 56679 221082 -124365
12873G9197i4470I2195c8043j36747h0193G79J91008a00360A01225P7206e8554
$$ 79197 -94470 92195 -38043 -174790 -80193 779 191787 -100360 101225 178431 -58554
12861b8863C04473j41334p2487c03954h1659B567J79023b20153A98928J85585
$$ -28863 304473 163139 90652 -303954 -81659 2567 181590 -220153 198928 384513
12851C84513q5949A3584K28679a8373E1020a2323k31616B9277a14755c2918B35279
$$ 384513 298564 13584 242263 -18373 51020 -12323 -243939 29277 -114755 -32918 235279
12839A24882J05892d6606n7872j55073O8238B55221o7240J18367R2901F3345J06520
$$ 124882 230774 -46606 -104478 -259551 -191313 255221 187981 306348 399249 63345 169865
12828A69865Q1685G5254K42458d6209A64139n4220d2400k12373b6203E2822c2275
$$ 169865 251550 75254 317712 -46209 164139 109919 -42400 -254773 -26203 52822 -32275
12816d371A02675a13718j987L0033j28555G0720f5705j78995A00255L1292b27500
$$ -4371 102675 -113718 -115705 -85672 -214227 70720 -65705 -244700 100255 131547 -227500
12804f2232A04244o487K8646b51931B4J56457I862a03405A42104c8705A90673
$$ -62232 104244 97757 126403 -251931 24 156481 9862 -103405 142104 -38705 190673
12792D3739a40115J8870j52624C930J13333h785j21734j7449o139A99320b1742
$$ 43739 -140115 -121245 -273869 3930 117263 -8785 -130519 -147968 -154107 199320 -21742
12780a07879B11237G4496K11483a36698f776B4653a29599a4999I6062b86578g6230
$$ -107879 211237 74496 285979 -136698 -6776 24653 -129599 -14999 96062 -286578 -76230
12768a19043l985E8660d6191B38300E5991J54629J42919g0390K9991A9872c6839
$$ -119043 -123028 58660 -46191 238300 55991 210620 353539 -70390 -40399 19872 -36839
12756a19327b6546k03910i5459A29143C2062a0229B90912c9828E0983b73129j0546
$$ -119327 -26546 -230456 -95459 129143 32062 -10229 290912 -39828 50983 -273129 -283675
12745b83675C37126A52009k3150o0888K65415E4753N4150a12028d3886m2815C60606
$$ -283675 337126 152009 128859 67971 333386 54753 108903 -112028 -43886 -86701 360606
12733a24988E6334j2350j8674J58331K7044C2679h6887E34575A95723n5303C0859
$$ -124988 56334 43984 25310 183641 210685 32679 -86887 534575 195723 140420 30859
12721E8918c666j23016k9119B40030b15216c1981A76955C8346a46024B20510g9266
$$ 58918 -3666 -126682 -155801 240030 -215216 -31981 176955 38346 -146024 220510 -79266
12709C39394f6944J0117p436j6488P982k6134C12114Q6135g6326L5929G3113J67029
$$ 339394 -66944 -56827 -64263 -80751 -72769 -98903 312114 398249 -76326 -40397 73113 240142
12697B40142j02060o3172Q133a32179G0672J74410D123J3582d417A00088a95433
$$ 240142 138082 74910 83043 -132179 70672 245082 4123 17705 -4417 100088 -195433
12685a10861c4342A36670R2983a16563A1106Q7981B4817c6357C40994P8406e5012
$$ -110861 -34342 136670 229653 -116563 11106 99087 24817 -36357 340994 419400 -55012
12673A47817E1133b04329D76763I0857b62260I6789k3042L434K6318a10535C03065
$$ 147817 51133 -204329 476763 90857 -262260 96789 73747 77181 103499 -110535 303065
12661A90638F6761J66030K15982B01261M3368j21068i390D82595H7868K46692
$$ 190638 66761 232791 448773 201261 244629 123561 -9390 482595 87868 334560
12651C34560I9033K17044h3376j22402A58783B2979J18056h8G6069d15856B13402
$$ 334560 99033 316077 -83376 -205778 158783 22979 141035 -88 76069 -415856 213402
12639A55309F7845a87659M1450A20007l5934L6689a36398I5975L74927j28450
$$ 155309 67845 -187659 -146209 120007 84073 120762 -136398 95975 470902 342452
12629C42452j64417D0815Q7110L19323C0247G404J37629K92740C9890L38900C9526
$$ 342452 178035 40815 127925 447248 30247 7404 145033 437773 39890 378790 39526
12617a75226B16909D6470J2271a3467B30115L6468q3594l8932b78654A69726P3466
$$ -175226 216909 46470 58741 -13467 230115 266583 182989 144057 -278654 169726 243192
12606B43192q828J5102A03682C103a32957C22325a25844B77103A14916J74024
$$ 243192 234364 249466 103682 3103 -132957 322325 -125844 277103 114916 288940
12596B88940p7672f3999l7027m7872a0498B67356N1850A25440M679d69428D68852
$$ 288940 211268 -63999 -101026 -148898 -10498 267356 319206 125440 130119 -469428 468852
12584a45489q0871i0854B86308h1373B7588a29941B24617F3008J60131G9551J93353
$$ -145489 -226360 -90854 286308 -81373 27588 -129941 224617 63008 223139 79551 272904
12573B72904a35048A88759E4355K8110B8218J4959J2334J40766c97305C59705
$$ 272904 -135048 188759 54355 82465 28218 43177 55511 196277 -397305 359705
12562H2676h9171C14600A02875a68864P7528D12692c34818B83221A05808b308
$$ 82676 -89171 314600 102875 -168864 -91336 412692 -334818 283221 105808 -2308
12551b61845f5825D8550e3957A6562R6011D0076g0976D58315c2915B7371N9120
$$ -261845 -65825 48550 -53957 16562 112573 40076 -70976 458315 -32915 27371 86491
12540H6491C2401a56353M7303B24369a29557A88738b16208A53464E5016i4301
$$ 86491 32401 -156353 -109050 224369 -129557 188738 -216208 153464 55016 -94301
12529B4630K29544j02464A9902g0270l00395A03610l6410b31548B72653j34971
$$ 24630 254174 151710 19902 -70270 -370665 103610 67200 -231548 272653 137682
12519A37682J23071D3514K37034M45939D062O9149e8150B42245b14926P6420A37829
$$ 137682 260753 43514 280548 726487 4062 73211 -58150 242245 -214926 -138506 137829
12507a17220C08711c09716B4765b03100G297M20808b25052A75768K07065g5725
$$ -117220 308711 -309716 24765 -203100 7297 428105 -225052 175768 382833 -75725
12496G6172a51243H7619l116K66901d5863h003o002B04243J46036A74561e4944
$$ 76172 -151243 87619 84503 351404 -45863 -8003 -14005 204243 350279 174561 -54944
12484b300l56845h8326j22496B82693r3699a066F8917a25462D7581N8329D6648
$$ -2300 -359145 -88326 -210822 282693 188994 -1066 68917 -125462 47581 105910 46648
12472h609m06896f05j44736I7590a80706C5001d62348i718j66220E10224A5142
$$ -8609 -415505 -605 -145341 97590 -180706 35001 -462348 -9718 -175938 510224 15142
12460b11476A55226M4773C965a86897B6776c6611l0578n9173l2755j54919e4058
$$ -211476 155226 199999 3965 -186897 26776 -36611 -67189 -126362 -159117 -314036 -54058
12448B35459E8073k7492J71535K68752A81515o6985a05771d132A19256b04690
$$ 235459 58073 30581 202116 470868 181515 114530 -105771 -4132 119256 -204690
12437a35654a2762p1655C58560a86715F8427j652A8956f6073B89034A25242d8965
$$ -135654 -12762 -84417 358560 -186715 68427 66775 18956 -66073 289034 125242 -48965
12425e789I3254O6001a09708A97164p7594J8717J47040q4764I2636a38021B5658
$$ -5789 93254 159255 -109708 197164 119570 138287 285327 200563 92636 -138021 25658
12413f9147B1009L0936J35999i9475d9607k4997E1967Q945i9466A08132f6281
$$ -69147 21009 51945 187944 -99475 -49607 -74604 51967 60912 -99466 108132 -66281
12401a39340l3775l9302G6185Q7735N2209a3881k84036a47176b843E7121J07970
$$ -139340 -173115 -212417 76185 163920 216129 -13881 -297917 -147176 -2843 57121 165091
12390A65091a48710A43435a88698G6407h643l02557A01100m8488k2073K86466
$$ 165091 -148710 143435 -188698 76407 -8643 -311200 101100 52612 30539 317005
12380C17005A7333F718K13258b6192k11120a7545k39367b1791I5589K64914b0723
$$ 317005 17333 6718 219976 -26192 -237312 -17545 -256912 -21791 95589 360503 -20723
12368A09914K6895K2952K1869q8047E261J74105M7443g4595A1732a7275m3932
$$ 109914 136809 159761 181630 93583 5261 179366 226809 -74595 11732 -17275 -61207
12357f1207B15935a92305G1030i5132L0103j55103B0748e261p9868Q839m3846
$$ -61207 215935 -192305 71030 -95132 -65029 -220132 20748 -5261 -85129 -76290 -120136
12346a20136a1471k00038n8217N8659B60421K29578D5008q140o091J55356a47474
$$ -120136 -11471 -211509 -269726 -211067 260421 489999 45008 36868 30777 186133 -147474
12334b6169D93330b47405a05115D8729J33419C9213J7896b4754G4055J11563l8065
$$ -26169 493330 -247405 -105115 48729 182148 39213 57109 -24754 74055 185618 147553
12323A47553o0724K49858A34555L24064A78620p5728e1787b4796j04373A42860
$$ 147553 86829 336687 134555 458619 178620 102892 -51787 -24796 -129169 142860
12312a48638A40403B7328o784a21794P975A87347a36221e4974B88483D3330b08123
$$ -148638 140403 27328 20544 -121794 -113819 187347 -136221 -54974 288483 43330 -208123
12300g7089n2475B52473c56872C81181j70043p1459M1815H1587J23791a13647
$$ -77089 -129564 252473 -356872 381181 211138 139679 181494 81587 205378 -113647
12289A31458e5347G1286b95159G6626J23310q7545b18569b9470A19552J30684
$$ 131458 -55347 71286 -295159 76626 199936 112391 -218569 -29470 119552 250236
12279B50236b30140B38824b2330j92472c8624A41787A9567K43975h8195I8589
$$ 250236 -230140 238824 -22330 -214802 -38624 141787 19567 263542 -88195 98589
12268A12378d55614B33024b1496A42414A6851a62068B3791f589k55572c8586J9228
$$ 112378 -455614 233024 -21496 142414 16851 -162068 23791 -6589 -262161 -38586 -19358
12257a9358j54170I6707C417K27416j10762a6953A10526N9327n4784f7902F0419
$$ -19358 -173528 96707 3417 230833 120071 -16953 110526 169853 115069 -67902 60419
12245E90L49515F0347L5173c514j53408a560B44277a2635A43733b2073l9386D9671
$$ 590 350105 60347 95520 -3514 -156922 -1560 244277 -12635 143733 -22073 -61459 49671
12232A68484J32414A01442J9287e2380A54105f9913B22647K28710A15973b39868
$$ 168484 300898 101442 120729 -52380 154105 -69913 222647 451357 115973 -239868
12221A56655L16113j87876A01144K7096L2J50347A10302J43324E0596K24493a96108
$$ 156655 472768 284892 101144 128240 128272 278619 110302 253626 50596 275089 -196108
12209B60063b388A81602b5826A79246j816J09400P6699A41776L9077b3740A43522
$$ 260063 -2388 181602 -25826 179246 177430 286830 363529 141776 180853 -23740 143522
12197D64999B29689H2614L6911K26106m8693J18173e248B86387d3961a724A37190
$$ 464999 229689 82614 119525 345631 296938 415111 -5248 286387 -43961 -1724 137190
12185F1911L5169M2058d6599A07274J0347c744F4413f750E8060K64431a68573
$$ 61911 97080 139138 -46599 107274 117621 -3744 64413 -6750 58060 322491 -168573
12173C07687H7559L9305J39650Q3382A29567J30369N6026A57167a2829r3631b3057
$$ 307687 87559 126864 266514 349896 129567 259936 315962 157167 -12829 -106460 -23057
12161B83998G2818N1747K44834b0852A30465B8092N20431k60839J05946C5744
$$ 283998 72818 124565 369399 -20852 130465 28092 548523 287684 393630 35744
12150I8339K00571F375a19408j77841k05652i602C72929A84929l3827E5696d0707
$$ 98339 298910 6375 -119408 -297249 -502901 -9602 372929 184929 151102 55696 -40707
12138b73447I0731J81888a14851C45260R5054c65429a2391j69305A97727a99275
$$ -273447 90731 272619 -114851 345260 440314 -365429 -12391 -181696 197727 -199275
12127C5004J03666J40174D0774Q2278b11250O1894C4736h0335J0272q1502A18462
$$ 35004 138670 278844 40774 123052 -211250 -149356 34736 -80335 -70063 -151565 118462
12115B54276A26851h8726k24400B8981L4981a26810A23204J31418A5950a2979
$$ 254276 126851 -88726 -313126 28981 63962 -126810 123204 254622 15950 -12979
12104B53211B7055P6367i5640B01804a14942D9092c6704d044k17565i7086K1901
$$ 253211 27055 103422 -95640 201804 -114942 49092 -36704 -4044 -221609 -97086 -75185
12093g5185k5608A31741D2689Q803j7106L2931c9860a7830k08825D4507K35660
$$ -75185 -100793 131741 42689 51492 34386 67317 -39860 -17830 -226655 44507 280167
12082B80167C7164J27973b82238c7463M907j26786N6430A12280M0729D0683M346
$$ 280167 37164 165137 -282238 -37463 -32556 -159342 -102912 112280 153009 40683 45029
12071D5029J87618G5986J0199a08178A85564e28479A74229b11777l457j58098
$$ 45029 232647 75986 86185 -108178 185564 -528479 174229 -211777 -215234 -373332
12061c73332A9921K55836J97608P43616l96393C41658I0046I953h9557A52181
$$ -373332 19921 275757 473365 1216981 820588 341658 90046 9953 -89557 152181
12050B43390i5434M609k18229A31068a74692h3281D3203J32623b65785k5697g8848
$$ 243390 -95434 -90825 -309054 131068 -174692 -83281 43203 175826 -265785 -291482 -78848
12038d70098e1388A72951a4325D5735F425h2370I1027e2777C24795A06210b73615
$$ -470098 -51388 172951 -14325 45735 6425 -82370 91027 -52777 324795 106210 -273615
12026g6100k26207m6884A00115k915d6663H9266d23775A45384a92903R5791k13096
$$ -76100 -302307 -349191 100115 97200 -46663 89266 -423775 145384 -192903 -97112 -310208
12015c10208J50737G4143K44182A51986c0339H2269a39135H0263d21833a63947
$$ -310208 -159471 74143 318325 151986 -30339 82269 -139135 80263 -421833 -163947
12004C5222a79152n4195e5372o7619F7948d6362j88525B03338b678B1496b14252
$$ 35222 -179152 -233347 -55372 -122991 67948 -46362 -234887 203338 -2678 21496 -214252
11992A05944A1970J96065G7139a66483A21149B6072h7336n8698B12542c0946B7884
$$ 105944 11970 208035 77139 -166483 121149 26072 -87336 -146034 212542 -30946 27884
11980g3588B41328a8347A83230a11229B958a41006n541j77995I0652i3821k5664
$$ -73588 241328 -18347 183230 -111229 2958 -141006 -146547 -324542 90652 -93821 -119485
11969a19485m3299A48411A6364a0760B04938b72140P9003g1545D0123b7535E8397
$$ -119485 -162784 148411 16364 -10760 204938 -272140 -193137 -71545 40123 -27535 58397
11957e6660r1565A21638J39388b56161J13627J0370d749k56075I8075b54956i6489
$$ -56660 -148225 121638 261026 -256161 -142534 -132164 -4749 -260824 98075 -254956 -96489
11945B79740o3620e3376k83566B18690L24813A30589g3022A23826a05479J4158
$$ 279740 216120 -53376 -336942 218690 543503 130589 -73022 123826 -105479 -91321
11935i1321L9486A42590c2738l2297H3126J80435i1019B17639K1591A3534d4991
$$ -91321 -51835 142590 -32738 -65035 83126 263561 -91019 217639 239230 13534 -44991
11923e8772k96223I1754a57019C08150a29009J6195j84207i3180G5261J39673
$$ -58772 -354995 91754 -157019 308150 -129009 -112814 -297021 -93180 75261 214934
11913B14934H1237b948j45105j44733a45287A97901M735m5213J35659f9761l7528
$$ 214934 81237 -2948 -148053 -292786 -145287 197901 202636 157423 293082 -69761 -107289
11902a07289m4302D07449A85795a03934B43590c9598l541d755A03430B3334b99161
$$ -107289 -151591 407449 185795 -103934 243590 -39598 -43139 -4755 103430 23334 -299161
11890I8711J9438b20239F415J19278B7733J30771f2059E7707C670Q2002a0975
$$ 98711 118149 -220239 6415 125693 27733 158504 -62059 57707 3670 85672 -10975
11878a7829p868j11036a0181k32041D83634b47940j39652N5726a0358k226B01676
$$ -17829 -25697 -136733 -10181 -242222 483634 -247940 -387592 -331866 -10358 -12584 201676
11866a47216N1736D6307J50980a67539A11276J98534C4355J97634d6308A496e9026
$$ -147216 -95480 46307 197287 -167539 111276 309810 34355 231989 -46308 1496 -59026
11854e1639B67613f464n9989k0676c0585j08666F6014K19123F5553a01634j7231
$$ -51639 267613 -6464 -66453 -87129 -30585 -139251 66014 285137 65553 -101634 -118865
11843a18865k4529k13661a31906b3000j48292D6822a15365I7608P9823b65332
$$ -118865 -143394 -357055 -131906 -23000 -171292 46822 -115365 97608 177431 -265332
11832a6394A99468m9418a91312M7899B0636a47294M5344l64873a06160b4353B70024
$$ -16394 199468 150050 -191312 -143413 20636 -147294 -101950 -466823 -106160 -24353 270024
11820H8922a45399j79950a47433f8058K7035A76100E0165R2268b29012B31645
$$ 88922 -145399 -325349 -147433 -68058 -41023 176100 50165 142433 -229012 231645
11809b5482R218k08581L9898D1202g0889j94603o8632J50130p780c1817D8777
$$ -25482 -16264 -224845 -184947 41202 -70889 -265492 -334124 -183994 -191774 -31817 48777
11797g9761J92H6850a54194O9888r1826A56032K0309a02905l08061C9531b01415
$$ -79761 -79569 86850 -154194 -84306 -176132 156032 176341 -102905 -410966 39531 -201415
11785A06695K58396o592G1706N5145J29279b27125A92735a19101K5122B49435
$$ 106695 365091 358499 71706 126851 256130 -227125 192735 -119101 -93979 249435
11774a738A40538F6635J18652A0301a43203l26866J87660Q3788A79409q7859a29756
$$ -1738 140538 66635 185287 10301 -143203 -470069 -282409 -198621 179409 91550 -129756
11762c03835C6713a31045O450j11878R5998B70539K40503b91416C20976A00278
$$ -303835 36713 -131045 -124595 -236473 -140475 270539 511042 -291416 320976 100278
11751a32363H8866f0988D422J01048f6513k25934h1794j83926J17072A86203a91901
$$ -132363 88866 -60988 4422 105470 -66513 -292447 -81794 -265720 -148648 186203 -191901
11739c6484k1417E77c62686A44779b22809d9488m4046B58102a11222e0684C4387
$$ -36484 -57901 577 -362686 144779 -222809 -49488 -93534 258102 -111222 -50684 34387
11727A47976C8194J29673a47660A82297p3925m0498c6549A68025b237k38921C95573
$$ 147976 38194 167867 -147660 182297 108372 67874 -36549 168025 -2237 -241158 395573
11715b23931B64523e6425a4230n8521B39787f6696j59208f5950k34483K1002b4610
$$ -223931 264523 -56425 -14230 -72751 239787 -66696 -225904 -65950 -300433 -279431 -24610
11703a31069H3283d76786J60623f8723j80857f1218F8527I083c01142J45143A85774
$$ -131069 83283 -476786 -316163 -68723 -249580 -61218 68527 9083 -301142 -155999 185774
11691b37521A16675a04969A63702c21189A51964h7792k82964a31731A0738J98691
$$ -237521 116675 -104969 163702 -321189 151964 -87792 -370756 -131731 10738 209429
11681B09429i0667A36267a98692K0613G3830R2309G2028a33527A36861K25476
$$ 209429 -90667 136267 -198692 -178079 73830 166139 72028 -133527 136861 362337
11671C62337d70432o9406B98020A41336f3400A50697a13500O779o8543c0522A641
$$ 362337 -470432 -539838 298020 141336 -63400 150697 -113500 -106721 -175264 -30522 1641
11659a71860H2677J1716a09642k0900A46872b07311B64287j28257l8111b12009
$$ -171860 82677 94393 -109642 -130542 146872 -207311 264287 136030 97919 -212009
11648e6920B55897a82553A24833k8502D030J40130D8029L6537b78831A46616a27009
$$ -56920 255897 -182553 124833 96331 4030 144160 48029 84566 -278831 146616 -127009
11636h1965j3715k0458j10338P8680F0418N5695A0644b47372B79258A26359M3508
$$ -81965 -95680 -116138 -226476 -147796 60418 116113 10644 -247372 279258 126359 169867
11625A69867n9003M5032a41792A66600j7530m1701P9135b084A98399a51222j45665
$$ 169867 110864 155896 -141792 166600 149070 107369 186504 -2084 198399 -151222 -296887
11614b96887J41592B20339c97438a80242J0391C4584a80793G2075e3430A75514
$$ -296887 -155295 220339 -397438 -180242 -169851 34584 -180793 72075 -53430 175514
11603c6662M89r6060A3390b66709B16224h0229A40833e8817A98107K7089b70501
$$ -36662 -36173 -132233 13390 -266709 216224 -80229 140833 -58817 198107 225196 -270501
11591A15493e2561j08156B00654E2958a10475A59625b9122F5235b09399J9888
$$ 115493 -52561 -160717 200654 52958 -110475 159625 -29122 65235 -209399 -189511
11581a89511B75631a02643o2457B7814b840D3693P2941n5060R1390N680o8885
$$ -189511 275631 -102643 -165100 27814 -2840 43693 116634 61574 152964 158644 89759
11570H9759J22529F5167J83754b62979A1904K1213a08921k4827A75409b73075
$$ 89759 212288 65167 248921 -262979 11904 33117 -108921 -133748 175409 -273075
11559c4885j72331D35797a10776B04780a8548O703q2342A37369h7163D028b11952
$$ -34885 -207216 435797 -110776 204780 -18548 -11845 -94187 137369 -87163 4028 -211952
11547c9216r1552A84661e4806J8878o9589D3147a96353J1571A17377i578B39557
$$ -39216 -130768 184661 -54806 -35928 -105517 43147 -196353 -184782 117377 -9578 239557
11535C3084i9491B2885K52164a40165A17013R9061E5956J81245F7086J66987f5885
$$ 33084 -99491 22885 275049 -140165 117013 216074 55956 237201 67086 234073 -65885
11523b50380O3226i189C45157b0454B34f6192C80429d47829F14582G0421a17899
$$ -250380 -187154 -9189 345157 -20454 234 -66192 380429 -447829 614582 70421 -117899
11511a14280A08081A8204M14603c6046I2956J13728c3436I9815h9185K959m6518
$$ -114280 108081 18204 432807 -36046 92956 206684 -33436 99815 -89185 -86226 -132744
11500a32744B88791h6195C88846j69991l698q3385a06091m4339e183D0497j9194
$$ -132744 288791 -86195 388846 218855 215157 131772 -106091 -150430 -5183 40497 21303
11489B1303d08031B09909K37279g2697k987A93565H4002K23421b48783B22443
$$ 21303 -408031 209909 447188 -72697 -75684 193565 84002 307423 -248783 222443
11478B85563a16944k6814D53759A89246g8279a52G8260J54597I7065J95577a62681
$$ 285563 -116944 -143758 453759 189246 -78279 -152 78260 232857 97065 292642 -162681
11466A08649E1809K38391A9280i0221b914B27565G1154a44830A45504D1554o65
$$ 108649 51809 290200 19280 -90221 -2914 227565 71154 -144830 145504 41554 40889
11455D0889K39630F3736K65464B0821d9125A81120j2202B913f7244A48518M9529
$$ 40889 280519 63736 329200 20821 -49125 181120 168918 2913 -67244 148518 198047
11444A98047h3484M0665B7571K4858K22589D1474K05948F1233J02103j0231b3183
$$ 198047 -83484 -42819 27571 52429 275018 41474 247422 61233 163336 153105 -23183
11432a32950K0160J6922d977q8299B98402a65041B30285A13520R4631b15161F1322
$$ -132950 -112790 -95868 -4977 -93276 298402 -165041 230285 113520 208151 -215161 61322
11420B2853J43698N0465I6405g4151J5926A37376Q2082a41963b3288B36141l6215
$$ 22853 166551 217016 96405 -74151 -58225 137376 219458 -141963 -23288 236141 199926
11409A99926J47341e5903A81962b88907f1200G2482K01003b12096A99936k2354
$$ 199926 347267 -55903 181962 -288907 -61200 72482 273485 -212096 199936 177582
11399A77582G2282a95510D1397a32060B97303a08170n34255a20409B34489H977
$$ 177582 72282 -195510 41397 -132060 297303 -108170 -642425 -120409 234489 8977
11388A18047h175l34604a33201k8812A01643B6883a65258A34872L0827l7581c28927
$$ 118047 -8175 -342779 -133201 -162013 101643 26883 -165258 134872 165699 128118 -328927
11376B18900b28554b5889j80119A5294L68790j71267c431D837J7080J59414c938
$$ 218900 -228554 -25889 -206008 15294 384084 212817 -3431 4837 21917 181331 -3938
11364a26840I6266N1916N6822D6132J25730b06345A53452h7958C6938a45349d0857
$$ -126840 96266 148182 205004 46132 171862 -206345 153452 -87958 36938 -145349 -40857
11352b81473A81268E40d3048j51611A42924E7157R5382Q2703b01087A82795e5737
$$ -281473 181268 540 -43048 -194659 142924 57157 152539 235242 -201087 182795 -55737
11340c46641a09682J0987j94143A22769B2281i3935A3763K84188a56174F3372
$$ -346641 -109682 -98695 -292838 122769 22281 -93935 13763 297951 -156174 63372
11329A40769A6934b56400M5616F3201c3243F5358l1623b15412A21641c0226A71791
$$ 140769 16934 -256400 -210784 63201 -33243 65358 33735 -215412 121641 -30226 171791
11317G4380d7028B9910J20619L20803b31183J00062q5341A8731J57086M1378a95110
$$ 74380 -47028 29910 150529 471332 -231183 -131121 -216462 18731 175817 217195 -195110
11305i8295l2105j3294H3537O9182B6063a58665l15367B36318a83150e0633a4455
$$ -98295 -130400 -143694 83537 152719 26063 -158665 -474032 236318 -183150 -50633 -14455
11293D0598b870r332p9511H6877D524a82229B50277r7129A6691a31569A8982g5929
$$ 40598 -2870 -12202 -91713 86877 4524 -182229 250277 153148 16691 -131569 18982 -75929
11280a79086j56424a01316d5287K1435A25157C5184J12899o4234c2665F9026b49069
$$ -179086 -335510 -101316 -45287 -23852 125157 35184 148083 83849 -32665 69026 -249069
11268I0975a43450f1348j33297g3406B8201r652a9603C71175I6831M1698a52234
$$ 90975 -143450 -61348 -194645 -73406 28201 18549 -19603 371175 96831 138529 -152234
11256b47866C7023o577M2460J71849F4052E713a23625k0749D65550k10824a72774
$$ -247866 37023 30446 72906 244755 64052 5713 -123625 -144374 465550 254726 -172774
11244a90325B63245a81814L3802d8034J338a3615G0158O7743O2918b52146C53472
$$ -190325 263245 -181814 -148012 -48034 -46696 -13615 70158 137901 200819 -252146 353472
11232a37936a9185j10227q6082i3280d2170A16644K05541C3703b21849a02369
$$ -137936 -19185 -129412 -215494 -93280 -42170 116644 322185 33703 -221849 -102369
11221d9185j20517I9059l853h1547A9546p370K41096E4592N9646A7427a30664
$$ -49185 -169702 99059 95206 -81547 19546 12176 253272 54592 114238 17427 -130664
11209A57403a1500D0691h3216D1572Q4048J31070a93422A47152j7807a17529c5633
$$ 157403 -11500 40691 -83216 41572 125620 256690 -193422 147152 129345 -117529 -35633
11197A08029a6162B8939b70991h3938k60646C50380F5293b5631C0347c00757O0836
$$ 108029 -16162 28939 -270991 -83938 -344584 350380 65293 -25631 30347 -300757 -239921
11186b39921A51537n4587b33770L0544J5406b9854A17584K44967j00160a5642
$$ -239921 151537 96950 -233770 -203226 -187820 -29854 117584 362551 262391 -15642
11175a61466a2810l08026B96186f811l1066I9989Q9030f71A88156l0000e28207
$$ -161466 -12810 -320836 296186 -6811 -37877 99989 189019 -671 188156 158156 -528207
11163b34520A14760a29237F3227K7124i2983I6012J22445C594f8246a349A97075
$$ -234520 114760 -129237 63227 90351 -92983 96012 218457 3594 -68246 -1349 197075
11151A3555b30365h2871q5030b9751p7691l0792d3305A92191E2327M0240K10315
$$ 13555 -230365 -82871 -167901 -29751 -107442 -138234 -43305 192191 52327 92567 302882
11140C02882J10682a02087A28301c04813F7014J81478G5846d3202C21751K3031
$$ 302882 413564 -102087 128301 -304813 67014 248492 75846 -43202 321751 344782
11130C44782A4350b09265A05268k949A8670K22550G8358M4224c1941A6463R8677
$$ 344782 14350 -209265 105268 102319 18670 241220 78358 122582 -31941 16463 115140
11119A15140K935a04440A10922R8372h5225B92778A19738n0562B8645e22929a29047
$$ 115140 118075 -104440 110922 209294 -85225 292778 119738 69176 28645 -522929 -129047
11107a79605B29981r2731L27806k4986A69262p8079b99138E5758K49339K75451
$$ -179605 229981 137250 465056 440070 169262 91183 -299138 55758 305097 580548
11097E80548A25843J85639J26053f1694A49763c551A46562N1296F2844P4612L562
$$ 580548 125843 311482 437535 -61694 149763 -3551 146562 197858 62844 137456 141018
11086A41018K33654f4591B31041L71166j08366B26251n8646a0282D19139K0427
$$ 141018 374672 -64591 231041 602207 493841 226251 167605 -10282 419139 439566
11076D39566E9456J87714E6498L45253j74532A01390J04776J66775O3933k04584
$$ 439566 59456 247170 56498 401751 227219 101390 206166 372941 436874 232290
11066B32290N99602k94984j03067j69825K14237A66707L36080n7232K11691l27424
$$ 232290 831892 536908 433841 264016 478253 166707 502787 445555 657246 329822
11056C29822J54022r8156Q0476K09755k90649M09636o4764j27831J74738J19652
$$ 329822 483844 385688 466164 675919 385270 794906 730142 602311 777049 896701
11046H96701C56551L88683K28682k78829k0731K0872j31958L54958l78089M302
$$ 896701 356551 745234 973916 695087 674356 695228 563270 918228 540139 544441
11036E44441K29393j52427J38151j00183N1814K8152j07183O1465q1103J86373
$$ 544441 773834 621407 759558 659375 711189 739341 632158 693623 612520 798893
11026G98893l43205L9301k9123O2940K59364k44321Q7315j69781q6510K74659
$$ 798893 455688 494989 465866 528806 788170 543849 631164 461383 374873 649532
11016F49532k91907K63454k37158J01724j13118J10843j78500K54699k22912N05444
$$ 649532 357625 621079 383921 485645 372527 483370 304870 559569 336657 842101
11006H42101k53583j08146q1096k630q9329K68725J76513l14310M41227M6665
$$ 842101 588518 480372 399276 396646 307317 576042 752555 438245 879472 926137
10996I26137k03764l43668J01387J57912K2821M47024E07778L36549j50775l21825
$$ 926137 722373 378705 480092 638004 660825 1107849 507778 844327 693552 371727
10986C71727Q37984k13479j07373l02393O17950L0137j47908N10986j86511N08381
$$ 371727 1209711 996232 888859 586466 1204416 1234553 1086645 1597631 1411120 1919501
10976A919501N2247M58747n6039N32373j42521J38786j84475j49815l29523n1739
$$ 1919501 1971748 2430495 2374456 2906829 2764308 2903094 2718619 2568804 2239281 2187542
10966B187542k05500p89617P9870q8673l3235l60622K42245P0630j42612l575
$$ 2187542 1982042 1192425 1272295 1183622 1150387 789765 1032010 1102640 960028 956453
10956I56453m0598n6063j39058R9943k94900k7200B15131M77731k77890I9600
$$ 956453 915855 859792 720734 820677 525777 498577 215131 692862 414972 99600
10945D7264L52032D4391n80M86252B56075p3357L9722A10062O1846p6910M228
$$ 47264 399296 44391 43811 530063 256075 182718 222440 110062 171908 94998 99226
10934I9226L3467b1279n7542F0440a63545A2808K94747M3639H4380k0073e8306
$$ 99226 132693 -21279 -78821 60440 -163545 12808 307555 351194 84380 64307 -58306
10922d1851B3574R8126P1236P5048C1616f8791m4056q3158I6107K2957b01906
$$ -41851 23574 121700 192936 267984 31616 -68791 -112847 -196005 96107 119064 -201906
10910B5763R7570R7019j5243o157b98211A26935K79915I6975a80647b6908p6841
$$ 25763 123333 220352 205109 198952 -298211 126935 406850 96975 -180647 -26908 -103749
10899a03749L7498J1261C089K2381a00773a6767j87499B79529q4141r1159m1326
$$ -103749 -66251 -54990 3089 25470 -100773 -16767 -204266 279529 195388 104229 62903
10888F2903b01599B80617a29669p6890B88773g0517G536L0346Q959a77480K9039
$$ 62903 -201599 280617 -129669 -206559 288773 -70517 7536 37882 46841 -177480 -148441
10877a48441A49083b05922C24016a53140a2667j88915B3719J4912c59426A2119
$$ -148441 149083 -205922 324016 -153140 -12667 -201582 23719 38631 -359426 12119
10866D612K18902b76198e3047a1265n6089D7531a6239A41745M9245B510b07758
$$ 4612 223514 -276198 -53047 -11265 -67354 47531 -16239 141745 190990 2510 -207758
10854d9055G6143a84647G2512O6875o6922B6847L5868P4533b3801k97483b2041
$$ -49055 76143 -184647 72512 139387 72465 26847 62715 137248 -23801 -321284 -22041
10842B19190a78468d2237j98515J11873l7581H5868L7464j6528J75247a68660
$$ 219190 -178468 -42237 -240752 -128879 -166460 85868 123332 106804 282051 -168660
10831B53417c74121G3548i6407K5599q4395j5256g6614k34798j54200A1233n505
$$ 253417 -374121 73548 -96407 -70808 -155203 -170459 -76614 -311412 -465612 11233 5728
10820E728h7417A19166b08592i0171m0157F6997c20876A88765c57820a44229C149
$$ 5728 -87417 119166 -208592 -90171 -130328 66997 -320876 188765 -357820 -144229 3149
10808A49746a18609k53119C36464C0108J99777b7618k2424m1925L6262A31312
$$ 149746 -118609 -371728 336464 30108 229885 -27618 -50042 -91967 -55705 131312
10797A53789A7774b22447a04664o2789P9847O773k84308A59292C8741c25142R7073
$$ 153789 17774 -222447 -104664 -167453 -87606 -80833 -365141 159292 38741 -325142 -228069
10786b28069N7766B37403a6245A43344n0612a63826L0112n3842A55959a32787
$$ -228069 -170303 237403 -16245 143344 92732 -163826 -133714 -187556 155959 -132787
10775b3332j46633a4516B31849h3800g693k24468j10386C09527a98116j1469O7132
$$ -23332 -169965 -14516 231849 -83800 -7693 -232161 -342547 309527 -198116 -209585 -142453
10764a42453j98663M6802A5573K45055a34248A68301c3857B15210i0502j0464
$$ -142453 -341116 -294314 15573 260628 -134248 168301 -33857 215210 -90502 -100966
10754a00966J2525I0073C9243J05412C3979c46094a61868J0208A7756J23614P3496
$$ -100966 -88441 90073 39243 144655 33979 -346094 -161868 -151660 17756 141370 214866
10743B14866G3252K406c08710A47807A9362d2116C07169g0154j82388h7617l6616
$$ 214866 73252 75658 -308710 147807 19362 -42116 307169 -70154 -252542 -87617 -124233
10732a24233o4041M2977A22894a96774N3428A73259n1523M0792a1769A21284c27561
$$ -124233 -188274 -145297 122894 -196774 -143346 173259 121736 162528 -11769 121284 -327561
10720I1444P6599q0703d13554a09074C12259d0394G3187e8483A15968a6842n7220
$$ 91444 168043 87340 -413554 -109074 312259 -40394 73187 -58483 115968 -16842 -74062
10709g4062B56936c45201B45125A1311b36033I296J455a21965C1253J50543n723
$$ -74062 256936 -345201 245125 11311 -236033 9296 10751 -121965 31253 181796 176073
10698A76073H7060N0335c47005D590d42613a40013d5666j48243a1436j27166n6872
$$ 176073 87060 137395 -347005 4590 -442613 -140013 -45666 -193909 -11436 -138602 -195474
10687a95474F3614r549b10677F1588a01425B4751h5373a4037p7070A22832a9802
$$ -195474 63614 54065 -210677 61588 -101425 24751 -85373 -14037 -91107 122832 -19802
10675a59735A64115a48672f5045k7859l01615J46227A08948a78155F8414K1699
$$ -159735 164115 -148672 -65045 -92904 -394519 -248292 108948 -178155 68414 90113
10665I0113e19379d0767k33842F8411a89638Q9940m93750I6260a25983B72896
$$ 90113 -519379 -40767 -274609 68411 -189638 -99698 -593448 96260 -125983 272896
10654f8942A25856D8481J26871p8975a07710E777K9494a4233j60946A01825J36440
$$ -68942 125856 48481 175352 96377 -107710 5777 35271 -14233 -175179 101825 238265
10643B38265h8906A60585g2896l5890H8127a15080N5033G455c80251A8264d5351
$$ 238265 -88906 160585 -72896 -108786 88127 -115080 -60047 7455 -380251 18264 -45351
10631D4375e346j8246o4874H1370A9514Q3822b52267b9783k0630C00521a0519
$$ 44375 -5346 -23592 -88466 81370 19514 103336 -252267 -29783 -50413 300521 -10519
10619A91754g1846I3304Q0935f8955b2496C8343a73330K9468j01681A20970c40727
$$ 191754 -71846 93304 174239 -68955 -22496 38343 -173330 -143862 -245543 120970 -340727
10607b58907J9686J10399c9204l04274B70784I9051J44757E376c7291L986G6894
$$ -258907 -239221 -128822 -39204 -343478 270784 99051 243808 5376 -37291 -33305 76894
10595A98451a01967B14948f3415A39392l5696b45793H9785f5393E1153c72090
$$ 198451 -101967 214948 -63415 139392 103696 -245793 89785 -65393 51153 -372090
10584a01552K860A77530b1149B23056c9729F8204k5484i8973A97414f7667R922
$$ -101552 -98692 177530 -21149 223056 -39729 68204 42720 -98973 197414 -67667 -57745
10573e7745m75119H568d3950k42455F799K9013e975C9628o391J20322l399c1236
$$ -57745 -532864 8568 -43950 -286405 6799 35812 -5975 39628 33237 153559 150160 -31236
10560A73539h6091q0015l3934n7032B32786a71223j09276J2749J19477A05862
$$ 173539 -86091 -166106 -200040 -257072 232786 -171223 -280499 -267750 -148273 105862
10549C89855c02724A06073a81948j18013b3427C19656I8863a02743A22486E2543
$$ 389855 -302724 106073 -181948 -299961 -23427 319656 98863 -102743 122486 52543
10538b37623c100j61973d1583l67621I8058b68021e9617F5572g4135j62785f2625
$$ -237623 -3100 -165073 -41583 -409204 98058 -268021 -59617 65572 -74135 -236920 -62625
10526A34311a62191b7056k4181A44657D7910J34297a3199H6383g5260j33224N4054
$$ 134311 -162191 -27056 -51237 144657 47910 182207 -13199 86383 -75260 -208484 -154430
10515a54430l9940b2798e608C7856d5098k7128B2510d1296r1298j32078h9692
$$ -154430 -194370 -22798 -5608 37856 -45098 -72226 22510 -41296 -132594 -264672 -89692
10503A31012f7378j12602Q488D067J6174a1039j58466j42095f1130j65648F0699
$$ 131012 -67378 -179980 -171492 4067 20241 -11039 -169505 -311600 -61130 -226778 60699
10491B73719a50594f3521F2496c2528j32777j25901i4217A2229L43075b853l0484
$$ 273719 -150594 -63521 62496 -32528 -165305 -291206 -94217 12229 355304 -2853 -33337
10480c3337p2832a1117j08446A0957f3936A69388a81097c165A3692c264B95480
$$ -33337 -106169 -11117 -119563 10957 -63936 169388 -181097 -3165 13692 -3264 295480
10468a61625e9895R897B03485a08248A4817b21687p3055L9015h5575D6602a85332
$$ -161625 -59895 -49998 203485 -108248 14817 -221687 -294742 -255727 -85575 46602 -185332
10456a0305l91810f8749c3122R038C5256d3260o0979g578G0550b36886J01665
$$ -10305 -402115 -68749 -33122 -24084 35256 -43260 -104239 -7578 70550 -236886 -135221
10445a35221M7581B94230I0954a7581H2777a72022l9263G9358K78236A48510d0336
$$ -135221 -87640 294230 90954 -17581 82777 -172022 -211285 79358 357594 148510 -40336
10433d2006J6399k71006i825k61110d5856F5346m668B4642J67747f4974b2269
$$ -42006 -25607 -296613 -9825 -270935 -45856 65346 60678 24642 192389 -64974 -22269
10421b2312A04579f1506j22879F5918a23198j51238i8547b8065D4591c9504A78652
$$ -22312 104579 -61506 -184385 65918 -123198 -274436 -98547 -28065 44591 -39504 178652
10409A873N7020J54801J6858d06098M7574c1634p5044B52631p6619q3347K05729
$$ 1873 58893 213694 230552 -406098 -358524 -31634 -106678 252631 176012 92665 298394
10398B98394H0284J8924J479j0389e0930A52201K78048n1642j19870n2057g1214
$$ 298394 80284 99208 100687 90298 -50930 152201 430249 378607 258737 206680 -71214
10386B31916j03640R4365K54920c039F5417Q5694N2302F5994J64866b52094B08617
$$ 231916 128276 222641 477561 -3039 65417 151111 203413 65994 230860 -252094 208617
10374e4175A63692Q3708F6038J53831J30145d2566D11727j61033K45728q2416
$$ -54175 163692 247400 66038 219869 350014 -42566 411727 250694 496422 414006
10364D14006D9860J0873L33730H6382L44598A3143J04051Q8556C7507A4759P6532
$$ 414006 49860 60733 394463 86382 430980 13143 117194 205750 37507 14759 91291
10353I1291K01512K46628J13516B90071K98452I5317L44246J5833F1490L37905
$$ 91291 292803 539431 652947 290071 588523 95317 439563 455396 61490 399395
10343C99395A33997J55925A18363J88238G913L55933j45149j8282f4552I9758
$$ 399395 133997 289922 118363 306601 7913 363846 218697 200415 -64552 99758
10332a22109J1942C32107G1887K1642N1366J31238k8085O1097I1493L09763O7232
$$ -122109 -110167 332107 71887 93529 144895 276133 248048 309145 91493 401256 468488
10321D68488A38595J63705q6201a95545C4350c2477D9153b26304B35575d5776
$$ 468488 138595 302300 216099 -195545 34350 -32477 49153 -226304 235575 -45776
10310A20278a60168G8293a1760A86685a63904f6740b6857l06332f8158H7212b81148
$$ 120278 -160168 78293 -11760 186685 -163904 -66740 -26857 -333189 -68158 87212 -281148
10298C5940k027e4342r4348b012A10551e2375J514A8902J72198d729l1106A47273
$$ 35940 33913 -54342 -148690 -2012 110551 -52375 -50861 18902 191100 -4729 -35835 147273
10285a42748P0405b113k30911D6571a17779j02538G4527c51426B12173d29992
$$ -142748 -72343 -2113 -233024 46571 -117779 -220317 74527 -351426 212173 -429992
10274c4845m6589j67648h4751a7886G903J55187p0123a65941A09765c5328H877
$$ -34845 -81434 -249082 -84751 -17886 7903 163090 92967 -165941 109765 -35328 8877
10262h6016F2540K13339n4037a76599A80861B5090n394J49922a23844A20877K19365
$$ -86016 62540 275879 221842 -176599 180861 25090 19696 169618 -123844 120877 340242
10251C40242a7740H290K32263A08908B3762M4136b76344C0047a80188K5197M3113
$$ 340242 -17740 8290 240553 108908 23762 67898 -276344 30047 -180188 -154991 -111878
10240a11878C666K7086a43181N4363F2023b68762c188B0292c57191a78024A39889
$$ -111878 3666 30752 -143181 -88818 62023 -268762 -3188 20292 -357191 -178024 139889
10228F7131j1116a37045F6714R297a0438j52776H0439a50812k44920K2268A63408
$$ 67131 56015 -137045 66714 76011 -10438 -163214 80439 -150812 -395732 -373464 163408
10216H0182l8819N8622J93019R7391a66752A42667L0468a55485O2276H812Q5556
$$ 80182 41363 99985 293004 390395 -166752 142667 173135 -155485 -93209 8812 94368
10205I4368c01812J40803O3515B03791e41038B24355d30223B35099D9091b22221
$$ 94368 -301812 -161009 -97494 203791 -541038 224355 -430223 235099 49091 -222221
10194a9422B24927A02089a28338A02599b92612O1894Q364d7229k5328j45903c2049
$$ -19422 224927 102089 -128338 102599 -292612 -230718 -222354 -47229 -72557 -218460 -32049
10182A41602g9962I7371a07100F1991a40057B54368b94380a06763c5494E9931
$$ 141602 -79962 97371 -107100 61991 -140057 254368 -294380 -106763 -35494 59931
10171A17941J01692a22666J1191H6377J11125a98438F1516J22587E8303b20313
$$ 117941 219633 -122666 -111475 86377 197502 -198438 61516 184103 58303 -220313
10160c75243N7711A32620J30289b09325a0784A0119a62953j4848A8589d1567D0070
$$ -375243 -317532 132620 262909 -209325 -10784 10119 -162953 -177801 18589 -41567 40070
10148b54191a25202k0487j80443m7262H0565c03788B5843N5557a3697k44548p025
$$ -254191 -125202 -145689 -326132 -373394 80565 -303788 25843 81400 -13697 -258245 -265270
10137b65270a04927L8671j7903k04869J22823P8611a4135r6987M7951B1392a23347
$$ -265270 -104927 -66256 -84159 -289028 -166205 -87594 -14135 -111122 -63171 21392 -123347
10125a18815o7120k09593g3107I1051e3488k0223j3660j46393A57797C9112d1770
$$ -118815 -185935 -395528 -73107 91051 -53488 -73711 -87371 -233764 157797 39112 -41770
10113b39437A03549K8612K63537i4308B9738N9010a14964l8118C2344b14974E624
$$ -239437 103549 132161 395698 -94308 29738 88748 -114964 -153082 32344 -214974 5624
10101A64397f8209j92481B23044b89817d6603r4756a8774j37310A42610P5556
$$ 164397 -68209 -260690 223044 -289817 -46603 -141359 -18774 -156084 142610 218166
10091B18166b5753j29943Q171I1225a88188O9178k39682o0441A49487b9051l29243
$$ 218166 -25753 -155696 -147525 91225 -188188 -119010 -358692 -419133 149487 -29051 -358294
10080c58294J9098J44975M9745G0778i7894j18768A14882g4955n1608I2778K9059
$$ -358294 -339196 -194221 -144476 70778 -97894 -216662 114882 -74955 -126563 92778 121837
10069A21837D1212M98090D4739b21304A01995J3969b51616M4286j05859A5148
$$ 121837 41212 539302 44739 -221304 101995 115964 -251616 -207330 -313189 15148
10058a4917D4344a05241O284j98307g0542E18513a14819B2054c08652g4464E4931
$$ -14917 44344 -105241 -98957 -297264 -70542 518513 -114819 22054 -308652 -74464 54931
10046c05434B50276c29652H4040c24357A06299b59308b6166G5028b02724d7452
$$ -305434 250276 -329652 84040 -324357 106299 -259308 -26166 75028 -202724 -47452
10035E1200b24686j3514f440k41838p8406B0435b13439A46630e1061b3395k30687
$$ 51200 -224686 -238200 -6440 -248278 -326684 20435 -213439 146630 -51061 -23395 -254082
10024b54082C22528A19553a48169o5424E969b67917A74435a01570B8411N4634
$$ -254082 322528 119553 -148169 -213593 5969 -267917 174435 -101570 28411 83045
10014H3045L4897o369a18557j23706d0036l7693B35505c10792a37763K6230A1592
$$ 83045 117942 111573 -118557 -242263 -40036 -77729 235505 -310792 -137763 -111533 11592
10002A27639a74390M8959J3945j9500q0016O8154A09222k0558e0114j36625R819
$$ 127639 -174390 -125431 -111486 -130986 -211002 -142848 109222 88664 -50114 -186739 -176920
9991a76920I8257b9740j9952A51915d5358k48671b1639C7824b0985p9938J7775
$$ -176920 98257 -29740 -49692 151915 -45358 -294029 -21639 37824 -20985 -100923 -83148
9980h3148F6307L5645G54b44526a14033A90406a33790q3781P6464b8792B88629
$$ -83148 66307 101952 754 -244526 -114033 190406 -133790 -217571 -141107 -28792 288629
9968g6727C9635b00002b2832D80742a07848C00711c1096m6078E0982K95170A27574
$$ -76727 39635 -200002 -22832 480742 -107848 300711 -31096 -77174 50982 346152 127574
9956A85595a98661g3233G1355b88842B5398P4538b27589E090J41622A5732O1661
$$ 185595 -198661 -73233 71355 -288842 25398 99936 -227589 5090 146712 15732 77393
9945G7393h5782D63564h6550c0088k02602f2197n4695l8811F2290J42311a15650
$$ 77393 -85782 463564 -86550 -30088 -232690 -62197 -116892 -155703 62290 204601 -115650
9933C742K40431o2341a47805j51012a39886d067k9300B8013J425L6031c54348
$$ 3742 244173 181832 -147805 -298817 -139886 -4067 -33367 28013 29438 65469 -354348
9921b05105h8717J307l55380g862j36602O10B87250a28735N3800J1957A19326
$$ -205105 -88717 -87410 -442790 -7862 -144464 -143854 287250 -128735 -74935 -62978 119326
9909c63865A13821D8548f7949l7668o5411d1962r1546p7496c63A16731i8653k21619
$$ -363865 113821 48548 -67949 -105617 -171028 -41962 -133508 -211004 -363 116731 -98653 -320272
9897c20272h9205k02395i7377L4200B1150i96j56114b4594B8126b83168A82175
$$ -320272 -89205 -291600 -97377 -63177 21150 -996 -157110 -24594 28126 -283168 182175
9885c7771j0573J4812k80912J46001d9121h274j19037j53622a16549C6262L768
$$ -37771 -48344 -33532 -314444 -168443 -49121 -8274 -127311 -280933 -116549 36262 40030
9874D0030n060c92482b4766l57493G6888b6790m1173C63406b225j54442B28350
$$ 40030 34970 -392482 -24766 -382259 76888 -26790 -67963 363406 -2225 -156667 228350
9862d28740F1206d6599l89937E5510j7029b97360a02275L3074k69105E1035J33783
$$ -428740 61206 -46599 -436536 55510 38481 -297360 -102275 -69201 -338306 51035 184818
9851A84818O8993a02516o9028B37592b5325k69731a13754A1543g6237A15964d2421
$$ 184818 253811 -102516 -171544 237592 -25325 -295056 -113754 11543 -76237 115964 -42421
9839a90909E8366c30347h3973c276p4162j22620J8983j19351g6306c6088r9690
$$ -190909 58366 -330347 -83973 -3276 -77438 -200058 -181075 -300426 -76306 -36088 -135778
9828a35778n3675b6537l118I9533j2367J411j1186J07363b16636A77239b59G3506
$$ -135778 -189453 -26537 -29655 99533 87166 88577 77391 184754 -216636 177239 -259 73506
9815B91130D6510c34696A1693h1579C22435j05147b18957P157e1966j80577P3099
$$ 291130 46510 -334696 11693 -81579 322435 217288 -218957 -211800 -51966 -232543 -159444
9804a59444P2248C8332a65815C7682A5501O1846J76748J7022c7751E1790a21310
$$ -159444 -87196 38332 -165815 37682 15501 77347 254095 271117 -37751 51790 -121310
9792h7385E0492a99441O8575E6234a60100A38912j4153b58892L8226C743i2480
$$ -87385 50492 -199441 -130866 56234 -160100 138912 124759 -258892 -220666 3743 -92480
9780b88004Q2059p2551B02692I5559a35578n88B65422J68815b53028a2195j40165
$$ -288004 -205945 -278496 202692 95559 -135578 -136166 265422 434237 -253028 -12195 -152360
9769a52360C1585m238a83019B474a02566K7596n8485a2756p8622B01423b72285
$$ -152360 31585 27347 -183019 2474 -102566 -74970 -133455 -12756 -91378 201423 -272285
9757a51286e1076K2671q4729j8721A44398o6950h0674l67653b9356p492o5886
$$ -151286 -51076 -28405 -113134 -131855 144398 77448 -80674 -448327 -29356 -36848 -102734
9746a02734A55560C6462J50423l0330N9814B2499a95980p765C0248b64556H6880
$$ -102734 155560 36462 186885 156555 216369 22499 -195980 -203745 30248 -264556 86880
9734a05657j57246M5199a5208l55776A81921D0380a42967m9169J8812b1725A9147
$$ -105657 -262903 -217704 -15208 -370984 181921 40380 -142967 -192136 -173324 -21725 19147
9722b34046p4370f8735j86874E627g2853l0322o6388q9480Q9156r0762B1646c16911
$$ -234046 -308416 -68735 -255609 5627 -72853 -103175 -169563 -259043 -169887 -260649 21646 -316911
9709a02935b6228f342o8373A09918b31400h5292b6077D4467K04505B9445a88969
$$ -102935 -26228 -6342 -74715 109918 -231400 -85292 -26077 44467 248972 29445 -188969
9697d89592C563K72571I074c5214n08006J81080h8310r9502a6001G2543q910b80551
$$ -489592 3563 276134 9074 -35214 -543220 -362140 -88310 -187812 -16001 72543 63633 -280551
9684a90802B98747e17436G4605b19954r1676f2390m0501j66302M817B87007B9351
$$ -190802 298747 -517436 74605 -219954 -311630 -62390 -102891 -269193 -264376 287007 29351
9672c08026a21625E4498a86506c838p3949N089j13024O9163b3695A57483E3216
$$ -308026 -121625 54498 -186506 -3838 -77787 -72698 -185722 -116559 -23695 157483 53216
9660E3767j2939b52616e9025j75847j33129C1386J45209c2177k76642A65853G3478
$$ 53767 40828 -252616 -59025 -234872 -368001 31386 176595 -32177 -308819 165853 73478
9648b91054B01425D1582c3072j84335c8850A49939c3403A54376J84121j32880
$$ -291054 201425 41582 -33072 -217407 -38850 149939 -33403 154376 338497 205617
9638B05617a62301E2628J14142l951E7645K1660c6607E6267a91842R5822A65289
$$ 205617 -162301 52628 166770 162819 57645 79305 -36607 56267 -191842 -96020 165289
9626e9737A4090f48892b73531e2665B5411c05365A51486b10366J02371A51207
$$ -59737 14090 -648892 -273531 -52665 25411 -305365 151486 -210366 -107995 151207
9615a7440B2397i6539A88020a65553j27803J5696l433P8866L7272B5901J4883
$$ -17440 22397 -96539 188020 -165553 -293356 -277660 -281093 -202227 -164955 25901 40784
9604D0784i283A34267a99024m629B98147C9981h4824B8843c9559k04995B49651
$$ 40784 -9283 134267 -199024 -203653 298147 39981 -84824 28843 -39559 -244554 249651
9592A738b5933l53817B6282O7283b80668j89581a04409k40429d9619j98934P7105
$$ 1738 -25933 -379750 26282 93565 -280668 -470249 -104409 -344838 -49619 -248553 -171448
9581a71448J5549I4409a35059K8008C35772a84850h7169l96767f1762j23202A99906
$$ -171448 -155899 94409 -135059 -107051 335772 -184850 -87169 -483936 -61762 -184964 199906
9569a88438P6871F6699K08067g6551A189a66502C09834a39177k742j29697J34251
$$ -188438 -111567 66699 274766 -76551 1189 -166502 309834 -139177 -141919 -271616 -137365
9558a37365R767L1289p8939A17307m1569c02605f6385L0204F624a30557c3672
$$ -137365 -127598 -96309 -175248 117307 75738 -302605 -66385 -36181 6624 -130557 -33672
9546a37816L6068H623a99025B84827c33802d4116o0381k2922M9215H64d28845
$$ -137816 -101748 8623 -199025 284827 -333802 -44116 -104497 -127419 -78204 864 -428845
9534H1506f9187o9998B3377c06820d6274m6795j53454P4372J3565j76837D1321
$$ 81506 -69187 -139185 23377 -306820 -46274 -93069 -246523 -172151 -158586 -335423 41321
9522g0129a9618m10694f5856p3054e6680n9425j44174a03664A92436b25978G0551
$$ -70129 -19618 -430312 -65856 -138910 -56680 -116105 -260279 -103664 192436 -225978 70551
9510a78298A68934b71443a05206j63867F3943b73412g083n9589j32727m4856L0943
$$ -178298 168934 -271443 -105206 -269073 63943 -273412 -7083 -66672 -199399 -244255 -213312
9499b13312e8663I2450m5480g1175J2281J496j24431I196f2971h247I9732L9029
$$ -213312 -58663 92450 46970 -71175 -58894 -57398 -181829 9196 -62971 -8247 99732 138761
9487A38761d3245C5964J73256p2728c48772J19014O4351k9744m8979A92759h3974
$$ 138761 -43245 35964 209220 136492 -348772 -229758 -165407 -195151 -244130 192759 -83974
9475A43231b53920Q7303e5719G119K05489M4835b85345h3189j32441M6939A24046
$$ 143231 -253920 -166617 -55719 7119 212608 257443 -285345 -83189 -215630 -168691 124046
9463A12758c19908h2202G5437P4096e8393j87925A18943G789J10380l4470g0023
$$ 112758 -319908 -82202 75437 149533 -58393 -246318 118943 7789 118169 83699 -70023
9451a30675j06857O1037r5682B8833N65927A64853h2465H0919d64726I3099O5847
$$ -130675 -237532 -176495 -272177 28833 594760 164853 -82465 80919 -464726 93099 158946
9440A58946a80520k95881i929j14491H5333j6491M24490I1483b39421J3632D4388
$$ 158946 -180520 -476401 -9929 -124420 85333 68842 493332 91483 -239421 -225789 44388
9428a19428p3935h613j07253A14170b92297A84297a88797P8466l9543E8000J50555
$$ -119428 -193363 -8613 -115866 114170 -292297 184297 -188797 -110331 -149874 58000 208555
9417B08555e149n2259r5190b2668F4844e352D281d5565j62608L2654q8786h1895
$$ 208555 -5149 -57408 -152598 -22668 64844 -5352 4281 -45565 -208173 -175519 -264305 -81895
9404E2235b66804G0627a68186n1529o2611C77495f21343a0134H6573D2485a10455
$$ 52235 -266804 70627 -168186 -219715 -282326 377495 -621343 -10134 86573 42485 -110455
9392C6591a53263A04527C7468g9749l22153J72769M2340d4300j83780j54559a34713
$$ 36591 -153263 104527 37468 -79749 -401902 -229133 -186793 -44300 -228080 -382639 -134713
9380e5345I6329o344b08749j41047c9714l35581a2468k75790E691J24411B0255
$$ -55345 96329 89985 -208749 -349796 -39714 -375295 -12468 -288258 5691 130102 20255
9368F1177a9407C77469c06328C41874j29399I5382b5687k54804f8771m96o1172
$$ 61177 -19407 377469 -306328 341874 212475 95382 -25687 -280491 -68771 -69267 -130439
9357a30439E9855g0545A0662d3165k96402E8476b42928E9939b7083c952l70886
$$ -130439 59855 -70545 10662 -43165 -339567 58476 -242928 59939 -27083 -3952 -374838
9346c74838A37789b9382A29140b46486D9228g0418D62830H759g95A67312R4588
$$ -374838 137789 -29382 129140 -246486 49228 -70418 462830 8759 -795 167312 261900
9335B61900L869F271a45476K0861j76680h1690F0689g9321j2797C63009A32957
$$ 261900 265769 6271 -145476 -124615 -301295 -81690 60689 -79321 -92118 363009 132957
9323A58470g5948B46253d8092j78273C5987K40268b30059f1138J7010a7134A30936
$$ 158470 -75948 246253 -48092 -226365 35987 276255 -230059 -61138 -44128 -17134 130936
9311A58643h9200j03689O8751C50890G3872K777b33514L2093Q4916A59795a40324
$$ 158643 -89200 -192889 -124138 350890 73872 76649 -233514 -201421 -116505 159795 -140324
9299a41713c4174n8336A09726B9906K0858f8450b2514j59024Q962a5960j68239
$$ -141713 -34174 -92510 109726 29906 50764 -68450 -22514 -181538 -172576 -15960 -184199
9288a84199Q0271B26896a08436p2032g3957j32169o6179g3581B9600K30719H7784
$$ -184199 -103928 226896 -108436 -180468 -73957 -206126 -272305 -73581 29600 260319 87784
9276C2351J67773a53103A47528L6983i7223j62746P7371A04358d03953c3803j63156
$$ 32351 200124 -153103 147528 184511 -97223 -259969 -182598 104358 -403953 -33803 -196959
9265a96959f9668l6301A5898b56242f9036k90952e4256B77512I7914d78105a87150
$$ -196959 -69668 -105969 15898 -256242 -69036 -359988 -54256 277512 97914 -478105 -187150
9253a89435a4947o4641a7719k33407f0411k18351j22022A45326h5214j86513i1041
$$ -189435 -14947 -79588 -17719 -251126 -60411 -278762 -400784 145326 -85214 -271727 -91041
9241H3288h6910C5128a66455A4918R6140d6962m71194A94923P010c0408k33010
$$ 83288 -86910 35128 -166455 14918 111058 -46962 -518156 194923 201933 -30408 -263418
9230b63418b5543q0221m3087j30644M2656J09577A80546b37418a15067n827f0051
$$ -263418 -25543 -105764 -148851 -279495 -236839 -127262 180546 -237418 -115067 -120894 -60051
9218a29021B3682a77293H2866c28054A87670o8762b62851B45247d98931b43248
$$ -129021 23682 -177293 82866 -328054 187670 118908 -262851 245247 -498931 -243248
9207B31896a00334k23391d7295D36548a08186F8982i7850D52850a30225A18968
$$ 231896 -100334 -323725 -47295 436548 -108186 68982 -97850 452850 -130225 118968
9196a18887B24457L209a29854B74119a43089C01949c5832I2701c09054a8031j96146
$$ -118887 224457 227666 -129854 274119 -143089 301949 -35832 92701 -309054 -18031 -214177
9185b14177C655O3025a40847A97466b4815j71963q3546J34735D2148a13304o1763
$$ -214177 3655 66680 -140847 197466 -24815 -196778 -280324 -145589 42148 -113304 -175067
9174a75067a2462G930P1973d20102E5164K26901b94902i0275q6847a672H8808
$$ -175067 -12462 7930 79903 -420102 55164 282065 -294902 -90275 -177122 -1672 88808
9162b13993A7846a1852k00362I2284k9301a89418B25785a87997j06843d5508A94508
$$ -213993 17846 -11852 -212214 92284 62983 -189418 225785 -187997 -294840 -45508 194508
9150b34650d1570A09582C4444f3664j12994B19692a68577b2647q6450l8322A06231
$$ -234650 -41570 109582 34444 -63664 -176658 219692 -168577 -22647 -109097 -147419 106231
9138b42494m2347J21621d671k11082A14035c09516J09898N7411B04774r7411h3670
$$ -242494 -284841 -163220 -4671 -215753 114035 -309516 -199618 -142207 204774 107363 -83670
9126B23726I2001l3792J02982G2177a61774j21360j03102a866p5309L3781j87160
$$ 223726 92001 58209 161191 72177 -161774 -283134 -386236 -1866 -77175 -43394 -230554
9115b30554O3213d5954a3581C2010b5427j06114G919h7036l5611F6937c0606A90717
$$ -230554 -167341 -45954 -13581 32010 -25427 -131541 7919 -87036 -122647 66937 -30606 190717
9102B11933a77534f2581j66679J10151L4229A23145a6296A21935f1279j0617a4496
$$ 211933 -177534 -62581 -229260 -119109 -84880 123145 -16296 121935 -61279 -71896 -14496
9090a55782j29871C55039j09757a10718A76523a8815j53677j95580C5660D652
$$ -155782 -285653 355039 245282 -110718 176523 -18815 -172492 -368072 35660 4652
9079G2090b15429h6158G9861h9449A66766b8188F1151R3239b89540A25917b00390
$$ 72090 -215429 -86158 79861 -89449 166766 -28188 61151 154390 -289540 125917 -200390
9067E2675j8871J052J65341B6762m857c35495h5062k13805H4812a19225I0920
$$ 52675 33804 34856 200197 26762 21905 -335495 -85062 -298867 84812 -119225 90920
9055d58993a95428B21870F4374a82622a3508j38438C30749a91548E9959a92162
$$ -458993 -195428 221870 64374 -182622 -13508 -151946 330749 -191548 59959 -192162
9044A3468c9420M55A22033c45745D2209J08060Q0635a27030e1405J7680B20934
$$ 13468 -39420 -38965 122033 -345745 42209 150269 230904 -127030 -51405 -33725 220934
9032A89956G8218J60878c68767a81043b1533k0457r9410j19040p2710a46720D2313
$$ 189956 78218 239096 -368767 -181043 -21533 -41990 -141400 -260440 -333150 -146720 42313
9020b82940R4964H4621d44345a31607D6124A5733K18071D2662d6285k7136a1286
$$ -282940 -187976 84621 -444345 -131607 46124 15733 233804 42662 -46285 -73421 -11286
9008F0071g7424H9790k2676c48020i8837A59122D929O4461f9222A39491a2438
$$ 60071 -77424 89790 67114 -348020 -98837 159122 4929 69390 -69222 139491 -12438
8996b53388A28532N5542H6718Q2031F6628b81693I3418J77160c23099a58499n973
$$ -253388 128532 184074 86718 168749 66628 -281693 93418 270578 -323099 -158499 -164472
8985a64472B40042a05104K8367n49047b78603b6892A62761m0641a93038E4382
$$ -164472 240042 -105104 -76737 -625784 -278603 -26892 162761 122120 -193038 54382
8974a97010l3531g30l57458b8941H602a98363j61441J58721b067p673I332a95224
$$ -197010 -230541 -730 -358188 -28941 8602 -198363 -359804 -201083 -2067 -9740 9332 -195224
8961A68632Q507b06058A98341c13963C47670f2598J1604r1360P371A25231o789
$$ 168632 177139 -206058 198341 -313963 347670 -62598 -50994 -142354 -134983 125231 118442
8950A18442c10700b8731k58128f4777j00185E2656b59932G3801J106I347R6383
$$ 118442 -310700 -28731 -286859 -64777 -164962 52656 -259932 73801 74907 9347 105730
8939A05730K45215b01421A99042Q3288D2456J34185a82190G2605a0306k43595
$$ 105730 350945 -201421 199042 282330 42456 176641 -182190 72605 -10306 -253901
8929b53901A13484j0578n0034K31340O5167Q06020P15355M753487M368746C249221
$$ -253901 113484 102906 52872 284212 349379 1155399 1870754 6624241 10992987 3249221
8918A276764E27157j24460j33967F9089K17696a29613b5338l19697J58161F00745
$$ 1276764 527157 402697 268730 69089 286785 -129613 -25338 -345035 -186874 600745
8907C03066A14605m7275J5152f035j46467H0339K82511j05874A15854R9259C5892
$$ 303066 114605 67330 82482 -6035 -152502 80339 362850 256976 115854 215113 35892
8895e0786B89277a77017E8907a02251A84701E0727a07828k35642d6483j73526
$$ -50786 289277 -177017 58907 -102251 184701 50727 -107828 -343470 -46483 -220009
8885b20009A8722h4751A42903b87145j21503A0584a37509e8701D4843N2224a15724
$$ -220009 18722 -84751 142903 -287145 -408648 10584 -137509 -58701 44843 97067 -115724
8873d00805C5765J28944b37107C2118a28524n9283N9002A2144d6224j04346j2478
$$ -400805 35765 164709 -237107 32118 -128524 -187807 -128805 12144 -46224 -150570 -163048
8862a63048j3820f3179G2720J8222a77993k68296J07508C0682c62491J76504r7222
$$ -163048 -176868 -63179 72720 90942 -177993 -446289 -338781 30682 -362491 -185987 -283209
$$ [...]
##END NTUPLES=NMR SPECTRUM
##END=
