
##TITLE=AC1160_Rove100-14_6524090_qxO8nUWJPk
##JCAMPDX= 6.0         $$ Bruker NMR JCAMP-DX V2.0
##DATA TYPE= NMR SPECTRUM
##DATA CLASS= NTUPLES
##ORIGIN= BRUKER
##OWNER= Administrator
$$ 1.72 TOPSPIN		Version 2.1
$$ 2012-07-14 17:35:22.453 -0500  Administrator@TOPSPIN
$$ Compression mode = diff/dup
##.OBSERVE FREQUENCY= 400.02188249412
##.OBSERVE NUCLEUS= ^1H
##.ACQUISITION MODE= SIMULTANEOUS (DQD)
##.ACQUISITION SCHEME= undefined
##.AVERAGES= 64
##.DIGITISER RES= 22
##SPECTROMETER/DATA SYSTEM= spect
##.PULSE SEQUENCE= noesygpps1d.comp
##.SOLVENT NAME= COFFEE_meoh
##.SHIFT REFERENCE= INTERNAL, COFFEE_meoh, 1, 14.96105
##AUDIT TRAIL= $$ (NUMBER, WHEN, WHO, WHERE, PROCESS, VERSION, WHAT)
$$ ##TITLE= Audit trail, TOPSPIN		Version 2.1
$$ ##JCAMPDX= 5.01
$$ ##ORIGIN= Bruker BioSpin GmbH
$$ ##OWNER= Administrator
$$ $$ C:\Bruker\TOPSPIN/data/COFFEE/nmr/AC1160_Rove100-14_6524090_qxO8nUWJPk/12/pdata/1/auditp.txt
$$ ##AUDIT TRAIL=  $$ (NUMBER, WHEN, WHO, WHERE, PROCESS, VERSION, WHAT)
(   1,<2012-07-14 17:35:17.515 -0500>,<Administrator>,<TOPSPIN>,<go>,<TOPSPIN 2.1>,
      <created by zg
	started at 2012-07-14 17:23:47.218 -0500,
	POWCHK enabled, PULCHK disabled,
       configuration hash MD5:
       6B 1B 68 BB D9 2E 58 E2 7F 35 AD 54 07 DF 0E 41
       data hash MD5: 64K
       A4 B9 C4 44 69 2E EC 62 49 E3 E7 7D D2 D0 7C CD>)
(   2,<2012-07-14 17:35:20.625 -0500>,<Administrator>,<TOPSPIN>,<proc1d>,<TOPSPIN 2.1>,
      <Start of raw data processing
       efp LB = 0.3 FT_mod = 6 PKNL = 1 PHC0 = 0 PHC1 = 0 SI = 128K 
       data hash MD5: 128K
       0B 6D AF 91 E3 ED 0F 14 60 A6 75 CF 4F 62 85 1B>)
(   3,<2012-07-14 17:35:21.656 -0500>,<Administrator>,<TOPSPIN>,<proc1d>,<TOPSPIN 2.1>,
      <pk PHC0 = -1.466675 PHC1 = 0 
       data hash MD5: 128K
       A6 2B 06 8A 17 34 22 50 8E D5 D2 68 4C 36 BB D5>)
(   4,<2012-07-14 17:35:22.140 -0500>,<Administrator>,<TOPSPIN>,<proc1d>,<TOPSPIN 2.1>,
      <abs ABSG = 1 
       data hash MD5: 128K
       9F 80 56 F2 12 47 CC 8D 6C B5 9D 4A 09 6A D3 CC>)
(   5,<2012-07-14 17:35:22.203 -0500>,<Administrator>,<TOPSPIN>,<proc1d>,<TOPSPIN 2.1>,
      <abs ABSG = 2 
       data hash MD5: 128K
       17 63 B9 D2 6E FE 17 E7 74 7F 7A CB E6 6D AD 37>)
(   6,<2012-07-14 17:35:22.265 -0500>,<Administrator>,<TOPSPIN>,<proc1d>,<TOPSPIN 2.1>,
      <abs ABSG = 3 
       data hash MD5: 128K
       56 B0 CE 3E C0 DE 7A 1D 15 D9 13 6D 1F 44 1D 61>)
(   7,<2012-07-14 17:35:22.312 -0500>,<Administrator>,<TOPSPIN>,<proc1d>,<TOPSPIN 2.1>,
      <abs ABSG = 4 
       data hash MD5: 128K
       DC 9F 2F BE 58 E5 C8 22 EE 19 1D 8F 57 3F AF 22>)
(   8,<2012-07-14 17:35:22.375 -0500>,<Administrator>,<TOPSPIN>,<proc1d>,<TOPSPIN 2.1>,
      <abs ABSG = 5 
       data hash MD5: 128K
       8E D6 DC CB 0E 0F EF C4 2F 56 DE 39 E0 BB DF 8C>)
$$ ##END=
$$ 
$$ $$ hash MD5
$$ $$ 52 47 14 7F 25 30 A9 C5 B9 CF 21 6F 03 B6 19 0E
##$RELAX= 
##$RELAX= 
##$RELAX= 
##$RELAX= 
##$RELAX= 
##$RELAX= 
##$RELAX= 
##$RELAX= 
$$ Bruker specific parameters
$$ [...]
##$TP07= 0
##$TPNAME0= <>
##$TPNAME1= <>
##$TPNAME2= <>
##$TPNAME3= <>
##$TPNAME4= <>
##$TPNAME5= <>
##$TPNAME6= <>
##$TPNAME7= <>
##$TPOAL= (0..7)
0.5 0.5 0.5 0.5 0.5 0.5 0.5 0.5
##$TPOFFS= (0..7)
0 0 0 0 0 0 0 0
##$TUNHIN= 0
##$TUNHOUT= 0
##$TUNXOUT= 0
##$USERA1= <user>
##$USERA2= <user>
##$USERA3= <user>
##$USERA4= <user>
##$USERA5= <user>
##$V9= 5
##$VALIST= <valist>
##$VCLIST= <CCCCCCCCCCCCCCC>
##$VD= 0
##$VDLIST= <DDDDDDDDDDDDDDD>
##$VPLIST= <PPPPPPPPPPPPPPP>
##$VTLIST= <TTTTTTTTTTTTTTT>
##$WBST= 2048
##$WBSW= 25
##$XGAIN= (0..3)
0 0 0 0
##$XL= 0
##$YL= 0
##$YMAX_a= 11191398
##$YMIN_a= -8267458
##$ZGOPTNS= <>
##$ZL1= 120
##$ZL2= 120
##$ZL3= 120
##$ZL4= 120
##$ABSF1= 14.96105
##$ABSF2= -5.597132
##$ABSG= 5
##$ABSL= 3
##$ALPHA= 0
##$AQORDER= 0
##$ASSFAC= 0
##$ASSFACI= 0
##$ASSFACX= 0
##$ASSWID= 0
##$AUNMP= <proc_prof1d_extract.lims>
##$AXLEFT= 0
##$AXNAME= <>
##$AXNUC= <1H>
##$AXRIGHT= 0
##$AXTYPE= 0
##$AXUNIT= <>
##$AZFE= 0.1
##$AZFW= 0.1
##$BCFW= 0
##$BC_mod= 0
##$BYTORDP= 0
##$COROFFS= 0
##$CY= 15
##$DATMOD= 1
##$DC= 0
##$DFILT= <>
##$DTYPP= 0
##$F1P= 0
##$F2P= 0
##$FCOR= 0.5
##$FTSIZE= 131072
##$FT_mod= 6
##$GAMMA= 0
##$GB= 0
##$INTBC= 1
##$INTSCL= 1
##$ISEN= 128
##$LB= 0.3
##$LEV0= 0
##$LPBIN= 0
##$MAXI= 10000
##$MC2= 0
##$MEAN= 0
##$ME_mod= 0
##$MI= 0
##$NCOEF= 0
##$NC_proc= -2
##$NLEV= 6
##$NOISF1= 0
##$NOISF2= 0
##$NSP= 0
##$NTH_PI= 0
##$NZP= 0
##$OFFSET= 14.96105
##$PC= 1
##$PHC0= -1.466675
##$PHC1= 0
##$PH_mod= 1
##$PKNL= yes
##$PPARMOD= 0
##$PPDIAG= 0
##$PPIPTYP= 0
##$PPMPNUM= 2147483647
##$PPRESOL= 1
##$PSCAL= 4
##$PSIGN= 0
##$PYNMP= <proc.py>
##$REVERSE= no
##$SF= 400.020009617617
##$SI= 131072
##$SIGF1= 0
##$SIGF2= 0
##$SINO= 400
##$SIOLD= 131072
##$SPECTYP= <>
##$SREGLST= <1H.CDCl3>
##$SSB= 0
##$STSI= 131072
##$STSR= 0
##$SW_p= 8223.68421052631
##$SYMM= 0
##$S_DEV= 0
##$TDeff= 65536
##$TDoff= 0
##$TI= <>
##$TILT= no
##$TM1= 0
##$TM2= 0
##$TOPLEV= 0
##$USERP1= <user>
##$USERP2= <user>
##$USERP3= <user>
##$USERP4= <user>
##$USERP5= <user>
##$WDW= 1
##$XDIM= 131072
##$YMAX_p= 386748785
##$YMIN_p= -14468
##$CURPLOT= <Network HP LaserJet P1505>
##$CURPRIN= <$Network HP LaserJet P1505>
##$DFORMAT= <normdp>
##$LAYOUT= <+/1D_H.xwp>
##$LFORMAT= <normlp>
##$PFORMAT= <normpl>
##$SURQMSG= 1
$$ End of Bruker specific parameters
$$ ---------------------------------
##NTUPLES= NMR SPECTRUM
##VAR_NAME=  FREQUENCY,     SPECTRUM/REAL,   SPECTRUM/IMAG
##SYMBOL=    X,             R,               I
##VAR_TYPE=  INDEPENDENT,   DEPENDENT,       DEPENDENT
##VAR_FORM=  AFFN,          ASDF,            ASDF
##VAR_DIM=   131072,        131072,          131072
##UNITS=     HZ,            ARBITRARY UNITS, ARBITRARY UNITS
##FACTOR=    0.0627417313425164, 1,          1
##FIRST=     8223.62146879497, 1470,         -51478
##LAST=      0,             2298,            -52070
##MIN=       0,             -14468,          0
##MAX=       8223.62146879497, 386748785,    0
$$ Real data points
##PAGE= N=1
##DATA TABLE= (X++(R..R)), XYDATA
$$ [...]
63927B847928K32652K35962K35297K29553K18205K01252J78771J50891J18445
$$ 2847928 3080580 3316542 3551839 3781392 3999597 4200849 4379620 4530511 4648956
63918D648956Q3319M7528J1964k3587n9173r3978j26929j57354j84609k07508
$$ 4648956 4732275 4779803 4791767 4768180 4709007 4615029 4488100 4330746 4146137 3938629
63908C938629k24670k35365k39802k38907k34136k27024k18326k07658j94381
$$ 3938629 3713959 3478594 3238792 2999885 2765749 2538725 2320399 2112741 1918360
63899A918360j78767j61984j45102j28644j12951r8419q5282p3569o3387n4852
$$ 1918360 1739593 1577609 1432507 1303863 1190912 1092493 1007211 933642 870255 815403
63889H15403m7729m1535l6195l2140k9491k7513k5194k2270j9378j7293j6157
$$ 815403 767674 726139 689944 657804 628313 600800 575606 553336 533958 516665 500508
63878E00508j5389j4259j2589j0953r969r471q628o996n117l794l092k433j544
$$ 500508 485119 470860 458271 447318 437349 427878 419250 412254 407137 403343 400251 397818 396274
63865C96274p59l09J93J234K735M263N805P781J0200J2272J3275J3519J4093J5676
$$ 396274 395515 395206 395399 396633 399368 403631 409436 417217 427417 439689 452964 466483 480576 496252
63851D96252J7995K0410K2524K4088K4905K5160K5532K6436K7346K7376K6348
$$ 496252 514247 534657 557181 581269 606174 631334 656866 683302 710648 738024 764372
63840G64372K4855K3273K1281J8535J5274J2017Q919N787K471r78m386p486j0102
$$ 764372 789227 812500 833781 852316 867590 879607 888526 894313 896784 895806 891420 883934 873832
63827H73832j2496j5305j8819k2496k5547k7831k9759l1372l2017l1256k9666
$$ 873832 861336 846031 827212 804716 779169 751338 721579 690207 658190 626934 597268
63816E97268k8333k7679k7113k5906k4026k1930j9876j7813j5896j4585j4013
$$ 597268 568935 541256 514143 488237 464211 442281 422405 404592 388696 374111 360098
63805C60098j3570j2529j0941r494q521p597o296m891l961l590l415l327l584
$$ 360098 346528 333999 323058 313564 305043 297446 291150 286259 282298 278708 275293 271966 268382
63792B68382m222m707m521l846l390l594m123m216l470k237j302j105j424j800
$$ 268382 264160 259453 254932 251086 247696 244102 239979 235763 232293 230056 228754 227649 226225 224425
63778B24425k087k361k437j983j154o47q59j290j227p13l42k77p9L71M89q8o93
$$ 224425 222338 219977 217540 215557 214403 213756 212897 211607 210380 209667 209325 209048 208969 209340 209829 209741 209048
63761B09048l68P46J419Q27m43j135q12j82r5n36p81m30R2J18l17n15j7Q05J308
$$ 209048 208680 209426 210845 211672 211229 210094 209282 209100 209005 208469 207688 207258 207350 207468 207151 206636 206619 207424 208732
63742B08732J344J170Q25J51n79o50K23J359J852J605J285J342J520J390J033
$$ 208732 210076 211246 212071 212222 211643 210993 211216 212575 214427 216032 217317 218659 220179 221569 222602
63727B22602R68J550K629L739M470M661M445M135M022M137M256M209M131M245
$$ 222602 223570 225120 227749 231488 235958 240619 245064 249199 253221 257358 261614 265823 269954 274199
63713B74199M507M622M446M115L691K943J731L55p23j427k043k786l630m444m952
$$ 274199 278706 283328 287774 291889 295580 298523 300254 300609 299886 298459 296416 293630 290000 285556 280604
63698B80604m704l479j765m11J97K69K8m35p14j91J012J852J618Q90P34J268J716
$$ 280604 275900 272421 270656 270245 270442 270711 270739 270304 269590 269399 270411 272263 273881 274771 275505 276773 278489
63681B78489J646J488J736K245K512K306J840J498J462J533J378J094J235K021
$$ 278489 280135 281623 283359 285604 288116 290422 292262 293760 295222 296755 298133 299227 300462 302483
63667C02483K821K941K695L072M308N457N568M723L679K915K335J603M06j351
$$ 302483 305304 308245 310940 314012 318320 323777 329345 334068 337747 340662 342997 344600 345006 343655
63653C43655l322m831n480n509n427n465n541n503n187m431l283k087j193o18
$$ 343655 340333 335502 330022 324513 319086 313621 308080 302577 297390 292959 289676 287589 286396 285778
63639B85778j36M25J124J909K568K828K687K566K894L648M396M705M432L841L501
$$ 285778 285642 286067 287191 289100 291668 294496 297183 299749 302643 306291 310687 315392 319824 323665 327166
63624C27166L908M937N862O100N888O027P049Q735J0357J1263J1411J1484J2360
$$ 327166 331074 336011 341873 347973 353861 359888 366937 375672 386029 397292 408703 420187 432547
63611D32547J4298J6781J9232K1593K3981K6141K7728K9042L0849L3355L5799
$$ 432547 446845 463626 482858 504451 528432 554573 582301 611343 642192 675547 711346
63600G11346L7196L7267L6395L4894L2530K8713K3060J5839P947M79n703j0034
$$ 711346 748542 785809 822204 857098 889628 918341 941401 957240 965187 965666 959963 949929
63588I49929j2303j2891j2857j3254j4314j5574j6739j8027j9534k0860k1687
$$ 949929 937626 924735 911878 898624 884310 868736 851997 833970 814436 793576 771889
63577G71889k2275k2911k3098k1978j9516j6732j4550j2813j0707p840m633j807
$$ 771889 749614 726703 703605 681627 662111 645379 630829 618016 607309 599469 594836 593029
63565E93029K20J503K391L259M261N320O333P220P778P733P188O841P363Q596
$$ 593029 593249 594752 597143 600402 604663 609983 616316 623536 631314 639047 646235 653076 660439 669035
63551F69035R715J0252J0668J1741J3640J5880J8029K0229K2969K6567L0892L5410
$$ 669035 678750 689002 699670 711411 725051 740931 758960 779189 802158 828725 859617 895027
63539H95027L9501M2726M4819M5340M3453L8211K9216J7192M060p595j5636j9465
$$ 895027 934528 977254 1022073 1067413 1110866 1149077 1178293 1195485 1199545 1191950 1176314 1156849
63527A156849k0154j9405j8384j7487j6895j6905j7770j9515k2003k4978k8039
$$ 1156849 1136695 1117290 1098906 1081419 1064524 1047619 1029849 1010334 988331 963353 935314
63516I35314l0802l3094l4772l5353l4237l1453k7954k4870k2620k0856j9066
$$ 935314 904512 871418 836646 801293 767056 735603 707649 682779 660159 639303 620237
63505F20237j6947j4428j1688r242p680p134p100o906o362n801n572n579n495
$$ 620237 603290 588862 577174 567932 560252 553118 546018 539112 532750 526949 521377 515798 510303
63492E10303n288n275n565n675n013l718k691k680l486m230m346m077l956l928
$$ 510303 505015 499740 494175 488500 483487 479769 477078 474398 470912 466682 462336 458259 454303 450375
63478D50375l258j466Q28K389K743K598K759L093L006K457J877J303L79q14j720
$$ 450375 447117 445651 446479 448868 451611 454209 456968 460061 463067 465524 467401 468704 469083 468269 466549
63463D66549k224k907m079n274o016o454o767o608n704m523l672l062k324j698
$$ 466549 464325 461418 457339 452065 446049 439595 432828 426220 420516 415993 412321 409259 406935 405237
63449D05237j725k209k286j566n45J69N00P16J204K372M248O029O759O527O464
$$ 405237 403512 401303 399017 397451 396906 397075 397575 398291 399495 401867 406115 412144 418903 425430 431894
63434D31894P319Q680R874J1056J2938J5884J9702K4000K8311L2051L4619L5403
$$ 431894 439213 447893 457767 468823 481761 497645 517347 541347 569658 601709 636328 671731
63422F71731L3686K9123K2694J6634J2802J1318J1296J2486J5499K0415K6114
$$ 671731 705417 734540 757234 773868 786670 797988 809284 821770 837269 857684 883798
63411H83798L1218L5250L8496M1113M2724M2687M0379L5390K7755J8192Q002j372
$$ 883798 915016 950266 988762 1029875 1072599 1115286 1155665 1191055 1218810 1237002 1245004 1243632
63399A243632q837j3928j6840j8220j8826j9286j9993k1195k3048k5530k8289
$$ 1243632 1234795 1220867 1204027 1185807 1166981 1147695 1127702 1106507 1083459 1057929 1029640
63388A029640l0711l2278l2879l2662l1659k9814k7380k4908k2693k0459j7892
$$ 1029640 998929 966651 933772 901110 869451 839637 812257 787349 764656 744197 726305
63377G26305j5204j2819j0646q219n523l142j467j78J206K674M042N533P493R681
$$ 726305 711101 698282 687636 679417 673894 670752 669285 669107 670313 672987 677029 682562 690055 699736
63363F99736J1506J2929J4529J6433J7868J8286J8411J9524K1946K4871K7599
$$ 699736 711242 724171 738700 755133 773001 791287 809698 829222 851168 876039 903638
63352I03638L0175L2808L5373L7766M0019M1704M1781L9568L5410K9893K2984
$$ 903638 933813 966621 1001994 1039760 1079779 1121483 1163264 1202832 1238242 1268135 1291119
63341A291119J4629N701k492r434j5253j9576k1704k2047k2233k3294k4670k5544
$$ 1291119 1305748 1311449 1308957 1299523 1284270 1264694 1242990 1220943 1198710 1175416 1150746 1125202
63329A125202k6305k7805k9918l1787l3147l4305l5024l4438l2303k9428k6601
$$ 1125202 1098897 1071092 1041174 1009387 976240 941935 906911 872473 840170 810742 784141
63318G84141k3730k0384j6586j2691q845n038j486J300K702K116q17n789j1645
$$ 784141 760411 740027 723441 710750 701905 696867 695381 696681 699383 701499 700682 694893 683248
63305F83248j6818j9981k0554j8967j6495j4398j2974j1720j0437r730j0057j0779
$$ 683248 666430 646449 625895 606928 590433 576035 563061 551341 540904 531174 521117 510338
63293E10338j0791r887q979q876r333r428q586p062n668n091n346n797n805n360
$$ 510338 499547 489660 480681 471805 462472 453044 444458 437396 431728 426637 421291 415494 409689 404329
63279D04329m874m515m089l622l474l740l959l799l615l786l860l106j798j101
$$ 404329 399455 394940 390851 387229 383755 380015 376056 372257 368642 364856 360996 357890 356092 354991
63265C54991j490k088k007j609j754k334k485k037j800k239k794k806k414k006
$$ 354991 353501 351413 349406 347797 346043 343709 341224 339187 337387 335148 332354 329548 327134 325128
63251C25128j439n17K24J6q80j250m82N99P43k19j383j964k012j907j626q55L24
$$ 325128 323689 323172 323396 323412 322532 321282 320800 321399 322142 321923 320540 318576 316564 314657 313031 312176 312500
63234C12500J296J555J220O98J02o31j235j204m70M57J119J441J382Q05Pk42L19
$$ 312500 313796 315351 316571 317269 317371 316740 315505 314301 313831 314288 315407 316848 318230 319035 319042 318800 319119
63217C19119Q65N57k11l57L59J138J418J467J620J739J741J891K254K398K059
$$ 319119 319984 320541 320330 319973 320332 321470 322888 324355 325975 327714 329455 331346 333600 335998 338057
63202C38057J664J743K274K892L367L534L168K375J709J546J743K185L125M491
$$ 338057 339721 341464 343738 346630 349997 353531 356699 359074 360783 362329 364072 366257 369382 373873
63188C73873N523N724N779O616P941Q648Q548Q664R743J1327J2539J3048J2961
$$ 373873 379396 385120 390899 397515 405456 414104 422652 431316 441059 452386 464925 477973 490934
63175D90934J2464J1943J1860J2100J1952J1066R938R120Q436P463O324N462M856
$$ 490934 503398 515341 527201 539301 551253 562319 572257 581377 589813 597276 603600 609062 613918
63162F13918M010K650J018m96j770l086m916p436j0154j2332j3801j4996j6061
$$ 613918 617928 620578 621596 621100 619330 616244 611328 603892 593738 581406 567605 552609 536548
63149E36548j6477j5894j4756j3644j2539j1258j0142r525q951p698n901m343
$$ 536548 520071 504177 489421 475777 463238 451980 441838 432313 423362 415664 409763 405420
63137D05420l296k425j749j746k281k387j478r4R74J592J967K111K159K650L816
$$ 405420 402124 399699 397950 396204 393923 391536 390058 389964 390938 392530 394497 396608 398767 401417 405233
63122D05233N057N694N923O402P218P883Q186Q346Q421Q223P844P643P675P552
$$ 405233 410290 415984 421907 428309 435527 443410 451596 459942 468363 476586 484430 492073 499748 507300
63108E07300P009O165N199M228L552L520L995M378M402M488N032N727N941N564
$$ 507300 514309 520474 525673 529901 533453 536973 540968 545346 549748 554236 559268 564995 570936 576500
63094E76500N088N031N510O314P095P551P659P708P968Q306Q247P433N925M113
$$ 576500 581588 586619 592129 598443 605538 613089 620748 628456 636424 644730 652977 660410 666335 670448
63080F70448K366P07j189l595o227q397r722j0487j1134j1612j1612j1258j1120
$$ 670448 672814 673521 672332 668737 662510 654113 644391 633904 622770 611158 599546 588288 577168
63067E77168j1383j1403j0384q373o283n000m593m421l828k755j725j228j084
$$ 577168 565785 554382 543998 535625 529342 524342 519749 515328 511500 508745 507020 505792 504708
63054E04708n79O44K003K651K624K860L874M948N060M357M069N001O641P931Q452
$$ 504708 504129 504773 506776 509427 512051 514911 518785 523733 528793 533150 537219 542220 548861 556792 565244
63039E65244Q503Q429Q252P892P402O948O717O778O879O586N767M803M104L602
$$ 565244 573747 582176 590428 598320 605722 612670 619387 626165 633044 639630 645397 650200 654304 657906
63025F57906K954K113J329O78r3j163k360l362m030m461m843n246n477n205m352
$$ 657906 660860 662973 664302 664980 664887 663724 661364 658002 653972 649511 644668 639422 633945 628740 624388
63010F24388l282k383j569m81R37K340L564M934O860R256J1545J3200J4224J5141
$$ 624388 621106 618723 617154 616673 617610 619950 623514 628448 635308 644564 656109 669309 683533 698674
62996F98674J6391J7767J8564J8394J7609J6829J6311J6082J6215J6580J6559
$$ 698674 715065 732832 751396 769790 787399 804228 820539 836621 852836 869416 885975
62985H85975J5677J4324J3238J2392J1070R103P101N320L091j02l766p167j0372
$$ 885975 901652 915976 929214 941606 952676 961779 968880 974200 977291 977189 973423 966256 955884
62972I55884j3812j7258k0013k1898k3355k4627k5442k5542k4990k3897k2272
$$ 955884 942072 924814 904801 882903 859548 834921 809479 783937 758947 735050 712778
62961G12778k0288j8366j6884j5965j5433j4852j3761j2198j0836j0206r966r430
$$ 712778 692490 674124 657240 641275 625842 610990 597229 585031 574195 563989 554023 544593
62949E44593q713q735r987j1763j2860j2739j1769j0663r922r606r412r040q530
$$ 544593 535880 527145 517158 505395 492535 479796 468027 457364 447442 437836 428424 419384 410854
62936D10854q164q003p771p243o513n760n016m326l903l833l730l096k074j559
$$ 410854 402690 394687 386916 379673 373160 367400 362384 358058 354155 350322 346592 343496 341422 339863
62922C39863k167l318l689k746j413r03j234j382p67O7L29o2o78j175j306q04
$$ 339863 337696 334378 330689 327943 326530 325627 324393 323011 322244 322311 322640 322578 321900 320725 319419 318615
62906C18615K82J371J934K034K037K061K082K194K307J978J146O78J519L485N555
$$ 318615 318897 320268 322202 324236 326273 328334 330416 332610 334917 336895 338041 338719 340238 343723 349278
62891C49278P130Q330R170R308Q761Q108P789P700P579P245O450N057L439K090
$$ 349278 356408 364738 373908 383216 391977 400085 407874 415574 423153 430398 436848 441905 445344 447434
62877D47434Q60p31k459l517l884m560o080p633q208p879p401p155p112p260p459
$$ 447434 448294 447563 445104 441587 437703 433143 427063 419430 411222 403343 395942 388787 381675 374415 366956
62862C66956p304o683o046n640n045m032l226l204l462l160k397j864j609j136
$$ 366956 359652 352969 346923 341283 336238 332206 328980 325776 322314 319154 316757 314893 313284 312148
62848C12148n20l77p32r56q84j074j735k245k056j410q19m40j98l9K27P57J189
$$ 312148 311628 311251 310519 309563 308679 307605 305870 303625 301569 300159 299340 298900 298702 298663 298890 299647 300836
62831C00836Q88p5q20p82l99k48k54j96l58q76r82J32J842K487J409j58o18J70
$$ 300836 301724 301649 300829 300047 299648 299400 299146 298950 298592 297716 296734 296866 298708 301195 302604 302446 301828 301998
62813C01998J028R86J33q14j249r76k56L11K25l77q60r10r24j323j797j653p80
$$ 301998 303026 304012 304145 303331 302082 301106 300850 301161 301386 301009 300149 299239 298315 296992 295195 293542 292762
62796B92762K57J011J505J759J608J218J114J353J208K94n78m03M86P93M4q84
$$ 292762 293019 294030 295535 297294 298902 300120 301234 302587 303795 304089 303511 303108 303594 304387 304431 303547
62780C03547j107p49k98K74J212K278K935L079L096L319L737M143M356M260L917
$$ 303547 302440 301691 301393 301667 302879 305157 308092 311171 314267 317586 321323 325466 329822 334082 337999
62765C37999L547L310L061K506J620Q18N84Q97J119O75k21q07p61n94q98j593
$$ 337999 341546 344856 347917 350423 352043 352861 353445 354342 355461 356136 355915 355108 354347 353753 352855 351262
62749C51262k247k710k978k819k182j698k030k871l334l268l359l877m224l971
$$ 351262 349015 346305 343327 340508 338326 336628 334598 331727 328393 325125 321766 317889 313665 309694
62735C09694l477l087k537j719j228j416j563q42L56R31O65L67N33P30N09J74
$$ 309694 306217 303130 300593 298874 297646 296230 294667 293825 294181 295112 295777 296144 296677 297407 297916 298090
62719B98090L18J009J776K205K347K610L263M045M483M653N225O526P897Q573
$$ 298090 298408 299417 301193 303398 305745 308355 311618 315663 320146 324799 330024 336550 344447 353020
62705C53020Q754R219J0068J0677J0956J1765J3756J6417J8762K0528K2190K4023
$$ 353020 361774 370993 381061 391738 402694 414459 428215 444632 463394 483922 506112 530135
62693E30135K5700K6893K7831K9054L0660L2023L2376L1656L0505K9379K7929
$$ 530135 555835 582728 610559 639613 670273 702296 734672 766328 796833 826212 854141
62682H54141K5523K2061J7851J2879O886J33o493j2307j7282k1528k4899k7467
$$ 854141 879664 901725 919576 932455 939341 939474 932981 920674 903392 881864 856965 829498
62670H29498k9794l2200l4106l4703l4037l2875l1568k9726k7119k4275k1917
$$ 829498 799704 767504 733398 698695 664658 631783 600215 570489 543370 519095 497178
62659D97178k0180j8682j7106j5368j3548j1927j0939j0624j0271r082p218n762
$$ 497178 476998 458316 441210 425842 412294 400367 389428 378804 368533 359451 352233 346471
62647C46471n409n631n421m498l395k572k044j828k184l112l972l973k965j585
$$ 346471 341062 335431 330010 325512 322117 319545 317501 315673 313489 310377 306405 302432 299467 297882
62633B97882o58n17p60o34J98J223J606J175N47K56J06l73j175j913k354k520
$$ 297882 297224 296707 295947 295313 295511 296734 298340 299515 300062 300318 300424 300051 298876 296963 294609 292089
62617B92089k421k084j754j716j917k038j901j561j128p36n60n57l78J79P77R94
$$ 292089 289668 287584 285830 284114 282197 280159 278258 276697 275569 274833 274273 273716 273338 273517 274294 275288
62601B75288R69J080J221R87M92L24N97P83O47O09Q43P77M7o96o10J27O71P63
$$ 275288 276257 277337 278558 279545 280037 280361 280958 281741 282388 282997 283840 284617 284664 283968 283358 283485 284156 284919
62583B84919R13J428K028K418K563K304J348j06j218j430j128j018j166j100o87
$$ 284919 285832 287260 289288 291706 294269 296573 297921 297815 296597 295167 294039 293021 291855 290755 290068
62568B90068m31p59j409j777j708j555j526j323o81OJ06l50o18l12R7J32J04N01
$$ 290068 289637 288878 287469 285692 283984 282429 280903 279580 278899 278905 279011 278661 278043 277731 277828 277960 278064 278565
62550B78565R50O58k64p51k38O13R31P42N66N38M71M14N33O90P48J039J854K697
$$ 278565 279515 280173 279909 279158 278920 279533 280464 281206 281772 282310 282781 283195 283728 284418 285166 286205 288059 290756
62532B90756K769K202J982K542L187L224K890K729K679K406K129K357L105L945
$$ 290756 293525 295727 297709 300251 303438 306662 309552 312281 314960 317366 319495 321852 324957 328902
62518C28902M751N755O976Q138R151J0137J1022J1660J2331J3521J5130J6538
$$ 328902 333653 339408 346384 354522 363673 373810 384832 396492 408823 422344 437474 454012
62506D54012J7590J8922K0874K2697K3271K2289K0364J8250J6324J4502J2380
$$ 454012 471602 490524 511398 534095 557366 579655 600019 618269 634593 649095 661475
62495F61475R595O393L489J166j015l320n177n995o076n934n088k554J508N649
$$ 661475 671070 677463 680952 682118 681103 677783 672606 666611 660535 654601 649513 646959 648467 654116
62481F54116Q833J1402J4023J6548J8559K0428K2939K6087K8915L0547L0784K9647
$$ 654116 662949 674351 688374 704922 723481 743909 766848 792935 821850 852397 883181 912828
62469I12828K6844K2108J5820Q992K559l258q846j4614k0587k6479l1913l6431
$$ 912828 939672 961780 977600 986592 989151 985893 977047 962433 941846 915367 883454 847023
62457H47023l9538m0985m0981l9955l8235l6090l3880l1809k9662k7124k4254
$$ 847023 807485 766500 725519 685564 647329 611239 577359 545550 515888 488764 464510
62446D64510k1360j8485j5525j2735j0537q860p205n517m343l899l591k899k149
$$ 464510 443150 424665 409140 396405 385868 377008 369803 364286 359943 356044 352453 349554 347405
62433C47405j891j936j660r79m37m30q14j266j550j534j304j213j465j769j758
$$ 347405 345514 343578 341918 340939 340502 340072 339258 337992 336442 334908 333604 332391 330926 329157 327399
62418C27399j596j701j970j824j073j90M09Q43J285J495J193N81J39j3j49m21
$$ 327399 325803 324102 322132 320308 319235 319045 319454 320297 321582 323077 324270 324851 324990 324977 324828 324407
62402C24407o11m62l8L75N90O49O82P97J124J812K796L606L719L210K845L318
$$ 324407 323796 323334 323296 323671 324261 324910 325592 326389 327513 329325 332121 335727 339446 342656 345501 348819
62386C48819M463N482N805N546N142M892M820M801M734M748N262O640Q709J0840
$$ 348819 353282 358764 364569 370115 375257 380149 384969 389770 394504 399252 404514 411154 419863 430703
62372D30703J2478J3491J3947J3939J3747J3933J4940J6678J8674K0645K2655
$$ 430703 443181 456672 470619 484558 498305 512238 527178 543856 562530 583175 605830
62361F05830K4783K6901K8973L1392L4763L9326M4689N0206N5406O0115O4358
$$ 605830 630613 657514 686487 717879 752642 791968 836657 886863 942269 1002384 1066742
62350A066742O8281P1916P4738P5537P3114O7220N8624M8224L6388K3317R704
$$ 1066742 1135023 1206939 1281677 1357214 1430328 1497548 1556172 1604396 1640784 1664101 1673805
62339A673805l246j4532k3887l1742l8732m5210n1006n5564n8303n8974n7833
$$ 1673805 1670559 1656027 1632140 1600398 1561666 1516456 1465450 1409886 1351583 1292609 1234776
62328A234776n5598n3040n0417m7379m3617l9495l5724l2567k9849k7627k6247
$$ 1234776 1179178 1126138 1075721 1028342 984725 945230 909506 876939 847090 819463 793216
62317G93216k5648k5171k4380k3528k2920k2288k1247j9931j8715j7653j6638
$$ 793216 767568 742397 718017 694489 671569 649281 628034 608103 589388 571735 555097
62306E55097j5746j4898j3546j1306q745o878o012n595n099m468l797l155k693
$$ 555097 539351 524453 510907 499601 490856 483978 477966 472371 467272 462804 459007 455852 453159
62293D53159k453k102j332m49J6J32M49J094J730K319L157M074M438M188M087
$$ 453159 450706 448604 447272 446823 446839 446971 447420 448514 450244 452563 455720 459794 464232 468420 472507
62278D72507M636N416N887O108O291O275O041O135O981Q248R416J0526J1787J2957
$$ 472507 477143 482559 488446 494554 500845 507120 513161 519296 526277 534525 543941 554467 566254 579211
62264E79211J3809J4914J7093K0268K3579K6613K9853L3830L8448M3319M8279
$$ 579211 593020 607934 625027 645295 668874 695487 725340 759170 797618 840937 889216
62253H89216N3329N8388O3353O8161P2564P5913P7240P5671P0818O2921N2525
$$ 889216 942545 1000933 1064286 1132447 1205011 1280924 1358164 1433835 1504653 1567574 1620099
62242A620099M0076K6052J1488k211j4254k4955l4785m3350m9872n4475n8271
$$ 1620099 1660175 1686227 1697715 1695504 1681250 1656295 1621510 1578160 1528288 1473813 1415542
62231A415542o1990o5106o6523o5772o3257n9663n5451n0860m6117m1434l6867
$$ 1415542 1353552 1288446 1221923 1156151 1092894 1033231 977780 926920 880803 839369 802502
62220H02502l2349k7976k4184k1333j9186j7140j5062j3463j2648j2197j1575
$$ 802502 770153 742177 717993 696660 677474 660334 645272 631809 619161 606964 595389
62209E95389j0796j0024q975p404n859n165n266n317m872m233l515k348q14J31
$$ 595389 584593 574569 565594 558190 552331 547166 541900 536583 531711 527478 523963 521615 520801 520932
62195E20932j24q49q57j3Q81J459K173L323M529N481O619Q480J0687J2153J2317
$$ 520932 520808 519959 519102 519089 519970 521429 523602 526925 531454 536935 543554 552034 562721 574874 587191
62180E87191J1774J1614J2383J3699J4650J4454J3022J1174J0049J0078J0621
$$ 587191 598965 610579 622962 636661 651311 665765 678787 689961 700010 710088 720709
62169G20709J0947J1394J3114J6631K1199K5750L0078L4671L9682M4569M8706
$$ 720709 731656 743050 756164 772795 793994 819744 849822 884493 924175 968744 1017450
62158A017450N1953N4420N5891N5583N2573M6524L8012K8133J7770P395k549j1480
$$ 1017450 1069403 1123823 1179714 1235297 1287870 1334394 1372406 1400539 1418309 1425704 1423155 1411675
62146A411675j9026k5369l0948l5989m0382m3876m6235m7408m7524m6616m4370
$$ 1411675 1392649 1367280 1336332 1300343 1259961 1216085 1169850 1122442 1074918 1028302 983932
62135I83932m0573l5755l0938k6554k2280j8072j4661j2556j1163r541p601n890
$$ 983932 943359 907604 876666 850112 827832 809760 795099 782543 771380 761839 754238 748348
62123G48348m625l658l068k979k996k627k146k253k911l345l158k690k167j263
$$ 748348 743723 740065 736997 734018 731022 728395 726249 723996 721085 717740 714582 711892 709725 708462
62109G08462K43K094M006N979P970R851J1771J3863J5459J5307J2890Q964M625
$$ 708462 708705 710799 714805 720784 728754 738605 750376 764239 779698 795005 807895 816859 821484
62096H21484N92k385l273j706J271L939N143M612K593l54l564o658r343j0750
$$ 821484 822076 819691 816418 814712 815983 819922 825065 829677 832270 831916 828352 821694 812351 801601
62082H01601r670n959j137L040O252R359J2901J6477J9380K1282K2443K3565K5315
$$ 801601 791931 785972 784835 787875 794127 803486 816387 832864 852244 873526 895969 919534 944849
62069I44849K7658K9897L1456L2356L2800L3009L3629L5480L8375M0933M2234
$$ 944849 972507 1002404 1033860 1066216 1099016 1132025 1165654 1201134 1239509 1280442 1322676
62058A322676M2905M3796M4303M3030L9568L4525K8175K0299J1279K219o156j3796
$$ 1322676 1365581 1409377 1453680 1496710 1536278 1570803 1598978 1619277 1630556 1632775 1626619 1612823
62046A612823k0573k6201l0987l5667m0344m4418m7680n0442n2429n2610n0641
$$ 1612823 1592250 1566049 1535062 1499395 1459051 1414633 1366953 1316511 1264082 1211472 1160831
62035A160831m7522m4394m1379l8131l4678l1134k7384k3679k0871j9321j8214
$$ 1160831 1113309 1068915 1027536 989405 954727 923593 896209 872530 851659 832338 814124
62024H14124j6601j4594j2803j1218r546q149p581p464o965o221o216p161p975
$$ 814124 797523 782929 770126 758908 749362 741213 733632 726168 719203 712982 706766 699605 691630
62011F91630p778o955o355o150o014n809n488m781l585k364j573r14K32J787L017
$$ 691630 683852 676897 670542 664392 658378 652569 647081 642300 638715 636351 634778 633864 634096 635883 638900
61996F38900L609M063M809N495N477M647L411K062N53j226l183n025o351o985
$$ 638900 642509 646572 651381 656876 662353 667000 670411 672473 673026 671800 668617 663592 657241 650256
61982F50256p375q356j0141j1769j2099j1190j0128r519q977q152p426p117o770
$$ 650256 642881 634525 624384 612615 600516 589326 579198 569679 560702 552550 545124 538007 531237
61969E31237n889m810m129l683k956k168k006k398k537k143j824j847j519k67
$$ 531237 525348 520538 516409 512726 509770 507602 505596 503198 500661 498518 496694 494847 493328 493061
61955D93061J354K265K079J277O11O93J747L210M047L943L854M853O736Q323Q926
$$ 493061 494415 496680 498759 500036 500647 501340 503087 506297 510344 514287 518141 522994 529730 538053 546979
61940E46979Q888Q885R340J0522J2509J4867J6797J7884J8458J9098J9981K0752
$$ 546979 555867 564752 574092 584614 597123 611990 628787 646671 665129 684227 704208 724960
61928G24960K0881K0143J8891J7701J6592J4912J2377R776P950O341L507p86n061
$$ 724960 745841 765984 784875 802576 819168 834080 846457 856233 864183 870524 874031 873245 868184
61915H68184q067j0250j2572j4653j5226j3991j1815r137n415n59M155P439R595
$$ 868184 860117 849867 837295 822642 807416 793425 781610 772473 767058 766499 770654 778093 787688
61902G87688J1898J4736J7124J8029J7343J5509J2872R662O135K353j810o140
$$ 787688 799586 814322 831446 849475 866818 882327 895199 904861 910996 913349 911539 905399
61890I05399r915j2572j4291j5539j6330j6357j5699j4940j4513j4358j4196j3835
$$ 905399 895484 882912 868621 853082 836752 820395 804696 789756 775243 760885 746689 732854
61878G32854j3181j2306j1608j1591j2303j3218j3750j3704j3169j2241j1001
$$ 732854 719673 707367 695759 684168 671865 658647 644897 631193 618024 605783 594782
61867E94782r478p567n185k684p92J18M77J035K041L221M418N858P769R992J2170
$$ 594782 585304 577737 572552 569868 569076 569194 569671 570706 572747 575968 580386 586244 594013 604005 616175
61852F16175J4184J6181J8298K0443K2470K4461K6656K9068L1278L2830L3723
$$ 616175 630359 646540 664838 685281 707751 732212 758868 787936 819214 852044 885767
61841H85767L4365L4946L5078L4029L1272K6759K0862J4121P038J4o567j2298
$$ 885767 920132 955078 990156 1024185 1055457 1082216 1103078 1117199 1124237 1124251 1117684 1105386
61829A105386j6827j9838k0861j9431j5738j0877o007j378L345P912J1375J3303
$$ 1105386 1088559 1068721 1047860 1028429 1012691 1001814 995807 994429 997774 1005686 1017061 1030364
61817A030364J4357J5210J5383J3706R674L853k842r778j6648k3289k9435l4406
$$ 1030364 1044721 1059931 1075314 1089020 1098694 1102547 1099705 1089927 1073279 1049990 1020555 986149
61805I86149l7298l7916l7265l6579l5961l4571l2114k9341k6915k4568k1832
$$ 986149 948851 910935 873670 837091 801130 766559 734445 705104 678189 653621 631789
61794F31789j9038j6881j5308j3635j1733j0372j0127j0463j0326r307p861o563
$$ 631789 612751 595870 580562 566927 555194 544822 534695 524232 513906 504599 496738 490175
61782D90175n657n184n013m682l750k543k005k428k841k307j358j322k289k744
$$ 490175 484518 479334 474321 469639 465889 463346 461341 458913 456072 453765 452407 451085 448796 446052
61768D46052j494Q87K945L941M050L587K924K738L478M647N365N617O207P422
$$ 446052 444558 445445 448390 452331 456381 459968 462892 465630 469108 473755 479120 484737 490944 498366
61754D98366Q490Q656Q189P901Q078Q333Q189P484O342N100M093L247K072L25
$$ 498366 506856 515512 523701 531602 539680 548013 556202 563686 570028 575128 579221 582468 584540 584865
61740E84865j521k769l317l577l681l287k300j260p02m19J74J102J753J738J403
$$ 584865 583344 580575 577258 573681 570000 566713 564413 563153 562451 562032 562206 563308 565061 566799 568202
61725E68202J257J304J237J021R31J105J392J582J512J093N16K63N12O53q8j597
$$ 568202 569459 570763 572000 573021 573952 575057 576449 578031 579543 580636 581152 581415 581927 582580 582492 580895
61709E80895k960l664m095m685n259n550n735n963n865n198m575m845n894o639
$$ 580895 577935 574271 570176 565491 560232 554682 548947 542984 537119 531921 527346 522501 516607 509968
61695E09968o252m932l507k708k785l388l838l763l408l121k787k176j522j213
$$ 509968 503716 498784 495277 492569 489784 486396 482558 478795 475387 472266 469479 467303 465781 464568
61681D64568j081o08J83O57M27k42r09j345j414j142r40j291k005k294j803j007
$$ 464568 463487 462879 463062 463719 464146 463904 462995 461650 460236 459094 458154 456863 454858 452564 450761 449754
61665D49754m75j50L55J122J881K284K132J581J263J729K714L371L383L354L874
$$ 449754 449279 449129 449484 450606 452487 454771 456903 458484 459747 461476 464190 467561 470944 474298 478172
61650D78172M751N431N711N650N246M661M413M769N236N134M590M393M916N642
$$ 478172 482923 488354 494065 499715 504961 509622 514035 518804 524040 529174 533764 538157 543073 548715
61636E48715N845N378M590L755K823J719O53m8m66j123k270l393l831l698l739
$$ 548715 554560 559938 564528 568283 571106 572825 573478 573430 572964 571841 569571 566178 562347 558649 554910
61621E54910m240m659m525m117l974m185m483m723m831m591l865k935k359k583
$$ 554910 550670 546011 541486 537369 533395 529210 524727 520004 515173 510582 506717 503782 501423 498840
61607D98840l707n389o870p506p400p197p142o857o196n712n822o064n776n074
$$ 498840 495133 489744 482874 475368 467968 460771 453629 446772 440576 434864 429042 422978 417202 412128
61593D12128m616m623m727m611m264l712k967k238j809j730j854k062k258k319
$$ 412128 407512 402889 398162 393551 389287 385575 382608 380370 378561 376831 374977 372915 370657 368338
61579C68338k283k373k593k657k494k442k599k538k039j569j505j426q98m36p68
$$ 368338 366055 363682 361089 358432 355938 353496 350897 348359 346320 344751 343246 341820 340922 340486 339718
61564C39718j506j649j196j170j967k705k556j762r88m27k9O7r5J4P83J787K184
$$ 339718 338212 336563 335367 334197 332230 329525 326969 325207 324219 323792 323763 323830 323735 323749 324532 326319 328503
61547C28503J628N89j37q6M41O18k8r39j160n30K01M74N16O94R49J168J545K144
$$ 328503 330131 330720 330583 330497 330938 331556 331528 330589 329429 328899 329100 329574 330090 330784 331733 332901 334446 336590
61529C36590K572K469K043J801J911K148K166J654N38p42j530j744j978k565l030
$$ 336590 339162 341631 343674 345475 347386 349534 351700 353354 353892 353150 351620 349876 347898 345333 342303
61514C42303k856k320k059k103j930j290n31r8j00l72p06r69j134j130p50O9Q22
$$ 342303 339447 337127 335068 332965 331035 329745 329214 329116 329016 328644 327938 326969 325835 324705 323955 324024 324846
61497C24846Q06K5p03q22p29r59j224q51J09Q75R10L87k65p64r70r15q44q77p68
$$ 324846 325652 325677 324974 324152 323423 322464 321240 320389 320498 321373 322283 322670 322405 321641 320671 319756 318912 318035 317267
61478C17267l04J74J13m57r97j207j228j097n86K38Q74R99P97M85n7q35j317r59
$$ 317267 316963 317137 317250 316793 315796 314589 313361 312264 311678 311916 312790 313789 314586 315071 315014 314179 312862 311903
61460C11903NO72M19m97j235j168m13L20M47J02r3J65M94M24J01R7O06J140J148
$$ 311903 311908 312580 312999 312502 311267 310099 309686 310006 310453 310555 310462 310627 311121 311545 311646 311743 312349 313489 314637
61441C14637O77L11N16J212J938K311K286K101K060K315K751L104L224L195L114
$$ 314637 315314 315625 316141 317353 319291 321602 323888 325989 328049 330364 333115 336219 339443 342638 345752
61426C45752K891K387J743J297J156J017O15J19n2K70Q18J219J384J588K103K755
$$ 345752 348643 351030 352773 354070 355226 356243 356858 356977 356925 357195 358013 359232 360616 362204 364307 367062
61410C67062K945K354J487J171J453J396K60j486k670k740k180j712j564j529
$$ 367062 370007 372361 373848 375019 376472 377868 378128 376642 373972 371232 369052 367340 365776 364247
61396C64247j398j106p47n65p87j322j723j608j013k94K57N60O30M62J27j18N8
$$ 364247 362849 361743 360996 360431 359644 358322 356599 354991 353978 353684 353941 354501 355131 355593 355720 355602 355660
61379C55660P95J879K829L172K720J778R99R18J441J967K036J711J246P17K08
$$ 355660 356455 358334 361163 364335 367055 368833 369832 370750 372191 374158 376194 377905 379151 379868 380076
61364C80076R0N67J105Q65k00j167j195m08M13O66L34q8Q7J175K709L884M450
$$ 380076 380166 380733 381838 382703 382503 381336 380141 379733 380146 380812 381146 381058 381145 382320 385029 388913 393363
61347C93363M753M986M981M949N637P346R332J0757J1643J2432J3067J3192J2815
$$ 393363 398116 403102 408083 413032 418669 426015 435347 446104 457747 470179 483246 496438 509253
61334E09253J2022J0441P780M679K230O92n54j820k688k883k822l069l709m480
$$ 509253 521275 531716 539496 544175 546405 547097 546543 544723 542035 539152 536330 533261 529552 525072
61320E25072n115n436n444n367n309n043m465l975l882l723k942j954j658j923
$$ 525072 519957 514521 509077 503710 498401 493358 488893 484918 481036 477313 474371 472417 470759 468836
61306D68836j660n17N77R35J165K067L348M133M259M292M722N682P083Q446Q985
$$ 468836 467176 466659 467236 468171 469336 471403 474751 478884 483143 487435 492157 497839 504922 513368 522353
61291E22353Q391P208N982M366J720j705m815o790p676p920p797p287o236m691
$$ 522353 530744 537952 543934 548300 550020 548315 543500 536710 529034 521114 513317 506030 499794 495103
61277D95103l124k085j505p46M23J389J631J576K000L016M216N423O678P825Q712
$$ 495103 491979 489894 488389 487643 488066 489455 491086 492662 494662 497678 501894 507317 513995 521820 530532
61262E30532R580J0591J1328J1371J1097J1095J1095J0407R345R110J0145J1565
$$ 530532 540112 550703 562031 573402 584499 595594 606689 617096 626441 635551 645696 657261
61250F57261J2549J3372J4532J5708J6158J5671J4363J2023Q321L551j368n596
$$ 657261 669810 683182 697714 713422 729580 745251 759614 771637 779958 783509 782141 776545
61238G76545q720j0562j1156j0984j0900j1492j2574j3282j2830j1240r310p787
$$ 776545 767825 757263 746107 735123 724223 712731 700157 686875 674045 662805 653495 645708
61226F45708o625n313l762k493j969k112k561l004l147k751j893r01O5J015J600
$$ 645708 639083 633770 630008 627515 625546 623434 620873 617869 614722 611971 610078 609177 609242 610257 611857
61211F11857J124n52k476l504l513l326l551l997m132l724k911j965j160o70m89
$$ 611857 612981 612429 609953 606449 602936 599610 596059 592062 587930 584206 581295 579330 578170 577500 577011
61196E77011n20o69p78n23L85J904L676N406P096Q928J1000J3257J5542J7645
$$ 577011 576491 575822 575044 574521 574906 576810 580486 585892 592988 601916 612916 626173 641715 659360
61182F59360J9336K0441K0920K0865K0268J8837J6233J2651R049O543N552N658
$$ 659360 678696 699137 720057 740922 761190 780027 796260 808911 817960 824503 830055 835713
61170H35713O154O496O348N640M617L541K250L70k034m399o424q369j0304j1666
$$ 835713 841867 848363 854711 860351 864968 868509 870759 871129 869095 864696 858272 849903 839599 827933
61156H27933j2033j1992j2538j3706j4443j3895j2411j1120j0809j1292j1546
$$ 827933 815900 803908 791370 777664 763221 749326 736915 725795 714986 703694 692148
61145F92148j0446p734m358j645m1J040K204L398M372N222N972O007M443J129
$$ 692148 681702 673968 669610 667965 667924 668964 671168 674566 678938 684160 690132 696139 700582 701711
61131G01711l087p058j0029j1719j2097j1312r665p528n339l559k385j442l8K107
$$ 701711 698624 691566 681537 669818 657721 646409 636744 629216 623877 620318 617933 616491 616453 618560
61117F18560M548O671Q277R474J0247J0601J0984J2035J3721J5218J5921J6292
$$ 618560 623108 629779 638056 647530 657777 668378 679362 691397 705118 720336 736257 752549
61105G52549J7158J8461J9244J8967J8239J7961J8165J8145J7521J6645J5910
$$ 752549 769707 788168 807412 826379 844618 862579 880744 898889 916410 933055 948965
61094I48965J5128J3749J1542Q772N885L124L99k622o229j0270j4007j6609j7867
$$ 948965 964093 977842 989384 998156 1004041 1007165 1007564 1004942 998713 988443 974436 957827 939960
61081I39960j8254j8268j7891j6934j5630j4535j3859j3316j2700j2160j1694
$$ 939960 921706 903438 885547 868613 852983 838448 824589 811273 798573 786413 774719
61070G74719j0819r221p436o254n604m708l323k136j552q70P23K801M090M078
$$ 774719 763900 754679 747243 740989 735385 730677 727354 725218 723666 722796 723519 726320 730410 734488
61056G34488L578L572M153M842N409O002O693P321P797Q319R253J0807J2795J4703
$$ 734488 738066 741638 745791 750633 756042 762044 768737 776058 783855 792174 801427 812234 825029 839732
61042H39732J6160J7322J8596J9958K0892K1230K1667K3018K5135K7075K8363
$$ 839732 855892 873214 891810 911768 932660 953890 975557 998575 1023710 1050785 1079148
61031A079148K9601L1576L4140L6359L7579L7984L8202L8734L9794M1435M3560
$$ 1079148 1108749 1140325 1174465 1210824 1248403 1286387 1324589 1363323 1403117 1444552 1488112
61020A488112M5989M8656N1721N5400N9662O4182O8607P2801P6746Q0237Q2909
$$ 1488112 1534101 1582757 1634478 1689878 1749540 1813722 1882329 1955130 2031876 2112113 2195022
61009B195022Q4934Q7531R2376J00243J10662J23148J38271J56855J78417K01348
$$ 2195022 2279956 2367487 2459863 2560106 2670768 2793916 2932187 3089042 3267459 3468807
60999C468807K24754K49657K78456L14233L60787M22261N01895O01452P22222
$$ 3468807 3693561 3943218 4221674 4535907 4896694 5318955 5820850 6422302 7144524
60990G144524Q66445J038883J249029J510530J832357K206323K606927L007402
$$ 7144524 8010969 9049852 10298881 11809411 13641768 15848091 18455018 21462420
60982B1462420L385674L693109L811516L571853K867525J782885O04081l26055
$$ 21462420 24848094 28541203 32352719 35924572 38792097 40574982 41179063 40853008
60974D0853008p93573p88122m41843N9613N04209O55611L19560n31736j695842
$$ 40853008 40059435 39271313 38829470 38889083 39393292 40048903 40368463 39836727 38140885
60965C8140885k827031l620109l947282l862584l512112l042338k557152k114498
$$ 38140885 35313854 31693745 27746463 23883879 20371767 17329429 14772277 12657779
60957A2657779j737092j425521j171012r63927p96023o60025n50054m62149l93410
$$ 12657779 10920687 9495166 8324154 7360227 6564204 5904179 5354125 4891976 4498566
60948D498566l40709l00409k68769k42414k18974j97512j77974j60161j43619
$$ 4498566 4157857 3857448 3588679 3346265 3127291 2929779 2751805 2591644 2448025
60939B448025j28249j14282j01765r0806q2325p7563p6544p7675p9059p9512p8259
$$ 2448025 2319776 2205494 2103729 2012923 1930598 1853035 1776491 1698816 1619757 1540245 1461986
60928A461986p4753o9316o3283n7807n2953m8280m3752l9639l6049l3042l0708
$$ 1461986 1387233 1317917 1254634 1196827 1143874 1095594 1051842 1012203 976154 943112 912404
60917I12404k8722k6362k3497k1001j9617j8883j7842j6342j4855j3438j1759
$$ 912404 883682 857320 833823 812822 793205 774322 756480 740138 725283 711845 700086
60906G00086r992q737p987o968n267l431k233j726j346o03N15J576K077J863J221
$$ 700086 690094 681357 673370 666402 661135 657704 655471 653745 652399 651796 652311 653887 655964 657827 659048
60891F59048L65r20k769m628n687n924o132o849p779q437q857r404j0266j1332
$$ 659048 659413 658493 655724 651096 645409 639485 633353 626504 618725 610288 601431 592027 581761 570429
60877E70429j2323j2833j2552j1650j0659r882r212q560p981p246n926m178k954
$$ 570429 558106 545273 532721 521071 510412 500530 491318 482758 474777 467531 461605 457427 454473
60864D54473k864l256l061k242j681j699j570o02R08K164K831L104L229L389L840
$$ 454473 451609 448353 445292 443050 441369 439670 438100 437498 438406 440570 443401 446505 449734 453123 456963
60849D56963M713N739O454O622O275N553M779M531N117N964O001M809L067J687
$$ 456963 461676 467415 473869 480491 486766 492319 497098 501629 506746 512710 518711 523520 526587 528274
60835E28274Q30J0j168k619l921m548m238l374k768k832l233l609m176n047n482
$$ 528274 529104 529114 527946 525327 521406 516858 512620 509246 506478 503646 500413 496804 492628 487581 482099
60820D82099m729l394k998l987n206n640n648n930o219n972n637o047o846o720
$$ 482099 477370 473976 470978 466991 461785 456145 450497 444567 438348 432376 426739 420692 413846 407126
60806D07126n237l460k557k560k860l132l320l212k628j802j152p87m87p5L37
$$ 407126 401889 398429 395872 393312 390452 387320 384000 380788 378160 376358 375206 374419 373932 373857 374194
60791C74194M63K08l0L32J286J987J755J021P64J133J439J521K155L730N297N622
$$ 374194 374657 374865 374835 375167 376453 378440 380195 381216 381980 383113 384552 386073 388228 391958 397255 402877
60775D02877M748L800L594L993M471M662M458M017L682L675L887M147M509N001
$$ 402877 407625 411425 415019 419012 423483 428145 432603 436620 440302 443977 447864 452011 456520 461521
60761D61521N398N564N690N807N436M254K854K146K199K285K014J715J612J421
$$ 461521 466919 472483 478173 483980 489416 493670 496524 498670 500869 503154 505168 506883 508495 509916
60747E09916J025Q48J165J509J276N72Q1K56R57J654J721P28j099k821l487k938
$$ 509916 510941 511789 512954 514463 515739 516311 516392 516648 517605 519259 520980 521708 520609 517788 514301 511363
60731E11363j741m25R25K419L960N236N997O319O644P511R163J1397J3806J6009
$$ 511363 509622 509197 510122 512541 516501 521737 527734 534053 540697 548208 557371 568768 582574 598583
60717E98583J7692J8578J8683J8441J8433J8841J9178J8681J7029J4741J2682
$$ 598583 616275 634853 653536 671977 690410 709251 728429 747110 764139 778880 791562
60706G91562J1110R314O432K469j793n720r197j2135j4295j5797j7207j8733j9757
$$ 791562 802672 811986 818418 820887 819094 813374 804177 792042 777747 761950 744743 726010 706253
60693G06253j9730j9111j8816j8998j9012j8463j7605j6733j5843j4936j4088
$$ 706253 686523 667412 648596 629598 610586 592123 574518 557785 541942 527006 512918
60682E12918j3118j1795j0484r867r733q868o657m155k867k898l118k828k423
$$ 512918 499800 488005 477521 467654 457921 449053 442396 438241 435374 432476 429358 426530 424107
60669D24107k385k452k125j452r35r12j230j408j062l80q1p12j987l142l783m064
$$ 424107 421722 419270 417145 415693 414758 413846 412616 411208 410146 409766 409685 408973 406986 403844 400061 395997
60653C95997m014l360k079o89L07R35J519K236L050L745L890L216K243K021K864
$$ 395997 391983 388623 386544 385855 386162 387097 388616 390852 393902 397647 401537 404753 406996 409017 411881
60638D11881L706L302J741K52l39l65n48r68j038k25J374K942L542K959J949J486
$$ 411881 415587 418889 420630 420882 420543 420178 419630 418662 417624 417399 418773 421715 425257 428216 430165 431651
60622D31651J757K111J867R81n4p25r20j024j490k243k695k528k142k065k180
$$ 431651 433408 435519 437386 438367 438313 437588 436668 435644 434154 431911 429216 426688 424546 422481 420301
60607D20301k034j607j273j071o81r5L07M22N90Q78P74o9j187j765j528q85m04
$$ 420301 418267 416660 415387 414316 413635 413540 413847 414269 414859 415737 416511 416442 415255 413490 411962 411077 410673
60590D10673l22m51m41k47k79p95j347j259o28k47m64p07l57M60J318K104K843
$$ 410673 410351 409900 409459 409212 408933 408138 406791 405532 404904 404657 404193 403486 403129 403589 404907 407011 409854
60573D09854L360L635M103N126O409P409Q082Q865J0149J2050J4436J6783J8343
$$ 409854 413214 416849 420952 426078 432487 439896 447978 456843 466992 479042 493478 510261 528604
60560E28604J8950J9391K0599K2578K4414K5019K3553J9628J3674O909M50n278
$$ 528604 547554 566945 587544 610122 634536 659555 683108 702736 716410 723319 723769 718491
60548G18491r968j2931j3865j3586j3033j1860q982m364Q14N748J0677J5781K0563
$$ 718491 708523 695592 681727 668141 655108 643248 634266 629902 630716 636464 647141 662922 683485
60535F83485K4779K8979L3449L7404L9925M0979M0749L8455L2863K3926J3232
$$ 683485 708264 737243 770692 808096 848021 889000 929749 968204 1001067 1024993 1038225
60524A038225K730o497j4164k0039k3581k4275k2353j9014j5733j3262j1478j0186
$$ 1038225 1040955 1034458 1020294 1000255 976674 952399 930046 911032 895299 882037 870559 860373
60512H60373r587r775j0268j0343r574p751m792j178J944L770M883O691R840J3749
$$ 860373 850786 841011 830743 820400 810826 803075 798283 797105 799049 802819 807702 814393 824233 837982
60498H37982J7764K2141K7570L4228M1762N0002N9028O8585P7928Q6532R4488
$$ 837982 855746 877887 905457 939685 981447 1031449 1090477 1159062 1236990 1323522 1418010
60487A418010J01771J07361J09751J08282J03380R5412Q4044O9105N1267L1204
$$ 1418010 1519781 1627142 1736893 1845175 1948555 2043967 2128011 2197116 2248383 2279587
60477B279587Q671j6506m2882o7828q9429j07001j19853j26862j27760j23825
$$ 2279587 2288258 2271752 2228870 2161042 2071613 1964612 1844759 1717897 1590137 1466312
60467A466312j16702j07316r6473q5519p5532o6484n8029n0541m4492l9345l4171
$$ 1466312 1349610 1242294 1145821 1060302 984770 918286 860257 809716 765224 725879 691708
60456F91708k9139k5255k2742k0628j8170j5711j3814j2323j0766r140p812o968
$$ 691708 662569 637314 614572 593944 575774 560063 546249 533926 523160 514020 506208 499240
60444D99240o494o183n804n136m173l201k493k077j832j684j604j470j026p8J173
$$ 499240 492746 486563 480759 475623 471450 468249 465756 463679 461847 460163 458559 457089 456063 455985 457158
60429D57158J967J493k63k413m030m897n218n072m549m040l867l812l549l229
$$ 457158 459125 460618 460355 457942 453912 449015 443797 438725 434176 430136 426269 422457 418908 415679
60415D15679l136l016k435j638j286j365j165m86K3q8l54j54M54J049J424J476
$$ 415679 412543 409527 407092 405454 404168 402803 401638 401152 401175 401087 400733 400579 401033 402082 403506 404982
60399D04982J074M96M86J281J976J510O1j178j459j130q00m72K75J584K988L677
$$ 404982 406056 406552 407038 408319 410295 411805 411866 410688 409229 408099 407299 406827 407102 408686 411674 415351
60383D15351L111J583J80r6P46J779K168J938J673J698J753J414O85J5k16p3J69
$$ 415351 418462 420045 420225 420129 420875 422654 424822 426760 428433 430131 431884 433298 433983 433998 433782 433709 433878
60366D33878M82J007J643K031K082K171K526K791K554K088K048K400K282J232
$$ 433878 434360 435367 437010 439041 441123 443294 445820 448611 451165 453253 455301 457701 459983 461215
60352D61215K7k43L07M61l98j444j610j026n96n53k45O79J740K475L053L718M184
$$ 461215 461242 460999 461306 461767 461369 459925 458315 457289 456693 456140 455895 456574 458314 460789 463842 467560 471744
60335D71744M095L550K830K011J289J107J494J725J288P10P37J167J270J023R28
$$ 471744 475839 479389 482219 484230 485519 486626 488120 489845 491133 491843 492580 493747 495017 496040 496968
60320D96968R18M09o42j633k200k296j562K66K366L433L499L899N158O239O394
$$ 496968 497886 498295 497653 496020 493820 491524 489962 490228 492594 496027 499526 503425 508583 514822 521216
60305E21216O415P206Q325Q960R394J0379J1962J4038J7240K1778K5889K7040
$$ 521216 527631 534837 543162 552122 561516 571895 583857 597895 615135 636913 662802 689842
60293F89842K4570J9896J4245P507m85q858j6380k2323k6225k7659k6722k4202
$$ 689842 714412 734308 748553 756060 755575 746717 730337 708014 681789 654130 627408 603206
60281F03206k0859j7038j3233j0306q667p732o681n466m627m439m615m738m664
$$ 603206 582347 565309 552076 541770 533103 525371 518690 513224 508597 504158 499543 494805 490141
60268D90141m473m245l961l563l149k941k992l075k965k618j998j088k48r0n85
$$ 490141 485668 481423 477462 473899 470750 467809 464817 461742 458777 456159 454161 453073 452825 452735 452150
60253D52150q60l99Q6k73j085j351j160j467k240k230r35M76P97L08q8k97o54
$$ 452150 451290 450891 450977 450704 449619 448268 447108 445641 443401 441171 440236 440712 441509 441817 441729 441432 440778
60236D40778q79m98J21J93j91j65N22J158J291J461K313L478L967L455K771K913
$$ 440778 439899 439401 439522 439715 439524 439359 439881 441039 442330 443791 446104 449582 453549 457004 459775 462688
60220D62688L891M722M599L741K933K492K102J569J186J164J272J336J644K422
$$ 462688 466579 471301 475900 479641 482574 485066 487168 488737 489923 491087 492359 493695 495339 497761
60206D97761L241L417K924K448K561L178L844M282M524M621M379L541K281J282
$$ 497761 501002 504419 507343 509791 512352 515530 519374 523656 528180 532801 537180 540721 543002 544284
60192E44284J050J251J177P71O14Q39Q31L05p5K24N03l51k176l593l703l044k653
$$ 544284 545334 546585 547762 548533 549147 549986 550817 551122 551047 551271 551774 551423 549247 545654 541951 538907 536254
60175E36254k817l087l121l009k924k750k254j509r72r53j128q57l1P31Q17K38
$$ 536254 533437 530350 527229 524220 521296 518546 516292 514783 513811 512858 511730 510873 510842 511573 512390 512628
60159E12628o08j329j482o13J172K968L919M093M116M231M266M307M700N398N901
$$ 512628 512020 510691 509209 508596 509768 512736 516655 520748 524864 529095 533361 537668 542368 547766 553667
60144E53667N950N757N421M651L330J924J051Q35Q68P07L40K07P04J613K209K155
$$ 553667 559617 565374 570795 575446 578776 580700 581751 582586 583454 584161 584501 584708 585412 587025 589234 591389
60128E91389J931K050K178J608L60q32j558k029k329k098j242k53M72J140K003
$$ 591389 593320 595370 597548 599156 599516 598684 597126 595097 592768 590670 589428 589175 589647 590787 592790
60113E92790K849L384L723M061M278M360M829O242Q308J0004J0493R755Q465P520
$$ 592790 595639 599023 602746 606807 611085 615445 620274 626516 634824 644828 655321 665076 673541 681061
60099F81061P400P650P136N134K119q05l062m819o330p530q326q815q976q488
$$ 681061 688461 696111 703247 708381 710500 709695 706633 701814 695484 687954 679628 670813 661837 653349
60085F53349p158n423m155l798l826l314k135j252j551k564k925k053p81k02m69
$$ 653349 646191 640768 636613 632815 628989 625675 623540 622288 620737 618173 615248 613195 612414 612212 611743
60070F11743j115j931k952l940m550m784m838m641m072l482l393l734l918l713
$$ 611743 610628 608697 605745 601805 597255 592471 587633 582992 578920 575438 572045 568311 564393 560680
60056E60680l522l731m299n114o119o932o898n885m625l882l603l277k827k592
$$ 560680 557158 553427 549128 544014 537895 530963 524065 518180 513555 509673 506070 502793 499966 497374
60042D97374k615k419j648n36M40J157J878K774L591L889L588L085K869L003L164
$$ 497374 494759 492340 490692 490156 490596 491753 493631 496405 499996 503885 507473 510558 513427 516430 519594
60027E19594L068K718K261J770J219N33m02j652l106m479n501o071o255o172n881
$$ 519594 522662 525380 527641 529411 530630 531163 530761 529109 526003 521524 516023 509952 503697 497525 491644
60012D91644n328m560l916l786m020l921l077j947j209q23k58N41J072J194J353
$$ 491644 486316 481756 477840 474054 470034 466113 463036 461089 459880 459057 458799 459340 460412 461606 462959
59997D62959J794K206K453K970L998N032N553N783O112O267N731M692L784L128
$$ 462959 464753 466959 469412 472382 476380 481412 486965 492748 498860 505127 510858 515550 519334 522462
59983E22462K444J925K154L028L627L390K779K466K469K358J835P71p72k274l004
$$ 522462 524906 526831 528985 532013 535640 539030 541809 544275 546744 549102 550937 551708 550936 548662 545658
59968E45658k914k796l195l671l578l073k732k556k112j354o39j4P59J542J901
$$ 545658 542744 539948 536753 533082 529504 526431 523699 521143 519031 517677 517038 517024 517783 519325 521226
59953E21226J847J858K017J858J243P44P72J008J113J410K275L293L712L451K952
$$ 521226 523073 524931 526948 528806 530049 530793 531565 532573 533686 535096 537371 540664 544376 547827 550779
59938E50779K255J034m22j132p10r4m45j728k867l106k690k285k285k668l188
$$ 550779 553034 554068 553646 552514 551804 551710 551265 549537 546670 543564 540874 538589 536304 533636 530448
59923E30448l418k988k000r89l41J24P69J583K306K881L461L964M045L616L017
$$ 530448 527030 524042 522042 521053 520712 520836 521605 523188 525494 528375 531836 535800 539845 543461 546478
59908E46478K526J983J213N75O58J474K263K249J378K47n17p00m88j96J8K85Q83
$$ 546478 549004 550987 552200 552775 553433 554907 557170 559419 560797 561044 560527 559827 559339 559143 559161 559446 560329
59891E60329J961L324M517N060M751L781K626J703J180J030J207J668K285K821
$$ 560329 562290 565614 570131 575191 579942 583723 586349 588052 589232 590262 591469 593137 595422 598243
59877E98243K999K620J733Q18N90J412K834L855L670K164j58k523m243n009n018
$$ 598243 601242 603862 605595 606413 607003 608415 611249 615104 618774 620938 620780 618257 614014 609005 603987
59862F03987m762m641m749m906m766m102l173k688l113m034m438l660j880J78
$$ 603987 599225 594584 589835 584929 580163 576061 572888 570200 567087 563053 558615 554955 553075 553253
59848E53253J772K470K377K132K349K998L544L723L855M348N327O802Q750J0850
$$ 553253 555025 557495 559872 562004 564353 567351 570895 574618 578473 582821 588148 594950 603700 614550
59834F14550J2619J4060J5669J7418J8139J6495J2371O971J845j820l317k671
$$ 614550 627169 641229 656898 674316 692455 708950 721321 728292 730137 728317 725000 722329
59822G22329q34P82J099l51l636q412j3813j8848k2858k5324k5544k3220j9278
$$ 722329 721495 722277 723376 723025 719389 710977 697164 678316 655458 630134 604590 581370 562092
59809E62092j5412j2621j0669r022p637o617n739m737l745l004k542k360k554
$$ 562092 546680 534059 523390 514368 506731 500114 494375 489638 485893 482889 480347 477987 475433
59796D75433k940k945k331j714j841k523k785k120j063m94o52j027j061p39n17
$$ 475433 472493 469548 467217 465503 463662 461139 458354 456234 455171 454677 454025 452998 451937 451198 450681
59781D50681p27j240j756k226k714l009k859k532k579k893k654j557m96m50j168
$$ 450681 449954 448714 446958 444732 442018 439009 436150 433618 431039 428146 425492 423935 423439 422989 421821
59766D21821j600j265m80M47J418K019J694O43j95k55J47O83J543K771L724L910
$$ 421821 420221 418956 418476 418923 420341 422360 424054 424697 424502 424247 424394 425077 426620 429391 433115 437025
59750D37025L823M250N036N347M949M473M381M400M225M043M049L893L148J976
$$ 437025 440848 445098 450134 455481 460430 464903 469284 473684 477909 481952 486001 489894 493042 495018
59736D95018Q95N2p72j611k214k491k665k819k717k204j506r69o98o47p93j010
$$ 495018 495913 495965 495193 493582 491368 488877 486212 483393 480676 478472 476966 475997 475299 474652 473859 472849
59720D72849j003o87m57p06j228j415j053n39l02l44m20l42L1P51J621K304K751
$$ 472849 471846 471159 470702 469996 468768 467353 466300 465761 465459 465115 464695 464353 464384 465135 466756 469060 471811
59703D71811L266M025M765N226N516N822O059O125O260O714P233P309O926O656
$$ 471811 475077 479102 483867 489093 494609 500431 506490 512615 518875 525589 532822 540131 547057 553713
59689E53713O901P392P541O993N767M070K213N93m37p61o12m41n57q30r09p66
$$ 553713 560614 568006 575547 582540 588307 592377 594590 595183 594746 593985 593373 592932 592375 591545 590636 589870
59673E89870q00j227j732k029k432l355m433m812m312l691l543l472k779j535
$$ 589870 589070 587843 586111 584082 581650 578295 573862 569050 564738 561047 557504 554032 551253 549718
59659E49718m55J07N44J328K352L145L546L974M832N867O327N936N331N227N351
$$ 549718 549263 549370 549914 551242 553594 556739 560285 564259 569091 574958 581285 587221 592552 597779 603130
59644F03130M749L084J010p92k328l745m757n180n593o701q198q978q542p591
$$ 603130 607879 610963 611973 611181 608853 605108 600351 595171 589578 582877 574679 565701 557159 549568
59630E49568p013o754o039m488k651j499j519k311k956k856k307k184k928l955
$$ 549568 542555 535801 529762 525274 522623 521124 519605 517294 514338 511482 509175 506991 504063 500108
59616E00108m249l560k735k694l277l560l235l048l590m269m118l249k601k394
$$ 500108 495859 492299 489564 486870 483593 480033 476798 473750 470160 465891 461773 458524 455923 453529
59602D53529j850o27M44O24L97N82R96Q65J03p39j466k233k742k437j583j081
$$ 453529 451679 451052 451496 452120 452517 453099 454095 454960 455063 454324 452858 450625 447883 445446 443863 442782
59586D42782j164j159q02p13j186j510j176q21j120j573j336q05j126k390l359
$$ 442782 441618 440459 439657 438944 437758 436248 435072 434251 433131 431558 430222 429417 428291 425901 422542
59571D22542l144k189j406j103j092j136r76l90L94P75N72L12M43P38P89O50N46
$$ 422542 419398 417209 415803 414700 413608 412472 411496 411106 411500 412275 412847 413159 413602 414340 415129 415779 416325
59554D16325L17k31p34o73k02L5j7L27J369K372K503K045K005K735L534L756L736
$$ 416325 416642 416411 415677 415004 414802 414837 414820 415147 416516 418888 421391 423436 425441 428176 431710 435466 439202
59537D39202M322N784P651R546J1644J4227J7104J9623K0931J9995J5831Q491
$$ 439202 443524 449308 456959 466505 478149 492376 509480 529103 550034 570029 585860 594351
59525E94351j21p060j0450j0612r011o576l543m51J665K348K335K633L293L554
$$ 594351 594230 587170 576720 566108 557097 550521 546978 546527 548192 550540 552875 555508 558801 562355
59511E62355K945J784N83n58j832l289m752o013o937p408p414p153o944o932o938
$$ 562355 565300 567084 567667 567109 565277 561988 557236 551223 544286 536878 529464 522311 515367 508435 501497
59496E01497o681o178n799n774n770n200l985k765k133j948j685j222q34n02K18
$$ 501497 494816 488638 482839 477065 471295 466095 462110 459345 457212 455264 453579 452357 451523 451021 451239
59481D51239J445K608L164L284L465L715L646L252L068L459M109M375L894K783
$$ 451239 452684 455292 458456 461740 465205 468920 472566 475818 478886 482345 486454 490829 494723 497506
59467D97506J456L36m05r85j690k378k531j888q20P3N72R09J346J891K436K987
$$ 497506 498962 499298 498893 497908 496218 493840 491309 489421 488601 488674 489246 490155 491501 493392 495828 498815
59451D98815L730M872O344P780Q891R811J0773J1581J1694J0949R763Q440O708
$$ 498815 502545 507417 513761 521541 530432 540243 551016 562597 574291 585240 595003 603443 610151
59438F10151M222J194j850m669p143q831r367r229r375r926r895q608o801n737
$$ 610151 614373 615567 613717 609048 601905 593074 583707 574478 565103 555177 545282 536674 529873 524136
59424E24136n609n483m620l205j734l41J029K367L865O023Q976J1955J3973J5041
$$ 524136 518527 513044 508424 505219 503485 503144 504173 506540 510405 516428 525404 537359 551332 566373
59410E66373J6229J8336K0979K3201K4557K5026K3988J9960J1949J046r608j6724
$$ 566373 582602 600938 621917 645118 669675 694701 718689 738649 750598 751644 742036 725312
59398G25312j8963j7360j3922r884n307j53M574O927N225p52r494j8398k4956
$$ 725312 706349 688989 675067 665183 659876 659723 664297 671224 676449 675697 666203 647805 622849
59385F22849k7855k7316k4483k0526j6272j2368r262o950n106l566k493j948j579
$$ 622849 594994 567678 543195 522669 506397 494029 484767 477817 472711 469145 466652 464704 463125
59372D63125r73o2R24J747K243K329K135J952J895J795J544J319J212R98N69L05
$$ 463125 462152 462090 463014 464761 467004 469333 471468 473420 475315 477110 478654 479973 481185 482183 482752 483057
59356D83057O23J337J901K186K528L139L921M860O073P455Q688R716J0830J2175
$$ 483057 483680 485017 486918 489104 491632 494771 498692 503552 509625 517080 525768 535484 546314 558489
59342E58489J3541J4707J5717J6679J7647J8624J9377J9347J8240J6685J5688
$$ 558489 572030 586737 602454 619133 636780 655404 674781 694128 712368 729053 744741
59331G44741J5324J4607J2777J0122P307M606K139J16j688l960o702q710r003
$$ 744741 760065 774672 787449 797571 804878 809484 811623 811739 810051 806091 799389 790679 781676
59318G81676q300q116q737r139q681p852p192o608n931n368m926m238l320k826
$$ 781676 773376 765260 756523 747384 738703 730851 723659 717051 711120 705752 700826 696588 693268 690442
59304F90442l024l196k626j682j209j229j033m12j6l53j070j458j256o64J84J397
$$ 690442 687418 684222 681596 679914 678705 677476 676443 676031 676015 675662 674592 673134 671878 671214 671398 672795
59288F72795L025M876O726Q647J1010J4138J7968K2090K5924K8686K9212K6188
$$ 672795 675820 680696 687422 696069 707079 721217 739185 761275 787199 815885 845097 871285
59276H71285J8924Q116m075j4790k1701k3964k2332j8366j3490q630m366r97J573
$$ 871285 890209 898325 894250 879460 857759 833795 811463 793097 779607 770977 766611 765614 767187
59263G67187L720N702P400Q436Q429P237N171K899R67o81k497m754p285r732j1772
$$ 767187 770907 776609 784009 792445 800874 808111 813282 816181 817148 816467 813970 809216 801931 792199 780427
59248G80427j3144j3743j3674j3044j1872j0443r504r515r895r570q340p051o343
$$ 780427 767283 753540 739866 726822 714950 704507 695003 685488 675593 666023 657683 650632 644289
59235F44289n920n320m667m217l722k843j743q20j54L12M46K54J28J98j87j618
$$ 644289 638369 633049 628382 624165 620443 617600 615857 615037 614883 615195 615641 615895 616023 616221 616034 614416
59219F14416l555m864n296n696o638p668q029p665p085o759o801o984o928o471
$$ 614416 610861 605997 600701 595005 588367 580699 572670 565005 557920 551161 544360 537376 530448 523977
59205E23977n857n274m400k946j465r48j414j720j080r3K26o7p0O67J738K721
$$ 523977 518120 512846 508446 505500 504035 503087 501673 499953 498873 498780 499006 498939 498869 499536 501274 503995
59189E03995L659M638N432N890O223O633O915O841O779P408Q712R632R117P368
$$ 503995 507654 512292 517724 523614 529837 536470 543385 550226 557005 564413 573125 582757 591874 599242
59175E99242N619M714M330L764L033K708K929L165L059K991L532M581N478N941
$$ 599242 604861 609575 613905 617669 620702 623410 626339 629504 632563 635554 639086 643667 649145 655086
59161F55086O523P899R822J1125J0956R805Q960R047R477R296Q069N901L142M71
$$ 655086 661609 669508 679330 690455 701411 711216 720176 729223 738700 747996 756065 761966 765108 765579
59147G65579j298k035k646m128o443q712j0160j0480r674q291p445p810q681q762
$$ 765579 764281 762246 759600 755472 749029 740317 730157 719677 710003 701712 694267 686457 677776 669014
59133F69014p776o543n591m709l782l074k464j356K20J444J986K557L654M750
$$ 669014 661238 654695 649104 644395 640613 637539 635075 633719 633939 635383 637369 639926 643580 648330
59119F48330N367O063P520R366J0853J2029J3272J4160J4002J3167J2802J3254
$$ 648330 653697 659760 667280 676646 687499 699528 712800 726960 740962 754129 766931 780185
59107G80185J3707J3409J2374J0907R250P841P130O965O754O285N744M960L444
$$ 780185 793892 807301 819675 830582 839832 847673 854803 861768 868522 874807 880551 885511 888955
59094H88955J369l42j248j968l180m659n743o276o575o847p066p263p504p789
$$ 888955 890324 889982 888734 886766 883586 878927 873184 866908 860333 853486 846420 839157 831653 823864
59080H23864q122q599r282j0193j1446j3052j4545j5194j4821j4054j3613j3599
$$ 823864 815742 807143 797861 787668 776222 763170 748625 733431 718610 704556 690943 677344
59068F77344j3573j3021j1647r650p815o893o721o377n405m385l970l943l685
$$ 677344 663771 650750 639103 629453 621638 614745 608024 601647 596242 591857 587887 583944 580259
59055E80259l144k802k882l158l382l459l308k953k715k873l177l021k148r40
$$ 580259 577115 574313 571431 568273 564891 561432 558124 555171 552456 549583 546406 543385 541237 540297
59041E40297K4M72M91L33K77N61J229K037K551K557K396K685L464L988L709L192
$$ 540297 540321 540793 541284 541617 541894 542455 543684 545721 548272 550829 553225 555910 559374 563362 567071 570263
59025E70263L414M334M993N103N540O922Q560R549J0044J0712J1417J1497J0979
$$ 570263 573677 578011 583004 588107 593647 600569 609129 618678 628722 639434 650851 662348 673327
59012F73327J0481J0031Q871O619L829J272p70k282l205l525l319k595j450k70
$$ 673327 683808 693839 702710 709329 713158 714430 713660 711378 708173 704648 701329 698734 697284 697014
58998F97014O43J549K793M008M457M147L759L429K552J005l57r37j349k419l994
$$ 697014 697657 699206 701999 706007 710464 714611 718370 721799 724351 725356 724999 724062 722713 720294 716300
58983G16300n401o526p635q540q826q645q485q350p891p248o865o516n392l313
$$ 716300 710899 704373 696738 688198 679372 670727 662242 653892 646001 638753 631888 625372 619980 616667
58969F16667j130L52J233J968K587K924L178L723M598N499O109O211N780N192
$$ 616667 615537 615889 617122 619090 621677 624601 627779 631502 636100 641599 647708 653919 659699 664891
58955F64891N021N260N054L587J066j655m130o500q696j0169j0642j0607j0738
$$ 664891 669912 675172 680226 683813 684879 683224 679094 672594 663898 653729 643087 632480 621742
58942F21742j1006j0758r562p733o005m836m066l225k176j369j266j635j704j140
$$ 621742 610736 599978 590416 582683 576678 571842 567776 564551 562375 561006 559740 558105 556401 555261
58928E55261m85m44r95j605k039k461k834k797k276j714j447j284j024r40j314
$$ 555261 554776 554332 553337 551732 549693 547232 544398 541601 539325 537611 536164 534880 533856 532916 531602
58913E31602j779j687j024l97q6L07J161K301L396M377N212N695N894O393P622
$$ 531602 529823 528136 527112 526715 526629 526936 528097 530398 533794 538171 543383 549078 554972 561365 568987
58898E68987R218J0541J1580J2742J3915J4429J3996J3024J1837J0310Q602P605
$$ 568987 578205 588746 600326 613068 626983 641412 655408 668432 680269 690579 699181 706786
58886G06786Q099R794J1741J3407J4824J5939J6472J6422J6107J5582J4464J2522
$$ 706786 714885 724679 736420 749827 764651 780590 797062 813484 829591 845173 859637 872159
58874H72159J0078P630N374L188Q65j724m437o691p840p936p830q304r249r900
$$ 872159 882237 889867 895241 898429 899294 897570 893133 886442 878602 870666 862836 854532 845283 835383
58860H35383r797r292r199j0087j1813j3706j5222j6338j7195j7558j7072j6004
$$ 835383 825586 816294 807095 797008 785195 771489 756267 739929 722734 705176 688104 672100
58848F72100j5060j4402j3400j1722j0027r018q373p316n917n030n083n668o253
$$ 672100 657040 642638 629238 617516 607489 598471 590098 582782 576865 571835 566752 561084 554831
58835E54831o594o452n678m691m110l784k981j765j282k106l208l299k618k333
$$ 554831 548237 541785 536107 531416 527306 523522 520541 518776 517494 515388 512180 508881 506263 503930
58821E03930k650k610j735p91n84q57q88n10j0N52J270J813J645Q61K98N32J162
$$ 503930 501280 498670 496935 496144 495560 494703 493815 493305 493295 493847 495117 496930 498575 499436 499734 500266 501428
58804E01428J385J050P17Q65J433K161K847L097K434J043L1L04J417K134J960
$$ 501428 502813 503863 504580 505445 506878 509039 511886 514983 517417 518460 518491 518795 520212 522346 524306
58789E24306J419R64M84L0J28R61J973K815L980N844P759Q758Q839Q725Q766Q819
$$ 524306 525725 526689 527173 527203 527331 528292 530265 533080 537060 542904 550663 559421 568260 576985 585751 594570
58773E94570Q904R061Q743P274M867K426L20j787l801m977n048m798m991n409
$$ 594570 603474 612535 621278 628552 633419 635845 636165 634378 630577 625600 620552 615754 610763 605354
58759F05354n429n005m567m375m412m558m503l866k737j727j201q06j31O31J019
$$ 605354 599925 594920 590353 585978 581566 577008 572505 568639 565902 564175 562974 562168 562037 562668 563687
58744E63687R98Q79R28J351K320L605M565M913N118N694O487P146P793Q628R263
$$ 563687 564685 565564 566492 567843 570163 573768 578333 583246 588364 594058 600545 607691 615484 624112 633375
58729F33375R217Q805Q753R044Q959Q229P471P276P569P950Q170Q121P877P863
$$ 633375 642592 651397 660150 669194 678153 686382 693853 701129 708698 716648 724818 732939 740816 748679
58715G48679Q478R405R855R677R582J0005J0319R661Q120O531N277L782J248k370
$$ 748679 757157 766562 776417 786094 795676 805681 816000 825661 833781 840312 845589 849371 850619 848249
58701H48249o175r100j0918j2460j4664j7468j9999k1689k2706k3237k2992k1793
$$ 848249 842074 832974 822056 809596 794932 777464 757465 735776 713070 689833 666841 645048
58689F45048k0098j8478j6933j5196j3345j1627r934q089o502n853o103o407o134
$$ 645048 624950 606472 589539 574343 560998 549371 539437 531348 524846 518993 512890 506483 500349
58676E00349n450m669l653k251q62n6K51O67J479K358L000L589M420N388O168
$$ 500349 494899 490230 486577 484326 483464 483408 483659 484326 485805 488163 491163 494752 499172 504560 510728
58661E10728O720P287P922Q347Q236P421N794L377N74j932l737m958n711n736
$$ 510728 517448 524735 532657 541004 549240 556661 562455 565832 566406 564474 560737 555779 550068 544332
58647E44332m827l490k620k515k667k583k392k458k734k852k705k569k690l029
$$ 544332 539505 536015 533395 530880 528213 525630 523238 520780 518046 515194 512489 509920 507230 504201
58633E04201l440l846m165m168l621k575j375l77K71M89J17q38j860k226j754
$$ 504201 500761 496915 492750 488582 484961 482386 481011 480634 480905 481394 481511 480673 478813 476587 474833
58618D74833r51k09P05K112L702M914N723O482P137P333P327P902R037R439P993
$$ 474833 473882 473673 474378 476490 480192 485106 490829 497311 504448 511781 519108 527010 536047 545486 553479
58603E53479N226K699J263N60K5m09o43p80r38j031j014j016j036p21K23J556
$$ 553479 558705 561404 562667 563227 563252 562843 562200 561420 560482 559451 558437 557421 556385 555664 555887 557443
58587E57443K597K906K768K942L923N455O783P449P680Q013Q630R205R363R074
$$ 557443 560040 562946 565714 568656 572579 578034 584817 592266 599946 607959 616589 625794 635157 644231
58573F44231Q619Q184P645O772N737N239N862P413R254J1200J3576J6176J7991
$$ 644231 652850 661034 668679 675451 681188 686427 692289 699702 708956 720156 733732 749908 767899
58560G67899J8472J8564J9562K1234K2042K1243J9801J8842J8089J6462J3551
$$ 767899 786371 804935 824497 845731 867773 889016 908817 927659 945748 962210 975761
58549I75761R712N183J14m705q160j0098j1499j3017j4080j3949j3100j2720j3126
$$ 975761 985473 990656 990770 986065 977905 967807 956308 943291 929211 915262 902162 889442 876316
58536H76316j3573j3606j3772j4672j5984j6913j7200j7099j6685j5763j4390
$$ 876316 862743 849137 835365 820693 804709 787796 770596 753497 736812 721049 706659
58525G06659j2963j1677j0353q808p111n392l721k240j070j38N95P48k5j169j473
$$ 706659 693696 682019 671666 662858 655747 650355 646634 644394 643324 643186 643781 644529 644504 643335 641862
58510F41862n09P54J242J067R93J126J009P30R63J830K494K251J365N36Ml86o77
$$ 641862 641353 642107 643349 644416 645409 646535 647544 648274 649237 651067 653561 655812 657177 657713 657717 657331 656654
58493F56654p89q56j053j221r66j55R14J850K476K867L168L465L753M071M666
$$ 656654 655865 655009 653956 652735 651769 651614 652528 654378 656854 659721 662889 666354 670107 674178 678844
58478F78844N848P583R333J0529J1085J1402J1805J2212J2317J1924J0977R351
$$ 678844 684692 692275 701608 712137 723222 734624 746429 758641 770958 782882 793859 803210
58466H03210O841L464k69l547n757o808p033o862o580o210n544m377k749r26Q53
$$ 803210 810051 813515 813246 809699 803942 797134 790101 783239 776659 770449 764905 760528 757779 756853 757706
58451G57706K484L919N119O084O757O942O569N932N281M224K121p98l357m826
$$ 757706 760190 764109 769228 775312 782069 789011 795580 801512 806793 811017 813138 812340 808983 804157
58437H04157n671o452o687n707m115l231l192k780j226Q53K652M250N891P090
$$ 804157 798486 792034 785347 779640 775525 772294 769102 766322 765096 765949 768601 772851 778742 785832
58423G85832P309O974P077P991R316J0585J1485J1575J0539Q714O821N116L249
$$ 785832 793141 800115 807192 815183 824499 835084 846569 858144 868683 877397 884218 889334 892583
58410H92583J039j025k236k400k035j924k431l132l261k676k131k346l034l275
$$ 892583 893622 892597 890361 887961 885926 884002 881571 878439 875178 872502 870371 868025 864991 861716
58396H61716k643j529m18O60J850L041L957M421M437M120L670L226K801K336J860
$$ 861716 859073 857544 857126 857786 859636 862677 866634 871055 875492 879612 883282 886508 889309 891645 893505
58381H93505J446J157J117J456K009K345K394K712L732M940N457N317N478O396
$$ 893505 894951 896108 897225 898681 900690 903035 905429 908141 911873 916813 922270 927587 933065 939461
58367I39461P369P660P632Q139R185R977J0130J0127J0465J1042J1609J2307J3321
$$ 939461 946830 954490 962122 970261 979446 989423 999553 1009680 1020145 1031187 1042796 1055103 1068424
58354A068424J4299J4674J4449J4133J3877J3160J1577R576P998P150O685O325
$$ 1068424 1082723 1097397 1111846 1125979 1139856 1153016 1164593 1174169 1182167 1189317 1196002 1202327
58342A202327O270O792P869R289J0819J2065J2588J2458J2444J3194J4406J5227
$$ 1202327 1208597 1215389 1223258 1232547 1243366 1255431 1268019 1280477 1292921 1306115 1320521 1335748
58330A335748J5389J5466J5930J6464J6563J6376J6511J7082J7474J7156J6309
$$ 1335748 1351137 1366603 1382533 1398997 1415560 1431936 1448447 1465529 1483003 1500159 1516468
58319A516468J5439J4681J3852J3049J2684J2892J3249J3222J2681J1858J1184
$$ 1516468 1531907 1546588 1560440 1573489 1586173 1599065 1612314 1625536 1638217 1650075 1661259
58308A661259J1207J2278J4001J5450J6286J7214J8850K0633K1612K1926K2551
$$ 1661259 1672466 1684744 1698745 1714195 1730481 1747695 1766545 1787178 1808790 1830716 1853267
58297A853267K3678K4427K4305K3924K3942K4188K4403K4909K5915K6886K7436
$$ 1853267 1876945 1901372 1925677 1949601 1973543 1997731 2022134 2047043 2072958 2099844 2127280
58286B127280K8126K9602L1457L2858L3838L4944L6084L6810L7510L9113M1515
$$ 2127280 2155406 2185008 2216465 2249323 2283161 2318105 2354189 2390999 2428509 2467622 2509137
58275B509137M3528M4618M5676M7601N0026N2096N3721N5464N7653O0256O3343
$$ 2509137 2552665 2597283 2642959 2690560 2740586 2792682 2846403 2901867 2959520 3019776 3083119
58264C083119O6994P0936P4697P8099Q1296Q4469Q7661R0847R3913R6649R8857
$$ 3083119 3150113 3221049 3295746 3373845 3455141 3539610 3627271 3718118 3812031 3908680 4007537
58253D007537J00401J01147J01113J00748J00831J01991J04435J08106J12781
$$ 4007537 4107938 4209085 4310198 4410946 4511777 4613768 4718203 4826309 4939090
58244D939090J18041J23557J29483J36279J44071J52511J61459J71229J81963
$$ 4939090 5057131 5180688 5310171 5446450 5590521 5743032 5904491 6075720 6257683
58235F257683J93146K04260K15646K28209K42258K57156K72293K88019L05298
$$ 6257683 6450829 6655089 6870735 7098944 7341202 7598358 7870651 8158670 8463968
58226H463968L24653L45945L69200L95013M23731M54811M87769N23421N63241
$$ 8463968 8788621 9134566 9503766 9898779 10322510 10777321 11265090 11788511 12351752
58217A2351752O07524O55422P07140P64883Q31081R06824R92931J091380J204532
$$ 12351752 12959276 13614698 14321838 15086721 15917802 16824626 17817557 18908937 20113469
58208B0113469J333978J481771J652343J851952K087081K364958K695354L090671
$$ 20113469 21447447 22929218 24581561 26433513 28520594 30885552 33580906 36671577
58200C6671577L565271M136326M824494N652384O644446P830936R251036J0951653
$$ 36671577 40236848 44373174 49197668 54850052 61494498 69325434 78576470 89528123
58192H9528123J2988034J5422463J8293352K1543170K4958588K8192218L0831252
$$ 89528123 102516157 117938620 136231972 157775142 182733730 210925948 241757200
58185B41757200L2378101L2113046K9066902K2388777J2036948p36110j3631169
$$ 241757200 274135301 306248347 335315249 357704026 369740974 369004864 355373695
58178C55373695k4239240l1036544l3792440l3273741l0632462k6919817k2887787
$$ 355373695 331134455 300097911 266305471 233031730 202399268 175479451 152591664
58171A52591664j8988447j5438128j2288002r498548p015583m821135k929125
$$ 152591664 133603217 118165089 105877087 96378539 89362956 84541821 81612696
58164H1612696j342967n1768Q85936J254723P54267p40428k944514n215059o891904
$$ 81612696 80269729 80217961 81103897 82358620 83112887 82372459 79427945 74212886 67320982
58155F7320982p643406p545521o900763o013951n089263m237694l508941k910672
$$ 67320982 59677576 52132055 45231292 39217341 34128078 29890384 26381443 23470771
58147B3470771k426729k036869j724993j475913j273792j105905r64459q44589
$$ 23470771 21044042 19007173 17282180 15806267 14532475 13426570 12462111 11617522
58139A1617522p43275o59691n93368n41486m99671m65044m36683m13368l92561
$$ 11617522 10874247 10214556 9621188 9079702 8580031 8114987 7678304 7264936 6872375
58130F872375l71512l48236l21837k93145k64573k38137k13990j91729j72190
$$ 6872375 6500863 6152627 5830790 5537645 5273072 5034935 4820945 4629216 4457026
58121D457026j56700j45482j38228j35418j37154j41046j43202j41476j36457
$$ 4457026 4300326 4154844 4016616 3881198 3744044 3602998 3459796 3318320 3181863
58112C181863j29384j20764j11210j01944r3751q6390p9599p3727o8943o4681
$$ 3181863 3052479 2931715 2820505 2718561 2624810 2538420 2458821 2385094 2316151 2251470
58102B251470o0411n6408n3267n1189m9949m9162m8343m7215m6084m5402m4849
$$ 2251470 2191059 2134651 2081384 2030195 1980246 1931084 1882741 1835526 1789442 1744040 1699191
58091A699191m3435m0731l7416l4316l1478k8558k5680k3421k2159k1666k1305
$$ 1699191 1655756 1615025 1577609 1543293 1511815 1483257 1457577 1434156 1411997 1390331 1369026
58080A369026k0562j9581j9132j9816k1295k2639k3302k3403k3174k2718k2372
$$ 1369026 1348464 1328883 1309751 1289935 1268640 1246001 1222699 1199296 1176122 1153404 1131032
58069A131032k2576k3142k3084k1670j9315j7160j5898j5353j4955j4361j3585
$$ 1131032 1108456 1085314 1062230 1040560 1021245 1004085 988187 972834 957879 943518 929933
58058I29933j2795j2097j1596j1517j2076j3033j3623j3253j2189j1229j0772
$$ 929933 917138 905041 893445 881928 869852 856819 843196 829943 817754 806525 795753
58047G95753j0525j0085r446q781q153p549p027o623o273n920n549n122m653m392
$$ 795753 785228 775143 765697 756916 748763 741214 734187 727564 721291 715371 709822 704700 700047 695655
58033F95655m674n538o568p236p332p177p443q587j0235j1315j1050r748q400
$$ 695655 690981 685443 678875 671639 664307 657130 649687 641100 630865 619550 608500 598752 590352
58020E90352p634p372p285p200p038o753o367n851n042l944k980k575k649k895
$$ 590352 582718 575346 568061 560861 553823 547070 540703 534852 529810 525866 522886 520311 517662 514767
58006E14767l279l785l891l072j767j023j099j213q81n95p76r36n44L6K91N94
$$ 514767 511488 507703 503812 500740 498973 497950 496851 495638 494757 494162 493386 492450 491906 491942 492233 492827
57990D92827J522K549K563J570P98R50J372J314J039J037R39P4j279k151k227
$$ 492827 494349 496898 499461 501031 501829 502779 504151 505465 506504 507541 508480 508554 507275 505124 502897
57975E02897k112k201k085j374n04j93m95q59r23p77n10%P42J365J456R45J47
$$ 502897 500785 498584 496499 495125 494621 494428 493933 493074 492151 491374 490864 490864 491606 492971 494427 495372 495519
57958D95519m42n15k63l19j115k391l516m231m725n050n023m729m559m571m281
$$ 495519 495077 494562 494299 493980 492865 490474 486958 482727 478002 472952 467929 463200 458641 454070 449789
57943D49789l455k575k104j745j019j75J37j1K30J329K792L893M524N098N889
$$ 449789 446334 443759 441655 439910 438891 438716 438853 438842 439072 440401 443193 447086 451610 456708 462597
57928D62597O720P159O966O404O047O167O463O599O750P224P744P649O751N519
$$ 462597 469317 476476 483442 489846 495893 502060 508523 515122 521872 529096 536840 544489 551240 556759
57914E56759M398L393K361J200k60k154m234o048p521q877r991j0449j0364j0471
$$ 556759 561157 564550 566911 568111 567851 565697 561463 555415 547894 539017 529026 518577 508213 497742
57900D97742j1031j1351j0828r925r493r544r348q482p208n990n162m950n180
$$ 497742 486711 475360 464532 454607 445114 435570 426222 417740 410532 404542 399380 394430 389250
57887C89250n072l905k024o00k95n77n46M7Q70J633K278K711K883L019L419L954
$$ 389250 384178 380273 378249 377649 377354 376777 376231 376278 377148 378781 381059 383770 386653 389672 393091 397045
57871C97045M141L811L398L304L268K770J899J224P19n17k990n731p136o685n260
$$ 397045 401186 404997 408395 411699 414967 417737 419636 420860 421579 421062 418072 412341 405205 398520 393260
57856C93260l785k370r03L41J147J866K818L616L718L470L821N064O485P408Q079
$$ 393260 389475 387105 386202 386543 387690 389556 392374 395990 399708 403178 406999 412063 418548 425956 434035
57841D34035R089J0383J1245J1135J0100Q475O552M675L185K044P40j078l002
$$ 434035 443124 453507 464752 475887 485987 494462 501014 505689 508874 510918 511658 510580 507578
57828E07578m282m818n246n990o715p007p023o963o435n074l555k998l352l306
$$ 507578 503296 498478 493232 487242 480527 473520 466497 459534 453099 448025 444470 441472 438120 434814
57814D34814k026k09R97J399J549J793K168K738L336L300K271R68M25O20O05j04
$$ 434814 432788 432579 433576 434975 436524 438317 440485 443223 446559 449859 452130 453098 453523 454143 454748 454644
57798D54644j091k009l081m384n384n650n432n106m575l699k883k626k750k701
$$ 454644 453553 451544 448463 444079 438695 433045 427613 422507 417932 414233 411350 408724 405974 403273
57784D03273k435k397k684k832k522j934j257l89N56R65M35l71j99J425L583M887
$$ 403273 400838 398441 395757 392925 390403 388469 387212 386823 387379 388344 388779 388408 388209 389634 393217 398104
57768C98104M825M094L828M532N751O593O603O086N634N487N465N272M634L312
$$ 398104 402929 407023 410851 415383 421134 427727 434330 440416 446050 451537 457002 462274 466908 470220
57754D70220J412l82j261j148p48p34j198j933k710l162k919k288k221l128m202
$$ 470220 471632 471250 469989 468841 468093 467359 466161 464228 461518 458356 455437 453149 450928 447800 443598
57739D43598m421l820l148k698k267j976k158k502k224j186o8O64J195J640J749
$$ 443598 439177 435357 432209 429511 427244 425268 423110 420608 418384 417198 417130 417794 418989 420629 422378
57724D22378J587J665K065K218J948J883K330K551J850P04L0l0R9M08J115J856
$$ 422378 423965 425630 427695 429913 431861 433744 436074 438625 440475 441179 441209 441179 441278 441686 442801 444657
57708D44657J957J412Q39O23O20O29N35J39n46r94o90J75J069J910K886L686L778
$$ 444657 446614 448026 448865 449488 450108 450737 451272 451411 450865 449871 449181 449356 450425 452335 455221 458907 462685
57691D62685L334L102L319L436L015K243J467P50N6o13j229j475o77J434M038
$$ 462685 466019 469121 472440 475876 478891 481134 482601 483351 483407 482794 481565 480090 479413 480847 484885
57676D84885O058P538R359J1706J3917J5966J8895K3306K8483L3637L9123M5590
$$ 484885 490943 498481 507840 519546 533463 549429 568324 591630 620113 653750 692873 738463
57664G38463N2502N8307O1338N9674N0830L3253Q726j7437l9220n3077n8826n8327
$$ 738463 790965 849272 910610 970284 1021114 1054367 1063093 1045656 1006436 953359 894533 836206
57652H36206n3793m6996l9345l2040k5865k0926j6949j3761j1260r074o758m395
$$ 836206 782413 735417 696072 664032 638167 617241 600292 586531 575271 566197 559439 555044
57640E55044k527j346m36N05J252J628J986K715L649M319M512M230L477K450J580
$$ 555044 552517 551171 550735 551240 552492 554120 556106 558821 562470 566789 571301 575531 579008 581458 583038
57625E83038J076P02L52L47P64J056Q03M37N23Q00O34J22q0J70L95M09N52J002
$$ 583038 584114 584816 585168 585515 586279 587335 588138 588575 589098 589898 590532 590654 590574 590744 591139 591548 592100 593102
57607E93102J546K109K797L335L162K378J873K247L068L579L583L351L031K577
$$ 593102 594648 596757 599554 602889 606051 608429 610302 612549 615617 619196 622779 626130 629161 631738
57593F31738J969J240N26K22O96J656K234J988J451J265J271R34L47J68O32J264
$$ 631738 633707 634947 635473 635695 636391 638047 640281 642269 643720 644985 646256 647190 647537 647705 648337 649601
57577F49601J632J896K379K978L267L043K507J978J604J357J164J033J067J386
$$ 649601 651233 653129 655508 658486 661753 664796 667303 669281 670885 672242 673406 674439 675506 676892
57563F76892J958K529K745K503K080J848J884K027K315K989L988M766M964M932
$$ 676892 678850 681379 684124 686627 688707 690555 692439 694466 696781 699770 703758 708524 713488 718420
57549G18420N237N844O281O402O377O005M842L190K194K447L145L243K912L132
$$ 718420 723657 729501 735782 742184 748561 754566 759408 762598 764792 767239 770384 773627 776539 779671
57535G79671M090M898M864M357M175M686N707O767P255O806N825N211N315N551
$$ 779671 783761 788659 793523 797880 802055 806741 812448 819215 826470 833276 839101 844312 849627 855178
57521H55178N381N110N272N569N183M044L097L196M212N354N960N740M768L584
$$ 855178 860559 865669 870941 876510 881693 885737 888834 892030 896242 901596 907556 913296 918064 921648
57507I21648L062L702N101O352O893O751O150N294M554M402M933N660O012N976
$$ 921648 924710 928412 933513 939865 946758 953509 959659 964953 969507 973909 978842 984502 990514 996490
57493I96490N965O177O358O335O459P184Q264Q778Q178P022O405O708P300P403
$$ 996490 1002455 1008632 1014990 1021325 1027784 1034968 1043232 1052010 1060188 1067210 1073615 1080323 1087623 1095026
57479A095026O944O435O360O902P942R057R712R697R309Q855Q228P253O269N886
$$ 1095026 1101970 1108405 1114765 1121667 1129609 1138666 1148378 1158075 1167384 1176239 1184467 1191720 1197989 1203875
57465A203875O210O731P072P379P837Q215Q258Q261Q744R627J0137R739Q902Q605
$$ 1203875 1210085 1216816 1223888 1231267 1239104 1247319 1255577 1263838 1272582 1282209 1292346 1302085 1310987 1319592
57451A319592R168R884J0011R758R898J0547J0959J0660J0168J0192J0630J0957
$$ 1319592 1328760 1338644 1348655 1358413 1368311 1378858 1389817 1400477 1410645 1420837 1431467 1442424
57439A442424J1166J1569J1917J1622J0867J0575J1085J1683J1799J1824J2211
$$ 1442424 1453590 1465159 1477076 1488698 1499565 1510140 1521225 1532908 1544707 1556531 1568742
57428A568742J2607J2560J2466J2898J3467J3313J2466J1829J1892J2362J3017
$$ 1568742 1581349 1593909 1606375 1619273 1632740 1646053 1658519 1670348 1682240 1694602 1707619
57417A707619J3962J4886J5015J4208J3365J3285J3724J4046J4183J4408J4598
$$ 1707619 1721581 1736467 1751482 1765690 1779055 1792340 1806064 1820110 1834293 1848701 1863299
57406A863299J4454J4136J4037J4171J4299J4554J5283J6305J6993J7156J7292
$$ 1863299 1877753 1891889 1905926 1920097 1934396 1948950 1964233 1980538 1997531 2014687 2031979
57395B031979J7778J8272J8203J7533J6766J6470J6955J8118J9379K0066K0087
$$ 2031979 2049757 2068029 2086232 2103765 2120531 2137001 2153956 2172074 2191453 2211519 2231606
57384B231606K0033K0342K0690K0571K0264K0561K1556K2278K1844K0519J9315
$$ 2231606 2251639 2271981 2292671 2313242 2333506 2354067 2375623 2397901 2419745 2440264 2459579
57373B459579J8827J8840J8950J9057J9210J9334J9355J9424J9757K0255K0485
$$ 2459579 2478406 2497246 2516196 2535253 2554463 2573797 2593152 2612576 2632333 2652588 2673073
57362B673073K0150J9565J9447K0087K0874K0919K0231J9839K0547K1908K2867
$$ 2673073 2693223 2712788 2732235 2752322 2773196 2794115 2814346 2834185 2854732 2876640 2899507
57351B899507K3090K3124K3316K3374K3132K3098K3662K4300K4180K3403K2900
$$ 2899507 2922597 2945721 2969037 2992411 3015543 3038641 3062303 3086603 3110783 3134186 3157086
57340C157086K3143K3623K3793K3927K4594K5712K6659K7138K7342K7318K6818
$$ 3157086 3180229 3203852 3227645 3251572 3276166 3301878 3328537 3355675 3383017 3410335 3437153
57329C437153K5939K5435K5875K6831K7368K7227K7001K7182K7555K7727K7779
$$ 3437153 3463092 3488527 3514402 3541233 3568601 3595828 3622829 3650011 3677566 3705293 3733072
57318C733072K8049K8557K8970K8968K8418K7471K6664K6665K7526K8459K8698
$$ 3733072 3761121 3789678 3818648 3847616 3876034 3903505 3930169 3956834 3984360 4012819 4041517
57307D041517K8322K7872K7497K7090K6919K7399K8215K8533K8165K7829K8025
$$ 4041517 4069839 4097711 4125208 4152298 4179217 4206616 4234831 4263364 4291529 4319358 4347383
57296D347383K8403K8487K8380K8309K8142K7807K7646K7911K8310K8522K8611
$$ 4347383 4375786 4404273 4432653 4460962 4489104 4516911 4544557 4572468 4600778 4629300 4657911
57285D657911K8553K7974K6932K6378K6965K7930K8069K7445K7112K7420K7718
$$ 4657911 4686464 4714438 4741370 4767748 4794713 4822643 4850712 4878157 4905269 4932689 4960407
57274D960407K7765K8177K9088K9484K8580K7113K6426K6730K7058K6706K6014
$$ 4960407 4988172 5016349 5045437 5074921 5103501 5130614 5157040 5183770 5210828 5237534 5263548
57263E263548K5614K5512K5169K4303K3310K2800K2829K2848K2439K1896K1777
$$ 5263548 5289162 5314674 5339843 5364146 5387456 5410256 5433085 5455933 5478372 5500268 5522045
57252E522045K2124K2467K2486K2267K1978K1741K1787K2262K2762K2560K1474
$$ 5522045 5544169 5566636 5589122 5611389 5633367 5655108 5676895 5699157 5721919 5744479 5765953
57241E765953K0190J9502J9538J9770J9516J8355J6448J4493J3021J1789J0282
$$ 5765953 5786143 5805645 5825183 5844953 5864469 5882824 5899272 5913765 5926786 5938575 5948857
57230E948857Q789Q216Q674R071Q444O992N347L586J754O78J201K811M055M259
$$ 5948857 5957646 5965862 5974536 5983607 5992051 5999043 6004390 6007976 6009730 6010408 6011609 6014420 6018475 6022734
57216F022734M033L935L651K818J966J922K711L605M101M338M654N155N789O478
$$ 6022734 6026767 6030702 6034353 6037171 6039137 6041059 6043770 6047375 6051476 6055814 6060468 6065623 6071412 6077890
57202F077890O987O853N739L887K092J089R50J084Q09r5j351k573l644m723o026
$$ 6077890 6084877 6091730 6097469 6101356 6103448 6104537 6105487 6106571 6107380 6107285 6105934 6103361 6099717 6094994 6088968
57187F088968p626r447j1424j3494j5563j7581j9658k1898k4021k5501k6277k7060
$$ 6088968 6081342 6071895 6060471 6046977 6031414 6013833 5994175 5972277 5948256 5922755 5896478 5869418
57175E869418k8517l0379l1847l2784l3916l5753l7861l9433m0181m0314l9998
$$ 5869418 5840901 5810522 5778675 5745891 5711975 5676222 5638361 5598928 5558747 5518433 5478435
57164E478435l9240l8018l6268l3889l1040k8245k5932k3999k2043j9856j7483
$$ 5478435 5439195 5401177 5364909 5331020 5299980 5271735 5245803 5221804 5199761 5179905 5162422
57153E162422j5031j2720j0973j0161j0295j1165j2605j4453j6442j8490k0915
$$ 5162422 5147391 5134671 5123698 5113537 5103242 5092077 5079472 5065019 5048577 5030087 5009172
57142E009172k4076k7886l1928l5845l9264m1556m2142m1107l9112l6636l3595
$$ 5009172 4985096 4957210 4925282 4889437 4850173 4808617 4766475 4725368 4686256 4649620 4616025
57131D616025k9733k4979j9412j3200o853j313K515M335M548L901L128K862L741
$$ 4616025 4586292 4561313 4541901 4528701 4521848 4520535 4523050 4527385 4531933 4535834 4538962 4541824 4545565
57118D545565O459J1618J9411K9536M1386N4312O7682Q0924R3827J06886J21275
$$ 4545565 4552024 4563642 4583053 4612589 4653975 4708287 4775969 4856893 4950720 5057606 5178881
57107E178881J38473J59830J86311K18548K57176L03158L57802M22651M99750
$$ 5178881 5317354 5477184 5663495 5882043 6139219 6442377 6800179 7222830 7722580
57098G722580N92085P03522Q38067R99262J190023J412450J667164J952606K264690
$$ 7722580 8314665 9018187 9856254 10855516 12045539 13457989 15125153 17077759 19342449
57089A9342449K596678K939007L278974L600393L884339M112531M271685M352355
$$ 19342449 21939127 24878134 28157108 31757501 35641840 39754371 44026056 48378411
57081D8378411M338805M198822L889251L380202K678979J831547R01194n4469
$$ 48378411 52717216 56916038 60805289 64185491 66864470 68696017 69597211 69542742
57073F9542742r90671j869392k653635l308910l808841m139971m303881m316130
$$ 69542742 68552071 66682679 64029044 60720134 56911293 52771322 48467441 44151311
57065D4151311m201988l990933l712468l393963l059381k728190k414589k127143
$$ 44151311 39949323 35958390 32245922 28851959 25792578 23064388 20649799 18522656
57057A8522656j869039j639649j437073j259764j106139r73617q59035p59751
$$ 18522656 16653617 15013968 13576895 12317131 11210992 10237375 9378340 8618589
57049H618589o73873n99737n35860m81169m34482l93916l57580l24808k96010
$$ 8618589 7944716 7344979 6809119 6327950 5893468 5499552 5141972 4817164 4521154
57040D521154k71145k49094k28667k09508j91715j75234j60021j46268j34041
$$ 4521154 4250009 4000915 3772248 3562740 3371025 3195791 3035770 2889502 2755461
57031B755461j22973j12668j03048r4072q5539p7495p0417o4511n9067n3013m5950
$$ 2755461 2632488 2519820 2416772 2322700 2237161 2159666 2089249 2024738 1965671 1912658 1866708
57020A866708l8269l0360k2088j2946k341J0419K6324M6600P2080J02024J33936
$$ 1866708 1828439 1798079 1775991 1763045 1760704 1771123 1797447 1844047 1916127 2018151 2152087
57009B152087J65468J96253K25145K43483K33012J76032P1877n6413j73845k53660
$$ 2152087 2317555 2513808 2738953 2982436 3215448 3391480 3463357 3406944 3233099 2979439
56999B979439k88679k87477k63783k29361j92418j58045j28583j04354q4783o9122
$$ 2979439 2690760 2403283 2139500 1910139 1717721 1559676 1431093 1326739 1241956 1172834
56989A172834n6629m6663l8649l1826k5417j9218j3785r700p057n995p239j1249
$$ 1172834 1116205 1069542 1030893 999067 973650 954432 940647 930947 923890 917895 910656 899407
56977H99407j7040k2554k6353k8385k9102k8633k7059k4869k2593k0312j7865
$$ 899407 882367 859813 833460 805075 775973 747340 720281 695412 672819 652507 634642
56966F34642j5286j2695j0040p263m488j716J411N043Q593J1237J2890J4068J4642
$$ 634642 619356 606661 596621 589358 584870 583154 584565 589608 598201 609438 622328 636396 651038
56953F51038J3351Q994J915o084j3170j8450k1700k2833k2031k0081j7909j5722
$$ 651038 664389 673383 675298 669214 656044 637594 615894 593061 571030 550949 533040 517318
56941E17318j3002r528n960l064o69K124N754R702J3248J6269J9076K1743K3777
$$ 517318 504316 494788 488828 485764 485095 487219 492973 502675 515923 532192 551268 573011 596788
56928E96788K4247K2058J6407P426l491j4118k2398k7306k9111k8848k7386k4967
$$ 596788 621035 643093 659500 666926 663435 649317 626919 599613 570502 541654 514268 489301
56916D89301k1701j8249j5538j3821j2436j0809r225q346q258q375q071p129n718
$$ 489301 467600 449351 433813 419992 407556 396747 387522 379176 370918 362543 354472 347343 341625
56903C41625m188k835j681o06K20M89M44R41K342L833M496M735N820Q153J0775
$$ 341625 337437 334602 332921 332315 332535 333024 333468 334409 336751 340584 345080 349815 355635 363788 374563
56888C74563J2767J4304J6047J8098J9945K0886K0125J6927J1276M196k937r111
$$ 374563 387330 401634 417681 435779 455724 476610 496735 513662 524938 529134 526197 517086
56876E17086j3596j5641j4991j2529r689p146m429q88L322P401J0760J3665J7033
$$ 517086 503490 487849 472858 460329 450640 443494 439065 438177 441499 448900 459660 473325 490358
56863D90358K1598K7126L2564L7124M0931M4251M6238M4899L8481K6724J1013
$$ 490358 511956 539082 571646 608770 649701 693952 740190 785089 823570 850294 861307
56852H61307o123k1665l3025l8952l9746l6572l0803k3817j6799j0216l733L050
$$ 861307 855184 833519 800494 761542 721796 685224 654421 630604 613805 603589 599856 602906
56840F02906R957J6584K3082L0198L8517M7892N7553O6458P3357P6633P4256O4231
$$ 602906 612863 629447 652529 682727 721244 769136 826689 893147 966504 1043137 1117393 1181624
56828A181624M5670J9902r434l7533n9956p3751p8167p4958o7483n8708m9725
$$ 1181624 1227294 1247196 1237762 1200229 1140273 1066522 988355 913397 845914 787206 737481
56817G37481m0352l0646k1281j2614m257M167J2449K0307K7976L5786M3386M9639
$$ 737481 697129 666483 645202 632588 628331 632498 644947 665254 693230 729016 772402 822041
56805H22041N3136N2449M6275L3858J5641o356k8700m7353n9183o3433o1788n6818
$$ 822041 875177 927626 973901 1007759 1023400 1017044 988344 940991 881808 818375 756587 699769
56793F99769n0331m3081l5499k8072k1171j4910r271m119Q24N785J0760J5597
$$ 699769 649438 606357 570858 542786 521615 506705 497434 493315 494139 499924 510684 526281
56781E26281K0070K3691K5687K5431K2673J7106Q237l676j6710k8038l5753l9595
$$ 526281 546351 570042 595729 621160 643833 660939 669176 665500 648790 620752 584999 545404
56769E45404m0112l7904l3866k9360k5524k2534j9856j7028j4060j1345r360q246
$$ 545404 505292 467388 433522 404162 378638 356104 336248 319220 305160 293815 284455 276209
56757B76209p569o761n877n495n753n941n442m573m036l891l588k847j992j436
$$ 276209 268640 261879 256002 250507 244754 238813 233371 228798 224762 220871 217283 214436 212444 211008
56743B11008j283j424j633j620j318j081j199j325q76M3O13M33O3K05O95P83J69
$$ 211008 209725 208301 206668 205048 203730 202649 201450 200125 199249 199292 199905 200338 200401 200606 201301 202084 202253
56726B02253o86j203j264j109r63q87q11o44m24k97l49m26l16ML67O49P76O31
$$ 202253 201567 200364 199100 197991 197028 196141 195330 194686 194262 193965 193616 193190 192874 192878 193245 193894 194670 195301
56708A95301J62m12p40q15r75j310j344o64L99J056R75N16J23r3j09J01K76q9
$$ 195301 195463 195051 194311 193496 192521 191211 189867 189203 189602 190658 191633 192149 192272 192179 192070 192171 192447 192358
56690A92358r46j436q80J91N92lp51q50m53j34MK47N99P73P41Q18J081J110N76
$$ 192358 191412 189976 189096 189287 189879 189876 189125 188275 187822 187688 187692 187939 188538 189311 190052 190870 191951 193061 193637
56671A93637j76m60j63P1k64p91p77j85L03L38L46O77R61P57L26J07j07o61j066
$$ 193637 193461 193001 192838 192909 192645 191854 191077 190892 191195 191533 191879 192556 193517 194274 194600 194707 194600 193939 192873
56652A92873n03P02J220N31l75n41l36n72j157j462j476j671j997j896j186k26
$$ 192873 192370 193072 194292 194823 194448 193907 193571 192999 191842 190380 188904 187233 185236 183340 182154 181928
56636A81928O90J464J814J463P57M40P54J297J803K458L287L807L475K245O04
$$ 181928 182618 184082 185896 187359 188116 188556 189310 190607 192410 194868 198155 201962 205437 207682 208286
56621B08286o24o30O17J966K092J026J03K19Q20R23L89k71p68j099j109o72r6
$$ 208286 207662 207032 207649 209615 211707 212733 212836 213055 213875 214798 215187 214916 214148 213049 211940 211268 211172
56604B11172K27L28M31M04k6o76j095j297j687k254k386j730p55j95k13l61j78
$$ 211172 211399 211727 212158 212562 212536 211860 210765 209468 207781 205527 203141 201411 200656 200461 200248 199887 199709
56587A99709L61R02J040O76J17j78N9P96J730K323K061J099M12Q70K134K929K543
$$ 199709 200070 200972 202012 202688 202805 202627 202686 203482 205212 207535 209596 210695 211107 211977 214111 217040 219583
56570B19583J569J049J344K102K922L622M065M183M113M029L999M226N130O868
$$ 219583 221152 222201 223545 225647 228569 232191 236256 240439 244552 248581 252580 256806 261936 268804
56556B68804Q917J0536J1453J1632J0615P802L561n92l220m083l890l360k808
$$ 268804 277721 288257 299710 311342 321957 329759 333320 332728 329508 325425 321535 318175 315367
56543C15367k283j775j397j484k241l148l228k245j207j231k241l255l705l833
$$ 315367 313084 311309 309912 308428 306187 303039 299811 297566 296359 295128 292887 289632 285927 282094
56529B82094l952l957l668l193k807k760l088l333k683r92N51N02j027k416k531
$$ 282094 278142 274185 270517 267324 264517 261757 258669 255336 252653 251661 252212 252714 251687 249271 246740
56514B46740j922j692j960k079j796j451j327j367j436j402j118o99n83r22j173
$$ 246740 244818 243126 241166 239087 237291 235840 234513 233146 231710 230308 229190 228491 227908 226986 225813
56499B25813p65NL16r4o51p53l62J81N47N57L02J35K58L61j0p80j327j137k43
$$ 225813 225048 225053 225369 225275 224624 223871 223509 223690 224237 224794 225096 225231 225489 225850 225840 225060 223733 222596 222353
56480B22353Q72J603J571J008N72N68N12q5q98j231j000n78J4R59J809J804J087
$$ 222353 223225 224828 226399 227407 227979 228547 229059 228974 228076 226845 225845 225267 225281 226240 228049 229853 230940
56463B30940O92J043J398J168Q30J007J393J425J285J443J621J161J95l86k3J029
$$ 230940 231632 232675 234073 235241 236071 237078 238471 239896 241181 242624 244245 245406 245601 245215 245192 246221
56447B46221K203K972K893K046J330J618K567K992K492J915J948K028J212l06
$$ 246221 248424 251396 254289 256335 257665 259283 261850 264842 267334 269249 271197 273225 274437 274131
56433B74131j287r17K78J047O94l36j043q85k04L33M41J66m93j484k347k520k104
$$ 274131 272844 271927 272205 273252 273946 273610 272567 271682 271478 271811 272252 272418 271925 270441 268094 265574 263470
56416B63470j749j702j502q54k12q1k06j1M70P26N48J94j55m62n00o7M41L34k99
$$ 263470 261721 260019 258517 257663 257451 257370 257164 257153 257623 258349 258897 259091 258936 258474 257974 257907 258348 258682 258383
56397B58383n30R6Q31P78K28K11R65J561J088k98j691k372k258j730j259j044
$$ 258383 257853 257949 258780 259558 259786 259997 260962 262523 263611 263313 261622 259250 256992 255262 254003 252959
56381B52959r01n27N1N22Q11J245K121L236M107M516M630M646M491L968L070K096
$$ 252959 252058 251531 251582 252104 252915 254160 256281 259517 263624 268140 272770 277416 281907 285875 288945 291041
56365B91041J385R77O32K73J93O17J150J074K38o55q70n00k47m73p76m84N47J689
$$ 291041 292426 293403 294035 294308 294501 295118 296268 297342 297580 296925 296055 295555 295308 294835 294059 293575 294122 295811
56347B95811K085J506O35L41O97J018Q94P20J020J564J694J231O16K21J4o8K16
$$ 295811 297896 299402 300037 300378 301075 302093 302987 303707 304727 306291 307985 309216 309832 310053 310067 309999 310215
56330C10215J138K630M265N464N802N303M474L839L511L341L335L516L510K813
$$ 310215 311353 313983 318248 323712 329514 334817 339291 343130 346641 349982 353317 356833 360343 363156
56316C63156J579O17L53L08n7m34j74N46P98J89n88p42l85j47j33R5O09Q94P13
$$ 363156 364735 365352 365705 366013 365956 365522 365348 365894 366692 366881 366293 365551 365166 365019 364886 364981 365590 366484 367197
56297C67197O60J305K190K302J450N42K94L36m9p57j005m77K44M76K53J61O09
$$ 367197 367857 369162 371352 373654 375104 375646 375940 376276 376227 375470 374465 373988 374232 374708 374961 375122 375731
56280C75731J400J928J713Q21j26m40J25J222K238K712K647K396K246K128J902
$$ 375731 377131 379059 380772 381593 381467 381027 381152 382374 384612 387324 389971 392367 394613 396741 398643
56265C98643J783K108K667K808K391K165K779L769M070L356K399K137K792L883
$$ 398643 400426 402534 405201 408009 410400 412565 415344 419113 423183 426539 428938 431075 433867 437750
56251D37750M794N292N634O200P004P815Q754J0237J2086J3291J3201J2472J2246
$$ 437750 442544 447836 453470 459670 466674 474489 483243 493480 505566 518857 532058 544530 556776
56238E56776J2755J3433J4014J4646J5131J5023J4451J3939J3313J1736R065O292
$$ 556776 569531 582964 596978 611624 626755 641778 656229 670168 683481 695217 704282 710574
56226G10574M300K895J472k7j315k315l058l474l676m031m610m999m994m951n142
$$ 710574 714874 717769 719241 719214 717899 715584 712526 709052 705376 701345 696735 691736 686742 681791 676649
56211F76649n247m937m511m425m639m861n122n546n857n626m840l830k864k160
$$ 676649 671402 666465 661954 657529 652890 648029 642907 637361 631504 625878 621038 617208 614344 612184
56197F12184j979k259k417j974j231q66j012j160q79k14N34J092J267J088Q80
$$ 612184 610205 607946 605529 603555 602324 601458 600446 599286 598407 598193 598727 599819 601086 602174 603054
56182F03054J021J615K450L202L562L355K739K150J980K353L171M106M636M481
$$ 603054 604075 605690 608140 611342 614904 618259 620998 623148 625128 627481 630652 634758 639394 643875
56168F43875M057M056M503M676M159L440L227L677M501N413O165O616P029P822
$$ 643875 647932 651988 656491 661167 665326 668766 671993 675670 680171 685584 691749 698365 705394 713216
56154G13216Q831R403R479R895J1165J2646J3530J4006J4747J5761J6540J7038
$$ 713216 722047 731450 740929 750824 761989 774635 788165 802171 816918 832679 849219 866257
56142H66257J7695J8761K0240K2327K5223K8605L1925L5134L8624M2643M7345
$$ 866257 883952 902713 922953 945280 970503 999108 1031033 1066167 1104791 1147434 1194779
56131A194779N3360O1747P3173Q7377J03322J19564J34546J46767J54660J56496
$$ 1194779 1248139 1309886 1383059 1470436 1573758 1693322 1827868 1974635 2129295 2285791
56121B285791J51041J38621J21199J01337Q1645O5052N4104M8899M6372M2535
$$ 2285791 2436832 2575453 2696652 2797989 2879634 2944686 2998790 3047689 3094061 3136596
56111C136596L5172K4023R702o220k0738l0859l6025l8499m1600m8198o0142p7516
$$ 3136596 3171768 3195791 3205493 3199273 3178535 3147676 3111651 3073152 3031552 2983354 2923212 2845696
56099B845696r7951j17501j32542j40669j40625j32787j19676j04722q9988p5721
$$ 2845696 2747745 2630244 2497702 2357033 2216408 2083621 1963945 1859223 1769235 1693514
56089A693514o1923m9323l8596k9664k2160j5891j0591n952k050Q02K886M979
$$ 1693514 1631591 1582268 1543672 1514008 1491848 1475957 1465366 1459414 1457364 1458166 1461052 1466031
56077A466031P274R011R462Q815P840P209P238P860Q668R304R745J0126J0560
$$ 1466031 1473305 1482316 1491778 1500593 1508433 1515642 1522880 1530740 1539408 1548712 1558457 1568583 1579143
56064A579143J1437J3286J5844J7883J8788J9540K1193K3125K4077K4356K5336
$$ 1579143 1590580 1603866 1619710 1637593 1656381 1675921 1697114 1720239 1744316 1768672 1794008
56053A794008K7073K8205K8231K8163K8626K8919K8529K8095K8180K8379K8378
$$ 1794008 1821081 1849286 1877517 1905680 1934306 1963225 1991754 2019849 2048029 2076408 2104786
56042B104786K8784L0133L1983L3683L5275L7068L9055M1208M3516M5458M6325
$$ 2104786 2133570 2163703 2195686 2229369 2264644 2301712 2340767 2381975 2425491 2470949 2517274
56031B517274M6490M7375M9695N2650N5248N7520N9908O2481O5255O8434P1761
$$ 2517274 2563764 2611139 2660834 2713484 2768732 2826252 2886160 2948641 3013896 3082330 3154091
56020C154091P4465P6324P8020Q0076Q2365Q4984Q8454R2633R6458R9392J02127
$$ 3154091 3228556 3304880 3382900 3462976 3545341 3630325 3718779 3811412 3907870 4007262 4109389
56009D109389J05451J09365J13845J19258J25476J31605J37185J42706J48520
$$ 4109389 4214840 4324205 4438050 4557308 4682784 4814389 4951574 5094280 5242800
56000E242800J54442J60796J68592J78026J88128J98420K09622K22120K35223
$$ 5242800 5397242 5558038 5726630 5904656 6092784 6291204 6500826 6722946 6958169
55991F958169K48749K63769K80827K98862L16857L35337L55332L77183M01271
$$ 6958169 7206918 7470687 7751514 8050376 8367233 8702570 9057902 9435085 9836356
55982I836356M28423M58798M91718N27389N67236O11946O61047P15155P76419
$$ 9836356 10264779 10723577 11215295 11742684 12309920 12921866 13582913 14298068 15074487
55973A5074487Q45919R23211J009604J109095J224615J356410J506190J679852
$$ 15074487 15920406 16843617 17853221 18962316 20186931 21543341 23049531 24729383
55965B4729383J884099K123933K406422K743778L149842L637355M222448M927969
$$ 24729383 26613482 28737415 31143837 33887615 37037457 40674812 44897260 49825229
55957D9825229N778705O798272Q016252R474234J1221187J3311492J5809769J8766571
$$ 49825229 55603934 62402206 70418458 79892692 91113879 104425371 120235140 139001711
55949A39001711K2141307K5731640K9193284L2112927L3982809L4044474L1247609
$$ 139001711 161143018 186874658 216067942 248180869 282163678 316208152 347455761
55942C47455761K4626428J4025660O40936j3175960k4846557l2625669l6112998
$$ 347455761 372082189 386107849 386748785 373572825 348726268 316100599 279987601
55935B79987601l6023394l3561421k9875492k5810039k1887189j8373312j5358499
$$ 279987601 243964207 210402786 180527294 154717255 132830066 114456754 99098255
55928I9098255j2833752j0750273r047328p660020o526563n596165m828646m189357
$$ 99098255 86264503 75514230 66466902 58806882 52280319 46684154 41855508 37666151
55920C7666151l649600l190312k799780k467022k180531j932268j718095j533505
$$ 37666151 34016551 30826239 28026459 25559437 23378906 21446638 19728543 18195038
55912A8195038j372265j229761j104393r94634q97431q10411p33236o65553o05580
$$ 18195038 16822773 15593012 14488619 13493985 12596554 11786143 11052907 10387354 9781774
55903I781774n51792n04354m63664m28655l97494l69049l43007l19252k97597
$$ 9781774 9229982 8725628 8261964 7833309 7435815 7066766 6723759 6404507 6106910
55894F106910k77583k58467k39949k22641k06992j92159j77071j62187j48740
$$ 6106910 5829327 5570860 5330911 5108270 4901278 4709119 4532048 4369861 4221121
55885D221121j36463j23625j09366r4541p9932o5042m9050l1783j3387N856K4906
$$ 4221121 4084658 3961033 3851667 3757126 3677194 3612152 3563102 3531319 3517932 3523788 3548694
55874C548694M1902N4959O2214O1290N0099K8728j73l2935o5939r5542j18672
$$ 3548694 3590596 3645555 3707769 3769059 3819158 3847886 3847713 3814778 3748839 3653297 3534625
55863C534625j34482j44647j51543j56499j59570j59835j55759j46453j33202
$$ 3534625 3400143 3255496 3103953 2947454 2787884 2628049 2472290 2325837 2192635
55854B192635j18977j06099r4977q5152p6434o8705o1685n5469n0565m7043m4293
$$ 2192635 2073658 1967559 1872582 1787430 1710996 1642291 1580606 1525137 1474572 1427529 1383236
55843A383236m1861l9758l7751l5307l2557l0396k9144k8041k6437k4730k3502
$$ 1383236 1341375 1301617 1263866 1228559 1196002 1165606 1136462 1108421 1081984 1057254 1033752
55832A033752k2542k1382k0168j9344j8821j8042j6620j4691j2876j1969j2251
$$ 1033752 1011210 989828 969660 950316 931495 913453 896833 882142 869266 857297 845046
55821H45046j3121j3848j4491j5438j6278j6166j5199j4376j4053j3587j2632
$$ 845046 831925 818077 803586 788148 771870 755704 740505 726129 712076 698489 685857
55810F85857j1599j0491q630o086m150l610l612l013j857p61K42J297K053K317
$$ 685857 674258 663767 655137 649051 644901 641291 637679 634666 632809 632048 632290 633587 635640 637957
55796F37957K677L524M163L880L165K901K989K866K768L190L537K615L60k073
$$ 637957 640634 644158 648321 652201 655366 658267 661256 664122 666890 670080 673617 676232 676592 674519
55782F74519l890n275o468p278p751q505j0204j3167j7249k1437k3875k3345k0751
$$ 674519 670629 665354 658886 651608 643857 635352 625148 611981 594732 573295 549420 526075 505324
55769E05324j8104j6051j3489r724n795l093j769j225j358k316l542m086l829
$$ 505324 487220 471169 457680 447956 442161 439068 437299 436074 434716 432400 428858 424772 420943
55756D20943l532l721m143m460m803n343n762n666n308n373n994o463o224n776
$$ 420943 417411 413690 409547 405087 400284 394941 389179 383513 378205 372832 366838 360375 354151 348375
55742C48375o131p411q555q533p486o374n767n344m430k785r02L48M56k69j095
$$ 348375 342244 334833 326278 317745 310259 303885 298118 292774 288344 285559 284657 285005 285461 285192 284097
55727B84097j734k518l648m706n208n270n361n584n634n299m558l376j826m17
$$ 284097 282363 279845 276197 271491 266283 261013 255652 250068 244434 239135 234577 231201 229375 228958
55713B28958K08Pl45k50K29O60R14J256J894K684L298L494L143K124M16j667l570
$$ 228958 229166 229173 228828 228578 228807 229467 230381 231637 233531 236215 239513 243007 246150 248274 248690 247023 243453
55696B43453m990o067o926p275o805n780m812m131l504k850k384k090j606q09
$$ 243453 238463 232396 225470 218195 211390 205610 200798 196667 193163 190313 187929 185839 184233 183424
55682A83424p7L27O95J388K267K857K853K241J200R5p92j591k580l545l908l682
$$ 183424 183347 183674 184369 185757 188024 190881 193734 195975 197175 197270 196478 194887 192307 188762 184854 181172
55666A81172l593l977m167l445k119j041n29k27K42J029K066K920K976K336J989
$$ 181172 177579 173602 169435 165990 163871 162830 162301 162074 162316 163345 165411 168331 171307 173643 175632
55651A75632K647L783M443M549M632M731M461L875L407L034K354J449Q68P37O05
$$ 175632 178279 182062 186505 191054 195686 200417 204878 208753 212160 215194 217548 218997 219865 220602 221207
55636B21207J25p40k120m005n715o458o435o541o906o773n929n199n027m694l608
$$ 221207 221332 220592 218472 214467 208752 202294 195859 189318 182412 175639 169710 164511 159484 154790 151182
55621A51182k454k170k435k131j027o3k6o68j191j140o51k15l05j009j922k479
$$ 151182 148728 146558 144123 141992 140965 140902 140876 140208 139017 137877 137226 137011 136706 135697 133775 131296
55605A31296k449k121k023k396k805k486j333k52j29o32o89m0N03M18K02L57M66
$$ 131296 128847 126726 124703 122307 119502 117016 115683 115431 115302 114670 113981 113941 114444 114862 115064 115421 115887
55588A15887m4q42j138q00l77j86l3K58N86Q39J017J111J107J073J029Q94Q65
$$ 115887 115843 115001 113863 113063 112686 112500 112467 112725 113311 114150 115167 116278 117385 118458 119487 120381 121246
55571A21246J493L043M939O246O571O221N691N366N454N710N363L846J546n83
$$ 121246 122739 125782 130721 136967 143538 149759 155450 160816 166270 171980 177343 181189 182735 182152
55557A82152k163l668n465p088p777p460o907o781o852o340n058l846l536l780
$$ 182152 179989 176321 170856 163768 155991 148531 141624 134843 127991 121651 116593 112747 109211 105431
55543A05431l553k677k027k023j886r43J48L55j63m16j35N7j27k65j51j38l87
$$ 105431 101878 99201 97174 95151 93265 92322 92470 92825 92662 92246 92111 92168 92041 91776 91625 91487 91100
55526I1100o27q04j171j607j591j144r68j336j589j199n86l22k13K93J237K279
$$ 91100 90473 89669 88498 86891 85300 84156 83188 81852 80263 79064 78478 78156 77943 78236 79473 81752
55510H1752L238L969M159L764L228K821K215J238M75M16M90j55j306j987j934
$$ 81752 84990 88959 93118 96882 100110 102931 105146 106384 106859 107275 107765 107610 106304 104317 102383
55495A02383j781j912k030j960j972k086j920j422j055r71p46k58k1k33k30N28
$$ 102383 100602 98690 96660 94700 92728 90642 88722 87300 86245 85274 84528 84270 84249 84016 83786 84314
55479H4314J520J899J665J394J182O90j3m13m25n25r05j108p55j50J99K40K70
$$ 84314 85834 87733 89398 90792 91974 92664 92651 92238 91813 91288 90383 89275 88520 88370 88569 88809 89079
55462H9079L51K58j29o48j086j326j243p26M3N10K44n17j037q66k51L06N38L31
$$ 89079 89430 89688 89559 88911 87825 86499 85256 84530 84573 85083 85327 84810 83773 82907 82656 82962 83500 83831
55444H3831l78j220j295j40J367J861J150K64j83o55j375j511n03O99Q20J23q3
$$ 83831 83453 82233 80938 80798 82165 84026 85176 85440 85257 84602 83227 81716 81213 81912 82732 82855 82772
55427H2772N21R98Q61P88J258J621J074j56j213j595j303n30L17O57L78P9K90
$$ 82772 83293 84291 85152 85940 87198 88819 89893 89737 88524 86929 85626 85096 85413 86070 86448 86527 86817
55410H6817P92J053R93Q88Q63R08J070J202Q29k94j662k535k727k519k063j335
$$ 86817 87609 88662 89655 90543 91406 92314 93384 94586 95415 95121 93459 90924 88197 85678 83615 82280
55394H2280m88K13O53P59L92k22l79K25Q70P13M1j79K09M94L91L98O12L67n59
$$ 82280 81792 82005 82658 83417 83809 83587 83208 83433 84303 85016 85057 84878 85087 85581 85972 86370 86982 87349 86790
55375H6790j289j092n26n59j152j498j253p59k14M56J020R53J99o95j209j272
$$ 86790 85501 84409 83883 83324 82172 80674 79421 78662 78448 78904 79924 80877 81076 80381 79172 77900
55359G7900r47k64N77J204J480J571J578J387R53M10j16n09n31j05L72N03O47
$$ 77900 76953 76689 77266 78470 79950 81521 83099 84486 85439 85849 85733 85224 84693 84588 84960 85463 86110
55342H6110J481K677K882J496l05j035p78o96j137j352j009p57j026j271r76m89
$$ 86110 87591 90268 93150 94646 94341 93306 92528 91832 90695 89343 88334 87577 86551 85280 84304 83815
55326H3815l12k45J4J03l14o11%R96J035q2j022p41K53R69J254J447J432R04J65
$$ 83815 83503 83258 83272 83375 83061 82450 82450 83446 84481 84399 83377 82636 82889 83858 85112 86559 87991 88895 89060
55307H9060j72q9q4l23n05m91m74n38n83o75r65j240j058m30P4L5m39j049j545
$$ 89060 88888 88799 88715 88392 87887 87396 86922 86384 85801 85126 84161 82921 81863 81433 81507 81542 81103 80054 78509
55288G8509j607j024j63K33pk56j5M91R02J346J926K169J615P24M06P81J036N89
$$ 78509 76902 75878 75715 75948 75941 75685 75670 76161 77063 78409 80335 82504 84119 84843 85249 86030 87066 87655
55270H7655k00o31n25k47j97m33o04k22P52J601J434K20j102j591j172m40L1O0
$$ 87655 87455 86824 86299 86052 85855 85422 84818 84596 85348 86949 88383 88603 87501 85910 84738 84298 84329 84389
55252H4389j82k90N3P05J164J135P81L32j65n64m69J73P06M73k42n52k07J07j75
$$ 84389 84207 83917 83970 84675 85839 86974 87755 88087 87922 87358 86889 87062 87768 88241 87999 87447 87240 87347 87172
55233H7172p02p71l16Q5pm70q46p42q6P55J165Q24J00k92n1M81P68O06J58l20
$$ 87172 86470 85699 85383 85468 85461 84991 84145 83403 83317 84072 85237 86061 86161 85869 85818 86299 87067 87673 87831 87511
55213H7511o16n94j82M87J057J165P94L31J87L50N01N15N86P76P95M47%j41K3
$$ 87511 86895 86301 86119 86606 87663 88828 89622 89953 90140 90490 90991 91506 92092 92868 93663 94110 94110 93969 93992
55194I3992J43L4j74l10l64m00n45q58j040n46O40J568J283R2p90q61q00j148
$$ 93992 94135 94169 93995 93685 93321 92921 92376 91518 90478 89932 90572 92140 93423 93515 92725 91864 91064 89916
55176H9916j347o78M96J210J199J030J054R91N40j31o63q30n38J22O93O53Q3k88
$$ 89916 88569 87891 88387 89597 90796 91826 92880 93871 94411 94280 93617 92787 92249 92371 93064 93717 93800 93512
55158I3512R3R24J432J298R35P72O24L2q66j280p55J09M04J03j45k07o50j552
$$ 93512 93605 94529 95961 97259 98194 98966 99590 99622 98756 97476 96721 96830 97234 97337 97192 96985 96335 94783
55140I4783k062j620q31n15m99j47M92R09J078J210R33k07j551j815q43J74M19
$$ 94783 92721 91101 90270 89755 89256 89109 89601 90510 91588 92798 93731 93524 91973 90158 89315 89489 89908
55123H9908L21M06L83l8l63j23K45J29j71J17J020J756J667P25o17j569j340L4
$$ 89908 90229 90635 91018 90980 90617 90494 90739 90868 90697 90814 91834 93590 95257 95982 95365 93796 92456 92490
55105I2490J410J696J085N79N58N32K02n6J11M80O86P13O57M10q4m90l47L51J029
$$ 92490 93900 95596 96681 97260 97818 98350 98552 98496 98607 99087 99773 100486 101143 101553 101469 100979 100632 100983 102012
55086A02012J082M63k64n06j90L04O28O58L00m93j401j813j507r58o88o07k72
$$ 102012 103094 103557 103293 102787 102597 102901 103529 104187 104487 103994 102593 100780 99273 98315 97627 97020 96748
55069I6748L64R04J039Q63O63N87M97N4q51j737j976j606j322j395j248l93O63
$$ 96748 97112 98016 99055 99918 100581 101168 101665 101719 100868 99131 97155 95549 94227 92832 91584 91191 91854
55052I1854J075P74L52J46O2O6J76J68j18l17k0M60N40L55N20R46R28M13K89R81
$$ 91854 92929 93703 94055 94201 94263 94329 94505 94673 94555 94238 94218 94678 95218 95573 96093 97039 97967 98380 98669 99650
55032I9650J696J542P35O5k62n99r87r93l16P72J652J744R27k85j085j110o98
$$ 99650 101346 102888 103623 103688 103426 102827 101840 100847 100531 101303 102955 104699 105626 105341 104256 103146 102448
55015A02448l98m42p10q81n97J08N61J05r43j478r62jN82O69N31K53n4m6L60O47
$$ 102448 102050 101608 100898 100017 99420 99528 100089 100194 99251 97773 96811 96810 97392 98061 98592 98845 98791 98745 99105 99752
54995I9752M36J10J66L73K59L8K84Q64J018M87j08j26M16J094J522J441Q44J34
$$ 99752 100188 100298 100464 100837 101096 101134 101418 102282 103300 103787 103679 103553 103969 105063 106585 108026 108870 109004
54977A09004k20k40l17n33n64k79L6J76L16N94Q41Q70P23M41J5k82M1R75J699
$$ 109004 108784 108544 108227 107694 107130 106851 106887 107063 107379 107973 108814 109684 110407 110848 110863 110581 110622 111597 113296
54958A13296J426L98l73k35M61R25Q28N88P91J376J549O97o59j234m99N73O50
$$ 113296 114722 115120 114747 114512 114973 115898 116726 117314 118105 119481 121030 121727 121068 119834 119335 119908 120558
54941A20558l02j072q12l7K34j61n65n80m84n28l89K58J023J203Q11O20J091J728
$$ 120558 120256 119184 118372 118335 118569 118408 117843 117263 116779 116251 115862 116120 117143 118346 119157 119777 120868 122596
54923A22596J708R04Rj75O29J982L061L413L499M193N528O473O263N476N164N314
$$ 122596 124304 125208 125217 125042 125671 127653 130714 134127 137626 141819 147347 153820 160083 165559 170723 176037
54907A76037M986L752K091L86j570l733n368n944n918o002o121n732m812l922
$$ 176037 181023 184775 186866 187252 185682 181949 176581 170637 164719 158717 152596 146864 142052 138130
54893A38130l430l200l009k720k172j325n01j06j03q5J81O35J212J823K113J815
$$ 138130 134700 131500 128491 125771 123599 122274 121773 121667 121564 121479 121660 122295 123507 125330 127443 129258
54877A29258J346J444K165K770K909L179M108N161N493N268N417O175O665O089
$$ 129258 130604 132048 134213 136983 139892 143071 147179 152340 157833 163101 168518 174693 181358 187447
54863A87447M617K788O73j841m298n902o402o297o128n980n698n249m691m111
$$ 187447 192064 194852 195525 193684 189386 183484 177082 170785 164657 158677 152979 147730 143039 138928
54849A38928l678l587l756l765l293k478j734j350j338j483j439r96m11k76p75
$$ 138928 135250 131663 127907 124142 120849 118371 116637 115287 113949 112466 111027 110031 109620 109344 108569
54834A08569j306j203n92j05Q9M22J009J253O87k42p08n04j43n9j82k32j00J18
$$ 108569 107263 106060 105468 105363 105452 105874 106883 108136 108823 108581 107873 107369 107226 107167 106985 106753 106653 106771
54816A06771K11L7k71l24qJ96j36n12L3J460K328J412o09j773j106L52R40K71
$$ 106771 106982 107019 106748 106424 106416 106612 106476 105964 105997 107457 109785 111197 110588 108815 107709 108061 109001 109272
54798A09272o40p71p6Q75J652K091K015J313L55j18K47Q94R36K21m99n16n2J37
$$ 109272 108632 107861 107785 108660 110312 112403 114418 115731 116086 115968 116215 117109 118045 118266 117767 117251 117199 117336
54780A17336j80m11M4R91J686J680J160N88K38J86M65J013J570J825J711J513
$$ 117336 117156 116745 116789 117780 119466 121146 122306 122894 123132 123318 123783 124796 126366 128191 129902 131415
54764A31415J636K245L085L697L932M185M937O020O656O384N684N259M921L766
$$ 131415 133051 135296 138381 142078 146010 150195 155132 161152 167808 174192 179876 185135 190056 193822
54750A93822J476j114l028m258n387o514p044o555n322l946k824k064j590j215
$$ 193822 195298 194184 191156 186898 181511 174997 167953 161398 156076 152130 149306 147242 145652 144437
54736A44437q29o00p60j148j347j264j243j396j263m71O05J190J012N15L08O95
$$ 144437 143608 143008 142248 141100 139753 138489 137246 135850 134587 134116 134721 135911 136923 137438 137746 138441
54720A38441J581K482K793K364J824J966K883L972M714N087N210N039M414L145
$$ 138441 140022 142504 145297 147661 149485 151451 154334 158306 163020 168107 173317 178356 182770 185915
54706A85915J076j513l685m602m561m687n434o060n868n204m649l976k711j301
$$ 185915 186991 185478 181793 177191 172630 167943 162509 156449 150581 145377 140728 136752 134041 132740
54692A32740o95r54j180q95n87p34j068j117q49m20R7M36J58o35j190j152j125
$$ 132740 132045 131091 129911 129016 128429 127695 126627 125510 124661 124241 124338 124774 124932 124297 123107 121955 120830
54675A20830j623k020j405n7Q37Q44P54J289K069K227J419Oj373k107j932j172
$$ 120830 119207 117187 115782 115725 116562 117406 118160 119449 121518 123745 125164 125170 123797 121690 119758 118586
54659A18586m11J72P28J040N61o18j480j259m06J55K07J29K4k00k20L57J064Q89
$$ 118586 118175 118347 119075 120115 120676 120058 118578 117319 116913 117068 117275 117404 117428 117228 117008 117365 118429 119318
54641A19318k38j115p67L67J182J229Q03K19l07l45M02J458J847J203J82l57k16
$$ 119318 119080 117965 117198 117565 118747 119976 120779 120998 120691 120346 120748 122206 124053 125256 125438 125081 124865
54624A24865J93M59M68K83k8m28q38j055q87m95m02q92j501j444o41J09J06l48
$$ 124865 125058 125517 125985 126268 126240 125812 124974 123919 123032 122537 122135 121243 119742 118298 117657 117766 117872 117524
54606A17524m08K43J064J387J125P22N82P29R12Q71N35J1m94p69o54j28O35J338
$$ 117524 117116 117359 118423 119810 120935 121657 122239 122968 123880 124751 125286 125297 124803 124034 123380 123252 123887 125225
54588A25225J733J745J442R71M38j03n59o78k35N81J116Q24q0p98p86k35L18O39
$$ 125225 126958 128703 130145 131116 131554 131451 130892 130214 129979 130560 131676 132500 132420 131622 130836 130601 130919 131558
54570A31558R30J430K027K272J785P49p2jQ29J616J735J246N91J23J7K28L68m5
$$ 131558 132488 133918 135945 138217 140002 140751 140679 140678 141507 143123 144858 146104 146695 146818 146835 147063 147431 147386
54552A47386r17j470j141k71M28Q46J296J645J354M68j32J56P99Q75L65J36P13
$$ 147386 146469 144999 143858 143587 144015 144861 146157 147802 149156 149624 149492 149648 150447 151322 151687 151823 152536
54535A52536J625K112K079J983K026J968J766J859K438K814K186R12K65O70R55
$$ 152536 154161 156273 158352 160335 162361 164329 166095 167954 170392 173206 175392 176304 176569 177239 178194
54520A78194j9j596k085j030K38M22k90r61j222j268j108o74l92q36j723j987
$$ 178194 178175 176579 174494 173464 173702 174124 173834 172873 171651 170383 169275 168601 168209 167373 165650 163663
54504A63663j094J97P14K05o27j127j274j272j050m73K62P64R41J019J073R22
$$ 163663 162569 162766 163480 163685 163058 161931 160657 159385 158335 157862 158124 158888 159829 160848 161921 162843
54488A62843N98N43J037J643J585N94q07j763j683n68R59K062K456K608K986L326
$$ 162843 163441 163984 165021 166664 168249 168843 168036 166273 164590 164022 164981 167043 169499 172107 175093 178419
54472A78419L057K227J472J188J250J517K032K629K971L108L334L461K889J666
$$ 178419 181476 183703 185175 186363 187613 189130 191162 193791 196762 199870 203204 206665 209554 211220
54458B11220P25O12P44M43J6P4L54J31n11p71l89P0J96K42M79P32P95P45N92M4
$$ 211220 211945 212557 213301 213744 213760 213834 214188 214319 213808 213037 212648 212718 212914 213156 213635 214367 215162 215907 216499 216543
54438B16543j016k162k798k751k371k206k551l073l014k066r58o51j069j213o53
$$ 216543 215527 213365 210567 207816 205445 203239 200688 197615 194601 192535 191577 190926 189857 188644 187991
54423A87991j22l46r28r43k23N54Q55P66N68L23M7r9M3L85O08L83k58q05o35K82
$$ 187991 187869 187523 186595 185652 185429 185983 186838 187604 188172 188495 188542 188443 188486 188871 189479 189862 189604 188799 188164 188446
54403A88446J247J558J245Q59O83N25K35L3J58M46N11K37q4r3L10R35J441J514
$$ 188446 189693 191251 192496 193355 194038 194563 194798 194831 194989 195435 195946 196183 196099 196006 196316 197251 198692 200206
54385B00206J118O20N15Q46J025M95m62r25n24j09q38k745m535m923l887k458
$$ 200206 201324 201944 202459 203305 204330 204825 204363 203438 202914 202805 201967 199222 194687 189764 185877 183419
54369A83419j538j142p20O2J035J828K223K180J760J164P22N69M01j75j027j533
$$ 183419 181881 180739 180019 180081 181116 182944 185167 187347 189107 190271 190993 191562 191963 191788 190761 189228
54353A89228j298n65J56N87O52L40k29q26j366j896k225k009j375r88j200j616
$$ 189228 187930 187365 187521 188108 188760 189100 188871 188045 186679 184783 182558 180549 179174 178186 176986 175370
54337A75370j889k256k812k886k034j095j160j825j695n49K88k2o96p32k79J07
$$ 175370 173481 171225 168413 165527 163493 162398 161238 159413 157718 157169 157457 157435 156739 156007 155728 155835
54321A55835N65J319J710R65m38j169p37Q5M60M10L85N29O25M58L1l77m19o2K98
$$ 155835 156400 157719 159429 160394 159956 158787 158050 158135 158595 159005 159390 159919 160544 161002 161033 160656 160237 160175 160473
54302A60473K67j01m22m11o7L71N05J33m31o63n65n97p82n41K54P40J74r30j515
$$ 160473 160740 160639 160217 159806 159739 160110 160615 160748 160317 159654 159089 158492 157710 157169 157423 158163 158337 157407 155892
54283A55892j373j119j076j022q65p81p31n50m54p57j178j083m85KJ83M47Q13
$$ 155892 154519 153400 152324 151302 150437 149656 148925 148375 147921 147164 145986 144903 144418 144420 144603 145050 145863
54266A45863O67k31j177j443j075m47M16J502K275K157J292L87n2j2L35P76J028
$$ 145863 146530 146299 145122 143679 142604 142157 142573 144075 146350 148507 149799 150186 150134 150122 150457 151233 152261
54249A52261Q76L67l22j044j590j646j085k20M06M48l1o17q19n51k83m71q31o47
$$ 152261 153137 153504 153182 152138 150548 148902 147817 147597 148003 148451 148420 147803 146984 146433 146150 145679 144848 144201
54231A44201J63Q32P88L75J64M8l50p72n27L73J010O61k81q03m74J76M15J63o7
$$ 144201 144364 145196 145984 146359 146523 146571 146221 145449 144922 145295 146305 146966 146685 145882 145408 145584 145999 146162 146095
54212A46095P1L60M60L44J13l55j080j559j285o63o59j412j867j163K07J142J273
$$ 146095 146166 146526 146986 147330 147443 147088 146008 144449 143164 142501 141842 140430 138563 137400 137607 138749 140022
54195A40022J036P01J66m32n63L9R79J613J669J359J054Q70N65j5n42n13j3K89
$$ 140022 141058 141759 141925 141493 140930 140969 141948 143561 145230 146589 147643 148513 149078 149063 148521 148008 147995 148284
54177A48284N7k27m7M12O94P95R12Q27K42n63j041j224j564k097k356k164j782
$$ 148284 148341 148114 148067 148479 149173 149968 150880 151707 151949 151386 150345 149121 147557 145460 143104 140940 139158
54160A39158j311n74K88P60O37K16k25o37p72k87N37Q97N67K29M17P41O45K76
$$ 139158 137847 137273 137561 138321 138958 139174 138949 138312 137540 137253 137790 138687 139254 139483 139900 140641 141286 141562
54142A41562Q8O9p1k98m38n65p02m96K57J037J158P10L67M01M73K52k45q70j382
$$ 141562 141650 141719 141648 141350 140912 140347 139645 139149 139406 140443 141601 142311 142678 143079 143552 143804 143559 142689 141307
54123A41307j429r31l09R2M85R91R31k97j817j924l22J347J637R89O92J038J340
$$ 141307 139878 138947 138638 138730 139215 140206 141137 140840 139023 137099 136777 138124 139761 140750 141442 142480 143820
54106A43820J211Q49M01j04l03K17J146J607J216M67n6l78p82j213j271o76L39
$$ 143820 145031 145880 146281 146177 145874 146091 147237 148844 150060 150527 150471 150093 149311 148098 146827 146151 146490
54089A46490J060Q17l01j343j403n57L98R35J101R32K76o45j104p02J00O00P15
$$ 146490 147550 148367 148066 146723 145320 144763 145161 146096 147197 148129 148405 147760 146656 145954 146054 146654 147369
54072A47369Q20J016J031P47M08L04N48J090J672J875J489Q53N39O64Q46P59M72
$$ 147369 148189 149205 150236 150983 151391 151695 152243 153333 155005 156880 158369 159222 159761 160425 161271 162030 162502
54055A62502J70j19l76m43k18J57M94P89J086J302J372J446J710K084K328K385
$$ 162502 162672 162553 162177 161734 161516 161673 162167 162956 164042 165344 166716 168162 169872 171956 174284 176669
54039A76669K389K327K040J676J784K637L615L776L034K403K794L890M596M430
$$ 176669 179058 181385 183425 185101 186885 189522 193137 196913 199947 202350 205144 209034 213630 218060
54025B18060M028M249N137N994O157N483M292L086K255J768J258N82J64M63J211
$$ 218060 222088 226337 231474 237468 243625 249108 253400 256486 258741 260509 261767 262349 262513 262976 264187
54010B64187J564J083K19l40n11p06j151j625j857j902k050k488l115l598l583
$$ 264187 265751 266834 267053 266713 266202 265496 264345 262720 260863 258961 256911 254423 251308 247710 244127
53995B44127l016k236j758j840k271k591k450j791p64L59J174J223L82q23j467
$$ 244127 241111 238875 237117 235277 233006 230415 227965 226174 225410 225769 226943 228166 228548 227725 226258
53980B26258j023K29J637K863L872M488M496M193M311N002N320M144J454j674
$$ 226258 225235 225464 227101 229964 233836 238324 242820 247013 251324 256326 261646 265790 267244 265570
53966B65570m225n949p030p569p597p206o407n088l350j686o33l25n40r93j373
$$ 265570 261345 255396 248366 240797 233200 225994 219587 214499 211149 209463 208830 208505 207965 206972 205599
53951B05599j303n72O10J712K321K309J797J147Q67J156J590J574J146R90J495
$$ 205599 204296 203724 204334 206046 208367 210676 212473 213620 214487 215643 217233 218807 219953 220943 222438
53936B22438K262K702K874L306M168M991N188M583L427K200J356J044R36N83J
$$ 222438 224700 227402 230276 233582 237750 242741 247929 252512 255939 258139 259495 260539 261475 262058 262059
53921B62059j89O07K256L881M485L723K266J342J715K985M097M511M629N006N546
$$ 262059 261870 262477 264733 268614 273099 276822 279088 280430 282145 285130 289227 293738 298367 303373 308919
53906C08919N761N580N446N664O058O332O393O164N362L862K158J050P57O37r
$$ 308919 314680 320260 325706 331370 337428 343760 350153 356317 361679 365541 367699 368749 369506 370143 370134
53891C70134j013j610j487j132j080j299j593k185l294m502n149n308n636o213
$$ 370134 369121 367511 366024 364892 363812 362513 360920 358735 355441 350939 345790 340482 334846 328633
53877C28633o283n455m492m317m752m848m157l132k387k167k400k799k963k778
$$ 328633 322350 316895 312403 308086 303334 298486 294329 291197 288810 286643 284243 281444 278481 275703
53863B75703k674k995l371l208k725k757l453l928l522k760k614l205l773l682
$$ 275703 273029 270034 266663 263455 260730 257973 254520 250592 247070 244310 241696 238491 234718 231036
53849B31036l051k370j849j254l40N71O53m69j992k664k223j554j348j286r49
$$ 231036 227985 225615 223766 222512 222172 222743 223396 222927 220935 218271 216048 214494 213146 211860 210911
53834B10911o86r64j309q95N7M10k77j105j142o67n54r10j033n54O0K95L10M70
$$ 210911 210225 209261 207952 207057 207114 207524 207247 206142 205000 204333 203779 202869 201836 201282 201342 201637 201947 202417
53816B02417N35n1j105j532o02J072K269K613K694K933L074K981L169M108N488
$$ 202417 202952 202901 201796 200264 199662 200734 203003 205616 208310 211243 214317 217298 220467 224575 230063
53801B30063O649P356P665P369O243M658L244K029N02j280k316j762L9J950L214
$$ 230063 236712 244068 251733 259102 265345 270003 273247 275276 275778 274498 272182 270420 270459 272409 275623
53786B75623L811L863L233J925M96l01k30K93Q24J333J898K264K113J556R33J72
$$ 275623 279434 283297 286530 288455 288951 288650 288420 288713 289537 290870 292768 295032 297145 298701 299634 299806
53770B99806j112k741l817l709k778j866j399j376j725k243k501k315k033k002
$$ 299806 298694 295953 292136 288427 285649 283783 282384 281008 279283 277040 274539 272224 270191 268189
53756B68189k096k228k836m148n353n399m479l811l919m083l638k899k409k081
$$ 268189 266093 263865 261029 256881 251528 246129 241650 237839 233920 229837 226199 223300 220891 218810
53742B18810j622j202j113j195j087p85n24l94l82m93n51k65K95O09M69L63P24
$$ 218810 217188 215986 214873 213678 212591 211806 211282 210888 210506 210013 209462 209197 209492 210101 210570 210933 211657
53725B11657J249J390J177R70P29J46o65j207j243r62n72j89RJ5K18Q95J612J652
$$ 211657 212906 214296 215473 216443 217172 217318 216653 215446 214203 213241 212669 212480 212489 212504 212722 213617 215229 216881
53707B16881J076O56Q26J212J351J242J011O48L09L96R36J374J359J313J836K817
$$ 216881 217957 218613 219439 220651 222002 223244 224255 224903 225212 225608 226544 227918 229277 230590 232426 235243
53691B35243L591L683L024J766L50m53k48L59L79k83q00o73l75m54o68m46J70
$$ 235243 238834 242517 245541 247307 247657 247204 246956 247315 247694 247411 246611 245938 245563 245109 244441 243995 244165
53674B44165O32O68M42J19j72q4O63J617J870J121O4n80q57j133j328j147p03
$$ 244165 244797 245465 245907 246026 245854 245770 246433 248050 249920 251041 251105 250525 249668 248535 247207 246060 245357
53657B45357l64j61R7K99J64j48j77M4l8o35j258j494j542j653j524p99J77O39
$$ 245357 244993 244832 244929 245228 245392 245244 245067 245111 245073 244438 243180 241686 240144 238491 236967 236168 236345 236984
53639B36984L87j9J5N24J126J460J429J201J011R33Q85Q22P92P08M02Nj6O21J645
$$ 236984 237371 237352 237367 237891 239017 240477 241906 243107 244118 245051 245936 246758 247550 248258 248660 248665 248649 249270 250915
53620B50915K572L112L097K442J505J071J507K281K753L083L704M288M049L011
$$ 250915 253487 256599 259696 262138 263643 264714 266221 268502 271255 274338 278042 282330 286379 289390
53606B89390K109J967K262K435K331J936J219N55O15J398J991J661O95k48j000
$$ 289390 291499 293466 295728 298163 300494 302430 303649 304204 304819 306217 308208 309869 310564 310316 309316
53591C09316j594j662r81j87j77r20j575j657j450j293j199j190j367j572j494
$$ 309316 307722 306060 305079 304892 304715 303795 302220 300563 299113 297820 296621 295431 294064 292492 290998
53576B90998j239j201j357j260q47n73n58l23K59N01k8o30l69N37J072R09O92
$$ 290998 289759 288558 287201 285941 285094 284521 283963 283640 283899 284400 284372 283742 283373 283910 284982 285891 286583
53559B86583R37J396J661J690J514J045M74L27P98J447J886K342L106L823L922
$$ 286583 287520 288916 290577 292267 293781 294826 295300 295627 296425 297872 299758 302100 305206 309029 312951
53544C12951L507L245L451L826M123M473M901N040M694M336M574N356O140O710
$$ 312951 316458 319703 323154 326980 331103 335576 340477 345517 350211 354547 359121 364477 370617 377327
53530C77327P402Q446R571J0475J1276J2140J2777J2807J2490J2535J3149J3829
$$ 377327 384729 393175 402746 413221 424497 436637 449414 462221 474711 487246 500395 514224
53518E14224J4273J4856J5816J6583J6634J6594J7547J9351K0669K0862K0861
$$ 514224 528497 543353 559169 575752 592386 608980 626527 645878 666547 687409 708270
53507G08270K1680K2939K3604K3449K2951K2241K1191K0235K0100K0653K0995
$$ 708270 729950 752889 776493 799942 822893 845134 866325 886560 906660 927313 948308
53496I48308K0747K0402K0318K0240K0092K0238K0598K0353J9206J8138J8114
$$ 948308 969055 989457 1009775 1030015 1050107 1070345 1090943 1111296 1130502 1148640 1166754
53485A166754J8630J8366J6949J5190J3812J2831J2050J1409J0768R951R059Q167
$$ 1166754 1185384 1203750 1220699 1235889 1249701 1262532 1274582 1285991 1296759 1306710 1315769 1323936
53473A323936O797M401J373j206l004m798p127r373j0853j2063j4026j6646j8677
$$ 1323936 1330733 1335134 1336507 1335301 1332297 1327499 1320372 1310999 1300146 1288083 1274057 1257411 1238734
53460A238734j9275j8947j8737j9155k0098k1311k2398k2799k2310k1596k1634
$$ 1238734 1219459 1200512 1181775 1162620 1142522 1121211 1098813 1076014 1053704 1032108 1010474
53449A010474k2520k3299k3146k2294k1415k0498j9001j7004j5379j4583j3980
$$ 1010474 987954 964655 941509 919215 897800 877302 858301 841297 825918 811335 797355
53438G97355j2784j1094r472p863n727l128q38O82J823L127M599N991P336Q837
$$ 797355 784571 773477 764005 756142 750415 747287 746449 747131 748954 752081 756680 762671 770007 778844
53424G78844J0498J2164J3763J5328J6890J8519K0271K1956K3225K4018K4739
$$ 778844 789342 801506 815269 830597 847487 866006 886277 908233 931458 955476 980215
53413I80215K5758K7016K8299K9692L1434L3414L5110L6183L6999L8448M1140
$$ 980215 1005973 1032989 1061288 1090980 1122414 1155828 1190938 1227121 1264120 1302568 1343708
53402A343708M4656M7700M9237M9525M9847N1170N3282N5194N6115N5954N5186
$$ 1343708 1388364 1436064 1485301 1534826 1584673 1635843 1689125 1744319 1800434 1856388 1911574
53391A911574N4451N4005N3498N2492N1217N0311M9727M8410M5494M1373L7103
$$ 1911574 1966025 2020030 2073528 2126020 2177237 2227548 2277275 2325685 2371179 2412552 2449655
53380B449655L3166K9346K5513K1812J8126J4083R718N538J740k167o689j1703
$$ 2449655 2482821 2512167 2537680 2559492 2577618 2591701 2601419 2606957 2608697 2606530 2599841 2588138
53368B588138j6783k1803k6950l2352l7978m3752m9470n4685n8900o1877o3664
$$ 2588138 2571355 2549552 2522602 2490250 2452272 2408520 2359050 2304365 2245465 2183588 2119924
53357B119924o4391o4199o3260o1808o0116n8488n7108n5836n4319n2402n0392
$$ 2119924 2055533 1991334 1928074 1866266 1806150 1747662 1690554 1634718 1580399 1527997 1477605
53346A477605m8763m7707m7019m6331m5345m3909m2080m0058l8022l6011l4011
$$ 1477605 1428842 1381135 1334116 1287785 1242440 1198531 1156451 1116393 1078371 1042360 1008349
53335A008349l2100l0303k8447k6298k3876k1466j9220j6859j3965j0617p612
$$ 1008349 976249 945946 917499 891201 867325 845859 826639 809780 795815 785198 777586
53324G77586n795n152m762l795k457j584j378r82M32K556M355N462O527Q131R913
$$ 777586 771791 766639 761877 758082 755625 754041 752663 751681 752113 754669 759024 764486 771013 779144 789057
53309G89057J1205J2050J3062J4447J5847J7071J8340J9670K0661K1310K2371
$$ 789057 800262 812312 825374 839821 855668 872739 891079 910749 931410 952720 975091
53298I75091K4313K6347K7298K7258K7421K8308K9086K8992K8534K8610K9105
$$ 975091 999404 1025751 1053049 1080307 1107728 1136036 1165122 1194114 1222648 1251258 1280363
53287A280363K9177K8431K6955K4476K0608J6041J2407J0485R215P065L823M26
$$ 1280363 1309540 1337971 1364926 1389402 1410010 1426051 1438458 1448943 1458158 1465223 1469046 1469472
53275A469472k495n151p835j0389j2521j4172j5404j6373j7476j9063k0912k2428
$$ 1469472 1466977 1461826 1453991 1443602 1431081 1416909 1401505 1385132 1367656 1348593 1327681 1305253
53263A305253k3525k4850k6755k8619k9685l0228l1190l2793l4236l4878l5012
$$ 1305253 1281728 1256878 1230123 1201504 1171819 1141591 1110401 1077608 1043372 1008494 973482
53252I73482l5130l5042l4247l2836l1450l0433k9511k8305k6765k5090k3602
$$ 973482 938352 903310 869063 836227 804777 774344 744833 716528 689763 664673 641071
53241F41071k2657k2414k2499k2297k1583k0659j9775j8751j7312j5482j3549
$$ 641071 618414 596000 573501 551204 529621 508962 489187 470436 453124 437642 424093
53230D24093j1835j0649j0129r900r223p769o055m851m330m126l982l956m064
$$ 424093 412258 401609 391480 381580 372357 364588 358533 353682 349352 345226 341244 337288 333224
53217C33224m187m399m908n581n877n488m775m324m205l969l353k706k582l018
$$ 333224 329037 324638 319730 314149 308272 302784 298009 293685 289480 285511 282158 279452 276870 273852
53203B73852l426l238k595k169k301k538k215j351o80p71j447k159k634k893k813
$$ 273852 270426 267188 264593 262424 260123 257585 255370 254019 253339 252568 251121 248962 246328 243435 240622
53188B40622k106q79J72M02n6n47q26j340k384l372l375k289j025m46n02n92n01
$$ 240622 238516 237637 237809 238211 238155 237608 236782 235442 233058 229686 226311 224022 222997 222551 222049 221457 220956
53171B20956o19j296k237k719k357j524q87n98l02M3j02r21j508q04R21K312K570
$$ 220956 220337 219041 216804 214085 211728 210204 209317 208719 208417 208460 208358 207437 205929 205125 206046 208358 210928
53154B10928K028J098k59j715k283j594n76j60m7L86P25K41o61j012r09j183j643
$$ 210928 212956 214054 213795 212080 209797 208203 207627 207467 207420 207806 208531 208772 208111 207099 206190 205007 203364
53137B03364j144L86J499J311P30Q33J227R57J32m14n47q14j338j669j582j277
$$ 203364 202220 202606 204105 205416 206146 206979 208206 209163 209295 208881 208334 207520 206182 204513 202931 201654
53121B01654q47k29L51N06K24q8j08K51R67J771K088J550N50j61l53l87n70q25
$$ 201654 200807 200578 200929 201435 201659 201571 201463 201714 202681 204452 206540 208090 208640 208479 208126 207739 207169 206344
53103B06344r59q90o20k92j88m14p39r57j152j342j247q57q25j631k640k696j614
$$ 206344 205385 204495 203875 203583 203395 202981 202242 201285 200133 198791 197544 196687 195862 194231 191591 188895 187281
53086A87281l81J81K09K07K55J96P4R6L84Q39J116P55k64j238j440j011o34m49
$$ 187281 186900 187081 187290 187497 187752 187948 188022 188118 188502 189341 190457 191212 190948 189710 188270 187259 186625 186176
53068A86176K1Q11J147N46m46r37p18k37M6l3l74o32n47l56n26r34r39m15n9k67
$$ 186176 186197 187008 188155 188701 188255 187318 186600 186363 186409 186376 186002 185370 184823 184467 183941 183007 182068 181653 181594 181327
53048A81327m33P1P78Q09J70l64m23k86j19K08N68O32M94N66P76N16l86j315j807
$$ 181327 180894 180965 181743 182552 182722 182358 181935 181649 181530 181738 182306 182938 183432 183998 184774 185290 184904 183589 181782
53029A81782k132k582k671j744j13J003Q03k52j085j209j015r63q35j13J063J804
$$ 181782 179650 177068 174397 172653 172540 173543 174346 174094 173009 171800 170785 169822 168987 168874 169937 171741
53013A71741J562Q45M78M72K20l38m85J51R07Q84J22m67k28M85P16j08j550k505
$$ 171741 173303 174148 174626 175098 175318 174980 174495 174646 175553 176437 176559 176092 175864 176349 177065 176957 175407 172902
52995A72902k239j115j16J97N2j38k54l11k34j13k37o44q90o45j79K8o5k01l82
$$ 172902 170663 169548 169432 169629 169681 169543 169289 168978 168744 168631 168394 167750 166860 166215 166036 166064 165999 165798 165416
52976A65416p57j069p86J83J278J922J991J674J229J017J328J951K224J809J176
$$ 165416 164659 163590 162804 162987 164265 166187 168178 169852 171081 172098 173426 175377 177601 179410 180586
52961A80586R73J237J484J448J262R85M05m99j282j467j098o80o21r50j453j909
$$ 180586 181559 182796 184280 185728 186990 187975 188380 187881 186599 185132 184034 183354 182733 181783 180330 178421
52945A78421k145k069j720j243p71m13k91m63p38p32l05J73J52m46j084j174o38
$$ 178421 176276 174207 172487 171244 170473 170060 169769 169306 168568 167836 167531 167704 167856 167410 166326 165152 164514
52928A64514J21O66P80N00M9k63l16l18n27q26q42m66m2J40J91K81K28j82o11
$$ 164514 164635 165301 166081 166581 166630 166367 166051 165733 165206 164380 163538 163072 163030 163170 163361 163642 163870 163688 163077
52909A63077m16M62J270J309O72o9n40o10j74N63Q26l2j519k313j774o55J0R5
$$ 163077 162661 163123 164393 165702 166374 166305 165765 165155 164981 165544 166370 166338 164819 162506 160732 160077 160087 160182
52891A60182P0k0m55j026j065m16L38P90J211J806K072J475M00k29j67q4m98j019
$$ 160182 160252 160232 159777 158751 157686 157270 157608 158398 159609 161415 163487 164962 165362 165133 164966 164882 164384 163365
52873A63365r34j50P59J216J112O90K69Q8J85L94M76L22rl40l50L45J796L332
$$ 163365 162431 162281 163040 164256 165368 166058 166327 166415 166600 166994 167470 167792 167783 167443 167093 167438 169234 172566
52855A72566L907L149J930J516K146K751K311J104K36J07l4q68j922k192j594
$$ 172566 176473 179622 181552 183068 185214 187965 190276 191380 191616 191723 191689 190821 188899 186707 185113
52840A85113j111j458k150k247j611r82r49j368j800k063k131j895j389r76q99
$$ 185113 184002 182544 180394 178147 176536 175554 174605 173237 171437 169374 167243 165348 163959 162983 162084
52825A62084p67l6J074J654J363J000J440K389K773K122R50j21r58j541j684j460
$$ 162084 161317 161281 162355 164009 165372 166372 167812 170201 172974 175096 176046 175925 174967 173426 171742 170282
52809A70282j279j227p94K65J281J431Q52L62L22M38N78R58J460J474P22k87r63
$$ 170282 169003 167776 166982 167247 168528 169959 170811 171173 171495 171933 172511 173469 174929 176403 177125 176838 175875
52792A75875j305j610j958k292k575k564j882o76K31K85j21l82n62r26j096n71
$$ 175875 174570 172960 171002 168710 166135 163571 161689 161013 161244 161529 161408 161026 160464 159538 158442 157871
52776A57871J55O3p81j137l15R09J492J330P78j29j220j717j113j14K27m1j32
$$ 157871 158026 158089 157308 156171 155856 156765 158257 159587 160365 160236 159016 157299 156186 156072 156299 156258 156126
52759A56126L4j40n69l39P21J522J264N50K61J94k78q16n50M11R94P05K24K05
$$ 156126 156160 156020 155451 155112 155833 157355 158619 159169 159430 159624 159346 158530 157980 158391 159385 160090 160314 160519
52741A60519M03L18R7K17P30J273J623J828J953J959J776J289M82l35p01o09n92
$$ 160519 160922 161240 161337 161554 162284 163557 165180 167008 168961 170920 172696 173985 174467 174132 173431 172822 172230
52724A72230r31j122n77M45J129J180J101J330J632J510Q33j66j230k134k604
$$ 172230 171299 170177 169600 170045 171174 172354 173455 174785 176417 177927 178760 178594 177364 175230 172626
52709A72626k468j900j337j086j051q16j35P33J232J105O46J98k91r84j627j746
$$ 172626 170158 168258 166921 165835 164784 163968 163833 164566 165798 166903 167549 167747 167456 166472 164845 163099
52693A63099j324q51p06p94q73q43o21j49L80O37O50P88J146J362J266J211J453
$$ 163099 161775 160924 160218 159424 158551 157708 157087 156938 157318 157955 158605 159393 160539 161901 163167 164378 165831
52676A65831J641J378R11P65R30R68P02K79k63r47j428j220m03L68O51N77L69
$$ 165831 167472 168850 169761 170526 171456 172424 173126 173405 173142 172195 170767 169547 169144 169512 170163 170740 171109
52659A71109K4l76n32k73K30Q27J558K305K627K229J371O39M78J015K040L003
$$ 171109 171133 170757 170225 169952 170182 171009 172567 174872 177499 179728 181099 181738 182216 183231 185271 188274
52643A88274L388L182K720K023P67r10k233k737k932l452l992l729k575j325o23
$$ 188274 191662 194844 197564 199587 200354 199444 197211 194474 191542 188090 184098 180369 177794 176469 175846
52628A75846l55r9K97P71J180J299J039P65J056J921K622K453J470K54q17j707
$$ 175846 175491 175392 175689 176460 177640 178939 179978 180743 181799 183720 186342 188795 190265 190519 189702 187995
52612A87995k358k519k067j290p02n66o37m39J45O79O85K45p6N5L43K69k72q94
$$ 187995 185637 183118 181051 179761 179059 178493 177856 177417 177562 178241 178926 179171 179095 179150 179493 179762 179490 178596
52594A78596j167r94o00k53j10k03m25m66J3R58J757J755J026K82Rop8qN32J255
$$ 178596 177429 176435 175835 175582 175472 175269 174844 174378 174391 175349 177106 178861 179887 180169 180178 180172 180094 180086 180618 181873
52574A81873J504J146P15N37L01k81q18o94L0N87M38j29m15j96Lm14j288j798
$$ 181873 183377 184523 185238 185775 186076 185795 184977 184283 184313 184900 185338 185209 184794 184598 184601 184187 182899 181101
52556A81101j402m98P3K2k26k23nJ66J87J67K74O81J340J731J206j16j121q12
$$ 181101 179699 179201 179274 179296 179070 178847 178842 179008 179195 179362 179636 180317 181657 183388 184594 184478 183357 182545
52538A82545M63J342J003N4l76l4K95j0o19q05n11l00l67k21L93Q52M41m83q20
$$ 182545 183008 184350 185353 185407 185031 184997 185292 185282 184663 183858 183347 183047 182680 182459 182852 183704 184145 183662 182842
52519A82842k30M49M08m3l3O79J491J786J506J026P21P08Q28Q82R67J401K236
$$ 182842 182612 183061 183469 183426 183393 184072 185563 187349 188855 189881 190602 191310 192138 193020 193987 195388 197624
52502A97624L015L245K934K408J731O33r64k584l496l349k480j642j329j387j325
$$ 197624 200639 203884 206818 209226 210957 211590 210626 208042 204546 201197 198717 197075 195746 194359 193034
52487A93034r10l14K78Q07J085P79o8q31q59j17R31J779K039J544O58K25O90J471
$$ 193034 192124 191810 192088 192895 193980 194759 194691 193860 193001 192884 193815 195594 197633 199177 199835 200060 200750 202221
52469B02221J634J149R20J523K490K948K657K066J645J462J354J294J483J997
$$ 202221 203855 205004 205924 207447 209937 212885 215542 217608 219253 220715 222069 223363 224846 226843
52455B26843K467K240J042o86k206l103l385l232k894k687k743k855k729k329
$$ 226843 229310 231550 232592 231906 229700 226597 223212 219980 217086 214399 211656 208801 206072 203743
52441B03743j771j084l89k1j65n32q02j117j638j868j182Q4P65K85o75j146r30
$$ 203743 201972 200888 200499 200478 200313 199781 198979 197862 196224 194356 193174 193258 194023 194308 193633 192487 191557
52424A91557m89k18j49p5K22O27N77k41j141j052O8J101J297J130J328J794K082
$$ 191557 191068 190850 190701 190626 190848 191475 192052 191811 190670 189618 189686 190787 192084 193214 194542 196336 198418
52407A98418K177K151J704P90J83N57J432J925K159K917M186N089N264N196N024
$$ 198418 200595 202746 204450 205240 205423 205980 207412 209337 211496 214413 218599 223688 228952 234148 239172
52392B39172M128K258J83j350k493l568m159l690k456j340p02k26L19P27Q23P63
$$ 239172 243300 245558 245741 244391 241898 238330 234171 230481 228025 226685 225983 225757 226076 226803 227626 228389
52376B28389P47P66P57P77Q95R68P47K01k31L3J012J936K118J848J934K354K030
$$ 228389 229136 229902 230659 231436 232331 233299 234046 234247 234016 234049 235061 236997 239115 240963 242897 245251 247281
52359B47281L19j882l052k726j696q40l81k45m14p43q59n65o2L38N11M49J82o6
$$ 247281 247600 245718 242666 239940 238244 237404 237023 236778 236364 235621 234762 234197 234135 234473 234984 235433 235615 235549
52341B35549N9O13J168J293J049Q57R75J345J860K463K980L125K890K717L093
$$ 235549 235608 236221 237389 238682 239731 240588 241563 242908 244768 247231 250211 253336 256226 258943 262036
52326B62036L969M786N109N099N213N546N739N509N104N009N324N569N130L902
$$ 262036 266005 270791 275900 280999 286212 291758 297497 303006 308110 313119 318443 324012 329142 333044
52312C33044K432J529J569K208K772K901K761K613K482K347K390K811L436L842
$$ 333044 335476 337005 338574 340782 343554 346455 349216 351829 354311 356658 359048 361859 365295 369137
52298C69137L865L714L530L107K314J514J286J688K106J951J303P16N05M56K57
$$ 369137 373002 376716 380246 383353 385667 387181 388467 390155 392261 394212 395515 396231 396736 397192 397449
52283C97449r4l70m63m15k68m0K09M99J042J882K514K236J087N1oO78J227J350
$$ 397449 397355 396985 396522 396107 395839 395799 396008 396507 397549 399431 401945 404181 405268 405319 405313 405991 407218 408568
52265D08568J545K143K754K897K754K826L123L259L226L531M299M711L862K095
$$ 408568 410113 412256 415010 417907 420661 423487 426610 429869 433095 436626 440925 445636 449498 451593
52251D51593R76J681L716N469N904N377M843M680M471L743K592J581J141J079
$$ 451593 452569 454250 457966 463435 469339 474716 479559 484239 488710 492453 495045 496626 497767 498846
52237D98846Q38K77K5P41K045K711K168J263J151J850K493K772L288M317N159
$$ 498846 499684 499961 499986 500727 502772 505483 507651 508914 510065 511915 514408 517180 520468 524785 529944
52222E29944N104M503M252M596N027N238N434N714N682M979L853K952K696L032
$$ 529944 535048 539551 543803 548399 553426 558664 564098 569812 575494 580473 584326 587278 589974 593006
52208E93006L655M285M814N312N811O086N832N146M597M662N121N322M887L981
$$ 593006 596661 600946 605760 611072 616883 622969 628801 633947 638544 643206 648327 653649 658536 662517
52194F62517K970K091J572J657K302L029L358L338L393L678L865L620L076K638
$$ 662517 665487 667578 669150 670807 673109 676138 679496 682834 686227 689905 693770 697390 700466 703104
52180G03104K477K435K258J779R04l57j778l041l966m601m995n083m909m786n027
$$ 703104 705581 708016 710274 712053 712957 712600 710822 707781 703815 699214 694219 689136 684227 679441 674414
52165F74414n493n684n370m879m523l941k492k62J809L020L651M207M412L689
$$ 674414 668921 663237 657867 652988 648465 644524 642032 641770 643579 646599 650250 654457 658869 662558
52151F62558K331J372J161R31R6q97j374j372j048l4J691K904K379P79L2P28J486
$$ 662558 664889 666261 667422 668353 668449 667552 666178 664806 663758 663724 665415 668319 670698 671477 671509 672237 673723
52134F73723J201N33M20L84n34j928k455j716n67M24J654L423N225O513P507Q763
$$ 673723 674924 675457 675877 676261 675727 673799 671344 669628 669061 669485 671139 674562 679787 686300 693807 702570
52118G02570J0331J1789J2784J3309J3540J3605J3396J2566J0885Q587O160L843
$$ 702570 712901 724690 737474 750783 764323 777928 791324 803890 814775 823362 829522 833365
52106H33365J556p30k965n169p268q749r022q098o552m856l179j768p90J75J726
$$ 833365 834921 834191 831226 826057 818789 810040 801018 792920 786368 781512 778333 776565 775775 775950 777676
52091G77676L486M242L589K690K737L415L595K885J541n58l623o761q352p953
$$ 777676 781162 785404 788993 791683 794420 797835 801430 804315 805856 805298 801675 794914 786562 778609
52077G78609o808o110n575m335k461r03k59l02n30o37n19k55o6J7L41J170K201
$$ 778609 771801 765691 760116 755781 753320 752417 752158 751856 751326 750689 750170 749915 749849 749866 750207 751377 753578
$$ [...]
##END NTUPLES=NMR SPECTRUM
##END=
