
##TITLE=AC1160_Rove100-14_5867767_M9hd03SO8T
##JCAMPDX= 6.0         $$ Bruker NMR JCAMP-DX V2.0
##DATA TYPE= NMR SPECTRUM
##DATA CLASS= NTUPLES
##ORIGIN= BRUKER
##OWNER= Administrator
$$ 1.72 TOPSPIN		Version 2.1
$$ 2012-03-30 23:02:31.921 -0500  Administrator@TOPSPIN
$$ Compression mode = diff/dup
##.OBSERVE FREQUENCY= 400.13188235
##.OBSERVE NUCLEUS= ^1H
##.ACQUISITION MODE= SIMULTANEOUS (DQD)
##.ACQUISITION SCHEME= undefined
##.AVERAGES= 8
##.DIGITISER RES= 22
##SPECTROMETER/DATA SYSTEM= spect
##.PULSE SEQUENCE= zg30
##.SOLVENT NAME= COFFEE_meoh
##.SHIFT REFERENCE= INTERNAL, COFFEE_meoh, 1, 14.98061
##AUDIT TRAIL= $$ (NUMBER, WHEN, WHO, WHERE, PROCESS, VERSION, WHAT)
$$ ##TITLE= Audit trail, TOPSPIN		Version 2.1
$$ ##JCAMPDX= 5.01
$$ ##ORIGIN= Bruker BioSpin GmbH
$$ ##OWNER= Administrator
$$ $$ C:\Bruker\TOPSPIN/data/COFFEE/nmr/AC1160_Rove100-14_5867767_M9hd03SO8T/10/pdata/1/auditp.txt
$$ ##AUDIT TRAIL=  $$ (NUMBER, WHEN, WHO, WHERE, PROCESS, VERSION, WHAT)
(   1,<2012-03-30 23:02:25.046 -0500>,<Administrator>,<TOPSPIN>,<go>,<TOPSPIN 2.1>,
      <created by zg
	started at 2012-03-30 23:01:18.578 -0500,
	POWCHK enabled, PULCHK disabled,
       configuration hash MD5:
       1A 1E CE 29 27 FD 77 03 67 4E F0 E3 C4 B2 CB 90
       data hash MD5: 64K
       55 5A 33 0F 70 10 B6 FC B3 0C 4B 41 23 6C A5 12>)
(   2,<2012-03-30 23:02:27.656 -0500>,<Administrator>,<TOPSPIN>,<proc1d>,<TOPSPIN 2.1>,
      <Start of raw data processing
       efp LB = 0 FT_mod = 6 PKNL = 1 PHC0 = 0 PHC1 = 0 SI = 32K 
       data hash MD5: 32K
       4F BA EC 6F F2 B4 C5 15 5A 74 EE CE 4B 6C 7D EC>)
(   3,<2012-03-30 23:02:28.078 -0500>,<Administrator>,<TOPSPIN>,<proc1d>,<TOPSPIN 2.1>,
      <pk PHC0 = 209.1687 PHC1 = 0 
       data hash MD5: 32K
       24 21 01 EC 05 44 DD E7 27 29 23 16 6A F5 85 22>)
(   4,<2012-03-30 23:02:28.171 -0500>,<Administrator>,<TOPSPIN>,<proc1d>,<TOPSPIN 2.1>,
      <abs ABSG = 1 
       data hash MD5: 32K
       61 6A 64 D5 1E 24 54 C2 06 11 27 D2 C9 30 FA BD>)
(   5,<2012-03-30 23:02:28.218 -0500>,<Administrator>,<TOPSPIN>,<proc1d>,<TOPSPIN 2.1>,
      <abs ABSG = 2 
       data hash MD5: 32K
       3A D0 E0 94 F1 AB 8C 5B 9B 41 11 F2 47 BE 5E 19>)
(   6,<2012-03-30 23:02:28.250 -0500>,<Administrator>,<TOPSPIN>,<proc1d>,<TOPSPIN 2.1>,
      <abs ABSG = 3 
       data hash MD5: 32K
       DA B5 DA CF 24 35 5A 2D 57 B2 24 3F B4 0F F7 A1>)
(   7,<2012-03-30 23:02:28.296 -0500>,<Administrator>,<TOPSPIN>,<proc1d>,<TOPSPIN 2.1>,
      <abs ABSG = 4 
       data hash MD5: 32K
       BC EB 30 93 D7 F4 59 E8 31 97 54 B5 DB 51 89 EA>)
(   8,<2012-03-30 23:02:28.343 -0500>,<Administrator>,<TOPSPIN>,<proc1d>,<TOPSPIN 2.1>,
      <abs ABSG = 5 
       data hash MD5: 32K
       F3 68 B1 6E C9 33 38 EC 66 10 AB 67 6E 86 E4 66>)
$$ ##END=
$$ 
$$ $$ hash MD5
$$ $$ 2B 8C 3A 64 AA 46 BF 21 22 E4 A6 D7 12 78 66 5B
##$RELAX= 
##$RELAX= 
##$RELAX= 
##$RELAX= 
##$RELAX= 
##$RELAX= 
##$RELAX= 
$$ Bruker specific parameters
$$ --------------------------
$$ [...]
##$TP= (0..7)
150 150 150 150 150 150 150 150
##$TP07= 0
##$TPNAME0= <>
##$TPNAME1= <>
##$TPNAME2= <>
##$TPNAME3= <>
##$TPNAME4= <>
##$TPNAME5= <>
##$TPNAME6= <>
##$TPNAME7= <>
##$TPOAL= (0..7)
0.5 0.5 0.5 0.5 0.5 0.5 0.5 0.5
##$TPOFFS= (0..7)
0 0 0 0 0 0 0 0
##$TUNHIN= 0
##$TUNHOUT= 0
##$TUNXOUT= 0
##$USERA1= <user>
##$USERA2= <user>
##$USERA3= <user>
##$USERA4= <user>
##$USERA5= <user>
##$V9= 5
##$VALIST= <valist>
##$VCLIST= <CCCCCCCCCCCCCCC>
##$VD= 0
##$VDLIST= <DDDDDDDDDDDDDDD>
##$VPLIST= <PPPPPPPPPPPPPPP>
##$VTLIST= <TTTTTTTTTTTTTTT>
##$WBST= 2048
##$WBSW= 25
##$XGAIN= (0..3)
0 0 0 0
##$XL= 0
##$YL= 0
##$YMAX_a= 544749
##$YMIN_a= -662445
##$ZGOPTNS= <>
##$ZL1= 120
##$ZL2= 120
##$ZL3= 120
##$ZL4= 120
##$ABSF1= 14.98061
##$ABSF2= -5.57192
##$ABSG= 5
##$ABSL= 3
##$ALPHA= 0
##$AQORDER= 0
##$ASSFAC= 0
##$ASSFACI= 0
##$ASSFACX= 0
##$ASSWID= 0
##$AUNMP= <proc_prof1d_extract_pilot.lims>
##$AXLEFT= 0
##$AXNAME= <>
##$AXNUC= <1H>
##$AXRIGHT= 0
##$AXTYPE= 0
##$AXUNIT= <>
##$AZFE= 0.1
##$AZFW= 0.1
##$BCFW= 0
##$BC_mod= 0
##$BYTORDP= 0
##$COROFFS= 0
##$CY= 15
##$DATMOD= 1
##$DC= 0
##$DFILT= <>
##$DTYPP= 0
##$F1P= 0
##$F2P= 0
##$FCOR= 0.5
##$FTSIZE= 32768
##$FT_mod= 6
##$GAMMA= 0
##$GB= 0
##$INTBC= 1
##$INTSCL= 1
##$ISEN= 128
##$LB= 0
##$LEV0= 0
##$LPBIN= 0
##$MAXI= 10000
##$MC2= 0
##$MEAN= 0
##$ME_mod= 0
##$MI= 0
##$NCOEF= 0
##$NC_proc= -8
##$NLEV= 6
##$NOISF1= 0
##$NOISF2= 0
##$NSP= 0
##$NTH_PI= 0
##$NZP= 0
##$OFFSET= 14.98061
##$PC= 1
##$PHC0= 209.1687
##$PHC1= 0
##$PH_mod= 1
##$PKNL= yes
##$PPARMOD= 0
##$PPDIAG= 0
##$PPIPTYP= 0
##$PPMPNUM= 2147483647
##$PPRESOL= 1
##$PSCAL= 4
##$PSIGN= 0
##$PYNMP= <proc.py>
##$REVERSE= no
##$SF= 400.13
##$SI= 32768
##$SIGF1= 0
##$SIGF2= 0
##$SINO= 400
##$SIOLD= 32768
##$SPECTYP= <>
##$SREGLST= <1H.CDCl3>
##$SSB= 0
##$STSI= 32768
##$STSR= 0
##$SW_p= 8223.68421052632
##$SYMM= 0
##$S_DEV= 0
##$TDeff= 65536
##$TDoff= 0
##$TI= <>
##$TILT= no
##$TM1= 0
##$TM2= 0
##$TOPLEV= 0
##$USERP1= <user>
##$USERP2= <user>
##$USERP3= <user>
##$USERP4= <user>
##$USERP5= <user>
##$WDW= 1
##$XDIM= 32768
##$YMAX_p= 465492064
##$YMIN_p= -739171
##$CURPLOT= <Network HP LaserJet P1505>
##$CURPRIN= <$Network HP LaserJet P1505>
##$DFORMAT= <normdp>
##$LAYOUT= <+/1D_H.xwp>
##$LFORMAT= <normlp>
##$PFORMAT= <normpl>
##$SURQMSG= 1
$$ End of Bruker specific parameters
$$ ---------------------------------
##NTUPLES= NMR SPECTRUM
##VAR_NAME=  FREQUENCY,     SPECTRUM/REAL,   SPECTRUM/IMAG
##SYMBOL=    X,             R,               I
##VAR_TYPE=  INDEPENDENT,   DEPENDENT,       DEPENDENT
##VAR_FORM=  AFFN,          ASDF,            ASDF
##VAR_DIM=   32768,         32768,           32768
##UNITS=     HZ,            ARBITRARY UNITS, ARBITRARY UNITS
##FACTOR=    0.250966925370066, 1,           1
##FIRST=     8223.43324360095, -177863,      307099
##LAST=      0,             -19324,          22407
##MIN=       0,             -739171,         0
##MAX=       8223.43324360095, 465492064,    0
$$ Real data points
##PAGE= N=1
##DATA TABLE= (X++(R..R)), XYDATA
$$ [...]
$$ plain form
19526 487033 -23531 233543 252549 128152 17468 342949 80953 -165254 55621 1829 188071
19515 188071 -90306 -178664 -296231 360155 168071 -23406 -23103 -123680 -149855 -175237 -206029
19504 -206029 -399929 -77152 -161602 226990 99316 -3943 -43450 -115101 89832 -5347 -253914
19493 -253914 -79894 -309946 -204824 -123044 175915 -93067 -264463 252191 282650 -33240
19482 -104660 136918 -67837 -101285 -160004 134513 -37970 -175552 -217434 -16618 28525 -85001
19470 -55683 -284033 49928 71895 -58059 171963 118706 113196 54752 81909 -41769 -305552
19459 -305552 -72436 15436 -150563 48178 43205 383201 332283 -254100 -586455 -46284 -370650
19448 -370650 -225669 -17215 200369 132480 81488 -17661 -283641 -306271 -271492 250396 44537
$$ packed form
19526D87033b3531B33543J9006j24397A7468L25481H0953a65254E5621A829J86242
19515A88071i0306q8358j17567C60155A68071b3406L03j00577k6175k5382l0792
19504b06029j93900g7152q4450B26990I9316c943l9507p1651H9832e347k48567
19493b53914g9894k30052J05122Q1780A75915i3067j71396B52191L0459c3240
19482a04660A36918f7837l3448n8719A34513c7970j37582m1882a6618B8525h5001
19470e5683k28350D9928K1967e8059A71963n3257n510E4752K7157d1769k63783
19459c05552g2436A5436a50563D8178m973L39996n0918b54100l32355d6284l24366
19448c70650J44981a7215B00369o7889n0992a7661k65980k2630L4779B50396D4537
$$ plain form
19436 -214730 -421740 -43206 121017 -220984 -49181 -165263 105127 235146 141301 38565
19425 -248217 451998 -122043 -18316 -139630 -17618 -279074 -486299 -202941 -114559 67008
19414 19663 19284 76281 -67558 -54126 -118530 -194637 -268800 -126713 194424 -93496 -361683
19403 -361683 -52944 414410 40496 101754 -105803 -163652 153124 -303218 -231073 150725
19392 61157 -268515 -113747 48078 -130730 172051 -55956 -60277 -48292 -82909 22005 40003
19381 40003 55083 34390 -32465 175605 -166013 80712 26509 -171145 75444 -179110 -147071
19370 -147071 151928 -254067 60638 -32001 -36166 -26640 95549 -221713 64808 -179356 -68757
19358 -114476 233554 194466 24605 3680 -244525 -165997 -318865 271339 -88587 -3832 -64384
$$ packed form
19436b14730k07010d3206A21017b20984d9181j16082A05127J30019r3845C8565
19425b48217D51998a22043a8316j21314a7618k61456k07225b02941Q8382F7008
19414A9663l79N6997f7558J3432o4404p6107p4163a26713A94424i3496k68187
19403c61683e2944D14410D0496O1258a05803n7849A53124c03218P2145A50725
19392F1157b68515a13747D8078a30730A72051e5956m321J1985l4617B2005J7998
19381D0003J5080k0693c2465A75605a66013H0712B6509a71145G5444a79110L2039
19370a47071A51928b54067F0638c2001m165R526I5549b21713F4808a79356f8757
19358a14476B33554l9088B4605C680b44525P8528j52868B71339h8587c832o0552
$$ plain form
19347 -64384 -447037 61696 -12615 -16701 -257701 20417 -318056 -55071 2379 -61941 -48727
19336 -48727 180384 -35650 -159813 206197 163465 36 -99523 69336 -16468 -418298 -28072
19324 -126024 93249 -233241 -274724 -221215 -1324 59252 -406103 -154767 60015 -70854 -192019
19313 -192019 -60423 -80305 -157383 -15652 -7980 -206191 -184669 167367 -131063 -134169 322783
19301 64555 -272473 -118135 -340947 112520 64575 203923 -130825 -55890 -246642 357542
19290 79607 -394749 -165346 136264 -123940 -152219 -200965 -34295 41113 199385 -294053
19279 171968 -63972 71893 -197721 139761 -4082 46515 -193161 -68099 -435268 119481 89239
19268 89239 86789 -61733 -280783 -41123 40974 -7807 39545 -128609 -85220 -310452 -442172
$$ packed form
19347f4384l82653F1696a2615m086k41000B0417c18056e5071B379f1941J3214
19336d8727A80384c5650j24163B06197m2732C6i9523F9336a6468m01830b8072
19324a26024I3249b33241m1483N3509a324E9252d06103a54767F0015g0854j21165
19313a92019f0423j9882p7078a5652P672j98211K1522A67367a31063l106C22783
19301F4555b72473a18135k22812A12520m7945J39348a30825e5890j90752C57542
19290G9607c94749a65346A36264a23940k8279m8746c4295D1113J58272b94053
19279A71968f3972G1893a97721A39761d082D6515a93161f8099l67169A19481l0242
19268H9239k450f1733k19050d1123D0974g807C9545a28609M3389k25232j31720
$$ plain form
19257 -442172 32252 139162 -37630 -573588 -93332 38001 -69644 -385881 -67861 -135501 -190311
19246 -190311 -125854 -178016 -253335 -36210 -100411 54591 -36708 -95575 -41292 66617 -89545
19234 -462 319661 -212862 -158158 205204 -227079 -48300 -276230 -340195 83162 -282645 -209728
19223 -209728 -163597 165203 -150663 -123100 -48689 126479 -90584 -69791 -56016 -174565 -146549
19212 -146549 -43754 19864 164931 -246016 107794 -62264 -71954 -98991 -29991 -263976 -44566
19200 -16932 -194097 168976 -94330 -96409 -246642 4351 -241550 88898 229686 172275 -186986
19188 275236 126397 5823 63735 -263761 45536 53454 109536 509643 -92941 -56781 26338
19176 -441344 307136 -388983 138703 -114160 -84507 -65757 -201343 -79275 -217785 47370
$$ packed form
19257d42172C2252J06910c7630n35958i3332C8001f9644l16237f7861o7640n4810
19246a90311O4457n2162p5319c6210o4201E4591c6708n8867d1292F6617h9545
19234d62C19661b12862N4704B05204b27079d8300k27930o3965H3162b82645P2917
19223b09728M6131A65203a50663K7563d8689A26479i0584K0793J3775j18549K8016
19212a46549d3754A9864J45067b46016A07794f2264r690k7037b9991k33985d4566
19200a6932j77165A68976i4330k079j50233D351b41550H8898J40788n7411a86986
19188B75236A26397E823N7912b63761D5536P918N6082M00107i2941L6160B6338
19176d41344C07136c88983A38703a14160K9653J8750j35586g9275j38510D7370
$$ plain form
19165 -190971 314748 72763 146486 112260 -20172 -74439 -159934 203471 -351727 -98241 -7489
19153 30352 -201141 -59723 -90264 74681 -174332 -21680 -144660 317937 154066 -192464
19142 257634 -261087 -113777 -57418 -57436 102947 30865 -23449 -183580 -28946 96622 156696
19131 156696 69526 120784 -181267 -65085 -175990 -156414 68723 -70282 -153878 10339 309681
19120 309681 -171483 -46954 -512708 -147684 -330770 189580 65447 -51541 171065 -262832
19109 -217160 -121454 -69084 -73468 -15969 -168714 141840 -424664 182028 -295205 149447
19098 130565 -83179 136836 -157118 -90749 58079 -58114 -169830 -59409 -183650 -154713 -155886
19087 -155886 211643 100523 153443 -316785 132567 -63619 -99356 -1783 -84198 -205257 -324400
$$ packed form
19165a90971C14748G2763P3723l4226b0172n4267q5495B03471c51727i8241g489
19153C0352b01141e9723l0541G4681a74332b1680j22980C17937A54066a92464
19142B57634b61087a13777N6359j8A02947C0865b3449j60131b8946I6622O0074
19131A56696F9526N1258a81267f5085j10905J9576F8723g0282q3596A0339K99342
19120C09681a71483d6954m65754a47684j83086A89580F5447e1541A71065b62832
19109b17160R5706N2370m384a5969j52745A41840d24664A82028b95205A49447
19098A30565h3179A36836a57118O6369E8079e8114j11716e9409j24241K8937j173
19087a55886B11643A00523N2920c16785A32567f3619l5737a783q2415j21059j19143
$$ plain form
19076 -324400 176197 -133493 -275853 -507836 -273426 -290788 -86351 -255935 -57551 -89619
19066 -89619 -80966 95207 -188257 -2142 35323 -77180 -186018 -139889 -7991 -1630 -372131 187594
19053 -41697 113660 -145148 102540 -416288 -185045 18755 -83942 65340 17473 -122805
19042 -224356 -51741 -295621 15697 130710 259590 76810 -159549 21712 46549 208394
19032 208394 92079 40705 -76024 -184770 -101220 -57287 89674 192425 -318788 -159986 -171943
19021 -171943 -492028 -206815 -87318 108917 -44612 -250543 -18883 -19451 -7664 -305299 -104921
19009 277698 -151203 -227690 189048 312488 -332022 131492 222863 843 -263095 -324603 -24984
18997 -9552 23641 -207089 -298524 198844 55350 -281044 18970 -9589 214483 5419 -253292
$$ packed form
19076c24400A76197a33493j42360k31983K34410j7362h6351j69584e7551l2068
19066h9619Q653I5207a88257b142C5323g7180j08838M6129g991a630l70501A87594
19053d1697A13660a45148A02540d16288a85045A8755h3942F5340A7473a22805
19042b24356e1741k43880A5697J15013J28880G6810a59549B1712K4837J61845
19032B08394I2079D0705g6024j08746Q3550M3933H9674J02751c18788J58802j1957
19021a71943l20085b06815h7318A08917d4612k05931a8883n68g664k97635a04921
19009B77698a51203p6487A89048J23440c32022A31492R1371H43b63095o1508b4984
18997i552B3641b07089r1435A98844E5350b81044A8970i589B14483E419b53292
$$ plain form
18985 -43815 204240 -12878 74988 108168 -233018 -137726 163838 -268804 257219 -144198
18974 274541 25465 -109038 93660 -163912 -74549 264864 -327139 160544 -346215 37619
18963 25864 -207413 -488344 -172230 79658 -225704 115016 -5430 -393914 -43614 -184556
18953 -184556 -212399 -48050 -205343 -39654 -189109 -143019 200143 48312 -51214 -37411 88935
18941 -44174 -304519 220229 36649 107626 187440 -144205 -130993 -167920 51852 -129338 -25845
18929 -136471 363833 -257373 235237 -12154 -465783 -15333 67049 280563 3096 77896 6808
18917 11314 116976 -131684 4859 -38923 -110052 -193163 -371169 355037 179920 -101890 -537261
18906 -537261 -101178 48067 -7336 137728 -235809 138366 -211536 -39513 -194457 -222394
$$ packed form
18985d3815B04240a2878G4988L3180b33018R5292A63838b68804B57219a44198
18974B74541B5465a09038I3660a63912g4549B64864c27139A60544c46215C7619
18963B5864b07413k80931a72230G9658b25704A15016e430l88484d3614j40942
18953a84556k7843d8050j57293c9654j49455M6090B00143D8312e1214J3803H8935
18941d4174k60345B20229C6649P0977P9814a44205J3212l6927E1852a29338b5845
18929a36471C63833b57373B35237a2154m53629a5333F7049K13514C096P4800F808
18917A1314J05662a31684D859c8923p1129q3111j78006C55037j75117a01890m35371
18906e37261a01178D8067g336A37728b35809A38366b11536c9513j54944k7937
$$ plain form
18896 -222394 93525 -201973 -220840 -24582 169510 -314379 -219899 196627 154378 -70007 93513
18884 -89685 237580 -95919 -210056 -65343 105546 -138874 -301019 18825 8667 -285464 398303
18872 151813 333683 -91032 -64738 183019 -177761 219816 138980 -219614 -3364 243818
18861 23271 -81608 163677 -164871 -37314 204096 -11733 -3890 98135 -73804 227069 60470
18849 174785 -92458 68468 538 63952 -234646 -147370 -40798 -118557 -169143 -104243 -194906 -122213
18837 -122213 -41729 -90906 -83215 -180931 -13993 -171037 -287552 -52408 15457 -40979 -108380
18826 -108380 -320584 9468 -167356 43910 -168868 -130383 -53909 123253 221771 93376 -81423
18814 -140593 -373579 -80408 55475 -258285 89543 42156 272713 -196042 92674 -149246
$$ packed form
18896b22394I3525b01973j8867b4582A69510c14379R4480A96627m2249g0007I3513
18884h9685B37580i5919j14137f5343A05546a38874j62145A8825H667b85464C98303
18872A51813J81870i1032K6294A83019a77761B19816q0836b19614c364B43818
18861B3271h1608A63677a64871c7314B04096a1733c890I8135g3804B27069F0470
18849A74785i2458F8468E38O3414b34646Q7276d0798p7759n0586O4900r0663P2693
18837a22213d1729m9177P691r7716a3993j57044j16515e2408A5457d0979o7401
18826a08380k12204I468a67356D3910a68868L8485e3909A23253R8518I3376h1423
18814a40593k32986h0408E5475b58285H9543D2156K30557a96042I2674a49246
$$ plain form
18803 -112625 22135 216044 252208 -6745 -179125 -161010 -39231 -39228 47904 286480 -56195 -193639
18791 -193639 65766 -176060 49966 -87053 -60986 -401909 85844 -73035 -7470 53059 -5909
18779 -199246 24703 -177596 268561 -35845 -243360 -189250 137965 -126678 -29346 -31112 -67154
18768 -67154 -86160 -275073 -142863 16543 -118126 -148975 33473 38950 -22542 -102901 -245900
18757 -245900 -170297 -164274 165829 -146253 67478 -159542 -386597 63787 -170608 -82828 -46003
18746 -46003 -355574 295559 222466 -27170 61056 -57353 282129 149250 -225664 192855
18735 160901 24493 -30178 96547 56139 -298316 -48046 -101227 -94580 114514 -67160 -67395 -128545
18723 -128545 -271224 -295567 29429 1269 162315 1268 -93041 -62275 210945 -223223 144024
$$ packed form
18803a12625B2135J93909L6164f745j72380J8115c9231LD7904K38576e6195j37444
18791a93639F5766a76060D9966h7053K6067l40923H5844g3035g470E3059e909
18779a99246B4703a77596B68561c5845k07515N4110A37965a26678b9346j766l6042
18768f7154j9006j88913J32210A6543a18126l0849C3473N477b2542q0359j42999
18757b45900P5603O023A65829a46253F7478a59542k27055F3787a70608h2828L6825
18746d6003l09571B95559p3093b7170F1056e7353B82129j32879b25664A92855
18735A60901B4493c0178I6547m0408b98316d8046n3181O647A14514f7160k35o1150
18723a28545j42679k4343B9429A269J61046A268i3041L0766B10945b23223A44024
$$ plain form
18711 -256601 261686 -26883 151170 -185039 130546 -389414 22808 -92217 -84858 -87256 187458
18699 -32034 -287176 -149644 -216006 -52782 38399 -248178 118302 -294286 -111814 49154
18688 -136319 -133346 -188447 261334 -65028 -168210 114026 -26296 243109 -19203 123156 179490
18677 179490 -122027 60050 -130983 -71576 -165564 141165 221604 108272 -219737 -56886
18666 -121552 -53776 66586 -177153 -574725 1820 -193344 43627 -45815 -135967 117665 292334
18655 292334 -375779 -47418 205067 53925 59915 10545 -38628 146394 -88604 353493 58921
18643 -109961 -393216 -169305 -113388 302371 -194560 -135739 169753 -2395 57286 -29271 -164787
18632 -164787 195918 -140874 -150276 61465 140689 244466 9830 102887 18836 -2271 -308410
$$ packed form
18711b56601B61686b6883A51170a85039A30546c89414B2808i2217P359k398A87458
18699c2034k55142J37532o6362e2782C8399b48178A18302b94286a11814D9154
18688a36319K973n5101B61334f5028j03182A14026b6296B43109a9203A23156N6334
18677A79490a22027F0050a30983N9407r3988A41165Q0439A08272b19737e6886
18666a21552e3776F6586a77153l97572A820a93344D3627d5815r0152A17665J74669
18655B92334c75779d7418B05067E3925N990A0545c8628A46394h8604C53493E8921
18643a09961k83255a69305N5917C02371a94560N8821A69753b395E7286b9271j35516
18632a64787A95918a40874r402F1465P9224J03777I830R3057A8836b271l06139
$$ plain form
18621 -308410 -98118 -223394 -268208 -124983 -129635 -178379 -27257 123527 -193608 83792 30046
18609 -183563 -10014 87210 -140277 63642 60008 -159872 -119631 244425 -60614 250225 -96765
18597 -187930 -80115 -40329 -75284 16754 -84308 -296394 -222657 73628 48182 -1582 -9421 -3877
18584 19353 30343 -264482 -71170 -67966 -24047 -238879 170799 89891 371575 62337 -35689
18572 147126 130138 -36970 116454 117879 -190211 -314394 -261507 -283943 -114404 -80358 -139656
18561 -139656 -200111 91717 282266 18868 -64115 -12088 42225 -140597 260384 -175344 -167627
18550 -167627 -57396 -167696 -97431 13871 122501 234209 -2247 -184989 -140309 18537 -87926
18538 -91587 -68716 -290748 -35506 -106469 -124091 -130817 226826 -183758 126599 -242696 -22719
$$ packed form
18621c08410i8118j25276m4814a24983m652m8744b7257A23527a93608H3792C0046
18609a83563a0014H7210a40277F3642l634a59872M0241B44425f0614B50225i6765
18597a87930h0115L9786l4955A6754h4308k12086P3737G3628k5446a582p839c877
18584A9353J0990b64482g1170L204b4047k14832A70799q0908K81684F2337c5689
18572A47126j6988c6970A16454J425a90211j24183N2887k2436a14404L4046n9298
18561a39656o0455I1717J90549A8868f4115a2088D2225a40597B60384a75344P717
18550a67627e7396j10300P0265A3871J08630J11708b247j82742M4680A8537h7926
18538i1587K2871k22032c5506p0963j7622o726B26826a83758A26599b42696b2719
$$ plain form
18526 193480 160609 39013 -54618 404557 -422972 -176201 91804 -75903 100196 -107674
18515 -49885 -183935 37772 150593 -109218 213836 -122987 -134524 5193 67929 -66129 -135528
18504 -135528 -13966 88357 92062 -74188 272715 -159480 216865 37642 -29492 -80172 97331
18492 166376 -229776 -138888 98331 -182984 254764 -49369 -106677 -32341 158731 28098 -113485
18480 -125929 -21035 351210 -58464 60098 260454 232465 -343102 -182209 -28911 359029
18469 -189117 193436 -276665 110844 -168705 -125748 -11419 -204504 62164 -196586 -253390
18459 -253390 49780 -47988 -185207 -165496 -78435 84106 181362 -14151 -60330 269290 -419553
18447 286914 -270103 298335 42268 -311221 -418 45246 -92896 -79280 -26121 -141478 105543
$$ packed form
18526A93480l2871C9013e4618D04557d22972a76201I1804g5903A00196a07674
18515d9885j34050C7772J12821a09218B13836a22987j1537E193O2736f6129o9399
18504a35528a3966H8357L705g4188B72715a59480B16865C7642b9492n0680I7331
18492A66376b29776R0888I8331a82984B54764d9369n7308c2341A58731B8098a13485
18480a25929b1035C51210e8464F0098K00356k7989c43102J60893b8911C59029
18469a89117A93436b76665A10844a68705M2957a1419j93085F2164a96586n6804
18459b53390D9780d7988j37219J9711g8435H4106R7256a4151m6179B69290d19553
18447B86914b70103B98335D2268c11221d18D5246i2896J3616b6121j15357A05543
$$ plain form
18435 -302305 92636 10784 -80849 -50367 -65665 410082 265919 14597 -12112 -198213 -162517
18424 -162517 -55379 -502357 -74740 177220 -87305 177333 164932 -67744 244956 -37999 -74589
18413 -74589 -116508 -341520 -60264 -46338 -102963 -99906 -204106 28564 64003 -68563 -22929
18401 -58861 -14457 176519 -5999 -131811 -246644 -252189 5040 -28616 -67991 -88196 218376
18389 -64927 -149204 3119 112415 147291 -64705 98206 -166164 -89489 -116314 125933 -146824
18377 -65955 -33318 2724 -143056 -292608 -175316 -204328 103821 -112431 -75448 -210303 13102
18365 -209009 119345 -176464 -174205 -186497 -21585 -211661 -343024 -28144 -208275 -111867 291590
18353 292631 -28300 -160773 -56560 65320 -37990 -140908 -365798 50440 97380 -48962 -95865
$$ packed form
18435c02305I2636A0784h0849L0482j5298D10082j44163A4597a2112j86101L5696
18424a62517e5379m46978g4740A77220h7305A77333j2401f7744B44956c7999l6590
18413g4589m1919k25012f0264J3926n6625L057j04200B8564L5439f8563b2929
18401e8861a4457A76519e999j25812j14833n545E040b8616l9375k0205B18376
18389f4927q4277C119J09296L4876f4705I8206a66164P6675k6825A25933a46824
18377f5955L2637B724a43056j49552J17292k9012A03821a12431L6983j34855A3102
18365b09009A19345a76464K259j2292b1585j90076j31363b8144j80131R6408B91590
18353B92631b8300j32473e6560F5320c7990j02918k24890E0440M6940d8962m6903
$$ plain form
18342 -95865 -117112 223676 102080 -300837 -167639 82025 -241577 -216590 224429 -189444
18331 -203362 50841 152687 -160366 102512 -44753 -158592 164616 -390568 28876 -167679
18320 26522 3136 -76145 112151 -112811 -248838 216606 175348 18054 -80341 -76341 32144
18308 -344841 -26601 386733 66566 127229 49039 -45679 159134 -166276 -112000 75670 -4905
18296 103049 -13106 314590 -368921 -115506 97666 -190133 77291 -226497 82042 -19827
18285 -62805 -242259 110354 100551 153474 -72562 -70414 -32156 -277291 194706 -91360 260446
18273 41810 -42920 54080 51314 -17118 -123012 -11556 84685 -95642 -109854 177388 -335987
18261 -52126 -263775 -16713 -81899 16577 73799 -64155 66235 132946 -244932 290401 49938
$$ packed form
18342i5865k1247B23676A02080c00837J33198H2025b41577K4987B24429a89444
18331b03362E0841J01846a60366A02512d4753j13839A64616c90568B8876a67679
18320B6522C136g6145A12151a12811j36027B16606m1258A8054h0341M000C2144
18308c44841b6601C86733F6566O0663D9039d5679A59134a66276N4276G5670d905
18296A03049a3106C14590c68921a15506I7666a90133G7291b26497H2042a9827
18285f2805j79454A10354r803N2923g2562K148c2156k45135A94706i1360B60446
18273D1810d2920E4080k766a7118j05894a1556H4685i5642j4212A77388c35987
18261e2126k11649a6713o5186A6577N7222f4155F6235O6711b44932B90401D9938
$$ plain form
18249 -19287 -68720 -131419 293203 -87716 164303 -438641 -253291 88664 110559 -161690 120546
18237 329381 94122 103054 -88348 -210140 -11144 -82323 -91951 -135771 -295553 -244437 -20543
18225 -373972 -91322 310040 -95482 20198 -44155 197995 167714 -73564 -248860 34710 -162241
18213 -101116 -56629 -13924 -61694 -38737 -40711 97788 97410 -88335 128399 18447 -145258 -412200
18201 -412200 -350156 -268590 -99551 -52386 184631 156212 -91236 -137113 -96749 230879 -8724
18189 -266823 19811 -193772 -262518 34371 300101 148888 92327 -289083 254122 312220
18179 312220 45237 594013 67334 -135661 -189214 -20870 -119752 24781 -29262 198715 33057
18167 -81202 293504 -100409 -196060 -238924 85310 -81717 16175 -195718 409646 -142048 -82744
$$ packed form
18249a9287m9433o2699B93203h7716A64303d38641J85350H8664K1895a61690A20546
18237C29381I4122Q932h8348j21792a1144p1179r628m3820j59782N1116b0543
18225c73972i1322C10040i5482B0198d4155A97995l0281g3564j75296C4710a62241
18213a01116M4487a3924m7770K2957j974I7788l78h8335A28399A8447a45258k66942
18201d12200O2044Q1566i9551M7165A84631k8419i1236m5877M0364B30879h724
18189b66823A9811a93772o8746C4371K65730A48888n6561b89083B54122N8098
18179C12220D5237N48776F7334a35661n3553b0870r8882B4781b9262A98715C3057
18167h1202B93504a00409r5651m2864H5310h1717A6175a95718D09646a42048N9304
$$ plain form
18156 -82744 77785 -176620 190642 -179443 -343791 -133439 -178661 -213216 -122462 46566 -61835
18144 140676 -100552 135764 -238469 -60487 -70101 -184601 -84874 -239526 -69939 -113368 -202610
18133 -202610 104389 394057 -84144 -154592 -286413 68130 -151218 -79292 -16832 -116712 -189146
18122 -189146 -145905 -2829 -116570 -166445 362869 81945 451789 -219519 -182175 -36342 166161
18110 -17037 56131 -239562 -236305 -142641 -31486 -72076 -91011 122638 -264799 214689 57928
18098 -34661 234277 -104019 41613 -103520 -273209 -12246 -296033 -174269 -130676 50761
18087 210550 131950 -105124 -197868 312195 -386560 -267972 -15976 112744 -173747 -51875
18076 127766 -22586 -101800 -152320 242921 -51828 -68850 283544 126614 37304 -399637 -34879
$$ packed form
18156h2744G7785a76620A90642a79443j64348a33439m5222l4555R0754D6566f1835
18144A40676a00552A35764b38469f0487r614j14500h4874j54652f9939m3429q9242
18133b02610A04389K89668h4144p0448j31821F8130a51218P1926a6832r9880p2434
18122a89146M3241b829j13741m9875C62869H1945L69844b19519L7344c6342A66161
18110a7037E6131b39562L257R3664c1486m0590j8935A22638b64799B14689E7928
18098c4661B34277a04019D1613a03520j69689a2246k83787J21764M3593E0761
18087B10550p8600a05124r2744C12195c86560J18588a5976A12744a73747e1875
18076A27766b2586p9214n0520B42921e1828j7022B83544A26614C7304c99637c4879
$$ plain form
18064 32044 -40606 -38156 -27933 10883 155969 188797 -219650 43948 -42192 -35430 7410 -242679
18051 45010 -41652 206474 170365 -52326 72942 -169739 -76334 51430 15342 7003 -76212
18039 44649 -54647 -169150 172794 113305 14124 180612 48155 -119059 -208053 -61164 122006
18027 -299878 66887 -136943 71898 51451 -254722 144807 -6610 219396 96711 130382 -36524
18015 -90272 -312481 33718 262843 -268615 104800 -273832 -29498 196233 114590 -53027
18004 39725 72911 110748 -86429 -137224 -5375 128412 16091 -510954 -248981 148697 -326941
17992 -237729 73431 120390 -65796 -244160 186782 -36315 101102 -144407 190155 272800
17982 272800 111234 -168254 15430 373524 -176222 65423 58196 870 -218553 -34669 -28285
$$ packed form
18064C2044d0606K450J0223A0883J45086L2828b19650D3948d2192O762G410b42679
18051D5010d1652B06474l6109e2326G2942a69739g6334E1430A5342G003g6212
18039D4649e4647j14503A72794n9489A4124J66488D8155a19059q8994f1164A22006
18027b99878F6887a36943G1898k0447b54722A44807f610B19396I6711L3671c6524
18015i0272k22209C3718K29125b68615A04800b73832b9498A96233q1643e3027
18004C9725L3186L7837h6429n0795e375A28412A6091e10954b48981A48697c26941
17992b37729G3431M6959f5796j78364A86782c6315A01102a44407A90155Q2645
17982B72800A11234a68254A5430L58094a76222F5423p227H70b18553c4669O384
$$ plain form
17971 -28285 229313 276987 -42101 -118237 -34209 -36336 -201023 67527 78852 -706 80564 -161885
17958 -268757 -95331 172665 199738 -180420 102950 -171627 57759 -114660 139432 -63057
17947 184265 150309 -193963 -268054 -14019 51280 161236 5796 67290 137632 -47472 88980
17935 44444 22336 -287670 357582 -164478 -198931 495865 -396444 115020 -37312 -340133
17925 -340133 -173062 -67266 -477499 156054 125878 130677 -200643 -30643 254400 164756 52055
17913 143402 148818 117429 -193106 -206216 -12213 50496 120001 87632 -252001 -117352 -32044
17901 159073 70337 -75278 146626 97045 -383677 -52946 184043 6546 -42950 -144957 133117
17889 -293014 216157 -106364 118821 189572 -90728 -250916 72060 156415 -89198 98793 -267378
$$ packed form
17971b8285B29313M7674d2101p6136c4209k127j64687F7527J1325g06H0564a61885
17958b68757i5331A72665K7073a80420A02950a71627E7759a14660A39432f3057
17947A84265l3956a93963p4091a4019E1280J09956E796O1494P0342d7472H8980
17935D4444k2108b87670C57582a64478l4453D95865c96444A15020c7312l02821
17925c40133J67071f7266m10233A56054l0176M799b00643c0643B54400q9644E2055
17913A43402N416l1389a93106j3110a2213E0496O9505l2369b52001a17352c2044
17901A59073G0337g5278A46626m9581c83677e2946A84043F546d2950j02007A33117
17889b93014B16157a06364A18821P0751i0728j60188G2060Q4355h9198I8793b67378
$$ plain form
17877 112206 -55789 154949 -136011 -28281 14443 -95438 -153832 91052 266181 -148152 -409194
17866 -409194 42719 237111 -136496 157133 118263 181347 -34972 451406 214034 125570
17856 125570 -192437 88752 177721 -16041 -196514 400744 70735 -173472 -4898 -124020 124882
17844 198265 49330 2452 -334884 64035 -281540 119691 -64889 -116272 46300 388945 -8161
17832 161970 -57935 -20456 21707 219110 171207 -186385 264780 162581 -103071 -17166
17821 -457573 166875 82648 -70262 -75185 97175 269125 345979 210399 55667 -144325 40039
17809 -151199 -8466 -271923 -215061 175572 226159 -35253 -133728 -49592 -152 -84364 90652 -190275
17796 -94774 156620 -62136 -9878 81649 -7759 20482 -153811 -539 211659 133796 44812 -10850
$$ packed form
17877A12206e5789A54949a36011b8281A4443i5438n8394I1052J75129a48152k61042
17866d09194D2719J94392a36496A57133l8870O3084c4972D51406B14034q8464
17856A25570a92437H8752Q8969a6041j80473D00744G0735a73472d898j19122A24882
17844A98265D9330B452c34884F4035b81540A19691f4889n1383D6300L42645h161
17832A61970e7935b0456B1707J97403m7903a86385B64780j02199a03071a7166
17821d57573A66875H2648g0262m923I7175J71950P6854j35580E5667a44325D0039
17809a51199h466k63457N6862A75572N0587c5253r8475d9592a52q4212I0652a90275
17796i4774A56620f2136i878H1649g759B0482a53811e39B11659p7863D4812a0850
$$ plain form
17783 -65599 289749 -322600 28190 56257 -18161 -20213 154164 -28426 153593 -90075 -100231
17772 -100231 -43843 -23959 3370 230869 264981 -9857 347009 -119896 -24285 -26521 -57214
17761 -57214 169010 250734 115284 -179186 215755 172603 -124161 -80761 170350 213627
17751 213627 177745 214915 302249 11997 21379 78445 41005 106243 173843 -102861 153338
17739 87838 158811 -34666 186944 37027 65282 -94411 34755 -208484 26003 -3765 -46187
17728 -46187 -305794 -169753 226015 56226 -252320 -82518 227336 -67795 134672 -122302
17717 -99797 -47752 -109453 213299 65348 112299 -55357 -76776 -22160 37317 73448 -225663
17705 955 146088 174907 -175747 163589 386606 -108573 116361 -109403 211126 -152551
$$ packed form
17783f5599B89749c22600B8190K8067a8161k052A54164b8426A53593i0075j0156
17772a00231d3843J9884C370K27499L4112i857C47009a19896b4285k236l0693
17761e7214A69010Q1724A15284a79186B15755m3152a24161M3400A70350M3277
17751B13627l5882L7170Q7334A1997R382N7066l7440O5238O7600a02861A53338
17739H7838P0973c4666A86944C7027K8255i4411C4755b08484B6003c765m2422
17728d6187k59607J36041B26015E6226b52320h2518B27336f7795A34672a22302
17717i9797d7752o1701B13299F5348M6951e5357k1419b2160C7317L6131b25663
17705I55J45133K8819a75747A63589K23017a08573A16361a09403B11126a52551
$$ plain form
17694 149994 -81748 427066 259346 -375477 -347908 -121352 17320 -144688 -299732 202059
17683 333570 60177 99929 -14077 -207566 -118360 9749 -34361 -205438 77120 145385 180820
17672 180820 -184880 162519 359668 244955 323911 175062 204890 169510 200736 -32390
17661 -61043 71624 260581 53877 -21287 160778 126569 114111 53758 296817 -155595 -56997
17649 -91896 -284405 -68894 -82769 -8339 31315 -104481 581920 290528 -20484 -117097 -61112
17638 -61112 159111 288650 -255717 -149986 -136085 31062 28400 5921 -6717 260500 -7943
17626 -125749 361872 125738 -66607 -11851 -24526 224606 -277520 -35615 352408 369480
17616 369480 111219 55113 -46777 -136725 118960 -59740 -151692 35494 199777 170796 125042
$$ packed form
17694A49994h1748D27066j67720c75477K7569a21352A7320a44688j55044B02059
17683C33570F0177L9752a4077j93489Q9206I749c4361j71077G7120O8265L5435
17672A80820a84880A62519J97149j14713P8956j48849K9828l5380L1226c2390
17661f1043G1624J88957E3877b1287A60778l4209j2458E3758K43059a55595e6997
17649i1896j92509f8894j3875h339C1315a04481E81920B90528b0484r6613N5985
17638f1112A59111J29539b55717J05731J3901C1062k662E921f717B60500g943
17626a25749C61872A25738f6607a1851j2675B24606b77520c5615C52408J7072
17616C69480A11219E5113d6777q9948A18960e9740r1952C5494J64283k8981m5754
$$ plain form
17605 125042 -35752 63092 -69704 -414040 -28933 -226547 25435 45252 -111718 -96395 -7938
17593 94348 226747 62117 134956 -41132 -129096 79157 -249167 85737 -125732 -89656 290194
17581 -12920 78453 -110727 69737 -11635 20212 172673 -73782 -286730 94260 -139787 -83650
17570 -83650 97415 -283282 98950 -44606 238161 -137204 276375 -128610 264518 -21566
17559 5461 41469 -86860 575686 -100219 285034 101083 -21811 76682 105513 -38702 -172301
17548 -172301 569945 275179 -290563 -78626 260766 -152525 236938 -83725 60144 -201266
17537 59717 171566 -174532 99776 -67016 300743 229059 -99949 94351 -222579 -215895 -195917
17526 -195917 -178046 -17253 323893 -73950 285987 194376 188410 -40993 -85031 49199 238 162504
$$ packed form
17605A25042c5752F3092f9704l44336b8933j97614B5435J9817a11718J5323g938
17593I4348J32399F2117P2839d1132q7964G9157b49167H5737a25732L6076B90194
17581a2920G8453a10727F9737a1635B0212J52461g3782k12948I4260a39787N6137
17570h3650I7415b83282I8950d4606B38161a37204B76375a28610B64518b1566
17559E461L6008h6860E75686a00219B85034A01083b1811G6682K8831c8702j33599
17548a72301E69945B75179b90563g8626B60766a52525B36938h3725F0144b01266
17537E9717J11849a74532I9776f7016C00743p1684i9949I4351b22579O684J9978
17526a95917J7871a7253C23893g3950B85987r1611n966d0993m4038D9199B38J62266
$$ plain form
17514 162504 54645 -21838 -128849 19754 50505 102798 -130015 -3456 -111176 113089 -23039
17502 -22136 135015 22655 -230747 32515 81645 1679 -123932 147422 178425 -14548 38552
17490 318503 143940 -397846 -15200 458326 -57739 47736 187051 51562 253675 108175
17479 -79384 250660 291727 -162791 -241442 77777 23946 -64898 305500 388001 192014 514679
17468 514679 114743 37231 227177 336852 -45878 -79099 262324 32810 440382 -316648
17457 89078 -9538 499852 165302 364744 293502 469392 381544 -173938 54626 -86393 203104
17445 512662 -98912 115769 199439 -12268 25913 500591 -10891 278851 35706 140309 154024
17434 154024 255518 168281 430880 160588 124114 203050 51000 257392 72484 389312
$$ packed form
17514A62504E4645b1838j07011A9754L0751N2293a30015c456j07720A13089b3039
17502b2136A35015B2655b30747C2515M9130A679a23932A47422L1003a4548C8552
17490C18503A43940c97846a5200D58326e7739D7736J39315E1562K02113A08175
17479g9384B50660M1067a62791p8651G7777B3946f4898C05500Q2501A92014L22665
17468E14679A14743C7231J89946J09675d5878l3221B62324C2810M07572c16648
17457H9078i538D99852A65302J99442p1242J75890q7848a73938E4626h6393B03104
17445E12662i8912A15769Q3670a2268B5913M74678a0891B78851C5706J04603J3715
17434A54024J01494q7237K62599A60588l6474P8936E1000K06392G2484L16828
$$ plain form
17424 389312 396708 433135 244536 27926 395407 474598 109583 422165 102058 160258 170644
17413 170644 323922 -45279 186104 -8982 74976 274765 516563 19308 130567 58977 340323
17402 340323 342759 -67969 376401 327556 463406 186202 -245441 41289 -551 15407 144633
17391 144633 89774 154806 71681 242847 110277 118362 72718 -139309 346501 269171 -10623
17379 158607 46196 83696 -173276 51658 276715 -142922 134560 -41230 151606 193542
17369 193542 153294 -46894 290564 256645 453031 17544 36703 9088 -291736 77880 89525
17358 89525 50470 34622 -207777 101959 139951 15157 27834 134043 161070 158704 32561
17346 225319 126224 -145350 54289 157130 -114046 138044 262084 26534 359260 285828
$$ packed form
17424C89312P396L6427j88599B7926L67481P9191A09583L12582A02058N8200J0386
17413A70644J53278d5279A86104h982G4976J99789K41798A9308J11259E8977K81346
17402C40323K436f7969C76401m8845J35850A86202b45441D1289e51A5407J29226
17391A44633n4859O5032G1681J71166A10277Q085m5644a39309C46501p7330a0623
17379A58607D6196L7500a73276E1658K25057a42922A34560d1230A51606M1936
17369A93542m0248d6894B90564l3919J96386A7544J9159I088b91736G7880J1645
17358H9525l9055j5848b07777A01959L7992A5157J2677J06209K7027k366C2561
17346B25319r9095a45350E4289J02841a14046A38044J24040B6534L32726p3432
$$ plain form
17336 285828 423499 -115466 35465 -82940 186445 37237 465215 247773 354909 312652
17326 312652 442708 117054 -80081 -4183 103078 -23124 29406 291683 50084 238216 255723
17315 255723 125330 172650 60156 -86101 343193 43814 205456 179395 141623 243462 260169
17304 260169 182222 26394 265910 264992 62588 105693 351179 197260 136685 205540 160335
17293 160335 18931 -41563 -4148 139560 212920 64323 -50665 198232 18300 -6945 74609
17281 117318 86577 71974 -47841 414930 156409 287738 41766 399789 -16688 358344
17270 87540 118116 297464 55321 -74469 -124085 89986 -1747 253764 635917 15598 4137
17258 -130545 -74081 210643 10130 -170641 252522 636427 170548 209610 -62581 -265337
$$ packed form
17336B85828J37671a15466C5465h2940A86445C7237M27978k17442J07136m2257
17326C12652J30056A17054h0081d183A03078b3124B9406K62277E0084J88132J7507
17315B55723A25330M7320F0156h6101C43193D3814J61642k6061l7772J01839J6707
17304B60169p7947B6394K39516r18F2588M3105K45486j53919o0575O8855m5205
17293A60335A8931d1563d148A39560P3360F4323e0665A98232A8300f945G4609
17281A17318l0741j4603d7841D14930A56409J31329D1766L58023a6688C58344
17270H7540L0576J79348E5321g4469m9616H9986a747B53764L82153A5598D137
17258a30545N6464B10643A0130a70641B52522L83905A70548L9062f2581k02756
$$ plain form
17248 -265337 229319 182471 -109322 -96260 417432 159519 308253 237594 182766 334864
17238 334864 479872 4714 250668 114520 197545 -144734 -21500 489161 255824 543690
17228 543690 423384 195488 286252 6002 192237 -1363 237388 13017 59463 315845 407428
17217 407428 -14052 321715 378059 71513 422352 -139721 89867 13778 38075 174827 151372
17206 151372 216069 230971 513507 128846 159322 409235 332569 16910 370533 542845
17196 542845 359662 -161550 -216930 214786 166916 143059 -166782 242259 272337 253066
17186 253066 113736 81489 202536 102240 362058 160439 334355 192701 223916 106870
17175 242446 75708 212208 213160 73809 227138 178146 185132 68593 255283 407377 376681
$$ packed form
17248b65337B29319m6848a09322J3062D17432A59519J48734p0659n4828J52098
17238C34864J45008D714K45954A14520Q3025a44734b1500D89161k33337K87866
17228E43690j20306A95488R0764F002J86235a363B37388A3017M6446K56382R1583
17217D07428a4052C21715N6344G1513L50839a39721H9867A3778K4297J36752k3455
17206A51372O4697J4902K82536A28846L0476K49913p6666A6910L53623J72312
17196E42845j83183a61550n5380B14786m7870k3857a66782B42259L0078j9271
17186B53066A13736l2247J21047j00296K59818A60439J73916j41654L1215A06870
17175B42446G5708J36500R52G3809J53329m8992O986F8593J86690J52094l0696
$$ plain form
17164 376681 21478 388062 282106 191693 214841 -8247 -32489 260788 304171 -17525 135741
17152 248419 391484 231330 278070 154641 234552 381277 178068 184439 181341 363573 557698
17141 557698 459259 58360 -29129 -5885 -88753 169220 93606 -143472 425577 107679 297436
17130 297436 530878 302881 343294 354672 243279 -63801 524494 24384 491859 202596
17119 314648 565823 182679 339228 653921 37573 461503 371395 456713 328218 329065 -43170
17107 302842 326847 30868 181172 249146 325904 393340 562718 38337 377566 357547 131844
17095 277582 496261 117398 443333 212338 361842 237048 361717 377917 154692 515250
17085 515250 281605 369834 386552 379608 568903 486391 153790 241375 67508 132324 252357
$$ packed form
17164C76681B1478L66584j05956r0413K3148h247k4242B60788M3383a7525A35741
17152B48419J43065j60154M6740j23429P9911J46725A78068O371l098J82232J94125
17141E57698r8439E8360b9129e885q2868A69220p5614a43472D25577A07679J89757
17130B97436K33442k27997M0413J1378j11393f3801E24494B4384M67475B02596
17119C14648K51175A82679J56549L14693C7573M23930r0108Q5318j28495Q47d3170
17107C02842K4005C0868J50304O7974P6758O7436J69378C8337L39229k0019A31844
17095B77582K18679A17398L25935B12338J49504j24794J24669J6200A54692L60558
17085E15250k33645Q8229J6718o944J89295q2512A53790Q7585F7508O4816J20033
$$ plain form
17074 252357 211883 285293 274414 358556 526504 298028 344069 485451 328023 190290
17064 190290 102950 628113 114878 599852 185762 216580 433581 402515 601276 479501
17054 479501 537509 444433 380988 509281 339969 197658 267132 805240 480324 363795
17044 363795 574399 709049 567800 203645 745530 469905 308353 420754 401850 452658
17034 452658 532427 617728 387331 570599 536066 327031 552943 534561 366131 213521
17024 213521 369791 583436 494068 190466 687121 629769 553690 430454 558353 728487
17014 728487 612954 643491 164411 715094 467513 250437 813628 639429 253150 418669
17004 418669 190167 316104 496230 590228 865968 412260 639770 938088 604122 515569
$$ packed form
17074B52357m0474P3410j0879Q4142J67948k28476M6041J41382j57428j37733
17064A90290q7340N25163A14878M84974A85762L0818K17001l1066J98761j21775
17054D79501N8008r3076o3445J28293j69312j42311O9474N38108l24916j16529
17044C63795K10604J34650j41249B03645N41885k75625j61552J12401j8904N0808
17034D52658P9769Q5301k30397J83268l4533k09035K25912j8382j68430j52610
17024B13521J56270K13645q9368A90466M96655n7352p6079j23236J27899J70134
17014G28487j15533L0537A64411N50683k47581k17076N63191j74199B53150J65519
17004D18669A90167J25937J80126R3998K75740D12260K27510K98318l33966q8553
$$ plain form
16994 515569 369609 332751 574887 516631 876379 515619 805923 155955 894036 842099
16984 842099 825176 381213 602359 705528 713515 520685 533122 788739 635801 746013
16974 746013 564606 907743 757073 913300 844899 648025 477282 843442 622474 857007
16964 857007 871760 888224 506813 499583 436479 639499 810365 898716 879757 1183774 937971
16953 937971 874341 745400 736190 819996 1017211 536212 694479 1095546 753814 789819
16943 789819 1055974 958673 927145 775976 804052 882462 1003262 765778 946053 942564 1159960
16932 1159960 541302 742884 966224 1206292 865160 829633 857522 940377 1023368 891489
16922 891489 1135835 828945 663971 1269372 1253603 1206649 982398 896732 1061518 1136529
$$ packed form
16994E15569j45960l6858K42136n8256L59748l60760K90304A55955P38081n1937
16984H42099j6923C81213K21146J03169P987j92830J2437K55617j52938J10212
16974G46013j81407L43137j50670J56227o8401j96874j70743L66160k20968K34533
16964H57007J4753J6464l81411p230o3104K03020J70866Q8351j8959L04017k45803
16953I37971o3630j28941r210Q3806J97215m80999J58267M01067l41732L6005
16943G89819K66155r7301l1528j51169K8076P8410J20800k37484J80275l489K17396
16932A159960E41302K01582K23340K40068l41132l5527K7889Q2855Q2991j31879
16922H91489K44346l06890j64974O05401j5769m6954k24251q5666J64786P5011
$$ plain form
16912 1136529 817525 1000229 1358348 626032 913635 1145224 1099460 1252493 1184665 1189227
16902 1189227 1183815 1237101 1199952 1215514 1179541 1537426 1304487 1467827 1388657 1372961 1518006
16891 1518006 1375725 1153915 1553230 1533638 1447801 1252299 1486606 1394400 1406954 1271074
16881 1271074 1281642 1456854 1601839 1460388 1618360 1767913 1642426 1483019 1516679 1649685
16871 1649685 1744005 1504091 1702850 1924673 1686255 1844615 1796427 1547477 1901816 1754895
16861 1754895 1881640 1733528 2121460 2198923 2059876 2348889 1935523 2138469 2095089 1622946
16851 1622946 2104813 1972380 2165688 2100036 2194058 2549525 2521219 2589736 2334356 2600395
16841 2600395 2436033 2407363 2857990 2899381 2809814 2788844 2941764 2944477 2751632 3146384
$$ packed form
16912A136529l19004J82704L58119F26032K87603K31589m5764J53033o7828M562
16902A189227n412N3286l7149J5562l5973L57885k32939J63340p9170j5696J45045
16891A518006j42281k21810L99315j9592q5837j95502K34307r2206J2554j35880
16881A271074J0568J75212J44985j41451J57972J49553j25487j59407L3660J33006
16871A649685R4320k39914J98759K21823k38418J58360m8188k48950L54339j46921
16861A754895J26745j48112L87932P7463j39047K89013m13366K02946m3380m72143
16851A622946M81867j32433J93308o5652R4022L55467k8306O8517k55380K66039
16841B600395j64362k8670M50627M1391q9567k0970J52920K713j92845L94752
$$ plain form
16831 3146384 2994722 3245776 3172823 2940403 3017798 3172954 3094639 3477273 3065403 3346680
16821 3346680 3326441 3493403 4013335 3830584 3729398 3891785 3691530 3755628 4048092 3834456
16811 3834456 4050088 4133061 4314440 4422977 4381288 4655268 4523168 4665162 4718514 4628347
16801 4628347 4676790 5130499 5062220 5350881 5143979 5489978 5756432 5844047 5719658 6022821
16791 6022821 6629821 6075245 6550800 6711577 6892723 6686735 7132353 7422012 7517181 7484346
16781 7484346 7696798 7902812 8188249 8102698 8650383 8920713 8904865 9370918 9392368 9965081
16771 9965081 10020729 10524617 10654674 10879948 11557605 11530993 11921492 12225705 12915179 13447003
16761 13447003 13563253 14319601 14702587 14969347 15701131 16155096 16361979 17074895 18127194
$$ packed form
16831C146384j51662K51054p2953k32420P7395J55156p8315L82634m11870K81277
16821C346680k0239J66962N19932j82751j01186J62387k00255O4098K92464k13636
16811C834456K15632Q2973J81379J08537m1689K73980j32100J41994N3352r0167
16801D628347M8443M53709o8279K88661k06902L45999K66454Q7615j24389L03163
16791F022821O07000n54576M75555J60777J81146k05988M45618K89659R5169l2835
16781G484346K12452K06014K85437q5551N47685K70330j5848M66053K1450N72713
16771I965081N5648N03888J30057K25274O77657k6612L90499L04213O89474N31824
16761A3447003J16250P56348L82986K66760P31784M53965K06883P12916J052299
$$ plain form
16752 18127194 18579156 19229129 19807873 20770634 21630780 22136806 23199534 24330716 25441148
16743 25441148 26590818 27465052 29036132 29805574 31740101 33346126 34723556 36566059
16735 36566059 38190047 40287844 42348942 44714974 47283845 49877000 52742362 55794043
16727 55794043 59240838 62539732 66900709 70794867 75446009 80156730 85210845 91307710
16719 91307710 97165381 103524031 110598553 117856210 125707825 133793546 142819868 151639414
16711 151639414 160603433 169887560 179340520 188083898 196381922 204050737 210866587 216301627
16703 216301627 220515954 222823401 223748642 222727329 219924067 215409691 209839819 202495127
16695 202495127 194792080 185830411 176806936 167344922 158327316 149486659 140341043 131774584
$$ packed form
16752A8127194M51962O49973N78744R62761Q60146N06026J062728J131182J110432
16743B5441148J149670Q74234J571080P69442J934527J606025J377430J842503
16735C6566059J623988K097797K061098K366032K568871K593155K865362L051681
16727E5794043L446795L298894M360977L894158M651142M710721N054115O096865
16719I1307710N857671O358650P074522P257657P851615Q085721R026322Q819546
16711A51639414Q964019R284127R452960Q743378Q298024P668815O815850N435040
16703B16301627M214327K307447R25241j021313k803262m514376n569872p344692
16695B02495127p703047q961669r023475r462014r017606q840657r145616q566459
$$ plain form
16687 131774584 123428903 115590858 108429116 101474152 95386534 89184629 83364826 78076393
16679 78076393 73155269 69075689 64201227 60416193 56794627 53608704 50503504 47510060
16671 47510060 45136504 42595950 40291159 37977517 36482389 34510086 32877645 31084675
16663 31084675 29418612 28494509 27256062 25487335 24636280 23533213 22771690 21610748
16655 21610748 20821773 20072569 19180864 18196660 17525095 16743178 16407619 15727386 15178616
16646 15178616 14704032 13848162 13536435 13305377 12815926 12548555 11819049 11663433 11205302
16637 11205302 11090704 10432908 10177349 9829698 9365436 8978514 9283674 8739053 8377870
16628 8377870 8166992 7722593 7830558 7405605 7325014 7295637 7218924 6650958 6467381 6290703
$$ packed form
16687A31774584q345681p838045p161742o954964o087618o201905n819803n288433
16679G8076393m921124m079580m874462l785034l621566l185923l105200k993444
16671D7510060k373556k540554k304791k313642j495128j972303j632441j792970
16663C1084675j666063r24103j238447j768727q51055j103067p61523j160942
16655B1610748p88975p49204q91705r84204o71565p81917l35559o80233n48770
16646A5178616m74584q55870l11727k31058m89451k67371p29506j55616m58131
16637A1205302j14598o57796k55559l47651m64262l86922L05160n44621l61183
16628H377870k10878m44399J07965m24953q0591k9377p6713n67966j83577j76678
$$ plain form
16618 6290703 6450328 6249659 5797620 6180181 5425086 5372210 5175071 5449251 5256143 5039153
16608 5039153 4850948 4755458 4434784 4601257 4412195 4551269 4487232 4304143 3933160 3840700
16598 3840700 3619997 4124210 3302419 3817441 4051903 3670246 3514008 3406498 3330854 3324105
16588 3324105 3169268 3233732 2819711 2911943 3210417 2808835 2785688 2994728 2570164 2963105
16578 2963105 2560358 2522031 2589087 2659383 2444077 2411970 2515615 2428815 2212100 2254416
16568 2254416 2003821 2150357 1888893 1947259 2278488 2152404 2073702 1802831 1852771 1968605
16558 1968605 1976696 1793544 2108871 1966771 1702855 1677509 1453588 1385593 1145408 1770487
16548 1770487 1551829 1392049 1553660 1673907 1419669 1701407 1568468 1199137 1652227
$$ packed form
16618F290703J59625k00669m52039L82561p55095n2876j97139K74180j93108k16990
16608E039153j88205r5490l20674J66473j89062J39074o4037j83089l70983r2460
16598C840700k20703N04213q21791N15022K34462l81657j56238j07510p5644o749
16588C324105j54837O4464m14021R2232K98474m01582k3147K09040m24564L92941
16578B963105m02747l8327O7056P0296k15306l2107J03645q6800k16715M2316
16568B254416k50595J46536k61464N8366L31229j26084p8702k70871M9940J15834
16558A968605Q091j83152L15327j42100k63916k5346k23921o7995k40185O25079
16548A770487k18658j59780J61611J20247k54238K81738j32939l69331M53090
$$ plain form
16539 1652227 1506986 1414939 1401539 1451008 1285485 1637107 1354747 1097550 1204624 1114543
16529 1114543 1306582 1411724 1024287 1114943 1067002 1099739 971937 1163181 1263965 734063
16519 734063 1251611 1014432 1075553 1056355 1076342 1204709 1194849 865365 900002 986267 596939
16508 596939 960305 909144 646934 1116932 1083616 671252 864509 964178 949950 730003
16498 730003 963699 571155 532967 643850 741576 584045 645315 883707 747928 723272
16488 723272 847060 741359 920245 764843 653573 722396 669269 667951 845813 567260
16478 567260 751050 200735 575145 817806 545129 601208 773099 514537 548670 484479
16468 484479 602690 558913 842523 610119 347025 453396 348463 587948 288327 446299
$$ packed form
16539A652227j45241r2047j3400M9469j65523L51622k82360k57197J07074r0081
16529A114543J92039J05142l87437R0656m7941L2737j27802J91244J00784n29902
16519G34063N17548k37179O1121j9198J9987J28367r860l29484L4637Q6265l89328
16508E96939L63366n1161k62210M69998l3316m12364J93257R9669j4228k19947
16498G30003K33696l92544l8188J10883R7726j57531O1270K38392j35779k4656
16488G23272J23788j05701J78886j55402j11270O8823n3127j318J77862k78553
16478E67260J83790B00735L74410K42661k72677N6079J71891k58562L4133o4191
16468D84479J18211m3777K83610k32404k63094J06371j04933K39485B88327J57972
$$ plain form
16458 446299 723247 467534 228954 572563 667534 628269 440510 268590 441005 441752
16448 441752 688723 460104 598722 392504 264693 370787 690006 375057 232652 388852
16438 388852 522106 544853 451352 432984 252076 353513 462226 213313 537279 345539
16428 345539 339824 115515 532299 113409 404120 564356 307392 62608 -58489 541894
16417 96129 517449 113471 211534 193061 156834 284714 268360 341776 362182 463158 430027
16406 430027 201709 226484 231429 251979 88596 172501 388130 252861 413928 570077 422322
16395 422322 638809 423494 313658 476332 -150624 381916 275158 370888 359192 252866
16385 252866 367144 551185 371976 532496 7710 294360 61587 108920 170443 427569
$$ packed form
16458D46299K76948k55713B28954L43609R4971l9265j87759j71920J72415P47
16448D41752K46971k28619J38618k06218j27811J06094L19219l14949j42405J56200
16438C88852J33254K2747r3501j8368j80908J01437J08713B13313L23966j91740
16428C45539n715A15515M16784A13409K90711J60236k56964F2608e8489E41894
16417I6129M21320A13471R8063j8473l6227J27880j6354P3416K0406J00976l3131
16406D30027B01709K4775M945K0550H8596Q3905K15629j35269J61067J56149j47755
16395D22322K16487k15315j09836J62674a50624C81916j06758R5730j1696j06326
16385B52866J14278J84041j79209J60520G710K86650F1587M7333O1523K57126
$$ plain form
16375 427569 356328 479489 385363 383386 48002 215543 -4877 321992 257597 303471 392063
16364 392063 -25282 -38052 127701 511801 262594 166464 227215 256521 -4434 327242 63351
16352 277719 -18631 94073 5741 148905 256927 115073 314248 290262 456621 317776
16342 317776 295676 -65836 172559 -120910 316674 595385 62992 -194272 42374 207859
16332 207859 244293 300861 190424 167465 116448 129393 -247852 491886 359016 -185583
16321 478448 104749 22687 73319 331494 -110767 175385 317952 207851 186102 279296
16311 279296 398428 -83074 372170 198901 -67881 378741 -89374 119306 5715 245591
16301 245591 127929 202175 251595 22004 424217 509591 370187 281201 133344 368398
$$ packed form
16375D27569p1241J23161r4126j977D8002J67541d877C21992o4395M5874Q8592
16364C92063b5282j2770A27701L84100k49207r6130O0751K9306d434C27242F3351
16352B77719a8631I4073E741J43164J08022A15073J99175k3986J66359j38845
16342C17776k2100f5836A72559a20910C16674K78711F2992a94272D2374J65485
16332B07859L6434N6568j10437k2959n1017J2945b47852D91886j32870a85583
16321D78448A04749B2687N0632K58175a10767A75385J42567j10101k1749R3194
16311B79296J19132h3074C72170j73269f7881C78741h9374A19306E715K39876
16301B45591j17662P4246M9420B2004M02213Q5374j39404q8986A33344K35054
$$ plain form
16291 368398 103933 411423 376011 157847 -44850 341389 160804 -217082 304874 75631
16280 342538 53455 -68579 -11029 104973 366165 -69444 138097 285027 115978 305007
16270 305007 25078 122581 274809 -99163 80757 324719 67181 397178 80882 153547 -30059
16258 161898 254353 202559 63742 236923 529189 340902 117462 77387 144387 147210 129746
16247 129746 349965 504654 245843 302928 327821 -39150 244957 -47169 53777 111550 -117930
16235 -264504 34893 118590 -108410 -125302 37049 116547 -100680 -205873 -57963 343459 125767
16223 643466 -88953 86208 56932 19451 19678 280576 264423 246271 333893 268732 -57852 102370
16210 117985 666473 10006 420061 17705 59494 -197299 403486 43957 137064 140663 121545
$$ packed form
16291C68398A03933L07490l5412A57847d4850C41389A60804b17082C04874G5631
16280C42538E3455f8579a1029A04973K61192f9444A38097J46930A15978J89029
16270C05007B5078R7503J52228i9163H0757K43962F7181L29997H0882P2665c0059
16258A61898R2455n1794F3742J73181K92266j88287A17462m0075O7000K823j7464
16247A29746K20219J54689B45843N7085K4893c9150B44957d7169E3777N7773a17930
16235b64504C4893Q3697a08410j6892C7049P9498a00680j05193e7963C43459A25767
16223F43466h8953H6208k9276A9451K27K60898j6153j8152Q7622o5161e7852A02370
16210A17985N48488A0006M10055A7705M1789a97299D03486D3957R3107L599j9118
$$ plain form
16199 121545 129584 26873 57085 -260596 125503 85409 -101843 -215872 119798 3519 -238508
16187 -100551 -13468 198884 223489 352749 -94391 222077 152169 -19235 33483 282413 -212226
16175 125954 -122546 98809 183710 13044 72756 -134167 -28252 334425 -1705 -26552 202162
16163 9368 238918 -49951 146657 -4414 -20037 -106196 -184343 282872 -234487 -179191 58963
16151 -286755 -105466 -156297 297643 89698 224877 189024 74317 -402514 -252047 -50928
16140 292275 50564 -100842 -110595 132564 166250 -288544 336793 257475 227223 200988 -135076
16128 -62264 61070 -61114 142738 1132 212458 -98347 23995 272803 38698 359922 -315103
16116 -34217 51962 -146354 -57978 254274 -111892 -16628 35897 -263063 247898 57438 90831
$$ packed form
16199A21545Q039B6873L0212b60596A25503m0094a01843j14029A19798C519b38508
16187a00551a3468A98884K4605J29260i4391B22077o9908a9235C3483K48930b12226
16175A25954a22546I8809Q4901A3044N9712a34167b8252C34425a705k4847B02162
16163I368K29550d9951A46657d414j5623q6159p8147B82872b34487N5296E8963
16151b86755a05466n0831B97643H9698J35179l5853G4317d02514J50467e0928
16140B92275E0564a00842r753A32564L3686b88544C36793p9318l0252k6235a35076
16128f2264F1070f1114A42738A132K11326i8347B3995K48808C8698L21224c15103
16116c4217E1962a46354e7978B54274a11892a6628C5897b63063B47898E7438L3393
$$ plain form
16105 90831 -122133 -60921 87825 -88840 -122490 -12496 48873 317180 23714 -154663 32216
16093 53864 147566 66051 -158765 121106 119009 -145445 -17326 -141779 -87561 166110 262628
16082 262628 -99538 -59611 73242 -205022 -74186 -30830 -84214 -91318 24829 -205274 -4821
16070 -200590 -183954 124935 114928 -73712 -12661 90084 14220 -40003 608528 -81368 156204
16058 -65928 -186801 -264327 -178937 118704 -42246 139088 -185702 -189475 -4547 -64320 -303749
16047 -303749 -89459 8317 -306184 8872 186360 -18154 96260 -14082 -24679 137287 3314
16035 52896 -8930 124569 -352970 -44912 -215012 126919 -293004 119157 -85829 60805 50829
16024 50829 -327329 -57751 27511 -48600 -37218 -494888 113519 90751 186194 228153 13423
$$ packed form
16105I0831a22133f0921H7825h8840l3650a2496D8873K68307B3714a54663C2216
16093E3864R3702F6051a58765A21106k097a45445a7326j24453N4218A66110R6518
16082B62628i9538L9927G3242b05022g4186c0830n3384p104B4829b05274d821
16070b00590J6636A24935j0007g3712a2661I0084A4220d0003F08528h1368A56204
16058f5928j20873p7526Q5390A18704d2246A39088a85702l773d547n9773k39429
16047c03749h9459H317c06184H872J77488a8154I6260a4082j0597A37287C314
16035E2896h930A24569c52970d4912j70100A26919b93004A19157h5829F0805r976
16024E0829c27329e7751B7511d8600J1382m57670A13519k2768R5443M1959A3423
$$ plain form
16012 -117452 -201141 -81603 199751 -928 139383 -195754 -56151 436857 -38549 -133050 -95502
16001 -95502 -212375 -195899 -206276 -245988 141076 32813 -279775 -31352 218297 76375 -119824
15989 233815 174350 -50669 -18566 -19203 -90266 43752 -8954 -38070 51625 -17155 -98041 86879
15976 101420 -90727 -216755 -104501 -158884 -76772 -5682 213173 -375961 41437 -252846 12370
15964 249882 -79985 156413 89329 -207 -176105 414 -139818 80627 -195023 122557 -107157
15952 -149986 -306352 -157101 99558 78921 211142 -30198 -313915 109633 46738 -342800
15941 13028 -114825 -85802 286164 52498 -257720 -118765 90503 -195816 -460569 -67215
15930 -97638 64931 -202679 -84529 -240621 99314 -128021 -146913 -219893 -337449 -150552 -307580
$$ packed form
16012a17452q3689h1603A99751i28A39383a95754e6151D36857c8549r4501L7548
16001i5502j16873J6476j0377l9712A41076C2813b79775c1352B18297G6375a19824
15989B33815n9465e0669a8566o37p1063D3752h954k9116E1625a7155q0886H6879
15976A01420i0727j26028a04501n4383g6772e682B13173c75961D1437b52846A2370
15964B49882g9985A56413o7084b07j75898D14a39818H0627a95023A22557a07157
15952a49986j56366J49251I9558k0637J32221c0198k83717A09633D6738c42800
15941A3028a14825K9023B86164E2498b57720a18765I0503a95816k64753f7215
15930i7638F4931b02679h4529j56092I9314a28021j8892p2980j17556a50552j57028
$$ plain form
15919 -307580 -99031 -160960 -77293 -56048 -321631 -179318 196079 176973 49167 -14364 -137915
15908 -137915 181970 21389 -20150 -315428 54904 -18369 -223318 -120195 8671 -50283 -76736
15897 -76736 -227407 234311 54908 -308486 -52488 -123268 -135093 54363 15148 186947 242847
15886 242847 -370376 -105690 374721 -235612 -19445 29039 6217 92579 113451 -147521 78819
15874 85604 -424943 -152579 -146598 23997 -101671 -186060 -207600 68402 42389 178528 -230192
15862 68667 85649 -142394 46753 -20251 -174674 75774 179124 97332 69238 -58393 -217365
15851 -217365 -111316 -51165 -242939 -3394 -385087 -96215 -202908 -211667 -44832 126287 -265311
15839 209530 16963 -135568 23143 -182327 -58514 -112686 201630 76144 -240357 -84941 -54872
$$ packed form
15919c07580i9031o1929g7293K1245k65583J42313A96079j9106D9167a4364j23551
15908a37915A81970B1389b0150k95278E4904a8369k04949J03123H671e0283k6453
15897g6736j50671B34311E4908c08486e2488p0780j1825E4363A5148J71799N5900
15886B42847c70376a05690C74721b35612a9445B9039F217Q6362K0872a47521G8819
15874H5604d24943a52579N981B3997a01671q4389k1540F8402k6013J36139b30192
15862F8667J6982a42394D6753b0251j54423G5774J03350q1792k8094e8393j58972
15851b17365J06049e1165j91774c394l81693i6215j06693q759d4832A26287b65311
15839B09530A6963a35568B3143a82327e8514n4172B01630G6144b40357h4941L0069
$$ plain form
15828 -54872 -130877 -269278 59055 -176897 54735 25305 -121317 82347 -240490 -170735 -4136
15816 -368894 -337824 32626 -9889 -55832 -159700 -144634 53029 -138658 63048 -34837 -406364
15805 -406364 10223 67933 175484 -170205 68062 17660 -290280 -222215 -44814 -132651 111955
15793 310108 19853 -427081 -144608 190253 28315 87646 -136492 229275 -6030 -93094 191278
15781 -79834 -6668 -63110 -130803 116090 33234 67801 -39917 68687 51787 -282317 -47818
15769 73357 57132 112253 212777 52014 112083 41671 -69377 -177641 -92536 132355 -203433
15757 368677 -23437 97135 -92008 49284 62487 -192859 -536288 -124493 -148019 -19804 511
15745 -84914 -397783 -66783 -25589 -135822 -361226 -507460 196857 -268651 -337023 -199569
$$ packed form
15828e4872p6005j38401E9055a76897E4735B5305a21317H2347b40490O9755d136
15816c68894L1070C2626i889m5943j03868J5066E3029a38658F3048c4837l71527
15805d06364A0223N7710J07551a70205F8062A7660b90280O8065d4814q7837A11955
15793C10108A9853d27081a44608A90253B8315N9331a36492B29275f030q7064A91278
15781g9834f668n6442o7693A16090C3234L4567c9917F8687j6900b82317d7818
15769G3357j6225N5121J00524E2014O0069D1671f9377j08264Q5105A32355b03433
15757C68677b3437I7135i2008D9284J3203a92859l43429a24493k3526a9804E11
15745h4914l12869f6783b5589j10233k25404j46234A96857b68651o8372J37454
$$ plain form
15735 -199569 -167388 -105781 -276248 -389171 -60484 -55644 157285 -267888 -2213 -35582 -313721
15724 -313721 -23496 -7592 154593 -156554 235520 30330 -37392 -99335 26479 -114040 -115124
15713 -115124 121718 42112 -47366 -81663 -317634 -152726 -46767 -191428 115029 -219223
15702 -113433 -46164 -331162 -269261 63134 -7190 -178820 62478 47045 -140478 -222053 -242375
15691 -242375 -359327 81744 -56551 -229130 -383062 -226149 9285 -180801 -148774 -151489 -114192
15680 -114192 44216 261660 -190630 125795 -85593 218649 -95341 -129404 56599 33915 111904
15669 111904 -281705 2645 126077 88466 -237904 -105317 -273982 300437 47904 369861
15659 369861 -250671 267525 -83669 197942 -238578 147721 -69126 -90061 -161921 5008 -49070
$$ packed form
15735a99569L2181O1607j70467j12923f0484M840A57285b67888b213l3369k78139
15724c13721b3496g592A54593a56554B35520C0330c7392o1943B6479a14040j084
15713a15124A21718D2112d7366l4297k35971a52726d6767j44661A15029b19223
15702a13433d6164k84998O1901F3134g190j71630F2478j5433a40478q1575k0322
15691b42375j16952H1744e6551j72579j53932J56913I285a80801L2027k715L7297
15680a14192D4216K17444a90630A25795h5593B18649i5341l4063E6599k2684P7989
15669A11904b81705B645J23432l7611b37904a05317j68665C00437D7904L21957
15659C69861b50671B67525h3669A97942b38578A47721f9126k0935p1860E008d9070
$$ plain form
15647 -264033 476 -339434 96037 -85071 -32009 -45474 -36010 196176 -70878 -99204 56351 -120078
15634 -468958 -219538 -183712 -337777 -23623 -338420 -62036 -261596 68612 207762 120768
15624 120768 -224575 -243928 -340660 -481656 74713 297592 -292762 -28062 153495 77688
15614 77688 46850 173285 -23060 -107326 -220939 -203928 132034 22305 -153028 70551 -176730
15602 -25030 -373655 16645 -417587 -244298 -494455 8610 159430 37060 -348703 539 107430
15591 107430 150473 -208342 -227874 104549 62281 305428 114208 -21996 -110112 -347273
15581 -347273 136297 20147 -150881 -23964 -190237 21549 83021 -91674 275881 130335
15570 215095 -131873 169853 17351 143766 98269 149995 5210 -407847 102789 285770
$$ packed form
15647b64033D76c39434I6037h5071c2009j3465R464A96176g0878k8326E6351a20078
15634d68958b19538L5826j54065b3623l14797f2036j99560F8612J39150q6994
15624A20768b24575j9353r6732j40996G4713K22879b92762b8062A53495p5807
15614G7688l0838J26435b3060q4266j13613J7011A32034B2305a53028G0551a76730
15602b5030l48625A6645d17587J73289k50157H610J50820C7060c48703E39J06891
15591A07430M3043b08342j9532A04549m2268K43147A14208b1996q8116k37161
15581c47273A36297B0147a50881b3964j66273B1549O1472i1674B75881A30335
15570B15095a31873A69853A7351J26415m5497N1726E210d07847A02789J82981
$$ plain form
15560 285770 -72953 4305 -171258 567 -314 -111768 -145530 87725 63392 -128990 146863 242728
15548 242728 -66186 -53193 -13170 -191524 57417 66143 117646 -46540 35480 119307 -8036 170525
15535 245776 -95022 -60599 -16166 7040 190536 28649 -197394 -13047 128177 139179 -271382
15523 51413 -87897 283709 143642 -209099 161302 -111177 94439 18013 -286639 -89901
15512 -25809 -229621 -168934 194124 94774 283384 205753 -129606 -19548 -69405 17397 169634
15501 169634 -47640 3024 58349 268760 -86860 36717 58872 -4316 -103894 395469 -93313
15489 -169133 -54358 32337 5901 -267919 37392 -60399 -191397 -60595 -300005 163805 174846
15478 174846 21874 127422 156884 -231160 118088 -102818 -102524 17406 48941 13647 65315
$$ packed form
15560B85770g2953D305a71258E67c14j11454l3762H7725k4333a28990A46863R5865
15548B42728f6186J2993a3170j78354E7417Q726N1503d6540C5480Q3827h036A70525
15535B45776i5022L4423a6166G040J83496B8649a97394a3047A28177J1002b71382
15523E1413h7897B83709j40067b09099A61302a11177I4439A8013b86639h9901
15512b5809k03812O0687A94124I4774J88610p7631a29606a9548m9857A7397J52237
15501A69634d7640C024N5325K10411h6860C6717K2155d316r9578C95469i3313
15489a69133e4358C2337E901b67919C7392f0399j30998f0595k39410A63805J1041
15478A74846B1874J05548K9462b31160A18088a02818K94A7406L1535A3647N1668
$$ plain form
15467 65315 176355 66714 -68430 -54981 79201 112554 -143901 316792 -263422 147557 84264
15456 84264 -238072 -84585 -176204 -144905 106375 117789 -28674 37834 80948 14318 -157299
15444 142413 166152 217201 -17055 -4074 255858 103261 79996 137593 -219433 -150741 6438
15432 -187918 -64648 -149456 -43174 90089 -72591 263979 89477 243306 -22624 -283010 54757
15420 -212898 -43058 101785 -30939 160874 -3974 4183 -180479 -15310 1776 -189760 195490
15408 169142 40409 -92470 192677 -36201 87738 -280618 -878 -358926 759 -35305 334130
15396 87733 -162295 -107873 -30723 104444 339360 52282 153282 -135535 -336453 148198
15385 329996 78406 1794 253653 5522 -11336 43791 93753 286773 -301843 -324908 117007
$$ packed form
15467F5315J11040F6714f8430J3449G9201L3353a43901C16792b63422A47557o3293
15456H4264b38072h4585r1619L1299A06375J1414b8674C7834M3114A4318a57299
15444A42413K3739N1049a7055d074B55858A03261k3265N7597b19433O8692F438
15432a87918f4648q4808d3174I0089g2591B63979H9477J53829b2624k60386E4757
15420b12898d3058A01785c0939A60874c974D183a80479a5310A776a89760A95490
15408A69142D0409i2470A92677c6201H7738b80618h78l58048G59c5305C34130
15396H7733a62295N4422c0723A04444K34916E2282J01000a35535k00918A48198
15385C29996G8406A794K51859E522a1336D3791M9962J93020c01843k3065A17007
$$ plain form
15373 103409 172857 6423 163227 249101 -14000 -286111 285552 300727 -113723 -218723 59504
15361 -242800 -24569 31089 161601 -320032 82725 -111380 -157506 -65083 -2782 48735 230148
15350 230148 191851 294931 -155119 -218600 13711 61239 -141900 168063 -120755 -141068
15340 -141068 -173345 203800 191338 96041 -103686 -230444 13724 69970 155883 -174208 -223512
15329 -223512 -104040 -143621 448206 131810 130567 273619 -293372 202640 215950 -59110
15318 103316 32848 -53135 54727 125601 -342360 130325 194260 92463 -56429 -107021 79595
15306 216817 27288 78847 144766 254617 -269580 72868 94200 297519 36271 -259821 143672
15294 102986 -28704 -181247 187642 -207875 -21244 180129 638147 -131635 115653 -81412
$$ packed form
15373A03409O9448F423J56804Q5874a4000k72111B85552J5175a13723j05000E9504
15361b42800b4569C1089J30512c20032H2725a11380m6126f5083b782D8735J81413
15350B30148l8297J03080a55119o3481A3711M7528a41900A68063a20755k0313
15340a41068l2277B03800j2462r5297a03686j26758A3724N6246Q5913a74208m9304
15329b23512a04040l9581D48206A31810j243J43052b93372B02640J3310e9110
15318A03316C2848e3135E4727P0874c42360A30325O3935I2463e6429n0592G9595
15306B16817B7288N1559O5919J09851b69580G2868K1332K03319C6271b59821A43672
15294A02986b8704j52543A87642b07875b1244A80129M58018a31635A15653h1412
$$ plain form
15283 37768 115107 203216 66898 171188 6842 111790 114202 48973 -324588 205145 -265826
15271 103477 212154 -2335 118272 77667 83625 -81671 42923 1059 -100846 -326116 -1988
15259 -206568 -173063 151431 207491 -223729 20184 -136433 -150761 439954 99827 87637 87099
15248 87099 32281 288181 277097 188259 70792 222478 350707 -53224 -151426 363474 146947
15236 130518 474205 714201 1130194 1525044 1416478 1673268 1230120 531119 311691 44790
15225 329644 124902 88199 181656 264529 -72754 -201772 143970 829 -16058 532643 -116859
15213 -18858 141581 389195 284842 45409 -257060 -191501 -136174 45622 106892 177098 -105459
15201 -16430 133201 156930 158115 95926 97408 -153827 -42164 205857 -41902 256425 -172377
$$ packed form
15283C7768P7339Q8109F6898J04290F842J04948K412D8973c24588B05145b65826
15271A03477J08677b335A18272m0605N958h1671D2923A059a00846k25270a988
15259b06568L3505A51431N6060b23729B0184a36433j4328D39954I9827j2190n38
15248H7099C2281K55900j1084q8838G0792J51686J28229e3224r8202C63474A46947
15236A30518L43687K39996M15993L94850j08566K56790m43148E31119k19428D4790
15225C29644A24902l6703R3457Q2873g2754j29018A43970H29a6058E32643a16859
15213a8858A41581K47614j04353D5409b57060O5559N5327D5622O1270P0206a05459
15201a6430A33201K3729J185o2189J482a53827d2164B05857d1902B56425a72377
$$ plain form
15189 -164022 24161 112437 469276 67591 123487 93831 -229176 -297682 12375 203086 239670
15178 239670 -170905 255812 -19482 130111 215630 43487 -29627 -73228 -56791 274510 62045
15166 -109800 230775 203314 -135887 43337 -2508 -4720 -29603 14676 299609 253771 -82712
15154 131307 -175985 -5329 157667 252765 -394418 -6980 168116 -66213 -114824 -261469 17347
15142 229879 79258 306994 288791 65449 135254 97412 52955 212622 -164306 364370 -52280
15130 104989 316961 270696 253852 79319 111623 321764 87587 177961 265228 110016 508636
15119 508636 203193 82972 131048 334756 85295 203056 -169575 149002 10739 67007
15109 67007 234948 183566 237121 -2938 416938 28702 358985 81300 -67973 347603 236490
$$ packed form
15189a64022B4161Q8276L56839F7591N5896k9656b29176o8506A2375J90711L6584
15178B39670a70905B55812a9482A30111Q5519D3487b9627m3601J6437B74510F2045
15166a09800B30775k7461a35887D3337b508k212k4883A4676K84933m5838h2712
15154A31307a75985e329A57667R5098c94418f980A68116f6213m8611j46645A7347
15142B29879G9258K27736j8203F5449O9805l7842m4457J59667a64306C64370e2280
15130A04989K11972m6265j6844G9319L2304K10141H7587R0374Q7267A10016L98620
15119E08636B03193H2972M8076K03708H5295J17761a69575A49002A0739N6268
15109F7007J67941n1382N3555b938D16938B8702L30283H1300f7973C47603j11113
$$ plain form
15098 236490 66197 -167338 286602 -84517 -53425 387582 211404 335613 -33041 91511
15087 217737 198254 148462 88508 411637 118687 116569 191110 3505 -2170 299044 24574
15075 -234587 222825 221126 71372 113800 338751 41272 -48465 -3332 250291 -133116 388415
15063 86408 187393 -2275 160672 65862 160138 40452 359422 -172032 241068 256736 93402
15051 -5564 -157759 -150984 20186 -111369 157856 301681 263675 129971 79704 484762 128422
15039 215523 354286 13647 95096 368370 -131526 168283 303274 106906 -18205 324897
15028 119539 284990 77204 170991 221551 201015 63536 14964 197924 24392 468887 458635
15017 458635 63912 221299 311925 374065 107382 300053 245020 162143 89496 208585 448530
$$ packed form
15098B36490F6197a67338B86602h4517L1092C87582j76178J24209c3041I1511
15087B17737j9483m9792n9954L23129A18687k118P4541C505b170B99044B4574
15075b34587B22825j699G1372M2428K24951D1272d8465c332B50291a33116C88415
15063H6408J00985b275A60672F5862R4276D0452L18970a72032B41068J5668I3402
15051e564j52195O775B0186a11369A57856J43825l8006A29971n0267M05058A28422
15039B15523J38763A3647Q1449K73274a31526A68283J34991A06906a8205C24897
15028A19539J65451G7204R3787N0560k0536F3536A4964J82960B4392M44495j0252
15017D58635F3912J57387R0626O2140A07382J92671n5033q2877p2647J19089K39945
$$ plain form
15006 448530 352428 264386 -108566 -106370 202260 183991 368535 465692 170680 292192 169968
14995 169968 232863 227793 185086 85912 145662 -22814 277939 262924 13311 263911 735253
14984 735253 243278 -52745 366560 152139 474059 314515 451916 53897 229609 46882
14973 292782 492355 39000 421559 299381 100515 406389 279265 246101 92891 435101
14963 435101 277681 334100 213229 292767 23350 496088 283252 426372 216587 343373
14953 343373 433965 72950 151341 316856 448195 393623 360727 351216 311542 294506 363412
14942 363412 -31062 310581 344506 -325116 243502 286451 266126 142474 416371 259665
14932 259665 318496 143375 422842 124035 -10612 204033 268530 256499 113731 240786
$$ packed form
15006D48530r6102q8042a08566K196B02260j8269J84544R7157A70680J21512j22224
14995A69968O2895n070m2707H5912N9750b2814B77939j5015A3311K50600M71342
14984G35253B43278e2745C66560A52139L21920j59544J37401E3897J75712D6882
14973B92782J99573C9000L82559j22178A00515L05874j27124l3164I2891L42210
14963D35101j57420N6419j20871P9538B3350M72738k12836J43120k09785J26786
14953C43373R0592G2950P8391J65515J31339n4572l2896r511l9674j7036O8906
14942C63412c1062C10581L3925c25116B43502M2949k0325j23652K73897j56706
14932B59665N8831A43375K79467A24035a0612B04033O4497j2031A13731J27055
$$ plain form
14922 240786 308893 454679 116776 325343 167142 101542 470714 220262 72306 425123
14912 425123 235427 375116 392340 67493 192812 74346 238302 141995 163228 439516
14902 439516 -48502 190136 325562 551929 278007 -76942 125689 323179 493531 199266
14891 300087 712563 -47852 433971 784560 68890 427130 312011 220617 327847 302047
14881 302047 263259 564461 409592 371856 227918 429493 327867 92368 -3094 178664
14870 211110 347767 273091 285658 405854 312365 386098 118112 340948 431939 305935
14860 305935 -135743 334891 411521 527831 300702 325218 499039 299341 761142 415920
14850 415920 214340 42341 45676 435202 298368 115184 454063 501045 335194 377690
$$ packed form
14922B40786O8107J45786A16776K08567j58201o5600L69172B20262G2306L52817
14912D25123j89696J39689J7224F7493J25319G4346J63956r6307K1233K76288
14902D39516d8502A90136J35426K26367k73922g6942A25689J97490J70352A99266
14891C00087M12476d7852D33971L50589F8890L58240j15119r1394J07230k5800
14881C02047l8788L01202j54869l7736j43938K01575j01626I2368c094A78664
14870B11110J36657p4676J2567J20196r3489P3733A18112K22836R0991j26004
14860C05935a35743C34891P6630J16310k27129K4516J73821j99698M61801l45222
14850D15920k01580D2341L335L89526j36834A15184L38879M6982j65851M2496
$$ plain form
14840 377690 617721 596203 463782 583657 53957 448876 414112 364400 498239 618505
14830 618505 426523 323203 186632 545442 530687 280475 227785 477144 700155 621104
14820 621104 416006 592413 591396 501336 529776 468598 811394 301048 376957 558851 814931
14809 814931 573120 333121 937099 658618 358728 491394 327685 314044 350345 271117
14799 271117 542424 259078 664156 571126 518466 773793 517187 582018 787705 422389
14789 422389 552554 730986 235088 507663 577541 454342 708555 770529 777435 530319
14779 530319 534490 635670 598555 235798 632453 593921 794633 657728 458407 554043
14769 554043 684711 652910 461274 639130 390121 617543 942216 691958 683542 474047
$$ packed form
14840C77690K40031k1518j32421J19875E3957L94919l4764m9712J33839J20266
14830F18505j91982j03320j36571L58810j4755k50212n2690K49359K23011p9051
14820F21104k05098J76407j017r0060K8440o1178L42796C01048P5909J81894K56080
14809H14931k41811k39999O03978k78481k99890J32666j63709j3641L6301p9228
14799B71117K71307B59078M05078r3030n2660K55327k56606O4831K05687l65316
14789D22389J30165J78432B35088K72575O9878j23199K54213O1974O906k47116
14779E30319M171J01180l7115B35798L96655l8532K00712j36905j99321R5636
14769E54043J30668l1801j91636J77856k49009K27422L24673k50258q416k09495
$$ plain form
14759 474047 972216 450961 892991 423917 431136 772008 625404 704821 666069 591063
14749 591063 536114 774153 728321 847717 968387 649644 535371 607970 502691 799227
14739 799227 773510 562556 835178 779136 959915 422435 768733 1008861 404240 855620
14729 855620 629990 748546 697890 749599 724850 648934 500083 707000 688156 453147
14719 453147 854369 521033 859296 1226596 1056447 725945 531234 844826 401507 918632
14709 918632 771315 572904 739893 896533 688279 630213 622769 792692 1083845 895526
14699 895526 867999 703394 883017 735904 696919 746926 950495 937562 704913 984635
14689 984635 727847 960041 853059 1108268 810965 952705 869113 837646 836142 827101 947463
$$ packed form
14759D74047M98169D50961M42030D23917P219L40872j46604P9417l8752p5006
14749E91063n4949K38039m5832J19396J20670l18743j14273P2599j05279K96536
14739G99227k5717k10954K72622n6042J80779D22435L46298K40128D04240M51380
14729H55620k25630J18556n0656N1709k4749p5916j48851K06917j8844k35009
14719D53147M01222l33336L38263L67300j70149l30502j94711L13592D01507N17125
14709I18632j47317j98411J66989J56640k08254n8066p444J69923K91153j88319
14699H95526k7527j64605J79623j47113l8985N0007K03569j2933k32649K79722
14689I84635k56788K32194j06982K55209k97303J41740q3592l1467j504r041J20362
$$ plain form
14678 947463 1056021 828351 1063600 1201477 973135 1239024 1286159 696592 1303890 1062221
14668 1062221 824227 1045282 1196563 991049 957918 1123259 754284 1091811 1395465 1166878
14658 1166878 1127316 1207318 1207353 1056447 1026303 1246733 1374177 1251131 961197 1382039 1061854
14647 1061854 1150960 893812 1220936 948771 1229979 1316716 1198526 1223443 1335940 1249201
14637 1249201 1244381 1116200 1563206 1362987 1242959 1172310 1317459 1197716 1351832 1389038
14627 1389038 1469312 1371527 1417023 1489847 1113547 1219371 1474646 1083705 1174596 1391631
14617 1391631 1368709 1482917 1121389 1656777 1350469 1162845 1386553 1428418 1600686 1370771
14607 1370771 1062174 1572338 1521972 1336599 1660369 1347111 1750602 1759513 1776069 1550817
$$ packed form
14678I47463J08558k27670K35249J37877k28342K65889M7135n89567O07298k41669
14668A062221k37994K21055J51281k05514l3131J65341l68975L37527L03654k28587
14658A166878l9562Q0002L5j50906l0144K20430J27444j23046k89934M20842l20185
14647A061854Q9106k57148L27124k72165K81208Q6737j18190K4917J12497q6739
14637A249201m820j28181M47006k00219j20028p0649J45149j19743J54116L7206
14627A389038Q0274r7785M5496P2824l76300J05824K55275l90941R0891K17035
14617A391631k2922J14208l61528N35388l06308j87624K23708M1865J72268k29915
14607A370771l08597N10164n0366j85373L23770l13258M03491Q911J6556k25252
$$ plain form
14597 1550817 1835796 1586972 1568908 1574833 1486973 1768897 1678960 1509975 1762912 1762368 1503865
14586 1503865 1606010 1683493 1896947 1642841 1570832 1540910 1839714 1857147 1681240 1956043
14576 1956043 1943358 1962422 2416529 1697266 2100936 2026492 1958136 1899485 1728190 2080431
14566 2080431 1674284 1944328 1995354 2120944 2003563 2428088 2386777 2167939 2180301 2192526
14556 2192526 2590516 2547478 2461127 2697446 2656916 2713724 2478479 2474878 2726935 2999387
14546 2999387 3049213 3255207 3344019 3518240 3534764 3676853 4257002 4549624 5225204 5839832
14536 5839832 6799706 8118654 10416952 14298228 20931414 29277605 29887336 21819459
14528 21819459 13959122 8821174 6064597 4965337 4131491 3665555 3312225 3138190 2952034
$$ packed form
14597A550817K84979k48824j8064N925q7860K81924q9937j68985K52937n44k58503
14586A503865J02145P7483K13454k54106p2009k9922K98804J7433j75907K74803
14576A956043j2685J9064M54107p19263M03670p4444o8356n8651j71295L52241
14566B080431m06147K70044N1026J25590j17381M24525m1311k18838J2362J2225
14556B192526L97990m3038q6351K36319m0530N6808k35245l601K52057K72452
14546B999387M9826K05994Q8812J74221J6524J42089N80149K92622O75580O14628
14536E839832R59874J318948K298298L881276O633186Q346191O09731q067877
14528B1819459p860337n137948k756577j099260q33846m65936l53330j74035j86156
$$ plain form
14519 2952034 2614717 2618204 2651142 2506827 2577846 2462329 2429552 2517509 2718686 2707358 2751463
14508 2751463 2719284 2570636 2747265 2682187 2633677 2760901 2973226 2881338 2635145 3077352
14498 3077352 2623669 2782883 2957985 2746347 3147417 2874855 3014069 3385320 3143299
14489 3143299 3049622 3173213 3034745 3440047 3424147 3364942 3272431 3629877 3574399 3437060
14479 3437060 3473547 3568674 3883571 3791999 3710451 3815353 3850437 3980151 4175077 3720398
14469 3720398 3684950 3944359 3997428 4034422 4481349 4129017 4049170 4626150 4341548 3997588
14459 3997588 4017059 4191680 4361971 4696719 4482332 4778373 4893686 4914837 4949634 4585829
14449 4585829 4960709 4831229 5296495 4840807 5146729 5176105 5474394 5520208 5563056 5602080
$$ packed form
14519B952034l37317L487L2938j44315P1019j15517l2777Q7957K01177j1328M4105
14508B751463l2179j48648J76629o5078m8510J27224K12325r1888k46193M42207
14498C077352m53683J59214J75102k11638M01070k72562J39214L71251k42021
14489C143299r3677J23591j38468M05302j5900n9205r2511L57446n5478j37339
14479C437060L6487R5127L14897r1572q1548J04902L5084J29714J94926m54679
14469C720398l5448K59409N3069L6994M46927l52332p9847N76980k84602l43960
14459C997588J9471J74621J70291L34748k14387K96041J15313K1151L4797l63805
14449D585829L74880j29480M65266m55688L05922K9376K98289M5814M2848L9024
$$ plain form
14439 5602080 5284934 5594203 5599078 5814292 5909720 5748313 5840454 5918866 5993799 5979882 6283500
14428 6283500 6447418 6509785 6509881 6518064 6968565 6520091 6444718 6904913 6633149 7130239 7662948
14417 7662948 7021338 7595606 7432343 7524466 7496582 7375713 7738378 8107890 8150288 8407970
14407 8407970 8425057 8664731 8658423 8806631 8907287 8739554 9328966 9143690 9541458 9478311
14397 9478311 9680177 9735813 9986280 9809697 10318811 10514563 10345201 10760820 10812310 11082628
14387 11082628 11202324 11593891 11568299 11489342 12030605 12170240 12756619 12483434 12616789 12977759
14377 12977759 13218037 13486768 13715576 14039345 13730013 14480289 14664417 14854445 15281733
14368 15281733 15571130 15726187 15940517 16165505 16297974 16877171 17455311 17366276 17985418
$$ packed form
14439E602080l17146L09269M875K15214R5428j61407R2141P8412P4933j3917L03618
14428F283500J63918O2367R6Q183M50501m48474p5373M60195k71764M97090N32709
14417G662948o41610N74268j63263R2123k7884j20869L62665L69512M2398K57682
14407H407970J7087K39674o308J48208J00656j67733N89412j85276L97768o3147
14397I478311K01866N5636K50467j76583N09114J95752j69362M15619N1490K70318
14387A1082628J19696L91567k5592p8957N41263J39635N86379k73185J33355L60970
14377A2977759K40278K68731K28808L23769l09332P50276J84128J90028M27288
14368A5281733K89397J55057K14330K24988J32469N79197N78140q9035O19142
$$ plain form
14359 17985418 18310276 18489342 19067459 19602511 19718568 20286452 20614573 21053328 21633482
14350 21633482 21945409 22103011 22617751 23280675 23755719 24281734 24534373 25284614 26121654
14341 26121654 26737941 27350129 27813557 28552154 29585437 29937016 30729541 31631908 32052956
14332 32052956 33311199 33660882 35121003 35996550 36955971 37571479 38712981 39429147 41152695
14323 41152695 42268732 43451167 44588725 46081975 47451141 48716769 50088333 52038765
14315 52038765 53432689 55164327 56932737 59014626 61091102 62982487 65169302 67493579
14307 67493579 69895801 72586204 75238311 77767286 80773260 84186188 86942143 90516174
14299 90516174 94237833 97971399 102077679 106359579 110893969 115571463 120593969 126181055
$$ packed form
14359A7985418L24858J79066N78117N35052J16057N67884L28121M38755N80154
14350B1633482L11927J57602N14740O62924M75044N26015K52639P50241Q37040
14341B6121654O16287O12188M63428P38597J033283L51579P92525R02367M21048
14332C2052956J258243L49683J460121Q75547R59421O15508J141502P16166J723548
14323D1152695J116037J182435J137558J493250J369166J265628J371564J950432
14315E2038765J393924J731638J768410K081889K076476J891385K186815K324277
14307F7493579K402222K690403K652107K528975L005974L412928K755955L574031
14299I0516174L721659L733566M106280M281900M534390M677494N022506N587086
$$ plain form
14291 126181055 131476641 137236864 143906703 150577133 157343460 164728006 172889112 180964498
14283 180964498 190353824 199070461 209109058 219195265 230446391 241568504 253730106
14276 253730106 266326859 279290120 292723156 306908206 321149420 335817463 349961638
14269 349961638 364295871 378080772 391444174 404281936 416086877 426891715 436429138
14262 436429138 444611750 451366430 456649813 461898770 464773540 465492064 464774475 462773662
14254 462773662 457733965 450021534 442735190 433735932 422583796 409528766 396901236
14247 396901236 384169492 370838689 357218626 343758805 330752671 317206662 304061498
14240 304061498 291187853 278499539 266387135 254676586 243313647 232099523 221206326
$$ packed form
14291A26181055N295586N760223O669839O670430O766327P384546Q161106Q075386
14283A80964498R389326Q716637J0038597J0086207J1251126J1122113J2161602
14276B53730106J2596753J2963261J3433036J4185050J4241214J4668043J4144175
14269C49961638J4334233J3784901J3363402J2837762J1804941J0804838R537423
14262D36429138Q182612O754680N283383N248957K874770P18524p17589k000813
14254D62773662n039697p712431p286344q999258j1152136j3055030j2627530
14247C96901236j2731744j3330803j3620063j3459821j3006134j3546009j3145164
14240C04061498j2873645j2688314j2112404j1710549j1362939j1214124j0893197
$$ plain form
14233 221206326 210852101 200336077 190446292 181594674 172916317 164401301 156459771 149227648
14225 149227648 142128679 136117568 129940601 124061842 119004662 113752819 108979710 104464542
14217 104464542 100336526 96797514 92901437 89174348 85853039 82741554 79545522 76360650
14209 76360650 73639631 71411012 68876621 66403071 64200272 61925618 59893934 58137057
14201 58137057 56036876 54425368 52793744 51261287 50169594 48033988 46761395 45436286
14193 45436286 44548816 43373315 42246665 40723384 39365571 38461244 37731647 36638763
14185 36638763 35700743 34750608 33873831 33370114 31945028 31471138 30991932 29677255 29158629
14176 29158629 28438439 27519986 27197484 26435783 25647989 25428757 24754203 24387723 23812202
$$ packed form
14233B21206326j0354225j0516024r889785q851618q678357q515016p941530p232123
14225A49227648p098969o011111o176967n878759n057180n251843m773109m515168
14217A04464542m128016l539012l896077l727089l321309l111485l196032l184872
14209G6360650k721019k228619k534391k473550k202799k274654k031684j756877
14201E8137057k100181j611508j631624j532457j091693k135606j272593j325109
14193D5436286q87470j175501j126650j523281j357813r04327p29597j092884
14185C6638763r38020r50135q76777n03717j425086m73890m79206j314677n18626
14176B9158629p20190r18453l22502p61701p87794k19232o74554l66480n75521
$$ plain form
14167 23812202 22962488 22705318 22330494 21555864 20902819 20745632 20132504 19777864 19545718
14158 19545718 19164507 18843233 18416177 18229800 17655728 17294269 17069708 16699776 16239493
14149 16239493 15957433 16047880 15860604 15181111 15050297 14598425 14439324 13875619 13990030
14140 13990030 13431196 13549690 13137660 12996077 12996453 12638202 12703765 12389791 12224424 12104988
14130 12104988 11495048 11797065 11578685 10829644 10905267 10750180 10801985 10467503 10347686 10225627
14120 10225627 10241138 9764462 9928832 9716910 9527838 9520232 9381972 9031689 9050091 8753941
14110 8753941 8909560 8694767 8579925 8472784 8297821 8139122 7851008 8037625 7636632
14101 7636632 7961783 7614978 7490821 7178100 7338054 7365802 6988770 7132517 7099305 6809350
$$ packed form
14167B3812202q49714k57170l74824p74630o53045j57187o13128l54640k32146
14158A9545718l81211l21274m27056j86377n74072l61459k24561l69932m60283
14149A6239493k82060R0447j87276o79493j30814m51872j59101n63705J14411
14140A3990030n58834J18494m12030j41583L76l58251O5563l13974j65367j19436
14130A2104988o09940L02017k18380p49041P5623j55087N1805l34482j19817j22059
14120A0225627J5511m76676J64370k11922j89072p606j38260l50283J8402k96150
14110H753941J55619k14793j14842j07141j74963j58699k88114J86617m00993
14101G636632L25151l46805j24157l12721J59954K7748l77032J43747l3212k89955
$$ plain form
14091 6809350 6683823 6622525 6736913 6310241 6726202 6512654 6499798 6152572 6118897 5928264
14081 5928264 5911951 5754774 5958055 6123784 5893728 5765788 5504701 5433390 5776196 5342650
14071 5342650 5566390 5631371 5080528 5014376 5157178 5001803 5292924 4914890 5100532 5215573
14061 5215573 4630065 4956705 4601043 4921630 4674353 4404964 4813270 4939329 4485674
14052 4485674 4454008 4308332 4752527 4450724 4659636 4288512 4354030 4111413 4147265 4224993
14042 4224993 4082856 4124222 3685171 3730970 3969319 4012079 3766703 3931816 3608404 3466710
14032 3466710 3752909 3510642 3581560 3678192 3562873 3446237 3561337 3298029 2955771 3249657
14022 3249657 3383786 3015021 3179242 3229770 3434303 3406557 3063784 3396993 3071404 3058415
$$ packed form
14091F809350j25527o1298J14388m26672M15961k13548j2856l47226l3675j90633
14081E928264j6313j57177K03281J65729k30056j27940k61087p1311L42806m33546
14071E342650K23740O4981n50843o6152J42802j55375K91121l78034J85642J15041
14061E215573n85508L26640l55662L20587k47277k69389M08306J26059m53655
14052D485674l1666j45676M44195l01803K08912l71124O5518k42617L5852P7728
14042D224993j42137M1366m39051M5799K38349M2760k45376J65113l23412j41694
14032C466710K86199k42267P0918R6632j15319j16636J15100k63308l42258K93886
14022C249657J34129l68765J64221N0528K04533k7746l42773L33209l25589j2989
$$ plain form
14012 3058415 3205418 3149177 3145992 3046024 3020712 3068879 2725970 2735238 3020778 2677243 3198486
14001 3198486 2721017 2533785 2588435 2764719 2493584 2388898 2784554 2744085 2631557 2186192
13991 2186192 2731470 2404709 2239523 2209614 2570823 2651344 2635791 2708059 2707691 2759831 2480956
13980 2480956 2694074 3147938 3183711 3797250 4069529 5229970 7004964 10017189 15925887
13971 15925887 25002772 28644543 21481782 15079438 10593496 7943646 6329643 5773888
13963 5773888 4773112 4315347 4105003 3524053 3307709 3379380 3236632 3329747 2999537 2697605
13953 2697605 2873000 2602506 2406001 2549521 2700031 2558902 2208416 2450952 2270453
13944 2270453 2283967 2237035 1940963 2058735 2201124 2056456 1927242 1673802 2279827 2016745
$$ packed form
14012C058415J47003n6241l185r9968k5312M8167l42909R268K85540l43535N21243
14001C198486m77469j87232N4650J76284k71135j04686L95656m0469j12528m45365
13991B186192N45278l26761j65186k9909L61209Q0521j5553P2268l68N2140k78875
13980B480956K13118M53864L5773O13539K72279J160441J774994L012225N908698
13971A5925887R076885L641771p162761o402344m485942k649850j614003n55755
13963E773888j000776m57765k10344n80950k16344P1671j42748R3115l30210l01932
13953B697605J75395k70494j96505J43520J50510j41129l50486K42536j80499
13944B270453J3514m6932k96072J17772J42389j44668j29214k53440O06025k63082
$$ plain form
13934 2016745 1903954 1790515 1985439 2050571 2027932 1648664 2156809 1653542 1732771 2096586
13924 2096586 1908805 1676789 2002369 1975101 1940417 1842498 1810588 1661374 2084938 1873617
13914 1873617 1523986 2002229 1525223 1672432 1565242 1732387 1868991 1645740 1746681
13905 1746681 1563228 1187301 1343747 1436228 1710581 1335327 1404940 1588413 1773917 1067197
13895 1067197 1519186 1580756 1358338 1488133 1661778 1475939 1299238 1576877 1846121 1367872
13885 1367872 1712847 1355866 1195977 1471498 1639394 1628853 1431157 1420418 1566367 1415876
13875 1415876 1568524 1480809 1220990 1504540 1443865 1566442 1487479 1297561 1135167 1357103
13865 1357103 1430183 1343140 1398047 1206302 1241048 1111329 1068242 1140216 1100410 1172836 1305678
$$ packed form
13934B016745j12791j13439J94924O5132k2639l79268N08145n03267P9229L63815
13924B096586j87781k32016L25580k7268l4684r7919l1910j49214M23564k11321
13914A873617l49631M78243m77006J47209j07190J67145J36604k23251J00941
13905A746681j83453l75927J56446R2481K74353l75254O9613J83473J85504p06720
13895A067197M51989O1570k22418J29795J73645j85839j76701K77639K69244m78249
13885A367872L44975l56981j59889K75521J67896j0541j97696j0739J45949j50491
13875A415876J52648q7715k59819K83550o0675J22577p8963j89918j62394K21936
13865A357103P3080q7043N4907j91745L4746j29719m3087P1974l9806P2426J32842
$$ plain form
13854 1305678 1269295 1067718 1246415 1046161 1061694 1101884 1131923 1059640 1317047 960807
13844 960807 1049973 1194203 923752 1238071 974606 1150985 1314260 822685 1135935 1020499
13834 1020499 926404 1029826 1349594 528215 1199476 1142879 1189573 771101 1039852 887763
13824 887763 1011727 990548 950176 1235126 858834 911217 952875 1040166 1223962 1349306
13814 1349306 706890 872797 895827 1070520 1116102 850360 856068 777654 1094486 975561
13804 975561 804894 907859 884366 598387 1181850 1026135 966888 972198 686400 1084153
13794 1084153 963018 830253 1215011 638532 792360 738116 796526 845907 646958 685966
13784 685966 782696 953462 769959 739036 748756 712148 672888 1075562 895736 930433 1105939
$$ packed form
13854A305678l6383k01577J78697k00254J5533M0190L0039p2283K57407l56240
13844I60807Q9166J44230k70451L14319k63465J76379J63275m91575L13250j15436
13834A020499r4095J03422L19768E28215O71261n6597M6694m18472K68751j52089
13824H87763J23964k1179m0372K84950l76292N2383M1658Q7291J83796J25344
13814A349306o42416J65907K3030J74693M5582k65742N708p8414L16832j18925
13804I75561j70667J02965k3493k85979N83463j55715n9247N310k85798L97753
13794A084153j21135j32765L84758n76479J53828n4244N8410M9381j98949L9008
13784F85966R6730J70766j83503l0923R720l6608l9260M02674j79826L4697J75506
$$ plain form
13773 1105939 794338 670110 801467 883812 590257 706061 815049 888709 850190 714588
13763 714588 684661 558031 871995 995790 734284 719026 780262 511341 708134 950775
13753 950775 514564 472600 767897 653304 814892 523973 791602 619431 816687 641677
13743 641677 845329 919206 800827 531843 774757 605360 789705 771152 669611 534589
13733 534589 701030 966529 423209 816646 604618 632553 696326 817853 574122 1018923
13723 1018923 763697 584659 490479 447307 406584 419055 523632 582052 365638 631522
13713 631522 938553 706319 393097 740632 517517 593886 527486 736981 665433 562024
13703 562024 328700 551402 413208 627236 364463 554287 678500 488640 507692 717851
$$ packed form
13773A105939l11601j24228J31357Q2345k93555J15804J08988P3660l8519j35602
13763G14588k9927j26630L13964J23795k61506j5258O1236k68921J96793K42641
13753I50775m36211m1964K95297j14593J61588k90919K67629j72171J97256j75010
13743F41677K03652P3877j18379k68984K42914j69397J84345j8553j01541j35022
13733E34589J66441K65499D23209L93437k12028K7935O3773J21527k43731M44801
13723A018923k55226j79038r4180m3172m0723J2471J04577N8420k16414K65884
13713F31522L07031k32234l13222L47535k23115P6369o6400K09495p1548j03409
13703E62024k33324K22702j38194K14028k62773J89824J24213j89860J9052K10159
$$ plain form
13693 717851 522402 530170 636088 469356 819678 665060 635801 343521 742096 659259
13683 659259 393788 441521 766609 644812 629850 560406 804588 520398 686605 729149
13673 729149 414247 741854 522165 552552 942337 582715 479803 491385 870292 665072
13663 665072 471637 569701 30154 410019 584223 633676 286654 373676 642928 399485
13653 399485 412663 826105 598198 663545 445665 401903 357538 547155 456203 715923
13643 715923 123307 391334 226272 592442 382807 386421 282070 395533 495742 482693
13633 482693 570110 407550 477182 481979 180686 337820 483713 369109 485757 473602
13623 473602 429556 380461 495581 557310 461184 682574 693796 374793 454539 424408 328215
$$ packed form
13693G17851j95449P768J05918j66732L50322j54618k9259k92280L98575q2837
13683F59259k65471M7733L25088j21797j4962o9444K44182k84190J66207M2544
13673G29149l14902L27607k19689L0387L89785l59622j02912J1582L78907k05220
13663F65072j93435R8064C0154L79865J74204M9453B86654Q7022K69252k43443
13653C99485J3178M13442k27907O5347k17880m3762m4365J89617r0952K59720
13643G15923A23307K68027j65062L66170k09635L614j04351J13463J00209j3049
13633D82693Q7417j62560O9632M797A80686J57134J45893j14604J16648j2155
13623D73602m4046m9095J15120O1729r6126K21390J1222l19003P9746l0131r6193
$$ plain form
13612 328215 356137 617477 353666 755812 173732 388813 596852 538922 357111 217349
13602 217349 424129 301034 252037 167616 331166 654698 397092 422285 350582 169132
13591 125462 199397 514875 -108829 268841 365220 481084 450309 376429 349158 348537 625047
13580 625047 507097 528544 576428 539978 447368 236242 244882 419629 363026 525795 404756
13569 404756 529135 157428 86173 665700 362827 231964 273267 98124 435268 285292
13559 285292 373547 288445 540211 571024 327976 370543 475315 647860 404698 502083
13549 502083 143482 372198 305228 327419 279276 109790 544529 517668 210186 112669
13539 112669 244241 361649 387528 503384 344414 547514 700986 243744 301932 113189
$$ packed form
13612C28215K7922K61340k63811M02146A73732K15081K08039n7930j81811j39762
13602B17349K06780j23095m8997q4421J63550L23532k57606K5193p1703A69132
13591A25462P3935L15478a08829B68841R6379J15864l0775p3880k7271o21K76510
13580F25047j17950K1447M7884l6450r2610k11126Q640J74747n6603J62769j21039
13569D04756J24379A57428p1255N79527l02873j30863M1303I8124L37144j49976
13559B85292Q8255q5102K51766L0813k43048M2567J04772J72545k43162R7385
13549E02083A43482K28716o6970K2191m8143A09790M34739k6861B10186r7517
13539A12669J31572J17408K5879J15856j58970K03100J53472B43744N8188A13189
$$ plain form
13528 479043 252926 300350 297224 389587 404469 343323 546442 52101 336354 259379 334382
13517 334382 580613 205238 156783 728900 108299 346932 567101 310080 317242 281727
13507 281727 357057 238478 412649 46516 396618 547039 119702 384804 137304 322669
13497 322669 345058 382426 205667 334830 441257 -133915 439274 33314 373803 113435
13486 335668 372497 382789 285826 330540 397790 314472 -45739 208806 171831 225532 97359
13474 256346 12737 285246 202480 285980 251164 474731 52550 357674 323984 363794 524573
13463 524573 188601 301755 -7619 474615 417032 610324 446836 286520 486083 620690
13453 620690 218909 243101 234620 147744 5482 -47070 166938 448061 185492 263477 117572
$$ packed form
13528D79043k26117M7424l126R2363J4882o1146K03119E2101K84253p6975P5003
13517C34382K46231B05238m8455N72117A08299K38633K20169k57021P162l5515
13507B81727P5330j18579J74171D6516L50102J50421A19702K65102A37304J85365
13497C22669K2389L7368j76759J29163J06427a33915D39274C3314L40489A13435
13486C35668L6829J0292r6963M4714O7250q3318d5739B08806l6975N3701I7359
13474B56346A2737K72509q2766Q3500l4816K23567E2550L05124l3690L9810J60779
13463E24573A88601J13154g619D74615n7583J93292j63488j60316J99563J34607
13453F20690B18909K4192q481q6876E482d7070A66938K81123A85492P7985A17572
$$ plain form
13441 366705 318492 474275 -44905 98722 415080 265017 241440 232523 115673 355282 4281
13429 -81031 553178 147925 28471 225247 5450 289035 319930 413532 -88026 92579 4365
13417 326822 209350 92445 244920 122233 208884 38596 305987 414375 75032 77633 230447
13406 230447 68542 299706 175299 217512 450969 722906 302159 125164 146842 415249
13396 415249 179803 -178608 273850 -135995 209198 208820 4817 -100341 595301 528231 244802
13384 166578 -143015 38800 141407 271929 15334 272595 83523 345729 126773 408797
13374 408797 188411 269110 73678 192581 242414 265628 429817 149897 163383 202413 449775
13363 449775 248355 392805 173581 12181 -93332 138373 96426 468634 148701 -14153
$$ packed form
13441C66705m8213J55783d4905I8722L16358j50063k3577q917A15673K39609D281
13429h1031E53178A47925B8471J96776E450K83585L0895R3602h8026I2579D365
13417C26822j17472I2445J52475A22233Q6651C8596K67391J08388G5032K601J52814
13406B30447F8542K31164j24407M2213K33457K71937C02159A25164K1678K68407
13396D15249A79803a78608B73850a35995B09198l78D817a00341E95301o7070B44802
13384A66578a43015C8800J02607J30522A5334K57261H3523K62206A26773K82024
13374D08797A88411Q0699G3678J18903M9833K3214J64189A49897J3486L9030K47362
13363D49775k01420J44450A73581A2181i3332A38373m1947L72208A48701a4153
$$ plain form
13352 318667 171326 294978 128370 110440 21067 431625 282273 317112 427026 531784
13342 531784 360410 305699 87846 255628 157878 271749 309795 433809 338951 652181
13332 652181 420818 326454 361969 228338 198858 443670 799090 140191 366334 83068
13321 355303 40201 443376 392580 252843 228273 95814 -59444 255570 418280 321345 -19043
13309 72171 -105942 169302 303596 242733 7943 277404 18607 341079 -44046 289382 -46269
13297 388465 79674 325442 145056 -63404 101304 -202068 130151 -117655 349741 263092
13287 263092 52625 81526 82188 484782 -92002 -53335 260605 391276 -127993 -77347 -94638
13276 -94638 142725 323573 253471 172201 -8990 -33525 394739 97935 268405 370110 292856
$$ packed form
13352C18667j47341J23652A28370j7930B1067M10558j49352L4839J09914J04758
13342E31784j71374n4711H7846J67782r7750J13871L8046J24014r4858L13230
13332F52181k31363r4364L5515j33631k9480K44812L55420A40191K26143H3068
13321C55303D0201M03175n0796j39737k4570I5814e9444B55570J62710r6935a9043
13309G2171a05942A69302J34294o0863G943K69461A8607L22472d4046B89382d6269
13297C88465G9674K45768A45056f3404A01304b02068A30151a17655C49741q6649
13287B63092E2625K8901O62M02594i2002L8667B60605J30671a27993N0646j7291
13276i4638A42725J80848p0102q1270h990k4535C94739I7935J70470J01705p7254
$$ plain form
13265 292856 139447 216006 130461 79729 183841 56860 184552 33035 427375 206624
13254 232098 264662 294996 64431 62925 -42910 273324 41092 156357 -42134 -197795 119196
13242 -88904 -51846 268633 250390 117395 -18112 30766 82319 223646 129248 39838 -53732
13230 22180 145671 193910 169682 195551 261475 215569 -143894 86851 43287 133403 121994
13219 121994 23986 252714 152081 111375 1116 316965 -34441 -60959 74645 234952 -130261
13207 -94793 335101 257442 171866 325858 43232 -235527 -204303 189399 -4033 405950 -53335
13195 149345 345826 -255589 -1977 -153274 19572 281074 -140960 209369 63526 82573
13185 82573 145827 38774 -6025 340060 -65064 389126 136686 -7075 316741 306750 147317
$$ packed form
13265B92856A39447P6559q5545n0732J04112E6860J27692C3035L94340B06624
13254B32098L2564L0334F4431j506d2910B73324D1092J15265d2134j55661A19196
13242h8904L7058B68633j8243A17395a8112C0766N1553J41327r4398C9838e3732
13230B2180J23491M8239k4228K5869O5924m5906a43894H6851D3287R0116j1409
13219A21994B3986K28728j00633m0706A116L15849c4441k6518G4645J60307a30261
13207i4793C35101p7659q5576J53992D3232b35527L1224A89399d033D05950e3335
13195A49345J96481b55589a977j51297A9572K61502a40960B09369F3526J9047
13185H2573O3254C8774f025C40060f5064C89126A36686g075C16741r991A47317
$$ plain form
13173 97839 -71775 122106 -36840 18720 342938 56184 249500 -147042 -230436 -213279 368633
13161 148655 -777 55037 -115584 462774 551775 395692 130600 -29953 255365 25110 -84490
13149 33359 248843 -139737 71352 312536 -75012 -111677 116795 304290 -64438 222272
13138 148219 35358 221016 -40015 124825 -80773 301484 257878 102985 49025 -175228
13127 28005 -75501 -89421 -110630 520981 513491 18271 146892 136903 177102 -127059 271118
13115 131359 -47577 64124 -111336 -190164 -13891 104229 295224 117089 149215 -17150 -255963
13104 -255963 92329 234997 -242954 313879 124878 -103112 52919 326303 155939 -244171
13093 218200 148808 -41678 105160 113486 345362 153573 131658 14788 -160144 -46742 345739
$$ packed form
13173I7839g1775A22106c6840A8720L24218E6184J93316a47042q3394J7157C68633
13161A48655g77E5037a15584D62774Q9001j56083A30600b9953B55365B5110h4490
13149C3359K15484a39737G1352K41184g5012l6665A16795J87495f4438B22272
13138A48219C5358J85658d0015A24825h0773C01484m3606A02985D9025a75228
13127B8005g5501j3920k1209E20981p490A8271J28621r989M0199a27059B71118
13115A31359d7577F4124a11336p8828a3891A04229J90995A17089L2126a7150k38813
13104b55963I2329J42668b42954C13879A24878a03112E2919K73384A55939b44171
13093B18200o9392d1678A05160Q326K31876A53573k1915A4788a60144d6742C45739
$$ plain form
13081 81094 33899 394363 -185668 -23943 -162270 -43212 -56862 102078 -354328 179386
13070 36081 153215 260802 198115 -16597 -258867 -36912 -35976 295 -78661 496374 -125349
13058 159677 -227959 225276 180903 -54670 78435 -129339 -216797 344097 418872 365602 200126
13047 200126 -14237 378564 123330 312974 -292702 69402 -235915 288187 120416 56454
13036 32233 184542 221955 -23715 158980 -31917 65334 -212464 103726 280764 208730 -121148
13024 -27658 430758 6791 40128 81150 255113 339663 -28583 -150896 176006 195029 -137160
13012 281328 55959 96361 70519 88332 175808 -152187 -86105 377187 324082 239320 200467
13001 200467 26352 -255351 349921 -20731 256421 -144475 -24716 77604 102360 200254 83436
$$ packed form
13081H1094C3899L60464a85668b3943j38327d3212j3650A02078c54328A79386
13070C6081J17134J07587o2687a6597k42270c6912R36B95g8661D96374a25349
13058A59677b27959B25276m4373e4670G8435a29339q7458C44097P4775n3270j65476
13047B00126a4237C78564A23330J89644b92702F9402b35915B88187A20416E6454
13036C2233J52309L7413b3715A58980c1917F5334b12464A03726J77038p2034a21148
13024b7658D30758F791L3337M1022J73963Q4550b8583j22313A76006J9023a37160
13012B81328E5959M0402k5842J7813Q7476a52187O6082C77187n3105q4762l8853
13001B00467B6352b55351C49921b0731B56421a44475b4716G7604K4756R7894H3436
$$ plain form
12989 -150472 154554 163764 125390 126568 21208 58412 35070 376479 56433 17698 7179 -183444
12976 -98100 113469 -197538 -254505 138640 264325 -83229 67432 278222 47142 81641 123095
12965 123095 23638 135967 33434 94893 -236540 -179005 175488 78936 -23561 -15637 -13330
12954 -13330 69959 -517 -98086 -165245 200291 -443080 304351 49116 56078 145715 -116924
12942 196039 52906 83184 145178 175068 -180051 -203428 26029 -150690 119109 -120159 5872
12930 277057 -82623 109156 88610 -8924 -16044 196543 370480 15218 -22957 423568 -112382
12918 590870 128048 36995 185743 13688 246054 201386 249760 184926 91611 149962 -44830
12906 544328 4646 -60953 233051 -32159 -23012 -180224 204876 -192286 221790 394666 -33918
$$ packed form
12989a50472A54554R210l8374J178B1208L7204k3342L41409E6433A7698G179a83444
12976i8100A13469a97538n6967A38640J25685h3229F7432K10790D7142L4499M1454
12965A23095B3638J12329C3434O1459b36540N7535A75488G8936b3561P924K307
12954a3330F9959e17r7569o7159B00291d43080C04351D9116O962Q9637a16924
12942A96039E2906L0278O1994K9890a80051k3377B6029a50690A19109a20159E872
12930B77057h2623A09156k0546h924p120A96543J73937A5218b2957D23568a12382
12918E90870A28048C6995J48748A3688K32366m4668M8374o4834I1611N8351d4830
12906E44328D646f0953B33051c2159R147j57212B04876a92286B21790J72876c3918
$$ plain form
12894 -112648 274184 -90682 -96102 223128 6723 181606 171922 277189 20912 244479 198490
12883 198490 270042 -37301 -78648 -86461 447446 -31769 -285295 -30651 348613 -159521 2366
12871 73399 367252 -131351 112806 -283484 -370965 205639 174892 288181 -42994 260584
12860 93273 89641 28402 79508 139765 54829 124166 -141224 18995 11532 192814 159465 107824
12848 107824 156831 -161064 387109 167895 62082 -60038 249887 45097 111964 301760
12838 301760 -175056 69819 -144790 28352 -235234 220987 -210246 174802 -110417 -52280
12827 87310 271567 252460 367418 58079 187550 304336 -76808 128231 -105262 43637
12816 185913 -251634 184122 -90082 71424 -164923 -206838 76147 -281721 -62456 -21459 -66946
$$ packed form
12894a12648B74184i0682n420B23128F723J74883r684J05267B0912K23567m5989
12883A98490P1552c7301m1347p813D47446c1769k53526c0651C48613a59521B366
12871G3399K93853a31351A12806b83484q7481B05639l0747J13289d2994B60584
12860I3273l632B8402N1106O0257E4829O9337a41224A8995p463J81282l3349n1641
12848A07824M9007a61064C87109A67895F2082f0038B49887D5097O6867J89796
12838C01760a75056F9819a44790B8352b35234B20987b10246A74802a10417e2280
12827H7310J84257j9107J14958E8079J29471J16786g6808A28231a05262D3637
12816A85913b51634A84122i0082G1424a64923m1915G6147b81721f2456b1459m5487
$$ plain form
12805 -66946 -8252 131085 221947 -105494 144691 113355 -196804 45543 -225045 337943 37583
12793 -350937 144385 152234 287836 -13368 -32261 -24529 181030 58231 -102819 75643 159602
12782 159602 -186081 227909 127724 163768 184790 -152425 60133 132848 191340 85695 101021
12771 101021 145784 117724 22417 -229738 -116011 -189348 54596 -178473 -469 156975 170769
12760 170769 -70920 65429 352593 282346 91412 -96391 170743 82235 -121431 13509 80950
12749 80950 -276759 25469 -15124 -119764 -27516 -90552 70141 378413 368604 -97103 318507
12737 -142805 450055 -120679 -224425 -22758 98198 50829 129718 268923 -181476 170574
12726 123396 -460285 -89184 47261 126089 -34186 220039 263374 55700 -211823 -167284 73601
$$ packed form
12805f6946h252A31085R0862a05494A44691l1336a96804D5543b25045C37943C7583
12793c50937A44385P849J35602a3368j8893P732A81030E8231a02819G5643Q3959
12782A59602a86081B27909j00185L6044K1022a52425F0133P2715N8492H5695J5326
12771A01021M4763k8060B2417b29738J13727p3337E4596a78473d69A56975J3794
12760A70769g0920F5429K87164p0247I1412i6391A70743H2235a21431A3509O7441
12749H0950b76759B5469a5124j04640b7516o3036G0141L08272r809i7103C18507
12737a42805D50055a20679j03746b2758I8198m7369P8889J39205a81476A70574
12726A23396d60285h9184D7261P8828c4186B20039M3335E5700b11823M4539G3601
$$ plain form
12714 -284651 112725 32975 156183 -30881 21815 152698 160199 -202975 -63819 56609 -185859
12702 219492 186047 -49387 271878 -367344 38598 -209251 -19601 -17189 64441 -176273 -92042
12691 -92042 89166 183247 -91482 -140761 82686 234633 82008 400712 -151521 6502 -102144
12679 137626 390968 151517 -178089 -35710 7376 -215 110353 -95898 -49771 -200108 46035
12667 264269 -32151 9499 105185 -303599 42678 -167404 94761 116341 28658 -44339 -141332
12656 -141332 -79982 96007 350580 352229 270060 -37025 353330 -80848 -169999 -193351 173763
12644 -16121 -69718 -11388 127244 434897 258494 235080 178281 -61491 -24847 -54859 78939
12632 177014 124881 -198208 286894 -40381 -73256 6852 163035 -156416 120871 144561 65354
$$ packed form
12714b84651A12725C2975J23208c0881B1815J30883P501b02975f3819E6609a85859
12702B19492l3445d9387B71878c67344C8598b09251a9601K412F4441a76273Q4231
12691i2042H9166R4081i1482m9279H2686J51947H2008L18704a51521F502a02144
12679A37626K53342A51517a78089c5710G376b15A10353i5898M6127j50337D6035
12667B64269c2151I499R5686c03599D2678a67404I4761K1580B8658d4339r6993
12656a41332O1350I6007K54573J649q2169c7025C53330h0848q9151k3352A73763
12644a6121n3597a1388A27244L07653j76403k3414n6799f1491b4847l0012G8939
12632A77014n2133a98208B86894d0381l2875F852J56183a56416A20871K3690F5354
$$ plain form
12620 26702 -75872 -27844 121362 448210 307426 81720 222880 259784 102308 92833 11087
12608 30525 126786 307997 486622 354160 323894 215362 -13029 151604 12933 241370
12598 241370 110594 139108 -103664 -125664 144020 -195717 271143 -72539 -13779 -121111
12588 -121111 109054 230373 -164950 66774 316124 138053 156634 70176 28581 62305
12578 62305 -37017 -35895 111656 -82358 114598 79573 35716 65411 8198 -43858 113657
12566 -38242 -285907 -136940 -95789 -94700 -278273 201928 -90226 183204 -137363 -155218 22941
12554 363252 -78480 -181210 -330638 158257 211976 116023 159394 388600 -119188 -224624
12544 -224624 115300 -243086 88414 -105049 242 352946 -242139 -118390 -202513 81866 -101791
$$ packed form
12620B6702g5872b7844A21362L26848j40784H1720J41160L6904A02308r475A1087
12608C0525R6261J81211J78625j32462l0266j08532a3029A51604A2933K28437
12598B41370A10594K8514a03664k2000A44020a95717B71143g2539a3779j07332
12588a21111A09054J21319a64950F6774K49350A38053J8581G0176B8581L3724
12578F2305c7017J122A11656h2358A14598l5025C5716K9695H198d3858A13657
12566c8242k47665a36940M1151J089j83573B01928i0226A83204a37363j7855B2941
12554C63252g8480j02730j49428A58257N3719r5953M3371K29206a19188j05436
12544b24624A15300b43086H8414a05049B42L52704b42139a18390q4123H1866a01791
$$ plain form
12532 111068 90106 179886 -80873 -198354 71020 86717 56411 23233 115798 -33774 -410091
12521 -410091 -88517 -102247 -14860 259615 -72408 -172969 -91678 2005 -409912 140356 300247
12510 300247 2396 148884 114253 -105761 -5149 137686 23938 -112986 -187761 -104530 96319
12498 394561 138133 343651 41531 438235 112621 279412 -25388 221504 -39051 57190
12487 -170042 -66332 26166 144597 240245 -231454 27413 91764 40492 97427 53744 -194976
12475 -318731 350480 153841 210526 -212435 84483 -96390 -47164 63007 -17018 -10329 4554
12463 156922 -243250 391178 224563 63552 -193936 145308 -26592 42931 143674 166369
12453 166369 -106321 -40089 -200137 91332 351388 192252 -345732 304737 34473 112463
$$ packed form
12532A11068k0962Q9780h0873j17481G1020J5697l0306B3233R2565c3774l76317
12521d10091h8517j3730a4860B59615g2408j00561Q1291B005d09912A40356J59891
12510C00247B396J46488l4631a05761e149A37686B3938a12986p4775Q3231I6319
12498C94561A38133K05518D1531L96704A12621J66791b5388B21504c9051E7190
12487a70042f6332B6166J18431R5648b31454B7413O4351D0492N6935m3683a94976
12475c18731C50480A53841N6685b12435H4483i6390d7164F3007a7018O689D554
12463A56922b43250C91178j66615F3552a93936A45308b6592D2931J00743K2695
12453A66369a06321d0089j60048I1332K60056j59136c45732C04737C4473P7990
$$ plain form
12443 112463 78379 68867 83510 144496 -171468 107138 -210327 -178751 47308 78891 167586
12432 167586 81838 223217 260206 -59460 11708 -381208 -373605 -41243 -295316 113793 -11880
12420 -36301 -252540 60739 -13544 267025 293654 -246419 88978 -86709 -9095 283988 89409
12408 141971 143705 -341622 -160224 -94647 238312 -170235 -35025 163667 207842 -50166 33645
12396 62107 161040 182244 -154618 -145647 -343608 206729 -79833 -27331 277951 -53056 -198570
12385 -198570 -27489 134706 -104968 209103 -510293 -50769 61556 304720 -43888 -100908
12375 -100908 363535 -33115 -132335 -4877 76882 -249764 78200 -94802 -250563 125609 346191
12364 346191 -256260 59431 38284 -363365 -88664 -77464 -58909 -14920 314019 79702 188638
$$ packed form
12443A12463l4084r512J4643O0986a71468A07138b10327L1576D7308L1583Q8695
12432A67586H1838J41379L6989e9460A1708c81208P603d1243k54073A13793a1880
12420c6301k16239F0739a3544B67025K6629b46419H8978h6709i095B83988H9409
12408A41971J734c41622a60224O5577B38312a70235c5025A63667M4175e0166C3645
12396F2107R8933K1204a54618Q971j97961B06729g9833b7331B77951e3056j45514
12385a98570b7489A34706a04968B09103e10293e0769F1556K43164d3888n7020
12375a00908C63535c3115r9220d877G6882b49764G8200i4802j55761A25609K20582
12364C46191b56260E9431k1147c63365h8664J1200J8555a4920C14019G9702J08936
$$ plain form
12353 188638 -233840 11419 -53206 -84326 -431361 23222 218528 -176114 207949 -118349
12342 137075 120326 -179365 517891 -97123 132899 293443 -20491 -196019 187808 232271
12332 232271 -97293 94852 -248604 193866 -103193 -78899 -200425 39412 77672 -283908
12321 75842 -12077 -132411 -2326 -54427 -143069 -102463 285174 -118106 -12427 -117948 -59468
12310 -59468 -78314 -342340 -21551 25414 -23094 -52274 -152490 70643 94930 1060 -130000
12298 -222787 -273064 34479 -180231 69894 -446373 39458 197293 -73807 245493 -107701
12287 -133785 141044 90886 601887 2783 129686 -211912 -370012 -25506 16764 -24445 168342
12275 77220 115978 54694 219840 28397 -95225 323189 129637 -30602 53871 -56200 232848
$$ packed form
12353A88638b33840A1419e3206l1120l47035B3222J95306a76114B07949a18349
12342A37075j6749a79365E17891i7123A32899J60544b0491j75528A87808M4463
12332B32271i7293I4852b48604A93866a03193K4294j21526C9412L8260b83908
12321G5842a2077j20334b326n2101q8642M0606B85174a18106a2427j05521N8480
12310e9468j8846k64026b1551B5414b3094k9180j00216G0643K4287A060a30000
12298b22787n0277C4479a80231F9894d46373C9458J57835g3807B45493a07701
12287a33785A41044n0158N11001B783J26903b11912j58100b5506A6764b4445A68342
12275G7220L8758E4694J65146B8397i5225C23189A29637c0602E3871e6200B32848
$$ plain form
12263 -33839 -30563 100312 183703 -297176 -92487 28556 -207667 175393 172990 79187 -188709
12251 105397 180812 41468 32226 -183229 -281064 286734 -188987 74797 60657 -178227 -87269
12239 351775 -214611 152642 -83629 265595 316814 183730 -77085 196028 196619 85026 -5547
12227 186045 86031 171805 218966 322692 -146097 116532 199432 219267 -190542 -190686 -124073
12216 -124073 247158 471140 -98956 39736 283757 131263 -26668 -56472 128100 200848
12206 200848 51427 209672 83324 445168 81741 -226116 39260 -129777 182896 35884
12195 -138001 266884 -255158 -10258 370369 227197 240850 294139 127382 -108323 -43046
12184 240845 48993 338078 271258 245874 -60623 275297 -80080 287566 123831 -37409 -23192
$$ packed form
12263c3839L276A00312Q3391b97176i2487B8556b07667A75393k403G9187a88709
12251A05397P5415D1468r242a83229r7835B86734a88987G4797j4140a78227h7269
12239C51775b14611A52642h3629B65595N1219j33084g7085A96028N91H5026e547
12227A86045H6031Q5774M7161J03726a46097A16532Q2900J9835a90542j44O6613
12216a24073B47158K23982i8956C9736K44021A31263b6668k9804A28100P2748
12206B00848E1427J58245H3324L61844H1741b26116C9260a29777A82896C5884
12195a38001B66884b55158a0258C70369j43172J3653N3289A27382a08323d3046
12184B40845D8993K89085o6820k5384f0623B75297h0080B87566A23831c7409J4217
$$ plain form
12173 -23192 122054 11262 -15759 231218 -101038 187581 37026 16277 -18122 18267 -32760
12161 155948 120430 226922 -98799 293039 198921 -113345 258994 -116192 -152136 -28451
12150 252497 193076 21627 420113 180165 109791 311644 -68310 -43205 -49804 191160 74805
12138 -3430 -132380 -98877 241156 -36293 -152965 161835 173614 -46017 217471 313356 316248
12127 316248 283066 -146898 184330 -202472 61213 59589 -69686 19074 229767 236387 535965
12116 535965 -91482 -284265 265123 -186337 -214122 146092 333667 -139131 383377 -178497
12105 43887 -21240 -129773 94556 151565 66896 224061 278068 870 -302635 -27377 523122
12093 -90776 100600 28250 -30874 -208413 -190833 -228650 -267647 -3761 -89838 4840 115047
$$ packed form
12173b3192A22054A1262a5759B31218a01038A87581C7026A6277a8122A8267c2760
12161A55948l5518J06492i8799B93039r4118a13345B58994a16192l5944b8451
12150B52497n9421B1627L98486A80165p0374K01853f8310K5105o599A91160G4805
12138c430j28950L3503B41156c6293j16672A61835J1779d6017B17471R5885K892
12127C16248l3182a46898A84330b02472F1213j624f9686A9074K10693O620K99578
12116E35965i1482j92783B65123a86337k7785A46092J87575a39131C83377a78497
12105D3887b1240j08533I4556N7009F6896J57165N4007H70c02635b7377E23122
12093i0776A00600B8250c0874j77539J7580l7817l8997c761q6077D840J10207
$$ plain form
12082 115047 281956 -72625 -108757 -271260 -27531 -186285 -193802 -181967 -11144 170300 57078
12070 -84771 139316 -112014 125215 -195900 -152947 93825 131238 -152924 -66120 -123110 -219392
12059 -219392 166755 -205877 -183519 206139 -11915 87484 -53874 -169602 5359 -113204 -34162
12047 -31108 25892 -49594 -225979 -18919 96987 77999 -47205 88431 -175598 237133 -18388
12035 141478 -240087 23645 307702 448096 764618 402360 250984 270070 10592 234635
12025 234635 102038 -227143 254973 279801 201587 180097 206493 -385008 3628 -179903 -68750
12013 -72705 -119870 -74506 -100309 -141262 -191971 30214 5737 34018 -25489 -87912 104300 -77513
12000 -117207 -27820 18091 -378051 -278436 596 22685 -272206 17699 78495 -35503 37029
$$ packed form
12082A15047J66909g2625l6132j62503b7531j58754p517J1835a1144A70300E7078
12070h4771A39316a12014A25215a95900M2953I3825L7413a52924f6120n6990r6282
12059b19392A66755b05877K2358B06139a1915H7484e3874j15728E359a13204c4162
12047c1108B5892d9594j76385a8919I6987j8988d7205H8431a75598B37133a8388
12035A41478b40087B3645K84057J40394L16522l62258j51376J9086A0592K24043
12025B34635A02038b27143B54973K4828p8214k1490K6396c85008C628a79903f8750
12013g2705m7165M5364k5803m0953n0709C0214E737K8281b5489o2423A04300g7513
12000a17207b7820A8091c78051R9615E96K2089b72206A7699O0796c5503C7029
$$ plain form
11988 -56422 -136900 878 110444 -130146 142528 -165482 -341943 -90044 -95801 340906 382611
11977 382611 229234 -164825 168528 211577 -28666 -125475 -200908 -238919 220278 -306031
11966 -155163 250163 -269549 69663 -49972 64227 -235430 -135818 32352 -142911 7834 40094
11955 40094 27139 342135 -132023 -102494 -174656 114685 -184442 -228594 -58302 -95668 275473
11943 9474 159787 48492 -88999 120894 -151661 125240 -237758 -147564 166122 -30079 -1429
11931 169349 297456 107336 -7669 85599 369867 -15538 -99495 -215491 -117100 -33498 60518
11919 105839 -298506 73861 25968 -89772 235802 -62694 -58244 218219 -227593 -299648 7651
11907 -149692 47370 -183904 -337447 -95215 149005 202359 -182969 -38159 58614 -17870 34277
$$ packed form
11988e6422q0478H78J09566a30146A42528a65482j76461i0044n757C40906M1705
11977C82611j53377a64825A68528M3049b8666r6809p5433l8011B20278c06031
11966a55163B50163b69549F9663d9972F4227b35430R9612C2352a42911G834L2260
11955D0094j2955L14996a32023K9529p2162A14685a84442m4152e8302l7366B75473
11943I474J50313D8492h8999A20894a51661A25240b37758R0194A66122c0079a429
11931A69349J28107A07336g669H5599K84268a5538q3957j15996R8391c3498F0518
11919A05839b98506G3861B5968h9772B35802f2694M450B18219b27593p2055G651
11907a49692D7370a83904j53543i5215A49005N3354a82969c8159E8614a7870C4277
$$ plain form
11895 19858 -44353 -120442 -458092 128265 89291 124202 -131655 198488 19101 64698 15159
11883 -203934 317106 401424 -93378 -96303 161575 -135619 5804 146487 -116295 -184985 -31427
11871 -264023 131861 -13989 -75557 324062 26645 -27166 161194 -160439 -129527 -90411 216233
11859 -53346 113413 -140404 246686 134486 -65209 164502 149337 54742 17379 46632 -179072
11847 53858 43747 -74373 -154148 -49044 -302926 -121304 117852 -147504 219166 -78489 -217904
11836 -217904 -284884 -65569 17118 -206530 -29349 -173438 -160921 99850 -274080 101574 131677
11825 131677 -21525 -247251 47717 97668 -102216 -172 -91609 132146 -121281 34564 -185881
11813 74744 -178036 -59679 -85924 52198 163589 104430 59642 -489054 -136045 55540 235249
$$ packed form
11895A9858d4353p6089l37650A28265l8974L4911a31655A98488A9101M5597A5159
11883b03934C17106Q4318i3378k925A61575a35619E804J40683a16295o8690c1427
11871b64023A31861a3989o1568C24062B6645b7166A61194a60439L0912L9116B16233
11859e3346A13413a40404B46686j12200f5209A64502j5165E4742A7379K9253a79072
11847E3858j0111g4373p9775d9044k53882a21304A17852a47504B19166g8489j39415
11836b17904o6980f5569A7118b06530b9349j44089J2517I9850b74080A01574L0103
11825A31677b1525k25726D7717M9951a02216a72r1437A32146a21281C4564a85881
11813G4744a78036e9679k6245E2198J11391n9159m4788d89054a36045E5540J79709
$$ plain form
11802 235249 -103240 -176906 -8111 -425210 46201 -356995 12293 -51850 79469 151718 -38416
11790 -54153 68117 89009 -184581 -121419 145 153312 -43970 -197154 124563 54516 -286285
11778 188805 114270 60582 -225688 -38964 -22154 391 -177988 151965 34651 127700 138686
11767 138686 14243 267843 -254170 -17586 87735 252134 -74689 -162738 -179553 -122677 -322641
11756 -322641 -29074 44045 -116285 -175776 81774 -195614 -104789 -195259 103286 -346572 144762
11744 -132823 -85491 453759 35118 130571 179899 -239660 -162109 78226 -158646 324681 -126028
11732 -180187 -16284 7236 216037 -70850 -130367 64813 -3337 46400 124398 -31663 41735 -447847
11719 97056 -236923 -195862 109061 118136 -354983 250732 -27125 -361660 27261 73957 43625
$$ packed form
11802B35249a03240p3666h111m17099D6201c56995A2293e1850G9469P2249c8416
11790e4153F8117K0892a84581O3162A45J53167d3970j53184A24563E4516b86285
11778A88805p4535n3688b25688c8964J6810C91a77988A51965C4651R3049J0986
11767A38686A4243K53600b54170a7586H7735J64399g4689q8049j6815N6876j99964
11756c22641b9074D4045a16285n9491H1774a95614R0825r0470A03286c46572A44762
11744a32823M7332D53759C5118R5453M9328b39660P7551G8226a58646C24681a26028
11732a80187a6284G236K08801g0850n9517F4813c337D6400P7998c1663D1735d47847
11719I7056b36923M1061A09061R075c54983B50732b7125l34535B7261M6696l0332
$$ plain form
11708 43625 -5003 -51298 -125811 -200320 -251282 -130376 -266348 -237691 -209604 29115 -136744
11696 -215030 198200 -57456 -336664 138450 184875 -36657 -152450 223887 3147 328255
11686 328255 1253 41392 112259 -37384 -169918 -98780 -276526 5320 178205 36912 173535
11675 173535 -31346 95716 -53112 85463 153893 136581 -28690 164538 -433764 -51200 224178
11663 -266441 28331 147462 226702 -194392 175286 -381063 90139 -161584 -199171 -59396
11652 -53007 66233 -24574 -133695 381836 -18628 -156752 8197 -164454 30459 74037 -158316
11640 99681 -291595 -82802 -107230 83967 125788 -245814 -64717 9030 16155 16538 -237830 75975
11627 274665 54802 80592 -191226 -165340 134217 10488 -73132 68571 214116 -155790 63349
$$ packed form
11708D3625e003m6295p4513p4509n0962J20906j35972K8657K8087B9115a36744
11696b15030A98200e7456k79208A38450M6425c6657j15793B23887C147L25108
11686C28255A253M0139P0867c7384j32534P1138j77746E320J72885C6912J36623
11675A73535c1346I5716e3112H5463O8430j7312b8690A64538d33764e1200B24178
11663b66441B8331J19131P9240a94392A75286c81063I0139a61584l7587e9396
11652e3007F6233b4574j09121C81836a8628j38124H197a64454C0459M3578a58316
11640I9681b91595h2802k4428H3967M1821b45814f4717I030P125L83b37830G5975
11627B74665E4802K5790a91226K5886A34217A0488g3132F8571J45545a55790F3349
$$ plain form
11615 -75220 103428 320007 -256945 54705 -145351 -208089 -111716 -390291 155014 -5189 48801
11603 -78059 -309783 44619 -16094 -226617 -78008 -2170 -29677 -139456 -5079 195294 96708
11591 -108184 71702 -18551 -146804 49136 265138 156823 237010 -160666 -104131 -111776 186867
11579 -256040 102940 179277 13497 -260779 -11241 -186845 105115 270823 28577 42221
11569 42221 -105495 9230 236080 -62043 -124474 143811 231063 359410 -270167 108106 -415209
11557 -65849 282086 221011 6 -145511 -96392 -68493 226230 190895 57302 145314 -10076 66717
11544 -50947 188555 88140 -12092 33435 -18888 -96561 -87103 -376367 149962 28546 22679
11533 22679 -322033 -122236 -156482 -176267 -300912 160619 42441 -45707 -71941 -10471 190430
$$ packed form
11615g5220A03428K16579b56945E4705a45351o2738R6373k78575A55014e189D8801
11603g8059k31724D4619a6094k10523g8008b170k7507j09779e079A95294I6708
11591a08184G1702a8551j28253D9136K16002j08315Q0187a60666N6535p645A86867
11579b56040A02940P6337A3497b60779a1241j75604A05115J65708B8577J3644
11569D2221a05495I230K26850f2043o2431A43811Q7252J28347b70167A08106d15209
11557f5849B82086o1075Fa45511M9119K7899B26230l5335E7302Q8012a0076F6717
11544e0947A88555H8140a2092C3435a8888p7673R458k89264A49962B8546n867
11533B2679c22033a22236l4246j9785j24645A60619D2441d5707k6234a0471A90430
$$ plain form
11521 -469826 -36290 66437 2166 205128 194762 -67387 -16076 376308 149855 192910 93668
11509 78717 -115071 110315 354581 -203588 268748 108703 175764 140416 -47097 -405557
11499 -405557 -377583 -55649 43322 -37911 118492 112659 -19800 259296 33450 -42401 -218178
11488 -218178 199051 158902 336536 117002 524205 162674 5198 -12893 394065 38215
11477 -47328 55453 252434 206308 -251654 42138 158584 3750 136316 91195 558563 -104420
11465 229553 400513 124874 281876 271628 318735 231172 324235 -167 -15165 76195 175875
11454 175875 -425883 -195886 -208189 -278979 224795 184740 -47322 -113350 -55685 -135966 18994
11442 205365 214228 -258961 244880 -209331 38444 136694 -162456 34679 -206121 193927
$$ packed form
11521d69826c6290F6437B166K02962j0366f7387a6076C76308A49855M3055I3668
11509G8717a15071A10315K44266b03588B68748A08703O7061l5348d7097l58460
11499d05557K7974e5649D3322c7911A18492n833a9800B59296C3450d2401j75777
11488b18178A99051m0149J77634A17002M07203A62674E198a2893C94065C8215
11477d7328E5453J96981m6126b51654D2138J16446C750J32566m5121M67368a04420
11465B29553J70960A24874J57002j0248M7107q7563R3063a67j4998G6195R9680
11454A75875d25883a95886j2303p0790B24795m0055d7322o6028e5685q0281A8994
11442B05365Q863b58961B44880b09331C8444R8250a62456C4679b06121A93927
$$ plain form
11431 8080 29703 -91575 31908 239935 -186604 29323 -181726 -188176 -121170 -320984 295345
11419 -192517 -141323 95586 -132720 -198606 -147152 14056 -28377 -179015 15945 208069 -1423
11407 133581 -191869 77518 58010 68742 56181 -131809 -273377 65747 -132814 7313 -82197
11395 173853 170078 -87753 -280581 142997 197823 76700 -116838 64217 196973 116954 303704
11384 303704 -56788 85647 66803 -21821 31514 -209336 105583 405782 -213398 188555
11373 -8792 92193 -39512 37954 -267644 -93064 26158 7143 -147595 58129 -197741 -71084
11361 -56547 88211 69113 -374377 119822 254719 -173719 -10557 245402 -148510 -207222
11351 -207222 -185903 -63458 -193341 189915 -253951 96555 -34743 67343 -10215 -28929 -486655
$$ packed form
11431H080K1623i1575C1908K08027a86604B9323a81726o450O7006j99814B95345
11419a92517N1194I5586a32720o5886N1454A4056b8377j50638A5945J92124a423
11407A33581a91869G7518j9508J0732j2561a31809j41568F5747a32814G313h2197
11395A73853l775h7753j92828A42997N4826G6700a16838F4217J32756q0019J86750
11384C03704e6788H5647j8844b1821C1514b09336A05583L00199b13398A88555
11373h792I2193c9512C7954b67644i3064B6158G143a47595E8129a97741g1084
11361e6547H8211j9098c74377A19822J34897a73719a0557B45402a48510n8712
11351b07222K1319f3458j29883A89915b53951I6555c4743F7343a0215j8714m57726
$$ plain form
11340 -486655 -216433 -72687 78172 -73706 159977 -333484 -117422 60501 -32506 138948
11329 55336 148073 -82385 -59843 -21463 -501027 56530 41322 -39997 190663 -128800 42509
11317 -419236 24786 -41625 -23990 204597 230269 189124 -223166 61832 -123223 -166277 29619
11305 -80704 -269945 -24282 23890 51200 101339 -355553 -99107 -37424 -359099 58265 -107997
11293 142262 -124002 -162780 -69618 213038 193114 5388 47117 2055 -402978 59967 66710
11282 66710 329459 -18977 302746 -22308 -82773 140087 -241803 -110249 -273158 -45770
11271 -49145 -200883 191083 298465 -161783 87470 -305576 52248 93742 -110492 -114256 -95824
11260 -95824 57937 -51523 -159182 5293 225091 165253 -114817 217146 18175 -248075 -31695
$$ packed form
11340d86655b16433g2687G8172g3706A59977c33484a17422F0501c2506A38948
11329E5336R2737h2385K2542b1463m79564E6530j5208c9997A90663a28800D2509
11317d19236B4786d1625J7635B04597K5672m1145b23166F1832a23223m3054B9619
11305h0704j89241b4282B3890K7310N0139c55553i9107c7424l21675E8265a07997
11293A42262a24002l8778f9618B13038j9924E388M1729B055d02978E9967O743
11282F6710K62749a8977C02746b2308o0465A40087b41803a10249j62909d5770
11271d9145j51738A91083J07382a61783H7470c05576E2248M1494a10492l764J8432
11260i5824E7937e1523j07659E293K19798n9838a14817B17146A8175b48075c1695
$$ plain form
11248 -326683 -57421 -25302 82102 -253490 146270 6506 113576 71978 -214823 198383 -336975
11236 -51002 -356193 132780 -297059 -483251 -48579 427132 394928 -103109 -100377 -188407 43728
11224 -182307 28970 -276424 33841 -256826 -194588 -214912 -304367 -24482 -240172 69235 409592
11213 409592 -191935 -455069 48074 119672 -45740 4267 -163766 9176 127224 211811 -19357
11201 -3517 -316737 247063 -215323 240732 41052 118539 150799 -224860 -208548 152844 123498
11190 123498 -26748 114626 8413 154402 215639 5946 -169904 -105892 -77837 111623 379372
11179 379372 -465166 76630 -44775 189037 -178388 -195619 83397 7839 94902 219253 -110055
11167 -58216 -313758 -224477 294626 -90368 59099 70883 39689 -260923 91795 -202859 -145082
$$ packed form
11248c26683e7421b5302H2102b53490A46270F506J07070m1598b14823A98383c36975
11236e1002l05191A32780b97059j86192d8579D27132l2204a03109K732q8030D3728
11224a82307B8970b76424C3841b56826O2238k0324q9455b4482k15690F9235L40357
11213D09592a91935k63134D8074P1598d5740D267a63766I176J18048Q4587a9357
11201c517l13220B47063b15323B40732D1052P7487L2260b24860J6312A52844k9346
11190A23498b6748A14626H413J45989O1237E946a69904O4012K8055A11623K67749
11179C79372d65166G6630d4775A89037a78388j7231H3397G839Q7063J24351a10055
11167e8216k55542Q9281B94626i0368E9099J1784l1194b60923I1795b02859N7777
$$ plain form
11156 -145082 196895 -158198 13035 11834 80298 -309752 124273 129886 -91410 62578 -70634
11144 281995 -311289 103343 160782 141729 -116779 223900 3374 -162294 -99204 86845 426641
11133 426641 18079 -29388 -26936 277954 95234 -58035 161444 -603396 -308863 75061 114251
11122 114251 -51011 11284 -107680 -28099 -147998 -115012 -355317 -105218 279045 -33434
11111 -192565 -65601 294204 226996 131999 189184 -14783 -302803 -197478 -164023 234199 -184255
11099 42531 52362 -67732 126407 -37862 214491 220765 63454 -551249 61 263178 186568 209975
11087 209975 142277 215517 209843 -17501 265567 -152838 495865 95992 58634 376341 10562
11075 139906 290563 43173 23437 3266 -103226 418325 104620 352573 196930 160978
$$ packed form
11156a45082A96895a58198A3035j201O8464c09752A24273N613i1410F2578g0634
11144B81995c11289A03343N7439j9053a16779B23900C374a62294O3090H6845L39796
11133D26641A8079b9388K452B77954I5234e8035A61444f03396K94533G5061L9190
11122A14251e1011A1284a07680b8099j19899L2986k40305a05218B79045c3434
11111a92565f5601B94204o7208r4997N7185a4783k88020J05325L3455B34199a84255
11099D2531R831f7732A26407c7862B14491O274F3454e51249F1K63117p6610K3407
11087B09975o7698P3240n674a7501B65567a52838D95865I5992l7358L17707A0562
11075A39906J50657D3173j9736C266a03226D18325A04620K47953j55643l5952
$$ plain form
11065 160978 27685 272654 124449 339001 148585 -129317 210923 217046 218513 275094 -15678
11053 387531 496757 -34808 576671 118897 334623 336453 684233 585892 288395 379866
11043 379866 304060 104770 437624 658925 112940 720301 340121 808950 561217 577740
11033 577740 608156 556189 298648 543560 488707 532457 415371 320685 625759 1044091
11023 1044091 659168 712896 540619 636829 533096 398772 303817 487757 391486 664016
11013 664016 515209 394564 590299 736509 747034 575078 379147 726943 673392 264606
11002 461309 608606 822388 215399 376353 755333 387205 292261 529922 733142 294145
10991 606025 806800 336463 534459 501004 537348 633773 734247 432520 546572 739072
$$ packed form
11065A60978B7685K44969A24449K14552A48585a29317B10923O123J467N6581a5678
11053C87531J09226c4808E76671A18897K15726J830L47780r8341B88395R1471
11043C79866p5806A04770L32854K21301A12940O07361C40121M68829k47733J6523
11033E77740L0416n1967k57541K44912n4853M3750j17086r4686L05074M18332
11023A044091l84923N3728j72277R6210j03733j34324r4955J83940r6271K72530
11013F64016j48807j20645J95735J46210J0525j71956j95931L47796n3551B64606
11002D61309J47297K13782B15399J60954L78980l68128r4944K37661K03220B94145
10991F06025K00775C36463J97996l3455L6344R6425J00474l01727J14052J92500
$$ plain form
10981 739072 491273 457485 348948 367984 584523 670509 565020 808557 611073 613400
10971 613400 786644 508952 862356 1127397 1143585 1255973 1336692 1117456 1274026 1487161
10961 1487161 1718950 1550539 2008835 2422359 2367473 2294232 2249198 2174916 1872165 1427495
10951 1427495 1404834 1085033 1111883 1023374 772144 1060361 733058 604715 816009 698713
10941 698713 579359 283917 365753 167486 59848 400839 526526 465847 84072 122510
10931 122510 -72044 306041 -206704 178423 182091 109189 157055 109233 197631 286301 -20592
10919 42186 87991 -417444 197016 44865 317037 169208 -119001 -69321 78104 -38858 328938
10907 -65841 376068 -96390 -87073 -293765 188205 -53472 86215 150284 -17967 -39815 145762
$$ packed form
10981G39072k47799l3788j08537J9036K16539Q5986j05489K43537j97484K327
10971F13400J73244k77692L53404K65041J6188J12388Q0719k19236J56570K13135
10961A487161K31789j68411M58296M13524n4886p3241m5034p4282l02751m44670
10951A427495k2661l19801K6850q8509k51230K88217l27303j28343K11294j17296
10941F98713j19354B83917Q1836A67486E9848L40991J25687o0679H4072L8438
10931A22510g2044C06041b06704A78423L668p2902M7866m7822Q8398Q8670b0592
10919D2186M5805d17444A97016D4865K72172j47829a19001M9680G8104c8858C28938
10907f5841C76068i6390R317k06692A88205e3472H6215O4069a7967k1848A45762
$$ plain form
10895 -311618 -130569 5500 58265 71099 -215014 243280 24655 -281976 203308 678 -186128
10883 6810 -141593 -293238 62964 -95842 -91308 276119 -184766 170382 108279 -236536 2828
10871 -197549 268355 -448591 69787 27540 28064 155395 502769 123152 -161226 133778
10860 277114 54294 -143511 -114092 576528 74097 37267 76279 32434 -37310 -11675 120461
10848 -105494 65220 27709 114861 250797 207690 -103220 13963 -129346 -31127 -368867 -233687
10837 -233687 -56349 37992 24393 -64126 -45569 164301 -125300 -409459 176479 -150631
10826 124268 -168939 -52878 -42226 -327850 84418 98041 -74874 -29613 32102 -80062 -432216
10815 -432216 -222262 -296899 -138188 -60707 113770 27812 123173 23721 241350 -151219
$$ packed form
10895c11618a30569E500N2765J2834b15014B43280B4655b81976B03308F78a86128
10883F810a41593j51645F2964i5842M534B76119a84766A70382o2103b36536B828
10871a97549B68355d48591F9787B7540N24J27331L47374A23152a61226A33778
10860B77114E4294a43511K9419E76528G4097l6830L9012C2434c7310a1675A20461
10848a05494F5220B7709Q7152J35936m3107a03220A3963a29346c1127l37740J35180
10837b33687e6349C7992j3599f4126J8557A64301a25300k84159A76479a50631
10826A24268a68939e2878J0652k85624H4418J3623g4874b9613C2102h0062l52154
10815d32216K09954p4637a38188f0707A13770B7812R5361B3721K17629a51219
$$ plain form
10804 -128746 221446 -14318 -437863 253587 -27779 106156 62937 -83522 58134 20339 365374
10793 365374 -476837 -37172 -18919 60093 -42741 -221404 102320 41774 -24119 -78070 -300728
10782 -300728 -170851 -82831 87016 -128524 -30867 -119354 -34804 111086 -157779 283816
10771 5538 -89 -22072 83314 -201008 138024 54054 -134762 458334 -103764 -294904 -141374
10759 -103549 -238350 -239843 -177886 -141206 -163945 -41761 -128913 -86150 -107385 -145097 -250793
10748 -250793 189663 -103971 -227413 -280794 -345474 -31415 291510 60478 26623 -67375 73084
10736 -50037 -35823 -228269 -117310 -316696 147481 214168 86961 121349 434991 -118774
10725 -96613 -24188 -221696 10918 -203398 239832 -156225 12577 143555 -64264 -99180 8744
$$ packed form
10804a28746B21446a4318m23545B53587b7779A06156m3219h3522E8134B0339L45035
10793C65374d76837c7172J8253F0093d2741j78663A02320D1774b4119n3951k22658
10782c00728J29877h2831H7016a28524c0867q8487c4804A11086a57779B83816
10771E538h9k1983H3314b01008A38024E4054a34762D58334a03764j91140a41374
10759a03549j34801j493O1957L6680k2739d1761q7152M2763k1235l7712j05696
10748b50793A89663a03971j23442n3381o4680c1415B91510F0478B6623f7375G3084
10736e0037J4214j92446J10959j99386A47481O6687H6961L4388L13642a18774
10725i6613b4188j97508A0918b03398B39832a56225A2577J30978f4264l4916H744
$$ plain form
10713 -168039 -199823 -72024 -217033 -48646 -130344 8315 332416 -156319 263980 -59692 163688
10701 -264309 -78103 299356 5057 413 -2801 155593 -201365 -277290 99601 88871 -187911
10689 -284828 -380801 28941 -201625 -155401 -57943 -59101 -25955 -197553 -68299 49915 -111144
10677 -75486 -198296 -176026 -140045 -127514 -102642 2968 -255105 -51792 38184 164819 156072
10666 156072 -333841 82960 -37461 -24122 128242 -254342 170994 -110348 -339861 277379
10655 -129586 115281 -68222 17539 -69138 -418838 15053 284254 48041 114889 -269189 -27240
10643 197195 -101962 -217224 -33258 141694 -201895 -59323 -300852 -308608 -280134 -104880
10632 184586 -113539 -241894 -12729 105970 -302438 -141677 20959 -292049 -474473 97218
$$ packed form
10713a68039l1784g2024j45009d8646q1698H315L24101a56319B63980e9692A63688
10701b64309g8103B99356E057D13b801A55593b01365p5925I9601j0730a87911
10689b84828r5973B8941b01625M6224e7943j158b5955j71598f8299D9915a11144
10677g5486j22810K2270L5981J2531K4872B968b55105e1792C8184J26635q747
10666A56072c33841H2960c7461J3339A28242b54342A70994a10348k29513B77379
10655a29586A15281f8222A7539f9138l49700A5053K69201D8041O6848b69189b7240
10643A97195a01962j15262c3258A41694b01895e9323k41529p756K8474a04880
10632A84586a13539j28355a2729A05970c02438a41677B0959b92049j82424I7218
$$ plain form
10621 -162466 150982 -417044 306649 -289919 -94464 23001 192016 -218460 9630 278043
10611 278043 154325 186386 169799 -285366 -217754 245130 65940 -134151 -401783 -145046
10600 63781 214985 4735 42000 100717 281722 -17313 79856 4887 18659 -53749 -56131 155089
10587 -191258 -328799 249055 -179966 -44424 -88540 -244296 232243 165773 -194366 -143551
10577 -143551 -123947 73226 297951 -122188 -264839 252980 -33719 134113 -46698 -206226
10567 -206226 -202885 -172684 -357437 -77588 -57223 -327872 -75267 82901 28916 128645 -12383
10555 -363054 106878 240409 -73504 62124 -175450 -207660 239838 -452471 28390 -222776
10544 134724 -8276 -78183 -68034 -129962 -127996 -132485 53656 129047 79552 -26763 -21655 -74097
$$ packed form
10621a62466A50982d17044C06649b89919i4464B3001J69015b18460I630K68413
10611B78043j23718L2061j6587b85366O7612B45130F5940a34151k67632a45046
10600F3781J51204D735L7265N8717J81005a7313G9856D887J3772e3749k382A55089
10587a91258j37541B49055a79966d4424m4116j55756B32243o6470a94366N0815
10577a43551J9604G3226K24725a22188j42651B52980c3719A34113d6698j59528
10567b06226L341L0201j84753g7588K0365k70649g5267H2901B8916R9729a2383
10555c63054A06878J33531g3504F2124a75450l2210B39838d52471B8390b22776
10544A34724h276o9907J0149o1928J966m489E3656P5391m9495b6763N108n2442
$$ plain form
10532 -74097 -168007 -111111 244570 256485 103189 166920 59463 227607 -92598 -86862 244539
10520 -10634 -271051 -349660 -96910 -151902 -28116 -118698 70471 -85962 -204310 -113505 -349187
10509 -349187 327335 80810 -80433 -38738 98661 93251 -94034 117165 -163743 76524 -74910
10497 216418 -98692 78733 -221390 -92541 -86484 175488 28161 -366967 61265 3405 231082
10486 231082 -24729 6926 -161825 229998 -61740 -124179 -212430 -323699 185017 -27460 72328
10474 304112 -186667 13584 -271655 -205244 -497909 -166095 167297 179701 -34132 246885
10463 144563 -97771 73542 216659 41424 361408 15787 -244453 -215448 -139869 95339 304979
10452 304979 -183266 -1489 -469196 -234927 -84828 86412 -32936 -243670 171403 -68631 160109
$$ packed form
10532g4097r3910N6896B44570J1915A03189O3731E9463J68144i2598N736B44539
10520a0634k60417p8609i6910n4992b8116r0582G0471h5962j18348R0805k35682
10509c49187C27335H0810h0433c8738I8661n410i4034A17165a63743G6524g4910
10497B16418i8692G8733b21390i2541O057A75488B8161c66967F1265C405K27677
10486B31082b4729F926a61825B29998f1740o2439q8251j11269A85017b7460G2328
10474C04112a86667A3584b71655O6411k92665a66095A67297J2404c4132B46885
10463A44563i7771G3542J43117D1424L19984A5787b44453K9005P5579I5339K09640
10452C04979a83266a489m67707K34269h4828H6412c2936k10734A71403f8631A60109
$$ plain form
10440 -71679 73771 181737 169200 233773 -320360 -103545 -54576 178467 19756 -354722 105866
10428 -312918 59446 -143954 151157 162255 -72747 -31597 -102765 42212 65432 101830 -296841
10416 -184290 -312938 103626 -160346 86864 -237112 116637 -150367 -142395 164554 -208727
10405 230165 -9161 -234718 -248270 -143642 376169 -130505 -202633 72863 42319 -44737 -356538
10394 -356538 -37380 171417 55019 -246525 -13414 -828 4239 225114 -46736 113896 -117316
10382 -60244 -70971 110574 422832 -78853 12035 75580 261635 213499 -69613 -748 148024
10370 -187144 256836 233726 -77068 107159 107004 -98668 127948 167891 200407 475833 220177
10358 218606 334856 192406 98171 92457 57884 518009 67337 77759 161212 231012 140400
$$ packed form
10440g1679G3771J07966j2537O4573c20360a03545M8969A78467A9756c54722A05866
10428c12918E9446a43954A51157J1098g2747c1597p1168D2212K3220L6398b96841
10416a84290j28648A03626a60346H6864b37112A16637a50367P972A64554b08727
10405B30165i161k25557j3552J04628C76169a30505p2128G2863l0544d4737l11801
10394c56538c7380A71417E5019b46525a3414h28D239K20875d6736A13896a17316
10382f0244j0727A10574L12258g8853A2035O3545J86055m8136f9613g48A48024
10370a87144B56836k3110g7068A07159j55i8668A27948L9943L2516K75426B20177
10358B18606J16250j42450r4235n714l4573M60125F7337J0422Q3453O9800r0612
$$ plain form
10347 140400 231124 113217 47154 146242 269826 -121884 359932 386546 442717 120193
10336 618485 362283 88732 530518 94176 304518 -121732 -34911 120087 318212 161175
10326 161175 218559 134110 473745 181136 220188 -36744 -75747 382929 169015 147382 16422
10314 116154 40860 -119732 -149801 119025 296331 -37733 122626 -98399 -55912 212336
10303 -51581 -114481 -281889 258461 -150394 -158183 49710 -21562 -396168 167822 -65462 109785
10291 67127 57308 68094 202298 129648 116012 232450 -242005 133419 -265682 -261736 -45591
10279 24599 -401374 -37404 96321 -156844 225707 -35446 136818 -135613 94090 28613 -195957
10267 -253678 -61720 -17335 -124770 224270 4472 74194 -175552 -195182 -130598 111308 158560
$$ packed form
10347A40400R0724A13217D7154R9088J23584a21884C59932K6614N6171A20193
10336F18485k56202H8732M41786I4176K10342a21732c4911A20087J98125j57037
10326A61175N7384q4449L39635A81136L9052c6744l9003C82929A69015k1633A6422
10314A16154D0860a19732l0069A19025J77306c7733A22626i8399M2487B12336
10303e1581o2900j67408B58461a50394p789D9710b1562l74606A67822f5462A09785
10291F7127r819J0786J34204p2650j3636J16438b42005A33419b65682L946d5591
10279B4599d01374c7404I6321a56844B25707c5446A36818a35613I4090B8613a95957
10267b53678f1720a7335j07435B24270D472O9722a75552j9630O4584A11308M7252
$$ plain form
10256 158560 29956 151006 -104407 78942 -27951 118877 74401 -168277 10197 -247724
10245 -197228 238168 -244026 6205 68793 136820 71450 -1392 -167372 -81445 -33851 125105
10233 -39001 -139744 -154960 65795 175894 -82389 917 55576 119879 76023 -323058 -54111
10221 84263 694 131831 368781 36786 6248 163208 391795 -81539 -81487 -370340 -20240 35109
10208 86336 -6642 -41087 109661 8740 36487 -51547 -31843 -33830 -94257 -143719 331213 97756
10195 -217078 -160282 -238970 19078 -69885 -220148 -274122 -134662 184775 154515 -142432 -148187
10184 -148187 -438383 -109010 -5007 209796 233107 -229652 -387244 -19325 -39731 -173890
10174 -173890 10527 -119539 279692 -221249 -108601 9425 -303358 -199528 21726 16278 109947
$$ packed form
10256A58560B9956J21050a04407G8942b7951A18877m4476a68277A0197b47724
10245a97228B38168b44026F205O2588O8027o5370a392j65980h1445c3851A25105
10233c9001j00743j5216F5795J10099h2389I17N4659O4303m3856c23058e4111
10221H4263F94J31137K36950C6786F248J56960K28587h1539N2k88853b0240C5109
10208H6336f642l4445A09661H740K7747e1547J9704j987o0427m9462C31213I7756
10195b17078N6796p8688A9078f9885j50263n3974a34662A84775l0260a42432n755
10184a48187k90196a09010e007B09796K3311b29652j57592a9325k0406j34159
10174a73890A0527a19539B79692b21249a08601I425c03358J03830B1726n448R3669
$$ plain form
10163 109947 -289339 112192 -217528 -193312 -64551 -278443 -92893 77540 73776 -180124 73783
10151 8570 -94214 -34660 -145355 17951 58304 -95575 149649 166782 -12456 89067 -422606
10139 -104560 155033 -126943 -156408 -156206 225604 -147574 -50972 54902 -138051 28142 -2743
10127 -70006 -263882 -202939 -85409 120187 -156926 -198495 -188838 149768 -427516 -191864 -70914
10115 -22003 -350205 -154535 47467 62456 -36694 -31558 -96700 -56117 -90131 24041 -38112
10103 -317357 -46952 22373 181022 41897 -162926 62660 -172610 -153374 103986 -21730 -153313
10092 -153313 -84590 -134713 -58204 -343832 -35820 -102825 -344234 150810 -336105 -192729
10082 -192729 -17487 16634 -233827 25857 174183 46327 262112 -284793 85857 -64468 -488814
$$ packed form
10163A09947b89339A12192b17528K4216f4551k13892i2893G7540l764a80124G3783
10151H570i4214c4660j10695A7951M0353i5575A49649J7133a2456H9067d22606
10139a04560A55033a26943k9465K02B25604a47574e0972E4902a38051B8142b743
10127g0006j93876O0943h5409A20187a56926m1569R657A49768d27516a91864g0914
10115b2003l28202a54535D7467J4989c6694N136o5142M0583l4014B4041c8112
10103c17357d6952B2373J58649D1897a62926F2660a72610J9236A03986b1730j31583
10092a53313O8723n0123e8204k85628c5820o7005k41409A50810c36105J43376
10082a92729a7487A6634b33827B5857J48326D6327K15785b84793H5857f4468m24346
$$ plain form
10071 -488814 -103295 -128174 142848 -48139 -1137 81832 -55131 189010 4090 138513 119201
10060 119201 -174172 103367 11500 -244939 -49710 -14854 -62341 -106982 -57717 36601 -149031
10048 169306 170349 -13558 -305959 -6172 120005 223237 117071 -166550 -12317 79624 97854
10037 97854 -209749 -482944 -629509 -52433 152394 -64343 -89266 -41489 189671 -177114
10026 -220045 -280456 167308 162217 30674 -609197 141026 59889 -241415 -109793 319490
10015 -197625 -128809 -230683 -267251 -447200 -43311 221208 -116704 -65805 -336304 -218545
10005 -218545 297405 171655 194901 8302 158212 -47129 35545 49044 -116097 206866 103612
9994 103612 -67578 -2044 55099 -158851 -190710 -329925 -11593 -143072 -173232 -62989 183478
$$ packed form
10071d88814a03295k4879A42848d8139a137H1832e5131A89010D090J34423j9312
10060A19201a74172A03367A1500b44939d9710a4854m7487m4641M9265C6601a49031
10048A69306J043a3558k92401f172A20005J03232j06166a66550a2317G9624J8230
10037I7854b09749k73195j46565e2433A52394f4343k4923d1489A89671a77114
10026b20045o0411A67308n091C0674f09197A41026E9889b41415a09793C19490
10015a97625O8816j01874l6568j79949d3311B21208a16704N0899k70499J17759
10005b18545B97405j25750K3246H302J49910d7129C5545J3499a16097B06866j03254
9994A03612f7578b044E5099a58851l1859j39215a1593j31479l0160f2989A83478
$$ plain form
9982 -163641 -443258 -103372 -109178 -199469 28570 -125159 325167 -57006 8662 -333128 -125644
9970 -270518 204175 34854 181151 -199622 27928 -4216 -77682 -188491 -294282 -216431 -211920
9959 -211920 81646 10650 -164304 -122165 31787 -118358 51305 -103739 -236574 -212408 24943
9947 -208632 96854 -143055 -134457 -295385 -185585 105091 353411 132410 -136397 138157
9936 3894 253286 -46612 253511 -55259 173511 83711 -3425 -232587 214731 -156822 -129437
9925 -129437 -264485 -65924 -121266 -63456 123585 -35493 208263 -34886 -26633 -295242 -127242
9913 -336506 -360691 -130168 -29237 -100178 -227949 101790 16215 39711 -135992 -57223 3767
9901 -216590 -396805 -200827 70065 52961 -329727 -38216 341631 3996 261993 -232428 41222
$$ packed form
9982a63641k79617a03372n806r0291B8570a25159C25167e7006H662c33128a25644
9970b70518B04175C4854J46297a99622B7928d216p3466j10809j05791P7851M511
9959b11920H1646A0650a64304M2139C1787a18358E1305a03739j32835K4166B4943
9947b08632I6854a43055Q598j60928J09800A05091K48320A32410a36397A38157
9936C894K49392d6612B53511e5259A73511H3711c425k29162B14731a56822K7385
9925a29437j35048f5924n5342N7810A23585c5493B08263c4886Q253k68609a27242
9913c36506k4185a30168b9237p0941j27771A01790A6215K3496a35992e7223C767
9901b16590j80215J95978G0065j7104c29727c8216C41631C996K57997b32428D1222
$$ plain form
9889 -25469 -40223 -59469 -101652 -18405 -7333 -209619 -60776 -100286 -202558 42038 -112593
9877 -109561 -215343 101385 124093 48821 223537 146777 63716 -265502 -245069 -52631 -107236
9866 -107236 152547 -71986 -191208 -177388 -524473 42668 -1416 9794 -469150 -34607 32041
9854 -501455 -60840 -75412 -241059 -84493 87710 -330788 -209063 -69324 104693 233531 -170011
9842 -127139 -243801 185804 149232 30541 -53010 25153 175303 -296358 101065 131612 177309
9831 177309 -37035 282126 -200715 -191161 123502 -173416 -381251 7090 161117 -342587 110505
9819 -79938 69703 140810 -181524 -42542 -297811 138457 -85566 -285268 -209444 -497 -23460
9808 -23460 45966 -424998 115642 -181916 -328108 -178385 92786 26041 43165 -89039 -9789
$$ packed form
9889b5469j4754j9246m2183a8405g333k02286f0776l9510j02272D2038a12593
9877a09561j05782A01385K2708D8821J74716p6760F3716b65502K0433e2631n4605
9866a07236A52547g1986j19222J3820l47085D2668a416I794d69150c4607C2041
9854e01455f0840j4572j65647h4493H7710c30788J21725f9324A04693J28838a70011
9842a27139j16662A85804l6572C0541e3010B5153J50150b96358A01065L0547M5697
9831A77309c7035B82126b00715R554A23502a73416k07835G090J54027c42587A10505
9819g9938F9703P1107a81524d2542k55269A38457h5566j99702P5824d97k2963
9808b3460D5966d24998A15642a81916j46192J49723I2786B6041J7124h9039i789
$$ plain form
9796 -73619 -280242 -81514 -180805 -118723 -113333 -149204 250760 184072 -191255 -61787 99043
9784 -160909 -60164 -24847 249826 -253812 -165579 93606 -61779 123152 -330611 -301076 -43296
9772 246209 8465 -49136 -214468 171141 51950 -50200 -148974 -41618 -195080 -22987 -195783
9761 -195783 21521 -62963 -273338 250225 -198988 -141 197457 27240 40675 -140916 80710
9749 -171478 -101469 -153155 -200738 153099 105964 -92680 227167 -55936 -131607 -98844 -262256
9738 -262256 -30479 -283794 -44552 -280823 44028 173516 77049 68607 -200260 -296957 -49225
9726 198306 -163177 5679 -61145 -54201 -117262 -126676 -38323 -134340 14419 224434 -226010 380467
9713 -91551 -78122 -204284 170280 -71776 -81156 158887 -156729 45841 -117622 3316 218940
$$ packed form
9796g3619k06623h1514r9291O2082N390l5871B50760o6688a91255f1787I9043
9784a60909f0164b4847B49826b53812Q8233I3606f1779A23152c30611K9535d3296
9772B46209H465d9136j65332A71141E1950e0200r8774d1618j53462b2987j72796
9761a95783B1521f2963k10375B50225a98988a41A97457B7240J3435a40916H0710
9749a71478P0009n1686m7583A53099m7135i2680B27167e5936p5671L2763j63412
9738b62256c0479k53315d4552k36271D4028J29488G7049q442b00260r6697d9225
9726A98306a63177E679f1145O944o3061r414c8323r6017A4419K10015b26010C80467
9713i1551J3429j26162A70280g1776r380A58887a56729D5841a17622C316K15624
$$ plain form
9702 218940 86991 453908 -340571 382 -73329 -8721 -87725 -223338 -108251 -164261 75211
9690 235816 -271720 -46234 168745 185104 -94431 -233187 -5432 -302151 -56238 71098 -278483
9678 81362 -93826 75536 -31080 -99251 -451729 -16744 -46374 -3828 174384 53255 -149240
9666 -104476 -50048 -91777 85665 125282 -311663 -336677 -161839 102742 -80442 83913 -29468
9654 -175520 -212619 -142799 -396749 -473010 294251 -308630 30350 -127716 -407161 208928
9643 -241467 -23612 -438417 92427 -41736 -161710 -163941 -212128 -437025 -44531 76400 183566
9632 183566 -42644 -36172 1233 -12260 -42306 -62429 -208128 -176115 -373313 -49493 1514 -26055
9619 5628 2306 137199 20813 -192769 6031 144235 -148286 -415565 -2769 -110164 181775
$$ packed form
9702B18940H6991L66917c40571C82g3329h721p9004j35613a08251n6010G5211
9690B35816b71720d6234A68745J6359i4431j38756e432k96719e6238G1098b78483
9678H1362i3826G5536c1080o8171l52478a6744k9630c828A74384E3255a49240
9666a04476e0048m1729H5665L9617c11663k5014a61839A02742h0442H3913b9468
9654a75520l7099O9820k53950p6261B94251c08630C0350a27716k79445B08928
9643b41467b3612m14805I2427d1736j19974k231m8187k24897d4531G6400J07166
9632A83566d2644O472A233a2260l0046k0123j45699L2013j97198d9493A514b6055
9619E628B306J34893B0813a92769F031J38204a48286k67279b769j07395A81775
$$ plain form
9607 -174858 -113566 124955 114774 69195 253481 -337936 35787 113698 51046 131131 275468
9596 275468 -28589 15046 -223564 131479 -374340 -259657 69810 -102967 -228215 -90849
9585 217283 208688 -83885 -373726 -14467 27598 367095 -588929 77074 191632 -104462 -95157
9574 -95157 -134888 -392169 -313831 -29727 -344857 74973 30860 14080 149095 18496 163857
9563 163857 -178928 -233204 -174711 84699 -16981 -160433 -91690 -267124 15256 -158273 213822
9551 8979 -94911 -8299 146647 71969 -206331 -119750 -166540 -104899 -165997 100858 72169 148790
9539 148790 -175252 -76105 292695 168846 -687118 -207902 43615 76962 -84650 86558 -320305
9527 -222943 14244 -82488 -315290 -313160 -24865 115204 174449 192313 289928 -130387 -7143
$$ packed form
9607a74858O1292A24955j0181m5579J84286c37936C5787P7911E1046Q0085J44337
9596B75468b8589A5046b23564A31479c74340J14683F9810a02967j25248i0849
9585B17283q595h3885k89841a4467B7598L39497e88929G7074J14558a04462R305
9574i5157l9731k57281P8338b9727l15130G4973C0860A4080J35015A8496J45361
9563A63857a78928n4276N8493H4699a6981j43452O8743j75434A5256a58273B13822
9551H979i4911h299A46647G1969b06331Q6581m6790O1641o1098A00858k8689P6621
9539A48790a75252g6105B92695j23849f87118b07902D3615L3347h4650H6558c20305
9527b22943A4244h2488k32802K130b4865A15204N9245J7864R7615a30387g143
$$ plain form
9515 186669 -74971 -125189 -95951 276498 196076 -156398 -386250 74133 167940 -122407 -135588
9504 -135588 -99367 197261 -61019 -239378 -142452 -31477 -168116 163548 -118863 -13497 70182
9492 -81795 -392089 -32947 -79224 99 99686 -206529 -28355 -233725 -136985 -99642 270496 15542
9479 -42454 -168054 -76523 21557 -81927 -21914 80214 -206397 -281030 -181443 88887 -55058
9467 -215481 295314 -31316 -247414 -35849 -89371 -11053 -36138 -86132 -63066 -183221 20168
9455 -195187 -19059 -162372 -198959 -131904 41275 -17226 -316562 -118985 -24618 -176149 217288
9443 257501 -6212 -175610 436992 -256720 -187576 -62169 -206531 -483077 193991 5836 -271866
9431 -42227 -20398 -66230 27859 -163804 -248260 38330 -170680 5818 -333879 -109561 235156
$$ packed form
9515A86669g4971n0218K9238B76498q0422a56398k29852G4133R3807a22407j3181
9504a35588L6221A97261f1019j78359R6926c1477j36639A63548a18863a3497G0182
9492h1795l10294c2947m6277I9R9587b06529b8355k05370R6740L7343B70496A5542
9479d2454j25600g6523B1557h1927b1914H0214b06397p4633R9587H8887e5058
9467b15481B95314c1316k16098c5849n3522a1053k5085m9994K3066j20155B0168
9455a95187a9059j43313l6587O7055D1275a7226k99336a18985b4618j51531B17288
9443B57501f212j69398D36992b56720O9144f2169j44362k76546A93991E836b71866
9431d2227b0398m5832B7859a63804q4456C8330a70680E818c33879a09561B35156
$$ plain form
9419 25595 -237331 -432490 110734 -76900 -562667 -119314 -162532 73326 44769 -84193 -85395
9408 -85395 87604 -1523 53461 -29581 -277571 -136303 -250576 -40600 437177 -227381 -19988
9396 -248970 209292 60332 -141465 116167 135542 -32607 -17876 -183796 59628 213542 -418675
9384 -275497 -383247 35466 198022 290870 1290 71445 -363182 -283085 -128945 -213260 -281615
9373 -281615 196902 42858 -279628 -201077 -267638 -245522 -212223 34269 -29372 204239 61749
9361 44369 -280567 -29838 -40908 77442 -58756 -45748 137003 5253 64114 78496 180664
9350 180664 92283 -83737 32563 60103 9722 111045 -158881 -27434 -246731 -123036 402822
9338 -258645 -226455 -202731 135021 178863 338637 23989 57248 76386 52193 -245221 -254323
$$ packed form
9419B5595b37331j95159A10734g6900m85767a19314m3218G3326k8557h4193j202
9408h5395H7604a523E3461b9581k47990a36303j14273d0600D37177b27381a9988
9396b48970B09292F0332a41465A16167J9375c2607J4731j65920E9628J53914d18675
9384b75497j07750C5466J62556R2848A290P0155c63182Q0097a28945q4315o8355
9373b81615A96902D2858b79628P8551o6561K2116L3299C4269b9372B04239F1749
9361D4369b80567b9838j1070G7442e8756J3008A37003E253N8861J4382J02168
9350A80664q8381h3737C2563K7540I722J01323a58881b7434k19297a23036D02822
9338b58645L2190K3724A35021M3842J59774B3989L3259J9138k4193b45221r102
$$ plain form
9327 -254323 -201367 -143155 -42592 63084 12852 -23433 -211187 191542 -72639 -43383 -118657
9316 -118657 -160778 -356306 -116443 -69665 396923 25067 -59846 -74620 -18845 42950 220940
9305 220940 -204114 -244188 168839 -59502 -232374 -328225 169023 -37488 28512 -234934 -101221
9293 96915 -342316 -392776 -109238 -191793 -131523 -235389 -176697 -228629 -240924 12433 -347796
9281 -65295 -44737 116802 -36469 -259281 18366 158085 269440 15809 306681 240811 -302938
9269 -108070 -198322 5881 -136479 -20484 -83853 -225957 -208687 -112509 -352404 83146 -210564
9257 -51058 -110372 -32707 -276114 168559 -350397 -149279 -55792 -71732 -150529 118897 97546
9246 97546 189002 -141120 -198230 -59377 104705 -69899 22562 -12121 276957 241989 -39608
$$ packed form
9327b54323N2956N8212d2592F3084A2852b3433j87754A91542g2639K9256p5274
9316a18657m2121j95528a16443M6778C96923B5067e9846j4774a8845D2950J77990
9305B20940b04114m0074A68839e9502j72872r5851A69023c7488B8512b34934a01221
9293I6915c42316n0460a09238q2555O0270j03866N8692n1932j2295A2433c47796
9281f5295K0558A16802c6469k22812A8366J39719J11355A5809K90872o5870c02938
9269a08070r0252E881a36479b0484o3369j42104J7270R6178k39895H3146b10564
9257e1058n9314c2707k43407A68559c50397a49279e5792j5940p8797A18897k1351
9246I7546R1456a41120n7110e9377A04705f9899B2562a2121B76957l4968c9608
$$ plain form
9234 120654 -10046 -181631 -22639 -316087 267790 -267016 -184407 165087 343190 39108
9223 -45246 -228507 -42306 307769 -192854 77571 -181381 -199058 -191270 147473 22812 -141114
9211 2295 34031 -265901 -270901 -109440 -90860 58451 -22134 77254 241635 30416 30497 -164855
9198 -78630 -438101 -10634 127191 -500226 -275549 -161695 -69883 12990 192611 67102 -437041
9186 -95971 -73046 -297989 -273964 -273772 49569 -119138 98335 -115167 -77921 -200262 182634
9174 -123444 -48238 -75085 -28359 -104194 -193244 267989 -111001 -29567 226248 108987 22824
9162 -120637 310405 -27486 -59874 -79910 25283 -279759 -51069 -122528 -127850 -314971 -173359
9151 -173359 -263807 29666 29848 94844 -315825 126442 -118775 308540 -93377 -241291 -345772
$$ packed form
9234A20654a0046j71585b2639k93448B67790b67016Q2609A65087J78103C9108
9223d5246j83261d2306C07769a92854G7571a81381j7677P788A47473B2812a41114
9211B295L1736b65901n000a09440J8580E8451b2134G7254J64381C0416Q1a64855
9198g8630l59471a0634A27191e00226K24677J13854f9883A2990J79621F7102d37041
9186i5971K2925k24943K4025J92D9569a19138I8335a15167L7246j22341A82634
9174a23444d8238k6847b8359p5835q9050B67989a11001b9567B26248A08987B2824
9162a20637C10405b7486l2388k0036B5283b79759e1069p1459n322j87121J41612
9151a73359r0448B9666J82O4996c15825A26442a18775C08540i3377j47914j04481
$$ plain form
9140 -345772 -144046 -109534 300760 106583 185894 -186461 186443 77250 122693 -286998
9129 -31541 -230236 145076 11369 46086 -521883 -26953 -237087 8884 102395 151570 -99912
9117 -21553 -315183 -362237 -111332 -149600 -60116 250560 -212680 -42273 -137821 -156207 49429
9105 205187 -251676 45373 37701 -20688 110341 -294564 259275 242996 202418 -214307 -104314
9093 129014 -121404 -82883 26418 238305 -89490 -127295 -332761 -221386 213998 -185845
9082 -355409 63520 58526 -233113 -172848 -7418 157142 -217766 164078 -154302 28191 -58191
9070 44088 204928 31845 252922 -63081 -92175 -159349 -272958 -25843 36722 -122507 -398653
9059 -398653 194522 -224406 -311244 -83853 -11666 -311368 -567111 -91378 -332053 -121900
$$ packed form
9140c45772a44046L4512C00760A06583P9311a86461A86443G7250M5443b86998
9129c1541j98695A45076A1369L4717e21883b6953k10134H884R3511M9175i9912
9117b1553k93630m7054a11332l8268f0116B50560b12680d2273r5548j8386D9429
9105B05187b51676D5373p672b0688A10341b94564B59275j6279m0578b14307a04314
9093A29014a21404L8521B6418K11887h9490l7805k05466J11375B13998a85845
9082c55409F3520m994b33113O0265g418A57142b17766A64078a54302B8191e8191
9070D4088J60840C1845K21077f3081k9094o7174j13609b5843C6722a22507k76146
9059c98653A94522b24406q6838h3853a1666k99702k55743i1378k40675a21900
$$ plain form
9048 -9011 -1471 -127585 58842 -86962 -87694 88322 -311585 81296 -73247 10805 -54286 -96094
9036 -96094 55920 -42170 60682 41486 -223169 21367 -119478 -57543 -54946 -454876 -259511
9025 -259511 13566 -443672 -214200 -5602 120267 -223306 -8463 165346 -201119 70910 -62550
9013 -53795 -59339 -420542 -44832 -117296 242340 -209757 -5336 403488 -58832 -72552 -226580
9002 -226580 -22963 39888 -9453 332817 64531 354932 -284668 -69701 -52063 182550 -43613
8990 303485 300385 367736 176163 -149061 -178620 23736 -129140 173108 -8334 -292153 -287898
8979 -287898 -47425 -90303 142492 -282179 -144197 -25217 -150351 -215648 -174034 141664 -67848
8967 15108 197921 -151933 -18077 -147874 295652 106630 -34076 -217122 -78796 -103772 -169179
$$ packed form
9048i011a471j26114E8842h6962p32H8322c11585H1296g3247A0805e4286m1808
9036i6094E5920d2170F0682j9196b23169B1367a19478e7543K597l99930J95365
9025b59511A3566d43672b14200e602A20267b23306h463A65346b01119G0910f2550
9013e3795n544l61203d4832p2464B42340b09757e336D03488e8832j3720j54028
9002b26580b2963C9888i453C32817F4531K90401b84668f9701J7638A82550d3613
8990C03485l100O7351A76163a49061k9559B3736a29140A73108h334k83819M255
8979b87898d7425m2878A42492b82179J37982b5217j25134o5297M1614A41664f7848
8967A5108J82813a51933a8077j29797B95652A06630c4076j83046g8796k4976o5407
$$ plain form
8956 -169179 -71067 -315571 44653 -127397 -62707 114856 84034 -376542 -186262 -75118 -247756
8945 -247756 -149704 99340 -64170 -111380 29770 139937 -380557 54426 147147 -485744 -353350
8934 -353350 110892 53039 176526 80026 51880 -118023 89517 -134009 2256 153522 -138302
8922 72670 133293 169533 271524 132051 -89998 350027 232137 252366 217795 277708 346498
8911 346498 700984 548703 841486 1678353 3645529 7759488 6189931 2997810 1794073
8902 1794073 1012125 611921 459388 419896 94248 67674 154022 365115 208816 124956
8892 124956 205302 -246910 63067 285165 134696 -99165 -153661 -213210 -207198 -197976 -329644
8881 -329644 32275 -25768 -162889 -32708 408752 37627 127290 -75734 -217546 -194572 138998
$$ packed form
8956a69179g1067k44504D4653a27397f2707A14856l0822c76542a86262g5118j72638
8945b47756R8052I9340f4170m7210B9770J10167c80557E4426R2721d85744J32394
8934c53350A10892E3039J23487H0026k8146a18023H9517a34009B256J51266a38302
8922G2670O0623L6240J01991A32051h9998C50027j17890K0229l4571N9913O8790
8911C46498L54486j52281K92783Q36867J967176M113959j569557B997810j203737
8902A794073p81948m00204j52533l9492I4248k6574Q6348K11093j56299q3860
8892A24956Q0346b46910F3067K22098A34696i9165n4496n9549O012R222j31668
8881c29644C2275b5768j37121c2708D08752C7627Q9663g5734j41812K2974A38998
$$ plain form
8869 -223176 137096 -275720 -270463 -48014 -251456 -130892 35960 -30389 -151196 -23971 277377
8857 -107309 -309164 -266724 -230210 6173 -39192 178933 -108263 -38470 6386 -147991 -53874
8845 265342 -159674 205346 -17820 -11984 148394 -144017 -59532 -65903 -115840 -95510 -52852
8834 -52852 140020 54781 27440 -468788 99990 -61213 -164443 -33423 -26170 -210311 124449
$$ packed form
8869b23176A37096b75720N257d8014k03442J20564C5960c0389j20807b3971B77377
8857a07309k01855M2440L6514F173c9192A78933a08263c8470F386a47991e3874
8845B65342a59674B05346a7820N836A48394a44017e9532o371m9937K0330M2658
8834e2852A40020E4781k7341d68788I9990f1213j03230c3423P253j84141A24449
$$ [...]
##END NTUPLES=NMR SPECTRUM
##END=
