
##TITLE=AC1160_Rove100-14_5867767_M9hd03SO8T
##JCAMPDX= 6.0         $$ Bruker NMR JCAMP-DX V2.0
##DATA TYPE= NMR SPECTRUM
##DATA CLASS= NTUPLES
##ORIGIN= BRUKER
##OWNER= Administrator
$$ 1.72 TOPSPIN		Version 2.1
$$ 2012-03-30 23:16:09.718 -0500  Administrator@TOPSPIN
$$ Compression mode = diff/dup
##.OBSERVE FREQUENCY= 400.13188235
##.OBSERVE NUCLEUS= ^1H
##.ACQUISITION MODE= SIMULTANEOUS (DQD)
##.ACQUISITION SCHEME= undefined
##.AVERAGES= 64
##.DIGITISER RES= 22
##SPECTROMETER/DATA SYSTEM= spect
##.PULSE SEQUENCE= noesygpps1d.comp
##.SOLVENT NAME= COFFEE_meoh
##.SHIFT REFERENCE= INTERNAL, COFFEE_meoh, 1, 14.96674
##AUDIT TRAIL= $$ (NUMBER, WHEN, WHO, WHERE, PROCESS, VERSION, WHAT)
$$ ##TITLE= Audit trail, TOPSPIN		Version 2.1
$$ ##JCAMPDX= 5.01
$$ ##ORIGIN= Bruker BioSpin GmbH
$$ ##OWNER= Administrator
$$ $$ C:\Bruker\TOPSPIN/data/COFFEE/nmr/AC1160_Rove100-14_5867767_M9hd03SO8T/12/pdata/1/auditp.txt
$$ ##AUDIT TRAIL=  $$ (NUMBER, WHEN, WHO, WHERE, PROCESS, VERSION, WHAT)
(   1,<2012-03-30 23:16:04.968 -0500>,<Administrator>,<TOPSPIN>,<go>,<TOPSPIN 2.1>,
      <created by zg
	started at 2012-03-30 23:04:33.390 -0500,
	POWCHK enabled, PULCHK disabled,
       configuration hash MD5:
       1A 1E CE 29 27 FD 77 03 67 4E F0 E3 C4 B2 CB 90
       data hash MD5: 64K
       C7 45 02 18 CA 1B 6B 1E 89 21 89 78 F2 D9 58 9D>)
(   2,<2012-03-30 23:16:07.734 -0500>,<Administrator>,<TOPSPIN>,<proc1d>,<TOPSPIN 2.1>,
      <Start of raw data processing
       efp LB = 0.3 FT_mod = 6 PKNL = 1 PHC0 = 0 PHC1 = 0 SI = 128K 
       data hash MD5: 128K
       2E 3B B8 E4 7C EF A2 C8 87 5C 7C AE DD 4E 45 90>)
(   3,<2012-03-30 23:16:08.953 -0500>,<Administrator>,<TOPSPIN>,<proc1d>,<TOPSPIN 2.1>,
      <pk PHC0 = 30.76721 PHC1 = 0 
       data hash MD5: 128K
       B0 56 46 6B 4B 53 27 E5 6C EF BF 5D F4 7F BF CA>)
(   4,<2012-03-30 23:16:09.187 -0500>,<Administrator>,<TOPSPIN>,<proc1d>,<TOPSPIN 2.1>,
      <abs ABSG = 1 
       data hash MD5: 128K
       9C FD B7 86 60 D9 FA DC 5F 80 DA 56 C6 8E 3E 8D>)
(   5,<2012-03-30 23:16:09.265 -0500>,<Administrator>,<TOPSPIN>,<proc1d>,<TOPSPIN 2.1>,
      <abs ABSG = 2 
       data hash MD5: 128K
       7A 7D 31 CB D7 29 BD E2 17 64 51 6F E1 E4 C8 69>)
(   6,<2012-03-30 23:16:09.406 -0500>,<Administrator>,<TOPSPIN>,<proc1d>,<TOPSPIN 2.1>,
      <abs ABSG = 3 
       data hash MD5: 128K
       86 76 04 37 F1 7D A7 F9 90 25 81 76 CB 26 52 3D>)
(   7,<2012-03-30 23:16:09.593 -0500>,<Administrator>,<TOPSPIN>,<proc1d>,<TOPSPIN 2.1>,
      <abs ABSG = 4 
       data hash MD5: 128K
       2A BD 7B 13 BD F1 17 31 AE 09 BB 4B 5C BF D8 DF>)
(   8,<2012-03-30 23:16:09.640 -0500>,<Administrator>,<TOPSPIN>,<proc1d>,<TOPSPIN 2.1>,
      <abs ABSG = 5 
       data hash MD5: 128K
       D5 30 68 0A 9B 37 C7 9F E5 1F 79 80 36 FD E5 1B>)
$$ ##END=
$$ 
$$ $$ hash MD5
$$ $$ DE 5A 76 7A B4 E8 D7 47 2E 07 FF CC D5 DA B5 B8
##$RELAX= 
##$RELAX= 
##$RELAX= 
##$RELAX= 
##$RELAX= 
##$RELAX= 
##$RELAX= 
##$RELAX= 
$$ Bruker specific parameters
$$ [...]
##$TP07= 0
##$TPNAME0= <>
##$TPNAME1= <>
##$TPNAME2= <>
##$TPNAME3= <>
##$TPNAME4= <>
##$TPNAME5= <>
##$TPNAME6= <>
##$TPNAME7= <>
##$TPOAL= (0..7)
0.5 0.5 0.5 0.5 0.5 0.5 0.5 0.5
##$TPOFFS= (0..7)
0 0 0 0 0 0 0 0
##$TUNHIN= 0
##$TUNHOUT= 0
##$TUNXOUT= 0
##$USERA1= <user>
##$USERA2= <user>
##$USERA3= <user>
##$USERA4= <user>
##$USERA5= <user>
##$V9= 5
##$VALIST= <valist>
##$VCLIST= <CCCCCCCCCCCCCCC>
##$VD= 0
##$VDLIST= <DDDDDDDDDDDDDDD>
##$VPLIST= <PPPPPPPPPPPPPPP>
##$VTLIST= <TTTTTTTTTTTTTTT>
##$WBST= 2048
##$WBSW= 25
##$XGAIN= (0..3)
0 0 0 0
##$XL= 0
##$YL= 0
##$YMAX_a= 9054723
##$YMIN_a= -5228238
##$ZGOPTNS= <>
##$ZL1= 120
##$ZL2= 120
##$ZL3= 120
##$ZL4= 120
##$ABSF1= 14.96674
##$ABSF2= -5.585791
##$ABSG= 5
##$ABSL= 3
##$ALPHA= 0
##$AQORDER= 0
##$ASSFAC= 0
##$ASSFACI= 0
##$ASSFACX= 0
##$ASSWID= 0
##$AUNMP= <proc_prof1d_extract.lims>
##$AXLEFT= 0
##$AXNAME= <>
##$AXNUC= <1H>
##$AXRIGHT= 0
##$AXTYPE= 0
##$AXUNIT= <>
##$AZFE= 0.1
##$AZFW= 0.1
##$BCFW= 0
##$BC_mod= 0
##$BYTORDP= 0
##$COROFFS= 0
##$CY= 15
##$DATMOD= 1
##$DC= 0
##$DFILT= <>
##$DTYPP= 0
##$F1P= 0
##$F2P= 0
##$FCOR= 0.5
##$FTSIZE= 131072
##$FT_mod= 6
##$GAMMA= 0
##$GB= 0
##$INTBC= 1
##$INTSCL= 1
##$ISEN= 128
##$LB= 0.3
##$LEV0= 0
##$LPBIN= 0
##$MAXI= 10000
##$MC2= 0
##$MEAN= 0
##$ME_mod= 0
##$MI= 0
##$NCOEF= 0
##$NC_proc= -3
##$NLEV= 6
##$NOISF1= 0
##$NOISF2= 0
##$NSP= 0
##$NTH_PI= 0
##$NZP= 0
##$OFFSET= 14.96674
##$PC= 1
##$PHC0= 30.76721
##$PHC1= 0
##$PH_mod= 1
##$PKNL= yes
##$PPARMOD= 0
##$PPDIAG= 0
##$PPIPTYP= 0
##$PPMPNUM= 2147483647
##$PPRESOL= 1
##$PSCAL= 4
##$PSIGN= 0
##$PYNMP= <proc.py>
##$REVERSE= no
##$SF= 400.130005552274
##$SI= 131072
##$SIGF1= 0
##$SIGF2= 0
##$SINO= 400
##$SIOLD= 131072
##$SPECTYP= <>
##$SREGLST= <1H.CDCl3>
##$SSB= 0
##$STSI= 131072
##$STSR= 0
##$SW_p= 8223.68421052632
##$SYMM= 0
##$S_DEV= 0
##$TDeff= 65536
##$TDoff= 0
##$TI= <>
##$TILT= no
##$TM1= 0
##$TM2= 0
##$TOPLEV= 0
##$USERP1= <user>
##$USERP2= <user>
##$USERP3= <user>
##$USERP4= <user>
##$USERP5= <user>
##$WDW= 1
##$XDIM= 131072
##$YMAX_p= 438980999
##$YMIN_p= -157390456
##$CURPLOT= <Network HP LaserJet P1505>
##$CURPRIN= <$Network HP LaserJet P1505>
##$DFORMAT= <normdp>
##$LAYOUT= <+/1D_H.xwp>
##$LFORMAT= <normlp>
##$PFORMAT= <normpl>
##$SURQMSG= 1
$$ End of Bruker specific parameters
$$ ---------------------------------
##NTUPLES= NMR SPECTRUM
##VAR_NAME=  FREQUENCY,     SPECTRUM/REAL,   SPECTRUM/IMAG
##SYMBOL=    X,             R,               I
##VAR_TYPE=  INDEPENDENT,   DEPENDENT,       DEPENDENT
##VAR_FORM=  AFFN,          ASDF,            ASDF
##VAR_DIM=   131072,        131072,          131072
##UNITS=     HZ,            ARBITRARY UNITS, ARBITRARY UNITS
##FACTOR=    0.0627417313425165, 1,          1
##FIRST=     8223.62146879498, 7217,         -79793
##LAST=      0,             8277,            -77450
##MIN=       0,             -157390456,      0
##MAX=       8223.62146879498, 438980999,    0
$$ Real data points
##PAGE= N=1
##DATA TABLE= (X++(R..R)), XYDATA
$$ [...]
63729D27780p248q498q054o766o302p188q340q331o687m167k279k223l630m691
63715C43376m105k548j515j262q97j94O4m33r78j046r45r11o80m09q88k118k751
63698C21760j901o12l77q70n28R80K234K154J313Q08Q92J370K360L725M371L259
63682C40938J014m95l32O04J188J637K681L849L822K412J159J483L079M550N069
63667C72658M843M452M388M979O082P016P182O738O152N427M285K983K246K372
63653D41803K921L270L023J973K18j635k876l332l254k787k146k009k867m013
63639D28289m173l225k379k328k323j522l04N35J077J970L316M701N822O360N846
63624D41662M485L615M331N900O610O002N139M729M205L058J963J906K768L491
$$ plain form
63729 427780 420532 412034 403980 397214 390912 383724 375384 367053 360366 356199 353920 351697 348067 343376
63715 343376 339271 336723 335208 333946 333049 332855 332919 332486 331508 330462 329517 328606 327926 327517 326629 324511 321760
63698 321760 319859 319247 318870 318000 317472 318452 320686 322840 324153 324961 325853 327223 329583 333308 337679 340938
63682 340938 341952 341457 341125 341729 342917 344554 347235 351084 354906 357318 358477 359960 363039 367589 372658
63667 372658 377501 381953 386341 391320 397402 404418 411600 418338 424490 429917 434202 437185 439431 441803
63653 441803 444724 447994 451017 452990 453208 451573 448697 445365 442111 439324 437178 435169 432302 428289
63639 428289 424116 420891 418512 416184 413861 412339 412035 412570 413647 415617 418933 423634 429456 435816 441662
63624 441662 446147 449762 454093 459993 466603 472605 477744 482473 486678 489736 491699 493605 496373 499864
63610D99864L334K585K228L076M932O473O424M943L392K489J466n97l222n071
63596E32316n640n630n691n608m862l540k306j734j831k085j890j031J41J105
63582D91714J703K235L035M102N119N810O225O795P991R849J1824J3175J3560
63569E83137J3254J2910J3072J3845J4924J5927J6739J7583J8792K0526K2535
63558G63244K4168K4889K5078K6007K8550L2090L5309L7975M1116M5239M9298
63547A132963N2002N3433N4581N5797N6560N6465N5328N2423M6668L8016K7907
63536A682143J8016R035R79o022j1750j6227j9602k1990k3698k5258k6920k8536
63524A530170l0178l2251l4569l6024l5907l4903l3882l2220k8651k3694j9683
$$ plain form
63610 499864 503198 505783 508011 511087 516019 522492 528916 533859 537251 539740 541206 540609 537387 532316
63596 532316 526676 521046 515355 509747 504885 501345 499039 497305 495474 493389 491499 490468 490609 491714
63582 491714 493417 495652 498687 502789 507908 513718 519943 526738 534729 544578 556402 569577 583137
63569 583137 596391 609301 622373 636218 651142 667069 683808 701391 720183 740709 763244
63558 763244 787412 812301 837379 863386 891936 924026 959335 997310 1038426 1083665 1132963
63547 1132963 1184965 1238398 1292979 1348776 1405336 1461801 1517129 1569552 1616220 1654236 1682143
63536 1682143 1700159 1709194 1710173 1704151 1692401 1676174 1656572 1634582 1610884 1585626 1558706 1530170
63524 1530170 1499992 1467741 1433172 1397148 1361241 1326338 1292456 1260236 1231585 1207891 1188208
63513A188208j7860j6663j3882r625n962m044k819p23K446N754Q465J0630J2696
63500A156621J5072J7830K0435K2061K2615K3181K4901K7519K9737L1072L2600
63489A423644L5462L9315M2965M6199N0083N5468O1788O7466P0796P0125O3844
63478B027155N1175L3347J3792l279j5100k1716k5252k7676k9385l0058l0212
63467A942791l1024l2802l4797l6788l9711m4028m8420n1108n1900n1923n1727
63456A468563n0841m9031m6863m4780m2523l9804l6837l3856l0714k7259k3686
63445A042369k0314j7440j5506j4840j4997j4950j4149j2960j1980j1477j1533
63434H82223j1983j2093j1198r894r554j0260j0341q833p110o859p336o357l591
$$ plain form
63513 1188208 1170348 1153685 1139803 1130178 1124216 1120172 1117353 1116630 1119076 1124830 1133295 1143925 1156621
63500 1156621 1171693 1189523 1209958 1232019 1254634 1277815 1302716 1330235 1359972 1391044 1423644
63489 1423644 1459106 1498421 1541386 1587585 1637668 1693136 1754924 1822390 1893186 1963311 2027155
63478 2027155 2078330 2111677 2125469 2122190 2107090 2085374 2060122 2032446 2003061 1973003 1942791
63467 1942791 1911767 1878965 1844168 1807380 1767669 1723641 1675221 1624113 1572213 1520290 1468563
63456 1468563 1417722 1368691 1321828 1277048 1234525 1194721 1157884 1124028 1093314 1066055 1042369
63445 1042369 1022055 1004615 989109 974269 959272 944322 930173 917213 905233 893756 882223
63434 882223 870240 858147 846949 837055 827501 817241 806900 798067 790957 784098 776762 770405 766814
63421G66814j054k52n36p30p72q42k83J315K789K611J060j40j87L9j60j44O06
63404G70134R08q57m175o447n945l761k208k038k209j890j385r92j95J302K686
63389G42928L145L341M593O857Q673R272R674J1141J3555J6057J8638K2048K6335
63376H96257L0540L4041L7530M2150M8086N4327N9461O2252O1671N7132M9085
63365A432532L9182K9512K1659J6499J4480J5682J9508K4867L0897L7438M4543
63354A726799N1734N7941O2009O3128O1042N6193M9432M1237L1340J9714P699
63343B228268k655j0568j7067k3142k8218l1316l3162l5875m0449m5548m9262
63332A911006n1271n2632n3937n4521n3435n0620m6913m3275m0071l6940l3271
$$ plain form
63421 766814 765760 765508 764972 764242 763470 762628 762345 763660 766449 769060 770120 769980 769793 769832 769672 769528 770134
63404 770134 771042 770185 766010 759563 753618 749857 747649 745611 743402 741512 740127 739135 738940 740242 742928
63389 742928 746073 749414 754007 760864 769537 778809 788483 799624 813179 829236 847874 869922 896257
63376 896257 926797 960838 998368 1040518 1088604 1142931 1202392 1264644 1326315 1383447 1432532
63365 1432532 1471714 1501226 1522885 1539384 1553864 1569546 1589054 1613921 1644818 1682256 1726799
63354 1726799 1778533 1836474 1898483 1961611 2022653 2078846 2128278 2169515 2200855 2220569 2228268
63343 2228268 2225613 2215045 2197978 2174836 2146618 2115302 2082140 2046265 2005816 1960268 1911006
63332 1911006 1859735 1807103 1753166 1698645 1645210 1594590 1547677 1504402 1464331 1427391 1394120
63321A394120k8858k4117j9597j5611j2364r933p657m164J137O776J0423J1542
63309A301697J1967J3607J6487J9522K2253K4930K7615L0294L3577L8198M3793
63298A583940M8941N2514N4449N5429N6361N7928N9847O0739N9448N6162N1461
63287B197219M4786L5303K3931J2814K602p734j7931k5447k8842l0318l2954l6778
63275B136651l9715m1560m4441m9394n4754n8416n9836n9223n6598n2724m9412
63264A570578m7511m5518m1412l5338k9245k4241j9580j4444r765p706r675j5123
63252A271020k2115k8827l4309l8093l9613l8537l5402l1438k7772k5083k3675
63241I26156k3216k2629k1150j9487j9065j9996k0734j9947j7789j5104j2527
$$ plain form
63321 1394120 1365262 1341145 1321548 1305937 1293573 1283640 1275983 1271819 1272956 1279732 1290155 1301697
63309 1301697 1313664 1327271 1343758 1363280 1385533 1410463 1438078 1468372 1501949 1540147 1583940
63298 1583940 1632881 1685395 1739844 1795273 1851634 1909562 1969409 2030148 2089596 2145758 2197219
63287 2197219 2242005 2277308 2301239 2314053 2316655 2308921 2290990 2265543 2236701 2206383 2173429 2136651
63275 2136651 2096936 2055376 2010935 1961541 1906787 1848371 1788535 1729312 1672714 1619990 1570578
63264 1570578 1523067 1477549 1436137 1400799 1371554 1347313 1327733 1313289 1303524 1295818 1286143 1271020
63252 1271020 1248905 1220078 1185769 1147676 1108063 1069526 1034124 1002686 974914 949831 926156
63241 926156 902940 880311 859161 839674 820609 800613 779879 759932 742143 727039 714512
63230G14512j0901j1280j3413j5109j4341j1505q598o688n450m767n248o844q291
63217E92077q481p705o970o672o397n711m688l800l527l977m820n597n977n663
63203E12092m429k642j420j634k862l798l603k434q82M63R78L55r76k248l179
63188D83781l803l762k748j559j543k598k932j448O66J601J211N27j95j495l092
63173D62611l762l081j984j251o02K04M99j48q20l52Q59J316N63k11J46J393K574
63156D57954L272L599L536K953K068J321R05Q19J095J576J679J066M60J084L153
63141D86540N488O858P138O873O376N794N586O194P443Q811J0168J1662J2955
63128E87886J3297J2580J1760J1867J2907J4117J4969J5508J5808J5637J4870
$$ plain form
63230 714512 703611 692331 678918 663809 649468 637963 629365 622677 617227 612460 607212 600368 592077
63217 592077 583596 575891 568921 562249 555852 550141 545453 541653 538126 534149 529329 523732 517755 512092
63203 512092 507663 505021 503601 501967 499105 495307 491704 489270 488388 488851 489829 490184 489208 486960 483781
63188 483781 479978 476216 473468 471909 470366 467768 464836 463388 464054 465655 466866 467393 467198 465703 462611
63173 462611 458849 455768 453784 452533 451931 452135 452634 452486 451666 451314 452173 453489 454052 453841 453987 455380 457954
63156 457954 461226 464825 468361 471314 473382 474703 475608 476427 477522 479098 480777 481843 482303 483387 486540
63141 486540 492028 498886 506024 512897 519273 525067 530653 536847 544290 553101 563269 574931 587886
63128 587886 601183 613763 625523 637390 650297 664414 679383 694891 710699 726336 741206
63117G41206J3855J2986J2037J0423Q270O716O629P272O922M844K028j33j265
63104H31790j888k595l982o713j0770j4849j7346j7977j7861j7997j8254j7962
63092F83596j6893j5461j4232j3339j2340j0788r145q587r445j0294r366o610
63080E47096l562j559r36j595l013l842k965j213n58j235j156J092M229O248O985
63065E44016P303O987N345L243K650M151O378Q076R371J0848J2440J3605J3866
63052F48279J3041J1659J0970J1790J3438J4656J5242J5877J6633J6994J7145
63041H05724J7865J9085J9903K0126K0421K0762K0324J9236J8650J8538J7081
63030A017715J3241Q388M194M46l774q106j1691j4853j8303k1474k3277k3832
$$ plain form
63117 741206 755061 768047 780084 790507 798777 805493 812122 819394 826316 831160 833188 833055 831790
63104 831790 829902 827307 823325 816612 805842 790993 773647 755670 737809 719812 701558 683596
63092 683596 666703 651242 637010 623671 611331 600543 591398 582811 573366 563072 553706 547096
63080 547096 543534 541975 541039 539444 536431 532589 529624 528411 527853 526618 525462 526554 530783 537031 544016
63065 544016 551319 558306 563651 566894 569544 573695 580073 588149 597520 608368 620808 634413 648279
63052 648279 661320 672979 683949 695739 709177 723833 739075 754952 771585 788579 805724
63041 805724 823589 842674 862577 882703 903124 923886 944210 963446 982096 1000634 1017715
63030 1017715 1030956 1039344 1043538 1043984 1040210 1032104 1020413 1005560 987257 965783 942506 918674
63018I18674k3987k3751k2849k2083k2230k2119j9899j6136j3414j2742j2395
63007G07069j0820q627o938n613m203l058k395j599n56k38p48k63K440N555O345
62992F76351M939L995M845O112O448O521P348Q191P628N915M845N412O800P917
62978G63267Q905J0498J2473J3602J3193J1898J0695R619Q111O212M728M158M136
62965H81495L979L397K562J927J902K314K312J467O62J068K338K951K552K600
62951I13526M200O554Q425R949J1822J3657J4584J5050J6487J9201K1824K3063
62939A078342K3029K2610K2232K1584K0109J7715J5220J3804J3601J3308J1886
62928A273440J0096R301R154P738M066q29n532r779j3841j7444k0212k2525k5077
$$ plain form
63018 918674 894687 870936 848087 826004 803774 781655 761756 745620 732206 719464 707069
63007 707069 696249 687622 680684 675071 670868 667810 665415 663816 663260 663022 662274 662011 664451 670006 676351
62992 676351 681290 685285 690130 696242 702690 709211 716559 724750 732378 738293 743138 748550 755350 763267
62978 763267 772172 782670 795143 808745 821938 833836 844531 854150 862261 868473 873201 877359 881495
62965 881495 885474 888871 891433 893360 895262 897576 899888 901355 902017 903085 905423 908374 910926 913526
62951 913526 917726 924280 932705 942654 954476 968133 982717 997767 1014254 1033455 1055279 1078342
62939 1078342 1101371 1123981 1146213 1167797 1187906 1205621 1220841 1234645 1248246 1261554 1273440
62928 1273440 1283536 1292837 1301991 1309729 1313795 1312966 1307434 1297655 1283814 1266370 1246158 1223633 1198556
62915A198556k7781k9726l0196k9420k8374k7980k8331k8654k8143k6792k5125
62904H88034k3233k0579j6891j2839r620q015p886q434r011r654j0558j1124j0310
62891G29880q346p183q292j0657j1962j1396j0117r333r222r587j0220j0459r736
62878F03370q631q161q000o962n401n237o796p600n601k265p55j985m025m857
62864E27094m191k848j626r19n40P9J005J467R29Q0J09J435L635N978P392O829
62848E45908M699L220M070O245P400O862O093O501Q038R801J0811J0378Q863P913
62834F46802Q717J0160J0068Q117O149N493N485M936L577J616q73l502n611p296
62820F93838r306j1451j2377j1592j0557j0839j2167j3211j3394j2935j1907j0393
$$ plain form
62915 1198556 1170775 1141049 1110853 1081433 1053059 1025079 996748 968094 939951 913159 888034
62904 888034 864801 844222 827331 814492 804872 796857 788971 780537 771526 761872 751314 740190 729880
62891 729880 721534 714351 706059 695402 683440 672044 661927 652594 643372 633785 623565 613106 603370
62878 603370 594739 586578 578578 571616 566215 560978 554182 546582 540981 538716 537961 535976 531951 527094
62864 527094 522903 520055 518429 517510 516970 517049 518054 519521 520450 520530 520639 522074 525709 531687 539079 545908
62848 545908 550607 553827 557897 564142 571542 578404 584497 590998 599036 608837 619648 630026 638889 646802
62834 646802 655519 665679 675747 683864 690013 695506 700991 705927 709504 711120 710247 706745 701134 693838
62820 693838 684532 673081 660704 649112 638555 627716 615549 602338 588944 576009 564102 553709
62808E53709r139q875r227r088p971o360m960m173l978l871l261k296j797j956
62794D76757j884j054l33o51j448j682j716k742m547n450m599l030k076j878j963
62779D41704k121k048j123O29J967J739L59p67r27n43j64J79N67Q85J133J515
62763D42984K000K096J450M82L3L46P32N15J39Q03K791M548M092J307j711k830
62747D59777j960o34rQ4K55N30N87N00O90J188J505J376J209J493J956J750M97
62730D70794j165k162j912o11J028K224K561K444K854M316O093O827N985M368
62716E03644L154K800L091L803M937O348P565Q011P317N594L561K232K065K347
62702E66469J722m06l182n171n795n696n785o157o138n300m146l594l845m115
$$ plain form
62808 553709 544570 535695 526468 517380 509409 503049 498089 493916 489938 486067 482806 480510 478713 476757
62794 476757 474873 473819 473486 472835 471387 469705 467989 465247 460700 455250 450651 447621 445545 443667 441704
62779 441704 439583 437535 436412 437041 439008 440747 441106 440339 439412 438869 438705 438884 439451 440336 441469 442984
62763 442984 444984 447080 448530 449012 449045 449391 450123 450638 450777 451580 454371 458919 463011 464318 462607 459777
62747 459777 457817 457183 457174 457258 457513 458043 458630 459130 459820 461008 462513 463889 465098 466591 468547 470297 470794
62730 470794 469629 467467 465555 464944 465972 468196 470757 473201 476055 480371 486464 493291 499276 503644
62716 503644 506798 509598 512689 516492 521429 527777 535342 543353 550670 556264 559825 562057 564122 566469
62702 566469 568191 567785 564603 559432 553637 547941 542156 535999 529861 524561 520415 516821 512976 508861
62688E08861l619k564j834j920k610l604m777n693n563m084j998l26O07J099J442
62673D73417J799K248K447J756L47l88M28J634J530O29J227M054P092Q410Q464
62658E15094Q574Q682Q257Q181R736J2268J3740J3512J2836J2651J2689J3050
62646F49270J4870J8528K2468K4851K5632K6244K7910L0844L4362L7140L7970
62635I50089L6914L5278L4132L3484L3094L2980L2508L0153K5227J9001J3072
62624A275932P334Q13o182j2306j7283k2161k7270l1458l3831l5016l6078l7099
62612A025395l7639l7746l7609l6701l4316l0817k7597k5593k4374k2933k0979
62601F89091j9113j7936j7306j6634j5579j4241j2756j1132r483q099p078o202
$$ plain form
62688 508861 505242 502678 500844 498924 496314 492710 487933 482240 476677 472593 470595 470269 470876 471975 473417
62673 473417 475216 477464 479911 481667 482014 481626 482054 483688 485218 485847 487074 491128 498220 506630 515094
62658 515094 523668 532350 540607 548788 558524 570792 584532 598044 610880 623531 636220 649270
62646 649270 664140 682668 705136 729987 755619 781863 809773 840617 874979 912119 950089
62635 950089 987003 1022281 1056413 1089897 1122991 1155971 1188479 1218632 1243859 1262860 1275932
62624 1275932 1283266 1284079 1277897 1265591 1248308 1226147 1198877 1167419 1133588 1098572 1062494 1025395
62612 1025395 987756 950010 912401 875700 841384 810567 782970 757377 733003 710070 689091
62601 689091 669978 652042 634736 618102 602523 588282 575526 564394 554911 546812 539734 533532
62589E33532n406m951m880m717m155l652l711l970l734l152k992l263l069k073
62575D79807j161j138j514j311n20l4l49j014j274p97J30O85Pj894l805m334l338
62558D58146j936j152r85q49m23M6P7n37j470k136k437k906l697l852k417j84
62542D33288Q13j31j395j245n1P04P99J216K087K336J570Q73J098J563J344Q58
62526D45727J153K237L106L041J959l2k398l795l120j087L22J13p88j082o33j27
62510D44596q4o86j900l249l926l631k925k432k184j998j919j812j188MR54R83
62494D18603N70P43J715K795L318L077K136R18K08M02Q82Q29N23J033K766N020
62478D45538O850P555O572M030J557J193K928M491M347L791M850P007P754O300
$$ plain form
62589 533532 528126 523175 518295 513578 509423 505771 502060 498090 494356 491204 488212 484949 481880 479807
62575 479807 478646 477508 475994 474683 474163 474129 473780 472766 471492 470695 470825 471510 471517 469623 465818 461484 458146
62558 458146 456210 455058 454073 453224 452801 452847 452924 452387 450917 448781 446344 443438 439741 435889 433472 433288
62542 433288 434101 433970 432575 431330 431279 431983 432782 433998 436085 438421 439991 440864 441962 443525 444869 445727
62526 445727 446880 449117 452223 455264 457223 457191 454793 450998 447878 446791 447113 447226 446438 445356 444723 444596
62510 444596 444512 443826 441926 438677 434751 431120 428195 425763 423579 421581 419662 417850 416662 416666 417620 418603
62494 418603 419173 419916 421631 424426 427744 430821 432957 433875 434083 434485 435367 436196 436719 437752 440518 445538
62478 445538 452388 459943 466515 470545 472102 473295 476223 480714 485061 488852 493702 500709 508463 514763
62464E14763M952O152R430J2320J3491J3769J4392J5468J6447J7255J8344J9997
62452F76780K1937K3487K3973K3180K1659K0302J9497J8875J7937J6425J4015
62441H98067J0321N791J954K1n30j259k884m944o969q859r910q830n375j196J762
62426H67160L211M337O085Q316J0371J1887J3211J5278J8755K2991K6214K7264
62414A035080K6770K6200K6105K5839K4573K2008J8316J3992R593N165J27n826
62402A227942j1950j7133k1185k4912k9024l3361l7091l9280l9528l8500l7589
62391H98389l7576l7683l6315l2681k7555k2791k0119j9682j9516j7334j3275
62380F13862r976r258r879r579q143o901o127m948l438k731k951k892k127j708
$$ plain form
62464 514763 519715 525867 535297 547617 561108 574877 589269 604737 621184 638439 656783 676780
62452 676780 698717 722204 746177 769357 791016 811318 830815 849690 867627 884052 898067
62441 898067 908388 914179 916133 916154 915624 914365 911481 906537 899568 890709 880799 871969 866594 865398 867160
62426 867160 870371 874708 880793 889109 899480 911367 924578 939856 958611 981602 1007816 1035080
62414 1035080 1061850 1088050 1114155 1139994 1164567 1186575 1204891 1218883 1228476 1233641 1233768 1227942
62402 1227942 1215992 1198859 1177674 1152762 1123738 1090377 1053286 1014006 974478 935978 898389
62391 898389 860813 823130 786815 754134 726579 703788 683669 663987 644471 627137 613862
62380 613862 603886 594628 584749 575170 567027 560126 553999 549051 545613 542882 539931 537039 534912 533204
62366E33204k291l047l138k889k843k856k750k714k495j419J69P96j37j428j793
62351E04369j221l1J727L102K471L14j62K681N783N088J280j205l54J439J849
62336E27130J851L217N373O691P251Q201R462R894R425R358J0478J2142J3398
62323F33871J4088J4493J4591J4099J3048J2132J2438J4638J8228K1753K4067
62312H07446K5288K6417K8214L0737L3703L6887M0161M3446M6797N0373N4275
62301A223744N8478O2928O7677P2909P8869Q5704R3249J00775J06994J10537J10792
62290B172656J08085J02811R4477Q2225O6426M8976L1667J4886j459j6592k9706
62279B674452m1753n4696o8511q0335q7611r1097r3486r5594r5525r1702q5201
$$ plain form
62366 533204 530913 527866 524728 521839 518996 516140 513390 510676 508181 506762 506931 507727 507590 506162 504369
62351 504369 503148 503117 504844 507946 510417 510731 510569 513250 519033 524121 525401 524196 523842 525281 527130
62336 527130 528981 532198 537571 544262 551513 559714 569176 579070 588495 597853 608331 620473 633871
62323 633871 647959 662452 677043 691142 704190 716322 728760 743398 761626 783379 807446
62312 807446 832734 859151 887365 918102 951805 988692 1028853 1072299 1119096 1169469 1223744
62301 1223744 1282222 1345150 1412827 1485736 1564605 1650309 1743558 1844333 1951327 2061864 2172656
62290 2172656 2280741 2383552 2478029 2560254 2626680 2675656 2707323 2722209 2720750 2704158 2674452
62279 2674452 2632699 2578003 2509492 2429157 2341546 2250449 2156963 2061369 1965844 1874142 1788941
62268A788941p8393p2431o7173o2686n9201n5838n1089m5213m0685l9186l9185
62257A177861l7917l5060l2702l1806l0771k8081k4669k2324k1043j9566j7771
62246H76151j6815j6959j6897j5655j3897j2645j1632r840p221n027m307m575
62234G40681m205k164P51K659K648J871K206M031N928O595O381O617P903R566
62220G91468J0712J1342J2184J3713J5576J7119J8120J8851J9605K0612K2193
62209I71495K4447K6832K8774L0795L4124L8851M3446M6813M9973N4677O1010
62198A411237O7601P3842Q0522Q8139R5771J02037J06334J08675J08781J05726
62188B348665R8351Q6233P0604N3843L7368K0561K553j5555l1588m5012n7084
$$ plain form
62268 1788941 1710548 1638117 1570944 1508258 1449057 1393219 1342130 1296917 1256232 1217046 1177861
62257 1177861 1139944 1104884 1072182 1040376 1009605 981524 956855 934531 913488 893922 876151
62246 876151 859336 842377 825480 809825 795928 783283 771651 761811 754590 749563 745256 740681
62234 740681 736476 734312 735063 737722 740370 742241 744447 748478 754406 761001 767382 773999 781902 791468
62220 791468 802180 813522 825706 839419 854995 872114 890234 909085 928690 949302 971495
62209 971495 995942 1022774 1051548 1082343 1116467 1155318 1198764 1245577 1295550 1350227 1411237
62198 1411237 1478838 1552680 1633202 1721341 1817112 1919149 2025483 2134158 2242939 2348665
62188 2348665 2447016 2533249 2603853 2657696 2695064 2715625 2718178 2702623 2671035 2626023 2568939
62177B568939o8391p8037q5635r2153r7953j01558j01573r8542r3944q8545q2788
62166A579820p7491p2723o7105n9810n2272m6435m2185l8317l5109l3660l3130
62155A021583l1126k7208k3728k2409k2016k0485j7768j5203j3288j1454r436
62144H07462p622o346n640n383n161m371k955j483r1J893M626O962P900Q192R396
62129H07379J1766J4200J5937J7163J8013J8315J8489J9504K1467K3235K4096
62118A009564K4927K6827K9175L0196K9356K8284K8917L1410L4430L7204M0570
62107A350860M5737N2388N8683O3274O6910P1464P7330Q2214Q2898P8093O9374
62096B099225N9301M9004L7822K5011J1147k347j4585k5601l5682m4978n3717
$$ plain form
62177 2568939 2500548 2422511 2336876 2244723 2146770 2045212 1943639 1845097 1751153 1662608 1579820
62166 1579820 1502329 1429606 1362501 1302691 1250419 1203984 1161799 1123482 1088373 1054713 1021583
62155 1021583 990457 963249 939521 917112 895096 874611 856843 841640 828352 816898 807462
62144 807462 799840 793494 787854 782471 777310 772939 769984 768501 768410 770303 774929 781891 789791 797983 807379
62129 807379 819145 833345 849282 866445 884458 902773 921262 940766 962233 985468 1009564
62118 1009564 1034491 1061318 1090493 1120689 1150045 1178329 1207246 1238656 1273086 1310290 1350860
62107 1350860 1396597 1448985 1507668 1570942 1637852 1709316 1786646 1868860 1951758 2029851 2099225
62096 2099225 2158526 2207530 2245352 2270363 2281510 2279163 2264578 2238977 2203295 2158317 2104600
62085B104600o2040o9365p4520p6873p6860p5200p2276o8654o5383o2837n9849
62074A340743n5032m8712m2535l7391l2852k8625k5182k2508j9502j5357j0727
62063A002320o766l675q94J855M451O801Q642R361Q617O797M414J646r02j835
62049A040832l27K599N066O056N259K114l422r513j3560j4768j4230j2619r592
62036I83895n673k638j125M92L777Q106J2012J5307J8546K1509K3750K5887K8832
62023A132677L2202L4920L7005L9326M1930M3876M4677M4691M4314M3893M4203
62012A583714M5798M7991M9613N0523N1277N1759N1712N2222N4740N8484O0858
62001B158691O0826N9946N9338N7750N3641M7381L9756L0023J7335L084j0129
$$ plain form
62085 2104600 2042560 1973195 1898675 1821802 1744942 1669742 1597466 1528812 1463429 1400592 1340743
62074 1340743 1285711 1236999 1194464 1157073 1124221 1095596 1070414 1047906 1028404 1013047 1002320
62063 1002320 995554 991879 990985 992840 997291 1004092 1012734 1022095 1030712 1037509 1041923 1043569 1042667 1040832
62049 1040832 1040505 1043104 1048170 1054226 1059485 1061599 1058177 1048664 1035104 1020336 1006106 993487 983895
62036 983895 978222 975584 974459 974951 978728 986834 998846 1014153 1032699 1054208 1077958 1103845 1132677
62023 1132677 1164879 1199799 1236804 1276130 1318060 1361936 1406613 1451304 1495618 1539511 1583714
62012 1583714 1629512 1677503 1727116 1777639 1828916 1880675 1932387 1984609 2039349 2097833 2158691
62001 2158691 2219517 2279463 2338801 2396551 2450192 2497573 2537329 2567352 2584687 2587771 2577642
61990B577642k1288l1117m0030m7790n4894o2330o9700p5236p8103p9434q0443
61979A937277q0687p9003p5315p0674o5968o1311n6617n2162m8389m5279m2178
61968A259694l8513l4614l1364k8904k6327k3048j9828j7725j6653j5870j5399
61957I91449j5846j7026j7923j8043j7762j7184j5802j3542j1220r438p932o335
61945H23396m760l126q33K155M593N222M270L052K474K604L321M414N152M653
61931H56587K905Q96m28j048j609k597l929n160o003o708p850r673j1624j2703
61917G91056j2253j0468q260o676o157o313o442o246n752m758k966q32M30J44
61903G14507r24j350n14J092K597L357L228K852L322N017O905P742P668P844Q615
$$ plain form
61990 2577642 2556354 2525237 2485207 2437417 2382523 2320193 2250493 2175257 2097154 2017720 1937277
61979 1937277 1856590 1777587 1702272 1631598 1565630 1504319 1447702 1395540 1347151 1301872 1259694
61968 1259694 1221181 1186567 1155203 1126299 1099972 1076924 1057096 1039371 1022718 1006848 991449
61957 991449 975603 958577 940654 922611 904849 887665 871863 858321 847101 837663 829731 823396
61945 823396 818636 815510 814677 816832 821425 826647 830917 833969 836443 839047 842368 846782 851934 856587
61931 856587 859492 860388 859960 858912 857303 854706 850777 845617 839614 832906 825056 815383 803759 791056
61917 791056 778803 768335 760075 753399 747242 740929 734487 728241 722489 717731 714765 713933 714363 714507
61903 714507 713583 712233 711719 712811 715408 718765 721993 724845 728167 733184 740089 747831 755499 763343 771958
61888G71958R153R116R446J0793J2174J2384J2241J4019J8429K3321K5984K6028
61876I55046K5340K5706K7259K9033L0177L0331K9395K7425K4726K1873J9533
61865A245844J8078J7065J5278J1741O902K399n05k022l246m872o785q394q956
61852A282527p892n428k793j223n72O72L950R325J5432K0317K2564K2078J9949
61839A378906J7290J4318J0783O869K995r75n490j0267j4365j7472k0209k2938
61827A339445k5070k6028k6068k5701k5090k4509k4568k5166k5067k3482k1412
61816A067284k0304j9969j9170j7909j7386j7599j6704j3535r444o511m882l099
61804I00772n64J701K774L147L879N205O671Q263J0643J4241J8541K2710K6602
$$ plain form
61888 771958 781111 790227 799673 810466 822640 835024 847265 861284 879713 903034 929018 955046
61876 955046 980386 1006092 1033351 1062384 1092561 1122892 1152287 1179712 1204438 1226311 1245844
61865 1245844 1263922 1280987 1296265 1308006 1314908 1317307 1316802 1314780 1311534 1306662 1299877 1291483 1282527
61852 1282527 1274635 1269207 1266414 1265191 1264619 1265291 1269241 1278566 1293998 1314315 1336879 1358957 1378906
61839 1378906 1396196 1410514 1421297 1428166 1431161 1430186 1424696 1414429 1400064 1382592 1362383 1339445
61827 1339445 1314375 1288347 1262279 1236578 1211488 1186979 1162411 1137245 1112178 1088696 1067284
61816 1067284 1046980 1027011 1007841 989932 972546 954947 938243 924708 915264 908753 903871 900772
61804 900772 900208 901909 904683 907830 911709 916914 923585 931848 942491 956732 975273 997983 1024585
61791A024585L0670L4963L8739M1359M3091M4576M5917M6776M7072M6837M5600
61780A490185M2692L8227L2895K6722J8995R814P43o774j2755j7592k0360j9715
61768A583077j6267j2576j0314q418m792R48P147J1948J4626J5313J4431J2493
61756A607616R815O147J053n174j1574j7746k4326l1660l8542m3211m5347m6143
61744A360908m6481m6168m5222m4502m4177m2736l8863l3716k9763k7585k5469
61733I36226k2358j9515j8409j8406j7820j6355j5080j4483j3910j2884j1742
61722G55264j0717r462p851o496n962n971n823n264m532l830l138k442j883j598
61708F80295j496j183k73J155K562L556M233M702M701M177L847M443N504N789
$$ plain form
61791 1024585 1055255 1090218 1128957 1170316 1213407 1257983 1303900 1350676 1397748 1444585 1490185
61780 1490185 1532877 1571104 1603999 1630721 1649716 1659530 1660273 1653499 1640744 1623152 1602792 1583077
61768 1583077 1566810 1554234 1543920 1535502 1530710 1531658 1538805 1550753 1565379 1580692 1595123 1607616
61756 1607616 1617431 1623578 1624631 1619457 1607883 1590137 1565811 1534151 1495609 1452398 1407051 1360908
61744 1360908 1314427 1268259 1223037 1178535 1134358 1091622 1052759 1019043 989280 961695 936226
61733 936226 913868 894353 875944 857538 839718 823363 808283 793800 779890 767006 755264
61722 755264 744547 735085 727234 720738 714776 708805 702982 697718 693186 689356 686218 683776 681893 680295
61708 680295 678799 677616 677343 678498 681060 684616 688849 693551 698252 702429 706276 710719 716223 722012
61694G22012M953M027L890M110L698K508J223L95N0l7j10l64p58j115j531k275
61678G40676l080l061j861m23j6p93j839k264j725k08J801L087K597P06r78j225
61662G31394j06J620L287M354M519M191M250M902N360M967M088L326K501J076
61648G79729p34k148k911l488m157m611m600m354m102l677l017k670l300m743
61634G31217n874n579l805j714p78j516l040l931l722l236l320l572k851j005
61620F87274O39Q84K42L32J833L763M861N035N081N406N689N567N132M679M397
61605G40814M399M735N223N483N299M858M605M884N556N927N232L568K159K283
61591H05025L931N840O716O123M351K159P42J116L017M836N131M020K766K243
$$ plain form
61694 722012 726965 730992 734882 738992 742690 745198 746421 746816 746866 746829 746719 746355 745597 744482 742951 740676
61678 740676 737596 734535 732674 732251 732235 731442 729603 727339 725614 725406 727207 730294 732891 733597 732619 731394
61662 731394 731288 732908 736195 740549 745068 749259 753509 758411 763771 768738 772826 776152 778653 779729
61648 779729 778995 776847 773936 770448 766291 761680 757080 752726 748624 744947 741930 739260 735960 731217
61634 731217 725343 719764 715959 714245 713467 711951 708911 704980 701258 698022 694702 691130 688279 687274
61620 687274 687913 688797 689039 689371 691204 694967 699828 704863 709944 715350 721039 726606 731738 736417 740814
61605 740814 745213 749948 755171 760654 765953 770811 775416 780300 785856 791783 797015 800583 802742 805025
61591 805025 808956 814796 821512 827635 831986 834145 834887 836003 839020 843856 848987 853007 855773 858016
61577H58016K268K211J829J367J106Q81J85j172k585l215l012k747l027l828n000
61562H43277o418p368o745m536k415j931k666l013k346j386p52k89J51L62L10
61547H04235J82k32j368k988m309n222o403q043r372r787r607r214q475p433o664
61532G15300o309n701m706m527o074q250q998p662n347l348k374k874m793o883
61518F37454p444o127m224l071k923l455m357n099m985m023l078k751k599j861
61504E81457m70R87J875J763N76j161k602l339l492k948j322R02K113J301m35
61489E75205j111l48L07m21j933k723k241j262o80n48l05L48J083J354J016M43
61473E68184Q5nj32n78j244j613j133J63J425J600M03j405k753l141k841k478
$$ plain form
61577 858016 860284 862495 864324 865691 866797 867678 867863 866691 864106 860891 857879 855132 852105 848277 843277
61562 843277 836859 829491 822746 818210 815795 813864 811198 808185 805839 804453 803701 803412 803563 803925 804235
61547 804235 804417 804185 802817 799829 795520 790298 783895 775852 766480 756693 747086 737872 729397 721964 715300
61532 715300 708991 703290 698584 694057 687983 679733 670735 663073 657726 654378 652004 649130 644337 637454
61518 637454 630010 623883 619659 616588 613665 610210 605853 600754 595769 591746 588668 585917 583318 581457
61504 581457 580987 581974 583849 585612 586188 585027 582425 579086 575594 572646 571324 572226 574339 575640 575205
61489 575205 574094 573746 574053 573632 571699 568976 566735 565473 564793 564245 563940 564288 565371 566725 567741 568184
61473 568184 568269 568264 568132 567554 566310 564697 563564 563727 565152 566752 567155 565750 562997 559856 557015 554537
61457E54537k483k793k999k835k441k076j775j506j446j695j923j754j374j186
61443E26251j007l29N92P55j77j217j301n71N1J70K16O86J404J552M14j552k688
61426E23249j900k52K26o03p94O43K102J785K47q19j117j391j479o74M47M46p82
61409E19334j963k572l263m041l838k444j287j562k734l494l173j880l08L41o21
61394D86495k168k630k002j673j752p68J400K531J239p41r90L96J701K225K272
61379D85535J706L59q19o86O25K424M615O759P278N498L366L133M187M349L294
61364E31623K356J786R98Q62K619M749M287J566L09K072L982L385J576R89J444
61349E64603J537J448J809J580l03k487k927k031j730k255k312j838k128l444
$$ plain form
61457 554537 552054 549261 546262 543427 540986 538910 537135 535629 534183 532488 530565 528811 527437 526251
61443 526251 525244 524915 525507 526262 526085 524868 523567 522996 523047 523217 523433 524119 525523 527075 527489 525937 523249
61426 523249 521349 521097 521323 520720 519926 520569 522671 524456 524703 523884 522767 521376 519897 519223 519670 520116 519334
61409 519334 517371 514799 511536 507495 503657 501213 499926 498364 495630 492136 488963 487083 486775 487116 486495
61394 486495 484327 481697 479695 478022 476270 475502 476902 479433 480672 479931 478941 479337 481038 483263 485535
61379 485535 487241 487600 486781 486095 486720 489144 493759 500518 507796 513294 516660 519793 523980 528329 531623
61364 531623 533979 535765 536763 537625 540244 544993 549280 550846 551155 553227 557209 560594 562170 563159 564603
61349 564603 566140 567588 569397 570977 570674 568187 565260 563229 561499 559244 556932 555094 552966 549522
61335E49522m628n017m788l648j233J252J844M87r25j330j377j363l96J629L111
61320E33140K847J606O30j20j158j986j664k63J199J830J321m4j215r53P68K464
61304E38402K834K187J640J605J765J993K383K736K812K902L437M205M643M805
61290E78349N306O198O678O347O258P900J1147J3901J4285J2828J1685J1806J1795
61277G04483R940O503L300J726J940L343M760M736K952J125J141K406K474L91
61263G51220k138l344l590m151n095n532n161m498m048l991m146l754j982O77
61249G00467K360J972O46J96R24J971K984M053M587L979L326M731Q375J1586J1640
61234G63797Q655M967K323M53j786m678p269q471q213p272o133m599k877k157
$$ plain form
61335 549522 544894 539877 535089 531441 530208 531460 533304 533791 532866 531536 530159 528796 528400 530029 533140
61320 533140 535987 537593 538223 538103 536945 534959 533295 533032 534231 536061 537382 537338 536123 535170 535938 538402
61304 538402 541236 543423 545063 546668 548433 550426 552809 555545 558357 561259 564696 568901 573544 578349
61290 578349 583655 589853 596531 602878 609136 617036 628183 642084 656369 669197 680882 692688 704483
61277 704483 714423 720926 724226 725952 727892 731235 735995 740731 743683 744808 745949 748355 750829 751220
61263 751220 749082 745738 742148 737997 732902 727370 722209 717711 713663 709672 705526 701772 699790 700467
61249 700467 702827 704799 705445 705641 706565 708536 711520 715573 720160 724139 727465 732196 740571 752157 763797
61234 763797 772452 777419 779742 780195 778409 773731 766462 757991 749778 742506 736373 731774 728897 726740
61220G26740l159m464l697n92K418L351L236M316O537P601O604N728P227J0007
61206G71853J1010R543Q262R336J1332J1233Q548N860N631P900J1026J3327J3733
61193H98594J2238J0376J0224J2194J4395J4668J2600R177N418K029m22j816k616
61180I97059l201l624m376o303r073j0784j0115q162o948o887o989o891p121p620
61166H98965p560o703n605m431k791q81M45R90J464K158K432J820P29l13j124
61151H79595j464j100n16n05q05k68J364K983L828M326M749M419L210K459L249
61136I05524M736N455N493O046P470R148J0962J3446J6521J9198K0776K1482K1774
61123A068031K1655K0807J9047J6777J5126J5097J6070J5954J3724J1076J0407
$$ plain form
61220 726740 723581 719117 715420 714828 717246 720597 723833 728149 734686 742287 748891 754619 761846 771853
61206 771853 782863 792406 800668 810004 821336 832569 841117 846977 852608 860508 871534 884861 898594
61193 898594 910832 921208 931432 943626 958021 972689 985289 994466 999884 1001913 1001491 999675 997059
61180 997059 993858 990234 985858 979555 970482 959698 949583 941421 934473 927586 920597 913706 906585 898965
61166 898965 891405 884702 879097 874666 871875 870994 871439 872429 873893 876051 878483 880303 881032 880719 879595
61151 879595 878131 877031 876515 876010 875205 874937 876301 879284 883112 887438 892187 896606 899816 902275 905524
61136 905524 910260 915715 921208 927254 934724 943872 954834 968280 984801 1003999 1024775 1046257 1068031
61123 1068031 1089686 1110493 1129540 1146317 1161443 1176540 1192610 1208564 1222288 1233364 1243771
61112A243771J1732J2939J2712J1585J0151Q073N423L370K523J687o16m073p041
61099A312236q587r227r987j1449j3479j5227j5565j4184j2181j1054j1171j1552
61087A168573j1107r721q167p186o734o162n232m687n292o515p005o453n984o423
61073A071905p283q002q936j0078j0020p685m354k263j612o97J223L141M521O248
61059A026108Q699J0798J1947J3251J5574J7930J9238K0316K2444K5029K6641
61048A217975K7579K9318L1869L3746L4563L5528L7086L7869L6619L3728L0374
61037A586254K7438K5605K4984K4203K1373J6556J1852Q483N481J857j809m935
61025A747342q182j1733j4208j4978j5855j8462k1359k2156k1247k0827k1033
$$ plain form
61112 1243771 1255503 1268442 1281154 1292739 1302890 1310963 1316386 1319756 1322279 1323966 1323350 1319277 1312236
61099 1312236 1303649 1294422 1284435 1272986 1259507 1244280 1228715 1214531 1202350 1191296 1180125 1168573
61087 1168573 1157466 1147745 1139578 1132392 1125658 1119496 1114264 1109577 1104285 1097770 1090765 1084312 1078328 1071905
61073 1071905 1064622 1056620 1047684 1037606 1027586 1019901 1015547 1013284 1011672 1010975 1012198 1015339 1019860 1026108
61059 1026108 1034807 1045605 1057552 1070803 1086377 1104307 1123545 1143861 1166305 1191334 1217975
61048 1217975 1245554 1274872 1306741 1340487 1375050 1410578 1447664 1485533 1522152 1555880 1586254
61037 1586254 1613692 1639297 1664281 1688484 1709857 1726413 1738265 1746748 1752229 1754086 1752277 1747342
61025 1747342 1739160 1727427 1713219 1698241 1682386 1663924 1642565 1620409 1599162 1578335 1557302
61014A557302k0000j7457j5463j5201j5536j5147j3807j1183o865k320k44p94
61002A423285o80K587P598J1738J4979J8971K3879K8377L1835L4606L6764L8361
60990A672300M0453M4065M8430N1837N4017N6237N9278O2820O6795P1829P7977
60979B306038Q4327R0345R6760J04640J14088J24191J34004J43540J53871J65945
60969C517749J79210J91978K03409K14313K25702K37692K50585K65734K84083
60960E570455L04873L27220L52099L81182M14343M50255M89284N34533N90225
60951I414469O60124P46610Q49579R66789J097279J244363J414249J613097J846916
60942A9853475K121706K439840K797116L182938L569715L881576L974561L685912
$$ plain form
61014 1557302 1537302 1519845 1504382 1489181 1473645 1458498 1444691 1433508 1426643 1424323 1424079 1423285
61002 1423285 1422605 1425192 1432790 1444528 1459507 1478478 1502357 1530734 1562569 1597175 1633939 1672300
60990 1672300 1712753 1756818 1805248 1857085 1911102 1967339 2026617 2089437 2156232 2228061 2306038
60979 2306038 2390365 2480710 2577470 2682110 2796198 2920389 3054393 3197933 3351804 3517749
60969 3517749 3696959 3888937 4092346 4306659 4532361 4770053 5020638 5286372 5570455
60960 5570455 5875328 6202548 6554647 6935829 7350172 7800427 8289711 8824244 9414469
60951 9414469 10074593 10821203 11670782 12637571 13734850 14979213 16393462 18006559 19853475
60942 19853475 21975181 24415021 27212137 30395075 33964790 37846366 41820927 45506839
60934D5506839K954038J913295Q55457O8259l13122l25531r5716K25165M59463
60925E1248147M04586q5107r80897k054755l000510l606018l835197l779736l559671
60916C0750842l263312k942506k626353k328536k052021j796629j563716j354752
60908A2823017j169500j007505q69237p54493o61139n86019n25656m75919m32850
60899F340699l94494l60517l29884l00671k72420k46617k24029k03532j84550
60890C823985j68666j57285j49164j41977j35162j29374j23861j16554j06785
60881B595157r6391q7613q0951p5401p0060o5058o1189n8920n7688n6385n4533
60870A830968n2697n1477n0719n0001m9287m8605m7555m5810m3693m1771m0251
$$ plain form
60934 45506839 48460877 50374172 51229629 51297888 50984766 50659235 50563519 50788684 51248147
60925 51248147 51652733 51567626 50586729 48531974 45531464 41925446 38090249 34310513 30750842
60916 30750842 27487530 24545024 21918671 19590135 17538114 15741485 14177769 12823017
60908 12823017 11653517 10646012 9776775 9022282 8361143 7775124 7249468 6773549 6340699
60899 6340699 5946205 5585688 5255804 4955133 4682713 4436096 4212067 4008535 3823985
60890 3823985 3655319 3498034 3348870 3206893 3071731 2942357 2818496 2701942 2595157
60881 2595157 2498766 2411153 2330202 2254801 2184741 2119683 2058494 1999574 1941886 1885501 1830968
60870 1830968 1778271 1726794 1676075 1626074 1576787 1528182 1480627 1434817 1391124 1349353 1309102
60859A309102l9167l8578l7931l5943l2129k8013k5784k5882k6777k6965k6092
60848I65841k4256k1455j8151j5438j4064j3750j3736j3428j2362j0386q207o982
60836G93626o829o418m746k634j677k064k477k105j779k715m745o413o692o115
60822G36217o017o911p900p859o865o061o238p023p569p411o380m322j629M10
60808F54442P31j00m57J72N76j15p68K82K608L838K597J39j453j706j584j621
60792F57581j445j008j093k180l545m044l371k166j244j104j877l283m731n711
60778F20779o043n741n037m610n101n960n531l129m38K24j212k588k453j559j014
60763E70587m02J143K920L284K154J560L232O443Q701Q244N546K628J212J445
$$ plain form
60859 1309102 1269935 1231357 1193426 1157483 1125354 1097341 1071557 1045675 1018898 991933 965841
60848 965841 941585 920130 901979 886541 872477 858727 844991 831563 819201 808815 800608 793626
60836 793626 786797 780379 775633 772999 771322 769258 766781 764676 762897 760182 755437 749024 742332 736217
60822 736217 730200 723289 715389 707530 700665 694604 688366 681343 673774 666363 659983 655661 654032 654442
60808 654442 655173 655073 654616 654788 655364 655249 654481 654763 657371 661209 663806 663945 662492 660786 659202 657581
60792 657581 656136 655128 654035 651855 648310 644266 640895 638729 637485 636381 634504 631221 626490 620779
60778 620779 614736 608995 603958 599348 594247 588287 582756 579627 579189 579413 578201 575613 573160 571601 570587
60763 570587 570185 571328 574248 577532 579686 581246 584478 590921 599622 607866 613412 616040 617252 618697
60749F18697K249K819L406M427N298M959L454K086J718J695J012j40p29m21O3
60734F50593k2q49k376m514o712q129q522q388q052p283o155n469n646n917n427
60719E67132m570m241m224l533k161j115o70l5Q75P89q91k704k855j501p4Q51
60703E41073J701K405K278J355N89N55R61J447J896J901J111K12N01K208M217
60688E64410N675O777P693P969P594P497Q268R224R408Q662P117M788K401J420
60674F58903K089K395M83k692m516m088k869k298k357k567k927l425l701l675
60660F28755l684l789l665l231k781k410k126k405l688n436o680p421q269q783
60646E64387p741n396l753l875m358l609k265j942k552k594j591o49n07m48M26
$$ plain form
60749 618697 620946 623765 627171 631598 636896 641855 645309 647395 649113 650808 651820 651680 650951 650530 650593
60734 650593 650571 649722 647346 642832 636120 627991 619469 611081 603029 595746 589591 584122 578476 572559 567132
60719 567132 562562 558321 554097 550564 548403 547288 546618 546583 547458 548247 547356 544652 541797 540296 540222 541073
60703 541073 542774 545179 547457 548812 549401 549956 550917 552364 554260 556161 557272 557484 557985 560193 564410
60688 564410 570085 576862 584555 592524 600118 607615 615883 625107 634515 643177 650294 655082 657483 658903
60674 658903 660992 663387 663870 661178 656662 652574 649705 647407 645050 642483 639556 636131 632430 628755
60660 628755 625071 621282 617617 614386 611605 609195 607069 604664 600976 595540 588860 581439 573170 564387
60646 564387 556646 551250 547497 543622 539264 535655 533390 531448 528896 526302 524711 524062 523555 523107 523533
60631E23533J935L262L947L988L418K400J544J604K786M440N672O184O392O670
60617E77775O899O922P019P217O567M117N95j940k451j962j856k237k633l296
60603F00736m620n973o202n142l688k618k163k358k967l244k678j860j737k100
60589E53386j764k56J639L144M374N551O224N750M091J763n38j965j765m1J976
60574E81569K932K595J875J727K247K807K787K195J644J886L243N304P099P736
60560F27646P278O800P178P957Q089P772Q511J0900J3315J3766J2524J1849J3377
60547G56962J6563J9559K0813J9922J7802J6122J5941J6799J7458J7322J6628
60536I51891J5735J5033J5186J6473J8016J8682J8696J9340K1038K2774K3644
$$ plain form
60631 523533 525468 528730 532677 536665 540083 542483 544027 545631 548417 552857 558529 564713 571105 577775
60617 577775 584674 591596 598615 605832 612399 616516 617111 615171 612720 610758 608902 606665 604032 600736
60603 600736 596116 590143 583941 578799 575111 572493 570330 567972 565005 561761 559083 557223 555486 553386
60589 553386 551622 551366 553005 556149 560523 566074 572298 578048 582139 583902 583364 581399 579634 579593 581569
60574 581569 584501 587096 588971 590698 592945 595752 598539 600734 602378 604264 607507 612811 619910 627646
60560 627646 634924 641724 648902 656859 664948 672720 681231 692131 705446 719212 731736 743585 756962
60547 756962 773525 793084 813897 833819 851621 867743 883684 900483 917941 935263 951891
60536 951891 967626 982659 997845 1014318 1032334 1051016 1069712 1089052 1110090 1132864 1156508
60525A156508K3851K3927K3895K3717K3658K3626K2879K0956J8406J6065J3920
60514A391408J1052O599Q60m281o489n301k950j970k326k211j330j429l379n840
60500A372413p705j0029j4043j8785k2368k4532k6189k7209k6452k3737k0112
60489A151252j6174j1526o053n64M108P817J0848J3610J6439J8893J9492J7072
60477A225214J2340P199K660j657o009r682j1857j2544j2237j1297r866p998n768
60464A158498l491j683m26Q21K285L298L362L157L592M474N357O988J0201J3740
60450A210173J5312J5022J5669J8911K3163K6475K9645L4680M1512M8273N4324
60439A533159O1027O9477P9009Q8116R5491R9887J00139R5987Q7940P5760N7934
$$ plain form
60525 1156508 1180359 1204286 1228181 1251898 1275556 1299182 1322061 1343017 1361423 1377488 1391408
60514 1391408 1402460 1409059 1409919 1405638 1399149 1393848 1390898 1388928 1386602 1384391 1383061 1381632 1378253 1372413
60500 1372413 1364708 1354679 1340636 1321851 1299483 1274951 1248762 1221553 1195101 1171364 1151252
60489 1151252 1135078 1123552 1117499 1116935 1121043 1128860 1139708 1153318 1169757 1188650 1208142 1225214
60477 1225214 1237554 1244753 1247413 1245756 1239747 1230065 1218208 1205664 1193427 1182130 1172264 1164266 1158498
60464 1158498 1155007 1153324 1152898 1153719 1156004 1159302 1162664 1165821 1169413 1173887 1179244 1186232 1196433 1210173
60450 1210173 1225485 1240507 1256176 1275087 1298250 1324725 1354370 1389050 1430562 1478835 1533159
60439 1533159 1594186 1663663 1742672 1830788 1926279 2026166 2126305 2222292 2310232 2385992 2443926
60428B443926L3674N088k3659m9485p1994r1643j07236j16328j18130j14916j09877
60417A679420j04217r7168q8345p8886p0216o2719n6044m9893m4077l8415l3147
60406I56293k8995k6319k4589k3043k1535k0330j9431j8443j6854j4288j0959
60395G31507q094p228q549j0374j0773r346p149n407m791n275n993n713m211k827
60381F35777k851l761l899k642r44J76N49J67j351l964o523p537o522m337k306
60366E90032j163p37n28n69j390l080m794n569n226m090k296r6J615K062J724
60351E65895J796K473K712J816K87j167k568m016m851m172j924R25L023L428K262
60336E65919Q45N59J285J534M01j259k039j674r46m58j52K58J001K078K953K820
$$ plain form
60428 2443926 2477600 2482688 2459029 2409544 2337550 2245907 2138671 2022343 1904213 1789297 1679420
60417 1679420 1575203 1478035 1389690 1310804 1240588 1177869 1121825 1071932 1027855 989440 956293
60406 956293 927298 900979 876390 853347 831812 811482 792051 773608 756754 742466 731507
60395 731507 723413 716185 707636 697262 686489 677143 669994 664587 659796 654521 648528 642815 638604 635777
60381 635777 632926 629165 625266 622624 621680 621856 622405 622572 621221 617257 610734 603197 596675 592338 590032
60366 590032 588869 588132 587604 587035 585645 582565 577771 572202 566976 562886 560590 560494 562109 564171 565895
60351 565895 567691 570164 572876 574692 574979 573812 571244 567228 562377 558205 556281 557206 560229 563657 565919
60336 565919 566764 567323 568608 570142 570543 569284 567245 565571 564625 564167 564015 564273 565274 567352 570305 573125
60320E73125J746R91J418K099J472k84j256l17J420K165J737J444K116L014K938
60305E93828J950J420K268L624L862K778J863K100K550J897N72M7M90N91j54n25
60289F19161M62J852K045J071M88J346L063M400M866M964N377O032O008M535K109
60274F67779K59j4P94J478J419P67j63j054j351n75J020K498L154L162L293M180
60258F86646N819P698R366J0783J2070J3102J3744J4414J5792J7994K0488K2998
60246H50914K5678K8307L0250L1703L3773L6410L7219L3775K6515J7891R126n55
60234A161006j1465k2093l0664l6522l9369l8734l5295l1359k8675k6514k3173
60223H37143j8650j4472j1464r152p237o096n644m994l731k606k418k986l640
$$ plain form
60320 573125 574871 575862 577280 579379 580851 580567 579311 578994 580414 582579 584316 585760 587876 590890 593828
60305 593828 595778 597198 599466 603090 606952 609730 611593 613693 616243 618140 618712 618759 619249 619840 619686 619161
60289 619161 619623 621475 623520 624591 625079 626425 629488 633888 638754 643718 649095 655127 661135 665670 667779
60274 667779 668038 668024 668818 670296 671715 672482 672319 671265 669914 669339 670359 672857 676011 679173 682466 686646
60258 686646 692465 700163 709529 720312 732382 745484 759228 773642 789434 807428 827916 850914
60246 850914 876592 904899 935149 966852 1000625 1037035 1074254 1108029 1134544 1152435 1161561 1161006
60234 1161006 1149541 1127448 1096784 1060262 1020893 982159 946864 915505 886830 860316 837143
60223 837143 818493 804021 792557 783405 776168 770072 764428 759434 755703 753097 750679 747693 744053
60210G44053m084m345m353m161m167m616n107n022m341l711l701m146m273l553
60196F84473k401j803k037k127j169J86L51j069k593k620j173M48J155P41l36
60181F70026j327j640j380j122r60l70O29J019K70m66K57K009L047K868K793L658
60165F79311M355L524J687O29J202K707M060M574L815J807m03j343n88Q64J946
60150G08147K554K852K465J202R2N69K483L936L643K703L229N557P775Q139O997
60135G62343N813N110M351L501L375M125M518L492J712N70J61n84j833k308j256
60120G93090R7l2j668l097k991j772q81j216k465l557l744l240k756k412j567
60105G61789oJ335J406M00n49p90n39k11j26o69j758k295j287M44Q25p45k417
$$ plain form
60210 744053 739969 735624 731271 727110 722943 718327 713220 708198 703857 700146 696445 692299 688026 684473
60196 684473 682072 680269 678232 676105 674936 675122 675473 674404 671811 669191 668018 668466 669621 670362 670026
60181 670026 668699 667059 665679 664557 663597 663227 663856 664875 665145 664679 664936 666945 669992 672860 675653 679311
60165 679311 683666 687190 688877 689506 690708 693415 697475 702049 705864 707671 707268 705925 705337 706201 708147
60150 708147 710701 713553 716018 717220 717312 717881 720364 724300 727943 730646 733875 739432 747207 755346 762343
60135 762343 768156 773266 777617 781118 784493 788618 793136 796628 798340 798910 799071 798487 796654 794346 793090
60120 793090 793187 793155 791487 788390 785399 783627 782746 781530 779065 775508 771764 768524 765768 763356 761789
60105 761789 761783 763118 764524 764924 764375 763585 763046 762835 762709 762040 760282 757987 756700 757144 757969 757224 754807
60088G54807k165l9K593M878O561P129O307N007M593N259O174P040Q328R913J0669
60073H37054R861Q147O677N777M863L185M08l064n985o945n505k560M21K269K442
60058H57045J209l27r24k79R05J900K617L205L642L928M187M298L881K850J580
60043H89717L52r06k134k968l298l504l807l894l514k914k363j730r75m78m28
60028H57156k84N18J719K507K400J484K57m32R0J300J600K14j632k302k030k474
60012H60091m278o223o940o357n260m330l910m049m354m407m428m970n868o304
59998G88413o055n834o129o553o775p055p284o454m076j466n20j458k750l099
59984G22905k545j691p99j9L55K94K77P70J623K336K710L107M050N605P051P402
$$ plain form
60088 754807 752642 752603 755196 760074 766635 773764 780071 785078 789671 794930 801104 808144 816472 826385 837054
60073 837054 846915 855062 861739 867516 872379 875564 875972 872908 866923 859978 854473 851913 852334 854603 857045
60058 857045 858254 857927 857003 856724 857629 859529 862146 865351 868993 872921 877108 881406 885287 888137 889717
60043 889717 890069 889163 887029 884061 880763 877259 873452 869558 866044 863130 860767 859037 858062 857584 857156
60028 857156 856872 857390 859109 861616 864016 865500 865757 865325 865415 866715 868315 868529 866897 864595 862565 860091
60012 860091 855813 849590 842650 836293 831033 826703 822793 818744 814390 809983 805555 800585 794717 788413
59998 788413 782358 776524 770395 763842 757067 750012 742728 736274 732198 730732 730212 728754 726004 722905
59984 722905 720360 718669 717870 717851 718206 718500 718777 719547 721170 723506 726216 729323 733373 738978 746029 753431
59968G53431O440N021M083L608L038K279J616P33j217m253p072q371q190p428
59954G43718o567n549m585m294m995o319p561q050p265n159k563q41q53k274l979
59939F72864m976n069m848n016n503n268l374k75K296K975K026Q80P03J536K548
59924F51499K880K367J641J454J869K381K795L475M445M888M095K602J691J882
59910F89964K567L038L182L003K227Q13o76j659k143k364k255j733j201j164j420
59895F90179j320p56l14k63q2N73R36j31k588m925n607m458k521r17q5Q7j06l38
59877F67364l28NM90Q42Q52N06K8j21L86J280J785J411M81l59r44j495j746q47
59859F69590J495M082N051L735J463L57J372L531M911M301K127m2q64k19R69J768
$$ plain form
59968 753431 759871 764892 768975 772583 775621 777900 779516 780249 779032 774779 767707 759336 751146 743718
59954 743718 737151 731602 727017 722723 717728 711409 703848 695798 688533 683374 680811 679970 679117 676843 672864
59939 672864 667888 662819 657971 652955 647452 642184 638810 638535 640831 643806 645832 646712 647415 648951 651499
59924 651499 654379 656746 658387 659841 661710 664091 666886 670361 674806 679694 683789 686391 688082 689964
59910 689964 692531 695569 698751 701754 703981 704794 704118 702459 700316 697952 695697 693964 692763 691599 690179
59895 690179 688859 688103 687789 687526 687444 688017 688953 688822 686234 681309 675702 671244 668723 667806 667721 667808 667702 667364
59877 667364 667036 667041 667531 668373 669225 669731 669759 669638 670024 671304 673089 674500 674981 674622 673678 672183 670437 669590
59859 669590 671085 675167 680218 683953 685416 685773 687145 690676 695587 699888 702015 701973 701109 700890 701859 703627
59843G03627K028K123K193J958J374R84J258J717J350jj207j112J11J301J726
59828G19430J681J856K589L782N077O070O649P144P808Q285Q070P515P675Q911
59814H02542J0225J0417R479Q300P298O012M020J670l15j673k757l855m614m306
59800H42443k801j015j43m09q98n37J018L494O419R280J1739J3922J6093J7728
59786I16333J7495J4677J0232N867K311q80l980o214o428m345j282L13j557o596
59772I35946j2131j5482j6356j6377j6612j6530j5379j3518j1857j0853j0536
59761G80315j0714j0551q790n440k727l040o000q606q609o718n044m390m024l444
59747F92218l058l053k760j762r36j534l472n238n552m597l582l513m551o137
$$ plain form
59843 703627 705655 707778 709971 711929 713303 714287 715545 717262 718612 718611 717404 716292 716403 717704 719430
59828 719430 721111 722967 725556 729338 734415 740485 747134 754278 762086 770371 778441 785956 793631 802542
59814 802542 812767 823184 832663 840963 848261 854273 858293 859963 859648 857975 855218 851363 846749 842443
59800 842443 839642 838627 838484 838075 837177 836640 837658 841152 847571 856851 868590 882512 898605 916333
59786 916333 933828 948505 958737 964604 966915 966035 962055 955841 949413 945068 943786 944099 942542 935946
59772 935946 923815 908333 891977 875600 858988 842458 827079 813561 801704 790851 780315
59761 780315 769601 759050 750260 744820 742093 739053 733053 724447 715838 709120 704076 699686 695662 692218
59747 692218 689160 686107 683347 681585 680649 679115 675643 670405 664853 660256 656674 653161 648610 642473
59733F42473p385p602o685m974k766l66J416J639M91m71r8Q04N96q15j790j277
59717F13190j62J72l25p74q82j052j301j153o86p07j460j882q04J440L208L353
59701F10175K358J523J428J510J026N7o38n55Q0P54J281J764K108J989J367P80
59685F27007Q90J792K902L548L582L364L342L623L944L917L335K380J612J662
59671F66900K714M079M473L069M33j893k819k584k056j599j134q77j199j721j474
59656F64312l06O26L53o53j303j355j234r47k87K25j34q74o98N68J635J783J927
59639F63638K988M364M898M540M019L537K906K461K743L407L412K222K49j633
59625G03751k509j749J77J680J757J326J882L198L604K410P16l27p45r45r21p57
$$ plain form
59733 642473 635088 627486 620801 615827 613061 612695 614111 615750 616241 615770 615672 616476 617072 616257 614467 613190
59717 613190 613028 613200 612875 612101 611219 610167 608866 607713 607027 606320 604860 602978 602174 603614 606822 610175
59701 610175 612533 614056 615484 616994 618020 618077 617439 616884 616964 617718 618999 620763 622871 624860 626227 627007
59685 627007 627897 629689 632591 636139 639721 643085 646427 650050 653994 657911 661246 663626 665238 666900
59671 666900 669614 673693 678166 681235 681668 679775 676956 674372 672316 670717 669583 668706 667507 665786 664312
59656 664312 664006 664632 664985 664332 663029 661674 660440 659493 659206 659431 659297 658423 657725 658293 659928 661711 663638
59639 663638 666626 670990 675888 680428 684447 687984 690890 693351 696094 699501 702913 705135 705384 703751
59625 703751 701242 699493 699670 701350 703107 704433 706315 709513 713117 715527 716243 715916 715171 714226 713305 712548
59609G12548q19r69n56K19O0j514k958k521o10P66N99k04m03R7O24Q57J036J248
59591G07500J017r2j614k338j734p23m25m40N28K424L504K694J010j50r44k196
59575G08021l440l415k168j079q06n48K67Q36L39m76j28J442K617K115O27l8Q37
59558G05003K150K494J753O68o52k754n328o782o039m095k889l022l349k667j006
59543F73485P48J780J788J078M21L67O19M32l07q59o05K08P85N55n58k215l721
59526F74001m276l503j876n29m70j751l327m013l625k937k460j829q05k49j261
59511F41090l519n358n581m528l149j766k25J312K359K783K898K855K348J236
59497F32755K59O19K577M744N337M152K791K714L644M343M348M200M275M281M074
$$ plain form
59609 712548 711729 710760 710204 710423 710483 708969 706011 703490 702880 703646 704245 704041 703638 703735 704359 705216 706252 707500
59591 707500 708517 708425 706811 704473 702739 702016 701591 701151 701679 704103 707607 710301 711311 711161 710217 708021
59575 708021 704581 701166 698998 697919 697113 696565 696832 697668 698007 697531 697403 698845 701462 703577 704204 704166 705003
59558 705003 707153 709647 711400 712068 711416 708662 703334 696552 690513 686418 683529 680507 677158 674491 673485
59543 673485 674233 676013 677801 678879 679300 679667 680286 680718 680411 679552 678947 679155 679940 680495 679937 677722 674001
59526 674001 669725 666222 664346 663817 663347 661596 658269 654256 650631 647694 645234 643405 642600 642351 641090
59511 641090 637571 632213 626632 622104 618955 617189 616964 618276 620635 623418 626316 629171 631519 632755
59497 632755 633014 633633 636210 640954 646291 650443 653234 655948 659592 663935 668283 672483 676758 681039 685113
59482F85113M240N512P944J0846J3315J4918J6067J7625J9728K1157K0332J6780
59470H53577J1169M301k950q824j1185r603o184l604k736k674k368j422K39K457
59456H20193M597N926O390O433O155N308M103L230K692J380j517n093p440p723
59442H44634o909o392o583p197q271j0040j1857j2194j0212o953m366l335l148
59429G47177k835k317j897j272K38K505M290M476L336K285K569M362O929R142
59415G78988R941R040P562P327Q872J0470R847O791L326J298P12N99M99M27K47
59400H55946rL74K032M454O488P782Q916J0206J1310J2140J3350J5546J8528K1643
59386I88706K4354K6149K6427K4875K1729J7399J2076N992l05o151j1080j4871
$$ plain form
59482 685113 689353 694865 702809 713655 726970 741888 757955 775580 795308 816465 836797 853577
59470 853577 864746 869047 866097 857273 846088 836485 830301 826697 823961 821287 818919 817497 817736 820193
59456 820193 824790 830716 837106 843539 849694 855002 859105 862335 865027 866407 864890 859797 852357 844634
59442 844634 837725 831333 824750 817553 809282 799242 787385 775191 764979 758026 753660 750325 747177
59429 747177 744342 742025 740128 738856 739094 741599 745889 750365 753701 755986 758555 762917 769846 778988
59415 778988 788929 797969 805531 812858 821730 832200 842047 848838 852164 853462 854174 854773 855272 855699 855946
59400 855946 855937 856311 858343 862797 869285 877067 885983 896189 907499 919639 932989 948535 967063 988706
59386 988706 1013060 1039209 1065636 1090511 1112240 1129639 1141715 1147707 1147402 1141251 1130171 1115300
59374A115300j7497j9154k0009j9920j8811j7416j6999j7904j8768j7747j4367
59363I16708r893o020l535k047n01K048N842J0300J4544J8042K0802K3192K5823
59350A015305K9391L4011L8368L9705L5301K4663J0489k732j1541j5275j5365
59339A182320j3409j0127n798j036K943M378J398o847j8893l1089l9652m2916
59327A021272m1751l8138l3676k9190k5064k1509j8536j6132j4463j3646j3201
59316G55966j2215j0370q469p304o334m382j679j6l87j505j488k75O47M04m02
59301G02191p72k57R97K354K991K855K981M065N231N433N434O831R297J0664J0061
59286G70356R094R391J0712J2289J4262J6598J8168J8384J8520J9789K1060K0251
$$ plain form
59374 1115300 1097803 1078649 1058640 1038720 1019909 1002493 985494 967590 948822 931075 916708
59363 916708 906815 900795 897260 895213 894712 896760 902602 912902 927446 945488 966290 989482 1015305
59350 1015305 1044696 1078707 1117075 1156780 1192081 1216744 1227233 1224501 1212960 1197685 1182320
59339 1182320 1168911 1158784 1152986 1151950 1154893 1159271 1160669 1153822 1134929 1103840 1064188 1021272
59327 1021272 979521 941383 907707 878517 853453 831944 813408 797276 782813 769167 755966
59316 755966 743751 733381 724912 717608 711274 706892 705213 705197 704810 703305 701817 701542 702189 702593 702191
59301 702191 701419 701162 702159 704513 707504 710359 713340 717405 722636 728069 733503 740334 749631 760295 770356
59286 770356 779450 788841 799553 811842 826104 842702 860870 879254 897774 917563 938623 958874
59274I58874J7315J4210J2304J1335J0479Q930N820J198l053m938m959n461p400
59261A014654r579j1142j2748j4585j5263j3966j2120j1423j1461j0764r306q199
59249H74098p464n953l304m68J981M546P449R900J1511J3401J6943K1907K6672
59236I71219K9707K9920K5960J6818L745r351j8495k2584k3245k2295k0287j7548
59224I43564j5140j3773j2510r824n844k384n22O41K251L840M346M213N006P001
59210I10865Q700R113R148R864J0553R951Q716Q966J1251J3475J3335J0802P566
59197A042305M927L040J440m44k852n116o164o119o540q286j0127j0626j0331
59184I85107j0480j0388q366m892k521k261k329j186L91J273K014L405M753N235
$$ plain form
59274 958874 976189 990399 1002703 1014038 1024517 1033447 1039267 1040465 1037412 1032474 1027515 1022054 1014654
59261 1014654 1005075 993933 981185 966600 951337 937371 925251 913828 902367 891603 882297 874098
59249 874098 866634 860681 857377 856909 858890 863436 870885 880785 892296 905697 922640 944547 971219
59236 971219 1000926 1030846 1056806 1073624 1077369 1068018 1049523 1026939 1003694 981399 961112 943564
59224 943564 928424 914651 902141 892317 886473 884089 883567 884208 886459 890299 894645 898858 903864 910865
59210 910865 919565 928678 937826 947690 958243 968194 976910 985876 997127 1010602 1023937 1034739 1042305
59197 1042305 1047232 1050272 1051712 1051268 1048416 1043300 1037136 1031017 1024477 1016191 1006064 995438 985107
59184 985107 974627 964239 955873 950981 948460 946199 943870 942684 943075 944348 946362 949767 954520 959755
59170I59755N526O356O785N877M861N431O648N940K887k61j806k334l028m237
59156I98400o003q319j0413j1344j1528j2120j2825j2263j0709j0258j1527j2468
59144H68623j1574j0214j0190j0816j0308q796p914q091q209p532o451n400m285
59131G58843k907j098J145K943K811P49r19j65J992L021K468K079K675L109K597
59116G79343K056K376L018L258L432L960M360M261M488N918P962R301R639R705
59102H53077R914J0107J0405J1136J1830J1339R411P368O625P022P162O092M047
59089I65535J741l73j933k538k308k177k906m041m512m290m531n832p263p649
59075I16923p051o241n346m000k430j253l69Q25K127K603K225K280L564N145N701
$$ plain form
59170 959755 965281 971637 978422 984299 989160 994591 1001239 1007179 1010066 1009805 1007999 1005665 1002637 998400
59156 998400 992397 984078 973665 962321 950793 938673 925848 913585 902876 892618 881091 868623
59144 868623 857049 846835 836645 825829 815521 806725 798811 790720 782511 774979 768528 763128 758843
59131 758843 755936 754838 755983 758926 761737 762486 761567 761402 763394 766415 768883 770962 773637 776746 779343
59116 779343 781399 783775 786793 790051 793483 797443 801803 806064 810552 816470 824432 833733 843372 853077
59102 853077 862991 873098 883503 894639 906469 917808 927219 934587 941212 948234 955396 961488 965535
59089 965535 967276 966903 964970 962432 960124 957947 955041 951000 946488 942198 937667 931835 924572 916923
59075 916923 909872 903631 898285 894285 891855 890602 890233 891058 893185 895788 898013 900293 903857 909002 914703
59060I14703N411N572O781Q462J0053J1707J3590J5162J5604J4740J3220J1884
59048A046889J1099J0681J0348J0071R971J0021R939R327P829N436K917J595K162
59035A148285L775M883M866M213L225J567n17j695j091L09P25k79j685k653l258
59020A160670l717m018m567o123q605j0732j1515j1498j1910j3005j3939j3906
59008A047135j2763j0767q480o863o666p560q423q684q729q787q129o030l104
58995I42150r48m81j154j843k096k345l228m883o811q242q665p989o297l836j371
58980H81961k1j96r72j136o96n46p43k50J288K663K846K708L794N907P327P341
58964I11275P207Q111R412R702Q867Q113Q280R046R779J0470J1487J2755J3482
$$ plain form
59060 914703 920114 925686 932467 940929 950982 962689 976279 991441 1007045 1021785 1035005 1046889
59048 1046889 1057988 1068669 1079017 1089088 1099059 1109080 1119019 1128346 1136175 1141611 1144528 1146123 1148285
59035 1148285 1152060 1156943 1161809 1166022 1169247 1170814 1170297 1168602 1167511 1167820 1168545 1168266 1166581 1163928 1160670
59020 1160670 1156953 1152935 1148368 1142245 1133640 1122908 1111393 1099895 1087985 1074980 1061041 1047135
59008 1047135 1034372 1023605 1015125 1008262 1001596 994036 985613 976929 968200 959413 951284 945254 942150
58995 942150 941202 940721 939567 937724 935628 933283 930055 925172 918361 910119 901454 893465 887168 883332 881961
58980 881961 881940 881744 880772 879636 878940 878394 877651 877401 878689 881352 884198 886906 890700 896607 903934 911275
58964 911275 918482 926593 936005 945707 954574 962687 970967 980013 989792 1000262 1011749 1024504 1037986
58951A037986J2801J0718Q343O988O861O858N762L480J069k01K56K037M009N164
58937A112131N446N576N943O113N682N016M603M175L268K357K353K985K805J198
58923A169651n49r83o18j319l855o952q821q880p752o183m532k991j824j261j230
58908A111901j242o21R66L197N494P617R560J0935J1017R745Q157P359P204O592
58894A197881M942K891J306J84j140l006n061o750p824q336q434q342q334q505
58880A141472q514p748n958l837k723l400n248o859p530p799q443r427j0131j0193
58866A043662r684q800p878p428p531p329n963l951k766k855l009k155q59k83
58852I73171l59r8P88J746K706M304O500Q165Q643Q942J0601J3777J7057J8964
$$ plain form
58951 1037986 1050787 1061505 1069848 1076836 1083697 1090555 1096317 1099797 1100866 1100665 1100921 1102958 1106967 1112131
58937 1112131 1117577 1123153 1129096 1135209 1140891 1145907 1150510 1154685 1157953 1160310 1162663 1165648 1168453 1169651
58923 1169651 1169102 1168119 1167501 1166182 1162327 1155375 1146554 1137674 1129922 1123739 1119207 1116216 1114392 1113131 1111901
58908 1111901 1110659 1110038 1111004 1114201 1119695 1127312 1136872 1147807 1158824 1168569 1176726 1184085 1191289 1197881
58894 1197881 1202823 1205714 1207020 1207204 1206064 1203058 1197997 1191247 1183423 1175087 1166653 1158311 1149977 1141472
58880 1141472 1132958 1125210 1119252 1115415 1112692 1109292 1104044 1097185 1089655 1081856 1073413 1063986 1053855 1043662
58866 1043662 1033978 1025178 1017300 1009872 1002341 995012 989049 985098 982332 979477 976468 974313 973454 973171
58852 973171 972812 972714 973502 975248 977954 982258 988758 996923 1005566 1014508 1025109 1038886 1055943 1074907
58838A074907J9238J8811J8873J9636J9895J8294J5233J2763J2165J2429J2058
58827A254302J1536J2710J6000J9645K1891K2596K2394K1545K0341J9457J8846
58816A461263J7135J3207P898L016r15m723q662j1888j4146j6555j9961k3406
58804A402263k5316k5599k5535k5726k5356k3711k1536k0129j9664j9174j8158
58793A152359j7379j7700j8725j9241j8842j8471j9024j9929j9679j7713j5216
58782I50440j3793j3514j2913j0988q685p631p737p093m700k186j810l474n139
58769H50777n774o169o651o026l806j845k111l834m650l889k948k624k123r32
58755G97395N3J5n66r49j193j405j091j79K98m30j471j439l42O51R41Q71O80K83
$$ plain form
58838 1074907 1094145 1112956 1131829 1151465 1171360 1189654 1204887 1217650 1229815 1242244 1254302
58827 1254302 1265838 1278548 1294548 1314193 1336084 1358680 1381074 1402619 1422960 1442417 1461263
58816 1461263 1478398 1491605 1499503 1502519 1501604 1496881 1488219 1476331 1462185 1445630 1425669 1402263
58804 1402263 1376947 1351348 1325813 1300087 1274731 1251020 1229484 1209355 1189691 1170517 1152359
58793 1152359 1134980 1117280 1098555 1079314 1060472 1042001 1022977 1003048 983369 965656 950440
58782 950440 936647 923133 910220 899232 890547 882916 875179 868086 863386 861200 859390 855916 850777
58769 850777 845003 838834 832183 826157 822351 820506 818395 814561 809911 806022 803074 800450 798327 797395
58755 797395 797448 797463 796897 795948 794755 793350 792259 792080 792378 791948 790477 789038 788696 789347 790288 791159 791839 792122
58737G92122%M09J346J917J725J351J339J447J198O73L19K71L15L95R27K362M417
58720H12533N819N371L493K165K906N107O799O718N003K322o73l120m067l343
58706H47033j886r29j052j963k901l205k755j828o34O58J329N19j253j912k48
58691H28973K201L016K135J656K722M362N515O381P184P412P070P117P747P657
58677I01148O214M984N739Q011R988J0830J0723R718Q140P331Q118R212Q965Q085
58663A017206Q544J0216J0963R932Q419P215N799M777O270J0363J3647J3319J0836
58650A137506R377R348Q916P785P406P820P161M682J866q5j845m270p004r711
58636A178952j2928j6541j8942j9193j8808j9819k1882k2993k2388k0985j9310
$$ plain form
58737 792122 792122 792531 793877 795794 797519 798870 800209 801656 802854 803527 803846 804117 804432 804827 805754 808116 812533
58720 812533 818352 823723 827216 829381 832287 837394 844193 850911 855914 858236 857563 854443 850376 847033
58706 847033 845147 844218 843166 841203 838302 835097 832342 830514 829880 830538 831867 832386 831133 829221 828973
58691 828973 831174 834190 836325 837981 840703 845065 850580 856961 864145 871557 878627 885744 893491 901148
58677 901148 907362 912346 918085 926096 936084 946914 957637 967355 975495 982826 990944 1000156 1009121 1017206
58663 1017206 1025750 1035966 1046929 1056861 1065280 1072495 1078294 1083071 1089341 1099704 1113351 1126670 1137506
58650 1137506 1146883 1156231 1165147 1172932 1180338 1188158 1195319 1200001 1201867 1201782 1199937 1195667 1188663 1178952
58636 1178952 1166024 1149483 1130541 1111348 1092540 1072721 1050839 1027846 1005458 984473 965163
58625I65163j6998j4603j3891j5314j6600j5170j1321p737o228o134n901n001
58613H30265l866k851j995j415j227j113m69Q96K528L796M384M350M043L895L962
58598H45183L670K525J096O00J274J875J361L37k0R2n43k046l032k586j414m76
58582H47896L79J536K318J757J83j104j597j905k320k161r51N92J264P44j76m94
58566H45961N0P62O33n03j540j203L52J570J310K33m4J225L326N161O399P345
58550H71037Q051Q117P459O841P074P815P886O915N864N406M629K336q45k829
58536I45756k611j405j033k001l410m052l307j618l26l93j096p51J045K843L402
58521I31043L357M107N862P658Q777R195R091Q800R083J0536J2637J3927J3270
$$ plain form
58625 965163 948165 933562 919671 904357 887757 872587 861266 853529 847301 841167 835266 830265
58613 830265 826399 823548 821553 820138 818911 817798 817329 818225 820753 824549 828933 833283 837326 841221 845183
58598 845183 848853 851378 852474 853074 854348 856223 857584 857921 857901 857993 857450 855404 852372 849786 848372 847896
58582 847896 848275 849811 852129 853886 854069 852965 851368 849463 847143 844982 844031 844623 845887 846631 846455 845961
58566 845961 846011 846773 847406 846903 845363 844160 844512 846082 847392 847625 847581 848806 852132 857293 863692 871037
58550 871037 879088 887205 894664 901505 908579 916394 924280 931195 937059 942465 947094 949430 948585 945756
58536 945756 943145 941740 940707 938706 935296 931244 927937 926319 925993 925600 924504 923753 924798 927641 931043
58521 931043 934400 938507 944369 952027 960804 969999 979090 987890 996973 1007509 1020146 1034073 1047343
58508A047343J0869Q343P862J0465J4714J7700J8044J7317J7861J9967K2157K3443
58496A236085K3971K3776K2438K0044J7426J5124J2961J0560P579L623j105n290
58484A387192p799r348j1533j4292j5824j5296j4014j3403j3331j3244j3503j4522
58472A231083j5683j6242j6471j6761j6472j4847j2493j0712r773q835p321n412
58460A080061l472j844r16o85n22j6L98K91P5J35p9j126k288k470j802j061n0
58443A064629J812L678L946K861K526L847N225N024L724K634J911J144P47J244
58429A104952J911J593M96j65r4k29r93j507q74O06J991K908L717M760N949P068
58413A132089Q101R113R830R689Q456O687N162M011K848J692J048Q86L17j188
$$ plain form
58508 1047343 1058212 1066555 1074417 1084882 1099596 1117296 1135340 1152657 1170518 1190485 1212642 1236085
58496 1236085 1260056 1283832 1306270 1326314 1343740 1358864 1371825 1382385 1389964 1393587 1392482 1387192
58484 1387192 1379393 1370045 1358512 1344220 1328396 1313100 1299086 1285683 1272352 1259108 1245605 1231083
58472 1231083 1215400 1199158 1182687 1165926 1149454 1134607 1122114 1111402 1101629 1092794 1085473 1080061
58460 1080061 1076589 1074745 1073829 1073144 1072622 1072606 1073004 1073295 1073370 1073505 1073426 1072300 1070012 1067542 1065740 1064679 1064629
58443 1064629 1066441 1070119 1074065 1076926 1079452 1083299 1088524 1093548 1097272 1099906 1101817 1102961 1103708 1104952
58429 1104952 1106863 1108456 1108952 1108787 1108693 1108464 1107471 1105964 1105090 1105696 1107687 1110595 1114312 1119072 1125021 1132089
58413 1132089 1140190 1149303 1159133 1168822 1177278 1183965 1189127 1193138 1195986 1197678 1198726 1199612 1199929 1198741
58399A198741k813l310k459j077J64J130J733J800J533J531K154L216M211M530
58385A211084L640J703p3m16M26P37o38k876m180l880k853k091j580q55m3L31
58369A198436L86J026K672M468N293N340N910P684R869J1364J2006J2284J2332
58356A289070J1852J0697Q961O725M261K332J633J959K363K198J661J346J563
58343A346621K042K004P35j510l389l617k149J18K374M138M967M835M635N268
58329A367072O261O256N000L742L316L024K050J028J126K247L219L534L970N388
58315A417233P614R662J0679J0639J0370J0755J1665J1935J0852R323R062J0632
58303A540421J2889J4316J4490J4166J4259J4896J5366J5036J4312J4314J5450
$$ plain form
58399 1198741 1195928 1192618 1190159 1189082 1189246 1190376 1192109 1193909 1195442 1196973 1199127 1202343 1206554 1211084
58385 1211084 1214724 1216427 1216354 1215938 1216364 1217101 1216463 1213587 1209407 1205527 1202674 1200583 1199003 1198148 1198105 1198436
58369 1198436 1198822 1199848 1202520 1206988 1212281 1217621 1223531 1231215 1241084 1252448 1264454 1276738 1289070
58356 1289070 1300922 1311619 1320580 1327305 1331566 1333898 1335531 1337490 1339853 1342051 1343712 1345058 1346621
58343 1346621 1348663 1350667 1351402 1349892 1346503 1342886 1340737 1340855 1343229 1347367 1352334 1357169 1361804 1367072
58329 1367072 1373333 1379589 1384589 1388331 1391647 1394671 1396721 1397749 1398875 1401122 1404341 1407875 1411845 1417233
58315 1417233 1424847 1434509 1445188 1455827 1466197 1476952 1488617 1500552 1511404 1520727 1529789 1540421
58303 1540421 1553310 1567626 1582116 1596282 1610541 1625437 1640803 1655839 1670151 1684465 1699915
58292A699915J6770J7246J7165J7561J8486J8763J7553J5425J3635J2907J3106
58281A878532J3628J3780J3315J2884J3603J5765J8281J9829K0306K0676K1513
58270B062112K2275K2278K1856K2106K3436K4971K5689K5823K6542K8185K9541
58259B334814K9233K7377K5314K3991K3347K3222K3942K5596K7282K7877K7424
58248B619419K7187K8145K9850L1200L2012L3215L5424L7995L9934M1264M2793
58237B998438M4805M6736M8126M9175N0263N1709N3952N7143O0295O1994O2317
58226C584953O3037O5223O7759O9165O9886P1521P4572P8277Q2122Q6029Q9373
58215D401917R1442R2940R5603R9980J04784J08674J11712J14866J19065J24986
$$ plain form
58292 1699915 1716685 1733931 1751096 1768657 1787143 1805906 1823459 1838884 1852519 1865426 1878532
58281 1878532 1892160 1905940 1919255 1932139 1945742 1961507 1979788 1999617 2019923 2040599 2062112
58270 2062112 2084387 2106665 2128521 2150627 2174063 2199034 2224723 2250546 2277088 2305273 2334814
58259 2334814 2364047 2391424 2416738 2440729 2464076 2487298 2511240 2536836 2564118 2591995 2619419
58248 2619419 2646606 2674751 2704601 2735801 2767813 2801028 2836452 2874447 2914381 2955645 2998438
58237 2998438 3043243 3089979 3138105 3187280 3237543 3289252 3343204 3400347 3460642 3522636 3584953
58226 3584953 3647990 3713213 3780972 3850137 3920023 3991544 4066116 4144393 4226515 4312544 4401917
58215 4401917 4493359 4586299 4681902 4781882 4886666 4995340 5107052 5221918 5340983 5465969
58205E465969J32699J41179J49055J56123J63458J71886J81259J91159K01334
58196F954121K11419K21414K32524K46125K61627K76722K90173L03082L16934
58187I314141L31804L47202L63295L80337L97969M16026M35119M55708M77521
58178A2919122N00626N25983N54082N84044O15040O47801O83842P23963P68186
58169A8522689Q16512Q69046R26104R88567J057227J131544J210274J293577J383030
58160B8198570J479417J582552J693907J817049J954301K104993K268119K444433
58152D3543341K634401K837030L053352L289312L552822L849766M185514M568741
58144G1514279N010743N521746O109983O783201P548953Q415066R392620J0497581
$$ plain form
58205 5465969 5598668 5739847 5888902 6045025 6208483 6380369 6561628 6752787 6954121
58196 6954121 7165540 7386954 7619478 7865603 8127230 8403952 8694125 8997207 9314141
58187 9314141 9645945 9993147 10356442 10736779 11134748 11550774 11985893 12441601 12919122
58178 12919122 13419748 13945731 14499813 15083857 15698897 16346698 17030540 17754503 18522689
58169 18522689 19339201 20208247 21134351 22122918 23180145 24311689 25521963 26815540 28198570
58160 28198570 29677987 31260539 32954446 34771495 36725796 38830789 41098908 43543341
58152 43543341 46177742 49014772 52068124 55357436 58910258 62760024 66945538 71514279
58144 71514279 76525022 82046768 88156751 94939952 102488905 110903971 120296591 130794172
58136A30794172J1747413J3156766J4736022J6487329J8394093K0412743K2475934
58129B48204472K4495415K6336200K7747648K8284501K7310767K4190699J8654752
58122D25224454J1117468K639077n540807j2568566j8188494k2493724k5555623
58115C54633785k7314230k7747177k7036219k5534827k3609574k1526749j9441310
58108A82423699j7433286j5541902j3790084j2197374j0776461r525269q430900
58101I4728423p479919o659554n952606n339794m807541m348024l951774l605532
58093E2583679l298022l023549k779020k560681k364621k187740k027340j881353
58085C2461353j748974j629334j519908j417967j323154j236659j158225j086075
$$ plain form
58136 130794172 142541585 155698351 170434373 186921702 205315795 225728538 248204472
58129 248204472 272699887 299036087 326783735 355068236 382379003 406569702 425224454
58122 425224454 436341922 438980999 433440192 420871626 402683132 380189408 354633785
58115 354633785 327319555 299572378 272536159 247001332 223391758 201865009 182423699
58108 182423699 164990413 149448511 135658427 123461053 112684592 103159323 94728423
58101 94728423 87248504 80588950 74636344 69296550 64489009 60140985 56189211 52583679
58093 52583679 49285657 46262108 43483088 40922407 38557786 36370046 34342706 32461353
58085 32461353 30712379 29083045 27563137 26145170 24822016 23585357 22427132 21341057
58077B1341057j019658r60313r08755q63436q21708p81545p41909p02539o63742
58068A3877452o25938n89407n54660n22365m92494m64236m37295m12364l89831
58059I388862l69142l50091l33397l18999l05269k91179k78001k67303k58389
58050F617092k49256k39159k28655k18177k08244k00110j94203j88723j81755
58041D708810j74071j67838j63073j57730j50970j43912j37067j29539j21233
58032C363377j13617j07407j01419r4697q8113q2744p8188p3715o9829o7224o5117
58021B421307o2003n7817n3961n1254m8898m5758m2123l9587l9177l9896l9585
58010A901248l7318l4353l2408l1660l1160l0630l0671l1348l1732l1078k9607
$$ plain form
58077 21341057 20321399 19361086 18452331 17588895 16767187 15985642 15243733 14541194 13877452
58068 13877452 13251514 12662107 12107447 11585082 11092588 10628352 10191057 9778693 9388862
58059 9388862 9019720 8669629 8336232 8017233 7711964 7420785 7142784 6875481 6617092
58050 6617092 6367836 6128677 5900022 5681845 5473601 5273491 5079288 4890565 4708810
58041 4708810 4534739 4366901 4203828 4046098 3895128 3751216 3614149 3484610 3363377
58032 3363377 3249760 3142353 3040934 2946237 2858124 2775380 2697192 2623477 2553648 2486424 2421307
58021 2421307 2359304 2301487 2247526 2196272 2147374 2101616 2059493 2019906 1980729 1940833 1901248
58010 1901248 1863930 1829577 1797169 1765509 1734349 1703719 1673048 1641700 1609968 1578890 1549283
57999A549283k7949k6434k5058k3632k2016k0700k0765k2418k3941k3288k0637
57988A292445j8130j7104j6875j6458j6031j6099j6324j6026j5088j3792j2454
57977A118064j1610j1840j2958j4057j4720j5301j5729j5221j3813j3057j4202
57966I65556j6331j7374j6471j4576j3113j2797j3411j3989j3519j1969j0267
57955H11739q993p784o517o102p118q413q283o710n278n044n467n472m590l043
57941G22925j544j013j638k239j372Q66K851L331K542J458Q62J181K321L341L224
57926G37096K294J909K426K523J121j106l038m817p004q837r017p946p405p821
57912F90378p577n722l869m058n757o524n263l385k597k873l095k779k391k380
$$ plain form
57999 1549283 1521334 1494900 1469842 1446210 1424194 1403494 1382729 1360311 1336370 1313082 1292445
57988 1292445 1274315 1257211 1240336 1223878 1207847 1191748 1175424 1159398 1144310 1130518 1118064
57977 1118064 1106454 1094614 1081656 1067599 1052879 1037578 1021849 1006628 992815 979758 965556
57966 965556 949225 931851 915380 900804 887691 874894 861483 847494 833975 822006 811739
57955 811739 802746 794962 788445 782343 775225 766812 758529 751819 746541 741497 736030 730558 725968 722925
57941 722925 721381 720368 718730 716491 715119 715985 718836 722167 724709 726167 727029 728210 730531 733872 737096
57926 737096 739390 741299 743725 746248 747369 746263 743225 738408 731404 722567 713550 705604 698199 690378
57912 690378 682801 677079 673210 669152 663395 656871 651608 648223 645626 642753 639658 636879 634488 632108
57898F32108k671k912k862k586k477k965l920m526l985k326n16J47j036l377m956
57883E91140m253j849N9J26q81j647k072k623k832j915m59N7m83o34K61R96M99
57866E73490m77p85p37j258k048k064j447j352k083k890l606m907o605p290o485
57851E29456n731o519q178r001q613p891p127n824m196l325l644m410m984n463
57837D44550n771n335m355m082m989n620m572k756k233l214l824k902j418n80
57823C92899N8J568L655M845M452L329K632K510K270J432L44j90K00R92J275O20
57807D22891o50j860k433k077j106m22o51j308j448j091j246k300l328l436k818
57792C96717j928n02J673L676M356L934L624L832L832L184K413K120K299K743
$$ plain form
57898 632108 629437 626525 623663 621077 618600 615635 611715 607189 603204 600878 600362 600509 599473 596096 591140
57883 591140 586887 585038 585097 585223 584342 582695 580623 578000 575168 573253 572794 572851 572368 571734 571995 572991 573490
57866 573490 573013 572228 571491 570233 568185 566121 564674 563322 561239 558349 554743 549836 543231 535941 529456
57851 529456 523725 517206 509028 500027 491414 483523 476396 470572 466376 463051 459407 454997 450013 444550
57837 444550 438779 433444 429089 425007 420018 414398 409826 407070 404837 401623 397799 394897 393479 392899
57823 392899 392957 394525 398180 403025 407477 410806 413438 415948 418218 419650 419994 419804 420004 420996 422271 422891
57807 422891 422241 420381 417948 415871 414765 414343 413692 412384 410936 409845 408599 406299 402971 399535 396717
57792 396717 394789 394287 395960 399636 403992 407926 411550 415382 419214 422398 424811 426931 429230 431973
57778D31973L220L079J665m73j704j255k64k79j359k412k861l052l218l025k295
57763D17740j498j261j740k615l331l236j868M75K653L494K720R84q31k102k529
57748D07055k244k057k899m542n414m529l288m143p256r779r296o946n836o857
57734C31969p688o154l115j188j584l174m388m941n411n829n424l817j886r18
57720B76452j096j458j330j027q29j84J365L088L870L699L356L040K335J397R79
57705B93657J234J583J901K696L844M348L808L077K799K330Q39j358l289m459
57691C13010m767m047k595j522j680k599l208l196k970k817k834l183l613l212
57677B70767j632j11k00j713k953k868j921r15q0N21P08O23O78R09J017J147J705
$$ plain form
57778 431973 435193 438272 439937 439464 437760 436505 436241 435962 434603 432191 429330 426278 423060 420035 417740
57763 417740 416242 414981 413241 410626 407295 404059 402191 402666 405319 408813 411533 412517 411686 409584 407055
57748 407055 404811 402754 399855 395313 389899 385370 382082 377939 370683 360904 351608 344662 338826 331969
57734 331969 324281 318127 315012 313824 312240 309066 304678 299737 294326 288497 283073 279256 277370 276452
57720 276452 275356 273898 272568 271541 270712 270528 271893 274981 278851 282550 285906 288946 291281 292678 293657
57705 293657 294891 296474 298375 301071 304915 309263 313071 316148 318947 321277 322116 320758 317469 313010
57691 313010 308243 304196 301601 300079 298399 295800 292592 289396 286426 283609 280775 277592 273979 270767
57677 270767 269135 269024 268824 267111 264158 261290 259369 258454 258374 258895 259603 260226 260904 261813 262830 263977 265682
57660B65682K343K082P96m86j135j787k997m002l783k725k155k545l069k860j853
57645B41506m53R15J844K133J959J518O22p02j534r18N19R22l50j743j604m25
57629B44209J95J13N91J883K584K013J648L031N225N837M211K154J612K821N031
57614B83158P786J0901J4003J6770J9296K1798K4370K7221L0537L3691L5098L3166
57602E57795K7102J6883L451j0678k2097k8836l1552l1919l0743k8468k6367k5434
57590C69137k4530k1455j6219j1669j0282j1406j2400j1578r237o552m332k695
57578B26782j259L06J693K194J706R81O57M96j2p90j395j693j808j671j224p93
57562B24170q02j169j382j043j02J126J817J015j145l007l104k071j757k486k546
$$ plain form
57660 265682 268025 270107 270903 270417 269282 267495 264498 260496 256713 253988 251833 249288 246219 243359 241506
57645 241506 241053 241968 243812 245945 247904 249422 250044 249342 247808 246890 247409 248331 247981 246238 244634 244209
57629 244209 244404 244517 245108 246991 249575 251588 253236 256267 261492 267329 271540 273694 275306 278127 283158
57614 283158 290944 301845 315848 332618 351914 373712 398082 425303 455840 489531 524629 557795
57602 557795 584897 601780 605231 594553 572456 543620 512068 480149 449406 420938 394571 369137
57590 369137 344607 323152 306933 295264 284982 273576 261176 249598 240361 233809 229477 226782
57578 226782 225523 225829 227522 229716 231422 232403 233060 233556 233544 232754 231359 229666 227858 226187 224963 224170
57562 224170 223368 222199 220817 219774 219672 220798 222615 223630 222485 219478 216374 214303 212546 210060 207514
57547B07514r29Q72R82k1j01R36J060p28k710k945j952j443j506r24K03K78j187
57530A97399k612k799k709l749n517o524o379n870n391m582l369k271j720j871
57516A42036k750l719l292r28J353Q29k188m232k941N4J560P58o25j110q21m23
57500A23561j97k36m81l71O96K372L470L172J613n04k292k793j723j24N75L14
57484A27052K25N56L6j911l571k867m00J122M57n71K75K616M047L196J038o05
57468A30695q74r7Q05Q02n32k282k831j878j055j656k446j150K095M371L622J111
57452A28700n84p89n33j22J216L373M807M359K451O4k226l721l439j433O10J105
57436A33838J93j092k302l111k513k51J588N91k375l764k107j7l71k416l443k799
$$ plain form
57547 207514 206585 207457 208439 208418 208317 209253 210313 209585 206875 203930 201978 200535 199029 198105 198308 198586 197399
57530 197399 194787 191988 189279 185530 180013 173489 167110 161240 155849 151267 147898 145627 143907 142036
57516 142036 139286 135567 132275 131347 132700 133529 131341 127109 124168 124222 125782 126540 125915 124805 123984 123561
57500 123561 123364 123128 122647 122276 122972 125344 128814 131986 133599 133095 130803 128010 126287 126163 126738 127052
57484 127052 127277 127833 127869 125958 122387 119520 119120 120242 120699 120128 120403 123019 127066 130262 131300 130695
57468 130695 129821 129724 130529 131331 130799 128517 125686 123808 122753 121097 118651 117501 119596 123967 127589 128700
57452 128700 128116 127327 126794 126672 127888 131261 136068 140427 142878 142942 140716 136995 133556 132123 132733 133838
57436 133838 134031 132939 130637 127526 125013 124762 126350 126941 124566 120802 118695 118678 118307 115891 112448 109649
57420A09649j990j630p07J067K369K328J793J671J450L65q95r39M01J789J935
57405A18656Q10n01p70L64K036L008K927K376J801J111M65M37R99J270Q89P44
57389A36622J509K335K064J026M67O07O00J73K6N29J208J663K017K254K095J688
57373A56883J536J503R60J51J57J053J352J78j157r45M11J066M51k96m76p76j560
57356A60491j776n37J144J587R00Q10J968K887K269J150J523L275M102K651N14
57341A82958K57K243M438N010M168L278K924K365P59j493k943k777j861j516j473
57326A96337k20K340L934K721j6j499j105n33n07M43L162N701N645L399J549J326
57310B22677J380K20j561k135p77J409K774K558J137n65j700j777p92P40K040
$$ plain form
57420 109649 107659 106029 105322 106389 108758 111086 112879 114550 116000 116365 115470 114531 114932 116721 118656
57405 118656 119466 118965 118195 118559 120595 123603 126530 128906 130707 131818 132283 132720 133719 134989 135878 136622
57389 136622 138131 140466 142530 143556 144023 144630 145230 145403 145429 145958 147166 148829 150846 153100 155195 156883
57373 156883 158419 159922 160882 161033 161190 162243 163595 163773 162616 161671 162082 163148 163599 163303 162827 162051 160491
57356 160491 158715 158178 159322 160909 161809 162619 164587 167474 169743 170893 172416 175691 179793 182444 182958
57341 182958 183215 185458 189896 194906 199074 202352 205276 207641 208400 206907 203964 201187 199326 197810 196337
57326 196337 196117 198457 202391 205112 205096 203597 202492 201959 201452 201895 205057 210758 216403 219802 221351 222677
57310 222677 224057 224277 222716 220581 219804 221213 223987 226545 227682 227117 225417 223640 222848 223588 225628
57295B25628K581K447K222K485L280L946L592K218J161J761L525M513L871K896
57281B66126K810K726J240p44p44J812M712N882N573M947M231L342L061M063N486
57266C14523N898N424N685P534R699J0072Q007N152M016N515Q094R592R638R472
57252D18321R749R860R629J0099J1825J3538J3526J1593Q928O924O693Q561J1000
57239E50246J1402R176P023P621J0164J1942J2367J3142J4913J6201J6005J5230
57227F95432J4914J4790J4402J4085J4126J4284J4732J6097J7786J7864J5677
57216H64189J3315J3159J5011J6946J8083J8889J9511J9516J9256J9861K1534
57205A059270K3048K3263K2274K0690J8802J7095J6655J8085K0427K2107K2871
$$ plain form
57295 225628 228209 230656 232878 235363 238643 242589 246181 248399 249560 251321 254846 259359 263230 266126
57281 266126 268936 271662 272902 272158 271414 273226 277938 283820 289393 294340 298571 301913 304974 309037 314523
57266 314523 320421 325845 331530 339064 348763 358835 366842 371994 376010 381525 389619 399211 408849 418321
57252 418321 428070 437930 447559 457658 469483 483021 496547 508140 517068 523992 530685 539246 550246
57239 550246 561648 570824 577847 585468 595632 607574 619941 633083 647996 664197 680202 695432
57227 695432 710346 725136 739538 753623 767749 782033 796765 812862 830648 848512 864189
57216 864189 877504 890663 905674 922620 940703 959592 979103 998619 1017875 1037736 1059270
57205 1059270 1082318 1105581 1127855 1148545 1167347 1184442 1201097 1219182 1239609 1261716 1284587
57194A284587K3855K5635K7210K7542K7204K7468K8275K8377K7434K6561K6421
57183A580569K6161K5001K3587K2683K1666J9779J7989J7883J9179K0193K0533
57172A815223K1467K3482K5515K7009K8805L1171L2819L3078L3383L5232L8011
57161B145195M0370M2444M4808M6191M4617M0654L7288L6167L5851L4619L3334
57150B581538L4022L6436L7711L5682L1488K8222K7339K7231K5554K2285J9653
57139B907161J9305K0541K1541K1362K0197J8665J7634J8099K0161K2521K3838
57128C131025K4253K4815K5764K6450K6650K6804K6969K6642K5813K5173K4941
57117C415299K4344K2660K0066J7193J4482J2352J1271J1067J0759R684Q474Q339
$$ plain form
57194 1284587 1308442 1334077 1361287 1388829 1416033 1443501 1471776 1500153 1527587 1554148 1580569
57183 1580569 1606730 1631731 1655318 1678001 1699667 1719446 1737435 1755318 1774497 1794690 1815223
57172 1815223 1836690 1860172 1885687 1912696 1941501 1972672 2005491 2038569 2071952 2107184 2145195
57161 2145195 2185565 2228009 2272817 2319008 2363625 2404279 2441567 2477734 2513585 2548204 2581538
57150 2581538 2615560 2651996 2689707 2725389 2756877 2785099 2812438 2839669 2865223 2887508 2907161
57139 2907161 2926466 2947007 2968548 2989910 3010107 3028772 3046406 3064505 3084666 3107187 3131025
57128 3131025 3155278 3180093 3205857 3232307 3258957 3285761 3312730 3339372 3365185 3390358 3415299
57117 3415299 3439643 3462303 3482369 3499562 3514044 3526396 3537667 3548734 3559493 3569177 3577651 3585990
57105C585990R525J1024J1859J2279J3421J5829J8580K0227K0467K0313K0374
57094C759888J9875J8077J5993J5486J6900J8796J9920K0219J9755J8034J5078
57083C958021J1904R095N806J054m837j1042j7687k5404l3991m2827n2356o3864
57071C733872p7682r2663j07579j22219j36894j51806j67201j83478k00910k19630
57061B273810k39999k62359k86680l13431l44767l83365A3748d66477n33165n89166
57051a588808o51286p21264p98879q84338r79540j086551j206293j339449j487866
57042a0744274j654380j842067k054537k296518k573514k890938l253829l666408
57034c0976465m130635m644719n202848n795348o408099p022117p613908q154270
$$ plain form
57105 3585990 3595515 3606539 3618398 3630677 3644098 3659927 3678507 3698734 3719201 3739514 3759888
57094 3759888 3779763 3797840 3813833 3829319 3846219 3865015 3884935 3905154 3924909 3942943 3958021
57083 3958021 3969925 3979020 3984826 3985880 3981043 3970001 3952314 3926910 3892919 3850092 3797736 3733872
57071 3733872 3656190 3563527 3455948 3333729 3196835 3045029 2877828 2694350 2493440 2273810
57061 2273810 2033811 1771452 1484772 1171341 826574 443209 13748 -466477 -999642 -1588808
57051 -1588808 -2240094 -2961358 -3760237 -4644575 -5624115 -6710666 -7916959 -9256408 -10744274
57042 -10744274 -12398654 -14240721 -16295258 -18591776 -21165290 -24056228 -27310057 -30976465
57034 -30976465 -35107100 -39751819 -44954667 -50750015 -57158114 -64180231 -71794139 -79948409
57026g9948409q604871q919140r054755q990872q729580q271539p586232o611955
57018a46717353n295712l642753j734638K94902K301602M160855N779235P097051
57010a37756811Q088883Q760461R140082R267931R187422Q939677Q561014Q083503
57002f7727838P536938O949159O344249N741586N157042M603725M090451L620740
56994b3683948L195191K814562K479244K186276J929257J702273J502839J330445
56986f543861J183315J057602R48941Q53779P69503O94207d10026A55033N08745
56977F63778M57018M10340L69332L33752L02532K74693K50166K29757K14098K02295
56967C707761J92315J83781J79671J82511J87760J83297J58439J13603O0026J0678
$$ plain form
57026 -79948409 -88553280 -97472420 -106527175 -115518047 -124247627 -132519166 -140105398 -146717353
57018 -146717353 -152013065 -155655818 -157390456 -157095554 -154793952 -150633097 -144853862 -137756811
57010 -137756811 -129667928 -120907467 -111767385 -102499454 -93312032 -84372355 -75811341 -67727838
57002 -67727838 -60190900 -53241741 -46897492 -41155906 -35998864 -31395139 -27304688 -23683948
56994 -23683948 -20488757 -17674195 -15194951 -13008675 -11079418 -9377145 -7874306 -6543861
56986 -6543861 -5360546 -4302944 -3354003 -2500224 -1730721 -1036514 -410026 155033 663778
56977 663778 1120796 1531136 1900468 2234220 2536752 2811445 3061611 3291368 3505466 3707761
56967 3707761 3900076 4083857 4263528 4446039 4633799 4817096 4975535 5089138 5149164 5159842
56957E159842k7171n2199o6148p2281p4425p5104p4806p3705p3101p4259p6830
56946D419813p9640q2290q4976q7393q9192r1343r5716j03109j12424j21710j29405
56935C342615j34705j37627j38865j38969j37698j34777j31099j28115j25946
56926B134814j23033j18079j11604j05075r9117r3259q7170q1444p6972p3830
56916A165231p0966o7088o1960n6620n2208m8816m5757m2478l8621l3610k7322
56905F19785k1244j7709j7359j8165j7689j5669j3601j2435j1774j1107j0626
56894D52407j0667j1128j1894j3169j4950j6483j6684j5085j2322r711q274p870
56882C04170p464o448n329m594l327j14M584Q233R105Q385Q417R540J0009Q749
$$ plain form
56957 5159842 5132671 5080472 5014324 4942043 4867618 4792514 4717708 4644003 4570902 4496643 4419813
56946 4419813 4340173 4257883 4172907 4085514 3996322 3904979 3809263 3706154 3593730 3472020 3342615
56935 3342615 3207910 3070283 2931418 2792449 2654751 2519974 2388875 2260760 2134814
56926 2134814 2011781 1893702 1782098 1677023 1577906 1484647 1397477 1316033 1239061 1165231
56916 1165231 1094265 1027177 965217 908597 856389 807573 761816 719338 680717 647107 619785
56905 619785 598541 580832 563473 545308 527619 511950 498349 485914 474140 463033 452407
56894 452407 441740 430612 418718 405549 390599 374116 357432 342347 330025 320314 312040 304170
56882 304170 296706 290258 284929 280335 277008 276894 281478 289711 298816 307201 315618 325158 335167 343916
56868C43916O709N092L571J042k538o067q647j0168j0713j0245r052p836p138
56855B87926o971p150p504p588o751m884k794j465j119j326j799k486l099l102
56841B29888k366j356m52M88J699L014M083M832N323N468N275N204N767O806P638
56826B81311P861P658P178O184M445K142m02l028n477p081p182n787l573j250
56812B82999Q72K838M700O312P454Q300R612J2051J5215J7876J9449K0666K2352
56799D30696K4073K4695K3806K1623J7732J1245K708n209r786j0730r992r423
56787E11438r256q589o627l233J187N926J0195J3511J6084J8854K2825K8033L3179
56774F33527L6570L7416L5942L2384K6496J8292Q659j129j0193j8007k4002k7735
$$ plain form
56868 343916 350625 355717 359288 360330 357792 351725 343078 332910 322197 311952 302900 295064 287926
56855 287926 280955 273805 266301 258713 251962 247078 244284 242819 241700 240374 238575 236089 232990 229888
56841 229888 227522 226166 225714 226202 227901 230915 234998 239830 245153 250621 255896 261100 266867 273673 281311
56826 281311 289172 296830 304008 310192 314637 316779 316377 313349 307872 300791 293609 287822 284249 282999
56812 282999 283871 286709 291409 297721 305175 313475 323087 335138 350353 368229 387678 408344 430696
56799 430696 454769 479464 503270 524893 542625 553870 556578 551369 541583 530853 520861 511438
56787 511438 502182 493593 486966 483733 484920 490846 501041 514552 530636 549490 572315 600348 633527
56774 633527 670097 707513 743455 775839 802335 820627 829286 828157 817964 799957 775955 748220
56762G48220k9210k8666k6297k2606j8645j5289j2396r205n487j677K057O186
56750E86985J0977J5793J9491K1277K0978J8770J4833R239K194n628j3130j9378
56738F82401k3949k6656k7372k6516k5127k3795k1906j8704j4682j0993p847m695
56726D50159j846l65o0P84K911M811N013M265L945L352N06m675r958j3675j6373
56711D28794j9029k1099k1293j9438j6677j4242j2717j2031j1658j0969r837q676
56699B51128p727o643n065l303k129k098l159m677n790o109o084o207n970m418
56685A81749j848NJ5r09j203p24n80j296k179k332j515p2J268J555L53j577k855
56668A67855k819j857n98N72J287J290Q45M79K44j33m21p4O50P30j28r32q16j15
$$ plain form
56762 748220 719010 690344 664047 641441 622796 607507 595111 585906 580419 578742 580799 586985
56750 586985 597962 613755 633246 654523 675501 694271 709104 718343 720537 714909 701779 682401
56738 682401 658452 631796 604424 577908 552781 528986 507080 488376 473694 462701 454854 450159
56726 450159 448313 447948 447888 448672 451583 456394 461407 465672 469617 472969 473475 468800 458842 445167 428794
56711 428794 409765 388666 367373 347935 331258 317016 304299 292268 280610 269641 259804 251128
56699 251128 243401 236758 231693 228390 226261 224163 221004 216327 210537 204428 198344 192137 186167 181749
56685 181749 179901 179906 179921 179012 177809 177085 176505 175209 173030 170698 169183 169111 170379 171934 172287 170710 167855
56668 167855 165036 163179 162581 163153 164440 165730 166575 167054 167298 167165 166744 166670 167320 168050 167922 166990 166174 166059
56650A66059M99J095J804K019J291M18L97P20J65r26p27J388L672M232L322K482
56634A87910K323K266J907J479J102O12J63J07K47M0l06J72J583K466J381j148
56618B02304l094l128j712j32Q01R99O61J06l27n04n03k82L12J077J362Q56R4
56601A98890k71m72j212k290k433q39J632L351L713L470L368L163K183N06r88
56586B11771j590j382p72J44J270J883J092q21k165j619J17J177Q35J15k1N0m13
56569B09671j135j361j191j291j466p09J198L081L757L284K291R53o31j594r58
56554B13899R51K625L122K931K867K823K245J285O80N90M08j65n80l62L5m3l23
56537B32988J2R14J378R09L34N01R12M35q67j541n54J384K606K127K38k044l656
$$ plain form
56650 166059 166558 167653 169457 171476 172767 173185 173582 174302 174467 173541 172814 174202 177874 182106 185428 187910
56634 187910 190233 192499 194406 195885 196987 197599 197762 197869 198116 198156 197850 198022 199605 202071 203452 202304
56618 202304 199210 196082 194370 194238 195039 196038 196699 196805 196478 195974 195471 195189 195501 196578 197940 198796 198890
56601 198890 198619 198147 196935 194645 192212 191373 193005 196356 200069 203539 206907 210070 212253 212759 211771
56586 211771 210181 208799 208027 208171 209441 211324 212416 211595 209430 207811 207928 209105 209940 210055 210034 210084 209671
56569 209671 208536 207175 205984 204693 203227 202518 203716 206797 210554 213838 216129 217082 216451 214857 213899
56554 213899 214850 217475 220597 223528 226395 229218 231463 232748 233428 234018 234426 234261 233681 233319 233354 233311 232988
56537 232988 233000 233914 235292 236201 236535 237036 237948 238383 237516 235975 235421 236805 239411 241538 241776 239732 236076
56520B36076l862k608o63J015K083K819L344L283K444J421J033J308J558J462
56506B50713J476J923K396K483K621L470M750N536N627N767O329O693O233N174
56492C11191L922K278l7k527m323n107n100m402l041j437l19j84j049k451l350
56477B84064k733r07L83j69j851k999l104k837k503j758o95J29P15J502K197K037
56461B71471J299J068J232M16j503k549j383N32R14l37j585k011k060j898j126
56446B62480NO85R47J669K829L013J299j218k510j830l14M62M2q06j235j182q86
56429B63450o3J643L432L708K082J63l98K03O90O00M21M68P27J310K030K023R27
56412B83416p6M01J944K991L167L392L847L593K333J021K54l10o04J70J813K710
$$ plain form
56520 236076 232214 229606 228943 229958 232041 234860 238204 241487 243931 245352 246385 247693 249251 250713
56506 250713 252189 254112 256508 258991 261612 265082 269832 275368 280995 286762 293091 299784 306017 311191
56492 311191 315113 317391 317354 314827 310504 305397 300297 295895 292854 291417 291098 290914 289865 287414 284064
56477 284064 281331 280424 280807 280638 278787 275788 272684 269847 267344 265586 264891 265020 265735 267237 269434 271471
56461 271471 272770 273838 275070 275486 273983 271434 270051 270583 271497 271160 269575 267564 265504 263606 262480
56446 262480 262485 263170 264117 265786 268615 271628 272927 271709 269199 267369 267055 267517 267559 266753 265518 264336 263450
56429 263450 263387 265030 268462 272170 274252 274415 274017 274220 274910 275510 275931 276399 277126 278436 280466 282489 283416
56412 283416 283340 283741 285685 288676 291843 295235 299082 302675 305008 306029 306283 305973 305369 305539 307352 310062
56396C10062K153J642K607M076L994K096L7r24j033j090j420j772j587n68N95
56381C18868N74r46k546k700j539k46O51J372J868J788J231O40J78o0L11J129
56365C20573J177k92j935j687M48K368K606J612L14r49j631q53J075K364J979
56350C27169J057J053J619J518P09P8k06n42n60M31J765J887P27O3Q98J997J838
56333C41501Q75N30R26R40J44p15j106j352j661j535n78R00K394L633M181L413
56317C52490J478l11p92j78N73J166J922K719K894K281J584J520K054K584K497
56302C74481J593M04l7P73K080K614K016R77J45l76n84m04%M51J189K327K977
56285C90626K140M70j76P00J586J405J028J352J528O81O9J394L752M476K970J491
$$ plain form
56396 310062 312215 313857 316464 320540 324534 326630 326667 325743 324710 323620 322200 320428 318841 318273 318868
56381 318868 319442 318496 315950 313250 311711 311465 312116 313488 315356 317144 318375 319015 319193 319133 319444 320573
56365 320573 321750 321458 319523 317836 318284 320652 323258 324870 325184 324235 322604 321751 322826 325190 327169
56350 327169 328226 329279 330898 332416 333125 333203 332997 332455 331895 332326 334091 335978 336705 336768 337666 339663 341501
56333 341501 342376 342906 343832 344772 344916 344201 343095 341743 340082 338547 337969 338869 341263 344896 349077 352490
56317 352490 353968 353657 352865 352687 353260 354426 356348 359067 361961 364242 365826 367346 369400 371984 374481
56302 374481 376074 376478 376441 377214 379294 381908 383924 384901 385046 384670 384086 383682 383682 384133 385322 387649 390626
56285 390626 392766 393236 393060 393760 395346 396751 397779 399131 400659 401340 401409 402803 406555 411031 414001 415492
56269D15492J762K791K893K282K429L803N341N718M498K489J304J857L059K870
56255D58588J006n24k15Q95J031L42K28P72P04k64q58k75P25J354J972K894L247
56238D71622K188N01k71J09N84O09P38J263J517J105Q55J767L499M654M437L278
56222D98455K101J560J932K944L586K768O19j356j744n56J207K880M459N853O564
56207E31272O311N529M932M772M726M405L834L443L656M487N551O556P588Q728
56193F05790R505R214P941O862P064Q265R192R275R271J0042J1292J2084J2212
56180G28009J2240J2380J2200J1640J1387J1818J2245J1831J0772R899R489R013
56168H62923P797N454K214o80j604n27M01o57k804l836l564l740m925n661n259
$$ plain form
56269 415492 417254 420045 422938 425220 427649 431452 436793 442511 447009 449498 450802 452659 455718 458588
56255 458588 459594 459070 458855 459750 460781 461123 461351 462123 462827 462563 461705 461430 462155 463509 465481 468375 471622
56238 471622 473810 474311 474040 474149 474733 475342 476080 477343 478860 479965 480820 482587 486086 490740 495177 498455
56222 498455 500556 502116 504048 506992 510578 513346 513965 512609 510865 510309 511516 514396 518855 524708 531272
56207 531272 537583 543112 548044 552816 557542 561947 565781 569224 572880 577367 582918 589474 597062 605790
56193 605790 615295 624509 632450 639312 646376 654641 663833 673108 682379 692421 703713 715797 728009
56180 728009 740249 752629 764829 776469 787856 799674 811919 823750 834522 844421 853910 862923
56168 862923 870720 876174 878388 877708 876104 875577 875978 875321 872517 868681 865117 861377 856452 850791 845532
56153H45532n016n632n578l705j669j649k948l146j823q44j224k000k298k421
56139H05579k555k196j445j233j717j785q41L68J267K373L857M558L618K085J696
56124H13629K711M019M798N056N006M878N100N857O618O710O168N454M782M294
56110H85080M519N829P677R023R477R454R363R224Q967Q672Q538R013J0640J3402
56096A008878J6272J7921J7840J6633J5415J5179J6301J8285K0201K1728K3441
56085A208094K5854K8657L1381L4252L7762M1814M5894M9798N3575N7201O0981
56074A675263O5832P2317P9686Q6780R3345R9400J03575J03622R8872R0995Q2106
56063B651793P3372O5757O0398N7120N3718M8037M0072L0881K0361P861n336j6096
$$ plain form
56153 845532 840516 834884 829306 825601 823932 822283 819335 816189 814366 813522 812298 810298 808000 805579
56139 805579 803024 800828 799383 798150 796433 794648 793807 794175 795442 797815 801672 806230 809848 811933 813629
56124 813629 816340 820359 825157 830213 835219 840097 845197 851054 857672 864382 870550 876004 880786 885080
56110 885080 889599 895428 903105 912128 921605 931059 940422 949646 958613 967285 975823 984836 995476 1008878
56096 1008878 1025150 1043071 1060911 1077544 1092959 1108138 1124439 1142724 1162925 1184653 1208094
56085 1208094 1233948 1262605 1293986 1328238 1366000 1407814 1453708 1503506 1557081 1614282 1675263
56074 1675263 1741095 1813412 1893098 1979878 2073223 2172623 2276198 2379820 2478692 2569687 2651793
56063 2651793 2725165 2790922 2851320 2908440 2962158 3010195 3050267 3081148 3101509 3109370 3104034 3087938
56051C087938k2494k5616k7914l1153l6478m4942n6357o8247p7322q2015q2850
56040B532550q0733p6104o9636o2479n5345m8078m0518l3133k6523k0964j6659
56029B002378j3669j1297q388m746j410J052L525O776R764J0942J0736J1310J3839
56016B030812J7137J9331J9887J9778K0281K1865K3748K4555K3969K3473K4723
56005B269559K7506L0315L2626L5219L8269M0680M1846M2660M4049M5669M6910
55994B695308M8069M9610N1096N1918N2411N3318N4757N6504N8622O0900O2344
55983C294857O2335O1857O2590O5061O8423P1637P3990P5043P5179P5928P8634
55972D065534Q2901Q7299R1307R5626J00718J06154J11476J16799J22416J28514
$$ plain form
56051 3087938 3065444 3039828 3011914 2980761 2944283 2899341 2842984 2774737 2697415 2615400 2532550
56040 2532550 2451817 2375713 2306077 2243598 2188253 2140175 2099657 2066524 2040001 2019037 2002378
56029 2002378 1988709 1977412 1969024 1964278 1962868 1963920 1967445 1974221 1983985 1994927 2005663 2016973 2030812
56016 2030812 2047949 2067280 2087167 2106945 2127226 2149091 2172839 2197394 2221363 2244836 2269559
56005 2269559 2297065 2327380 2360006 2395225 2433494 2474174 2516020 2558680 2602729 2648398 2695308
55994 2695308 2743377 2792987 2844083 2896001 2948412 3001730 3056487 3112991 3171613 3232513 3294857
55983 3294857 3357192 3419049 3481639 3546700 3615123 3686760 3760750 3835793 3910972 3986900 4065534
55972 4065534 4148435 4235734 4327041 4422667 4523385 4629539 4741015 4857814 4980230 5108744
55962E108744J35233J42455J49680J56808J64666J73970J84150J94322K04961
55953F614989K17233K30740K43524K54734K65941K79077K94048L09109L23003
55944I032398L36161L50208L66498L84701M02942M20097M37761M58785M83828
55935A2673379N10794N38108N66956N99368O35461O74030P15023P59815Q09377
55926A8482311Q63502R21903R84905J052805J125474J202986J286103J375925
55918B7295914J473612J580678J698850J828991J970385K121728K282952K455834
55910D2708944K642994K847164L072152L324197L611719L943739M329037M776688
55902G1256634N296407N897827O589657P379371Q273052R276124J0396317J1647087
$$ plain form
55962 5108744 5243977 5386432 5536112 5692920 5857586 6031556 6215706 6410028 6614989
55953 6614989 6832222 7062962 7306486 7561220 7827161 8106238 8400286 8709395 9032398
55944 9032398 9368559 9718767 10085265 10469966 10872908 11293005 11730766 12189551 12673379
55935 12673379 13184173 13722281 14289237 14888605 15524066 16198096 16913119 17672934 18482311
55926 18482311 19345813 20267716 21252621 22305426 23430900 24633886 25919989 27295914
55918 27295914 28769526 30350204 32049054 33878045 35848430 37970158 40253110 42708944
55910 42708944 45351938 48199102 51271254 54595451 58207170 62150909 66479946 71256634
55902 71256634 76553041 82450868 89040525 96419896 104692948 113969072 124365389 136012476
55894A36012476J3046963J4613360J6353332J8252091K0256835K2254845K4045192
55887B64835094K5302106K5546101K4183231K0683823J4879794P208420j312108
55880C81326461r424051j6090873k0794265k3537037k4644349k4542931k3625728
55873B38667227k2203727k0504428j8686806j6859018j5092671j3433127j1907705
55866A19979745j0531345r308862q236323p304271o500989n812892n223732m716127
55858F2345204m274698l887404l544815l239548k966216k720590k498547k296473
55850C6916913k112187j944546j792444j655121j532877j425955j332631j249484
55842B3871668j173666j103800j038741r77095r18423q63540q12680p64444p17580
$$ plain form
55894 136012476 149059439 163672799 180026131 198278222 218535057 240789902 264835094
55887 264835094 290137200 315683301 339866532 360550355 375430149 382638569 381326461
55880 381326461 371902410 355811537 335017272 311480235 286835886 262292955 238667227
55873 238667227 216463500 195959072 177272266 160413248 145320577 131887450 119979745
55866 119979745 109448400 100139538 91903215 84598944 78097955 72285063 67061331 62345204
55858 62345204 58070506 54183102 50638287 47398739 44432523 41711933 39213386 36916913
55850 36916913 34804726 32860180 31067736 29412615 27879738 26453783 25121152 23871668
55842 23871668 22698002 21594202 20555461 19578366 18659943 17796403 16983723 16219279 15501699
55833A5501699o72764o31164n91869n52385n11799m71764m33872l97446l60851
55824A0877785l23887k87583k52384k18285j86829j61410j44923j37998j40080
55815I024406j51143j71326j99271k31719k64402k92938l13644l24942l28171
55806F746850l26098l20539l11770k99946k85915k70537k54225k37536k21407
55797D218877k06324j91893j77695j64004j51334j39794j29259j19613j10559
55788B828402j01803r3835q7731q3612p9935p5129o9383o4068n9921n6652n3911
55777B002422n1575m9248m6545m3898m2159m1264m0165l8350l6473l5191l4187
55766A543367l2879l1357l0016k8772k7297k5727k4526k3877k3666k3833k4238
$$ plain form
55833 15501699 14828935 14197771 13605902 13053517 12541718 12069954 11636082 11238636 10877785
55824 10877785 10553898 10266315 10013931 9795646 9608817 9447407 9302484 9164486 9024406
55815 9024406 8873263 8701937 8502666 8270947 8006545 7713607 7399963 7075021 6746850
55806 6746850 6420752 6100213 5788443 5488497 5202582 4932045 4677820 4440284 4218877
55797 4218877 4012553 3820660 3642965 3478961 3327627 3187833 3058574 2938961 2828402
55788 2828402 2726599 2632764 2545033 2461421 2381486 2306357 2236974 2172906 2112985 2056333 2002422
55777 2002422 1950847 1901599 1855054 1811156 1768997 1727733 1687568 1649218 1612745 1577554 1543367
55766 1543367 1510488 1479131 1449115 1420343 1393046 1367319 1342793 1318916 1295250 1271417 1247179
55755A247179k4407k3943k3007k1972k0779j9268j7937j7578j8046j8119j6913
55744A025210j4882j3017j1582j0233q977q294q315q592q841r392j0510j1587
55732I00988j1598j0251q312o623n149l358j263M54J463K293L393M087L186M57
55718H69767l258p365j1898j6292j8962j9098j8136j8169j9215j9366j7547j4701
55706F85760j2041r692p769p349r033j1420j2465j1903j1072j0601r777q159o422
55693E58057n151l949k384r14j78j23m56j352k890m231m331l432l024m137o126
55678E15379p439p318o394n741n640n533n049m614m745n241n539n576n685n762
55664D35103n456n135n697p145q180p776o368n010m048l233k466j690o97L22P02
$$ plain form
55755 1247179 1222772 1198829 1175822 1153850 1133071 1113803 1095866 1078288 1060242 1042123 1025210
55744 1025210 1010328 997311 985729 975496 966519 958225 949910 941318 932477 923085 912575 900988
55732 900988 889390 879139 870827 864204 859055 855697 854434 854888 856351 858644 862037 866124 869310 869767
55718 869767 866509 859144 847246 830954 811992 792894 774758 756589 737374 718008 700461 685760
55706 685760 673719 664027 656258 648909 639876 628456 615991 604088 593016 582415 572638 564479 558057
55693 558057 552906 548957 546573 545659 545481 545358 544902 543550 540660 536429 532098 528666 525642 521505 515379
55678 515379 507940 500622 494228 488487 482847 477314 472265 467651 462906 457665 452126 446550 440865 435103
55664 435103 429647 424512 418815 411670 403490 395714 389346 384336 380288 377055 374589 372899 372202 372524 373226
55649C73226N36J062K700L644K100p14j844q92o98l122o255p210o150n645p018
55634C43720r079j0203r942q588o560m633l653l586l559l090k620k614k847k790
55620B69956k213j102L60J507J511L38j090k005k541l053l347l083k501k103j923
55605B48711j666j381j364j570j715j799j954j803o91J205K624K452R55n95j324
55590B40085j440j655k163k313j297Q44K948L651K634R12q1L64J746K875K888
55575B49998K037J302J141R01j78j707k603k584k450k806l390l882m439m872m247
55560B22221k185M4P53j31j264j786k029k430k816k942k850k467j753j399k331
55545A96635m114m931l818k015j244j537j711j366j083j072q49k30L48N46L22
$$ plain form
55649 373226 373762 374824 377524 381168 383268 382554 380710 379818 379120 375998 369743 362533 356383 350738 343720
55634 343720 334641 324438 314496 305908 299348 294715 291062 287476 283917 280827 278207 275593 272746 269956
55620 269956 267743 266641 267001 268508 270019 270357 269267 267262 264721 261668 258321 255238 252737 250634 248711
55605 248711 247045 245664 244300 242730 241015 239216 237262 235459 234768 235973 238597 241049 242004 241409 240085
55590 240085 238645 236990 234827 232514 231217 232061 235009 238660 241294 242206 242125 242489 244235 247110 249998
55575 249998 252035 253337 254478 255379 255201 253494 250891 248307 245857 243051 239661 235779 231340 226468 222221
55560 222221 220036 220080 220833 220702 219438 217652 215623 213193 210377 207435 204585 202118 200365 198966 196635
55545 196635 192521 187590 183772 181757 180513 178976 177265 175899 174816 173744 172895 172665 173013 173559 173881
55530A73881n13j894k754j915P8J182M41q42j095m52J24O96J905L324L679K673
55514A78518J364O87O38J072K153L557M166L279J547R7q50j871l197m310m629
55499A82221m046k870j663j130j653k754l381k954j956j360j606k314k864k982
55485A48688k720k133j298n44l24p02j154j169q18n35m56m11m42q09j381j524
55469A32268r94m04l51l74M73K017K674J230j434k959j881R35L243L563K272Q44
55453A41122L60P34J090O84m29j517j930j735j439j152m18Q53J725J071r94l010
55437A35015l650k861j552o24m42p91j044p22j05J01j20J24J305K508K419R61
55421A30522p79j983k689l012k637j425K2Q32O94R3j36M79J472J687M34j618l045
$$ plain form
55530 173881 173368 171474 168720 166805 166883 168065 168506 167664 166569 166117 166241 166937 168842 172166 175845 178518
55514 178518 179882 180569 181207 182279 184432 187989 192155 195434 196981 197078 196228 194357 191160 186850 182221
55499 182221 178175 175305 173642 172512 170859 168105 164724 161770 159814 158454 156848 154534 151670 148688
55485 148688 145968 143835 142537 141993 141669 140967 139813 138644 137826 137291 136835 136424 135982 135173 133792 132268
55469 132268 131274 130870 130519 130145 130618 132635 135309 136539 135105 132146 130265 131200 134443 138006 140278 141122
55453 141122 141482 142216 143306 143990 143561 142044 140114 138379 136940 135788 135370 136223 137948 139019 138025 135015
55437 135015 131365 128504 126952 126328 125886 125095 124051 123329 123224 123325 123205 123329 124634 127142 129561 130522
55421 130522 129743 127760 125071 122059 119422 117997 118019 118851 119545 119638 119502 119981 121453 123140 123574 121956 118911
55404A18911l075j986m36R10J252R9j796k857k409j396r19p87n2J502L071L663
55388A13695K758O14j539k102o60J307J984J194K47J36P13J373J634J111j12r90
55372A21363m26J144J948J025o80j822k259k456k120o25J532K786K186L24j499
55357A20421k434k286j227L49J906K991L241K364N00j361j977j169j33n1p44j190
55341A19200j014q05r85j122n70O88K078K904K576R84r59j706o61R68J574J024
55325A24174L72N9m76j368j827j506j246j763k445k265j195J05J329K372K787
55310A17107K377J738J203K0k091l336j749J535L147J941L93P40J897J761O27
55295A27310K48O46L04r85j713j209n26l63O9J263K031J038j207k948l190k240
$$ plain form
55404 118911 115836 113850 113414 114324 115576 115675 113879 111022 108613 107217 106298 105511 105459 106961 110032 113695
55388 113695 116453 117067 115528 113426 112766 114073 116057 117251 117498 117634 118347 119720 121354 122465 122353 121363
55372 121363 120937 122081 124029 125054 124374 122552 120293 117837 115717 115092 116624 119410 121596 121920 120421
55357 120421 117987 115701 114474 114823 116729 119720 122961 125325 125825 124464 122487 121318 121185 121134 120390 119200
55341 119200 118186 117381 116396 115274 114704 115392 117470 120374 122950 123934 122975 121269 120608 121576 123150 124174
55325 124174 124546 124605 124129 122761 120934 119428 118182 116419 113974 111709 110514 110619 111948 114320 117107
55310 117107 119484 121222 122425 122445 120354 117018 115269 116804 119951 121892 122285 123025 124922 126683 127310
55295 127310 127558 128204 128508 127523 125810 124601 124075 123712 123781 125044 127075 128113 126906 123958 120768 118528
55279A18528p86N99J390J382J064J016J051N54l94r23n28K13M60J83N0M68J140
55262A25467J609J735J531Q98o6q56j045r83j296j815j645o13J59l59j758k935
55246A18028l482l519k707p44J370K024J234Q14J768K734J975k5j161l75J351
55231A19285K495K501J787J029O43N28K32m22j034j194r91o27l2O26O50j54o45
55214A24677L69K253L074K047L02r28j697k412k707k057q28J28M72L62n1m55k59
55197A22290P38J782K020J534R79N64J54l2K77N94J85n67l42J278K987L248K014
55180A39703N40r9J61O23N56j66r11j035p62r05j565j851j285p48j265k323k437
55163A26231j234l0m6q43j058j33J240K064J874P55p97j950k023j269o95p58n68
$$ plain form
55279 118528 117742 118341 119731 121113 122177 123193 124244 124798 124404 123481 122953 123166 123626 123809 123859 124327 125467
55262 125467 127076 128811 130342 131240 131174 130318 129273 128290 126994 125179 123534 122921 123080 122721 120963 118028
55246 118028 114546 111027 108320 107576 108946 110970 112204 113018 114786 117520 119495 119470 118309 117934 119285
55231 119285 121780 124281 126068 127097 127740 128268 128500 128078 127044 125850 124859 124232 124200 124826 125476 125322 124677
55214 124677 125046 127299 130373 132420 132722 131794 130097 127685 124978 122921 122093 122221 122693 123055 123004 122549 122290
55197 122290 123028 124810 126830 128364 129343 129907 130061 130029 130306 130900 131085 130518 130176 131454 134441 137689 139703
55180 139703 140243 140144 140305 140928 141484 141318 140407 139372 138610 137705 136140 134289 133004 132256 130991 128668 126231
55163 126231 124997 124967 124921 124078 123020 122887 124127 126191 128065 128820 128023 126073 124050 122781 122086 121328 120760
55146A20760R06L068L932K481P7j023j43J435K164J571R1j528k471k266j322n86
55130A27146l82m5R95K249K736K182J258P75R79J419J292J96j248j824j059K23
55114A36892R19Q00L66L6PL41P05M33m96j099o88k7j89p19l35P37O89j175l105
55095A34092l070j207Q22K007K457K402J973J685J942K111J205l93j050j34Q46
55080A45688J91j672k817k360j241n18r0L45K59p58j583o48J638K870J674m41
55064A40537j137k38N00Rj060j692j571o71R05K267K116M58r44o23P04J085k31
55047A40414k014k489j042J301K726K233O20l54Q4J065J406R03O9n41l26J058
55031A45113K677K572J08k719l398j918m38l85j134j413p15P14K158K469R73j427
$$ plain form
55146 120760 121666 124734 128666 131147 131224 130201 130058 131493 133657 135228 135319 133791 131320 129054 127732 127146
55130 127146 126764 126719 127714 129963 132699 134881 136139 136914 137893 139312 140604 140800 139552 137728 136669 136892
55114 136892 137811 138611 138977 139013 139020 139361 140066 140499 140003 138904 138216 138189 138000 137281 136946 137683 138372 137197 134092
55095 134092 131022 129815 130637 132644 135101 137503 139476 141161 143103 145214 146419 146026 144976 144842 145688
55080 145688 145879 144207 141390 139030 137789 137271 137181 137526 137785 137027 135444 134796 136434 139304 140978 140537
55064 140537 139400 139162 139662 139671 138611 136919 135348 134677 135582 137849 139965 140423 139479 138856 139560 140645 140414
55047 140414 138400 135911 134869 136170 138896 141129 141749 141395 141479 142544 143950 144853 144922 144381 144055 145113
55031 145113 147790 150362 150470 147751 144353 142435 141997 141612 140478 139065 138350 139064 141222 143691 144664 143237
55015A43237k923k776j767o57O23J996K675K265J461J002P69M89N27J171J790
55000A49882J598P78J09j18j89k92m47p74j244j425j089o87o98q56p13n42r23
54983A42370j625j795j177l27L95J198K062K370J826J120J165J901K327J606p7
54968A53339j725k415k011j130m81k63k27r9J29K51Rn99j033m81J233L127L780
54951A51404K676O60r64j561j420j109q61n71k11J07N19J531L203M434L751J063
54935A62651j827k833j455J108L194L814L003J669Q51O70K79q82k069k018n60
54920A65595J088J597P48n72j256r25k11m9o04j131r57j23J036K303L164K704
54904A72407P38j457k277j392K71J693K275J869J130J208K095K067M4k274k381
$$ plain form
55015 143237 140314 137538 135771 135114 135737 137733 140408 142673 144134 145136 145905 146394 146921 148092 149882
55000 149882 151480 152258 152367 152249 152060 151768 151321 150547 149303 147878 146789 146102 145404 144548 143835 143293 142370
54983 142370 140745 138950 137773 137446 137841 139039 141101 143471 145297 146417 147582 149483 151810 153416 153339
54968 153339 151614 149199 147188 146058 145577 145314 145087 144988 145117 145368 145377 144778 143745 143264 144497 147624 151404
54951 151404 154080 154740 153776 152215 150795 149686 148825 148254 148043 148150 148669 150200 153403 157837 161588 162651
54935 162651 160824 157991 156536 157644 160838 164652 167655 169324 170175 170845 171124 170242 168173 166155 165595
54920 165595 166683 168280 169028 168456 167200 166275 166064 166015 165411 164280 163323 163200 164236 166539 169703 172407
54904 172407 173145 171688 169411 168019 168290 169983 172258 174127 175257 176465 178560 180627 180671 178397 176016
54889A76016o21K85n83j121J22J424N93j623k772k188j291j013q42k69L80P57
54873A67254R53J016Q75P61R67J269J328J388J757J905J113k20r22o89k67q4K47
54856A78651Q76J352J564K087L238M602N743O588O812N884M239L358M030N214
54842B34238N282L774J414j011l050m416n120n510n770n673n144m491l686k240
54828A98597m07L61p74k388k220r8J760J505k53j466r34P54K040J811L79p66n11
54811A97390O12J166P68N84J758L991O017O913O554N256L500J832O22JL4O24J052
54794B38674J23k634o041p981p215m483j973j560l180m861m684k839j304j403
54780A88639k425k982k859k662k340j316j3J60j284k986l303k130n80M85R30Q63
$$ plain form
54889 176016 175395 175680 175097 173976 174098 175522 176115 174492 171720 169532 168241 167228 166386 166117 166497 167254
54873 167254 168207 169223 170098 170859 171826 173095 174423 175811 177568 179473 180586 180366 179444 178755 178488 178404 178651
54856 178651 179527 180879 182443 184530 187768 192370 198113 204701 211513 217397 221636 224994 229024 234238
54842 234238 239520 243294 244708 243697 240647 236231 231111 225601 219831 214158 209014 204523 200837 198597
54828 198597 198190 198551 197777 195389 193169 193071 194831 196336 196083 194617 193683 194437 196477 198288 198667 197901 197390
54811 197390 198002 199168 199936 200520 202278 206269 212286 219199 225753 231009 234509 236341 236963 236964 236998 237622 238674
54794 238674 238797 236163 230122 222141 214926 210443 208470 206910 203730 198869 194185 191346 190042 188639
54780 188639 186214 183232 180373 177711 175371 174055 174042 174202 172918 169932 166629 164499 163919 164404 165334 166197
54764A66197N25L93P70J281J273N68o38k228l793m158k371P30K970L238K515K087
54748A69359J784Q90j06%J106J687R37j09j46N45O69j28q20m76M98R59M12n65
54730A76496j091q32n6P99J379J478J188R08R10R70P20K57jpkJ89R86J981K033
54711A88305R83K17P58J673J612R90J128J855J921J527K247M061M706L051J136
54696B16170J404L418N093N920O840P719P119M664J804j44j221j927k322k483
54682B52054k763l184l397l457l721l833k893j035K17k70j884l235l807m068m469
54667B10255m874m763l709j922l08M67Q12J517K394K586K110K049K869L699L657
54652B16839L007K495K427K770L379L744L427K970L320M068L622J562o85k244
$$ plain form
54764 166197 166722 167115 167885 169166 170439 171007 170369 168141 164348 160190 157819 158549 161519 164757 167272 169359
54748 169359 171143 172033 171927 171927 173033 174720 175657 175548 175402 175947 176616 176488 175668 175192 175690 176649 177061 176496
54730 176496 175405 174573 174517 175316 176695 178173 179361 180269 181179 182149 182869 183126 183125 183118 183116 183305 184291 186272 188305
54711 188305 189288 189505 190263 191936 193548 194538 195666 197521 199442 200969 203216 207277 211983 215034 216170
54696 216170 217574 220992 226085 232005 238845 246564 253683 258347 260151 260007 258786 256859 254537 252054
54682 252054 249291 246107 242710 239253 235532 231699 228806 227771 227988 227718 225834 222599 218792 214724 210255
54667 210255 205381 200618 196909 194987 194679 195146 195958 197475 199869 202455 204565 206614 209483 213182 216839
54652 216839 219846 222341 224768 227538 230917 234661 238088 241058 244378 248446 252068 253630 252945 250701
54638B50701m096o807q668p908n493l803l389l098k641k754l094k336n67M83P2
54623A96602n30k69J53j82p56n72K77R51R87L88p11j802k047j194Q2J094J807
54606A94278K246K106J350N14o5o64j482k146k298j960j111L02J622J718N16n62
54590A94364l11Q63J696J469J55j855l467l252j062J364K236J655R40P60Q30Q95
54574A97280R28O87j8p24q01l69j32n10j320k011j830l86J489K145J013o11j310
54557A93520j212j072q10k21j79j427k746k068O34L144L724K700J296L36K43R83
54541A96845J627J173J9m68L7M69K19q0Q8L79N89J019J351O59p80j201K23K116
54523B04284L064L525M227M139K029r45k312j610p27q90j183m02J159K433K895
$$ plain form
54638 250701 246605 239798 231130 223222 217729 213926 210537 207439 204798 202044 198950 196614 196047 196530 196602
54623 196602 196072 195803 195956 195774 195018 194446 194723 195674 196661 197049 196338 194536 192489 191295 191377 192471 194278
54606 194278 196524 198630 199980 200494 200429 199765 198283 196137 193839 191879 190768 191070 192692 194410 194926 194364
54590 194364 194053 194916 196612 198081 198236 196381 192914 189662 188600 189964 192200 193855 194795 195555 196385 197280
54574 197280 198208 198895 198877 198153 197352 196983 196851 196341 195021 193010 191180 190794 192283 194428 195441 194830 193520
54557 193520 192308 191236 190426 190205 190026 188599 185853 183785 184419 187563 191287 193987 195283 195619 195862 196845
54541 196845 198472 199645 199664 199196 199233 199702 199921 199841 199929 200308 200897 201916 203267 203926 203146 201945 202168 204284
54523 204284 207348 210873 215100 219239 221268 220323 218011 216401 215674 214784 213601 213199 214358 216791 219686
54508B19686K542J447K6q96q56j81O34J434J987J782Q03J7L08J202J314J42j200
54491B30191j404o26j66n65p96J93J778K417J852J392J770K035J254K36L28J268
54475B41157J697J461J868L428M739M290K400O73K31J051K532L941M585M089K559
54460B80701L90j820l153k842j237K52N91K06J51O91J260J479J502J347O24r08
54444B79234k796m170m400l497k141j248j315k038k547k156r34L40Q64O58N70
54429B54424J135J665J176J13J32J704L018K228P7r73J11J940K883K887K675K425
54413B77620J981J579J474J352Q78M60P78J840L184M587N847O148M760K395R33
54398C15816J294K290K060L09j414j541j39J378J875J579J361J337P19p95k196
$$ plain form
54508 219686 222228 223675 223701 222805 221949 221768 222402 223836 225823 227605 228408 228425 228733 229935 231249 231391 230191
54491 230191 228787 228161 227995 227430 226634 226827 228605 231022 232874 234266 236036 238071 239325 239561 239889 241157
54475 241157 242854 244315 246183 249611 254350 258640 261040 261713 261944 262995 265527 269468 274053 278142 280701
54460 280701 281091 279271 276118 273276 272039 272291 272882 273088 273239 273930 275190 276669 278171 279518 280142 279234
54444 279234 276438 272268 267868 264371 262230 260982 259667 257629 255082 252926 251992 252332 253196 253854 254424
54429 254424 255559 257224 258400 258513 258645 260349 263367 265595 265672 264699 264810 266750 269633 272520 275195 277620
54413 277620 279601 281180 282654 284006 284884 285344 286122 287962 291146 295733 301580 307728 312488 314883 315816
54398 315816 317110 319400 321460 321769 320355 318814 318675 320053 321928 323507 324868 326205 326924 326129 323933
54383C23933k285j199k11j72q00j359j377q20j73l29j729l563m453l890k441q21
54367B98311L95M69p89k042j558L22J336M59p20n89J46P6m59l07J02n34j851k099
54349B90668q92K12J45l98n39m20l37J6P03J076Q32N67Q01J295J621J581R09l56
54331B97484j075j8K046K876J908J123J858K583J308j392l412m047m035l650k688
54316B90869j739j601j768j262n53q15j529q88J202K667K280J180P10M54m20j373
54300B87414j363n15L24R36J511J639P18r15k154k371j863j247r51j055j202r07
54284B77999l79n27j670k673k176m34Q25L59j413l217m281m588m311l429j889
54269B48196M1J692K331J655R2j403j965j496q02p11r75m95R39J829P19j530k377
$$ plain form
54383 323933 321648 320449 320238 320066 319266 317907 316530 315710 315537 315208 313479 309916 305463 301573 299132 298311
54367 298311 298706 299175 298386 296344 294786 295108 296444 296903 296183 295594 295740 295816 295357 295050 295152 294618 292767 290668
54349 290668 289776 289988 290133 289735 289196 288776 288439 288455 289158 290234 291066 291633 292434 293729 295350 296931 297840 297484
54331 297484 296409 296391 298437 301313 303221 304344 306202 308785 310093 308701 305289 301242 297207 293557 290869
54316 290869 289130 287529 285761 284499 283946 283131 281602 280714 281916 284583 286863 288043 288753 289207 288787 287414
54300 287414 286051 285536 285860 286796 288307 289946 290664 289749 287595 285224 283361 282114 281163 280108 278906 277999
54284 277999 277620 277093 275423 272750 270574 270140 270965 271324 269911 266694 262413 257825 253514 250085 248196
54269 248196 248237 249929 252260 253915 254007 252604 250639 249143 248341 247630 246655 246160 247099 248928 249647 248117 245740
54252B45740p15J724K454R38j284k423j837l00O29N2r87l42K449N011M745K012
54236B57866l87o40M19J022O44kj77L11J161J656J021p52k623l420k916j890j313
54219B49980j678k744l567l010p40K155L928L722K135L30j057j860j815p99M70
54204B45450P63k13j298j271l37L24Q3o86j449j993k169j852j249p42m39l24o33
54187B31965j361j700q63O19J447J254O37l09j942l437l103j017N58L82qR07K006
54170B26035J684Q77J382K294J137j887l830l380k343k171j845m93O02L33q8N91
54154B18898J092l52k613k922q91J080J273L44n41j155j298k94J720L315L462
54139B21118K718J982J114l05j590j539j77R93O71q15j949j663m59K32k87j184
$$ plain form
54252 245740 245025 246749 249203 250141 248857 246434 244597 244297 244926 244978 243991 243649 246098 251109 255854 257866
54236 257866 257479 256839 257258 258280 258924 258922 258745 259056 260217 261873 262894 262142 259519 256099 253183 251293 249980
54219 249980 248302 245558 241991 238981 238241 240396 244324 248046 250181 250511 249454 247594 245779 244980 245450
54204 245450 246213 246000 244702 243431 243094 243418 243501 242815 241366 239373 237204 235352 234103 233361 232922 232598 231965
54187 231965 230604 228904 228041 228660 230107 231361 231998 231689 229747 226310 223207 222190 222748 223130 223122 224029 226035
54170 226035 227719 228596 229978 232272 233409 231522 227692 224312 221969 219798 217953 217460 218062 218395 218307 218898
54154 218898 219990 219638 217025 214103 213212 214292 215565 215909 215368 214213 212915 212621 214341 217656 221118
54139 221118 223836 225818 226932 226627 225037 223498 223321 224314 224985 224170 222221 220558 220099 220331 220044 218860
54123B18860j228l71M22N72L35j17j118k599l630l426k213o74Q75K228K890K755
54107B13561K541K673K214R9k743l855k195M17J425L12j341j914j172K2O01J93
54091B10838m16Q4J849L187K291m82k819k982j352N85J912K516K493K013J470
54076B21187J158R60P77R41J722K625K717J657Q6j095j521j514j611j901j803
54061B24385q06N82J208R27J062K541M180L954J710n65j208m63N51J185J106K9
54045B40378j560k319j716r71j343k219k191j450j441k238k079q4K117K526J397
54030B26807N48P92J386J619J594J475J213J207K015L110L063J562J20r1k3j088
54014B45309k586k474n03J303J571J271J666K230J881J101J121J592Q45j436l372
$$ plain form
54123 218860 217632 217261 217683 218255 218590 218473 217355 214756 211126 207700 205487 204813 205688 207916 210806 213561
54107 213561 216102 218775 220989 221088 218345 214490 212295 212712 214137 214449 213108 211194 210022 210044 210645 210838
54091 210838 210422 210506 212355 215542 217833 217351 214532 211550 210198 210783 212695 215211 217704 219717 221187
54076 221187 222345 223305 224082 225023 226745 229370 232087 233744 233830 232735 231214 229700 228089 226188 224385
54061 224385 223579 224161 225369 226296 227358 229899 234079 238033 239743 239178 237970 237507 238058 239243 240349 240378
54045 240378 238818 236499 234783 233812 232469 230250 228059 226609 225168 222930 220851 220767 222884 225410 226807
54030 226807 227355 228147 229533 231152 232746 234221 235434 236641 238656 241766 244829 246391 246511 246420 246397 245309
54014 245309 242723 240249 239746 241049 242620 243891 245557 247787 249668 250769 251890 253482 254327 252891 249519
53999B49519l164j158Q93J792J605J114J066J604K048J599M15l77Q8J547L067
53984B61658L915L900L471L473M240M875M199K523J545K186L448L952L778L972
53970C11135M971O304P424Q036P937P209O310N504M525L172J742M46q91j957j669
53955C70198L27K566L341K801K299K166J458j57j772k655l080l460l732l993m651
53940C61656n477n477m312l022k769l340l566k822j633j036j635l059m233m470
53926C14805m179m103m087l378k081j301j651k456k817k608k065j221k07N73R99
53911B84223J364J600J218L73O2O23J015L49o04n11N91J479J528J236J203J511
53895B97260K020K500K487J745Q22N31R16J328J428J525J934K567L139L388L130
$$ plain form
53999 249519 246355 245197 246090 247882 249487 250601 251667 253271 255319 256918 257333 256956 257044 258591 261658
53984 261658 265573 269473 272944 276417 280657 285532 289731 292254 293799 295985 299433 303385 307163 311135
53970 311135 316106 322410 329834 337870 345807 353016 359326 364830 369355 372527 374269 374715 373824 371867 370198
53955 370198 370525 373091 376432 379233 381532 383698 385156 384999 383227 380572 377492 374032 370300 366307 361656
53940 361656 356179 350702 346390 343368 340599 337259 333693 330871 329238 328202 326567 323508 319275 314805
53926 314805 310626 306523 302436 299058 296977 295676 294025 291569 288752 286144 284079 282858 282651 283224 284223
53911 284223 285587 287187 288405 288778 288840 289463 290478 290827 290223 289712 290303 291782 293310 294546 295749 297260
53895 297260 299280 301780 304267 306012 306834 307365 308281 309609 311037 312562 314496 317063 320202 323590 326720
53880C26720K522K073K024K009J842K167L605N552O662O506N891N541N278M724
53866C83116M081L861M318N260O072N930M597L093K890M210N732O284O225O570
53852D52239P280P215N790M111L855N258O708O589N081L613K742J665pj166p45
53837E10228M09M86q28j974j626j75J039R98o74l647o589p711o444m242l215l986
53821D72049n272n433m115k263q08L20J610K791K966K008R95Q62J384K188L757
53806D73039O337Q623R026P890O837N953L391j815p980j2555j4604j4811j4148
53793D55183j3260j2433j1406r732p702o233n672n516n509n924o514o444n681
53780C53157n070m509k763l5J168o37l262l541j566p8l40j078j215j185j152k49
$$ plain form
53880 326720 329242 331315 333339 335348 337190 339357 342962 348514 355176 361682 367573 373114 378392 383116
53866 383116 387197 391058 395376 400636 406708 412638 417235 420328 423218 427428 433160 439444 445669 452239
53852 452239 459519 466734 472524 476635 480490 485748 492456 499045 504126 507739 510481 512146 512139 510973 510228
53837 510228 510637 511123 510295 508321 506695 506520 507559 508557 507883 504236 497647 489936 483492 479250 476035 472049
53821 472049 466777 461344 457229 454966 454158 454478 456088 458879 461845 463853 464848 465710 467094 469282 473039
53806 473039 479376 487999 497025 504915 511752 517705 521096 519281 511301 498746 484142 469331 455183
53793 455183 441923 429490 418084 408352 400650 394417 388745 383229 377720 371796 365282 358838 353157
53780 353157 348087 343578 340815 340780 341948 341311 338049 334508 332942 332864 332524 331446 330231 329046 327894 327645
53764C27645J466K149N44j965k976k065j002j233k122j864K95L069M506M183L420
53749C34050L226K949J761N10P34K356L769M068L713L122K196J456J929L469M636
53734C73944M776M736M946M420K620P99K32M52N15Q29K098L452L508K671K511
53719D12509L123K936J193j028k594l542m093l840k777j998k443l698m730n144
53705C83874n007m154k614j357j526k922m080m024l281k840k779k468j809j412
53691C43601j542j566r68l92r74k723m263m407l442k523k307k494k346j289O76
53676C13041K646L284K122K60o94k05J128K690M225N118M381J935o09j288J52
53661C38186J975K376J317K56L19J209J936K058J851J644J644K149L219M123L974
$$ plain form
53764 327645 329111 331260 331804 329839 326863 324798 323796 322563 320441 318577 318872 321941 326447 330630 334050
53749 334050 337276 340225 341986 342496 343230 345586 349355 353423 357136 360258 362454 363910 365839 369308 373944
53734 373944 378720 383456 388402 392822 395442 396241 396473 396925 397440 398269 400367 403819 407327 409998 412509
53719 412509 415632 418568 419761 418733 416139 412597 408504 404664 401887 399889 397446 393748 389018 383874
53705 383874 378867 374713 372099 370742 369216 366294 362214 358190 354909 352069 349290 346822 345013 343601
53691 343601 342059 340493 339525 339133 338159 335436 331173 326766 323324 320801 318494 316000 313654 312365 313041
53676 313041 315687 318971 321093 321353 320659 320454 321582 324272 328497 333615 337996 339931 339322 338034 338186
53661 338186 340161 342537 343854 344110 344429 345638 347574 349632 351483 353127 354771 356920 360139 364262 368236
53646C68236L084K727L213L272K002M27K7N61P06L33N48J654K658K962L024K990
53630C98424K213Q76N53K060L852L925K522J563J916K757L411M267N635O979P725
53615D48678P931P678O770N468M594M160K756o74m938p582p673o554n806n539
53601D49269n146m771n081n937o234n154l040r04M77R49Q86Q67J056Q46m52k420
53585D15211l608l092j584n60o43j316j867k021j764j203o33k67J28Q85J760K131
53569D01557J912J709J885K056J816J469J633K406L363M155M716N005M913M403
53555D42998L625K867K501K777L491L997L771K912K010J518J396J315J193J331
53541D77702J889K338J891N95n44q10o23o22n29J12O23r9j741k753k510j828j091
$$ plain form
53646 368236 371320 374047 377260 380532 382534 382961 382988 383549 384255 384588 385136 386790 389448 392410 395434 398424
53630 398424 400637 401513 402066 404126 407978 411903 414425 415988 417904 420661 424072 428339 433974 440953 448678
53615 448678 456609 464287 471057 476525 481119 485279 488035 487361 482423 474841 467168 460614 454808 449269
53601 449269 444123 439352 434271 428334 422100 416946 413906 413002 413479 414428 415314 416181 417237 418083 417631 415211
53585 415211 411603 408511 406927 406367 405724 404408 402541 400520 398756 397553 396920 396653 396781 397666 399426 401557
53569 401557 403469 405178 407063 409119 410935 412404 414037 416443 419806 423961 428677 433682 438595 442998
53555 442998 446623 449490 451991 454768 458259 462256 466027 468939 470949 472467 473863 475178 476371 477702
53541 477702 479591 481929 483820 484415 483871 483061 482438 481816 481287 481399 482022 481923 480182 477429 474919 473091 472000
53524D72000M39K662L616J894j122k952l087k753k397j377P5O43n3q76j060j124
53508D64528j382j024M40J997K433J992J840K456L396M133M392M141L745L717
53494D96804L876L439K415K061L246N085O103O075N873O133P035Q758J0955J2236
53480E80094J1564R975R519J0593J1693J1940J2215J3298J4468J5026J6006J8733
53468G35124K2287K3952K2500J9879J9124K1162K4262K6312K6929K7247K8211
53457I96989K9736L1432L3298L5291L6852L7563L7883L8372L8533L7515L5934
53446A389398L5665L7307L9008L8648L6329L3819L2257L1448L1002L0864L0868
53435A766613L0777L0836L1429L2195L2360L1985L1852L1984L1342K9430K7057
$$ plain form
53524 472000 472439 475101 478717 480611 479489 476537 473450 470697 468300 466923 466998 467641 467588 466712 465652 464528
53508 464528 463146 462122 462562 464559 466992 468984 470824 473280 476676 480809 485201 489342 493087 496804
53494 496804 500680 504119 506534 508595 511841 516926 523029 529104 534977 541110 548145 556903 567858 580094
53480 580094 591658 601633 611152 621745 633438 645378 657593 670891 685359 700385 716391 735124
53468 735124 757411 781363 803863 823742 842866 864028 888290 914602 941531 968778 996989
53457 996989 1026725 1058157 1091455 1126746 1163598 1201161 1239044 1277416 1315949 1353464 1389398
53446 1389398 1425063 1462370 1501378 1540026 1576355 1610174 1642431 1673879 1704881 1735745 1766613
53435 1766613 1797390 1828226 1859655 1891850 1924210 1956195 1988047 2020031 2051373 2080803 2107860
53424B107860K4856K2090J7966J3302R614P025M368J181j757m046o421r393j2297
53411B174348j4420j6173j8232k0318k1908k3496k5921k8690l0271l0146k9448
53400A915325k9254k9401k9375k9311k9418k9286k8642k8174k8598k9364k9241
53389A595261k7942k6288k4925k3804k2828k2015k0910j8760j5627j2498j0006
53378A369658p776n375l056j044J225M460Q554J2777J6448J8951J9829J9674K0318
53365A474643K3158K7476L1370L4103L6392L8710M0610M2060M4050M7186N0706
53354A890464N3651N6157N8650O0639O1517O2092O3861O6919O9884P2086P4382
53343B590302P7346P9995Q1289Q1880Q3155Q5040Q6104Q5587Q4145Q2626Q1260
$$ plain form
53424 2107860 2132716 2154806 2172772 2186074 2195688 2202713 2207081 2208262 2206505 2202459 2196038 2186645 2174348
53411 2174348 2159928 2143755 2125523 2105205 2083297 2059801 2033880 2005190 1974919 1944773 1915325
53400 1915325 1886071 1856670 1827295 1797984 1768566 1739280 1710638 1682464 1653866 1624502 1595261
53389 1595261 1567319 1541031 1516106 1492302 1469474 1447459 1426549 1407789 1392162 1379664 1369658
53378 1369658 1361882 1356507 1353451 1352407 1353632 1358092 1366646 1379423 1395871 1414822 1434651 1454325 1474643
53365 1474643 1497801 1525277 1556647 1590750 1627142 1665852 1706462 1748522 1792572 1839758 1890464
53354 1890464 1944115 2000272 2058922 2119561 2181078 2243170 2307031 2373950 2443834 2515920 2590302
53343 2590302 2667648 2747643 2828932 2910812 2993967 3079007 3165111 3250698 3334843 3417469 3498729
53332C498729Q0136P9252P7681P4053O8525O3249N9832N7168N2841M6022L7812
53321D195300K9428K1498J4776R803N515j55p700j5362k1768k7907l5406m3916
53309D124106n1627n7946o4182p1608p9803q6972r1380r2666r2391r2933r5088
53298C247510r7112r6959r4889r2724r0977q8424q4551q0680p8004p6021p3801
53287B293368p1524o9653o7634o4687o1108n7669n4342n0913m8149m6845m6001
53276A654843m3625l9339l4735l0906k7290k3440k0242j8343j6682j3970j0778
53265A375493q720p988p013m509p05L326O592Q440R015R598J1523J4440J6620
53252A426112J7370J8111K0409K3790K6450K7693K8578L0282L2634L4583L5551
$$ plain form
53332 3498729 3578865 3658117 3735798 3809851 3878376 3941625 4001457 4058625 4111466 4157488 4195300
53321 4195300 4224728 4246226 4261002 4270805 4276320 4276165 4268465 4253103 4231335 4203428 4168022 4124106
53309 4124106 4072479 4014533 3950351 3878743 3798940 3711968 3620588 3527922 3435531 3342598 3247510
53298 3247510 3150398 3053439 2958550 2865826 2774849 2686425 2601874 2521194 2443190 2367169 2293368
53287 2293368 2221844 2152191 2084557 2019870 1958762 1901093 1846751 1795838 1747689 1700844 1654843
53276 1654843 1611218 1571879 1537144 1506238 1478948 1455508 1435266 1416923 1400241 1386271 1375493
53265 1375493 1366773 1358785 1351772 1347263 1346558 1349884 1356476 1364916 1373931 1383529 1395052 1409492 1426112
53252 1426112 1443482 1461593 1482002 1505792 1532242 1559935 1588513 1618795 1651429 1686012 1721563
53241A721563L6029L7020L9066M1812M4414M6225M6949M6394M4628M2317M0264
53230B186681L8397L5852L2339K8661K5433K2073J7782J2886Q227L807r35n838
53218B405365j0158j3737j6979j9809k1879k3742k6422k9678l2152l3649l5742
53207B141418l9369m3186m5411m6134m6660m7531m8513m9712n1239n2346n2319
53196A618998n1855n2152n2860n2579n1247n0311n0121m8884m5161m0160l6403
53185A087265l4938l4861l5036l5052l4763l3906l2470l0690k8604k6039k3275
53174G37631k1117j9980j9253j8036j6352j5102j4716j4444j3327j1453r708q595
53162E55548p926p607p787q199q250p981q131q788q960q042o794o105n704n088
$$ plain form
53241 1721563 1757592 1794612 1833678 1875490 1919904 1966129 2013078 2059472 2104100 2146417 2186681
53230 2186681 2225078 2260930 2293269 2321930 2347363 2369436 2387218 2400104 2408331 2412138 2411203 2405365
53218 2405365 2395207 2381470 2364491 2344682 2322803 2299061 2272639 2242961 2210809 2177160 2141418
53207 2141418 2102049 2058863 2013452 1967318 1920658 1873127 1824614 1774902 1723663 1671317 1618998
53196 1618998 1567143 1514991 1462131 1409552 1358305 1307994 1257873 1208989 1163828 1123668 1087265
53185 1087265 1052327 1017466 982430 947378 912615 878709 846239 815549 786945 760906 737631
53174 737631 716514 696534 677281 659245 642893 627791 613075 598631 585304 573851 564143 555548
53162 555548 547622 540015 532228 524029 515779 507798 499667 490879 481919 473877 467083 460978 455274 450186
53148D50186m888o015p933r036q520o854m806l117k647l478m190l439j966j522
53134C81775k126k262j656j676k593k823j840j624l669o221o404m012j408l15
53120C43146l15k58L05J022J227N80l05l39N01R99N67J86O00Q79J2j084p54Q85
53102C47854K278K683K577K215J447P48P89J049L73j080j896j460n11M26J556
53087C59048K586K594J730J400K127K554J447n24j875k156j751q85J73O00n3r28
53071C66087p96L50J466J947K003J742P89r26k626l322k789j754j188j460k165
53056C57358k651k640k216j549q43l13Q9P22J609K044J389jj263k170l007l533
53040C43025l136k058j400j576j759j312q79j413k663l429l000j841r54q93j316
$$ plain form
53148 450186 445298 439283 431350 422314 413794 406940 402134 399017 396370 392892 388702 385263 383297 381775
53134 381775 379649 377387 375731 374055 371462 368639 366799 365175 361506 355285 348881 344869 343461 343146
53120 343146 342831 342573 342878 343900 345127 345707 345402 345063 345564 346563 347130 347316 347916 348795 348807 347723 346969 347854
53102 347854 350132 352815 355392 357607 359054 359802 360591 361640 362013 360933 359037 357577 357066 357492 359048
53087 359048 361634 364228 365958 367358 369485 372039 373486 372962 371087 368931 367180 366295 366468 367068 367015 366087
53071 366087 365291 365641 367107 369054 371057 372799 373588 372662 370036 366714 363925 362171 360983 359523 357358
53056 357358 354707 352067 349851 348302 347459 347146 347235 347957 349566 351610 352999 352998 351735 349565 346558 343025
53040 343025 339889 337831 336431 334855 333096 331784 330905 329492 326829 323400 320400 318559 317605 316712 315396
53025C15396j330m73P58J461J297N32n25j477j643p99O0k56j398j848j151m97
53009C08107p96j414j347n98K93J033J254M46j036j819j214k80l03j077j557j402
52993B98290q86j7J072J547Q51j54k50K99K36o01r92k44P85Q64k09j653k507k225
52975B94206j016K73R13Q47L06o42j609j629k63J373J764R31K64N11J027J076
52959B98332O89l0j289k791l381k307l31J055J217P56M60L97J03n08p00L40K153
52942B94165K960J557j056k546j814j4R56L56j131k303k308j013R35K573L359
52927B94676L474L328L002K338J461R40J156J520Q44j069k630k195n39k80k441
52912C03585m829m759k373K6J170J735K323K204N85j920l733l762k267n60K03
$$ plain form
53025 315396 314066 313593 314351 315812 317109 317641 317116 315639 313996 313197 313257 313001 311603 309755 308604 308107
53009 308107 307311 305897 304550 303952 304245 305278 306532 306978 305942 304123 302909 302629 302326 301249 299692 298290
52993 298290 297404 297387 298459 300006 300857 300703 300453 300752 300988 300387 299395 299151 299936 300800 300591 298938 296431 294206
52975 294206 293190 293463 294376 295223 295529 294887 293278 291649 291386 292759 294523 295454 295718 296229 297256 298332
52959 298332 299021 298991 297702 294911 291530 289223 288892 289947 291164 291920 292380 292777 292880 292372 291672 292012 294165
52942 294165 297125 298682 297626 295080 293266 293252 294208 294564 293433 291130 288822 287809 288744 291317 294676
52927 294676 298150 301478 304480 306818 308279 309219 310375 311895 312739 311670 309040 306845 306306 306026 303585
52912 303585 298756 293997 291624 291650 292820 294555 296878 299082 299667 297747 294014 290252 287985 287425 287628
52897B87628K76R84K693L957L593K690L088M356M231J978o46k134k999m021m540
52882C01134l867k942k983l407k693q74M26K44o93j387j819k309k476j516N61
52867B75399K517K928J675Q5n99n09n11o69l16M97P02k40j396j525n01Q83J896
52850B80316K227J980J698J797J753O19j319k489k133j340j234j336q21k47n36
52835B78935j085o54L60L95o53j100j27Q92L49j609l720n052n073l349l30K322
52819B60501L196K641J971J622J010j4o41k44Q06J798K507K901K557J113q24j975
52803B78925j825j221j112j126j15J988L708L739K432J163O70O72P69R17R89N80
52787B91153m14j414j667j023p2M42L15K9J87P35R38K88p53j256q83j68K22J49
$$ plain form
52897 287628 287904 288888 291581 295538 299131 301821 304909 309265 313496 315474 314828 312694 309695 305674 301134
52882 301134 297267 294325 291342 287935 285242 284368 284794 285038 284345 282958 281139 278830 276354 274838 275399
52867 275399 277916 280844 282519 282604 282005 281496 280985 280316 280000 280497 281199 280959 279563 278038 277537 278420 280316
52850 280316 282543 284523 286221 288018 289771 290390 289071 286582 284449 283109 281875 280539 279718 279471 278935
52835 278935 277850 277196 277556 277951 277298 276198 276071 276963 277312 275703 271983 266931 261858 258509 258179 260501
52819 260501 263697 266338 268309 269931 270941 270927 270286 270042 270848 272646 275153 278054 280611 281724 280900 278925
52803 278925 277100 275879 274767 273641 273526 275514 279222 282961 285393 286556 287226 287898 288667 289584 290573 291153
52787 291153 290739 289325 287658 286635 286563 287005 287320 287349 287536 288271 289209 289497 288744 287488 286605 286437 286659 286808
52769B86808m9k7K19L31m0p15r53j78J313K592K898K044L00j718l147l403k756
52752B83519k071j818j683j169k81O18J391K264L377M454N057N024M604M086L473
52737C10845K632J610M55j097l278n540o690o100m474l063k421k292k313k208
52723B76066j585k59J156J611Q06m12j042r60p19p46j074j691k638l569l535j709
52707B59700J433L962M134K249M35K81J194J447M18q96j321p35K00R14J321J687
52691B76423K246K708K277N77j523k546k002p92L5L74N61M99j37j035j350p39
52675B75576J34L45k11o88k42J002J982J786N57p09j180p52K82J703L277M378
52659B87240M177K393k09k263k860k199j246q66j295k241l081l113j972p5J568
$$ plain form
52769 286808 286759 286732 286951 287282 287242 286527 285574 285396 286709 289301 292199 294243 294543 292825 289678 286275 283519
52752 283519 281448 279630 277947 276778 276497 277115 278506 280770 284147 288601 293658 298682 303286 307372 310845
52737 310845 313477 315087 315542 314445 311167 305627 298937 292837 288363 285300 282879 280587 278274 276066
52723 276066 274481 274222 275378 276989 277795 277383 276341 275381 274662 273916 272842 271151 268513 264944 261409 259700
52707 259700 261133 265095 269229 271478 271913 272194 273388 274835 275253 274357 273036 272301 272501 273415 274736 276423
52691 276423 278669 281377 283654 284231 282708 280162 278160 277368 277403 277777 278338 278837 278700 277665 276315 275576
52675 275576 275710 276055 275844 275156 274914 275916 277898 279684 280241 279532 278352 277600 277882 279585 282862 287240
52659 287240 291417 293810 293601 291338 288478 286279 285033 284167 282872 280631 277550 274437 272465 272390 273958
52644B73958K149J567K31j249k182k213j807j803k134j645L31K749L912L264J529
52629B76657m02j778j738p3J815K043N89o23k89P64J134P21K77N8j20j15K55O67
52611B79842P92Q76J109J034M05n2J72J93q64j875r82J264K100M72j271p07J343
52594B83851K421K082J938K635K950K111J241J761L431M836M986L845J893j13
52580C19868j427j994k597l782m990n205m302l184k673k650k341j217M46J823
52566B85775K279J873J099L77Q3N99J668J989N45j723k770k191j661k005j638
52551B84299P71L548M001K276R47J118J208r6j908k870k884k255p98J074J872
52536B90303R51l38n04J50O63J187K043K227P67j054q89J387L386L318J859O54
$$ plain form
52644 273958 276107 277674 277905 276656 274474 272261 270454 268651 266517 264872 265203 267952 271864 275128 276657
52629 276657 276255 274477 272739 272666 274481 276524 277113 276490 276201 276965 278099 278820 279097 279155 279035 278920 279175 279842
52611 279842 280634 281510 282619 283653 284058 284006 284178 284371 283507 281632 280650 281914 284014 284486 283215 282508 283851
52594 283851 286272 288354 290292 292927 295877 297988 299229 300990 304421 309257 314243 318088 319981 319868
52580 319868 318441 316447 313850 310068 305078 299873 295571 292387 289714 287064 284723 283506 283952 285775
52566 285775 288054 289927 291026 291403 291486 292085 293753 295742 296287 294564 291794 289603 287942 285937 284299
52551 284299 285070 288618 292619 294895 295842 296960 298168 298072 296164 293294 290410 288155 287357 288431 290303
52536 290303 291254 290916 290412 290562 291225 292412 294455 296682 297449 296395 295506 296893 300279 303597 305456 306110
52520C06110L64O30Q56N92q9l66L97J534J739Q37r8l77l07j41L09P39L69o66j143
52501C11289n96k57j245k787l123j652N91K170K295J032q57k486l484l870l337
52486B93683j461J125K732K419J127L73M73P26P49P33P52N99K08l23r07j307j087
52469C00614k01P03J029R62R49Q68L34m22n62M65K323L903L900J810j201k995
52453C12479k596j141k08K83J503L558N033M867L641K606K141J729J076O57J061
52438C36689K065K660K134Q84j36o54j135j638j475m98J64m16j337q54J100K554
52422C40107J949lj432j654j565j911k148j395lO82J93k32O81K370L138K495J690
52405C42962J789K355K460K051J479O05p21j809j684l06J374K321J920K12j757
$$ plain form
52520 306110 306474 307104 307960 308552 308463 308097 308494 310028 311767 312604 312506 312129 311822 311681 311990 312729 313098 312432 311289
52501 311289 310693 310436 309191 306404 303281 301629 302220 304390 306685 307717 306860 304374 300890 297020 293683
52486 293683 292222 293347 296079 298498 299625 299998 300471 301197 301946 302679 303431 304030 304238 303915 303008 301701 300614
52469 300614 300413 301116 302145 303107 304056 304924 305258 304836 304274 304739 307062 310965 314865 316675 315474 312479
52453 312479 309883 308742 308534 308817 310320 313878 318911 323778 327419 330025 332166 333895 334971 335628 336689
52438 336689 338754 341414 343548 344432 344296 343642 342507 340869 339394 338896 339060 338644 337307 336453 337553 340107
52422 340107 342056 342053 340621 338967 337402 335491 333343 331948 331945 332627 332820 332588 333269 335639 338777 341272 342962
52405 342962 344751 347106 349566 351617 353096 353701 352980 351171 349487 349181 350555 352876 354796 355008 353251
52390C53251k414j306J71M31m27j280j767k303k778k580j732p96J59J234J552
52375C39415L2k555l833k632l51R99R62L00l08m80LP90J126R20Q19P94j65k222
52357C33614l701l014o86J590L160M419N327N369M754M228L785K810J607J571
52343C64833L442O208Q162Q392P065M946K903J306k90k334m175m627l711k931
52329C89189l336m226m403l947l790m048l835k636q98Q07K321L335L144J653Q8
52314C69418q9J139K403K717K556K824L342L085J796O36Q98K467M043M683M558
52299D06476M139L273J552p22k517l085k595j686q30l23l89q88j202q93k98l3
52283C99979k0L55J168J730J583J222J441K438L821N090N860O036O112O738P675
$$ plain form
52390 353251 350837 349531 349702 350133 349706 348426 346659 344356 341578 338998 337266 336470 336629 337863 339415
52375 339415 339447 336892 333059 330427 330076 331075 332037 332337 332029 331549 331552 332342 333468 334388 335207 336001 335836 333614
52357 333614 329913 326899 326213 327803 330963 335382 340709 346078 350832 355060 358845 361655 363262 364833
52343 364833 368275 374483 382645 391037 398102 403048 405951 407257 406967 404633 400458 395831 392120 389189
52329 389189 385853 381627 377224 373277 369487 365439 361604 358968 358070 358877 361198 364533 367677 369330 369418
52314 369418 369329 370468 372871 375588 378144 380968 384310 387395 389191 389827 390725 393192 397235 401918 406476
52299 406476 410615 413888 415440 414718 412201 409116 406521 404835 404005 403682 403293 402405 401203 400310 400012 399979
52283 399979 399959 400314 401482 403212 404795 406017 407458 409896 413717 418807 424667 430703 436815 443553 451228
52268D51228P806O733N695O079P588Q766R044R106R375R394Q824Q054P404O642
52254E61738N721N142N098M952M146L038K308K164K513L316M175M214L068J562
52240F13155P40O87R48J476K266K621J821M04l25m3L91N11Q76J840K585K139P28
52223F32820m33l88Q27K293K828K040J002J277K897M046L337J727J328K753M673
52208F63027N815O277O642O850O484N646M965M988N786O821P099N971M133L177
52194G43681L727M695N046N461P121R349J0047Q658P122P154P885P357N384L535
$$ plain form
52268 451228 459034 465767 471462 477541 485129 493895 502939 512045 521420 530814 539638 547692 555096 561738
52254 561738 567459 572601 577699 582651 586797 589835 592143 594307 596820 600136 604311 608525 611593 613155
52240 613155 613895 614582 615530 617006 619272 621893 623714 624118 623793 623750 624141 624652 625528 627368 629953 632092 632820
52223 632820 632387 631999 632826 635119 637947 639987 640989 642266 645163 649209 652546 654273 655601 658354 663027
52208 663027 668842 675119 681761 688611 695095 700741 705706 710694 716480 723301 730400 736371 740504 743681
52194 743681 747408 752103 757149 762610 769731 779080 789127 797785 804907 812061 819946 827303 832687 836222
$$ [...]
##END NTUPLES=NMR SPECTRUM
##END=
