
##TITLE=AC1166_Meta-centauros2_5898750_DkOoTLsF9Z
##JCAMPDX= 6.0         $$ Bruker NMR JCAMP-DX V2.0
##DATA TYPE= NMR SPECTRUM
##DATA CLASS= NTUPLES
##ORIGIN= BRUKER
##OWNER= Administrator
$$ 1.72 TOPSPIN		Version 2.1
$$ 2012-04-03 22:08:45.625 -0500  Administrator@TOPSPIN
$$ Compression mode = diff/dup
##.OBSERVE FREQUENCY= 400.13188235
##.OBSERVE NUCLEUS= ^1H
##.ACQUISITION MODE= SIMULTANEOUS (DQD)
##.ACQUISITION SCHEME= undefined
##.AVERAGES= 64
##.DIGITISER RES= 22
##SPECTROMETER/DATA SYSTEM= spect
##.PULSE SEQUENCE= noesygpps1d.comp
##.SOLVENT NAME= COFFEE_meoh
##.SHIFT REFERENCE= INTERNAL, COFFEE_meoh, 1, 14.96832
##AUDIT TRAIL= $$ (NUMBER, WHEN, WHO, WHERE, PROCESS, VERSION, WHAT)
$$ ##TITLE= Audit trail, TOPSPIN		Version 2.1
$$ ##JCAMPDX= 5.01
$$ ##ORIGIN= Bruker BioSpin GmbH
$$ ##OWNER= Administrator
$$ $$ C:\Bruker\TOPSPIN/data/COFFEE/nmr/AC1166_Meta-centauros2_5898750_DkOoTLsF9Z/12/pdata/1/auditp.txt
$$ ##AUDIT TRAIL=  $$ (NUMBER, WHEN, WHO, WHERE, PROCESS, VERSION, WHAT)
(   1,<2012-04-03 22:08:40.281 -0500>,<Administrator>,<TOPSPIN>,<go>,<TOPSPIN 2.1>,
      <created by zg
	started at 2012-04-03 21:57:08.687 -0500,
	POWCHK enabled, PULCHK disabled,
       configuration hash MD5:
       1A 1E CE 29 27 FD 77 03 67 4E F0 E3 C4 B2 CB 90
       data hash MD5: 64K
       36 A3 8A FF A6 FB B6 85 EB C1 D0 01 F1 A7 27 B5>)
(   2,<2012-04-03 22:08:43.406 -0500>,<Administrator>,<TOPSPIN>,<proc1d>,<TOPSPIN 2.1>,
      <Start of raw data processing
       efp LB = 0.3 FT_mod = 6 PKNL = 1 PHC0 = 0 PHC1 = 0 SI = 128K 
       data hash MD5: 128K
       AE 52 90 95 E1 94 4E 62 44 F7 95 F0 80 DC 4E 82>)
(   3,<2012-04-03 22:08:44.546 -0500>,<Administrator>,<TOPSPIN>,<proc1d>,<TOPSPIN 2.1>,
      <pk PHC0 = 35.26062 PHC1 = 0 
       data hash MD5: 128K
       4E 7F C5 FC 6C E0 B9 E1 13 E5 12 F3 54 16 70 38>)
(   4,<2012-04-03 22:08:44.781 -0500>,<Administrator>,<TOPSPIN>,<proc1d>,<TOPSPIN 2.1>,
      <abs ABSG = 1 
       data hash MD5: 128K
       D9 CA 34 0C 57 5C 4B 85 45 52 5B D8 5E B8 13 C4>)
(   5,<2012-04-03 22:08:44.859 -0500>,<Administrator>,<TOPSPIN>,<proc1d>,<TOPSPIN 2.1>,
      <abs ABSG = 2 
       data hash MD5: 128K
       25 9B 34 40 53 FF 70 25 94 AA 83 A5 95 00 50 99>)
(   6,<2012-04-03 22:08:44.921 -0500>,<Administrator>,<TOPSPIN>,<proc1d>,<TOPSPIN 2.1>,
      <abs ABSG = 3 
       data hash MD5: 128K
       53 66 5C 87 5F CF 47 83 E5 10 E7 AF B3 0E B2 83>)
(   7,<2012-04-03 22:08:45.281 -0500>,<Administrator>,<TOPSPIN>,<proc1d>,<TOPSPIN 2.1>,
      <abs ABSG = 4 
       data hash MD5: 128K
       F8 8D 83 E3 0C D5 7F 7D 9E 28 8C 92 58 2B 9C B7>)
(   8,<2012-04-03 22:08:45.546 -0500>,<Administrator>,<TOPSPIN>,<proc1d>,<TOPSPIN 2.1>,
      <abs ABSG = 5 
       data hash MD5: 128K
       22 5B 6D 0F 2D 66 B2 5F 35 DF 0A B4 D3 14 08 D5>)
$$ ##END=
$$ 
$$ $$ hash MD5
$$ $$ F4 1C 1A 20 9A 39 B3 B5 C2 D1 33 BF 42 7D 4D DE
##$RELAX= 
##$RELAX= 
##$RELAX= 
##$RELAX= 
##$RELAX= 
##$RELAX= 
##$RELAX= 
##$RELAX= 
$$ [...]
##$TP07= 0
##$TPNAME0= <>
##$TPNAME1= <>
##$TPNAME2= <>
##$TPNAME3= <>
##$TPNAME4= <>
##$TPNAME5= <>
##$TPNAME6= <>
##$TPNAME7= <>
##$TPOAL= (0..7)
0.5 0.5 0.5 0.5 0.5 0.5 0.5 0.5
##$TPOFFS= (0..7)
0 0 0 0 0 0 0 0
##$TUNHIN= 0
##$TUNHOUT= 0
##$TUNXOUT= 0
##$USERA1= <user>
##$USERA2= <user>
##$USERA3= <user>
##$USERA4= <user>
##$USERA5= <user>
##$V9= 5
##$VALIST= <valist>
##$VCLIST= <CCCCCCCCCCCCCCC>
##$VD= 0
##$VDLIST= <DDDDDDDDDDDDDDD>
##$VPLIST= <PPPPPPPPPPPPPPP>
##$VTLIST= <TTTTTTTTTTTTTTT>
##$WBST= 2048
##$WBSW= 25
##$XGAIN= (0..3)
0 0 0 0
##$XL= 0
##$YL= 0
##$YMAX_a= 13400973
##$YMIN_a= -5854264
##$ZGOPTNS= <>
##$ZL1= 120
##$ZL2= 120
##$ZL3= 120
##$ZL4= 120
##$ABSF1= 14.96832
##$ABSF2= -5.58421
##$ABSG= 5
##$ABSL= 3
##$ALPHA= 0
##$AQORDER= 0
##$ASSFAC= 0
##$ASSFACI= 0
##$ASSFACX= 0
##$ASSWID= 0
##$AUNMP= <proc_prof1d_extract.lims>
##$AXLEFT= 0
##$AXNAME= <>
##$AXNUC= <1H>
##$AXRIGHT= 0
##$AXTYPE= 0
##$AXUNIT= <>
##$AZFE= 0.1
##$AZFW= 0.1
##$BCFW= 0
##$BC_mod= 0
##$BYTORDP= 0
##$COROFFS= 0
##$CY= 15
##$DATMOD= 1
##$DC= 0
##$DFILT= <>
##$DTYPP= 0
##$F1P= 0
##$F2P= 0
##$FCOR= 0.5
##$FTSIZE= 131072
##$FT_mod= 6
##$GAMMA= 0
##$GB= 0
##$INTBC= 1
##$INTSCL= 1
##$ISEN= 128
##$LB= 0.3
##$LEV0= 0
##$LPBIN= 0
##$MAXI= 10000
##$MC2= 0
##$MEAN= 0
##$ME_mod= 0
##$MI= 0
##$NCOEF= 0
##$NC_proc= -3
##$NLEV= 6
##$NOISF1= 0
##$NOISF2= 0
##$NSP= 0
##$NTH_PI= 0
##$NZP= 0
##$OFFSET= 14.96832
##$PC= 1
##$PHC0= 35.26062
##$PHC1= 0
##$PH_mod= 1
##$PKNL= yes
##$PPARMOD= 0
##$PPDIAG= 0
##$PPIPTYP= 0
##$PPMPNUM= 2147483647
##$PPRESOL= 1
##$PSCAL= 4
##$PSIGN= 0
##$PYNMP= <proc.py>
##$REVERSE= no
##$SF= 400.130004917994
##$SI= 131072
##$SIGF1= 0
##$SIGF2= 0
##$SINO= 400
##$SIOLD= 131072
##$SPECTYP= <>
##$SREGLST= <1H.CDCl3>
##$SSB= 0
##$STSI= 131072
##$STSR= 0
##$SW_p= 8223.68421052632
##$SYMM= 0
##$S_DEV= 0
##$TDeff= 65536
##$TDoff= 0
##$TI= <>
##$TILT= no
##$TM1= 0
##$TM2= 0
##$TOPLEV= 0
##$USERP1= <user>
##$USERP2= <user>
##$USERP3= <user>
##$USERP4= <user>
##$USERP5= <user>
##$WDW= 1
##$XDIM= 131072
##$YMAX_p= 477820535
##$YMIN_p= -369074743
##$CURPLOT= <Network HP LaserJet P1505>
##$CURPRIN= <$Network HP LaserJet P1505>
##$DFORMAT= <normdp>
##$LAYOUT= <+/1D_H.xwp>
##$LFORMAT= <normlp>
##$PFORMAT= <normpl>
##$SURQMSG= 1
$$ End of Bruker specific parameters
$$ ---------------------------------
##NTUPLES= NMR SPECTRUM
##VAR_NAME=  FREQUENCY,     SPECTRUM/REAL,   SPECTRUM/IMAG
##SYMBOL=    X,             R,               I
##VAR_TYPE=  INDEPENDENT,   DEPENDENT,       DEPENDENT
##VAR_FORM=  AFFN,          ASDF,            ASDF
##VAR_DIM=   131072,        131072,          131072
##UNITS=     HZ,            ARBITRARY UNITS, ARBITRARY UNITS
##FACTOR=    0.0627417313425165, 1,          1
##FIRST=     8223.62146879498, -3585,        -93576
##LAST=      0,             -1269,           -95948
##MIN=       0,             -369074743,      0
##MAX=       8223.62146879498, 477820535,    0
$$ Real data points
##PAGE= N=1
##DATA TABLE= (X++(R..R)), XYDATA
$$ [...]
60697A707091J3773J2095R152N288K112Q42Q44N45n72j816k795l908n169n815
$$ 1707091 1720864 1732959 1742111 1747399 1749511 1750353 1751197 1751742 1751170 1749354 1746559 1742651 1737482 1731667
60683A731667n586n376n876o492o415o167p053r289j1542j2436j1992j1394j1542
$$ 1731667 1726081 1720705 1714829 1708337 1701922 1695755 1688702 1679413 1667871 1655435 1643443 1632049 1620507
60670A620507j2068j1938j0942j0083j0160j0460r770q281p365p378p042n372
$$ 1620507 1608439 1596501 1585559 1575476 1565316 1554856 1545086 1536805 1529440 1522062 1515020 1509648
60658A509648k971p21J553M134O166O700O425O861Q021Q170O121K776Q9p58K3
$$ 1509648 1506677 1505956 1507509 1511643 1517809 1524509 1530934 1537795 1545816 1553986 1560107 1562883 1562972 1562214 1562237
60643A562237J256J620O20r33j820j910k263l691n861p890r166r371q539p634
$$ 1562237 1563493 1565113 1565733 1564800 1562980 1561070 1558807 1555116 1549255 1541365 1532199 1522828 1514289 1506655
60629A506655q207j0596j2961j3162j1409j0085j0852j2880j4240j4049j2791
$$ 1506655 1498448 1487852 1474891 1461729 1450320 1440235 1429383 1416503 1402263 1388214 1375423
60618A375423j1349j0499j0700j1612j2152j1787j1311j1454j1374r723o931m913
$$ 1375423 1364074 1353575 1342875 1331263 1319111 1307324 1296013 1284559 1273185 1263462 1256531 1251618
60606A251618m434m369l854l509l683l070m67L089N459O011N791N625N437N214
$$ 1251618 1247184 1242815 1238961 1235452 1231769 1228699 1228232 1231321 1236780 1242791 1248582 1254207 1259644 1264858
60592A264858N275N546N670N814O417P195P391O959O549O368O048N548N186M799
$$ 1264858 1270133 1275679 1281349 1287163 1293580 1300775 1308166 1315125 1321674 1328042 1334090 1339638 1344824 1349623
60578A349623L910K756K081J879J477J011J538L361N373O566P174P836Q629R387
$$ 1349623 1353533 1356289 1358370 1360249 1361726 1362737 1364275 1367636 1373009 1379575 1386749 1394585 1403214 1412601
60564A412601J0156J0886J1464J2323J4044J6022J6767J5974J5134J5408J6146
$$ 1412601 1422757 1433643 1445107 1457430 1471474 1487496 1504263 1520237 1535371 1550779 1566925
60553A566925J6408J6566J7123J7057J5154J2428J1271J2087J2418R968N294O86
$$ 1566925 1583333 1599899 1617022 1634079 1649233 1661661 1672932 1685019 1697437 1707405 1712699 1713385
60541A713385k684n529q755j2144j5036j7537k0208k2678k3494k1811j8732j6296
$$ 1713385 1710701 1705172 1696417 1684273 1669237 1651700 1631492 1608814 1585320 1563509 1544777 1528481
60529A528481j5358j5022j3959j1598q310n153l308k922k573p69K083M075M048
$$ 1528481 1513123 1498101 1484142 1472544 1464234 1459081 1455773 1452851 1450278 1449509 1451592 1455667 1459715
60516A459715K472K43k004l304k793j258p67j920k823j794L13J771K660M255O526
$$ 1459715 1462187 1462430 1460426 1457122 1454329 1453071 1452304 1450384 1447561 1445767 1446080 1447851 1450511 1454766 1461292
60501A461292Q166Q876R807J1581J3225J3560J2709J1737J1428J1706J1914J1478
$$ 1461292 1469458 1478334 1488141 1499722 1512947 1526507 1539216 1550953 1562381 1574087 1586001 1597479
60489A597479J0659J0465J1513J3160J4326J4920J5871J7880K0787K4113K7577
$$ 1597479 1608138 1618603 1630116 1643276 1657602 1672522 1688393 1706273 1727060 1751173 1778750
60478A778750L0955L3924L6366L8520M0479M1517M0175L5433K7959J9789J2324
$$ 1778750 1809705 1843629 1879995 1918515 1958994 2000511 2040686 2076119 2104078 2123867 2136191
60467B136191M984l427j2479k0236k5456k8363k9203k7595k3918j9729j5898j1486
$$ 2136191 2141175 2137748 2125269 2105033 2079577 2051214 2022011 1994416 1970498 1950769 1934871 1923385
60455A923385n628P26O134J0681J5090J8783K0670K1375K2848K5802K9165L2192
$$ 1923385 1917757 1918483 1924617 1935298 1950388 1969171 1989841 2011216 2034064 2059866 2089031 2121223
60443B121223L5602M0214M5779N1768N8419O6375P5832Q6324R7043J07338J17415
$$ 2121223 2156825 2197039 2242818 2294586 2353005 2419380 2495212 2581536 2678579 2785917 2903332
60432B903332J28259J40344J52723J64284J75510J88034K02748K19487K38391
$$ 2903332 3031591 3171935 3324658 3488942 3664452 3852486 4055234 4274721 4513112
60423D513112K60130K84581L10402L35953L59047L75096L76903L57680L14546
$$ 4513112 4773242 5057823 5368225 5704178 6063225 6438321 6815224 7172904 7487450
60414G487450K49109J65694O9639l3072j35344k28676l04588l58053l89834m04573
$$ 7487450 7736559 7902253 7971892 7938820 7803476 7574800 7270212 6912159 6522325 6117752
60404F117752m06260l96553l77331l52732l27152l02087k76460k49678k23198
$$ 6117752 5711492 5314939 4937608 4584876 4257724 3955637 3679177 3429499 3206301
60395C206301j99154j78430j60459j44370j29985j17693j07395r7914q7990p7779
$$ 3206301 3007147 2828717 2668258 2523888 2393903 2276210 2168815 2070901 1982911 1905132
60385A905132o8614o1185n4875m9036m3877l9606l5811l2487l0503k9942k8965
$$ 1905132 1836518 1775333 1720458 1671422 1627545 1587939 1552128 1519641 1489138 1459196 1430231
60374A430231k5943k2049j9918j9965j9852j7838j4912j2948j2337j2466j3140
$$ 1430231 1404288 1382239 1362321 1342356 1322504 1304666 1289754 1276806 1264469 1252003 1238863
60363A238863j4243j4890j4283j2991j2079j1375r791p153m422k219l54J016J198
$$ 1238863 1224620 1209730 1195447 1182456 1170377 1159002 1149211 1142058 1137636 1135417 1135063 1136079 1137277
60350A137277M56L97K016M304N647N857N771N551M644L266K617L373M780N726
$$ 1137277 1137733 1138130 1140146 1144450 1150097 1155954 1161725 1167276 1171920 1175186 1177803 1181176 1185956 1191682
60336A191682O091O684Q116J0000J1216J0958R600Q297P674P260O417N210L959
$$ 1191682 1197773 1204457 1212573 1222573 1233789 1244747 1254347 1262644 1270318 1277578 1283995 1289205 1293164
60323A293164K681J656J790L333M773M352K399Q06K97k05j361k238k001j324j181
$$ 1293164 1295845 1297501 1299291 1302624 1307397 1311749 1314148 1314954 1315251 1315046 1313685 1311447 1309446 1308122 1306941
60308A306941j340j001j9J365L077M583M651K909R48P46K480M960P530J0196J2297
$$ 1306941 1305601 1304600 1304581 1305946 1309023 1313606 1318257 1321166 1322114 1322860 1325340 1330300 1337830 1348026 1360323
60293A360323J2772J1877J1287J1942J2911J3019J2812J3894J6676J9534K0495
$$ 1360323 1373095 1384972 1396259 1408201 1421112 1434131 1446943 1460837 1477513 1497047 1517542
60282A517542J9405J7989J7725J8050J7157J4375J1129R355R512J0446J0823J0358
$$ 1517542 1536947 1554936 1572661 1590711 1607868 1622243 1633372 1642727 1652239 1662685 1673508 1683866
60270A683866J0067J1414J4673J8021J8959J6970J4006J1967J0531P981L354k999
$$ 1683866 1693933 1705347 1720020 1738041 1757000 1773970 1787976 1799943 1810474 1818455 1821809 1818810
60258A818810j0133j6759k1362k3235k3241k2804k2325k1292j9513j7449j5484
$$ 1818810 1808677 1791918 1770556 1747321 1724080 1701276 1678951 1657659 1638146 1620697 1605213
60247A605213j3631j1811r927p921o201n569o093o579n856m119k339r34J60P61
$$ 1605213 1591582 1579771 1569844 1561923 1555722 1550153 1544060 1537481 1531625 1527506 1525167 1524233 1524393 1525154
60233A525154Q40J207K571M144M362K968J354Q27J412K383L132L448L644M430
$$ 1525154 1525994 1527201 1529772 1533916 1538278 1541246 1542600 1543427 1544839 1547222 1550354 1553802 1557446 1561876
60219A561876O154Q391J0660J3068J5553J7259J7604J7399J7702J8113J7499J6046
$$ 1561876 1568030 1576421 1587081 1600149 1615702 1632961 1650565 1667964 1685666 1703779 1721278 1737324
60207A737324J5102J5229J5828J6656J8111J9949K1274K2125K3742K6781L0511
$$ 1737324 1752426 1767655 1783483 1800139 1818250 1838199 1859473 1881598 1905340 1932121 1962632
60196A962632L4173L7913M1978M6045M9868N3604N7166O0289O3569O8286P4744
$$ 1962632 1996805 2034718 2076696 2122741 2172609 2226213 2283379 2343668 2407237 2475523 2550267
60185B550267Q1939Q9328R7649J07315J17207J25967J33567J40777J47899J54896
$$ 2550267 2632206 2721534 2819183 2926498 3043705 3169672 3303239 3444016 3591915 3746811
60175C746811J61848J68350J73146J75391J75662J74712J71623J64421J52490
$$ 3746811 3908659 4077009 4250155 4425546 4601208 4775920 4947543 5111964 5264454
60166E264454J37489J21677J06019R0145P3602N6626L9712K2944O173r977k3921
$$ 5264454 5401943 5523620 5629639 5719784 5793386 5850012 5889724 5912668 5918841 5908864 5884943
60155E884943l4289m0919m4203m3997m0106l3441k5593j7093p060N313J9746L5422
$$ 5884943 5850654 5809735 5765532 5721535 5681429 5647988 5622395 5605302 5598242 5603555 5623301 5658723
60143E658723N1623O7643Q2965R7759J12489J26839J39717J50310J58334J63357
$$ 5658723 5710346 5777989 5860954 5958713 6071202 6198041 6337758 6488068 6646402 6809759
60133F809759J64846J62894J57740J48594J34277J15201R3448P0632M7068K3251
$$ 6809759 6974605 7137499 7295239 7443833 7578110 7693311 7786759 7857391 7904459 7927710
60123G927710M35k0987m2017o2998q2258r7752j08755j15052j15946j11475j03409
$$ 7927710 7928145 7907158 7865141 7802143 7719885 7622133 7513378 7398326 7282380 7170905 7067496
60112G067496r3571q1976o7886n1655l4097j5100N320K5377M2956N8446P4108
$$ 7067496 6973925 6891949 6824063 6772408 6738311 6723211 6728531 6753908 6796864 6855310 6929418
60101F929418R0453J04906J14469J18270J17027J11484J02303R0630P7746O4399
$$ 6929418 7019871 7124777 7239246 7357516 7474543 7586027 7688330 7778960 7856706 7921105
60091G921105N0839L7273K4037J1700J244o002q833o619M13J1235K4709M0532
$$ 7921105 7971944 8009217 8033254 8044954 8046198 8040196 8031363 8024744 8025157 8036392 8061101 8101633
60079H101633N9146Q0513J03518J27109J51427J77227K04660K33413K63554K95209
$$ 8101633 8160779 8241292 8344810 8471919 8623346 8800573 9005233 9238646 9502200 9797409
60069I797409L27618L59497L90368M20637M50161M77519N00911N19274N32162
$$ 9797409 10125027 10484524 10874892 11295529 11745690 12223209 12724120 13243394 13775556
60060A3775556N38870N38004N27916N07713M78007M40448L96297L45713K88485
$$ 13775556 14314426 14852430 15380346 15888059 16366066 16806514 17202811 17548524 17837009
60051A7837009K24995J56097Q2785O620o9962j44481k15242k80667l38271l85286
$$ 17837009 18062004 18218101 18300886 18307506 18237544 18093063 17877821 17597154 17258883 16873597
60041A6873597m20184m42935m54095m54484m45410m28196m03460l71815l35176
$$ 16873597 16453413 16010478 15556383 15101899 14656489 14228293 13824833 13453018 13117842
60032A3117842k96119k55737k13298j68515j23154p9745l9702l522K7980N3664
$$ 13117842 12821723 12565986 12352688 12184173 12061019 11981274 11941572 11938050 11966030 12019694
60022A2019694P2943Q5648R1315Q9663Q1697O9246N3145L2797Q106j9052m6169
$$ 12019694 12092637 12178285 12269600 12359263 12440960 12510206 12563351 12596148 12604254 12585202 12539033
60011A2539033p2309r8003j23208j46630j67305j85706k02619k17646k29711k38435
$$ 12539033 12466724 12368721 12245513 12098883 11931578 11745872 11543253 11325607 11095896 10857461
60001A0857461k44156k46852k46033k41525k33519k21830k06126j86965j65719
$$ 10857461 10613305 10366453 10120420 9878895 9645376 9423546 9217420 9030455 8864736
59992H864736j43180j19120r3542o7526m2250j7794O569L1393N6681Q1838J05471
$$ 8864736 8721556 8602436 8508894 8441368 8399118 8381324 8387893 8419286 8475967 8557805 8663276
59981H663276J25857J42147J54639J63376J67191J64801J56278J42614J24386
$$ 8663276 8789133 8931280 9085919 9249295 9416486 9581287 9737565 9880179 10004565
59972A0004565J01772P5606M7195J7165j4497m7005p8279j06474j31317j53332
$$ 10004565 10106337 10181943 10229138 10246303 10231806 10184801 10106522 10000048 9868731 9715399
59962I715399j72090j86053j94149j96854j95249j89517j79063j64093j46214
$$ 9715399 9543309 9357256 9163107 8966253 8771004 8581487 8402424 8238331 8092117
59953H092117j27041j06817q4986o1580l7206j2156J3429L8794O3187Q7268J12453
$$ 8092117 7965076 7858259 7773273 7711693 7674487 7662331 7675760 7714554 7777741 7865009 7977462
59942G977462J38520J63229J84959K04407K22636K38455K49003K52338K48340
$$ 7977462 8115982 8279211 8464170 8668577 8891213 9129668 9378671 9631009 9879349
59933I879349K37540K20367J97444J69695J38008J03421O7374L1068n338m2097
$$ 9879349 10116889 10337256 10534700 10704395 10842403 10945824 11013198 11044266 11038928 10996831
59923A0996831p8565j13063j43785j69123j87443j97638k00107j96376j87518
$$ 10996831 10918266 10805203 10661418 10492295 10304852 10107214 9907107 9710731 9523213
59914I523213j73638j55145j33639j10870q7291o2258l5553q178J8396M3356O6849
$$ 9523213 9349575 9194430 9060791 8949921 8862630 8800372 8764819 8756641 8775037 8818393 8885242
59903H885242Q9433J11423J32417J50958J64822J72447J74431J73114J70212J65327
$$ 8885242 8974675 9086098 9218515 9369473 9534295 9706742 9881173 10054287 10224499 10389826
59893A0389826J57344J46716J35298J24294J13571J02969R3099Q4553P7592P3141
$$ 10389826 10547170 10693886 10829184 10953478 11067049 11170018 11263117 11347670 11425262 11498403
59883A1498403P2996P8248Q8280J02095J19919J42779J71100K04417K41759K81506
$$ 11498403 11571399 11649647 11737927 11840022 11959941 12102720 12273820 12478237 12719996 13001502
59873A3001502L21506L60396L98416M35971M71519N01731N23482N34775N33741
$$ 13001502 13323008 13683404 14081820 14517791 14989310 15491041 16014523 16549298 17083039
59864A7083039N17924M85180M34818L67629K85218J90029Q6058k1144j25780k23327
$$ 17083039 17600963 18086143 18520961 18888590 19173808 19363837 19449895 19428751 19302971 19079644
59854A9079644l10564l84511m42427m83403n09001n21342n21120n08562m85613
$$ 19079644 18769080 18384569 17942142 17458739 16949738 16428396 15907276 15398714 14913101
59845A4913101m55550m20567l81335l38953k95446k51759k06993j60572j13858
$$ 14913101 14457551 14036984 13655649 13316696 13021250 12769491 12562498 12401926 12288068
59836A2288068o8671k5463J5950N4797Q9682J19844J45075J64812J77921J82972
$$ 12288068 12219397 12193934 12209884 12264681 12354363 12474207 12619282 12784094 12962015 13144987
59826A3144987J78277J62452J35416R8335N2486q72n9458j20012j79662k36130
$$ 13144987 13323264 13485716 13621132 13719467 13771953 13771081 13711623 13591611 13411949 13175819
59816A3175819k86760l29222l63406l90491m09721m18662m17639m11060m02386
$$ 13175819 12889059 12559837 12196431 11805940 11396219 10977557 10559918 10148858 9746472
59807I746472l90175l71542l47506l22179k97965k74379k50601k26623k02291
$$ 9746472 9356297 8984755 8637249 8315070 8017105 7742726 7492125 7265502 7063211
59798G063211j77719j54408j34045j16576j01029q7529p6624o7597n9500n3077
$$ 7063211 6885492 6731084 6597039 6480463 6379434 6291905 6215281 6147684 6088184 6035107
59788F035107m9535m8096m6996m5990m5600m4723m1733l7482l4452l3274l2751
$$ 6035107 5985572 5937476 5890480 5844490 5798890 5754167 5712434 5674952 5640500 5607226 5574475
59777E574475l2939l5268l9588m3980m7683n1504n5221n7427n8050n8131n6844
$$ 5574475 5541536 5506268 5466680 5422700 5375017 5323513 5268292 5210865 5152815 5094684 5037840
59766E037840n2178m5117l9763l8000l7134l4167k9263k3484j6191o921K637J0781
$$ 5037840 4985662 4940545 4900782 4862782 4825648 4791481 4762218 4738734 4722543 4715622 4718259 4729040
59754D729040J7940K4809L0478L4414L8362M4169N1390N8957O7252P6422Q4446
$$ 4729040 4746980 4771789 4802267 4836681 4875043 4919212 4970602 5029559 5096811 5173233 5257679
59743E257679Q9357R1882R3400R2882Q8583Q1676P5129O9519O2882N4683M7291
$$ 5257679 5347036 5438918 5532318 5625200 5713783 5795459 5870588 5940107 6002989 6057672 6104963
59732F104963M3027M1911M2919M5608M9759N4876O1014O9347Q1161R6557J14355
$$ 6104963 6147990 6189901 6232820 6278428 6328187 6383063 6444077 6513424 6594585 6691142 6805497
59721F805497J33212J52949J74758J99733K27315K56090K86002L18293L53023
$$ 6805497 6938709 7091658 7266416 7466149 7693464 7949554 8235556 8553849 8906872
59712H906872L88240M22218M54480M83378N04421N12230N02250M69201M07106
$$ 8906872 9295112 9717330 10171810 10655188 11159609 11671839 12174089 12643290 13050396
59703A3050396L14785K00772P9747l5870j38846k23615k84783l20712l35518l35343
$$ 13050396 13365181 13565953 13645700 13609830 13470984 13247369 12962586 12641874 12306356 11971013
59693A1971013l23967l03073k74773k41790k05999j68412j30396r3744n9396k6681
$$ 11971013 11647046 11343973 11069200 10827410 10621411 10452999 10322603 10228859 10169463 10142782
59683A0142782N987L9460P2730J03774J32041J59681J89501K21859K54585K85843
$$ 10142782 10148769 10188229 10260959 10364733 10496774 10656455 10845956 11067815 11322400 11608243
59673A1608243L16128L47410L81394M18761M59115N01207N43963N87604O33262
$$ 11608243 11924371 12271781 12653175 13071936 13531051 14032258 14576221 15163825 15797087
59664A5797087O81480P31896P84271Q38613Q93881R47504R96883J040640J077864
$$ 15797087 16478567 17210463 17994734 18833347 19727228 20674732 21671615 22712255 23790119
59655B3790119J106746J124789J130077J122049J101524J070762J033447R93989
$$ 23790119 24896865 26021654 27151731 28273780 29375304 30446066 31479513 32473502
59647C2473502R56378R23553Q97511Q79373Q68894Q64049Q61534Q57892Q49745
$$ 32473502 33429880 34353433 35250944 36130317 36999211 37863260 38724794 39582686 40432431
59638D0432431Q32810Q01842P53018O86480O05343N12172M07987K95332J80594
$$ 40432431 41265241 42067083 42820101 43506581 44111924 44624096 45032083 45327415 45508009
59629D5508009P1673k5834j08970j75019k20817k44461k46292k27989j91708j39881
$$ 45508009 45579682 45553848 45444878 45269859 45049042 44804581 44558289 44330300 44138592 43998711
59619D3998711p4406M173R5641J98066L07676M20937N35687O50145P61883Q67926
$$ 43998711 43924305 43928478 44024119 44222185 44529861 44950798 45486485 46136630 46898513 47766439
59609D7766439R64652J046909J108154J141976J142760J104674J021365Q88048
$$ 47766439 48731091 49778000 50886154 52028130 53170890 54275564 55296929 56184977
59601E6184977P04048M73521K04935q9261l93334o90256r64097j201621j393498
$$ 56184977 56889025 57362546 57567481 57478220 57084886 56394630 55430533 54228912 52835414
59592E2835414j535448j628185j675612j683007j656842j604905j535291j455410
$$ 52835414 51299966 49671781 47996169 46313162 44656320 43051415 41516124 40060714
59584D0060714j372778j296170j234628j194842j179884j189399j218899j258436
$$ 40060714 38687936 37391766 36157138 34962296 33782412 32593013 31374114 30115678
59576C0115678j294489j315828j318114j302411j270467j223234j163221j095530
$$ 30115678 28821189 27505361 26187247 24884836 23614369 22391135 21227914 20132384
59568B0132384j025086r54179q83708q15358p50924o90366o32534n77623n27156
$$ 20132384 19107298 18153119 17269411 16454053 15703129 15012763 14380229 13802606 13275450
59559A3275450m81555m39517m00262l64540l32649l03082k74454k47483k23620
$$ 13275450 12793895 12354378 11954116 11589576 11256927 10953845 10679391 10431908 10208288
59550A0208288k02769j84058j68234j57320j51816j49896j49651j50699j53081
$$ 10208288 10005519 9821461 9653227 9495907 9344091 9194195 9044544 8893845 8740764
59541H740764j55981j58406j60221j61620j62198j61369j59124j55621j50397
$$ 8740764 8584783 8426377 8266156 8104536 7942338 7780969 7621845 7466224 7315827
59532G315827j42959j33869j24326j14683j04251r2743q1015o9990n9594m9355
$$ 7315827 7172868 7038999 6914673 6799990 6695739 6602996 6521981 6451991 6392397 6343042
59522F343042l9435l0258k1462j2140k205P326J5623K3026L0353L7710M4416M9795
$$ 6343042 6303607 6273349 6251887 6239747 6237542 6244868 6260491 6283517 6313870 6351580 6395996 6445791
59510F445791N3803N7127O0766O5285P0293P5152Q0161Q6497R4791J04507J15022
$$ 6445791 6499594 6556721 6617487 6682772 6753065 6828217 6908378 6994875 7089666 7194173 7309195
59499G309195J26438J38913J52055J65712J80497J96725K13681K30882K49227
$$ 7309195 7435633 7574546 7726601 7892313 8072810 8269535 8483216 8714098 8963325
59490H963325K69537K90718L10837L29622L48217L66695L83401L96877M06883
$$ 8963325 9232862 9523580 9834417 10164039 10512256 10878951 11262352 11659229 12066112
59481A2066112M13245M15137M11933M03674L90407L72155L49651L23654K93441
$$ 12066112 12479357 12894494 13306427 13710101 14100508 14472663 14822314 15145968 15439409
59472A5439409K57589K16867J74948J35620J00485O9766M3775K2564N524p559
$$ 15439409 15696998 15913865 16088813 16224433 16324918 16394684 16438459 16461023 16466547 16458988
59462A6458988j5812j8279j4604m232J3506L7571O4877R2965J21641J50477J75783
$$ 16458988 16443176 16424897 16410293 16406061 16419567 16457138 16522015 16614980 16736621 16887098 17062881
59451A7062881J91945J95461J86300J65459J32703Q6951K8194m1130j16452j93002
$$ 17062881 17254826 17450287 17636587 17802046 17934749 18021700 18049894 18008764 17892312 17699310
59441A7699310k67648l38547m03195m58110n00738n30500n47447n51421n43402
$$ 17699310 17431662 17093115 16689920 16231810 15731072 15200572 14653125 14101704 13558302
59432A3558302n26323n03077m74659m41395m05001l67912l31191k94464k57675
$$ 13558302 13031979 12528902 12054243 11612848 11207847 10839935 10508744 10214280 9956605
59423I956605k21737j87651j55746j25562r6010o6193l6424p705J9970M7572P5080
$$ 9956605 9734868 9547217 9391471 9265909 9169899 9103706 9067282 9059577 9079547 9127119 9202199
59412I202199J01321J26509J52825J81028K08301K31244K49594K65127K78349
$$ 9202199 9303520 9430029 9582854 9763882 9972183 10203427 10453021 10718148 10996497
59403A0996497K88186K93555K92750K82510K60452K27951J88194J41986Q8136
$$ 10996497 11284683 11578238 11870988 12153498 12413950 12641901 12830095 12972081 13060217
59394A3060217K7613l5541r7781j57857k14593k65288l07493l40714l65632l82913
$$ 13060217 13087830 13052289 12954508 12796651 12582058 12316770 12009277 11668563 11302931 10920018
59384A0920018l93205l96914l93797l84207l70634l56192l41410l24432l04661
$$ 10920018 10526813 10129899 9736102 9351895 8981261 8625069 8283659 7959227 7654566
59375G654566k84058k64337k44999k25179k05522j86994j69333j51977j35424
$$ 7654566 7370508 7106171 6861172 6635993 6430471 6243477 6074144 5922167 5786743
59366E786743j20504j07171r4796q2922p1140n9160m7564l7386k8460j9275r164
$$ 5786743 5666239 5559068 5464272 5381350 5310210 5251050 5203486 5166100 5137640 5118365 5109201
59355E109201O03Q536J4892K1208K8747L7659M6549N2454N2700M7761M1431L7580
$$ 5109201 5109804 5118340 5133232 5154440 5183187 5220846 5267395 5319849 5372549 5420310 5461741 5499321
59343E499321L7669M1547M8835N8558O9083P9845R1989J05820J18646J26884J29963
$$ 5499321 5536990 5578537 5627372 5685930 5755013 5834858 5926847 6032667 6151313 6278197 6408160
59332F408160J30894J33496J40216J52037J68598J88196K08915K30386K53901
$$ 6408160 6539054 6672550 6812766 6964803 7133401 7321597 7530512 7760898 8014799
59323H014799K80662L10498L42355L75446M09817M46109M84901N26057N68875
$$ 8014799 8295461 8605959 8948314 9323760 9733577 10179686 10664587 11190644 11759519
59314A1759519O12859O57844P02880P45398P82226Q11416Q32529Q45047Q47099
$$ 11759519 12372378 13030222 13733102 14478500 15260726 16072142 16904671 17749718 18596817
59305A8596817Q36169Q11079P73178P25693O72005O14554N55075M95341M37197
$$ 18596817 19432986 20244065 21017243 21742936 22414941 23029495 23584570 24079911 24517108
59296B4517108L81861L29266K77935K25598J70342J11351M8368j9317r2412j69830
$$ 24517108 24898969 25228235 25506170 25731768 25902110 26013461 26061829 26042512 25950100 25780270
59286B5780270k48520l25853m01361m75010n44441o05540o55877o96474p29806
$$ 25780270 25531750 25205897 24804536 24329526 23785085 23179545 22523668 21827194 21097388
59277B1097388p56726p75547p83728p80453p67953p49912p28217p01960o70187
$$ 21097388 20340662 19565115 18781387 18000934 17232981 16483069 15754852 15052892 14382705
59268A4382705o34474n97485n59867n20551m79786m39792m02109l66119l30943
$$ 14382705 13748231 13150746 12590879 12070328 11590542 11150750 10748641 10382522 10051579
59259A0051579k97288k66428k38414k12226j87128j63209j40939j20561j01499
$$ 10051579 9754291 9487863 9249449 9037223 8850095 8686886 8545947 8425386 8323887
59250H323887q2515o3197m5159l0685j9962j0699q04R574J9051K7001L3879M0135
$$ 8323887 8241372 8178175 8133016 8102331 8082369 8071670 8070866 8080440 8099491 8126492 8160371 8200506
59238H200506M5492M9105N0282M9317M7500M5821M3940M1080L7699L5379L5114
$$ 8200506 8245998 8295103 8345385 8394702 8442202 8488023 8531963 8573043 8610742 8646121 8681235
59227H681235L6470L8370M0085M1859M5354N2811O4603P8082R0309J01522J14336
$$ 8681235 8717705 8756075 8796160 8838019 8883373 8936184 9000787 9078869 9169178 9270700 9385036
59216I385036J29680J45259J58031J66344J69457J67010J59923J50332J39536
$$ 9385036 9514716 9659975 9818006 9984350 10153807 10320817 10480740 10631072 10770608
59207A0770608J26744J10375Q9732O5173L7696Q854j9733m6944p1629r2140j07738
$$ 10770608 10897352 11007727 11097459 11162632 11200328 11209182 11189449 11142505 11070876 10978736 10870998
59196A0870998j19914j30456j38423j41107j38103j32089j25195j17031j07222
$$ 10870998 10751084 10620628 10482205 10341098 10202995 10070906 9945711 9828680 9721458
59187I721458r7455q9542q3242p7366p1476o5389n8638n1753m6464m3104l9324
$$ 9721458 9624003 9534461 9451219 9373853 9302377 9236988 9178350 9126597 9080133 9037029 8997705
59176H997705l2970k4799j6728q627J316J4054K9270M6821O6819Q8711J11899
$$ 8997705 8964735 8939936 8923208 8914581 8915897 8929951 8959221 9006042 9072861 9161572 9273471
59165I273471J36998J65176J96392K29354K62964K96862L30806L64279L96497
$$ 9273471 9410469 9575645 9772037 10001391 10264355 10561217 10892023 11256302 11652799
59156A1652799M26096M51089M69358M78534M75287M56189M20103L68692L03732
$$ 11652799 12078895 12529984 12999342 13477876 13953163 14409352 14829455 15198147 15501879
59147A5501879K25387J34506L5420o5502j63742k57605l45520m23938m88520n36669
$$ 15501879 15727266 15861772 15897192 15831690 15667948 15410343 15064823 14640885 14152365 13615696
59137A3615696n68569n86039n90712n83604n66452n42553n15131m85278m52909
$$ 13615696 13047127 12461088 11870376 11286772 10720320 10177767 9662636 9177358 8724449
59128H724449m19458l87670l58447l29941l00672k71838k45521k22267k01533
$$ 8724449 8304991 7917321 7558874 7228933 6928261 6656423 6410902 6188635 5987102
59119E987102j82994j66030j49308j32458j17107j04783r4616q4487p3601o2735
$$ 5987102 5804108 5638078 5488770 5356312 5239205 5134422 5039806 4955319 4881718 4818983
59109D818983n2712m3800l6013k8906k1676j4212p295j211M798J1174J7456K3650
$$ 4818983 4766271 4722471 4686458 4657552 4635876 4621664 4614369 4613158 4617956 4629130 4646586 4670236
59097D670236L0518L7700M3465M7483N1878N7953O3853O7518P0070P3907P8775
$$ 4670236 4700754 4738454 4781919 4829402 4881280 4939233 5003086 5070604 5140674 5214581 5293356
59086E293356Q2426Q4232Q5516Q6703Q6546Q4128P9815P4345O8420O2745N7099
$$ 5293356 5375782 5460014 5545530 5632233 5718779 5802907 5882722 5957067 6025487 6088232 6145331
59075F145331N0048M1184L2527K6025K0765J4788Q608M296J955J22o89J988Q509
$$ 6145331 6195379 6236563 6269090 6295115 6315880 6330668 6339276 6343572 6345527 6345649 6344960 6346948 6355457
59062F355457J6040K2427K8661L6441M5453N4543O3891P4466Q6277R8477J10612
$$ 6355457 6371497 6393924 6422585 6459026 6504479 6559022 6622913 6697379 6783656 6882133 6992745
59051F992745J22882J35531J48564J61797J75029J88488K02840K18140K33084
$$ 6992745 7115627 7251158 7399722 7561519 7736548 7925036 8127876 8346016 8579100
59042H579100K46193K57433K67595K76222K81248K80693K73592K59205K36421
$$ 8579100 8825293 9082726 9350321 9626543 9907791 10188484 10462076 10721281 10957702
59033A0957702K04501J63913J16213O3272O583n2644j12217j67990k15616k53836
$$ 10957702 11162203 11326116 11442329 11505601 11512184 11459540 11347323 11179333 10963717 10709881
59023A0709881k84783l10247l29285l40671l45797l47053l44669l37636l26925
$$ 10709881 10425098 10114851 9785566 9444895 9099098 8752045 8407376 8069740 7742815
59014G742815l15255l03868k91808k78477k64816k51723k39052k26559k14323
$$ 7742815 7427560 7123692 6831884 6553407 6288591 6036868 5797816 5571257 5356934
59005E356934k02132j89724j77691j66869j56974j47176j37550j28613j19920
$$ 5356934 5154802 4965078 4787387 4620518 4463544 4316368 4178818 4050205 3930285
58996C930285j10963j02944r7517r3945q9650q3752p7970p3759p0542o7275o3849
$$ 3930285 3819322 3716378 3618861 3524916 3435266 3351514 3273544 3199785 3129243 3061968 2998119
58985B998119o0363n6721n3580n2041n1734n0716m7939m4491m1830m0038l8454
$$ 2998119 2937756 2881035 2827455 2775414 2723680 2672964 2625025 2580534 2538704 2498666 2460212
58974B460212l6768l4789l2187k9053k5956k3106k0313j7807j6129j5032j3506
$$ 2460212 2423444 2388655 2356468 2327415 2301459 2278353 2258040 2240233 2224104 2209072 2195566
58963B195566j1058q186n669m160l934m140l009j86K064J710J69M78K886M812
$$ 2195566 2184508 2176322 2170653 2166493 2162559 2158419 2155410 2155224 2157288 2158998 2159167 2159645 2162531 2167343
58949B167343N014M888N395N476M576M121N195O766P460P462P542P821Q477J0092
$$ 2167343 2172357 2177245 2182640 2188116 2192692 2196813 2202008 2208774 2216234 2223696 2231238 2239059 2247536 2257628
58935B257628J2301J3660J3753J3847J4510J4478J3121J2218J3728J7081K0328
$$ 2257628 2269929 2283589 2297342 2311189 2325699 2340177 2353298 2365516 2379244 2396325 2416653
58924B416653K2757K4744K5995K5844K4805K4369K5187K6551K7541K7956K8296
$$ 2416653 2439410 2464154 2490149 2515993 2540798 2565167 2590354 2616905 2644446 2672402 2700698
58913B700698K9267L1151L3352L5022L6147L7494L9424M1645M3978M6372M8124
$$ 2700698 2729965 2761116 2794468 2829490 2865637 2903131 2942555 2984200 3028178 3074550 3122674
58902C122674M8438M7972M8405N0133N1838N2849N4381N7587O1823O5767O9175
$$ 3122674 3171112 3219084 3267489 3317622 3369460 3422309 3476690 3534277 3596100 3661867 3731042
58891C731042P2479P5704P8887Q2755Q7979R4203J00501J06266J11327J15898
$$ 3731042 3803521 3879225 3958112 4040867 4128846 4223049 4323550 4429816 4541143 4657041
58881D657041J20836J27141J34842J43077J51625J61235J72183J83631J94990
$$ 4657041 4777877 4905018 5039860 5182937 5334562 5495797 5667980 5851611 6046601
58872F046601K06856K19931K33935K48288K63105K78990K96445L15796L37011
$$ 6046601 6253457 6473388 6707323 6955611 7218716 7497706 7794151 8109947 8446958
58863H446958L59491L82919M08234M36697M68000N00700N34556N70763O09580
$$ 8446958 8806449 9189368 9597602 10034299 10502299 11002999 11537555 12108318 12717898
58854A2717898O49430O89119P29341P71106Q13925Q56344Q96996R34159R65395
$$ 12717898 13367328 14056447 14785788 15556894 16370819 17227163 18124159 19058318 20023713
58845B0023713R88417J001436J002083R87020R53155Q98237Q20165P17531N91664
$$ 20023713 21012130 22013566 23015649 24002669 24955824 25854061 26674226 27391757 27983421
58836B7983421M46831K87729J18290n6335k28521l90379n36297o62645p66739
$$ 27983421 28430252 28717981 28836271 28779936 28551415 28161036 27624739 26962094 26195355
58827B6195355q47595r06440r45071r64475r66194r53757r31224r01070q64696
$$ 26195355 25347760 24441320 23496249 22531774 21565580 20611823 19680599 18779529 17914833
58818A7914833q24097p81535p38213o94619o51819o11074n72543n35500m99805
$$ 17914833 17090736 16309201 15570988 14876369 14224550 13613476 13040933 12505433 12005628
58809A2005628m66377m36210m09412l85067l61815l38868l16595k95655k75782
$$ 12005628 11539251 11103041 10693629 10308562 9946747 9607879 9291284 8995629 8719847
58800H719847k56212k37075k19147k02328j85767j69526j54486j40414j25914
$$ 8719847 8463635 8226560 8007413 7805085 7619318 7449792 7295306 7154892 7028978
58791G028978j10858r6886q4794p3238o1016m8730l7082k5388j3257j960P635
$$ 7028978 6918120 6821234 6736440 6663202 6602186 6553456 6516374 6490986 6477729 6475769 6483404
58780F483404J7019K8000L9929N0916O1039P2355Q6004J00922J15258J28026J39710
$$ 6483404 6500423 6528423 6568352 6619268 6680307 6752662 6838666 6939588 7054846 7182872 7322582
58769G322582J52128J67084J84293K01377K16852K32089K49256K68489K88645
$$ 7322582 7474710 7641794 7826087 8027464 8244316 8476405 8725661 8994150 9282795
58760I282795L09804L33095L58520L84866M11912M41104M73670N09230N46692
$$ 9282795 9592599 9925694 10284214 10669080 11080992 11522096 11995766 12504996 13051688
58751A3051688N85700O26729O70079P15149P60541Q04773Q46659Q84743R16748
$$ 13051688 13637388 14264117 14934196 15649345 16409886 17214659 18061318 18946061 19862809
58742A9862809R40184R53142R53516R37746R01686Q42887P60965O56036N28629
$$ 19862809 20802993 21756135 22709651 23647397 24549083 25391970 26152935 26808971 27337600
58733B7337600L81537K20158N0416j22160k90953m48258n88140p08217q07749
$$ 27337600 27719137 27939295 27989711 27867551 27576598 27128340 26540200 25831983 25024234
58724B5024234q85549r40938r75320r91431r91872r79204r56270r25403q88244
$$ 25024234 24138685 23197747 22222427 21230996 20239124 19259920 18303650 17378247 16490003
58715A6490003q46927q04149p61358p18386o75605o34743n96680n60278n24528
$$ 16490003 15643076 14838927 14077569 13359183 12683578 12048835 11452155 10891877 10367349
58706A0367349m90158m57991m27622l99046l73486l51009l29367l07216k86455
$$ 10367349 9877191 9419200 8991578 8592532 8219046 7868037 7538670 7231454 6944999
58697F944999k69035k53349k36587k19235k04067j91489j79062j65476j52203
$$ 6944999 6675964 6422615 6186028 5966793 5762726 5571237 5392175 5226699 5074496
58688E074496j40767j30847j21723j13676j07096j01449r5823q9776q3457p7471
$$ 5074496 4933729 4802882 4681159 4567483 4460387 4358938 4263115 4173339 4089882 4012411
58678D012411p2454o8220o3807n8976n4753n1758m8869m4807m0240l7028l5898
$$ 4012411 3939957 3871737 3807930 3748954 3694201 3642443 3593574 3548767 3508527 3471499 3435601
58667C435601l6043l6418l6333l5517l4772l5983m0060m5305m9029n0417n0810
$$ 3435601 3399558 3363140 3326807 3291290 3256518 3220535 3180475 3135170 3086141 3035724 2984914
58656B984914n1587n2846n3973n4571n4914n5755n7296n8323n7341n4583n1635
$$ 2984914 2933327 2880481 2826508 2771937 2717023 2661268 2603972 2545649 2488308 2433725 2382090
58645B382090m8940m5556m1754l9617l9885m0359l9018l6748l5221l3953l1687
$$ 2382090 2333150 2287594 2245840 2206223 2166338 2125979 2086961 2050213 2014992 1981039 1949352
58634A949352k9292k8791l0155l1149l0052k7084k3663k1438k1366k2525k2656
$$ 1949352 1920060 1891269 1861114 1829965 1799913 1772829 1749166 1727728 1706362 1683837 1661181
58623A661181k0782j8357j6961j6211j4895j2650r452n273j365O9r48j348R54
$$ 1661181 1640399 1622042 1605081 1588870 1573975 1561325 1551873 1546600 1545235 1545304 1544356 1543008 1543962
58610A543962M253O096O774P421O928L868j17j952j230j3L61k13k134n320p825
$$ 1543962 1548215 1554311 1561085 1568506 1575434 1579302 1579185 1577233 1576003 1575990 1576351 1576138 1574004 1568684 1560859
58595A560859p880o617o243o458n186k106J302M437P667J0343J1509J2083J3858
$$ 1560859 1552979 1546362 1540119 1533661 1528475 1526369 1527671 1532108 1539775 1550118 1561627 1573710 1587568
58582A587568J6780J9537K2224K5841K9723L2120L3038L4101L5984L8247M1165
$$ 1587568 1604348 1623885 1646109 1671950 1701673 1733793 1766831 1800932 1836916 1875163 1916328
58571A916328M5292M9744N3290N6639O1177O6183O9922P3057P8172Q6072R5063
$$ 1916328 1961620 2011364 2064654 2121293 2182470 2248653 2318575 2391632 2469804 2555876 2650939
58560B650939J03780J12316J20800J29179J38260J48926J60703J72984J86757
$$ 2650939 2754719 2867035 2987835 3117014 3255274 3404200 3564903 3737887 3924644
58551C924644K02810K19273K33605K46119K58751K71101K80573K85630K85873
$$ 3924644 4127454 4346727 4580332 4826451 5085202 5356303 5636876 5922506 6208379
58542F208379K79483K63902K38795K05548J64375J15074O0149L990n0774j03065
$$ 6208379 6487862 6751764 6990559 7196107 7360482 7475556 7535705 7539695 7488921 7385856
58532G385856j50245j88839k18149k39800k53964k59675k58583k54359k48049
$$ 7385856 7235611 7046772 6828623 6588823 6334859 6075184 5816601 5562242 5314193
58523E314193k37800k23589k08415j94093j79614j64433j49751j35758j21255
$$ 5314193 5076393 4852804 4644389 4450296 4270682 4106249 3956498 3820740 3699485
58514C699485j07161r6671r0544q5587p9379p3313o9391o6972o4566o2324o0874
$$ 3699485 3592324 3495653 3405109 3319522 3240143 3166830 3097439 3030467 2965901 2903577 2842703
58503B842703n9742n8315n6641n4351n0775m6829m4605m4377m4247m3268m2608
$$ 2842703 2782961 2724646 2668005 2613654 2562879 2516050 2471445 2427068 2382821 2339553 2296945
58492B296945m2992m3429m3176m2701m2182m1183m0072l9516l8583l5952l2790
$$ 2296945 2253953 2210524 2167348 2124647 2082465 2041282 2001210 1961694 1923111 1887159 1854369
58481A854369l1500l1661l0528k7555k4971k3614k2018k0080j9732k0926k0861
$$ 1854369 1822869 1791208 1760680 1733125 1708154 1684540 1662522 1642442 1622710 1601784 1580923
58470A580923j8366j5519j3741j2018j0271j0478j2777j4186j3243j2323j3318
$$ 1580923 1562557 1547038 1533297 1521279 1511008 1500530 1487753 1473567 1460324 1448001 1434683
58459A434683j4563j4227j3445j3540j3361j2037j1412j2851j4225j3036j0481
$$ 1434683 1420120 1405893 1392448 1378908 1365547 1353510 1342098 1329247 1315022 1301986 1291505
58448A291505r465j0230j0661r768q469p696p423o979n523l093j452k208m042
$$ 1291505 1282040 1271810 1261149 1251381 1242912 1235216 1227793 1220814 1215291 1212198 1210746 1208538 1204496
58435A204496m050k073r64k064l464l617l571m302m881m729m927n777n671l929
$$ 1204496 1200446 1198373 1197409 1195345 1191881 1188264 1184693 1180391 1175510 1170781 1165854 1160077 1154406 1150477
58421A150477k236j976k451k854l346l313j503J064J431q29k700k443j823k282
$$ 1150477 1148241 1146265 1143814 1140960 1137614 1134301 1132798 1133862 1135293 1134464 1131764 1129321 1127498 1125216
58407A125216k552j842j748k911l185j409J82l29j542j738j870l131m371m347
$$ 1125216 1122664 1120822 1119074 1116163 1112978 1111569 1111751 1111422 1109880 1108142 1106272 1103141 1098770 1094423
58393A094423m000m168l575j231J583L528M888N435L776N32j110JJ026j27j691
$$ 1094423 1090423 1086255 1082680 1081449 1083032 1086560 1091448 1096883 1100659 1101191 1100081 1100082 1101108 1100981 1099290
58378A099290j929k421m598o398n632l843l604m461m559m004l837l730l231l097
$$ 1099290 1097361 1094940 1090342 1083944 1078312 1074469 1070865 1066404 1061845 1057841 1054004 1050274 1047043 1043946
58364A043946l406k734j051o67k296l291j826L78J654L201N821P468O926O518
$$ 1043946 1040540 1037806 1036755 1036088 1033792 1030501 1028675 1029053 1030707 1033908 1039729 1047197 1054123 1060641
58350A060641Q151R954R832R148R726J0370R566Q593Q827Q943P877P525R323J1279
$$ 1060641 1068792 1078746 1088578 1097726 1107452 1117822 1127388 1135981 1144808 1153751 1161628 1169153 1178476 1189755
58336A189755J1494J1410J2363J2359R841P413P955R964J0377R327Q568Q006P123
$$ 1189755 1201249 1212659 1225022 1237381 1247222 1254635 1262590 1272554 1282931 1292258 1300826 1308832 1315955
58323A315955P131Q435Q901P684P411R417J0545Q265N124M247M221K704J350K519
$$ 1315955 1323086 1331521 1340422 1348106 1355517 1364934 1375479 1383744 1388868 1393115 1397336 1400040 1401390 1403909
58309A403909M447M453L827M991O770P002O919Q362R716R185Q943J1393J4253
$$ 1403909 1408356 1412809 1416636 1421627 1428397 1435399 1442318 1450680 1460396 1469581 1478524 1489917 1504170
58296A504170J4286J2861J3000J3789J2695J0680J0084R998Q584P303Q198R667
$$ 1504170 1518456 1531317 1544317 1558106 1570801 1581481 1591565 1601563 1610147 1617450 1625648 1635315
58284A635315R454Q806R232Q625N496L335N503R329J0732J1008J3252J5746J5329
$$ 1635315 1644769 1653575 1662807 1671432 1676928 1680263 1685766 1695095 1705827 1716835 1730087 1745833 1761162
58271A761162J3966J5309J7729J7342J5357J5797J8370K0000K1017K3438K5600
$$ 1761162 1775128 1790437 1808166 1825508 1840865 1856662 1875032 1895032 1916049 1939487 1965087
58260A965087K4934K3638K5142K7623K7456K6358K8034L0534K9320K5755K5092
$$ 1965087 1990021 2013659 2038801 2066424 2093880 2120238 2148272 2178806 2208126 2233881 2258973
58249B258973K7683K9444K9381K9650K9739K7543K4885K5328K7895K9158K9649
$$ 2258973 2286656 2316100 2345481 2375131 2404870 2432413 2457298 2482626 2510521 2539679 2569328
58238B569328L1927L4639L5012L4893L7741M2119M4564M5942M8467N0057M8789
$$ 2569328 2601255 2635894 2670906 2705799 2743540 2785659 2830223 2876165 2924632 2974689 3023478
58227C023478M8882N4281O0395O0905N8779O1095O6627O8808O7995P0075P5032
$$ 3023478 3072360 3126641 3187036 3247941 3306720 3367815 3434442 3503250 3571245 3641320 3716352
58216C716352P7469P7172P8994Q3415Q6824Q9856R5933J02985J06110J06797J10201
$$ 3716352 3793821 3870993 3949987 4033402 4120226 4210082 4306015 4409000 4515110 4621907 4732108
58205D732108J15393J17905J19442J24931J32560J37176J40812J48953J59253
$$ 4732108 4847501 4965406 5084848 5209779 5342339 5479515 5620327 5769280 5928533
58196E928533J65521J70059J79982J93989K05295K15201K30719K50989K69211
$$ 5928533 6094054 6264113 6444095 6638084 6843379 7058580 7289299 7540288 7809499
58187G809499K86012L07522L32280L53731L73565L98669M27365M52984M78049
$$ 7809499 8095511 8403033 8735313 9089044 9462609 9861278 10288643 10741627 11219676
58178A1219676N09574N43495N70379N93707O24941O62888O96316P24941P58652
$$ 11219676 11729250 12272745 12843124 13436831 14061772 14724660 15420976 16145917 16904569
58169A6904569P97600Q33215Q67944R13450R69615J026085J083933J154314J236534
$$ 16904569 17702169 18535384 19403328 20316778 21286393 22312478 23396411 24550725 25787259
58160B5787259J320052J407338J510611J626519J739478J850338J975509K117903
$$ 25787259 27107311 28514649 30025260 31651779 33391257 35241595 37217104 39335007
58152C9335007K266445K423940K605359K808578L019413L246885L520037L849655
$$ 39335007 41601452 44025392 46630751 49439329 52458742 55705627 59225664 63075319
58144F3075319M229767M676482N223516N877590O623306P474611Q473268R636037
$$ 63075319 67305086 71981568 77205084 83082674 89705980 97180591 105653859 115289896
58136A15289896J0959741J2479164J4251486J6273712J8482721K0839627K3343808
$$ 115289896 126249637 138728801 152980287 169253999 187736720 208576347 231920155
58129B31920155K6000317K8898199L2212128L5704324L7973813L6559842K9478193
$$ 231920155 257920472 286818671 319030799 354735123 392708936 429268778 458746971
58122D58746971J7032567K040997j1861799k2235077k8523582l1422331l1983336
$$ 458746971 475779538 477820535 465958736 443723659 415200077 383777746 351794410
58115C51794410l1134954k9526145k7499800k5197215k2731282k0249481j7867391
$$ 351794410 320659456 291133311 263633511 238436296 215705014 195455533 177588142
58108A77588142j5631726j3567909j1705504j0040959q525867p116134n806421
$$ 177588142 161956416 148388507 136683003 126642044 118116177 111000043 105193622
58101A05193622m610834l542040k623336j907040j477882j435299j831952k585444
$$ 105193622 100582788 97040748 94417412 92510372 91032490 89597191 87765239 85179795
58093H5179795l464932m212695m692714m912954m934316m804714m567434m270552
$$ 85179795 81714863 77502168 72809454 67896500 62962184 58157470 53590036 49319484
58085D9319484l943574l593177l232983k892028k586944k311758k062730j849121
$$ 49319484 45375910 41782733 38549750 35657722 33070778 30759020 28696290 26847169
58077B6847169j672125j516801j374093j250862j150517j062891r80981r09936
$$ 26847169 25175044 23658243 22284150 21033288 19882771 18819880 17838899 16928963
58069A6928963q51974p98666p44921o95527o52016o07932n62422n23813m94359
$$ 16928963 16076989 15278323 14533402 13837875 13185859 12577927 12015505 11491692 10997333
58060A0997333m65465m33142m04299l82739l62633l41251l24813l16012l08046
$$ 10997333 10531868 10098726 9694427 9311688 8949055 8607804 8282991 7966979 7658933
58051G658933k96536k85641k77269k65950k49933k36249k29214k23959k16335
$$ 7658933 7362397 7076756 6799487 6533537 6283604 6047355 5818141 5594182 5377847
58042E377847k09218k04265j97230j86371j76429j69829j62777j53787j46983
$$ 5377847 5168629 4964364 4767134 4580763 4404334 4234505 4071728 3917941 3770958
58033C770958j43200j37056j26726j17594j12327j06405r7393q9541q5052p9869
$$ 3770958 3627758 3490702 3363976 3246382 3134055 3027650 2930257 2840716 2755664 2675795
58023B675795p2425o7670o7724o7039o1888n6626n5538n6007n4599n2690n1359
$$ 2675795 2603370 2535700 2467976 2400937 2339049 2282423 2226885 2170878 2116279 2063589 2012230
58012B012230m7793m1494l7422l8276m0019l9061l7438l6831l4270k8302k3158
$$ 2012230 1964437 1922943 1885521 1847245 1807226 1768165 1730727 1693896 1659626 1631324 1608166
58001A608166k2092k2322k0635j8443j7496j6339j4662j5323j8435j9440j6609
$$ 1608166 1586074 1563752 1543117 1524674 1507178 1490839 1476177 1460854 1442419 1422979 1406370
57990A406370j4285j5093j5428j2679j0358j1427j2819j1512j0059j0983j1421
$$ 1406370 1392085 1376992 1361564 1348885 1338527 1327100 1314281 1302769 1292710 1281727 1270306
57979A270306q683n924o656q369p164m477l736m159l244k064k945m708m873l973
$$ 1270306 1261623 1255699 1249043 1240674 1233510 1229033 1225297 1221138 1217894 1215830 1212885 1208177 1203304 1199331
57965A199331l672l336k150j724l063m022l081k481m191o112n794m663n072o269
$$ 1199331 1195659 1192323 1190173 1188449 1185386 1181364 1178283 1175802 1171611 1165499 1159705 1155042 1149970 1143701
57951A143701o625o699p017o138m064m021p512j1049j1283r857r673r887q486
$$ 1143701 1137076 1130377 1123360 1117222 1113158 1109137 1101625 1090576 1079293 1069436 1059763 1049876 1041390
57938A041390o538n986o161o052o906r018r280n877k285k488n085o345o096o217
$$ 1041390 1034852 1028866 1022705 1016653 1009747 1000729 991449 985572 983287 980799 975714 969369 963273 957056
57924I57056n898l161O85K541K092J198L34q91j338m9J236O17n98k65O04l53k705
$$ 957056 951158 947997 948682 951223 953315 954513 954847 953956 952618 952569 953805 954422 953824 953559 954163 953810 951105
57907I51105m281m860n586o125n592m907n331n845m932l442k974k923j952r26
$$ 951105 946824 941964 936378 930253 924661 919754 914423 908578 903646 900204 897230 894307 892355 891429
57893H91429j492l096m140m639n272n348m259l315l568l559j889j46m10j665j609
$$ 891429 889937 886841 882701 878062 872790 867442 863183 859868 856300 852741 850852 850706 850296 848631 847022
57878H47022m32K64O49J698K424J163j384l237m034m494m311l263k955m752p248
$$ 847022 846590 846854 847503 849201 851625 852788 851404 848167 844133 839639 835328 832065 829110 824358 817110
57863H17110q327q281q362p979o162m267m149m953m570l136k207j649k16J792
$$ 817110 808783 800502 792140 784161 777999 773732 769583 764630 760060 756924 754717 753068 752852 754644
57849G54644L117L842M704N313N238N493O674P268O194N086N418N519L560J335
$$ 754644 757761 761603 766307 771620 776858 782351 789025 796293 802487 807573 812991 818510 822070 823405
57835H23405J472K735J972o75k541l101l923m866m435l400l990n720n900m286
$$ 823405 824877 827612 829584 828909 826368 823267 819344 814478 810043 806643 802653 796933 791033 786747
57821G86747l583n049o997p944q098p455n413k773j406j552j758j499j495j549
$$ 786747 783164 778115 771118 763174 755076 747621 742208 739435 738029 736477 734719 733220 731725 730176
57807G30176n92J185K593L559M836O130O834P813R834J1189R841P121N931N979
$$ 730176 729584 730769 733362 736921 741757 747887 754721 762534 772368 783557 793398 800519 806450 812429
57793H12429M452J120j102r72n93j728l710n690p810r421r179p724p410q695r540
$$ 812429 816881 818001 816899 815927 815334 813606 809896 804206 796396 786975 777796 770072 762662 753967 744427
57778G44427q953q272q225p779o774o851q473r658q919p236o089n744o215p614
$$ 744427 735474 727202 718977 711198 704424 697573 689100 679442 670523 663287 657198 651454 645239 637625
57764F37625q818q197o458o244q105r629r459r245j0203j0712r246p211o593o812
$$ 637625 628807 620610 614152 607908 599803 590174 580715 571470 561267 550555 541309 534098 527505 520693
57750E20693o188m936m519n058n283m283k023J065L852M847L883K568K223K430
$$ 520693 514505 509569 505050 499992 494709 490426 488403 489468 493320 498167 502050 504618 506841 509271
57736E09271K425K563L327M019L620K213P04j27K21J761L401L699K830K662M215
$$ 509271 511696 514259 517586 521605 525225 527438 528142 528015 528236 529997 533398 537097 539927 542589 546804
57721E46804O188O720N534L632K019J311J528J560o6l164n670o004m805l775l768
$$ 546804 552992 559712 565246 568878 570897 572208 573736 575296 575230 572066 566396 560392 555587 551812 548044
57706E48044m557n408n437m292k925k633l141k847j227M06J010J221J950K957
$$ 548044 543487 538079 532642 528350 525425 522792 519651 516804 515577 515983 516993 518214 520164 523121
57692E23121L678M332N262O071O174N588M678L817L535M157N043N184M678M643
$$ 523121 526799 531131 536393 542464 548638 554226 558904 562721 566256 570413 575456 580640 585318 589961
57678E89961N461O300O552O614O982P624Q358Q821Q286O790O093P794J0667J1925
$$ 589961 595422 601722 608274 614888 621870 629494 637852 646673 654959 661749 667842 675636 686303 698228
57664F98228J1154J0732J1950J3187J2867J1972J2247J3632J4919J5634J6089
$$ 698228 709382 720114 732064 745251 758118 770090 782337 795969 810888 826522 842611
57653H42611J6599J7581J9311K1116K1964K2176K3051K4585K5487K5858K7488
$$ 842611 859210 876791 896102 917218 939182 961358 984409 1008994 1034481 1060339 1087827
57642A087827L0787L3812L5451L7166M0145M3202M5305M7817N2054N6757O0418
$$ 1087827 1118614 1152426 1187877 1225043 1265188 1308390 1353695 1401512 1453566 1510323 1570741
57631A570741O4273P0207P7126Q2428Q6267R1438R9368J08838J18636J29088J40765
$$ 1570741 1635014 1705221 1782347 1864775 1951042 2042480 2141848 2250686 2369322 2498410 2639175
57620B639175J53665J67972J83928K00696K16789K31853K46812K62102K76752
$$ 2639175 2792840 2960812 3144740 3345436 3562225 3794078 4040890 4302992 4579744
57611D579744K89054K97100K99031K93741K80739K57982K20757J65122R3106J3304
$$ 4579744 4868798 5165898 5464929 5758670 6039409 6297391 6518148 6683270 6776376 6789680
57601F789680o3934j31266j85272k25174k51777k66772k72075k69803k62208k50891
$$ 6789680 6725746 6594480 6409208 6184034 5932257 5665485 5393410 5123607 4861399 4610508
57591D610508k36311k19003k00798j83721j68041j52697j37366j22816j09293
$$ 4610508 4374197 4155194 3954396 3770675 3602634 3449937 3312571 3189755 3080462
57582C080462r6160q3406p2135o3028n5285m7541l9041k9680j9786j0257k081
$$ 3080462 2984302 2900896 2828761 2765733 2710448 2662907 2623866 2594186 2574400 2564143 2562062
57571B562062M699J1016J7605K4471L1622L9403M7754N5938O3572P1327Q0141
$$ 2562062 2566761 2577777 2595382 2619853 2651475 2690878 2738632 2794570 2858142 2929469 3009610
57560C009610R0118J00708J11641J23202J35588J48232J59811J68949J75046J78336
$$ 3009610 3099728 3200436 3312077 3435279 3570867 3719099 3878910 4047859 4222905 4401241
57550D401241J79090J76748J69892J56801J36040J07103P1104L0716j0951n1415
$$ 4401241 4580331 4757079 4926971 5083772 5219812 5326915 5398019 5428735 5417784 5366369
57540E366369q8856j21787j49320j71389j88089j98959k03535k02680j98683j93608
$$ 5366369 5277513 5155726 5006406 4835017 4646928 4447969 4244434 4041754 3843071 3649463
57530C649463j87769j80099j70102j59058j48958j40312j31815j22431j12943
$$ 3649463 3461694 3281595 3111493 2952435 2803477 2663165 2531350 2408919 2295976
57521B295976j04520r6642q8046p9298p2508o8202o4392n9402n3875m8904m3973
$$ 2295976 2191456 2094814 2006768 1927470 1854962 1786760 1722368 1662966 1609091 1560187 1516214
57510A516214l8282l2836k9325k7673k6348k4532k2489k0159j7169j4056j1940
$$ 1516214 1477932 1445096 1415771 1388098 1361750 1337218 1314729 1294570 1277401 1263345 1251405
57499A251405j0823r494p323n047l523k598j471N09L419O529Q673R467J0000J1573
$$ 1251405 1240582 1231088 1223765 1218718 1215195 1212597 1211126 1211635 1215054 1221583 1230256 1239723 1249723 1261296
57485A261296J4128J6678J8904K1234K3598K5332K6399K7728L0172L3842L8375
$$ 1261296 1275424 1292102 1311006 1332240 1355838 1381170 1407569 1435297 1465469 1499311 1537686
57474A537686M3129M7232N0327N3299N7477O3230O9982P7323Q5109R2824R9928
$$ 1537686 1580815 1628047 1678374 1731673 1789150 1852380 1922362 1999685 2084794 2177618 2277546
57463B277546J06775J14119J21737J28679J34840J40991J46955J50906J50930
$$ 2277546 2384321 2498440 2620177 2748856 2883696 3024687 3171642 3322548 3473478
57454C473478J46383J37300J23404J04342Q0325N2166K1115j0980m1874o9704
$$ 3473478 3619861 3757161 3880565 3984907 4065232 4117398 4138513 4127533 4085659 4015955
57444D015955r3511j13024j28191j38797j44370j44852j41690j37442j33466j28605
$$ 4015955 3922444 3809420 3681229 3542432 3398062 3253210 3111520 2974078 2840612 2712007
57434B712007j21120j11328j01143r1666q2793p4807o8450o3213n7342n0064m2483
$$ 2712007 2590887 2479559 2378416 2286750 2203957 2129150 2060700 1997487 1940145 1890081 1847598
57423A847598l5720k9596k3667j8180j3193p935j927M264J0091J5881K1712K6618
$$ 1847598 1811878 1782282 1758615 1740435 1727242 1719307 1717380 1721644 1731735 1747616 1769328 1795946
57411A795946L0012L3173L8150M5467N3891O2096O9799P7397Q5344R3819J02538
$$ 1795946 1825958 1859131 1897281 1942748 1996639 2058735 2128534 2205931 2291275 2385094 2487632
57400B487632J10776J17826J23366J27412J30081J31288J30144J24837J13857
$$ 2487632 2598408 2716234 2839600 2967012 3097093 3228381 3358525 3483362 3597219
57391C597219R7410P6880N2918K5138n961l7919o7776r3966j16170j34157j47490
$$ 3597219 3694629 3771509 3824427 3849565 3843604 3805685 3737909 3643943 3527773 3393616 3246126
57380C246126j55927j59523j58699j54668j49307j43936j38433j31818j23600
$$ 3246126 3090199 2930676 2771977 2617309 2468002 2324066 2185633 2053815 1930215
57371A930215j14420j05700r8598r2981q7468q0968p3916o7425o1701n6239n1192
$$ 1930215 1815795 1710095 1611497 1518516 1431048 1350080 1276164 1208739 1147038 1090799 1039607
57360A039607m7219m4146m1137l8123l5586l3053k9645k6172k4597k4831k4306
$$ 1039607 992388 948242 907105 868982 833396 800343 770698 744526 719929 695098 670792
57349F70792k1709j9028j8445j9159j9071j7958j6914j5989j4552j3243j3312
$$ 670792 649083 630055 611610 592451 573380 555422 538508 522519 507967 494724 481412
57338D81412j4440j4966j4129j2492j0505q134n835m475m297m885n860o728o686
$$ 481412 466972 452006 437877 425385 414880 406746 400911 396436 392139 387254 381394 374666 367980
57325C67980n550m263l452k402o99L19n36j990j980q99p92j833k150j254r25k122
$$ 367980 362430 358167 354715 352313 351614 351933 351397 349407 347427 346528 345736 343903 341753 340499 339574 337452
57309C37452l317k995j927j682k300k671k360j956k141k964l709l332j670n1J34
$$ 337452 334135 331140 329213 327531 325231 322560 320200 318244 316103 313139 309430 306098 304428 304377 304511
57294C04511o67p94L19J683K537L138L641L648L234L149L670M351N004N732O031
$$ 304511 303844 303050 303369 305052 307589 310727 314368 318016 321250 324399 328069 332420 337424 343156 349187
57279C49187N335M461M930O625P811P800P787Q536R107Q799Q615R676J1534J3121
$$ 349187 354522 358983 363913 370538 378349 386149 393936 402472 411579 420378 428993 438669 450203 463324
57265D63324J4284J5462J6846J8552K0675K2617K3397K2975K2048K0596J8228
$$ 463324 477608 493070 509916 528468 549143 571760 595157 618132 640180 660776 679004
57254F79004J6085J6114J7850J8375J6489J4604J4998J6538J6992J6562J6833
$$ 679004 695089 711203 729053 747428 763917 778521 793519 810057 827049 843611 860444
57243H60444J7842J8353J8041J7420J6705J6409J7791K0843K3252K3325K2614
$$ 860444 878286 896639 914680 932100 948805 965214 983005 1003848 1027100 1050425 1073039
57232A073039K3465K5463K6760K7600K9546L2239L4079L5628L8910M3375M5911
$$ 1073039 1096504 1121967 1148727 1176327 1205873 1238112 1272191 1307819 1346729 1390104 1436015
57221A436015M5513M4908M6491M9183N0649N0410M9455M8346M7027M5248M2296
$$ 1436015 1481528 1526436 1572927 1622110 1672759 1723169 1772624 1820970 1867997 1913245 1955541
57210A955541L7560L1895K7059K3062J7734R844J229n252q741j0372j1256j1696
$$ 1955541 1993101 2024996 2052055 2075117 2092851 2102695 2103924 2098672 2089931 2079559 2068303 2056607
57198B056607j1756j1500j0833r741q483p248n909m185j741J639N510Q771J1011
$$ 2056607 2044851 2033351 2022518 2012777 2004294 1997046 1991137 1986952 1985211 1986850 1992360 2001131 2012142
57185B012142J3304J6607J9878K1222K0643J9994K0345K1173K2259K4306K7063
$$ 2012142 2025446 2042053 2061931 2083153 2103796 2123790 2144135 2165308 2187567 2211873 2238936
57174B238936K8761K8545K7969K8890L1019L2788L3732L4816L6819L9468M1980
$$ 2238936 2267697 2296242 2324211 2353101 2384120 2416908 2450640 2485456 2522275 2561743 2603723
57163B603723M3851M5141M6340M7737M9093N0259N1705N3607N4751N3575N0404
$$ 2603723 2647574 2692715 2739055 2786792 2835885 2886144 2937849 2991456 3046207 3099782 3150186
57152C150186M7469M6438M6951M7777M8264M8337M8047M7583M7033M6073M4620
$$ 3150186 3197655 3244093 3291044 3338821 3387085 3435422 3483469 3531052 3578085 3624158 3668778
57141C668778M3642M4239M6105M8002M9542N1161N2586N3077N3309N5059N8623
$$ 3668778 3712420 3756659 3802764 3850766 3900308 3951469 4004055 4057132 4110441 4165500 4224123
57130D224123O2119O3963O4454O4392O3755O2519O1313O0306N8770N6486N4348
$$ 4224123 4286242 4350205 4414659 4479051 4542806 4605325 4666638 4726944 4785714 4842200 4896548
57119D896548N2631M9929M4881L8197L2144K8507K7496K7869K7914K7090K6875
$$ 4896548 4949179 4999108 5043989 5082186 5114330 5142837 5170333 5198202 5226116 5253206 5280081
57108E280081K9073L3270L7210L9591M1072M2328M2748M1609L9171L6007L2210
$$ 5280081 5309154 5342424 5379634 5419225 5460297 5502625 5545373 5586982 5626153 5662160 5694370
57097E694370K7716K2585J6931J1309O766L476J44l815o490n777k529R60M557
$$ 5694370 5722086 5744671 5761602 5772911 5779677 5783153 5783297 5779482 5772992 5767215 5764686 5765646 5770203
57084E770203R488J4630J7086J6348J4653J2942R869N173N98l156p227j1934j6840
$$ 5770203 5779691 5794321 5811407 5827755 5842408 5855350 5865219 5870392 5870990 5867834 5860607 5848673 5831833
57071E831833k4158l8443o1694r1878j26975j67127k12136k60398l11050l63716
$$ 5831833 5807675 5769232 5707538 5615660 5488685 5321558 5109422 4849024 4537974 4174258
57061D174258m16076m65842n15259n69062o28069o90353A30900g09260r37099
$$ 4174258 3758182 3292340 2777081 2208019 1579950 889597 130900 -709260 -1646359
57052a646359j045679j165317j302283j461599j642642j845579k074364k330164
$$ -1646359 -2692038 -3857355 -5159638 -6621237 -8263879 -10109458 -12183822 -14513986
57044a4513986k609879k915410l256818l642731m076165m563564n118230n750413
$$ -14513986 -17123865 -20039275 -23296093 -26938824 -31014989 -35578553 -40696783 -46447196
57036d6447196o464566p270704q185189r212897j0339575j1544989j2806269j4084171
$$ -46447196 -52911762 -60182466 -68367655 -77580552 -87920127 -99465116 -112271385 -126355556
57028a26355556j5329725j6510401j7596627j8519877j9219848j9791159k0496143
$$ -126355556 -141685281 -158195682 -175792309 -194312186 -213532034 -233323193 -253819336
57021b53819336k1455380k2257434k1990624j9822616j5624073j0048888m056392
$$ -253819336 -275274716 -297532150 -319522774 -339345390 -354969463 -365018351 -369074743
57014c69074743J622416O664058J1009186J4663268J7606021J9802886K1251562
$$ -369074743 -367452327 -360788269 -349779083 -335115815 -317509794 -297706908 -276455346
57007b76455346K2008507K2171157K1838721K1096999K0033231J8742897J7312144
$$ -276455346 -254446839 -232275682 -210436961 -189339962 -169306731 -150563834 -133251690
57000a33251690J5804540J4270911J2760604J1316157R966618Q732918P631439
$$ -133251690 -117447150 -103176239 -90415635 -79099478 -69132860 -60399942 -52768503
56993e2768503O666161N825259N092445M456477L906655L428272L009471K646419
$$ -52768503 -46102342 -40277083 -35184638 -30728161 -26821506 -23393234 -20383763 -17737344
56985a7737344K335857K068241J833433J627348J447601J288309J145089J020108
$$ -17737344 -15401487 -13333246 -11499813 -9872465 -8424864 -7136555 -5991466 -4971358
56977d971358R16062Q29103P53175O87067O31388e72410c8762D46611M40788M00998
$$ -4971358 -4055296 -3226193 -2473018 -1785951 -1154563 -572410 -38762 446611 887399 1288397
56967A288397L64616L31841L03871K79464K56117K33718K13571J95158J76965
$$ 1288397 1653013 1984854 2288725 2568189 2824306 3058024 3271595 3466753 3643718
56958C643718J59168J42382J25297J06670Q8500P4296O5087N9466N6418N5796
$$ 3643718 3802886 3945268 4070565 4177235 4265735 4340031 4405118 4464584 4521002 4576798
56948D576798N6991N9025O1367O4107O8887P8716R2112R6210P2197J3113o6253
$$ 4576798 4633789 4692814 4754181 4818288 4887175 4965891 5058003 5154213 5226410 5239523 5173270
56937E173270j41306j97242k34164k57706k71942k80317k86262k90329k90023
$$ 5173270 5031964 4834722 4600558 4342852 4070910 3790593 3504331 3214002 2923979
56928B923979k83814k72934k58990k42464k24187k05913j88825j72982j58342
$$ 2923979 2640165 2367231 2108241 1865777 1641590 1435677 1246852 1073870 915528
56919I15528j45061j32977j22123j13100j05812r8779r1015B3361e2774o8196
$$ 915528 770467 637490 515367 402267 296455 197676 106661 23361 -52774 -120970
56909a20970n8673m9564m2948l7373k9790k0148j1336m996p4M876J0245J6072
$$ -120970 -179643 -229207 -272155 -309528 -339318 -359466 -370802 -375798 -375872 -370996 -360751 -344679
56897c44679K1936K6296K7671K6249K2943J7812J1174N093J445o36l067n493o206
$$ -344679 -322743 -296447 -268776 -242527 -219584 -201772 -190598 -185505 -184060 -184696 -187763 -193256 -199462
56884a99462n527n356n843n322l418j385P14M347R573J4291J7090J8845K0999
$$ -199462 -204989 -210345 -216188 -221510 -224928 -226313 -225599 -221252 -211679 -197388 -180298 -161453 -140454
56871a40454K4146K8394L2800b0862H484J8385N742m317j0739C157a2854j6211
$$ -140454 -116308 -87914 -55114 -20862 8484 26869 32611 28294 17555 3157 -12854 -29065
56859b9065j5896j5422j4456j3111j2043j1103r314o670m535l689l180j617J231
$$ -29065 -44961 -60383 -74839 -87950 -99993 -111096 -120410 -127080 -131615 -135304 -138484 -140101 -138870
56846a38870M442O583O478M319K058J519K472L647N099P822J1417J4178J5466
$$ -138870 -134428 -127845 -121367 -117048 -114990 -113471 -110999 -107352 -102253 -94431 -83014 -68836 -53370
56833e3370J6144J6669c754A3490J9298K2359K4053K3553K2677K2625K1697J7720
$$ -53370 -37226 -20557 -3754 13490 32788 55147 79200 102753 125430 148055 169752 187472
56821A87472J1226M718j78l520n895p663q851q985p448m476j170J821M840Q266
$$ 187472 198698 203416 203238 199718 193823 186160 177309 168324 160876 156400 155230 157051 161891 170157
56807A70157J1893J5566J9365K2888K5374K6997K9114L2717L7251M0961M1598
$$ 170157 182050 197616 216981 239869 265243 292240 321354 354071 391322 432283 473881
56796D73881L7139K7220J4243J853p879j4943j9460k0958j9739j7166j4185j0804
$$ 473881 511020 538240 552483 554336 546457 531514 512054 491096 471357 454191 440006 429202
56784D29202p149l409J366Q403J6645K3171K6984L0509L6244M3695N0688N5916
$$ 429202 422053 418644 420010 428413 445058 468229 495213 525722 561966 605661 656349 712265
56772G12265N8595N7141N0010L7315K0584J931j5771k9331l7356m1276m3207m3701
$$ 712265 770860 828001 878011 915326 935910 937841 922070 892739 855383 814107 770900 727199
56760G27199m2258l8867l3899k7613k0864j5104j0551n446J560R438J6350K2065
$$ 727199 684941 646074 612175 584562 563698 548594 538043 532597 534157 543595 559945 582010
56748E82010K7247L1478L3605L3236L0352K4192J4291K149r684j9781k7823l3219
$$ 582010 609257 640735 674340 707576 737928 762120 776411 778560 768876 749095 721272 688053
56736F88053l5536l5831l5739l5274l3083k8839k3813j9090j4652j0421o782l632
$$ 688053 652517 616686 580947 545673 512590 483751 459938 440848 426196 415775 408993 405361
56724D05361p8M421R338J3666J6555J7369J5814J2119O675j80p501j3627j7700
$$ 405361 405283 409704 419042 432708 449263 466632 482446 494565 501240 501060 493559 479932 462232
56711D62232k0710k3854k6399k6624k4567k2178k0764j9853j8771j7658j6446
$$ 462232 441522 417668 391269 364645 340078 317900 297136 277283 258512 240854 224408
56700B24408j4424j1630r429q636q076o159l169q52r6j26kJ16m40j558k285j992
$$ 224408 209984 198354 188925 180289 172213 166054 162885 162033 161937 161811 161809 161925 161485 159927 157642 155650
56684A55650j163o83n88O1J825L863M627L433J086r53j740j477j189j649k449
$$ 155650 154487 153804 153216 153277 155102 158965 163592 167025 168111 167158 165418 163941 162752 161103 158654
56669A58654k460j361k30l24j698l378m387m208k809q76M29N99L79O54J185J131
$$ 158654 156194 154833 154603 154279 152581 149203 144816 140608 137799 136923 137352 137951 138330 138984 140169 141300
56653A41300M17k82o19q10r23p74n36n95p50l15P28J406R01l68j188q84O3O79
$$ 141300 141717 141435 140816 140006 139083 138309 137773 137178 136428 136113 136841 138247 139148 138780 137592 136708 136771 137450
56635A37450O67O77J294K099K241J758J463J540J233K98l22J02R76J417J480J471
$$ 137450 138117 138794 140088 142187 144428 146186 147649 149189 150422 150720 150398 150500 151476 152893 154373 155844
56619A55844R32n34k053k321j267J27J245J916J744N28q16j122n40j48k45k99
$$ 155844 156776 156242 154189 151868 150601 150728 151973 153889 155633 156161 155345 154223 153683 153535 153290 152991
56603A52991k52n28p85k23Q09J020K75l3Q53J970K336K354K679K940K683K705
$$ 152991 152739 152211 151426 151203 152012 153032 153307 153274 154127 156097 158433 160787 163466 166406 169089 171794
56587A71794M064O187P083N506K291m44j061M13K391L048J805l84k147k895l035
$$ 171794 175858 182045 189128 194634 196925 196481 195420 195833 198224 201272 203077 202693 200546 197651 194616
56572A94616l321m046m726m682m013l507l378k783j348l25j019k495k306K29K809
$$ 194616 191295 187249 182523 177841 173828 170321 166943 164160 162812 162487 161468 158973 156667 156896 159705
56557A59705K821K80k437l278k329j283j426k197j958l40J019P42j49L38K192
$$ 159705 162526 162806 160369 157091 154762 153479 152053 149856 147898 147558 148577 149319 149170 149508 151700
56542A51700L537L415K670J950Q68l49l86R00J610N07q51l40J554K655K381K150
$$ 151700 155237 158652 161322 163272 164140 163791 163405 164305 165915 166422 165571 165231 166785 169440 171821 173971
56526A73971K709L037K250J023M91Q41J630K606L470L458K159N06J13J401K969
$$ 173971 176680 179717 181967 182990 183481 184322 185952 188558 192028 195486 197645 198151 198264 199665 202634
56511B02634L165J954P07L89O67R73J607L058M757N439M764L781L670M596N972
$$ 202634 205799 207753 208460 208849 209516 210489 212096 215154 219911 225350 230114 233895 237565 242161 248133
56496B48133P243Q083Q277P819O962O028N233M650M197L814L694M071M480L832
$$ 248133 255376 263459 271736 279555 286517 292545 297778 302428 306625 310439 314133 318204 322684 326516
56482C26516J668j045k953l697l651k988j876j101j317j961k038j705j905k655
$$ 326516 328184 327139 324186 320489 316838 313850 311974 310873 309556 307595 305557 303852 301947 299292
56468B99292l016k701k356k236j959j704k131k847k501r59J67j52r38r95q27j587
$$ 299292 296276 293575 291219 288983 287024 285320 283189 280342 277841 276882 277049 276897 275959 274964 274137 272550
56452B72550l110m132l932k804j414l11K36M68P19O52l36j790k367j683p99l53
$$ 272550 269440 265308 261376 258572 257158 256847 257083 257551 258270 258922 258586 256796 254429 252746 251947 251594
56436B51594L15J473J905Q13l68K07J997K745J763Q37J620L397M102K874R21M
$$ 251594 251909 253382 255287 256100 255732 255939 257936 260681 262444 263281 264901 268298 272400 275274 276195 276199
56420B76199M04P68k1j292j412J83K621M979O921P928P255N236L602L709N059
$$ 276199 276603 277371 277350 276058 274646 274829 277450 282429 289350 297278 304533 309769 313371 317080 322139
56405C22139O084N819M498L211L257N138P903J0081J1220J1698J1320R547P053
$$ 322139 328223 334042 338540 341751 345008 350146 358049 368130 379350 391048 402368 411915 418968
56392D18968N463N123M740L635K722K657K691K153J456P75o05k636l828l413k612
$$ 418968 424431 429554 434294 437929 440651 443308 445999 448152 449608 450383 449778 447142 443314 439901 437289
56377D37289k569k602j881j325k095l522m284m555n264o149o237n555m856m321
$$ 437289 434720 432118 430237 428912 426817 423295 419011 414456 409192 403043 396806 391251 386395 382074
56363C82074l809l677m040m012k923j472o13l31n17j723l683m631l721k722l414
$$ 382074 378265 374588 370548 366536 363613 362141 361528 361197 360680 358957 355274 350643 346922 344200 340786
56348C40786m665m169k018k34L46M68M30r9o44n21l30j072k104k044j189r25j145
$$ 340786 336121 331952 329934 329700 330046 330514 330944 330845 330201 329680 329350 328278 326174 324130 322941 322016 320871
56331C20871l76J670L613M446M328L530K309J549J848K254J585N48Q40K534M100
$$ 320871 320495 322165 325778 330224 334552 338082 340391 341940 343788 346042 347627 348175 349015 351549 355649
56316C55649M561L984K481N84j51J036K420J997N94M06J331J482P22P24J674K036
$$ 355649 360210 364194 366675 367259 367108 368144 370564 372561 373155 373561 374892 376374 377096 377820 379494 381530
56300C81530J596J853L140M185M859O430Q518Q753O365L512K064J450P32M20J049
$$ 381530 383126 384979 388119 392304 397163 403593 412111 420864 427229 430741 432805 434255 434987 435407 436456
56285D36456J918K426K971L752M283M597N232N707M977L610L428M602N386N074
$$ 436456 438374 440800 443771 447523 451806 456403 461635 467342 472319 475929 479357 483959 489345 494419
56271D94419M836N157N096M749N718Q147R873R759R398J0185J1059J0630R460
$$ 494419 499255 504412 509508 514257 519975 528122 537995 547754 557152 567337 578396 589026 598486
56258E98486Q725Q450Q376Q883R890J0528J0878J2190J4570J6377J6823J6996
$$ 598486 607211 615661 624037 632920 642810 653338 664216 676406 690976 707353 724176 741172
56246G41172J7370J6669J4459J2529J2151J2094J0968R507Q960Q980Q714Q445
$$ 741172 758542 775211 789670 802199 814350 826444 837412 846919 855879 864859 873573 882018
56234H82018Q644Q989R370J0303J1308J0924R437R462J2386J6271J8731J9929
$$ 882018 890662 899651 909021 919324 930632 941556 950993 960455 972841 989112 1007843 1027772
56222A027772K1199K2737K4253K6098K8205K9610L0450L2522L6525M0718M3754
$$ 1027772 1048971 1071708 1095961 1122059 1150264 1179874 1210324 1242846 1279371 1320089 1363843
56211A363843M6802N1291N6593O1532O6249P1107P5891Q1476Q9827J00705J10898
$$ 1363843 1410645 1461936 1518529 1580061 1646310 1717417 1793308 1874784 1964611 2065316 2176214
56200B176214J18620J26082J35640J46161J55731J65217J76126J87163J96190
$$ 2176214 2294834 2420916 2556556 2702717 2858448 3023665 3199791 3386954 3583144
56191C583144K03661K10984K17037K19478K18200K14355K07145J94737J77472
$$ 3583144 3786805 3997789 4214826 4434304 4652504 4866859 5074004 5268741 5446213
56182E446213J57398J35221J10394Q3426N5686K7734J35k5022m5839o3048p8489
$$ 5446213 5603611 5738832 5849226 5932652 5988338 6016072 6016207 5991185 5945346 5882298 5803809
56171E803809r2141j02838j10831j17231j22040j25157j28223j32717j37166j39047
$$ 5803809 5711668 5608830 5497999 5380768 5258728 5133571 5005348 4872631 4735465 4596418
56161D596418j38913j39911j43564j48364j52208j53948j52984j49647j45857
$$ 4596418 4457505 4317594 4174030 4025666 3873458 3719510 3566526 3416879 3271022
56152C271022j43444j41922j39242j34305j27393j19178j10772j03599r7690r1289
$$ 3271022 3127578 2985656 2846414 2712109 2584716 2465538 2354766 2251167 2153477 2062188
56142B062188q3575p6115p0112o4337n7941n2931n1033n0078m6688m1040l5848
$$ 2062188 1978613 1902498 1832386 1768049 1710108 1657177 1606144 1556066 1509378 1468338 1432490
56131A432490l2010k8590k5904k5088k5263k4307k2038j9741j7280j3683r956
$$ 1432490 1400480 1371890 1345986 1320898 1295635 1271328 1249290 1229549 1212269 1198586 1188630
56120A188630q156p897o732l744k68K687N100O600O975P569R667J2098J2978J3076
$$ 1188630 1180474 1172577 1165845 1162101 1161833 1164520 1169620 1176220 1183195 1190764 1200431 1212529 1225507 1238583
56106A238583J4642J7542J9551K0131K1038K3192K5523K6963K7352K6608K4981
$$ 1238583 1253225 1270767 1290318 1310449 1331487 1354679 1380202 1407165 1434517 1461125 1486106
56095A486106K3852K4244K5185K5279K4907K4962K4717K3294K2020K2828K5463
$$ 1486106 1509958 1534202 1559387 1584666 1609573 1634535 1659252 1682546 1704566 1727394 1752857
56084A752857K8670L2881L9156M6718N4122O1569O9650P7312Q3688R0355R9000
$$ 1752857 1781527 1814408 1853564 1900282 1954404 2015973 2085623 2162935 2246623 2336978 2435978
56073B435978J08574J17374J25838J34095J38972J37163J29745J20299J10539
$$ 2435978 2544552 2661926 2787764 2921859 3060831 3197994 3327739 3448038 3558577
56064C558577J01031R3693Q9297Q4565P5850O3748N0069L3172J1413j1107k8061
$$ 3558577 3659608 3753301 3842598 3927163 4003013 4066761 4116830 4150002 4161415 4150308 4122247
56053D122247l8708m7093n5256o2921p2101q5535j01111j13719j22087j28320
$$ 4122247 4083539 4036446 3981190 3918269 3846168 3760633 3659522 3545803 3423716 3295396
56043C295396j31687j29118j21449j12971j04919r5302q4750p6195o8917n9354
$$ 3295396 3163709 3034591 2913142 2800171 2695252 2599950 2515200 2439005 2370088 2310734
56033B310734m8060l9364l3805k7564k0007j4968j3483j1875q523o111n585m180
$$ 2310734 2262674 2223310 2189505 2161941 2141934 2126966 2113483 2101608 2093085 2086974 2081389 2077209
56021B077209j283j43j746k717j364k44p41m72J952M565O228Q371J1257J3241
$$ 2077209 2075926 2075783 2074037 2071320 2069956 2069712 2068971 2068499 2070451 2075016 2081244 2089615 2100872 2114113
56007B114113J4666J7486K0604K1015J9778K0890K3907K4432K2351K2515K6142
$$ 2114113 2128779 2146265 2166869 2187884 2207662 2228552 2252459 2276891 2299242 2321757 2347899
55996B347899K8972K9446L1231L5590L8671L8917M0029M3818M6888M7201M7514
$$ 2347899 2376871 2406317 2437548 2473138 2511809 2550726 2590755 2634573 2681461 2728662 2776176
55985B776176M9668N1711N3021N6031O0698O3557O4075O5581O8520O9693O9415
$$ 2776176 2825844 2877555 2930576 2986607 3047305 3110862 3174937 3240518 3309038 3378731 3448146
55974C448146P1887P7249Q1149Q3325Q8050R4954R8718R9413J03096J10208J14059
$$ 3448146 3520033 3597282 3678431 3761756 3849806 3944760 4043478 4142891 4245987 4356195 4470254
55963D470254J13544J16154J24752J32698J36476J41740J51771J61255J67237
$$ 4470254 4583798 4699952 4824704 4957402 5093878 5235618 5387389 5548644 5715881
55954E715881J75206J88128K00326K08848K20070K38108K57178K72652K89231
$$ 5715881 5891087 6079215 6279541 6488389 6708459 6946567 7203745 7476397 7765628
55945G765628L10690L31839L48456L65498L87723M11691M34222M59047M88179
$$ 7765628 8076318 8408157 8756613 9122111 9509834 9921525 10355747 10814794 11302973
55936A1302973N16656N42516N71418O05123O36782O63916O93659P28765P62206
$$ 11302973 11819629 12362145 12933563 13538686 14175468 14839384 15533043 16261808 17024014
55927A7024014P92698Q30758Q81333R35784R89612J051797J127107J206518J285644
$$ 17024014 17816712 18647470 19528803 20464587 21454199 22505996 23633103 24839621 26125265
55918B6125265J374570J477930J584228J687633J800815J932697K074093K219818
$$ 26125265 27499835 28977765 30561993 32249626 34050441 35983138 38057231 40277049
55910D0277049K382777K570290K770329K979740L222133L519145L870245M280899
$$ 40277049 42659826 45230116 48000445 50980185 54202318 57721463 61591708 65872607
55902F5872607M780572N388361O091766O885604P798517Q854238J0048406J1398974
$$ 65872607 70653179 76041540 82133306 89018910 96817427 105671665 115720071 127119045
55894A27119045J2975724J4840412J7005431J9487686K2329765K5510279K8915064
$$ 127119045 140094769 154935181 171940612 191428298 213758063 239268342 268183406
55887B68183406L2426996L5789973L8078033L7436359L1942497K1214806P190567
$$ 268183406 300610402 336400375 374478408 411914767 443857264 465072070 472262637
55880D72262637o881670j8323982k6098093l0509012l2364689l2451393l1390393
$$ 472262637 465380967 447056985 420958892 390449880 358085191 325633798 294243405
55873B94243405k9602022k7329497k4759043k2106404j9565259j7232048j5134268
$$ 294243405 264641383 237311886 212552843 190446439 170881180 153649132 138514864
55866A38514864j3293742j1718902j0373053r201108q172930p273450o476370
$$ 138514864 125221122 113502220 103129167 93928059 85755129 78481679 72005309
55859G2005309n759762n127773m588314m125280l715257l353701l042287k767390
$$ 72005309 66245547 61117774 56529460 52404180 48688923 45335222 42292935 39525545
55851C9525545k513307k282478k082687j907617j748091j608755j495447j398081
$$ 39525545 37012238 34729760 32647073 30739456 28991365 27382610 25887163 24489082
55843B4489082j303187j212267j132222j058967r86064r18733q63867q15594p65256
$$ 24489082 23185895 21973628 20841406 19782439 18796375 17877642 17013775 16198181 15432925
55834A5432925p16482o76540o41605o04277n67362n36821n08798m76676m43968
$$ 15432925 14716443 14039903 13398298 12794021 12226659 11689838 11181040 10704364 10260396
55825A0260396m17692l95487l71317l47711l30652l17980l03938k89838k79773
$$ 10260396 9842704 9447217 9075900 8728189 8397537 8079557 7775619 7485781 7206008
55816G206008k71024k58941k46094k36794k27867k14588k00435j91127j83985
$$ 7206008 6934984 6676043 6429949 6193155 5965288 5750700 5550265 5359138 5175153
55807E175153j73204j61023j53633j50014j44713j38217j34932j33860j30494
$$ 5175153 5001949 4840926 4687293 4537279 4392566 4254349 4119417 3985557 3855063
55798C855063j25712j24187j25990j27480j28287j29910j29751j23943j14272
$$ 3855063 3729351 3605164 3479174 3351694 3223407 3093497 2963746 2839803 2725531
55789B725531j05659r8885r1793q5056q0373p5679o8442o1126n7315n5104n0434
$$ 2725531 2619872 2520987 2429194 2344138 2263765 2188086 2119644 2058518 2001203 1946099 1895665
55778A895665m4118l9577l6347l2004k7598k5166k2621j7345j2080j0889j2079
$$ 1895665 1851547 1811970 1775623 1743619 1716021 1690855 1668234 1650889 1638809 1627920 1615841
55767A615841j1453r934j1254j4483j5801j5852j8459k3332k6658k7918k9874
$$ 1615841 1604388 1594454 1583200 1568717 1552916 1537064 1518605 1495273 1468615 1440697 1410823
55756A410823l2598l3430l2277l1489l1099k9348k7150k6980k8033k7293k4600
$$ 1410823 1378225 1344795 1312518 1281029 1249930 1220582 1193432 1166452 1138419 1111126 1086526
55745A086526k2185k0260j7586j5153j4607j4396j2123r301q920r794q477n533
$$ 1086526 1064341 1044081 1026495 1011342 996735 982339 970216 960915 951995 942201 933724 928191
55733I28191m498n463n097k729j230j855k940l816n663q190r406q863p839o628
$$ 928191 923693 918230 913133 910404 909174 907319 904379 900563 894900 886710 877304 868441 860602 853974
55719H53974m882l754m334n056m283l986o899j1393j3657j3789j4965j7393j7996
$$ 853974 849092 845338 841004 835948 831665 827679 820780 809387 795730 781941 766976 749583 731587
55706G31587j5980j3996j3416j2716j1050r637r289r780j1640j5190j8158j7793
$$ 731587 715607 701611 688195 675479 664429 654792 645503 635723 624083 608893 590735 572942
55694E72942j5198j4072j5312j6343j5632j4215j2870j1263r951r959j0331r171
$$ 572942 557744 543672 528360 512017 496385 482170 469300 458037 448086 438127 427796 418625
55682D18625p013o029o278o047n422n958p063o395l927k024j260K05K670L773
$$ 418625 411612 405583 399305 393258 387836 381878 374815 368420 364493 362469 361209 361414 364084 367857
55668C67857K160o82l025m726n881o077n594n252m858l691k391k312l288l997
$$ 367857 370017 369335 366310 361584 355703 349626 344032 338780 333922 330231 327840 325528 322240 318243
55654C18243l962l305j610P74J710K37r79P95L771M209K286J382K346K760J619
$$ 318243 314281 310976 309366 310140 311850 312087 311108 311903 315674 319883 322169 323551 325897 328657 330276
55639C30276M23m60k436n069n716l624j163j63l5O5K43J386M536Q262R689Q626
$$ 330276 330699 330239 327803 322734 317018 313394 312231 312068 312033 312098 312341 313727 318263 326525 336214 344840
55623C44840P716Q228Q849R007R845J1217J0989Q430N331K891M50j928k699j815
$$ 344840 352556 360784 369633 378640 388485 399702 410691 419121 424452 427343 427793 425865 423166 421351
55609D21351j531k968m537m930n099n880o062m359j479R48J937J075j254l068
$$ 421351 419820 416852 412315 407385 402286 396406 390344 385985 384506 385454 387391 388466 387212 384144
55595C84144k262N48K648K951K791K783J697o42k069j065R82J833J051l82j633
$$ 384144 381882 382430 385078 388029 390820 393603 395300 394658 392589 391524 392506 394339 395390 395008 393375
55580C93375k397k979m400p063r398r484p945p226q141r353j0144j1189j2337
$$ 393375 390978 387999 383599 376536 367138 357654 349709 342483 334342 324989 314845 303656 291319
55567B91319j2200j0575q976q236p667o963o676o610n980n394o174p525p154n099
$$ 291319 279119 268544 259568 251332 243665 236702 230026 223416 217436 212042 205868 198343 191189 186090
55553A86090l975m787n426m372l033l045l786m061l958l692k628q37K84J05k35
$$ 186090 182115 177328 171902 167530 164497 161452 157666 153605 149647 145955 143327 142490 142774 142879 142644
55538A42644R0L30j59q28j352k227l208l162k239k069k985l338k423j759k337
$$ 142644 142734 143064 142905 142077 140725 138498 135290 132128 129889 127820 124835 121497 119074 117315 114978
55523A14978k881k214j187q60p52l29k75q99j010J22J353J581J527K245L274L638
$$ 114978 112097 109883 108696 107836 107084 106755 106480 105581 104571 104693 106046 107627 109154 111399 114673 118311
55507A18311L426L301L545M397N911O889N561K159q83j977j928j821j521j208
$$ 118311 121737 125038 128583 132980 138891 145780 151341 153500 152617 150640 148712 146891 145370 144162
55493A44162k035l994n113m292k990k725k750j853o61m26q93j169j348j720j557
$$ 144162 142127 138133 133020 128728 125738 123013 120263 118410 117749 117323 116430 115261 113913 112193 110636
55478A10636l01J118J572J411J569K004K210K267K252J712O88K76J035J975J986
$$ 110636 110335 111453 113025 114436 116005 118009 120219 122486 124738 126450 127138 127414 128449 130424 132410
55463A32410J277N63O8J59J468L411M006K392K65l68L74J162J487J476Q54n29
$$ 132410 133687 134250 134318 134477 135945 139356 143362 145754 146019 145651 146025 147187 148674 150150 151004 150475
55447A50475j896k493k676l190m059m925n640n883n222m109l726m316m727m216
$$ 150475 148579 146086 143410 140220 136161 131236 125596 119713 114491 110382 106656 102340 97613 93397
55433I3397l434l137l131l080l054k833j978j089j437k980m121l960l168k414
$$ 93397 89963 86826 83695 80615 77561 74728 72750 71661 70224 67244 63123 59163 55995 53581
55419E3581j687j397k122k880j935J62Q11o92k146k179k178l197l855l058k045
$$ 53581 51894 50497 48375 45495 43560 43722 44533 43841 41695 39516 37338 34141 30286 27228 25183
55404B5183j816j161N79J439J0j601q72J083J560O67N73J514J726P53l7l0j6k96
$$ 25183 23367 22206 22785 24224 24234 22633 21761 22844 24404 25071 25644 27158 28884 29637 29600 29570 29554 29258
55386B9258j06R48K377L435L322J480j258k889k797k626l378l401j220J423J802
$$ 29258 29152 30100 32477 35912 39234 40714 39456 36567 33770 31144 27766 24365 23145 24568 26370
55371B6370K36p73l80J53K34N58J182J316R26O54L54m62j082l72J141J838J440
$$ 26370 26606 25833 25453 25606 25840 26398 27580 28896 29822 30476 30830 30368 29286 28914 30055 31893 33333
55354C3333J088J191R41p8j331k317k728j915L14K669L542K946K076J374M28o65
$$ 33333 34421 35612 36553 36475 35144 32827 30099 28184 28498 31167 34709 37655 39731 41105 41533 40868
55338D0868j275j285r30p0J188J747P20j209k780l759m351m121k976k145k399
$$ 40868 39593 38308 37378 37308 38496 40243 40963 39754 36974 33215 28864 24743 21767 19622 17223
55323A7223k409p20J600K382J486L72n35j629k005m15K006K593Q85r08j236n82
$$ 17223 14814 14094 15694 18076 19562 19934 19399 17770 15765 15350 17356 19949 20834 19926 18690 18108
55307A8108M84K025L137K264j63j642j034jj05o13k73N39P93M88P9n79j553k110
$$ 18108 18592 20617 23754 26018 25855 24213 23179 23178 23073 22460 22187 22726 23519 24007 24086 23507 21954 19844
55289A9844j704j015j047j783k308j781j40J580J658m95k919k813P1L002L683
$$ 19844 18140 17125 16078 14295 11987 10206 10066 11646 13304 12809 9890 7077 7148 10150 13833
55274A3833K653J672J161L56q90j782j617m15J234K370K166P54p15j213p86q0
$$ 13833 16486 18158 19319 19675 18785 17003 15386 14971 16205 18575 20741 21495 20780 19567 18781 18701
55258A8701N23R05Q02K8j023j556j203m10J56M83J173K376L106K284K77j238j173
$$ 18701 19224 20129 20931 20959 19936 18380 17177 16767 16923 17406 18579 20955 24061 26345 26622 25384 24211
55241B4211o0R25J266J078O10J73q8o43k008l525l675k099j75Q61J232J413R67
$$ 24211 24151 25076 26342 27420 28030 28203 28115 27472 25464 21939 18264 16165 15990 16851 18083 19496 20463
55224B0463m35j892k286j592l58J059K040J795Q25Q63K253K988J719L6q0O40L44
$$ 20463 20028 18136 15850 14258 13900 14959 16999 18794 19619 20482 22735 25723 27442 27478 27398 28038 28382
55207B8382o40o49J21l9j372k526l027l412l231j413J313K861K783K525K582J866
$$ 28382 27742 27093 27214 27175 25803 23277 20250 16838 13607 12194 13507 16368 19151 21676 24258 26124
55191B6124L12m21L12R26K05q48r06m13n22j260j880k060j831j228o80q07j270
$$ 26124 26436 26015 26327 27253 27458 26610 25704 25291 24769 23509 21629 19569 17738 16510 15830 15023 13753
55174A3753q94N93K015K462K357K163J330m86k146k239j003O6L21O22J782L041
$$ 13753 12859 13452 15467 17929 20286 22449 23779 23293 21147 18908 17905 17971 18292 18914 20696 23737
55158B3737K715L31k357l038j296J182K715K927K005K44j073j93K547M138K603
$$ 23737 26452 26783 24426 21388 20092 21274 23989 26916 28921 29165 28092 27899 30446 34584 37187
55143C7187j42r92j8K96p39j302m37N73O47L74M18L65m0j76J39P2p78j634j753
$$ 37187 37045 36053 36035 36331 35592 34290 33853 34426 35073 35447 35865 36230 36190 36014 36153 36225 35447 33813 32060
55124C2060j341q27l06k4l02p04l76O60J471J562J096n4k124m322n287m754l548
$$ 32060 30719 29892 29586 29562 29260 28556 28180 28840 30311 31873 32969 32915 30791 26469 21182 16428 12880
55107A2880j970K69K615L749L281J973L68j223j641J40K784L469J480r37j768
$$ 12880 10910 11179 13794 17543 20824 22797 23165 21942 20301 20441 23225 26694 28174 27237 25469
55092B5469j436j196j348j831k754l376k273M95K834L205K355J655J219P01M62
$$ 25469 24033 22837 21489 19658 16904 13528 11255 11750 14584 17789 20144 21799 23018 23719 24181
55077B4181P46Q35J80n95p50o09p60j014q70k72P19K075L126K759R56q44j440
$$ 24181 24927 25762 25942 25347 24597 23988 23228 22214 21344 21072 21791 23866 26992 29751 30707 29863 28423
55060B8423j020k01Q70J982K503K280J975K064K291K426K583K663K525K678L513
$$ 28423 27403 27202 28072 30054 32557 34837 36812 38876 41167 43593 46176 48839 51364 54042 57555
55045E7555L940K445l91k215j970r08k23K43M82k19j478j602k03J004J105J455
$$ 57555 61495 63940 63549 61334 59364 58456 58233 58476 58958 58739 57261 55659 55456 56460 57565 59020
55029E9020K855L469J609j188k158j072R3M18P49J583K218K103J676J634K121
$$ 59020 61875 65344 66953 65765 63607 62535 62628 63046 63795 65378 67596 69699 71375 73009 75130
55014G5130K603K216O65j082j643j017m45m01n1R04J424R08K23R8q3q99j631j512
$$ 75130 77733 79949 80614 79532 77889 76872 76427 76026 75975 76879 78303 79211 79434 79532 79449 78550 76919 75407
54996G5407j052j135j774k599l371l466k141r4Q39K12m35j98o4o25p54J41O87
$$ 75407 74355 73220 71446 68847 65476 62010 59869 59775 60614 60826 60391 60193 60129 59504 58750 58891 59578
54979E9578M7k42J100K598K269P29k75q40k010l151k737r93N65J413J851J492
$$ 59578 59625 59383 60483 63081 65350 66079 65804 64964 62954 59803 57066 56073 56638 58051 59902 61394
54963F1394J32p63L01K467L802M118M247L673J568o14n87J066J606M88l1J130
$$ 61394 61526 60763 61064 63531 67333 71451 75698 79371 80939 80325 79738 80804 82410 82898 82867 83997
54947H3997K292K215J915K150J689k92k116j807J08J662K255K685L087K467L65
$$ 83997 86289 88504 90419 92569 94258 93966 91850 90043 90151 91813 94068 96753 99840 102307 102672
54932A02672k234l863l945l049k136j705j645j648j590j456j314j341j415p78
$$ 102672 100438 96575 92630 89581 87445 85740 84095 82447 80857 79401 78087 76746 75331 74553
54918G4553R52K494J894p25k780k421p21L47O10R37J103L96n26l01J018K254L077
$$ 74553 75505 77999 79893 79168 76388 73967 73246 73593 74203 75140 76243 76639 76113 75812 76830 79084 82161
54901H2161L972M663M350L375K931L233L476L464L631L721L134K552L364N333
$$ 82161 86133 90796 95146 98521 101452 104685 108161 111625 115256 118977 122111 124663 128027 133360
54887A33360O662O614O399O980P767Q139Q726J0185J1924J3044J3670J4376J4787
$$ 133360 140022 146636 153035 160015 167782 175921 184647 194832 206756 219800 233470 247846 262633
54874B62633J3646J0240N349O48k915n948r420j2694j3871j2505j0645j0227j0752
$$ 262633 276279 286519 291868 292516 289601 283653 274233 261539 247668 235163 224518 214291 203539
54861B03539j0877j0948j1927j2830j1688q706o054m532k854o05O02j34j163o33
$$ 203539 192662 181714 169787 156957 145269 136563 130509 125977 123123 122518 123120 122986 121823 121190
54847A21190Q86J614J321J477L113N695P953R152R498R668J0049J0540J1113J1922
$$ 121190 122076 123690 125011 126488 129601 135296 143249 152401 161899 171567 181616 192156 203269 215191
54833B15191J2469J1506Q714N723M223L600J975r68l839o005q201j0527j1822
$$ 215191 227660 239166 247880 253603 257826 261426 263401 262433 258594 252589 244388 233861 222039
54820B22039j1648j1248j1584j1832j0775q705o923o081n804n537n154m901n000
$$ 222039 210391 199143 187559 175727 164952 156247 149324 143243 137439 131902 126748 121847 116847
54807A16847n137m591l328k475k837l454k808j161k29n03n18Q15K477K652R55
$$ 116847 111710 107119 103791 101316 98479 95025 92217 91056 90827 90324 89806 90621 93098 95750 96705
54792I6705j262k268j442J64Q05Rr32j059j234k368l262k279m32l45k242l506
$$ 96705 95443 93175 91733 91897 92702 92711 91779 90720 89486 87118 83856 81577 81145 80800 78558 75052
54776G5052k663j218p71o68J70J130J188O94L53k48j568k694k488j312l15K44
$$ 75052 72389 71171 70400 69732 69902 71032 72220 72914 73267 73019 71451 68757 66269 64957 64642 64886
54760F4886P94J278J441J616K206K862L118L224L416L086J790M64M48J603K587
$$ 64886 65680 66958 68399 70015 72221 75083 78201 81425 84841 87927 89717 90181 90629 92232 94819
54745I4819K760K770L198L659L520K852K345K633L859N574O806O498M426J995
$$ 94819 97579 100349 103547 107206 110726 113578 115923 118556 122415 127989 134795 141293 145719 147714
54731A47714J654M591Q968J1541J1393J0901J2190J4156J4518J3509J3251J4066
$$ 147714 149368 153959 162927 174468 185861 196762 208952 223108 237626 251135 264386 278452
54719B78452J4003J1992R092O175K794r49l740n238o894r297j0728r804p750o335
$$ 278452 292455 304447 313539 319714 322508 321559 317819 312581 305687 296390 285662 275858 268108 261773
54705B61773n299l683k301k578l820l890k282n26L44R77K183L816N488P160Q717
$$ 261773 256474 252791 250490 247912 244092 240202 237920 237394 237738 238715 240898 244714 250202 257362 266079
54690B66079R770J0276J0736J1633J3038J4655J6005J6793J7400J8586K0370K1741
$$ 266079 275849 286125 296861 308494 321532 336187 352192 368985 386385 404971 425341 447082
54678D47082K1873K0933J9257J6630J3007Q974M611j111q546j5781k0274k1715
$$ 447082 468955 489888 509145 525775 538782 547756 552367 551256 542710 526929 506655 484940
54666D84940k1868k1896k1415k0220j9264j9217j9198j7849j5130j2274j0326
$$ 484940 463072 441176 419761 399541 380277 361060 341862 324013 308883 296609 286283
54655B86283r302q742q435q323q023p043n611m787n137n682m929k815q16J2J02
$$ 286283 276981 268239 259804 251481 243458 236415 230804 226017 220880 215198 210269 207454 206638 206650 206752
54640B06752K40L29r6r25j725k425l034l211k727k064j878k127k141j422q3J241
$$ 206752 206992 207321 207225 206300 204575 202150 199116 195905 193178 191114 189236 187109 184968 183546 183463 184704
54624A84704J802J379P36Q99J805K231J357j24q21j47J210K003J556N48N35K121
$$ 184704 186506 187885 188621 189520 191325 193556 194913 194789 193968 193821 195031 197034 198590 199138 199673 201794
54608B01794L930M261L438L244M263N220N060M188L352K907L481N634Q178Q701
$$ 201794 205724 209985 213423 216667 220930 226150 231210 235398 238750 241657 245138 250772 258950 267651
54594B67651O598L868K085O95n70NL296O886Q019P535Q204J0288J1649J1619J1627
$$ 267651 274249 278117 280202 280897 280327 280332 283628 290514 298533 306068 314272 324560 336209 347828 359455
54579C59455J2123J2021J1692J3429J7764K1889K3263K2841K2987K3903K4041
$$ 359455 371578 383599 395291 408720 426484 448373 471636 494477 517464 541367 565408
54568E65408K3011K1892K0940J8758J4087P390K49o190j1889j7286k2230k5640
$$ 565408 588419 610311 631251 650009 664096 671486 671735 665545 653656 636370 614140 588500
54556E88500k6478k5136k3331k2425k2148k1377j9759j8011j6683j5323j3178
$$ 588500 562022 536886 513555 491130 468982 447605 427846 409835 393152 377829 364651
54545C64651j0508q589q279q968r394r262r307r752r598q032n846m602m692n066
$$ 364651 354143 345554 337275 328307 318913 309651 300344 290592 280994 272962 267116 262514 257822 252756
54531B52756m861m495m782n621o129n928n649n919o297n856m758m343n139n763
$$ 252756 247895 243400 238618 232997 226868 220940 215291 209372 203075 197219 192461 188118 182979 177216
54517A77216m732k800k008k736l365l036k936l974m858l874j480L13N02l40j457
$$ 177216 172484 169684 167676 164940 161575 158539 155603 151629 146771 142897 141417 141730 142232 141892 140435
54502A40435k435k557j184J071K596K555J674J088J065J084O58j29p34p14k52
$$ 140435 138000 135443 134259 135330 137926 140481 142155 143243 144308 145392 146050 145921 145187 144473 144221
54487A44221J43N21J474K935L726L011J616J104J885K979L461L408L494M220N461
$$ 144221 144364 144885 146359 149294 153020 156031 157647 158751 160636 163615 167076 170484 173978 178198 183659
54472A83659O535O872O816P260Q319R081R000Q616Q455Q264Q145R222J1890J4344
$$ 183659 190194 197066 203882 211142 219461 228542 237542 246158 254613 262877 271022 280244 292134 306478
54458C06478J4414J2289R888P886N095P92l929p562r666j0626j0964j1303j1971
$$ 306478 320892 333181 343069 350955 356050 356842 352913 345351 335685 325059 314095 302792 290821
54445B90821j2392j1649j0001q926r262j0133j0192r174p695o223m908m038l912
$$ 290821 278429 266780 256779 247853 238591 228458 218266 209092 201397 195174 190266 186228 182316
54432A82316m299m527m200l672l601m019m027k767p08N88K42q50j190m48M30N76
$$ 182316 178017 173490 169290 165618 162017 157998 153971 151204 150496 151084 151326 150476 149286 148838 149268 149844
54416A49844L3n32l68Q68K576L404K545P16o50j014q46m26N87K203L429L145J497
$$ 149844 149877 149345 148977 149845 152421 155825 158370 159086 158436 157422 156576 156150 156737 158940 162369 165514 167011
54399A67011L2K60K065L766L871K519Q72m47j561k342k366j933j894k157j636
$$ 167011 167043 167303 169368 173134 177005 179524 180396 179949 178388 176046 173680 171747 169853 167696 166060
54384A66060k25M14r31l147m125l287j827j062j473k737l792l403j509M03R79
$$ 166060 165835 166249 165318 162171 158046 154759 152932 151870 150397 147660 143868 140465 138956 139359 140338
54369A40338M79K5J12M64O50K10r41j785j124K92K14j655k492k82K979L988K551
$$ 140338 140817 140842 140954 141418 142068 142278 141337 139552 138428 138720 138934 137279 134787 134505 137484 141472 144023
54352A44023J024N28L96N38J604L120L834L847M136M311L257J826K155M188N536
$$ 144023 145047 145575 145971 146509 148113 151233 155067 158914 163050 167361 170618 172444 174599 178787 184323
54337A84323N208M772N105M792K893Q44J17P5k82l85M53J186M96j010j730j392
$$ 184323 189531 194303 199408 204200 207093 207937 208054 208129 207847 207462 207915 209101 209597 208587 206857 205465
54321B05465j034j348k311l838n632o832o733n588m058k521j352j082j509j587
$$ 205465 204431 203083 200772 196934 191302 184470 177737 172149 168091 165570 164218 163136 161627 160040
54307A60040r53o47j418k187j444M16J402M89j274k316k346k186k343k330j483
$$ 160040 159087 158440 157022 154835 153391 153807 155209 155698 154424 152108 149762 147576 145233 142903 141420
54292A41420k2J130J457J263Q32J51k72O37K834M452L972K262J187J017P82L90
$$ 141420 141398 142528 143985 145248 146080 146231 145959 146596 149430 153882 157854 160116 161303 162320 163102 163492
54276A63492M91O73n0j245j553j130j441k541k886k077j441j469j020J38N46l26
$$ 163492 163983 164656 164606 163361 161808 160678 159237 156696 153810 151733 150292 148823 147803 147941 148487 148161
54260A48161j005p73j104k928m628m503l287k432j732n52K11l86j313j123m85
$$ 148161 147156 146383 145279 142351 137723 133220 129933 127501 125769 125217 125428 125042 123729 122606 122121
54245A22121j106k998m774n799o201n542l506j362p89j496j681n85Q80J683J501
$$ 122121 121015 118017 113243 107444 101243 95701 92195 90833 90044 88548 86867 86282 87162 88845 90346
54230I0346L96j042j690j260r46j456j446M49K908L384J711Q7k94m23j179j872
$$ 90346 90742 89700 88010 86750 85804 84348 82902 83351 86259 89643 91354 91441 91147 90724 89545 87673
54214H7673j631o69N37J934L304L972L551K334Q54l00m71L28J063R77Q10J545
$$ 87673 86042 85373 85910 87844 91148 95120 98671 101005 101859 101559 101088 101416 102479 103456 104266 105811
54198A05811K567K560J756J524J923J545l8j542k021k072k370k517k035j252n45
$$ 105811 108378 110938 112694 114218 116141 117686 117648 116106 114085 112013 109643 107126 105091 103839 103294
54183A03294J91P77N55m72j295j264q67p04o44m92m81n26P1J520K916L314K747
$$ 103294 103485 104262 104817 104345 103050 101786 100919 100215 99571 99079 98598 98072 98143 99663 102579 105893 108640
54166A08640J751P04J44P81K485L933L991K833J289j77j224j240r3J233J663J304
$$ 108640 110391 111095 111239 112020 114505 118438 122429 125262 126551 126374 125150 123910 123817 125050 126713 128017
54150A28017R69Q58N51P3j9L97P20M55l09j327k544l642l795k444k37J277J128
$$ 128017 128986 129844 130395 130468 130449 130846 131566 132021 131712 130385 127841 124199 120404 117960 117723 119000 120128
54133A20128j09j023r04k99j69r00k133l119l084j851l26R4r18k150k299j405
$$ 120128 120019 118996 118092 117793 117624 116724 114591 111472 108388 106537 106211 106305 105387 103237 100938 99533
54117I9533k70Q25J965K704K417J396N21r9j064k168k225p81J000J837J804J744
$$ 99533 99263 100088 102053 104757 107174 108570 109091 108992 107928 105760 103535 102754 103754 105591 107395 109139
54101A09139J886J789J236L78n94j417j707j555j767k792l718l286j753p94j285
$$ 109139 111025 112814 114050 114428 113834 112417 110710 109155 107388 104596 100878 97592 95839 95045 93760
54086I3760k090j715m39J07p74j935j961q84J45L87J04j72k64k73l14n22r16j304
$$ 93760 91670 89955 89516 89623 88849 86914 84953 84069 84214 84601 84705 84533 84269 83996 83682 83160 82244 80940
54068H0940j511j708j978j831p14Q37J378L24j090j161L30K082K901K739K202
$$ 80940 79429 77721 75743 73912 73198 74035 75413 75737 74647 73486 73816 75898 78799 81538 83740
54053H3740J609R33K55k4K83O69L44p22j664j967k235k959l143j357J793L667
$$ 83740 85349 86282 86537 86513 86796 87465 87809 87087 85423 83456 81221 78262 75119 73762 75555 79222
54037G9222K587j39j794j176O43J801J385J18l40P26K025J840O31N51K146L229
$$ 79222 81809 81670 79876 78700 79343 81144 82529 82647 82307 83033 85058 86898 87529 88080 90226 93455
54021I3455K060n4q26l19l42j345j971j508q22o74n98M7J065J859K116J829J296
$$ 93455 95515 95461 94635 94316 93974 92629 90658 89150 88328 87654 87056 87103 88168 90027 92143 93972 95268
54004I5268J174J778K417K186J333R44J345J697J304M95M7M15J597L098L999L627
$$ 95268 96442 98220 100637 102823 104156 105100 106445 108142 109446 109941 109988 110403 112000 115098 119097 122724
53988A22724K277Q90J68L74J580L348M570M440L386K363J695J485K472N110Q025
$$ 122724 125001 125891 126059 126433 128013 131361 135931 140371 143757 146120 147815 149300 151772 156882 164907
53973A64907R026P777O204N896O479P005P596Q802J0155J0461R359P790O942O973
$$ 164907 173933 181710 187914 193810 200289 207294 214890 223692 233847 244308 253667 261457 268399 275372
53959B75372O996O293N293M953N203M842L354J808J174P03p82k681l242k111q34
$$ 275372 282368 288661 293954 298907 304110 308952 312306 314114 315288 315991 315209 312528 309286 307175 306341
53944C06341r16k475m770o734p168n755l970l705m834n471m565k977j885j624
$$ 306341 305425 302950 298180 291446 284278 278523 274553 270848 266014 260543 255978 253001 251116 249492
53930B49492k290l918n637o122n352m574m150l060j118Q0n29j790k094j571j219
$$ 249492 247202 243284 237647 231525 226173 221599 217449 214389 213271 213351 212822 211032 208938 207367 206148
53915B06148r97k46P65J080M40o85k022l408m185l719k296p25O77K035L157L582
$$ 206148 205151 204905 205670 206750 207190 206505 204483 201075 196890 193171 190875 190150 190827 192862 196019 199601
53899A99601L229K451J684J375J798K520K492J203n19j270l36J816L863M315K790
$$ 199601 202830 205281 206965 208340 210138 212658 215150 216353 215834 214564 214228 216044 219907 224222 227012
53884B27012P95M11J871L422L805L728M323N492O635P777Q755Q541O719M805M596
$$ 227012 227807 228218 230089 233511 237316 241044 245367 250859 257494 265271 274026 282567 289286 294091 298687
53869B98687N810O761O812O620O301N154L271J867J693K260K902L404L354K235
$$ 298687 304497 311258 318070 324690 330991 336145 339416 341283 342976 345236 348138 351542 354896 357131
53855C57131O31K04J649L604M424M297M672O025P282P446O939O925P729Q274P151
$$ 357131 357762 357966 359615 363219 367643 371940 376612 382637 389919 397365 404304 411229 418958 427232 434383
53840D34383M102N56j514j402l96m68k230m432n478n071m026l072k515k844m531
$$ 434383 438485 439041 437527 436125 435729 435261 433031 428599 423121 418050 414024 410952 408437 405593 401062
53825D01062o927q449q439q025q336q793q337p529p907r483j0468r675p793o075
$$ 401062 394135 385686 377247 369222 360886 352093 343756 336227 328320 318837 308369 298694 290901 284826
53811B84826n010m680n123n871o107n783n603n616n126m303m406n703o594n835
$$ 284826 279816 275136 270013 264142 258035 252252 246649 241033 235907 231604 227198 221495 214901 209066
53797B09066m330l585l530l221k617k286k134j855j961k896l721l263k215k391
$$ 209066 204736 201151 197621 194400 191783 189497 187363 185508 183547 180651 176930 173667 171452 169061
53783A69061m029n360m982l242j194M99J251N65j059k178j999j144m58K39J586
$$ 169061 165032 159672 154690 151448 150254 150753 152004 152569 151510 149332 147333 146189 145731 145970 147556
53768A47556L425M716M525K743K06j732k042p70J037K251K397J688O65k09p94
$$ 147556 150981 155697 160222 162965 163171 161439 159397 158627 159664 161915 164312 166000 166665 166456 165662
53753A65662j103q32N92L071N272N663M229K667K656M120N303M588K174r1n75
$$ 165662 164559 163727 164319 167390 172662 178325 182554 185221 187877 191997 197300 201888 204062 203971 203396
53738B03396P06K716M786O628P446O459M502L701M839O308O413N560N053M913
$$ 203396 204102 206818 211604 218232 225678 232137 236639 240340 245179 251487 257900 263460 268513 273426
53724B73426M317L407L007K898K060O00m2Q84K351K852J825l93l117n457o656
$$ 273426 277743 281150 284157 287055 289115 289715 289673 290557 292908 295760 297585 297192 294075 288618 281962
53709B81962o611n664l965j737N7K92r23k146k139j073j27m15k079l899m080k211
$$ 281962 275351 269687 265722 263985 264042 264334 263411 261265 259126 258053 257926 257511 255432 251533 247453 245242
53693B45242p8L10p64j343n72M72P56N37K38m13j479k262k450k825l974n137n213
$$ 245242 245164 245474 244710 243367 242795 243267 244023 244560 244798 244385 242906 240644 238194 235369 231395 226258 221045
53676B21045m257l065j886n13P34J068K54j063k034k292k102k116k691l201k511
$$ 221045 216788 213723 211837 211324 212058 213126 213380 212317 210283 207991 205889 203773 201082 197881 195370
53661A95370m70J558K100J126j94p76k58J095K435K748J891R42J001J925K826
$$ 195370 194900 196458 198558 199684 199490 198714 198456 199551 201986 204734 206625 207567 208568 210493 213319
53646B13319L298L374K833J611O40J008K320L044K691K454L211M209M403M040
$$ 213319 216617 219991 222824 224435 225075 226083 228403 231447 234138 236592 239803 244012 248415 252455
53632B52455L902L899L578L342L843M559M385L392K583J962N36j477k372j544
$$ 252455 256357 260256 263834 267176 271019 275578 279963 283355 285938 287900 288436 286959 284587 283043
53618B83043o86j226k014j158J013K602K938K830K632K001J363J614K167J334
$$ 283043 282357 281131 279117 277959 278972 281574 284512 287342 289974 291975 293338 294952 297119 298453
53604B98453j005k904l038k120j137n4Q51M88r85j435K94K293K224O00n61j129
$$ 298453 297448 294544 291506 289386 288249 288195 289046 289534 288549 287114 287408 289701 291925 292525 291964 290835
53588B90835k430m160m269k019R45K878L418K687Q11j149j475J53K051K621K009
$$ 290835 288405 284245 279976 277957 278902 281780 285198 287885 288696 287547 286072 286225 288276 290897 292906
53573B92906J234R37J485L092M988N469L782J317J67R59K660L953M226L616K796
$$ 292906 294140 295077 296562 299654 304642 310111 313893 315210 315377 316336 318996 322949 327175 330791 333587
53558C33587K508K943L659M166M294L996L416L158L862N196O027N827N401N760
$$ 333587 336095 339038 342697 346863 351157 355153 358569 361727 365589 370785 376812 382639 388040 393800
53544C93800O713P025N782L444J650J875L936N992O421N454M420L872L378K929
$$ 393800 400513 407538 413320 416764 418414 420289 424225 430217 436638 442092 446512 450384 453762 456691
53530D56691L163M045M537M066L231K649K080J346J067J655K367K266J555J146
$$ 456691 459854 463899 468436 472502 475733 478382 480462 481808 482875 484530 486897 489163 490718 491864
53516D91864J347J786K205K429J907K70j676k351j110R64K182J881Q26K53O23
$$ 491864 493211 494997 497202 499631 501538 501808 500132 497781 496671 497635 499817 501698 502524 502777 503400
53501E03400J241J048o0r34l31J649L495L815K801J907J959K087J023p40j170
$$ 503400 504641 505689 505629 504695 504364 506013 509508 513323 516124 518031 519990 522077 523100 522360 521190
53486E21190O60L182M350M149L980M271M161L367K796L101L920M969O544Q380
$$ 521190 521850 525032 529382 533531 537511 541782 545943 549310 552106 555207 559127 564096 570640 579020
53472E79020R238Q583P761Q408J0183J1202J0623R809J0602J2999J5111J5415
$$ 579020 588258 596841 604602 613010 623193 634395 645018 654827 665429 678428 693539 708954
53460G08954J4528J4214J4976J5636J5576J5983J7847J9986K0716K0717K2050
$$ 708954 723482 737696 752672 768308 783884 799867 817714 837700 858416 879133 901183
53449I01183K4569K5727K4487K3102K3912K6361K8570L0244L2182L4145L5152
$$ 901183 925752 951479 975966 999068 1022980 1049341 1077911 1108155 1140337 1174482 1209634
53438A209634L5289L5494L5794L5390L4267L3325L2860L2289L1590L1754L3214
$$ 1209634 1244923 1280417 1316211 1351601 1385868 1419193 1452053 1484342 1515932 1547686 1580900
53427A580900L4729L4592L2679L0707L0366L1318L1484K9569K6932K6146K7825
$$ 1580900 1615629 1650221 1682900 1713607 1743973 1775291 1806775 1836344 1863276 1889422 1917247
53416A917247K9994L0818L0678L0820L1141L0545K8698K6283K3913K1834K0257
$$ 1917247 1947241 1978059 2008737 2039557 2070698 2101243 2129941 2156224 2180137 2201971 2222228
53405B222228J8977J7037J3837J0247P610N898M037J717l76k178m746q651j2808
$$ 2222228 2241205 2258242 2272079 2282326 2289936 2295834 2299871 2301588 2301212 2299034 2294288 2285637 2272829
53392B272829j5468j5939j5074j4466j5229j7147j8936j9694j9988k0999k2843
$$ 2272829 2257361 2241422 2226348 2211882 2196653 2179506 2160570 2140876 2120888 2099889 2077046
53381B077046k4383k4666k4000k3568k4257k5738k6433k4905k1700j9162j8710
$$ 2077046 2052663 2027997 2003997 1980429 1956172 1930434 1904001 1879096 1857396 1838234 1819524
53370A819524j8862j7073j3003q765o160m977m111l044j861q17k17Q3J158L983
$$ 1819524 1800662 1783589 1770586 1761821 1755661 1750684 1746573 1743529 1741668 1740851 1740634 1740717 1741875 1745858
53356A745858P773J0462J1227J1391J2305J3600J4297J4730J6185J9149K2960
$$ 1745858 1753631 1764093 1775320 1786711 1799016 1812616 1826913 1841643 1857828 1876977 1899937
53345A899937K6730K9889L2032L3169L4026L5406L7298L9150M0915M3269M6628
$$ 1899937 1926667 1956556 1988588 2021757 2055783 2091189 2128487 2167637 2208552 2251821 2298449
53334B298449N0461N3675N5559N6396N7286N9144O1609O3303O3470O3131O4020
$$ 2298449 2348910 2402585 2458144 2514540 2571826 2630970 2692579 2755882 2819352 2882483 2946503
53323B946503O6545O9385P1143P1768P2138P2697P2909P1826O9011O4968O0882
$$ 2946503 3013048 3082433 3153576 3225344 3297482 3370179 3443088 3514914 3583925 3648893 3709775
53312C709775N7694N5249N2492M8642M3959L9155L4400K9317K3726J7805J1536
$$ 3709775 3767469 3822718 3875210 3923852 3967811 4006966 4041366 4070683 4094409 4112214 4123750
53301D123750M748k144q217j3359j8709k5125l1789l7338m1933m6924n2432n6640
$$ 4123750 4128498 4126354 4118137 4104778 4086069 4060944 4029155 3991817 3949884 3902960 3850528 3793888
53289C793888n8090n7708n7705n9107o1060o2168o1786o0240n8322n6590n4991
$$ 3793888 3735798 3678090 3620385 3561278 3500218 3438050 3376264 3316024 3257702 3201112 3146121
53278C146121n3258n1601n0362m9174m7412m5669m5477m6990m8134m7178m4990
$$ 3146121 3092863 3041262 2990900 2941726 2894314 2848645 2803168 2756178 2708044 2660866 2615876
53267B615876m3355m2007l9265l5160l1873l0651l0108k8339k5370k2610k0934
$$ 2615876 2572521 2530514 2491249 2456089 2424216 2393565 2363457 2335118 2309748 2287138 2266204
53256B266204k0284k0445k1109k1553k1126k0074j9357j9595k0391k0658j9560
$$ 2266204 2245920 2225475 2204366 2182813 2161687 2141613 2122256 2102661 2082270 2061612 2042052
53245B042052j7401j5500j4817j4688j3454j0427o615l413j285M9R70K091M269
$$ 2042052 2024651 2009151 1994334 1979646 1966192 1955765 1949150 1945737 1944452 1944501 1945471 1947562 1951831
53232A951831P573J0563J1584J0849J0581J2748J6973K1014K3221K4100K5298
$$ 1951831 1959404 1969967 1981551 1992400 2002981 2015729 2032702 2053716 2076937 2101037 2126335
53221B126335K7353K9090K9391K8689K8032K7316K5745K3750K2886K3337K2956
$$ 2126335 2153688 2182778 2212169 2240858 2268890 2296206 2321951 2345701 2368587 2391924 2414880
53210B414880J9764J4467R447N897L087jl607p489j1106j3528j4339j4832j7041
$$ 2414880 2434644 2449111 2458558 2464455 2467542 2467541 2463934 2456445 2445339 2431811 2417472 2402640 2385599
53197B385599k1091k4598k5440k4350k3909k5613k8786l1881l3789l4138l3350
$$ 2385599 2364508 2339910 2314470 2290120 2266211 2240598 2211812 2179931 2146142 2112004 2078654
53186B078654l2653l3200l4827l6158l6021l4380l1966k9747k8664k8955k9423
$$ 2078654 2046001 2012801 1977974 1941816 1905795 1871415 1839449 1809702 1781038 1752083 1722660
53175A722660k8488k6396k5337k6513k8171k7736k5253k3201k3140k4011k3933
$$ 1722660 1694172 1667776 1642439 1615926 1587755 1560019 1534766 1511565 1488425 1464414 1440481
53164A440481k2364k0134j8348j7627j7684j7394j6048j4517j4160j4601j4115
$$ 1440481 1418117 1397983 1379635 1362008 1344324 1326930 1310882 1296365 1282205 1267604 1253489
53153A253489j2443j1545j2677j4507j5361j5835j7423j9655k0630j9960j9184
$$ 1253489 1241046 1229501 1216824 1202317 1186956 1171121 1153698 1134043 1113413 1093453 1074269
53142A074269j9282j9603j9452j9145j8952j8271j6613j4571j3329j3607j5239
$$ 1074269 1054987 1035384 1015932 996787 977835 959564 942951 928380 915051 901444 886205
53131H86205j7137j7799j6711j5277j5381j6978j8150j7656j6291j5424j5312
$$ 886205 869068 851269 834558 819281 803900 786922 768772 751116 734825 719401 704089
53120G04089j5451j5552j5469j4897j3834j2791j2059j1254r999q524p179o050
$$ 704089 688638 673086 657617 642720 628886 616095 604036 592782 582783 574259 567080 561030
53108E61030n339n446o160o472n815m898m727n352o075o423o329n835n234n064
$$ 561030 555691 550245 544085 537613 531798 526900 522173 516821 510746 504323 497994 492159 486925 481861
53094D81861n420n694n562n580o184o620n806l996k547k172k291k255k362l210
$$ 481861 476441 470747 465185 459605 453421 446801 440995 436999 434452 432280 429989 427734 425372 422162
53080D22162m619n668n702m949m089l378k392p70R69J699R45n25j499j505j083
$$ 422162 417543 411875 406173 401224 397135 393757 391365 390595 391564 393263 394208 393683 392184 390679 389596
53065C89596j092j901l066l710l379k520j864j598j589k131l501m752m136j399
$$ 389596 388504 386603 383537 379827 376448 373928 372064 370466 368877 366746 363245 358493 354357 352958
53051C52958J255J389r48l499m497m179l703l451k827j466j23n9j412k621k119
$$ 352958 354213 355602 354654 351155 346658 342479 338776 335325 332498 331032 330909 330850 329438 326817 324698
53036C24698l38P50J97r12j304j202j378j532p76P61J978K346K388K755L506M281
$$ 324698 324360 325110 325307 324395 323091 321889 320511 318979 318203 318964 320942 323288 325676 328431 331937 336218
53020C36218M413L139M74k223l330k700j628j159j217j420j873k790l929m770
$$ 336218 340631 343770 344244 342021 338691 335991 334363 333204 331987 330567 328694 325904 321975 317205
53006C17205m979m505l582k694k199j944j526r17n12o71j504k889m366n241n285
$$ 317205 312226 307721 304139 301445 299246 297302 295776 294859 294347 293676 292172 289283 284917 279676 274391
52991B74391n042m884m240k568p65m13j653k949l191k868k719k497j858j499k205
$$ 274391 269349 264465 260225 257657 256892 256479 254826 251877 248686 245818 243099 240602 238744 237245 235040
52976B35040l266l167j769o32q84j676j466l24L9j423l500m124k966j730j779
$$ 235040 231774 228607 226838 226206 225322 223646 222180 221856 221895 220472 216972 212848 209882 208152 206373
52961B06373k389k088r51m61j236k167k075j260q64j333k122k536k281j476m68
$$ 206373 203984 201896 200945 200484 199248 197081 195006 193746 192882 191549 189427 186891 184610 183134 182666
52946A82666M08J105J611J555O30m58l64J140K475K055K82j072j083l21M83J361
$$ 182666 183074 184179 185790 187345 187975 187517 187153 188293 190768 192823 193105 192033 190950 190629 191112 192473
52930A92473K418L068K521P18j537l092l033j288J074K417J948M21p42r71q29
$$ 192473 194891 197959 200480 201198 199661 196569 193536 192248 193322 195739 197687 198108 197366 196395 195566
52915A95566q80p91J59J884L278L339K214R38L64O10J303J929J962J210K28n7
$$ 195566 194686 193895 194054 195938 199216 202555 204769 205707 206071 206681 207984 209913 211875 213085 213313 213256
52899B13256P23K065L263L918L746K648J294R24J863K927L054K917L803N342N746
$$ 213256 213979 216044 219307 223225 226971 229619 230913 231837 233700 236627 239681 242598 246401 251743 257489
52884B57489M371K674K163K625L038L156L335L551L513L248K895K369J993K656
$$ 257489 261860 264534 266697 269322 272360 275516 278851 282402 285915 289163 292058 294427 296420 299076
52870B99076M478N899N343L318J638Q94J66q49j194m99J52q0n30m85n96j626k731
$$ 299076 303554 309453 314796 318114 319752 320646 320812 319963 318769 318270 318422 318342 317812 317327 316731 315105 312374
52853C12374k481j005K56O35O89P57M46k23m48J07O27K42q11j576j378k47J170
$$ 312374 309893 308888 309144 309779 310468 311225 311671 311448 311000 311107 311734 311976 311165 309589 308211 307964 309134
52836C09134J864J222j85j059p63J48Q94J249J329J196R46N74k72j625k298q98
$$ 309134 310998 312220 312035 310976 310213 310361 311255 312504 313833 315029 315975 316549 316277 314652 312354 311456
52820C11456J839L196J890J23Q39L754N771M882K152k20j146p19M91J489J260
$$ 311456 313295 316491 318381 318504 319343 323097 328868 333750 335902 335682 334536 333817 334308 335797 337057
52805C37057j3q34k31R14J016j86j506j857j236l48J65Q2l24n52m51m42q98j502
$$ 337057 337044 336210 335979 336893 337909 337723 336217 334360 333124 332776 332941 333023 332699 332147 331696 331254 330356 328854
52787C28854j665j419j329j480j094M45K604M223M814M821M508L347J041j330
$$ 328854 327189 325770 324441 322961 321867 322312 324916 329139 333953 338774 343282 346629 347670 346340
52773C46340k090r74M87Q74M69L53O85P75M86M47Q60J073O42O2jL61N22J05p26
$$ 346340 344250 343276 343763 344637 345106 345459 346144 346919 347405 347852 348712 349785 350427 350489 350488 350849 351371 351476 350750
52754C50750j405j306m97m1q88k335k602j224K29L73k75n98o59r61r94k10L15
$$ 350750 349345 348039 347542 347501 346613 344278 341676 340452 340681 341054 340779 340181 339522 338561 337567 337357 337672
52737C37672r09l225m482m233m233n395o371n985n053m549l837k315j213j751
$$ 337672 336763 333538 329056 324823 320590 315195 308824 302839 297786 293237 289400 287085 285872 284121
52723B84121k809k618j918k956n630p219o251m340l448l373l073k682k783k921
$$ 284121 281312 278694 276776 273820 268190 260971 254720 250380 246932 243559 240486 237804 235021 232100
52709B32100k338j430j180j719k480l204l737l431j972m54m30j998l760m572m413
$$ 232100 229762 228332 227152 225433 222953 219749 216012 212581 210609 210155 209725 207727 203967 199395 194982
52694A94982l616k321q15K76M91k47j840l872n383n491m314k814j688r63n40m95
$$ 194982 191366 189045 188230 188506 188997 188750 186910 183038 177655 172164 167850 165036 163348 162385 161845 161350
52678A61350p44r95j105j093q47l14J13mm66p65r45j490k387l099l448l795m177
$$ 161350 160606 159611 158506 157413 156566 156252 156365 156361 155895 155130 154185 152695 150308 147209 143761 139966 135789
52661A35789m030k972j150J142L481M823M051J453j135k165j749q55j4O65R43
$$ 135789 131759 128787 127637 128779 132260 137083 141134 142587 141452 139287 137538 136683 136669 137334 138277
52646A38277P88P43J239J794J599O57k19n01n11r64k142l468l789k396R3K182
$$ 138277 139065 139808 141047 142841 144440 145097 144878 144377 143866 142902 140760 137292 133503 131107 131200 133382
52630A33382L015L047L035L055K782K187J401M19n81r92m23O46J350J341R00M69
$$ 133382 136397 139444 142479 145534 148316 150503 151904 152323 151742 150750 150327 150973 152323 153664 154564 155033
52614A55033M45R56J542J490R79J203K769M538M869L667K245J443Q39j40j198
$$ 155033 155478 156434 157976 159466 160445 161648 164417 168955 173824 177491 179736 181179 182018 181878 180680
52599A80680j610j138j94N30N39j14p83p30K41J667K715K584J078r81k392k826
$$ 180680 179070 177932 177738 178268 178807 178693 177910 177180 177421 179088 181803 184387 185465 184484 182092 179266
52583A79266l056l589l839l134j873r42n35l72m47o88l72R57K411K806K496K800
$$ 179266 176210 172621 168782 165648 163775 162833 162298 161926 161479 160791 160419 161376 163787 166593 169089 171889
52567A71889L740L854K492P33m27j410k784l891l847l024k453k384k354k249k265
$$ 171889 175629 179483 181975 182708 182281 180871 178087 174196 170349 167325 164872 162488 160134 157885 155620
52552A55620k119j319j46N26M20J28J38K63K82N75J637L169M036L221Q83j550
$$ 155620 153501 152182 152036 152562 152982 153110 153248 153511 153793 154368 156005 159174 163210 166431 167314 165764
52536A65764k467j480L39J662K185K452K677K348J159j18k16J098K597L010K522
$$ 165764 163297 161817 162156 163818 166003 168455 171132 173480 174639 174521 174305 175403 178000 181010 183532
52521A83532K355K905L097K004M85K96J783L357L483K473J727J821J981J363J59
$$ 183532 185887 188792 191889 193893 194378 194674 196457 199814 203297 205770 207497 209318 211299 212662 212821
52506B12821p50q30k35O89J770K735K967K036M40o97q31m44n6O17K017L652M413
$$ 212821 212071 211241 211006 211695 213465 216200 219167 221203 221643 220946 220115 219671 219615 220232 222249 225901 230314
52489B30314L862K591J323L05l58m02L40J665L068L807L116R99j236k026j290
$$ 230314 234176 236767 238090 238395 238037 237635 237975 239640 242708 246515 249631 250630 249394 247368 246078
52474B46078m17l59n01J07J263K077K329K517K867L110L120K992K527J444K34
$$ 246078 245661 245302 244801 244908 246171 248248 250577 253094 255961 259071 262191 265183 267710 269154 269388
52459B69388k5R62K139K456K217K352K742K341R85m6P7K52j006l118l958k808
$$ 269388 269363 270325 272464 274920 277137 279489 282231 284572 285557 285511 285588 285840 284834 281716 277758 274950
52443B74950j255p54q26n53m99j543k779k452p14M58K31N1J224K928L558K894
$$ 274950 273695 272941 272115 271562 271063 269520 266741 264289 263575 264033 264264 264315 265539 268467 272025 274919
52427B74919J845R64K55j19Q8O68J262J761J973J524O96N25J200J276l35k254
$$ 274919 276764 277728 277983 277864 277952 278620 279882 281643 283616 285140 285836 286361 287561 288837 288502 286248
52411B86248k159l5J733J671Q94R51J577J553P14r2l84k91J62J007J818K111K124
$$ 286248 284089 284054 285787 287458 288352 289303 290880 292433 293147 293055 292671 292380 292542 293549 295367 297478 299602
52394B99602K397K660K029M90o97m89O22J249P67j39l61M86J771K445K015R16
$$ 299602 301999 304659 306688 307178 306481 305992 306614 307863 308630 308491 308130 308616 310387 312832 314847 315763
52378C15763k8n40r40j433j674j307n34O8N2p17j969k863k445p64Q44J247Q78
$$ 315763 315735 315195 314255 312822 311148 309841 309307 309375 309427 308710 306741 303878 301433 300669 301513 302760 303638
52361C03638R73J722K184J846J270Q98L49o41j424j351p52l29n6N23J348J915
$$ 303638 304611 306333 308517 310363 311633 312531 312880 312239 310815 309464 308712 308383 308327 308850 310198 312113
52345C12113K065K068K106K173K158J559k42k756m093k993p02M31Jj87Q96J891
$$ 312113 314178 316246 318352 320525 322683 324242 324000 321244 317151 314158 313456 313887 313888 313701 314597 316488
52329C16488J078j091k496j818L76K588L725L626K910K264J750R58m7m86J20J129
$$ 316488 317566 316475 313979 312161 312537 315125 318850 322476 325386 327650 329400 330358 330311 329825 329945 331074
52313C31074J548J282J171J796K702K884J920N89K69J547L431M309L706K727K652
$$ 331074 332622 333904 335075 336871 339573 342457 344377 344966 345235 346782 350213 354522 358228 360955 363607
52298C63607L582M576M750L861K327J061J011K328M037M899M630M130M459N737
$$ 363607 367189 371765 376515 380376 382703 383764 384775 387103 391140 396039 400669 404799 409258 414995
52284D14995P052P372O596N527M860M458L904L413L664M764N988O685O976P333
$$ 414995 422047 429419 436015 441542 446402 450860 454764 458177 461841 466605 472593 479278 486254 493587
52270D93587P777P730O630M772L456L919N858P553P977Q096R235J0789J0964R609
$$ 493587 501364 509094 515724 520496 523952 527871 533729 541282 549259 557355 566590 577379 588343 597952
52256E97952Q743R908J2425J4798J6553J7861J8503J8323J7971J8154J8718J9286
$$ 597952 606695 616603 629028 643826 660379 678240 696743 715066 733037 751191 769909 789195
52244G89195K0248K2207K4803K6995K8226K8707K8876K9263L0335L1779L2376
$$ 789195 809443 831650 856453 883448 911674 940381 969257 998520 1028855 1060634 1093010
52233A093010L1418K9922K9551L0664L2194L3154L3320L2774L1610L0098K8350
$$ 1093010 1124428 1154350 1183901 1214565 1246759 1279913 1313233 1346007 1377617 1407715 1436065
52222A436065K6074K3346K1210K0490K0357J9217J6864J4543J2887J1234R230
$$ 1436065 1462139 1485485 1506695 1527185 1547542 1566759 1583623 1598166 1611053 1622287 1631517
52211A631517P680P140O808N638L608J187j503m007m974l681j585q70j593j800
$$ 1631517 1639197 1646337 1653145 1658783 1662391 1663578 1662075 1658068 1653094 1649413 1647828 1646958 1645365 1643565
52197A643565o62J66p26j823l99L585P204Q456Q808J0752J4021J5991J5589J4996
$$ 1643565 1642903 1643069 1642343 1640520 1640121 1643706 1650910 1659366 1668174 1678926 1692947 1708938 1724527 1739523
52183A739523J6767K0389K2868K2325K0008J8700J9785K2171K3657K2970K0528
$$ 1739523 1756290 1776679 1799547 1821872 1841880 1860580 1880365 1902536 1926193 1949163 1969691
52172A969691J7576J5006J3065J1667J0532R245P670O122M689K669n44m242p130
$$ 1969691 1987267 2002273 2015338 2027005 2037537 2046782 2054452 2060574 2065263 2067932 2067388 2063146 2056016
52159B056016r135j1326j3826j5285j5042j4450j4978j6209j6950j7360j8402
$$ 2056016 2046881 2035555 2021729 2006444 1991402 1976952 1961974 1945765 1928815 1911455 1893053
52148A893053j9798k0215j9319j8066j7047j5942j4782j4244j4296j3863j2407
$$ 1893053 1873255 1853040 1833721 1815655 1798608 1782666 1767884 1753640 1739344 1725481 1713074
52137A713074j0714r520q394o820n458n366o371p000n938l208l34O05j239m178
$$ 1713074 1702360 1692840 1684446 1677626 1672168 1666802 1660431 1653431 1647493 1644285 1643951 1644556 1643317 1639139
52123A639139n324l797j832j869l504m547m361m366n187n421m134k987m223p258
$$ 1639139 1633815 1630018 1628186 1626317 1622813 1618266 1613905 1609539 1604352 1598931 1594797 1591810 1587587 1580329
52109A580329r099q247o521o456q062r281q860p582o710o323n632m271k879k471
$$ 1580329 1571230 1562983 1556462 1550006 1541944 1532663 1523803 1516221 1509511 1503188 1497556 1493285 1490406 1487935
52095A487935l427n064o313o860p245p667p376n860m020l222l420l419k806k447
$$ 1487935 1484508 1479444 1473131 1466271 1459026 1451359 1443983 1438123 1434103 1430881 1427461 1424042 1421236 1418789
52081A418789k850l292l074k625k794l790n174o157n698l439r11l45j712k333
$$ 1418789 1415939 1412647 1409573 1406948 1404154 1400364 1395190 1389033 1383335 1379896 1378985 1378640 1376928 1374595
52067A374595n83J513R02k234m692m177j355J715L593L912L201K590K845L690
$$ 1374595 1374012 1375525 1376427 1374193 1369501 1365324 1363969 1365684 1369277 1373189 1376390 1378980 1381825 1385515
52053A385515M803O942J0832J5254J7796J7635J6500J6554J8436K1457K4606K7059
$$ 1385515 1390318 1397260 1408092 1423346 1441142 1458777 1475277 1491831 1510267 1531724 1556330 1583389
52041A583389K8537K9643L1268L3682L6564L9544M2048M3037M2086M0368L9427
$$ 1583389 1611926 1641569 1672837 1706519 1743083 1782627 1824675 1867712 1909798 1950166 1989593
52030A989593L9165L8244L6170L3644L1069K8302K5758K4152K2934K0640J7130
$$ 1989593 2028758 2067002 2103172 2136816 2167885 2196187 2221945 2246097 2269031 2289671 2306801
52019B306801J3822J1324Q633N218K110o1k363n717r209j1566j3115j4819j6330
$$ 2306801 2320623 2331947 2340580 2345798 2347908 2347847 2345484 2339767 2330558 2318992 2305877 2291058 2274728
52006B274728j6580j5615j4464j3664j3118j3000j3460j3682j2492r990p606o314
$$ 2274728 2258148 2242533 2228069 2214405 2201287 2188287 2174827 2161145 2148653 2138663 2131057 2124743
51994B124743n493l821r17K232M309N067N469O412P723Q859R905J1001J1463J0819
$$ 2124743 2119250 2115429 2114512 2116744 2121053 2126120 2131589 2138001 2145724 2154583 2164488 2175489 2186952 2197771
51980B197771J0309J1411J3028J2318Q795N416M545M940M116J831n44k491m257
$$ 2197771 2208080 2219491 2232519 2244837 2253632 2259048 2263593 2268533 2272649 2274480 2273936 2271445 2267188
51967B267188n588o484q152j1288j4460j6199j7596k0390k3474k4188k2726k2201
$$ 2267188 2261600 2255116 2246964 2235676 2221216 2205017 2187421 2167031 2143557 2119369 2096643 2074442
51955B074442k4029k6232k7129k7922l0075l2398l2801l1532l0788l1785l3715
$$ 2074442 2050413 2024181 1997052 1969130 1939055 1906657 1873856 1842324 1811536 1779751 1746036
51944A746036l5102l5135l4048l3076l3609l5680l7742l8538l8555l8926l9605
$$ 1746036 1710934 1675799 1641751 1608675 1575066 1539386 1501644 1463106 1424551 1385625 1346020
51933A346020l9505l7996l5478l2865l1272l1767l4383l7436l8640l7181l4293
$$ 1346020 1306515 1268519 1233041 1200176 1168904 1137137 1102754 1065318 1026678 989497 955204
51922I55204l1755l0253k9130k7424k4993k2713k1541k1429k1530k1418k1371
$$ 955204 923449 893196 864066 836642 811649 788936 767395 745966 724436 703018 681647
51911F81647k1256k0065j7433j4902j4414j5637j6042j4013j0807q907r183j0481
$$ 681647 660391 640326 622893 607991 593577 577940 561898 547885 537078 528171 518988 508507
51899E08507j1404j1479j0801r590q362p774p807p657o683n113l531k258j592
$$ 508507 497103 485624 474823 465233 456871 449097 441290 433633 426950 421837 418306 416048 414456
51886D14456j925l014l704l288k695l331n031o262o292n882n699n366m557l821
$$ 414456 412531 409517 405813 402525 399830 396499 391468 385206 378914 373032 367333 361967 357410 353589
51872C53589l594l467l090k877k981k608j356l68q48k182k843k629k525k724k488
$$ 353589 349995 346528 343438 340561 337580 334972 333616 333248 332400 330218 327375 324746 322221 319497 317009
51857C17009j852j805k424k417j246k88r67k684l759l701l406l408l179k350j720
$$ 317009 315157 313352 310928 308511 307265 306977 306010 303326 299567 295866 292460 289052 285873 283523 281803
51842B81803k372m081n244m638k840j467j279j706k262l310m834n470m043j580
$$ 281803 279431 275350 270106 265468 262628 261161 259882 258176 255914 252604 247770 242300 238257 236677
51828B36677m39j326k533k358j129k49k30n80r06j228j437j321j094j250j769
$$ 236677 236238 234912 232379 230021 228892 228643 228413 227833 226927 225699 224262 222941 221847 220597 218828
51813B18828j869q78P50J627Q98n76r59L88K116K646K175K062K696L089K576J636
$$ 218828 216959 216081 216831 218458 219356 218780 217821 218209 220325 222971 225146 227208 229904 232993 235569 237205
51797B37205Q01j23j118j268J50K485M367N094M719L412J560J81K05J364K456
$$ 237205 238006 237883 236765 235497 235647 238132 242499 247593 252312 255724 257284 257465 257670 259034 261490
51782B61490K665K170J514R96O75L87k33j221j826j205L22J422J371P95M14j00
$$ 261490 264155 266325 267839 268835 269510 269897 269664 268443 266617 265412 265734 267156 268527 269322 269736 269636
51766B69636j217k072j314O56J573J31k049k300k28K065K790K268J616R22m05
$$ 269636 268419 266347 265033 265689 267262 267393 265344 263044 262816 264881 267671 269939 271555 272477 272072
51751B72072k185l350l172j957n90J02k10j137j815j698j022l25J26K29o2k82
$$ 272072 269887 266537 263365 261408 260818 260920 260710 259573 257758 256060 255038 254713 254839 255068 255006 254724
51735B54724L37J691K431J626J82m39k28j10m6O80J418N59j584k325j63K905M013
$$ 254724 255061 256752 259183 260809 260991 260552 260324 260214 260168 260848 262266 262825 261241 258916 258753 261658 265671
51718B65671L097K127J743P25j344k957k808j541n38l0O35J544K014J662R09L50
$$ 265671 268768 270895 272638 273363 272019 269062 266254 264713 264175 264145 264780 266324 268338 270000 270909 271259
51702B71259K03M47J078J908K398K102J313R24J528K777L906M644N243N746N769
$$ 271259 271462 271909 272987 274895 277293 279395 280708 281632 283160 285937 289843 294487 299730 305476 311245
51687C11245N141M389M188M629N271N801O305O931P528P714P203O078M733L620
$$ 311245 316386 320775 324963 329592 334863 340664 346969 353900 361428 369142 376345 382423 387156 390776
51673C90776L044L117L624L898L293K073J465K213L404L450K117O20l36j458l287
$$ 390776 393820 396937 400561 404459 407752 409825 411290 413503 416907 420357 422474 423094 422758 421300 418013
51658D18013m735m198j713R52K170J656L9j851l200l442k663j410q2J065J467
$$ 418013 413278 409080 407367 408319 410489 412145 412184 410333 407133 403691 401028 399618 399536 400601 402068
51643D02068N98r69j645m63J655K861K204K52j678k344j074J568L699L694K124
$$ 402068 402666 401697 400052 399589 401244 404105 406309 406561 404883 402539 401465 403033 406732 410426 412550
51628D12550J376K847N298O594O429O279P121Q325Q914Q810Q386P591O105L974
$$ 412550 413926 416773 422071 428665 435094 441373 448494 456819 465733 474543 482929 490520 496625 500599
51614E00599J600n17j842k062j631j490j972k460k499k481k728k606j483K7P18
$$ 500599 502199 501682 499840 497778 496147 494657 492685 490225 487726 485245 482517 479911 478428 478455 479173
51599D79173L75k15o47j224j974k279j735p02J00k5j656m639p519q534p499n868
$$ 479173 479548 479333 478686 477462 475488 473209 471474 470772 470872 470847 469191 464552 457033 448499 441000 435132
51583D35132m733l685k274j500k711n335o836n411k194j95j021l046l367j317
$$ 435132 430399 426714 424440 422940 420229 414894 408058 402647 400453 400258 399237 396191 392824 391507
51569C91507Q65J042j81p76l10k18j364k930l861m007l405j787L73J524P33j002
$$ 391507 392372 393414 393233 392457 392147 391929 390565 387635 383774 379767 376362 374575 374948 376472 377205 376203
51553C76203j993j877j488j291j036o92p56j358j787j267JR11N86n54j176o08
$$ 376203 374210 372333 370845 369554 368518 367826 367070 365712 363925 362658 362659 363570 364156 363602 362426 361818
51537C61818L50O67O06J188K343K817K075J108R54J420J789J878J691R86l6l90
$$ 361818 362168 362835 363441 364629 366972 369789 371864 372972 373926 375346 377135 379013 380704 381690 381654 381264
51521C81264N14J893K546K233J426L61q24j515j122R0J335K079K076J184q6n13
$$ 381264 381778 383671 386217 388450 389876 390237 389413 387898 386776 386866 388201 390280 392356 393540 393454 392941
51505C92941M48J695J736N19q24j575j828j656r68L3J091K308L495L634K194N88
$$ 392941 393389 395084 396820 397339 396515 394940 393112 391456 390488 390521 391612 393920 397415 401049 403243 403831
51489D03831Q86L027M601L755J206r47j458n87O20J215R40L77J81K57J81J97R32
$$ 403831 404717 407744 412345 416100 417306 416359 414901 414314 414934 416149 417089 417466 417647 417904 418085 418282 419214
51472D19214K117K592J806M84l90n34k5J140K656L726L724K757J486P06J011K202
$$ 419214 421331 423923 425729 426213 425823 425289 425264 426404 429060 432786 436510 439267 440753 441459 442470 444672
51456D44672L021K299M14j162j831k310l025l245k460j492j393k033k635l003
$$ 444672 447693 449992 450406 449244 447413 445103 442078 438833 436373 434881 433488 431455 428820 425817
51442D25817l302l151k128r00q78k551m814n948n010k460L2O98o63k268k216o75
$$ 425817 422515 419364 417236 416336 415458 412907 408093 402145 397135 394675 394707 395405 394742 392474 390258 389583
51426C89583M42m3j243j587p62K69O37M24K79P34J888L442M813N470N274M513
$$ 389583 390025 389982 388739 387152 386390 386659 387296 387720 387999 388733 390621 394063 398876 404346 409620 414133
51410D14133L607K858K440K499L067L971N019O223P596Q619Q248N937K684O36
$$ 414133 417740 420598 423038 425537 428604 432575 437594 443817 451413 460032 468280 474217 476901 477537
51396D77537J150L300M635L529P56j494j982j445j299j806k007j230j1O51M48
$$ 477537 478687 481987 486622 490151 490907 489413 487431 485986 484687 482881 480874 479644 479633 480284 480732
51381D80732k6j6O54J392J355L74o76p82K6Q51J190J274J121K72j103j901j602
$$ 480732 480706 480690 481344 482736 484091 484465 483789 483007 483033 483884 485074 486348 487469 487741 486638 484737 483135
51364D83135j331k365m200n166m592l251j886m90Q49J475R16n40k118k998k562
$$ 483135 481804 479439 475239 470073 465481 462230 460344 459854 460703 462178 463094 462554 460436 457438 454876
51349D54876j027K29j65j882l050k247J70K718M064L758K497J669J903K207J322
$$ 454876 453849 454078 453913 452031 448981 446734 446904 449622 453686 457444 459941 461610 463513 465720 467042
51334D67042k36p65P5O75k41k050l443l960l728k900k188k747m604o164o195n326
$$ 467042 466806 466041 466116 466791 466550 464500 461057 457097 453369 450469 448281 445534 440930 434766 428571 423245
51318D23245m613l764k122n46o42k531m821o533p692q246p875o998o651o976o925
$$ 423245 418632 414868 412746 412200 411558 409027 404206 397673 389981 381735 373860 366862 360211 353235 346310
51303C46310n773m118l055l096l987m994n229m409l211k413j820q99l3o4p38j011
$$ 346310 340537 336419 333364 330268 326281 321287 316058 311649 308438 306025 304205 303306 303273 303209 302471 301460
51287C01460q67j351k571l192k536j601j201o62N19J223M81m80L0J206P34j470
$$ 301460 300593 299242 296671 293479 290943 289342 288141 287479 287998 289221 289702 289222 289252 290458 291192 289722
51271B89722k775j586M11P24p17k087k260j584o49L92J345J888K087K430L234
$$ 289722 286947 285361 285772 286496 285779 283692 281432 279848 279199 279591 280936 282824 284911 287341 290575
51256B90575M346N299N460M376K393O60Q1M49J048J489J496N28j361k801k538
$$ 290575 294921 300220 305680 310056 312449 313109 313190 313639 314687 316176 317672 318200 316839 314038 311500
51241C11500j398j348k606l299k437j444j740k365j698m01o32k742m707m968m082
$$ 311500 310102 308754 306148 302849 300412 298968 297228 294863 293165 292764 292132 289390 284683 279715 275633
51226B75633l172k370j603j557k665l971m062k789j288n62o97j153j297q53k68
$$ 275633 272461 270091 268488 266931 264266 260295 256233 253444 252156 251594 250897 249744 248447 247594 247326
51211B47326k66p86r22l39m1q89k098k311j716j689k349k037K21K965L899K504
$$ 247326 247060 246274 245352 245013 244972 244083 241985 239674 237958 236269 233920 231883 232104 235069 238968 241472
51195B41472J77j627k394k136j218o24j338l016m115l765k782k180j485M15L058
$$ 241472 241649 240022 237628 235492 234274 233650 232312 229296 225181 221416 218634 216454 214969 215384 218442
51180B18442M434L466J374L5j22J51M27O99N75l43j278q72P18J579N29j118j227
$$ 218442 222876 226342 227716 227751 227629 227780 228207 228906 229481 229138 227860 226988 227706 229285 229814 228696 227469
51163B27469M52K303L068K959K668K322J803J322J201J429J720J879J918J929
$$ 227469 227921 230224 233292 236251 238919 241241 243044 244366 245567 246996 248716 250595 252513 254442
51149B54442K001K097K019J551O59m76j474j855j382m72Q8N5J8N04J290J924K449
$$ 254442 256443 258540 260559 262110 262769 262293 260819 258964 257582 257110 257198 257253 257271 257775 259065 260989 263438
51132B63438K964L001K083O46m60j166j938k500j970m59N99J81j162k284k646
$$ 263438 266402 269403 271486 272132 271672 270506 268568 266068 264098 263639 264238 264419 263257 260973 258327
51117B58327k111o51Q64O93j720m445n052l477j620n71J65P96M79j031k494k908
$$ 258327 256216 255565 256429 257122 255402 250957 245905 242428 240808 240237 240402 241198 241677 240646 238152 235244
51101B35244k889l315l578k509m75P95M26p22j453j584j596j736j850j793j628
$$ 235244 232355 229040 225462 222953 222478 223273 223699 222977 221524 219940 218344 216608 214758 212965 211337
51086B11337j609j950k455k471j577j78Q80J261J257J178J104J166J427J545J083
$$ 211337 209728 207778 205323 202852 201275 201097 201977 203238 204495 205673 206777 207943 209370 210915 211998
51071B11998K62j93m8K42M06P69J507K239K695L165L739L728K471M13j328k212
$$ 211998 212260 212067 212019 212261 212667 213436 214943 217182 219877 223042 226781 230509 232980 233393 232065 229853
51055B29853k568k798k888k607j763k88J445K594K558J823J567K352L470L658
$$ 229853 227285 224487 221599 218992 217229 216941 218386 220980 223538 225361 226928 229280 232750 236408
51041B36408K316J6j933k427j317O91K722M126M331L001P43q46n04J368L192L885
$$ 236408 238724 238740 236807 234380 233063 233754 236476 240602 244933 247934 248677 247831 247327 248695 251887 255772
51025B55772L761L796M427N038M515K411k80j888j794j011p10q23n94L9M78N80
$$ 255772 259533 263329 267756 272794 277309 279720 279440 277552 275758 274747 274037 273214 272620 272659 273137 273717
51009B73717P58J036Q99K36k85m0P64J394J329P08K26N20J430K192K460K566K478
$$ 273717 274475 275511 276410 276646 276361 276321 277085 278479 279808 280516 280742 281262 282692 284884 287344 289910 292388
50992B92388J433n28j677o18J424K075J147P05J680K519J941J011J211J950J577
$$ 292388 293821 293293 291616 290998 292422 294497 295644 296349 298029 300548 302489 303500 304711 306661 308238
50977C08238J38o78OJ266J938K181K932M366N278M236J342j410k105r92J15K33
$$ 308238 308376 307698 307704 308970 310908 313089 316021 320387 325665 329901 331243 329833 327728 326736 326851 327084
50961C27084p4k67o02r71m92R41K053K128K182L087L889L472K700L059M099M337
$$ 327084 327010 326743 326141 325170 324678 325619 327672 329800 331982 335069 338958 342430 345130 348189 352288 356625
50945C56625M116N291Q070J0333J0586R710R166R099R038R035R180R084Q862R555
$$ 356625 360741 366032 374102 384435 395021 404731 413897 422996 432034 441069 450249 459333 468195 477750
50931D77750J1669J4066J5333J5529J5769J6678J8192K0254K2582K4175K4265
$$ 477750 489419 503485 518818 534347 550116 566794 584986 605240 627822 651997 676262
50920F76262K3675K4159K6286K8879L0817L2491L4954L8340M1829M4937M8167
$$ 676262 699937 724096 750382 779261 810078 842569 877523 915863 957692 1002629 1050796
50909A050796N2303N7532O3397O9315P4891P9907Q4362Q8446R2407R6307J00076
$$ 1050796 1103099 1160631 1224028 1293343 1368234 1448141 1532503 1620949 1713356 1809663 1909739
50898A909739J03507J06060J06994J06200J04739J03724J02515R8905R1664Q2099
$$ 1909739 2013246 2119306 2226300 2332500 2437239 2540963 2643478 2742383 2834047 2916146
50888B916146P2343O2666N1709L9098K6532J5981P733Q00n510j1072j5541j8803
$$ 2916146 2988489 3051155 3102864 3141962 3168494 3184475 3192208 3193008 3187498 3176426 3160885 3142082
50876C142082k0865k1809k1930k1816k2193k3618k6118k9153l2195l5435l9623
$$ 3142082 3121217 3099408 3077478 3055662 3033469 3009851 2983733 2954580 2922385 2886950 2847327
50865B847327m5120n1418n7714o3676o9459p5161q0471q4716q7139q7467q6347
$$ 2847327 2802207 2750789 2693075 2629399 2559940 2484779 2404308 2319592 2232453 2144986 2058639
50854B058639q5008q4137q3132q0753p6473p1017o5565o0810n6832n3409n0013
$$ 2058639 1973631 1889494 1806362 1725609 1649136 1578119 1512554 1451744 1394912 1341503 1291490
50843A291490m5819m0455l4726k9859k5931k2027j8197j6046j6226j6547j4280
$$ 1291490 1245671 1205216 1170490 1140631 1114700 1092673 1074476 1058430 1042204 1025657 1011377
50832A011377r881o423n358m906l197p43J324L482O460R112R764Q818Q136Q465
$$ 1011377 1001496 995073 989715 984809 981612 980869 982193 985675 992135 1001247 1011011 1019829 1027965 1036430
50818A036430R337J0922J3786J7031J8950J9771K1620K5113K8107K8759K8140
$$ 1036430 1045767 1056689 1070475 1087506 1106456 1126227 1147847 1172960 1201067 1229826 1257966
50807A257966K8627L1084L4755L8827M2803M6157M8897N2036N6583O2409O8692
$$ 1257966 1286593 1317677 1352432 1391259 1434062 1480219 1529116 1581152 1637735 1700144 1768836
50796A768836P4939Q1132Q7524R4859J03955J14511J25142J35286J46100J58598
$$ 1768836 1843775 1924907 2012431 2107290 2211245 2325756 2450898 2586184 2732284 2890882
50786B890882J71843J84130J95204K05996K16698K26315K33890K38941K40914
$$ 2890882 3062725 3246855 3442059 3648055 3864753 4091068 4324958 4563899 4804813
50777D804813K39279K34128K25663K13330J96415J75368J51376J24835R5668O5453
$$ 4804813 5044092 5278220 5503883 5717213 5913628 6088996 6240372 6365207 6460875 6526328
50767F526328L7570J4311n216k3216l9872n2969o0636o3271o2568n9599n4714
$$ 6526328 6563898 6578209 6572993 6549777 6509905 6456936 6396300 6333029 6270461 6210862 6156148
50756F156148m8908m4212m2378m3839m8414n6348o7750q1489r5933j10950j27735
$$ 6156148 6107240 6063028 6020650 5976811 5928397 5872049 5804299 5722810 5626877 5515927 5388192
50745E388192j46244j63981j78300j88897j97059k03279k06916k07546k05252
$$ 5388192 5241948 5077967 4899667 4710770 4513711 4310432 4103516 3895970 3690718
50736C690718j99847j91302j80778j69908j58975j47118j34476j22621j12321
$$ 3690718 3490871 3299569 3118791 2948883 2789908 2642790 2508314 2385693 2273372
50727B273372j02341r1463q0563p1532o4832n9356n4304m9832m5764m0934l4610
$$ 2273372 2171031 2079568 1999005 1927473 1862641 1803285 1748981 1699149 1653385 1612451 1577841
50716A577841k8002k3461k1920k1707k0327j7271j4425j3508j3836j3366j1430
$$ 1577841 1549839 1526378 1504458 1482751 1462424 1445153 1430728 1417220 1403384 1390018 1378588
50705A378588r315q227p707o537m319j629Q33K640L702M455N609P276Q766R717
$$ 1378588 1369273 1361046 1353339 1346802 1342483 1340854 1341687 1344327 1348029 1352484 1358093 1365369 1374135 1383852
50691A383852J0998J3785J8074K2665K6450K9129L0957L2534L4808L8475M3300
$$ 1383852 1394850 1408635 1426709 1449374 1475824 1504953 1535910 1568444 1603252 1641727 1685027
50680A685027M8454N3553N8795O4162O9279P4156P9246Q4502Q9210R3291R8015
$$ 1685027 1733481 1787034 1845829 1909991 1979270 2053426 2132672 2217174 2306384 2399675 2497690
50669B497690J04531J12097J18725J23315J26265J28172J28997J28714J27631
$$ 2497690 2602221 2714318 2833043 2956358 3082623 3210795 3339792 3468506 3596137
50660C596137J25417J20751J12784J02361R0827P8022O2602M4232K4397M863j3531
$$ 3596137 3721554 3842305 3955089 4057450 4148277 4226299 4288901 4333133 4357530 4362393 4348862
50649D348862l0152m3733n3298n9275o2776o3981o2198n7404n0916m4380l8754
$$ 4348862 4318710 4274977 4221679 4162404 4099628 4035647 3973449 3916045 3865129 3820749 3781995
50638C781995l4413l1606l0567l1639l5375m2055n0972o0879p1330q2783r4900
$$ 3781995 3747582 3715976 3685409 3653770 3618395 3576340 3525368 3464489 3393159 3310376 3215476
50627C215476j05610j12748j16251j17742j18137j16735j12782j06921j00485
$$ 3215476 3109866 2997118 2880867 2763125 2644988 2528253 2415471 2308550 2208065
50618B208065r4090q7568q0839p4054o7098n9783n2503m5941m0012l3831k7087
$$ 2208065 2113975 2026407 1945568 1871514 1804416 1744633 1692130 1646189 1606177 1572346 1545259
50607A545259k0855j6473j3984j2222j0018o726j956M097J0035J3967J5450J6069
$$ 1545259 1524404 1507931 1493947 1481725 1471707 1464981 1463025 1467122 1477157 1491124 1506574 1522643
50595A522643J7671K0522K3785K7068L0602L4271L7588M0701M4485M9237N4080
$$ 1522643 1540314 1560836 1584621 1611689 1642291 1676562 1714150 1754851 1799336 1848573 1902653
50584A902653N8119O1703O6072P1945P8871Q5665R1181R4881R7006R8164R8782
$$ 1902653 1960772 2022475 2088547 2160492 2239363 2325028 2416209 2511090 2608096 2706260 2805042
50573B805042R9104R9583J00405J00330R6879Q8726P7598O6952N8515N0856M1493
$$ 2805042 2904146 3003729 3104134 3204464 3301343 3390069 3467667 3534619 3593134 3643990 3685483
50562C685483K9794J7471O594k289j0041j7298k3336k6879k7912k7920k7939k7041
$$ 3685483 3715277 3732748 3739342 3737053 3727012 3709714 3686378 3659499 3631587 3603667 3575728 3548687
50550C548687k3681j8281j3268j0393q964p250m705k252j061j852m770r131j3779
$$ 3548687 3525006 3506725 3493457 3483064 3474100 3466850 3462145 3459893 3458832 3456980 3452210 3443079 3429300
50537C429300j8549k5080l5015m7448n9168o7778p3788p9292q5282r0861r4572
$$ 3429300 3410751 3385671 3350656 3303208 3244040 3176262 3102474 3023182 2937900 2847039 2752467
50526B752467r5879r5291r3532r0840q7045q2238p6968p1616o5973n9917n4186
$$ 2752467 2656588 2561297 2467765 2376925 2289880 2207642 2130674 2059058 1993085 1933168 1878982
50515A878982m9661m5983m1818l6637l1370k6792k2290j6953j1329o955m336k253
$$ 1878982 1829321 1783338 1741520 1704883 1673513 1646721 1624431 1607478 1596149 1589194 1584858 1582605
50503A582605O91M539Q292J1397J4372J7862K1455K3940K4989K5962K8288L1380
$$ 1582605 1583296 1587835 1596127 1607524 1621896 1639758 1661213 1685153 1710142 1736104 1764392 1795772
50491A795772L3258L3410L3701L5787L8803M0827M1766M3249M5943M8598N0067
$$ 1795772 1829030 1862440 1896141 1931928 1970731 2011558 2053324 2096573 2142516 2191114 2241181
50480B241181N0874N2029N3432N4405N5192N6956O0417O5363P1412P8547Q6654
$$ 2241181 2292055 2344084 2397516 2451921 2507113 2564069 2624486 2689849 2761261 2839808 2926462
50469B926462R5122J03379J11576J20328J29770J39340J48571J57649J66651J74645
$$ 2926462 3021584 3124963 3236539 3356867 3486637 3625977 3774548 3932197 4098848 4273493
50459D273493J80277J83209J84142J83153J78955J70487J58583J45086J30623
$$ 4273493 4453770 4636979 4821121 5004274 5183229 5353716 5512299 5657385 5788008
50450E788008J14031R3902P0015M3332J5539j1388l5869n7424p6494r3461j08194
$$ 5788008 5902039 5995941 6065956 6109288 6124827 6113439 6077570 6020146 5943652 5850191 5741997
50439E741997j20310j29290j34317j34644j30296j22026j10578r6438q0280o2990
$$ 5741997 5621687 5492397 5358080 5223436 5093140 4971114 4860536 4764098 4683818 4620828
50429D620828m5185k7278j0139M858J6494K3943K6361K3203J5013K997j2496l2120
$$ 4620828 4575643 4548365 4538226 4543084 4559578 4583521 4609882 4633085 4648098 4651095 4638599 4606479
50417D606479n5457p9771j01764j20092j35203j47151j54877j57849j57256j54875
$$ 4606479 4551022 4471251 4369487 4249395 4114192 3967041 3812164 3654315 3497059 3342184
50407C342184j51189j45394j37140j27587j18467j10452j02944r5246q7342p9390
$$ 3342184 3190995 3045601 2908461 2780874 2662407 2551955 2449011 2353765 2266423 2187033
50397B187033p1183o2605n4289m7127m1250l5897l0307k4373j8528j3305q820
$$ 2187033 2115850 2053245 1998956 1951829 1910579 1874682 1844375 1820002 1801474 1788169 1779349
50386A779349m466N37N982J0599J3716J6265J9293K2226K3831K4426K5542K7566
$$ 1779349 1774883 1775420 1781402 1792001 1805717 1821982 1841275 1863501 1887332 1911758 1937300 1964866
50374A964866K9445L0844L2747L5293L6843L6337L5113L4984L5594L5154L3098
$$ 1964866 1994311 2025155 2057902 2093195 2130038 2166375 2201488 2236472 2272066 2307220 2340318
50363B340318L0544K8462K6775K5175K3710K2357K0878J9315J8222J8384K0458
$$ 2340318 2370862 2399324 2426099 2451274 2474984 2497341 2518219 2537534 2555756 2574140 2594598
50352B594598K4477K9334L3374L6107L8951M3576M9900N6338O1586O5487O8413
$$ 2594598 2619075 2648409 2681783 2717890 2756841 2800417 2850317 2906655 2968241 3033728 3102141
50341C102141P0603P1923P1775O9453O5056N9567N3581M6484L7443K6574J4313
$$ 3102141 3172744 3244667 3316442 3385895 3450951 3510518 3564099 3610583 3648026 3674600 3688913
50330C688913M23j5228l1298m5677n7507o7638p7066q5790r3004r7536r8298r5175
$$ 3688913 3689336 3674108 3642810 3597133 3539626 3471988 3394922 3309132 3216128 3118592 3020294 2925119
50318B925119q9480q2658p4706o4768n3111m1252l0093j9198q408R22P110J0020
$$ 2925119 2835639 2752981 2678275 2613507 2560396 2519144 2489051 2469853 2461445 2462367 2469477 2479497
50306B479497J0966J0899R162M153m651j5439k5365l3322m0754m8999n6782o1629
$$ 2479497 2490463 2501362 2510524 2514677 2510026 2494587 2469222 2435900 2395146 2346147 2289365 2227736
50294B227736o3263o3931o5207o6180o5330o2784n9730n6556n2742m8085m3167
$$ 2227736 2164473 2100542 2035335 1969155 1903825 1841041 1781311 1724755 1672013 1623928 1580761
50283A580761l8738l5186l2471l0189k7865k5318k2475j8974j4547j0006o990
$$ 1580761 1542023 1506837 1474366 1444177 1416312 1390994 1368519 1349545 1334998 1324992 1318002
50272A318002o197o403n712l433l66K365M281N751P750J1071J5306J8841K0405
$$ 1318002 1311805 1305402 1299690 1296257 1295891 1298256 1302537 1308288 1316038 1327109 1342415 1361256 1381661
50259A381661K0442K0483K1282K2150K2216K1709K1585K2179K2774K2658K2069
$$ 1381661 1402103 1422586 1443868 1466018 1488234 1509943 1531528 1553707 1576481 1599139 1621208
50248A621208K1723K1632K1018J9401J7212J5155J3447J2007J0697R091O575L255
$$ 1621208 1642931 1664563 1685581 1704982 1722194 1737349 1750796 1762803 1773500 1782591 1789166 1792421
50236A792421J91j982m134p441j1487j4545j5686j5591j5339j5332j5659j6603
$$ 1792421 1792612 1790630 1786496 1779055 1767568 1753023 1737337 1721746 1706407 1691075 1675416 1658813
50224A658813j8227k0002k1119k0998j9525j7380j5970j6236j7410j7639j6154
$$ 1658813 1640586 1620584 1599465 1578467 1558942 1541562 1525592 1509356 1491946 1474307 1458153
50213A458153j4116j3062j3018j2620j0703p528m677l837n322p633q724p690n196
$$ 1458153 1444037 1430975 1417957 1405337 1394634 1387106 1382429 1378592 1373270 1365637 1356913 1349223 1344027
50200A344027k592j030r66j781k032p91J272K669K707J799N07q22j735k051k494
$$ 1344027 1341435 1340405 1339439 1337658 1335626 1334835 1336107 1338776 1341483 1343282 1343789 1342967 1341232 1339181 1336687
50185A336687l960o106p593p751p132o429n948o104p102q067p763o623o609q434
$$ 1336687 1332727 1326621 1319028 1311277 1304145 1297716 1291768 1285664 1278562 1270495 1262732 1256109 1249500 1241066
50171A241066j0217r837p627n626m995n177n207m735l839k556p91J468L830N541
$$ 1241066 1230849 1221012 1213385 1207759 1202764 1197587 1192380 1187645 1183806 1181250 1180459 1181927 1185757 1191298
50157A191298O265O631P395Q141P712N912L926K877K789L064L030J986k43k723
$$ 1191298 1197563 1204194 1211589 1219730 1227442 1233354 1237280 1240157 1242946 1246010 1249040 1251026 1250783 1248060
50143A248060m437n818p926j0185j0832r998j0180j2736j5847j7209j6956j6322
$$ 1248060 1243623 1237805 1229879 1219694 1208862 1198864 1188684 1175948 1160101 1142892 1125936 1109614
50131A109614j5096j2518r637q517r407j0486j0291q992p508o567o525o965o786
$$ 1109614 1094518 1082000 1072363 1063846 1054439 1043953 1033662 1024670 1017162 1010595 1004070 997105 990319
50118I90319n685m936n645o865o878n728m919m968m946m406m015m016l675k742
$$ 990319 984634 979698 974053 967188 960310 954582 949663 944695 939749 935343 931328 927312 923637 920895
50104I20895k197k852m185n158n455n479n631o061o656p099p154o969o817o814
$$ 920895 918698 915846 911661 906503 901048 895569 889938 883877 877221 870122 862968 855999 849182 842368
50090H42368p174q347j0230j1616j1219r148o704m984m166l795l168j781q1O48
$$ 842368 835194 826847 816617 805001 793782 784634 777930 772946 768780 764985 761817 760036 759955 760603
50076G60603q8j017o11R17K215K875L629M688N171M450L038K056K399M303O994
$$ 760603 760515 759498 758887 759804 762019 764894 768523 773211 778382 782832 785870 787926 790325 794628 801622
50061H01622Q991R567R530R780R670Q110N829N002O571R199J1111J1777J1623
$$ 801622 810613 820180 829710 839490 849160 857270 863099 868101 874672 883871 894982 906759 918382
50048I18382J1206J0999J1135J1163J0668J0006R724R670R644J0322J2143J3663
$$ 918382 929588 940587 951722 962885 973553 983559 993283 1002953 1012597 1022919 1035062 1048725
50036A048725J2758R529O462N499O357P799Q968R252Q407P388P648R121J0173
$$ 1048725 1061483 1071012 1077474 1082973 1089330 1097129 1106097 1115349 1123756 1131144 1138792 1147913 1158086
50023A158086R843Q858Q066P437P091P727R212J0203J0016R698J0455J2079J3623
$$ 1158086 1167929 1176787 1184853 1192290 1199381 1207108 1216320 1226523 1236539 1246237 1256692 1268771 1282394
50010A282394J4587J4936J5019J5896J8358K1358K2889K2857K3174K4446K4775
$$ 1282394 1296981 1311917 1326936 1342832 1361190 1382548 1405437 1428294 1451468 1475914 1500689
49999A500689K3009K0963K0644K1132K0316J8292J6878J6615J6264J4681J1523
$$ 1500689 1523698 1544661 1565305 1586437 1606753 1625045 1641923 1658538 1674802 1689483 1701006
49988A701006O845J601k086k993k605l415n964q991j1720j4149j5799j6061j5546
$$ 1701006 1707851 1709452 1707366 1704373 1701768 1698353 1692389 1683398 1671678 1657529 1641730 1625669 1610123
49975A610123j5346j5328j4789j4198j4460j4947j4360j3103j2521j2080r856
$$ 1610123 1594777 1579449 1564660 1550462 1536002 1521055 1506695 1493592 1481071 1468991 1459135
49964A459135o064l328k767k435p91P33L04j122j133Q31L297M981N589N034L446
$$ 1459135 1453071 1449743 1446976 1444541 1443750 1444483 1444787 1443665 1442532 1443363 1446660 1451641 1457230 1462264 1465710
49949A465710J670O06J39m53j449k727m256n773o539o328o183p216r034j0241
$$ 1465710 1467380 1467986 1468125 1467672 1466223 1463496 1459240 1453467 1446928 1440600 1434417 1427201 1418167 1407926
49935A407926j0288r903r919j0475j1260j1817j1658j0864j0435j1274j2806j3361
$$ 1407926 1397638 1387735 1377816 1367341 1356081 1344264 1332606 1321742 1311307 1300033 1287227 1273866
49923A273866j2202j0487r913j0854j2290j3265j3791j4316j4795j4769j4222
$$ 1273866 1261664 1251177 1241264 1230410 1218120 1204855 1191064 1176748 1161953 1147184 1132962
49912A132962j3817j4082j4837j5713j6654j7351j6817j4623j2252j1921j3888
$$ 1132962 1119145 1105063 1090226 1074513 1057859 1040508 1023691 1009068 996816 984895 971007
49901I71007j6030j6432j5299j3808j2410j1184j0785j1677j2985j3392j2929
$$ 971007 954977 938545 923246 909438 897028 885844 875059 863382 850397 837005 824076
49890H24076j2705j3041j2931j1623r746q544q456q755q254o473m399l826n384
$$ 824076 811371 798330 785399 773776 764030 755486 747030 738275 730021 723548 719149 715323 709939
49877G09939p487p873o056l553j958j527j696j982k073j753j223r61r43n00P03
$$ 709939 702452 694579 688523 684970 683012 681485 679789 677807 675734 673981 672758 671797 670854 670354 671057
49862F71057K002K421J894J373J792L036M011L912L297L430M366M505K857Q92
$$ 671057 673059 675480 677374 678747 680539 683575 687586 691498 694795 698225 702591 707096 709953 710845
49848G10845Q85K746M003L159J453Q26J542K684L694M338M104K937J909K000K732
$$ 710845 711730 714476 718479 721638 723091 723917 725459 728143 731837 736175 740279 743216 745125 747125 749857
$$ [...]
##END NTUPLES=NMR SPECTRUM
##END=
