
##TITLE=AC1167_Meta-centauros3_5898838_SFqeAGUjo0
##JCAMPDX= 6.0         $$ Bruker NMR JCAMP-DX V2.0
##DATA TYPE= NMR SPECTRUM
##DATA CLASS= NTUPLES
##ORIGIN= BRUKER
##OWNER= Administrator
$$ 1.72 TOPSPIN		Version 2.1
$$ 2012-04-10 10:22:27.296 -0500  Administrator@TOPSPIN
$$ Compression mode = diff/dup
##.OBSERVE FREQUENCY= 400.13188235
##.OBSERVE NUCLEUS= ^1H
##.ACQUISITION MODE= SIMULTANEOUS (DQD)
##.ACQUISITION SCHEME= undefined
##.AVERAGES= 8
##.DIGITISER RES= 22
##SPECTROMETER/DATA SYSTEM= spect
##.PULSE SEQUENCE= zg30
##.SOLVENT NAME= COFFEE_meoh
##.SHIFT REFERENCE= INTERNAL, COFFEE_meoh, 1, 14.98061
##AUDIT TRAIL= $$ (NUMBER, WHEN, WHO, WHERE, PROCESS, VERSION, WHAT)
$$ ##TITLE= Audit trail, TOPSPIN		Version 2.1
$$ ##JCAMPDX= 5.01
$$ ##ORIGIN= Bruker BioSpin GmbH
$$ ##OWNER= Administrator
$$ $$ C:\Bruker\TOPSPIN/data/COFFEE/nmr/AC1167_Meta-centauros3_5898838_SFqeAGUjo0/10/pdata/1/auditp.txt
$$ ##AUDIT TRAIL=  $$ (NUMBER, WHEN, WHO, WHERE, PROCESS, VERSION, WHAT)
(   1,<2012-04-04 08:45:30.593 -0500>,<Administrator>,<TOPSPIN>,<go>,<TOPSPIN 2.1>,
      <created by zg
	started at 2012-04-04 08:44:23.671 -0500,
	POWCHK enabled, PULCHK disabled,
       configuration hash MD5:
       1A 1E CE 29 27 FD 77 03 67 4E F0 E3 C4 B2 CB 90
       data hash MD5: 64K
       D2 B0 29 E1 3A 35 A0 9C 00 84 E2 49 26 40 A5 B1>)
(   2,<2012-04-04 08:45:33.281 -0500>,<Administrator>,<TOPSPIN>,<proc1d>,<TOPSPIN 2.1>,
      <Start of raw data processing
       efp LB = 0 FT_mod = 6 PKNL = 1 PHC0 = 0 PHC1 = 0 SI = 32K 
       data hash MD5: 32K
       76 4D 95 0A 1F 03 19 CA FD 6F 79 BF DA 10 C1 E8>)
(   3,<2012-04-04 08:45:33.734 -0500>,<Administrator>,<TOPSPIN>,<proc1d>,<TOPSPIN 2.1>,
      <pk PHC0 = 211.0364 PHC1 = 0 
       data hash MD5: 32K
       58 A0 38 32 D9 7D 06 EB EF 7A C0 7D 0B AE 6A 12>)
(   4,<2012-04-04 08:45:33.812 -0500>,<Administrator>,<TOPSPIN>,<proc1d>,<TOPSPIN 2.1>,
      <abs ABSG = 1 
       data hash MD5: 32K
       32 CA C3 F6 2F 24 56 43 60 B2 23 3D 73 DD 2C C1>)
(   5,<2012-04-04 08:45:33.843 -0500>,<Administrator>,<TOPSPIN>,<proc1d>,<TOPSPIN 2.1>,
      <abs ABSG = 2 
       data hash MD5: 32K
       36 7B C8 D6 21 4B 60 CF 46 2B 8D 45 27 84 CF A9>)
(   6,<2012-04-04 08:45:33.875 -0500>,<Administrator>,<TOPSPIN>,<proc1d>,<TOPSPIN 2.1>,
      <abs ABSG = 3 
       data hash MD5: 32K
       98 53 38 80 AC 85 DD 41 18 63 E8 6F 01 41 A1 DC>)
(   7,<2012-04-04 08:45:33.906 -0500>,<Administrator>,<TOPSPIN>,<proc1d>,<TOPSPIN 2.1>,
      <abs ABSG = 4 
       data hash MD5: 32K
       81 AA B2 BA B0 78 A1 88 52 C5 0C D4 71 50 25 DD>)
(   8,<2012-04-04 08:45:33.937 -0500>,<Administrator>,<TOPSPIN>,<proc1d>,<TOPSPIN 2.1>,
      <abs ABSG = 5 
       data hash MD5: 32K
       8D 3E 3F 67 20 C0 13 8F B0 3E 47 D4 EB F3 AA 9C>)
(   9,<2012-04-04 08:45:37.625 -0500>,<Administrator>,<TOPSPIN>,<audit>,<TOPSPIN 2.1>,
      <user comment:
       ICON-NMR User ID: COFFEE
       data hash MD5: 32K
       8D 3E 3F 67 20 C0 13 8F B0 3E 47 D4 EB F3 AA 9C>)
$$ [...]
##$TP= (0..7)
150 150 150 150 150 150 150 150
##$TP07= 0
##$TPNAME0= <>
##$TPNAME1= <>
##$TPNAME2= <>
##$TPNAME3= <>
##$TPNAME4= <>
##$TPNAME5= <>
##$TPNAME6= <>
##$TPNAME7= <>
##$TPOAL= (0..7)
0.5 0.5 0.5 0.5 0.5 0.5 0.5 0.5
##$TPOFFS= (0..7)
0 0 0 0 0 0 0 0
##$TUNHIN= 0
##$TUNHOUT= 0
##$TUNXOUT= 0
##$USERA1= <user>
##$USERA2= <user>
##$USERA3= <user>
##$USERA4= <user>
##$USERA5= <user>
##$V9= 5
##$VALIST= <valist>
##$VCLIST= <CCCCCCCCCCCCCCC>
##$VD= 0
##$VDLIST= <DDDDDDDDDDDDDDD>
##$VPLIST= <PPPPPPPPPPPPPPP>
##$VTLIST= <TTTTTTTTTTTTTTT>
##$WBST= 2048
##$WBSW= 25
##$XGAIN= (0..3)
0 0 0 0
##$XL= 0
##$YL= 0
##$YMAX_a= 531443
##$YMIN_a= -659164
##$ZGOPTNS= <>
##$ZL1= 120
##$ZL2= 120
##$ZL3= 120
##$ZL4= 120
##$ABSF1= 14.98061
##$ABSF2= -5.57192
##$ABSG= 5
##$ABSL= 3
##$ALPHA= 0
##$AQORDER= 0
##$ASSFAC= 0
##$ASSFACI= 0
##$ASSFACX= 0
##$ASSWID= 0
##$AUNMP= <proc_prof1d_extract_pilot.lims>
##$AXLEFT= 0
##$AXNAME= <>
##$AXNUC= <1H>
##$AXRIGHT= 0
##$AXTYPE= 0
##$AXUNIT= <>
##$AZFE= 0.1
##$AZFW= 0.1
##$BCFW= 0
##$BC_mod= 0
##$BYTORDP= 0
##$COROFFS= 0
##$CY= 15
##$DATMOD= 1
##$DC= 0
##$DFILT= <>
##$DTYPP= 0
##$F1P= 0
##$F2P= 0
##$FCOR= 0.5
##$FTSIZE= 32768
##$FT_mod= 6
##$GAMMA= 0
##$GB= 0
##$INTBC= 1
##$INTSCL= 1
##$ISEN= 128
##$LB= 0
##$LEV0= 0
##$LPBIN= 0
##$MAXI= 10000
##$MC2= 0
##$MEAN= 0
##$ME_mod= 0
##$MI= 0
##$NCOEF= 0
##$NC_proc= -8
##$NLEV= 6
##$NOISF1= 0
##$NOISF2= 0
##$NSP= 0
##$NTH_PI= 0
##$NZP= 0
##$OFFSET= 14.98061
##$PC= 1
##$PHC0= 211.0364
##$PHC1= 0
##$PH_mod= 1
##$PKNL= yes
##$PPARMOD= 0
##$PPDIAG= 0
##$PPIPTYP= 0
##$PPMPNUM= 2147483647
##$PPRESOL= 1
##$PSCAL= 4
##$PSIGN= 0
##$PYNMP= <proc.py>
##$REVERSE= no
##$SF= 400.13
##$SI= 32768
##$SIGF1= 0
##$SIGF2= 0
##$SINO= 400
##$SIOLD= 32768
##$SPECTYP= <>
##$SREGLST= <1H.CDCl3>
##$SSB= 0
##$STSI= 32768
##$STSR= 0
##$SW_p= 8223.68421052632
##$SYMM= 0
##$S_DEV= 0
##$TDeff= 65536
##$TDoff= 0
##$TI= <>
##$TILT= no
##$TM1= 0
##$TM2= 0
##$TOPLEV= 0
##$USERP1= <user>
##$USERP2= <user>
##$USERP3= <user>
##$USERP4= <user>
##$USERP5= <user>
##$WDW= 1
##$XDIM= 32768
##$YMAX_p= 469352425
##$YMIN_p= -694103
##$CURPLOT= <Network HP LaserJet P1505>
##$CURPRIN= <$Network HP LaserJet P1505>
##$DFORMAT= <normdp>
##$LAYOUT= <+/1D_H.xwp>
##$LFORMAT= <normlp>
##$PFORMAT= <normpl>
##$SURQMSG= 1
$$ End of Bruker specific parameters
$$ ---------------------------------
##NTUPLES= NMR SPECTRUM
##VAR_NAME=  FREQUENCY,     SPECTRUM/REAL,   SPECTRUM/IMAG
##SYMBOL=    X,             R,               I
##VAR_TYPE=  INDEPENDENT,   DEPENDENT,       DEPENDENT
##VAR_FORM=  AFFN,          ASDF,            ASDF
##VAR_DIM=   32768,         32768,           32768
##UNITS=     HZ,            ARBITRARY UNITS, ARBITRARY UNITS
##FACTOR=    0.250966925370066, 1,           1
##FIRST=     8223.43324360095, 138765,       -48089
##LAST=      0,             120012,          -79423
##MIN=       0,             -694103,         0
##MAX=       8223.43324360095, 469352425,    0
$$ Real data points
##PAGE= N=1
##DATA TABLE= (X++(R..R)), XYDATA
$$ [...]
$$ plain form
19477 -331667 170383 -80225 935 -10290 109304 -172501 61669 -97159 129877 -62784 -388825
19466 -388825 -110970 239372 -55547 -352829 -189575 -215765 43009 63368 -73663 -31828 -191706
19455 -191706 161247 -60690 -38517 -167926 -18334 48805 -262622 186339 -26586 -310651
19445 -310651 -351138 -179741 -25946 -55937 -49156 118945 414465 -105327 -201178 -124582 -200943
19434 -200943 -67669 -33044 -209281 -71739 -117391 245310 -24532 377582 -212231 -16229 128026
19422 23986 -70381 144203 -338789 62211 -338033 110843 -124962 246580 -239867 257615
19411 -118330 -156235 -120548 -79150 -51988 159213 191191 39263 127495 -169430 -347657 -63566
19399 -37505 61753 86025 217142 -103021 -84792 6816 59554 4623 127190 -142900 176248
$$ packed form
19477c31667A70383h0225I35a0290A09304a72501F1669i7159A29877f2784l26041
19466c88825a10970B39372e5547k97282J63254k6190D3009K0359g3663c1828j59878
19455a91706A61247f0690K2173j29409a8334D8805b62622A86339b6586k84065
19445c10651m0487J71397b5946k9991O781A18945K95520a05327r5851P6596p6361
19434b00943f7669c3044j76237g1739m5652B45310b4532C77582b12231a6229A28026
19422B3986g0381A44203c38789F2211c38033A10843a24962B46580b39867B57615
19411a18330l7905L5687M1398K7162A59213L1978C9263Q8232a69430j78227f3566
19399c7505F1753K4272J31117a03021J8229F816N2738D623J22567a42900A76248
$$ plain form
19387 154860 -18879 -231778 -125113 -65788 -228628 -138818 -219453 29918 -144112 -173027 -19988
19375 -99137 -151821 -288811 -121334 -132878 -53043 -67492 -169546 -108265 -424841 -4584 -476328
19364 -476328 7439 28643 -54874 -12457 -50223 -9509 -270287 -295128 -223647 22484 -256771
19352 -289748 295921 -95069 51944 -310650 79111 -199038 -502090 207551 62136 -6119 -231684
19341 -231684 -203724 -119046 -64576 131410 -44460 -171859 161973 -152406 -221130 -272789 38377
19329 24924 -396933 -223586 -124328 122502 -170019 -111916 -194133 -78026 -173297 -162153 -246579
19318 -246579 164335 -117377 260107 -170403 -437285 18328 65804 -273831 -219388 -278169
19308 -278169 -281491 206964 185033 128909 120593 -151638 -455933 235478 41127 87972 122174
$$ packed form
19387A54860a8879k12899J06665N9325j62840Q9810q0635B9918a44112k8915a9988
19375i9137n2684j36990a21334j1544e3043j4449j02054O1281l16576d584m71744
19364d76328G439K1204e4874a2457l7766i509k60778k4841P1481B2484b56771
19352b89748B95921i5069E1944c10650G9111a99038l03052B07551F2136f119k25565
19341b31684K7960Q4678N4470A31410d4460j27399A61973a52406o8724n1659C8377
19329B4924c96933J73347R9258A22502a70019N8103q2217g8026r5271J1144q4426
19318b46579A64335a17377B60107a70403k66882A8328M7476b73831N4443n8781
19308b78169l322B06964k1931n6124q316a51638l04295B35478D1127M6845L4202
$$ plain form
19297 122174 353133 4638 102231 -210037 -16381 102933 -424906 -149998 44779 -148971
19286 -135470 -134705 -210479 110599 -236959 -141826 405075 -187285 19514 -62844 193201 -180102
19274 -42967 253427 -71420 -441006 -275673 -200125 -116743 93340 186023 -245530 77911 -35967
19262 -210831 -229383 50108 -348906 -283230 -248425 -29221 -254462 -151231 94373 51150 63035
19251 63035 10723 -199406 -359303 -29932 -72512 -88026 -27597 -48963 -24554 -27359 -146727
19240 -146727 -316812 -9210 300421 -426516 28402 -80725 -82677 -190989 -173048 -87704 -2330
19228 72830 -44826 76777 -89782 362477 -52572 -223824 260006 41851 3504 152793 125151
19217 125151 466993 -83383 -16347 -214998 23969 -27427 58640 -1597 221716 -151595 21410
$$ packed form
19297A22174K30959D638R7593b10037a6381A02933d24906a49998D4779a48971
19286a35470P65p5774A10599b36959R5133D05075a87285A9514f2844A93201a80102
19274d2967B53427g1420l69586J65333P5548Q3382I3340R2683b45530G7911c5967
19262b10831j8552E0108c48906O5676L4805b9221k25241J03231I4373m3223J1885
19251F3035A0723a99406j59897b9932m2580j5514b7597k1366K4409k805j19368
19240a46727j70085i210C00421d26516B8402h0725j952j08312J7941Q5344b330
19228G2830d4826G6777h9782C62477e2572j71252B60006D1851C504J49289k7642
19217A25151L41842h3383a6347j98651B3969b7427E8640a597B21716a51595B1410
$$ plain form
19205 -42825 -96908 -109389 -153115 219292 -201009 216585 20076 -244906 -168066 -190697 -143446
19194 -143446 -69778 -81151 -309769 -500692 135730 -6619 61290 23263 110903 253655 35177
19182 9674 -226925 -32862 58488 -296145 -129138 -46109 -97913 -69520 -481862 41712 -9941
19170 69912 193670 -123795 -150545 -132354 -3732 -147327 -33192 -103476 72933 -238286 -88150
19158 156446 -70366 -19439 127279 198565 25973 -131907 59653 -160356 29669 -313751 -428245
19147 -428245 46806 32934 -114188 -152596 -122826 -125273 -27855 12558 -81269 -4345 143691
19135 -274685 347527 -33321 24463 -197655 44862 -147902 -4349 -48079 210456 -22457 -61758
19124 -61758 177990 -165726 -167002 6472 -62238 -367172 -33627 -341208 -335049 -281156 -85693
$$ packed form
19205d2825n4083j2481m3726B19292b01009B16585B0076b44906P6840k2631M7251
19194a43446f9778j1373k28618j90923A35730f619F1290B3263Q7640J42752C5177
19182I674b26925c2862E8488b96145a29138d6109n1804K8393m12342D1712i941
19170F9912J23758a23795k6750J8191c732j43595c3192p0284G2933b38286h8150
19158A56446g0366a9439A27279P1286B5973a31907E9653a60356B9669c13751j14494
19147d28245D6806j3872a14188l8408K9770k447b7855A2558h1269d345A43691
19135b74685C47527c3321B4463a97655D4862a47902d349m3730B10456b2457l9301
19124f1758A77990a65726j276F472f2238l04934c3627l07581O159N3893h5693
$$ plain form
19112 -14357 -273499 209862 -74545 -230111 90769 21399 2112 15103 -64996 -125326 27581
19100 -35948 12132 -279247 -290365 -24468 -161952 87282 -110762 -183592 -136096 56264 -192076
19088 127900 -56639 -134606 -248768 -64458 -38117 -226353 -76013 49526 -262027 -154406 -26222
19076 154528 -66956 64783 -148819 -291310 -326862 143060 -71106 -2325 47598 4914 33772
19065 33772 211317 -97926 -171859 -142148 -383514 224445 -249034 73652 93224 -59778 -3036
19053 -103807 -115972 94292 -264260 466259 -471422 -81774 147611 -38478 -135830 -24294 48912
19041 -99840 8152 36456 -64738 -120896 56759 41565 -302278 -198387 -169992 19141 -175536
19029 9529 189532 -363375 95508 -53598 -57363 188209 -147050 -136287 116565 248327 77263
$$ packed form
19112a4357k59142B09862g4545j55566I0769B1399B112J2991f4996o0330B7581
19100c5948A2132b79247j1118b4468j37484H7282a10762p2830M7496E6264a92076
19088A27900e6639p7967j14162f4458K6341j88236g6013D9526b62027J07621b6222
19076A54528f6956F4783a48819j42491l5552A43060g1106b325D7598D914K8858
19065C3772J77545i7926p3933K9711k41366B24445b49034G3652J9572e9778c036
19053a03807j2165I4292b64260D66259d71422h1774A47611c8478r7352b4294D8912
19041i9840H152K8304f4738n6158E6759j5194c02278J03891K8395A9141a75536
19029I529J80003c63375I5508e3598l765A88209a47050J0763A16565J31762G7263
$$ plain form
19017 4796 -47668 -388703 179159 45074 -47556 30111 139777 -417198 -83286 -207442 -177407
19006 -177407 -250981 127227 109594 278433 169338 -5224 171989 -39074 -131320 -91551 168233
18994 -47136 -165932 145912 364670 -23526 25831 83399 -23862 -26942 62110 -159758 -322448
18983 -322448 40922 286517 -41932 -16622 -81228 133398 84615 -74695 -67957 -107712 3639
18971 -139746 -174041 96571 128597 -135806 -172297 -149915 -208342 29153 -430654 138333 199425
18960 199425 212982 351426 615084 180742 614351 620916 -165804 -23852 14152 -193681
18949 73184 -352151 17396 143299 21748 108156 -171511 102881 -59949 -199023 -204708 124111
18937 72296 -189585 -93816 -313473 58423 66520 -54576 -153162 -412230 -10218 245589 98295
$$ packed form
19017D796d7668l41035A79159D5074d7556C0111J09666d17198h3286j24156L0035
19006a77407p3574A27227j7633J68839j09095e224A71989c9074r2246L9769A68233
18994d7136j18796A45912K18758b3526B5831N7568b3862l080F2110a59758j62690
18983c22448D0922K45595d1932a6622o4606A33398m8783g4695O738l9755C639
18971a39746l4295I6571L2026a35806l6491K2382n8427B9153d30654A38333O1092
18960A99425J3557J38444K63658A80742M33609O565a65804b3852A4152a93681
18949G3184c52151A7396J25903B1748Q6408a71511A02881e9949j39074n685A24111
18937G2296a89585i3816k19657E8423Q097e4576r8586k59068a0218B45589I8295
$$ plain form
18925 -259566 -359628 -131234 -119338 140021 61282 142727 -161219 -223601 158111 -19605
18914 -127909 -24637 25257 142947 -17682 -251314 -87786 111061 -264931 -23107 -161782
18904 -161782 246791 89025 12434 -102912 -153355 109206 -157200 -55987 138505 214011
18894 214011 251299 607107 540435 246752 -184286 58759 -42798 230364 182764 -105145
18883 -211984 17227 63351 36655 4397 31816 246852 -159702 -204930 214912 160654 -114098
18871 -254419 93273 35847 -205364 -381777 -69556 -196423 150611 7663 131805 217015 67060
18859 25721 -348147 168644 48458 -257392 -29438 -194710 -88882 -169129 137274 236564 189900
18848 189900 -179866 -56893 -89982 18642 22129 64436 -237708 125676 32000 88195 -76556
$$ packed form
18925b59566j00062a31234J1896A40021F1282Q1445a61219o2382A58111a9605
18914a27909b4637B5257J17690a7682k33632h7786A11061b64931b3107j38675
18904a61782B46791H9025A2434a02912n0443A09206a57200e5987A38505P5506
18894B14011L7288L55808o6672B46752a84286E8759d2798B30364m7600a05145
18883b11984A7227M6124k6696D397K7419K15036a59702m5228B14912n4258a14098
18871b54419I3273C5847b05364j76413f9556j26867A50611G663J24142Q5210F7060
18859B5721c48147A68644D8458b57392b9438j65272h8882q0247A37274R9290m6664
18848A89900a79866e6893l3089A8642L487M2307b37708A25676C2000N6195g6556
$$ plain form
18836 100850 -221870 174598 654007 113556 19725 299448 78322 -89914 -36914 -321265
18826 -321265 -67230 -38637 -52219 98362 -169155 119466 144886 3961 -247397 -260991 9994
18814 -53175 -104957 -214467 121938 45914 55148 46955 30307 -110920 7069 246814 98341
18802 -28368 -200121 -33948 149383 46796 -185675 -171421 196051 154775 106912 -141932 -184657
18791 -184657 279117 11622 43239 394198 -379656 169240 -5538 4187 -180579 -252736 -136290
18780 -136290 -128098 110933 -241393 229455 -63094 -309522 -221095 -146931 53922 63435 320593
18769 320593 40392 54497 4054 -69411 -355292 -78838 -5193 -243342 -78916 91508 -323767
18757 34433 111082 282876 -18111 51126 404232 2159 -229182 108960 154962 -36231 210211
$$ packed form
18836A00850b21870A74598M79409A13556A9725K79723G8322h9914c6914k84351
18826c21265f7230K8593j3582I8362a69155A19466K5420C961b47397j3594I994
18814e3175n1782j09510A21938D5914R234q193j6648a10920G069K39745I8341
18802b8368j71753c3948A49383D6796a85675J4254A96051m1276m7863a41932m2725
18791a84657B79117A1622L1617L50959c79656A69240e538D187a80579p2157J16446
18780a36290Q192A10933b41393B29455f3094k46428Q8427P4164E3922R513K57158
18769C20593D0392J4105D054f9411k85881g8838e193k38149g8916I1508c23767
18757C4433P6649J71794a8111E1126L53106B159b29182A08960M6002c6231B10211
$$ plain form
18745 210973 -171258 -215722 -166836 74877 262139 73935 296398 -81883 -98208 1102 -31526
18733 -192268 -88881 -416071 10103 134892 -223910 -47295 -202470 -141007 156025 1713 -347407
18721 -80890 -385179 69087 -152053 -63447 14156 -29118 -116058 -210762 -152304 -177531 333131
18709 39435 -24948 -264021 -149672 222078 -156973 -55688 22119 112492 -133215 126357
18698 -121403 -113644 -203031 93383 -303300 -37768 135032 -73586 -268384 -404185 311810 -242493
18686 100002 -218382 -104326 48455 188291 22485 -146679 39870 -45726 -229568 110319
18675 -205530 -177373 -119077 -109575 -89448 -37450 154739 -260964 -339098 -288672 -60518 -277340
18664 -277340 107835 -216577 163130 -97037 254301 246578 -48206 -142690 -3062 -159474 103412
$$ packed form
18745B10973a71258m4464M8886G4877J87262G3935K22463h1883j6325A102c1526
18733a92268h8881l27190A0103J24789b23910d7295j55175O1463A56025A713c47407
18721h0890l04289F9087a52053f3447A4156b9118q6940r4704N8458k5227C33131
18709C9435b4948k39073J14349B22078a56973e5688B2119R0373a33215A26357
18698a21403P759q9387I3383c03300c7768A35032g3586j94798j35801C11810b42493
18686A00002b18382a04326D8455J39836B2485a46679C9870d5726j83842A10319
18675b05530K8157N8296R502K0127c7450A54739b60964p8134N0426f0518k16822
18664b77340A07835b16577A63130i7037B54301p723d8206r4484c062j56412A03412
$$ plain form
18652 -76792 22310 -415125 -172452 6646 -19591 -51046 206398 108170 111116 -12560 -292629
18641 -292629 -6338 -378921 54119 261494 -176074 -214472 -269367 342089 129031 7414 87735
18630 87735 275399 -299271 192710 -55167 -119323 152034 130869 -304521 1802 132033 8618
18618 48370 8989 2494 319391 -164082 -30441 -53831 -130274 -26397 97470 122308 81469 206988
18606 206988 -158369 125793 -306890 -75946 171051 2183 -243730 14528 98372 -98699 -26900
18594 -196885 274618 -175518 143888 -263259 -29227 26736 -2667 -175967 13332 -105711
18583 -166770 -123507 -204101 -338981 120102 112897 103529 201005 -57810 -107423 268506 -150082
18571 -193012 -81078 355416 151115 14555 -147335 -104353 76610 -239339 -372144 -242455
$$ packed form
18652g6792B2310d15125a72452F646a9591l1455B06398r8228K946a2560k80069
18641b92629f338l72583E4119K07375a76074l8398n4895C42089A29031G414Q0321
18630H7735J87664b99271A92710e5167o4156A52034k1165c04521A802J30231H618
18618D8370H989B494L16897a64082c0441k3390p6443b6397I7470K4838m0839J25519
18606B06988a58369A25793c06890g5946A71051B183b43730A4528Q3844i8699b6900
18594a96885B74618a75518A43888b63259b9227B6736b667j73300A3332a05711
18583a66770M3263q0594j34880A20102p205r368R7476e7810m9613B68506a50082
18571a93012h1078C55416A51115A4555a47335M2982G6610b39339j32805J29689
$$ plain form
18561 -242455 -125052 111642 -446296 76381 106158 -237084 -120332 -44208 -63435 242790
18550 -123035 -63703 31184 197691 -63643 1655 -87455 -293561 -18546 -41975 -79058 -95143
18539 -95143 21142 105221 -48574 86271 202961 -139362 -34829 -16550 19227 73527 -205194
18527 -236994 -301645 -218139 55219 -241853 -61062 -121010 -299543 30459 37180 -97249 198924
18515 40868 -32338 -110035 18334 -385319 -368652 -64271 29032 59936 -97884 59765 -617515
18503 136032 -243867 -109330 156390 -398805 329809 -4027 13394 -5287 85502 29292 -71706
18491 -129682 55472 -237507 -227960 -124636 -205065 -69456 -132540 -156408 152068 99611 294917
18480 294917 6919 -74969 -481898 34397 262781 -103082 -169893 143587 299604 73975 7658
$$ packed form
18561b42455J17403A11642d46296G6381K9777b37084J16752d4208j9227B42790
18550a23035N9332C1184J66507f3643A655h7455k06106a8546k3429l7083j6085
18539i5143B1142Q4079d8574H6271J16690a39362c4829a6550A9227N4300b05194
18527b36994o4651Q3506E5219b41853f1062n9948j78533C0459O721i7249A98924
18515D0868c2338p7697A8334c85319J6667f4271B9032L0904i7884E9765f17515
18503A36032b43867a09330A56390c98805C29809d027A3394e287H5502B9292g1706
18491a29682E5472b37507R547J03324q0429f9456o3084k3868A52068n2457J95306
18480B94917F919g4969m06929C4397K28384a03082o6811A43587J56017G3975G658
$$ plain form
18468 -70715 -4449 -130840 -128015 55830 -237890 -138835 94857 -116903 35307 -237558 -195869
18457 -195869 -51471 -108649 75483 66588 -495704 -323152 -46032 325878 -499666 268731 133026
18445 121516 -189811 -98642 103048 13118 -137395 -129886 24421 12589 -36094 122336 -128804
18433 -64650 -299134 -33239 -147242 -121067 -316001 155582 143098 -10422 -99675 247574 -51646
18421 -5653 -231724 46333 32119 124274 113184 270065 -101709 -369467 -179570 -258406 32744
18409 180556 -6896 -67528 -179674 108637 164067 -48723 161427 -252491 65080 -170182 234267
18397 140845 -142274 23620 -83593 32640 -12765 296583 -71150 86306 64044 16358 16676
18386 16676 -13505 248440 986 143715 -37999 -104577 -39910 197461 -11329 5282 61630 40927
$$ packed form
18468g0715d449j26391K825E5830b37890R9055I4857a16903C5307b37558M1689
18457a95869e1471n7178G5483q895d95704J72552d6032C25878d99666B68731A33026
18445A21516a89811R1169A03048A3118a37395P509B4421j1832c6094A22336a28804
18433f4650k34484c3239j14003K6175j94934A55582j2484a0422q9253B47574e1646
18421e653k26071D6333j4214R2155j1090J56881a01709k67758a79570p8836C2744
18409A80556f896o0632j12146A08637N5430d8723A61427b52491F5080a70182B34267
18397A40845a42274B3620h3593C2640a2765B96583g1150H6306k2262A6358L18
18386A6676a3505B48440I86J42729c7999o6578c9910A97461a1329E282N6348k0703
$$ plain form
18374 40927 -107218 -214806 35133 60335 136116 -64676 -83388 -163230 163413 82821 -75615
18362 -40810 -120697 10708 161617 363258 156171 -4578 -118032 -413389 -128129 -137273 -88264
18351 -88264 190213 134530 96334 -144874 189508 -202766 67742 58848 147017 38160 270274
18340 270274 -15813 -309479 32031 -215702 -30558 -185624 -127556 89071 -55742 49909 -256079
18328 -215038 188504 -389211 -72577 -23376 -20695 -206934 -132308 138972 -30473 -160749 -182040
18317 -182040 -58649 -163892 -54605 -103556 -293345 -134901 66661 74317 -129970 -231814 125120
18305 213292 -98669 -31689 -169604 104410 107256 115728 -12569 44464 -47703 232994 166440
18294 166440 88502 -123533 -358725 -269318 -49742 186180 213203 -4415 149980 -235336 300809
$$ packed form
18374D0927a07218j07588C5133K5202P5781f4676j8712p9842A63413q0592g5615
18362d0810p9887A0708J50909K01641A56171d578j13454k95357a28129r144M9009
18351h8264A90213n5683l8196a44874A89508b02766F7742q894Q8169C8160K32114
18340B70274a5813k93666C2031b15702c0558j55066N8068H9071e5742D9909b56079
18328b15038A88504c89211g2577b3376K681j86239P4626A38972c0473j30276k1291
18317a82040e8649j05243e4605m8951j89789a34901F6661P656a29970j01844A25120
18305B13292i8669c1689j37915A04410K846Q472a2569D4464d7703B32994o6554
18294A66440p7938a23533k35192Q9407d9742A86180K7023d415A49980b35336C00809
$$ plain form
18282 -64491 55623 157881 288780 104439 -122289 -245649 -73423 214400 -271956 -87363
18271 288091 -170862 213409 16816 -166617 -115270 -70777 -195559 440847 -285260 547871
18260 231839 323163 114989 32141 -95835 109803 112885 -410 -197723 -163810 191753 -64919
18248 51840 -251136 122893 -280204 -48017 -142615 -7758 -177177 66545 -180207 35906 221347
18237 221347 54053 -114582 -284114 -210318 -143262 -53443 -349444 -291298 -197397 30191 -148632
18225 -10623 31314 171583 2581 -137867 94481 -398338 134714 -245905 -114826 -77119 132255
18213 32382 -15518 42419 -82694 -68866 116451 236481 -44864 -218017 -15293 -14001 27472
18201 246688 -148500 -4402 -128479 -245931 13473 -28662 -128926 60848 1990 -301602 288161
$$ packed form
18282f4491E5623J02258J30899A04439a22289j23360g3423B14400b71956h7363
18271B88091a70862B13409A6816a66617N1347M4493j24782D40847b85260E47871
18260B31839R1324A14989C2141i5835A09803L082d10j97313L3913A91753f4919
18248E1840b51136A22893b80204d8017r4598g758j69419F6545a80207C5906J85441
18237B21347E4053a14582j69532P3796O7056e3443k96001N8146R3901C0191a48632
18225a0623C1314J40269B581a37867I4481c98338A34714b45905a14826L7707A32255
18213C2382a5518D2419h2694J3828A16451J20030d4864j73153a5293J292B7472
18201B46688a48500d402j24077j17452A3473b8662j00264F0848A990c01602B88161
$$ plain form
18189 -222564 -470330 99295 98639 262408 -173057 259033 -89110 163236 19146 -315035 -86245
18177 141688 -15263 134683 93093 67191 -32709 -26236 -209950 -9461 61030 -137711 -218346
18166 -218346 39739 33227 113831 -109138 9428 275016 64027 98008 -33887 -167213 -383825
18155 -383825 100429 -1935 -65624 134868 253465 -68366 31637 -88382 -119016 226650 -54283
18143 -219494 -51774 286980 -162959 151387 -66877 -3010 -70202 44535 -21010 55911 921
18131 -106435 152138 -397375 11002 -251193 -18029 -52337 40426 -410968 -303569 -155166
18121 -155166 -19592 5792 283401 223544 -222650 -36375 -63880 -74784 3734 278437 63851
18109 114043 -118914 -282641 -529128 195951 -97800 167102 -172824 -43578 -205593 6286
$$ packed form
18189b22564k47766I9295o56J63769a73057B59033h9110A63236A9146c15035h6245
18177A41688a5263A34683m1590k5902c2709O473j83714i461F1030a37711q0635
18166b18346C9739o512Q0604a09138I428K65588F4027L3981c3887j33326k16612
18155c83825A00429a935o3689A34868J18597f8366C1637h8382l0634B26650e4283
18143b19494e1774B86980a62959A51387f6877c010o7192D4535b1010E5911I21
18131a06435A52138c97375A1002b51193a8029l4308D0426d10968J07399J48403
18121a55166a9592E792K77609n9857b22650c6375k7505j0904C734K74703F3851
18109A14043a18914j63727k46487A95951i7800A67102a72824d3578j62015F286
$$ plain form
18098 -80292 -192861 12738 265765 231259 22650 -289167 -141714 134695 -12403 178590
18087 188749 18483 -228430 -79434 112905 -9974 102463 -7442 87411 -81559 -43282 148592
18075 -147347 -315181 110987 97381 -25872 -137666 -57789 -63732 -142652 -320293 -245950 53337
18063 -195650 -25489 -127414 -34793 7729 20991 -40697 252121 -135261 -8960 -47618 -79284
18052 -79284 375328 -280680 -132116 -11453 -201258 155108 -210200 377786 40838 -56928
18041 74652 -50252 -703 -44375 36835 -116147 96377 79474 84588 -136520 -98677 456291 -65301
18028 -224447 -242387 -97747 92118 -74019 14298 -130986 -33011 5575 -115814 178219 -151396
18016 -205349 59197 253415 -211112 60667 -233263 -11444 -107999 -31447 -30146 -131230 -364591
$$ packed form
18098h0292j12569A2738K53027l4506B2650b89167a41714A34695a2403A78590
18087A88749A8483b28430g9434A12905i974A02463g442H7411h1559L8277A48592
18075a47347j67834A10987j3606b5872j11794e7789n943p8920j77641P4343E3337
18063a95650b5489j01925c4793G729J3262d0697B52121a35261h960l8658l1666
18052g9284C75328b80680a32116a1453j89805A55108b10200C77786D0838e6928
18041G4652e0252g03m3672C6835a16147I6377j6903N114a36520L7843D56291f5301
18028b24447j7940i7747I2118g4019A4298a30986c3011E575a15814A78219a51396
18016b05349E9197J94218b11112F0667b33263a1444r6555c1447J301j01084k33361
$$ plain form
18005 -364591 75568 107311 -151366 236939 -143082 -146549 -161409 198593 68399 -37780 182436
17993 51499 171793 140603 114483 298941 493308 318955 91574 -32422 336667 55588 71937
17982 71937 672 73256 115019 57170 -178074 195420 87710 -207310 63495 -184972 273586
17970 -85088 261166 451663 -264421 -189741 -115385 -230275 -138112 -4540 37540 -294165 225218
17958 -221103 -90235 -112095 82796 -83896 217648 205649 -80817 230296 12465 -238303 61155
17946 141396 -2349 -22135 86454 112953 2201 -173581 271675 -121964 61357 -29792 92469
17934 122663 295381 2879 -121608 130699 -117172 162739 -4091 -121875 -67153 410212
17923 192003 77679 -18088 -55381 -62177 173593 354941 462096 -56592 -137447 405002 -196190
$$ packed form
18005c64591G5568L1743a51366B36939a43082l467j4860A98593F8399c7780A82436
17993E1499J20294l1190k6120J84458J94367j74353I1574c2422C36667E5588J6349
17982G1937F72P2584M1763E7170a78074A95420H7710b07310F3495a84972B73586
17970h5088B61166J90497b64421P4680P4356j14890R2163d540C7540b94165B25218
17958b21103i0235k1860H2796h3896B17648j1999h0817B30296A2465b38303F1155
17946A41396b349j9786H6454K6499B201a73581B71675a21964F1357b9792I2469
17934A22663J72718B879a21608A30699a17172A62739d091j17784N4722D10212
17923A92003G7679a8088l7293o796A73593J81348J07155e6592q0855D05002a96190
$$ plain form
17911 8233 -59613 69935 -114260 -18064 -62018 -233226 193204 246596 142823 35370 80389
17900 80389 -151436 146373 290986 220209 -143615 -5116 92257 -17435 193243 -28428 19621
17888 82110 61923 -85357 56467 147630 8002 -216743 105813 141360 -113027 21671 75698
17877 75698 229799 -16440 175405 -169757 -135322 -189726 44487 -121547 -127341 188086 -98999
17865 89384 -19125 -17382 72371 226018 240964 -59431 248788 15766 198455 263805 -230847
17853 272545 -149037 213161 141301 6377 -40687 -22284 89290 282854 298778 45814 23250
17842 23250 -161725 27537 336668 61348 233624 112026 101498 128293 260528 162022 303560
17831 303560 -68410 -33220 -60811 490692 -344980 123297 2555 -173322 338943 28117 -92818
$$ packed form
17911H233e9613F9935a14260a8064m3954j71208A93204N3392j03773C5370M5019
17900H0389a51436A46373J44613p0777a43615e116I2257a7435A93243b8428A9621
17888H2110k0187h5357E6467R1163H002b16743A05813L5547a13027B1671N4027
17877G5698J54101a6440A75405a69757L4435n4404D4487a21547n794A88086i8999
17865H9384a9125J743G2371J53647J4946e9431B48788A5766J82689O5350b30847
17853B72545a49037B13161p1860F377d0687J8403H9290J93564J5924D5814k2564
17842B3250a61725B7537L09131F1348J72276A12026j0528K6795J32235r8506J41538
17831C03560f8410c3220k7591D90692c44980A23297B555a73322C38943B8117i2818
$$ plain form
17819 -120479 -107724 -191196 -11523 -132820 70100 185289 141288 391840 -138723 -193385 271302
17807 62126 21602 157154 117173 367530 162464 80293 107465 -58466 110495 145294 -26870
17795 459716 -40560 53208 85851 239250 212950 152804 299814 -149629 -85878 201510 -175857
17783 92262 -68913 26476 115810 187860 124903 46876 -46325 -22868 106878 163170 -234514
17771 -11737 51022 -92885 2946 -32608 -125618 -114495 -47679 -167947 26300 49551 135264 80685
17759 80685 -225238 -218850 234440 320167 -148450 285690 -229397 63513 -121012 74994 -75664
17747 35726 206014 350474 56389 99512 47784 81339 -141772 237364 -9740 97294 219097
17736 219097 282706 157580 4592 22671 273220 -114252 78866 -148481 -30747 409010 184468
$$ packed form
17819a20479J2755q3472a1523j21297G0100J15189m4001K50552a38723n4662B71302
17807F2126B1602J35552l9981K50357A62464H0293K7172e8466A10495L4799b6870
17795D59716d0560E3208L2643J53399k6300o0146J47010a49629O3751B01510a75857
17783I2262f8913B6476Q9334P2050o2957D6876d6325b2868A06878N6292b34514
17771a1737E1022i2885B946c2608r3010J1123d7679j20268B6300K3251Q5713n4579
17759H0685b25238O388B34440Q5727a48450B85690b29397F3513a21012G4994g5664
17747C5726J70288J44460E6389M3123D7784L3555a41772B37364i740I7294J21803
17736B19097O3609j25126D592J8079K50549a14252G8866a48481c0747D09010A84468
$$ plain form
17724 -27019 215876 238027 -8955 229678 208621 -44905 179259 111147 -155410 259950 372474
17713 372474 330080 318584 163586 20208 338488 226444 327952 -65950 303742 201398
17703 201398 32831 248587 55669 130862 36307 -50672 524345 399430 185235 -50826 474295
17691 454171 159961 -20628 310481 61634 -170091 -157744 409796 161391 201634 -128874
17680 127234 127961 -307888 -160403 -97345 408781 -168489 -57039 3281 -98522 38161 -26093
17668 122940 121147 90571 23901 117782 131003 160014 -150250 103912 139889 101084 -64625
17656 217376 49483 -232479 52894 -11733 114340 210207 -167735 -232077 48654 -1305 179375
17644 106867 35156 226520 -54554 -48323 -149153 42413 -47288 82641 -76400 283119 11343
$$ packed form
17724b7019B15876K2151h955B29678k1057d4905A79259o8112a55410B59950J12524
17713C72474m2394j1496j54998B0208L18280j12044J01508f5950C03742j02344
17703B01398C2831K15756E5669P5193C6307e0672E24345j24915A85235e0826D74295
17691D54171A59961b0628C10481F1634a70091J2347D09796A61391M0243a28874
17680A27234P27c07888J47485O3058D08781a68489e7039C281i8522C8161b6093
17668A22940j793l0576B3901R3881J3221K9011a50250A03912L5977l8805f4625
17656B17376D9483b32479E2894a1733A14340R5867a67735o4342D8654a305A79375
17644A06867C5156J91364e4554O231j00830D2413d7288H2641g6400B83119A1343
$$ plain form
17632 -60088 60326 -64286 111148 121929 -361530 2697 36928 154296 44166 -13649 241189
17620 -9050 68845 182681 214037 -22686 56180 438855 297067 -198504 300704 129709 -3539
17608 -104749 338529 430617 160952 241874 173279 39682 76537 78826 260541 -245913 12317
17596 6484 75641 321963 123083 196288 40893 -110220 -137894 199014 79855 -28827 -17752
17585 -17752 186658 24445 -68573 229518 48501 353380 -53777 -48501 528754 -55901 -101375
17574 -101375 35200 272708 86263 326970 -34176 83211 82912 141577 -23138 218079 135731
17563 135731 151934 184610 115914 203198 252527 373477 51905 93465 114874 337180 100120
17551 136250 -4293 -133195 24886 -83350 53649 -48092 98591 -5989 160911 271887 287792
$$ packed form
17632f0088F0326f4286A11148J0781c61530B697L4231J17368D4166a3649B41189
17620i050F8845J13836L1356b2686E6180L82675j41788a98504C00704A29709c539
17608a04749C38529R2088A60952Q0922o8595C9682L6855K289J81715b45913A2317
17596F484O9157K46322A23083P3205D0893a10220k7674A99014G9855b8827J1075
17585a7752A86658B4445f8573B29518D8501L04879e3777N276E28754e5901m5474
17574a01375C5200K37508H6263K40707c4176H3211k99N8665b3138B18079q2348
17563A35731J6203L2676o8696Q7284M9329J20950E1905M1560K1409K22306A00120
17551A36250d293j28902B4886h3350E3649d8092I8591e989A60911J10976J5905
$$ plain form
17540 287792 481253 5724 212938 565950 121211 -126298 86245 415983 642909 46958
17529 93801 88537 174172 251959 249037 335179 232002 122937 -51739 -142727 388012 153779
17517 289644 312372 176627 439432 219581 590711 545581 686175 540041 1040739 829884
17507 829884 1054681 506310 803783 442664 743222 545898 301311 352151 516278 1007958
17497 1007958 695615 683059 1030141 1017674 996406 1097039 429103 805886 206111 719021
17487 719021 253553 164877 -43692 324592 519389 136172 19632 358895 203757 259960
17477 259960 239949 187672 215431 544715 211614 448496 369584 278439 320446 175622 524727
17466 524727 319732 297501 408082 269995 374236 391718 593534 533155 110028 190206
$$ packed form
17540B87792J93461E724K07214L53012A21211a26298H6245L29738K26926D6958
17529I3801n264Q5635P7787k922Q6142j03177j09065e1739r0988C88012A53779
17517B89644K2728j35745K62805B19581L71130m5130J40594j46134N00698k10855
17507H29884K24797E06310K97473l61119L00558j97324k44587N0840J64127M91680
17497A007958l12343j2556L47082j2467k1268J00633D29103L76783B06111N12910
17487G19021B53553q8676d3692C24592J94797A36172A9632L39263j55138N6203
17477B59960k0011n2277K7759L29284B11614K36882p8912r1145M2007j44824L49105
17466E24727k04995k2231J10581j38087J04241J7482K01816o0379A10028Q0178
$$ plain form
17456 190206 69897 266576 317241 271170 251928 103753 35399 367400 64767 25471 312042
17445 312042 295137 110416 -16434 234803 102711 245284 317350 106226 487487 185284
17434 317204 241588 369571 361873 282078 613711 544575 117118 338727 493777 35089 251947
17423 251947 795792 402109 229449 631227 352617 46223 369369 213036 329221 280266
17413 280266 148268 53016 444177 324461 383506 375028 478623 376255 213698 304850
17403 304850 141308 281006 343099 199792 335076 83692 364964 259093 513010 -11981
17392 417728 260158 365775 332470 559027 336613 666972 -111844 -170540 528677 37857
17381 326881 -144981 -96301 489828 355539 447223 146701 345462 251835 316377 64882
$$ packed form
17456A90206F9897J96679N0665m6071j9242A03753C5399L32001F4767B5471K86571
17445C12042j6905A10416a6434B34803A02711J42573P2066A06226L81261A85284
17434C17204p5616J27983p698p9795L31633o9136A17118K21609J55050C5089K16858
17423B51947N43845l93683j72660M01778k78610D6223L23146j56333J16185m8955
17413B80266j31998E3016L91161j19716N9045q478J03595j02368j62557R1152
17403C04850A41308J39698O2093j43307J35284H3692K81272j05871K53917a1981
17392D17728j57570J05617l3305K26557k22414L30359a11844n8696E28677C7857
17381C26881a44981M8680D89828j34289R1684A46701J98761r3627O4542F4882
$$ plain form
17370 271671 323245 444178 204675 542903 317153 79370 395460 119420 414692 229060
17360 229060 431755 401992 3543 230557 303811 -18553 243910 120751 459988 175301
17349 232788 469232 115205 456416 185338 343045 202599 199168 656301 246742 247756
17339 247756 268673 91056 -109199 118151 -47502 132789 15980 293527 412847 326876
17329 326876 124445 369368 178217 210276 20989 -460 245153 197894 161680 87872 218170
17318 218170 222490 380426 279101 144711 -6849 375333 253076 32444 99719 439430 120074
17306 200561 197421 662612 235497 547458 391442 -68888 457178 68118 179392 92128
17296 92128 91051 306672 149910 396523 196466 175034 228018 290945 145276 533546 217536
$$ packed form
17370B71671N1574J20933B04675L38228k25750G9370L16090A19420K95272j85632
17360B29060K02695k9763C543K27014P3254a8553B43910A20751L39237A75301
17349B32788K36444A15205L41211A85338J57707j40446l431M57133B46742J014
17339B47756K0917I1056a09199A18151d7502A32789A5980K77547J19320q5971
17329C26876A24445K44923A78217L2059B0989d60B45153m7259l6214p3808J30298
17318B18170M320J57936j01325j34390f849C75333j22257C2444O7275L39711A20074
17306B00561l140M65191B35497L11961j56016f8888D57178F8118J11274q7264
17296I2128j077K15621A49910K46613A96466k1432N2984O2927A45276L88270B17536
$$ plain form
17284 249464 451742 -1192 175232 521217 258050 189182 627500 504063 351826 134235
17273 385783 542285 380816 370958 306046 201848 347639 446923 205253 280188 94750 235333
17262 235333 348861 409696 93013 -28362 497596 334897 350716 285223 495593 242313
17251 493414 211168 471894 326853 432323 340991 570397 708767 -49278 402466 584189
17241 584189 137310 250142 288558 424899 233764 589223 401196 212731 353715 643301
17231 643301 552348 174237 355644 55912 272996 458316 344942 532612 227734 127671
17221 127671 481890 471609 474728 430368 358970 235864 290485 525022 571976 232117 274182
17210 274182 309169 662210 634816 788905 203095 432163 319392 542791 265004 232110
$$ packed form
17284B49464K02278a192A75232L45985B58050o8868M38318j23437j52237A34235
17273C85783J56502j61469r858o4912j04198J45791R9284B05253P4935I4750J40583
17262B35333J13528O0835I3013b8362D97596j62699J5819o5493K10370B42313
17251D93414B11168K60726j45041J05470r1332K29406J38370d9278D02466J81723
17241E84189A37310J12832L8416J36341j91135L55459j88027j88465J40984K89586
17231F43301r0953A74237J81407E5912K17084J85320j13374J87670B27734j00063
17221A27671L54219j0281L119m4360p1398j23106N4621K34537M6954B32117M2065
17210B74182L4987L53041k7394J54089B03095K29068j12771K23399B65004l2894
$$ plain form
17200 232110 442448 210978 423585 101397 404861 299009 91665 205396 345947 274661
17190 274661 191734 324543 496519 523713 737012 297161 520743 415091 630053 732886
17180 732886 337918 205620 382556 619212 359365 224728 520840 405397 491590 694352
17170 694352 688954 481049 666381 399173 656960 470598 451747 377655 416567 283740
17160 283740 431908 635576 711329 274386 663894 277340 601600 574923 392627 517357
17150 517357 348011 538776 448396 288932 476115 666407 374839 593883 365054 629565
17140 629565 328963 330437 827583 210875 765709 473111 634771 499796 461230 286051
17130 286051 344341 460475 228962 322252 565106 450358 666412 568924 651385 577760
$$ packed form
17200B32110K10338B10978K12607A01397L03464j05852I1665J13731J40551p1286
17190B74661q2927J32809J71976K7194K13299B97161K23582j05652K14962J02833
17180G32886C37918j32298J76936K36656k59847j34637K96112j15443Q6193K02762
17170F94352n398k07905J85332k67208K57787j86362j8851p4092L8912j32827
17160B83740J48168K03668P5753B74386L89508B77340L24260k6677j82296J24730
17150E17357j69346J90765r0380j59464J87183J90292k91568K19044k28829K64511
17140F29565l00602J474M97146B10875N54834k92598J61660j34975l8566j75179
17130B86051N8290J16134B28962R3290K42854j14748K16054r7488Q2461p3625
$$ plain form
17120 577760 788161 769131 512902 482071 714175 247498 602332 625731 330248 278669
17110 278669 792805 625356 604756 990523 598606 558727 644776 481463 715815 786099
17100 786099 427674 239942 520418 357753 751543 733548 780070 552084 637485 859407
17090 859407 437990 661196 570301 570381 844478 395788 408164 565857 887987 484443 476673
17079 476673 639890 657101 612642 772970 733684 838230 504886 604349 741085 711746
17069 711746 541143 543308 823556 754652 1067907 727116 680933 1017382 685059 815501
17059 815501 1099928 895324 897609 597040 1012735 754553 1199341 812783 891032 810871
17049 810871 651869 1118103 808411 889797 1066904 923267 975566 632287 554223 771224
$$ packed form
17120E77760K10401j9030k56229l0831K32104B47498L54834K3399k95483n1579
17110B78669N14136j67449k0600L85767l91917l9879Q6049j63313K34352P0284
17100G86099l58425j87732K80476j62665L93790j7995M6522k27986Q5401K21922
17090H59407m21417K23206r0895Q0K74097C95788J2376J57693L22130m03544p770
17079D76673J63217J7211m4459J60328l9286J04546l33344R9463J36736k9339
17069G11746j70603K165K80248o8904L13255l40791m6183L36449l32323J30442
17059H15501K84427k04604K285l00569M15695k58182M44788l86558P8249q0161
17049H10871j59002M66234l09692Q1386J77107j43637N2299l43279p8064K17001
$$ plain form
17039 771224 1174133 618617 798377 891072 858970 884950 1231869 1016247 973610 671821
17029 671821 935546 832711 925255 1153951 567004 825526 1195949 947725 720427 1023153
17019 1023153 693945 965474 1309549 976604 1059161 1377600 922704 1079001 856881 1123283
17009 1123283 922243 1235388 927772 899463 1334552 1131779 1192568 641140 1355283 1234083
16999 1234083 1169379 1282140 823858 1292326 1308064 981537 975374 814462 1245815 1360459
16989 1360459 1250602 1146777 1093992 1249525 1362786 1538375 1067320 1179148 978853 1593253
16979 1593253 1345044 1258490 1249160 1577442 1197899 1198002 1315613 1076866 1650231 1414915
16969 1414915 1435465 1506144 1222902 1669670 1398453 1648113 1332158 1158068 1154428 1591739
$$ packed form
17039G71224M02909n55516J79760R2695l2102K5980L46919k15622m2637l01789
17029F71821K63725j02835R2544K28696E67004K58522L70423k48224k27298L02726
17019A023153l29208K71529L44075l32945Q2557L18439m54896J56297k22120K66402
17009A123283k01040L13145l07616k8309M35089k02773O0789n51428P14143j21200
16999A234083o4704J12761m58282M68468J5738l26527o163j60912M31353J14644
16989A360459j09857j03825n2785J55533J13261J75589m71055J11828k00295O14400
16979A593253k48209q6554r330L28282l79543J03J17611k38747N73365k35316
16969A414915K0550P0679k83242M46768k71217K49660l15955j74090l640M37311
$$ plain form
16959 1591739 1192808 1497828 1591701 1357902 1486387 1912458 1629660 1707824 1574727 1804955
16949 1804955 1555984 2131879 1465973 1757129 1542708 1997769 1762605 1678813 1679384 1824921
16939 1824921 1881981 1587303 1992497 1610086 1735176 1815602 1913114 1973598 2046883 2056652 1828199
16928 1828199 2216127 2141832 1998920 1872944 1954804 2096177 2421614 1891356 2121315 1987930
16918 1987930 2092388 2352245 2415675 2085190 2360086 2175547 2238771 2293113 2380257 2241923
16908 2241923 2276228 2183381 2492791 2646992 2392600 2745607 2580081 2362047 2629099 2088758
16898 2088758 2595550 2611547 2731529 2889127 2871501 2782850 2954151 2717823 2809116 2819741
16888 2819741 2825127 3095658 3029830 2925499 3203962 3017316 3065341 3000517 3382268 2982174
$$ packed form
16959A591739l98931L05020R3873k33799J28485M26071k82798P8164j33097K30228
16949A804955k48971N75895o65906K91156k14421M55061k35164q3792N71J45537
16939A824921N7060k94678M05194l82411J25090Q0426R7512O0484P3285R769k28453
16928A828199L87928p4295j42912j25976Q1860J41373L25437n30258K29959j33385
16918A987930J04458K59857O3430l30485K74896j84539O3224N4342Q7144j38334
16908B241923L4305r2847L09410J54201k54392L53007j65526k18034K67052n40341
16898B088758N06792J5997J19982J57598j7626q8651J71301k36328R1293J0625
16888B819741N386K70531o5828j04331K78463j86646M8025o4824L81751m00094
$$ plain form
16878 2982174 2969472 2995208 2990975 3443300 3262599 3201919 3186128 3523894 3183753 3107328 3621767
16867 3621767 3896167 3768948 3550689 3903410 3699796 3849892 3845992 3900724 4270997 4334395
16857 4334395 4192507 4358464 4138610 4448896 4761216 4289764 4675458 4138263 4832518
16848 4832518 4521435 4845873 4718755 4928626 4691936 5063927 5252504 5283153 5226072 5274541
16838 5274541 5245040 5823700 5634851 5277856 5590150 6093382 5885901 6083074 6320267 6326032
16828 6326032 6168854 6142590 6439351 6427794 6881161 6575058 6785159 7238241 7302825 7627802
16818 7627802 7522892 7372666 7618744 7619846 8171760 7838642 8171751 8260671 8454380 8468155
16808 8468155 8745983 9017452 9309432 9359187 9386732 9591115 10019063 9887409 10369842 10806400
$$ packed form
16878B982174j2702K5736m233M52325j80701o0680j5791L37766l40141p6425N14439
16867C621767K74400j27219k18259L52721k03614J50096l900N4732L70273O3398
16857D334395j41888J65957k19854L10286L12320m71452L85694n37195O94255
16848D832518l11083L24438j27118K09871k36690L71991J88577L0649n7081M8469
16838E274541k9501N78660j88849l56995L12294N03232k07481J97173K37193N765
16828F326032j57178k6264K96761j1557M53367l06103K10101M53082O4584L24977
16818G627802j04910j50226K46078J102N51914l33118L33109Q8920J93709J3775
16808H468155K77828K71469K91980M9755K7545K04383M27948j31654M82433M36558
$$ plain form
16798 10806400 10641787 10914104 11392854 10998027 11505586 11907203 12002222 12044330 12624088 12810739
16788 12810739 12821255 13197030 13851442 14053097 14176611 14686083 15256478 15349843 16017379 15871821
16778 15871821 16810236 17056991 17336497 17749404 18049709 18848789 19258506 20077074 20363949
16769 20363949 20905385 21371121 22164458 22942910 23337663 24078248 24830054 25612357 26096822
16760 26096822 27106075 27702965 28747009 29543367 30637452 31500301 32753869 33531233 34850004
16751 34850004 35825845 37115808 38262740 39464598 41029346 42391791 44049315 45345616
16743 45345616 46959264 49035693 50782213 52265872 54063065 56386612 58496719 60501067
16735 60501067 62593381 65124261 67701555 70179370 72578125 75328738 77749442 80896174
$$ packed form
16798A0806400j64613K72317M78750l94827N07559M01617R5019M2108N79758J86651
16788A2810739J0516L75775O54412K01655J23514N09472N70395R3365O67536j45558
16778A5871821R38415K46755K79506M12907L00305P99080M09717Q18568K86875
16769B0363949N41436M65736P93337P78452L94753P40585P51806P82303M84465
16760B6096822J009253N96890J044044P96358J094085Q62849J253568P77364J318771
16751C4850004R75841J289963J146932J201858J564748J362445J657524J296301
16743D5345616J613648K076429J746520J483659J797193K323547K110107K004348
16735F0501067K092314K530880K577294K477815K398755K750613K420704L146732
$$ plain form
16727 80896174 83260408 86013899 89345998 92204880 94750143 98235631 100895925 103602567
16719 103602567 106544803 109144969 112057535 114187115 116673781 118564413 120594417 122010539
16711 122010539 123654070 124548539 125436081 125657369 125966250 125759860 125215748 124364704 123021012
16702 123021012 122017250 120310828 118406592 116223632 113988280 111425954 108538095 106198216
16694 106198216 103223775 100573714 97792041 94428917 91631744 88259446 85526090 82858020
16686 82858020 79750257 77164246 74369615 71525367 69202855 66304948 64326618 61714630
16678 61714630 59621806 57403181 55981048 53388905 51697251 49690789 47689661 46024859
16670 46024859 44442591 43124204 41473005 40114825 38705823 37715196 36330724 35320398
$$ packed form
16727H0896174K364234K753491L332099K858882K545263L485488K660294K706642
16719A03602567K942236K600166K912566K129580K486666J890632K030004J416122
16711A22010539J643531Q94469Q87542K21288L08881k06390n44112q51044j343692
16702A23021012j003762j706422j904236k182960k235352k562326k887859k339879
16694A06198216k974441k650061k781673l363124k797173l372298k733356k668070
16686H2858020l107763k586011k794631k844248k322512k897907j978330k611988
16678F1714630k092824k218625j422133k592143j691654k006462k001128j664802
16670D6024859j582268j318387j651199j358180j409002r90627j384472j010326
$$ plain form
16662 35320398 33697521 32433809 31689855 30677602 29761677 28805032 27939803 27007927 26266278
16653 26266278 25612513 24742719 23833389 23170902 22672846 22060987 21353760 20952305 20138874
16644 20138874 19873887 19452634 18605661 18048355 17867873 17233889 16980422 16269976 16065581
16635 16065581 15281157 15352689 14790366 14565774 13938782 13578155 13769325 13482379 12690105
16626 12690105 12503100 12583871 11873881 11857776 11566061 11184077 10974469 10844704 10447987 10464988
16616 10464988 10058155 9972412 9509345 9529454 9278625 9018090 8926009 8750407 8421427 8355473
16606 8355473 8157675 8158329 8081871 8074158 7834739 7562710 7700006 7079052 7011040 6862967 6842418
16595 6842418 6957820 6691347 6439409 6471695 6392619 6278116 5817449 5956872 6200051 5949405
$$ packed form
16662C5320398j622877j263712p43954j012253r15925r56645q65229r31876p41649
16653B6266278o53765q69794r09330o62487m98056o11859p07227m01455q13431
16644B0138874k64987m21253q46973n57306j80482o33984k53467p10446k04395
16635A6065581p84424P1532n62323k24592o26992l60627J91170k86946p92274
16626A2690105j87005Q0771p09990j6105k91715l81984k09608j29765l96717J7001
16616A0464988m06833q5743m63067K0109k50829k60535r2081j75602l28980o5954
16606H355473j97798O54p6458p713k39419k72029J37296o20954o8012j48073k0549
16595F842418J15402k66473k51938L2286p9076j14503m60667J39423K43179k50646
$$ plain form
16585 5949405 5800513 6090412 5600817 5317697 5424374 5621808 5331058 4969202 4810641
16576 4810641 5033922 5149161 4986048 4810126 4910571 4799112 4633745 4496315 4399187 4473059
16566 4473059 4514119 3981438 4315972 4393461 4463237 4149416 4166038 4043321 4091261 3926080
16556 3926080 3890190 3720319 3645914 3546956 3569498 3491802 3623070 3493231 3306706 3391622
16546 3391622 3408512 3356811 3289344 3259951 3074142 2973435 3112187 3266006 3028626 2853397
16536 2853397 3028330 3204773 2779203 2715474 2586564 3152172 2848321 2487371 2591582 2909767
16526 2909767 2765884 2730750 2697715 2581783 2603900 2877557 2336160 2243753 2203977 2262285
16516 2262285 2302190 2290134 2476774 2226090 2205892 2421184 2153002 2465621 2379524 2168830
$$ packed form
16585E949405j48892K89899m89595k83120J06677J97434k90750l61856j58561
16576D810641K23281J15239j63113j75922J00445j11459j65367j37430r7128P3872
16566D473059M1060n32681L34534P7489O9776l13821J6622j22717M7940j65181
16556C926080l5890j69871p4405r8958K2542p7696J31268j29839j86525Q4916
16546C391622J6890n1701o7467k9393j85809j00707J38752J53819k37380j75229
16536B853397J74933J76443m25570o3729j28910N65608l03851l60950J04211L18185
16526B909767j43883l5134l3035j15932K2117K73657n41397r2407l9776N8308
16516B262285L9905j2056J86640k50684k0198K15292k68182L12619q6097k10694
$$ plain form
16506 2168830 2363560 2346248 2170327 2266609 1898246 2300159 2285533 2071427 2049096 2294772
16496 2294772 2069115 1975825 2226789 1885564 1995622 2379392 1849835 1925772 1674748 1740418
16486 1740418 1986060 1706124 1664304 1774515 1630644 1873728 1590921 1935658 1994529 1601400
16476 1601400 1493246 1735353 1767973 1407097 1524092 1699256 1505510 1680910 1609922 1367659
16466 1367659 1701814 1602283 1612553 1748965 1649395 1384359 1647213 1365499 1420080 1315441
16456 1315441 1484248 1453586 1396723 1366301 1506856 1068015 1172102 1165909 1279284 1162062
16446 1162062 1515454 1424208 1263460 1324281 1524613 1423571 1598122 1347647 1156183 1357644
16436 1357644 1288734 1144510 1338416 1046293 1373465 1299029 1157645 1037377 1335032 1085503
$$ packed form
16506B168830J94730j7312j75921R6282l68363M01913j4626k14106k2331K45676
16496B294772k25657r3290K50964l41225J10058L83770n29557P5937k51024O5670
16486A740418K45642k79936m1820J10211j43871K43084k82807L44737N8871l93129
16476A601400j08154K42107L2620l60876J16995J75164j93746J75400p0988k42263
16466A367659L34155r9531J0270J36412r9570k65036K62854k81714N4581j04639
16456A315441J68807l0662n6863l0422J40555m38841J04087o193J13375j17222
16446A162062L53392r1246j60748O0821K00332j01042J74551k50475j91464K01461
16436A357644o8910j44224J93906k92123L27172p4436j41384j20268K97655k49529
$$ plain form
16426 1085503 1049709 1059144 1151680 1220754 1090370 1091640 1177335 1228261 653763 1170729 708021
16415 708021 1354537 730831 1031318 1303099 1083611 811707 830176 891840 1198608 953290
16405 953290 785375 946762 505683 1074984 734885 902021 1006979 1034175 933446 875682
16395 875682 970765 920111 701824 665451 1203442 1025807 824974 869539 837852 758590 925129
16384 925129 954281 666463 965328 939742 1026839 555703 749588 926637 788170 1196738
16374 1196738 596739 515358 695182 885011 882521 628162 974124 730426 807038 943100
16364 943100 978255 743514 914643 908286 1006476 737253 433872 626538 503199 757150
16354 757150 669052 590258 876911 597896 901101 760746 891115 751479 531161 390970
$$ packed form
16426A085503l5794R435R2536O9074j30384J270Q5695N0926n74498N16966m62708
16415G08021O46516o23706L00487K71781k19488k71904J8469O1664L06768k45318
16405I53290j67915J61387m41079N69301l40099J67136J04958K7196j00729n7764
16395H75682R5083n0654k18287l6373N37991j77635k00833M4565l1687p9262J66539
16384I25129K9152k87818K98865k5586Q7097m71136J93885J77049j38467M08568
16374A196738E96739q1381J79824J89829k490k54359L45962k43698P6612J36062
16364I43100L5155k34741J71129o357R8190k69223l03381J92666j23339K53951
16354G57150q8098p8794K86653k79015L03205j40355J30369j39636k20318j40191
$$ plain form
16344 390970 572433 652038 556720 586085 843653 838399 599866 443395 735715 601018
16334 601018 598185 555743 623775 623429 486759 663042 693796 666575 395659 517969 772275
16323 772275 684144 547321 695546 684107 715492 369407 822137 468136 574274 595853
16313 595853 611213 656756 409243 503696 299534 253344 567424 677473 292232 289950 723503
16302 723503 643877 489904 454830 723632 599158 564785 718205 730707 268905 253482
16292 253482 585339 440217 605016 534549 502797 300292 611394 403613 373454 332849
16282 332849 315424 574091 826142 555294 240130 292955 194818 565402 511010 682537
16272 682537 589607 728160 464056 468478 257171 316826 583344 326034 496514 421308
$$ packed form
16344C90970J81463P9605r5318K9365K57568n254k38533j56471K92320j34697
16334F01018k833m2442O8032l46j36670J76283L0754k7221k70916J22310K54306
16323G72275q8131j36823J48225j1439L1385l46085M52730l54001J06138K1579
16313E95853J5360M5543k47513R4453k04162m6190L14080J10049B92232k282M33553
16302G23503p9626j53973l5074K68802j24474l4373J53420J2502B68905j5423
16292B53482L31857j45122J64799p0467l1752k02505L11102k07781l0159m0605
16282C32849j7425K58667K52051k70848B40130N2825r8137L70584n4392J71527
16272F82537r2930J38553k64104M422k11307N9655K66518k57310J70480p5206
$$ plain form
16262 421308 837570 390272 235307 363237 440105 571143 461220 384246 656145 272717
16251 342470 471677 235917 158068 245172 476878 -2247 202744 152178 343660 639797
16241 639797 284745 171706 419036 280166 164577 520262 243398 162299 213918 346684
16231 346684 423292 622890 424750 514383 387707 443734 396816 469674 320747 387985 525529
16220 525529 523637 93574 571200 380455 335668 406105 252823 263415 537149 318370 215420
16209 215420 153278 222565 463975 250653 370228 204198 570327 464364 175605 73530
16198 404922 348811 422305 217410 423283 423131 350623 394809 412197 173196 208885 105993
16187 105993 434695 277902 508272 539532 398687 413176 515767 84746 444675 181344
$$ packed form
16262D21308M16262C90272j54965J27930P6868J31038j09923p6974K71899B72717
16251C42470J29207k35760p7849Q7104K31706b247B02744n0566J91482K96137
16241F39797B84745j13039K47330j38870j15589L55685B43398q1099N1619J32766
16231C46684P6608J99598j98140Q9633j26676N6027m6918P2858j48927O7238J37544
16220E25529j892I3574M77626j90745m4787P0437j53282J0592K73734k18779j02950
16209B15420o2142O9287K41410k13322J19575j66030L66129j05963A75605G3530
16198D04922n6111P3494k04895K05873j52p2508M4186J7388A73196L5689j02892
16187A05993L28702j56793K30370L1260j40845J4489J02591H4746L59929A81344
$$ plain form
16176 257715 246913 209215 335512 95381 376936 318727 415118 355002 269043 284580 364324
16165 364324 42698 397015 447529 324190 187957 -13790 157842 296270 145015 20676
16154 367217 296627 172897 258253 131152 144218 281252 -230319 475606 85283 49264
16144 49264 107055 -74605 166836 214578 243752 156328 136920 183295 255896 221588 472426
16133 472426 246332 -90813 161144 -97456 534522 202634 130818 -24444 126136 357845
16123 357845 261284 281855 -75850 18309 -243686 161039 182056 54995 69971 252764 258393
16112 258393 100203 204911 269290 -26324 40250 140095 528634 39390 272682 156034
16102 156034 -318352 24701 127401 25272 -3060 -42055 375348 -66566 -51714 156864 108198
$$ packed form
16176B57715j0802l7698J26297I5381K81555n8209R6391o0116q5959J5537P9744
16165C64324D2698L54317N0514j23339j36233a3790A57842J38428A45015B0676
16154C67217p0590j23730Q5356j27101J3066J37034b30319D75606H5283l6019
16144D9264N7791g4605A66836M7742K9174q7424j9408M6375P2601l4308K50838
16133D72426k26094i0813A61144i7456E34522B02634p1816b4444A26136K31709
16123C57845r6561K0571g5850A8309b43686A61039K1017E4995J4976J82793N629
16112B58393A00203J04708O4379b6324D0250R9845L88539C9390K33292j16648
16102A56034c18352B4701J02700B5272c060l8995C75348f6566J4852A56864m8666
$$ plain form
16091 108198 15757 334436 462926 279332 123381 133983 23067 175686 123918 329931
16081 329931 44194 139950 254800 165020 347385 140634 -116580 -44909 237319 63452
16070 38452 46475 -4866 21747 83613 -8925 116819 189547 376365 68869 131285 86790 98851
16058 98851 236986 -340766 153185 271630 95645 -218548 115140 -35877 134690 256854
16048 256854 -126866 -110137 -219210 90748 9003 520988 -98172 59511 51731 94792 -19766
16036 14202 157338 -108596 -25208 349122 75129 282619 116106 -38090 123697 44385
16025 87391 128790 55834 -78223 -202406 84233 -18066 42653 13785 -1278 -47041 84012 117931
16013 117931 367909 154856 -54498 407313 40487 159821 -206237 54567 153461 -143281
$$ packed form
16091A08198A5757L18679J28490j83594A23381J0602B3067J52619n1768K06013
16081C29931D4194R5756J14850q9780J82365A40634a16580d4909B37319F3452
16070C8452Q023d866B1747O1866h925A16819P2728J86818F8869O2416m4495J2061
16058I8851J38135c40766A53185J18445I5645b18548A15140c5877A34690J22164
16048B56854a26866J6729j09073I0748I003N11985i8172E9511p780M3061a9766
16036A4202J43136a08596b5208C49122G5129K07490A16106c8090A23697D4385
16025H7391M1399E5834g8223j24183H4233a8066D2653A3785a278m5763H4012L3919
16013A17931K49978A54856e4498D07313D0487J19334b06237E4567R8894a43281
$$ plain form
16002 50438 312259 147436 393620 -42598 62016 -21531 259737 -176864 18781 -7185 -86073
15991 -86073 367312 89166 -138509 213532 -34910 -324971 76796 -160594 37288 175287
15981 175287 45751 236903 162458 -116611 184989 321689 505305 313161 334651 195162
15971 195162 1019974 838344 1185858 1056968 795821 340099 596517 302823 377810 512616
15961 512616 310859 61016 -37268 227763 185765 -150943 228611 -130507 168516 -100754
15950 -17753 -288198 64834 55169 -324630 -146507 -229162 -79179 -110154 13457 -253091 270951
15938 6550 -146534 119191 196663 35821 37104 321856 -125248 374862 158390 53084 -174229
15926 -280487 -100182 -216512 126636 -431867 -380309 163267 -110663 -117871 -223468 278187
$$ packed form
16002E0438K61821A47436K46184d2598F2016b1531B59737a76864A8781g185p8888
15991h6073C67312H9166a38509B13532c4910k90061G6796a60594C7288J37999
15981A75287D5751J91152p4445a16611A84989J36700J83616j92144K1490j39489
15971A95162Q24812j81630L47514j28890k61147C40099K56418k93694P4987J34806
15961E12616k01757F1016c7268B27763m1998a50943B28611a30507A68516a00754
15950a7753k70445F4834r665c24630a46507q2655g9179l0975A3457b53091B70951
15938F550a46534A19191P7472C5821J283K84752a25248C74862A58390E3084a74229
15926b80487a00182j16330A26636d31867N1558A63267a10663p208j05597B78187
$$ plain form
15915 153891 158434 208401 138308 230374 186438 18600 -181805 83012 -142577 29085 -342843
15903 122293 144055 -18974 -146896 53449 -160733 381920 -159201 104235 -220767 -111283
15893 -111283 79848 -184522 -164355 297638 239789 -184771 -117683 6741 -130444 -13289 -168486
15882 -168486 263860 6621 127325 -64517 283301 -120271 -149931 -34751 -367057 171302
15871 -53909 49181 -61594 19987 -5062 -185847 93405 47289 243172 -236967 -98085 105897
15859 -112311 -12044 104477 -101294 -148239 102320 -26599 -62472 271965 157850 -104393
15848 -179683 -6733 129845 246032 199519 132222 -155345 -446078 -221375 66657 -76318 -52539
15837 -52539 143472 30234 11945 142980 -141694 249691 214723 -12560 -117805 47184 -258380
$$ packed form
15915A53891M543M9967p0093R2066m3936A8600a81805H3012a42577B9085c42843
15903A22293K1762a8974j27922E3449a60733C81920a59201A04235b20767J09484
15893a11283G9848a84522K0167B97638n7849a84771O7088F741a30444a3289j55197
15882a68486B63860F621J20704f4517B83301a20271k9660c4751l32306A71302
15871e3909D9181f1594A9987e062j80785I3405m6116J95883b36967i8085A05897
15859a12311a2044A04477a01294m6945A02320b6599l5873B71965j14115a04393
15848a79683f733A29845J16187m6513o7297a55345k90733b21375F6657g6318K3779
15837e2539A43472C0234A1945J31035a41694B49691l4968a2560j05245D7184b58380
$$ plain form
15825 284947 53987 181385 162218 -96897 13596 91002 177135 -249199 -123833 144691 -282961
15813 -35177 -19241 359070 354459 135178 -289857 -165017 -130741 32408 -91579 120759 -207619
15801 -129043 -134333 227916 -80048 220203 -241666 -461 144308 -144907 -98527 -241868 -19926
15789 29746 114756 -79681 -20615 518564 -72339 66222 124614 -80928 -15638 75661 25771
15777 16877 -19790 -235961 149374 -69770 69783 -114579 -31500 -155478 -205230 56152 170198
15766 170198 -232040 -72996 -303813 79793 39194 -60151 -67632 -41042 -334506 -254587 307099
15754 -326334 -71335 -265310 79037 -172160 124384 -10564 45117 -25126 81325 96357 -25251
15742 46223 91182 -138827 513906 -163456 54330 -9283 -55622 83556 105621 -43101 267345
$$ packed form
15825B84947E3987J27398j9167i6897A3596P7406Q6133b49199a23833A44691b82961
15813c5177J5936C59070m611A35178b89857J24840L4276C2408i1579A20759b07619
15801a29043n290B27916h0048B20203b41666d61A44308a44907M6380j43341a9926
15789B9746Q5010g9681b0615E18564g2339F6222N8392h0928a5638G5661B5771
15777A6877a9790k16171A49374f9770F9783a14579c1500j23978m9752E6152J14046
15766A70198b32040g2996k30817G9793C9194f0151p481K6590k93464P9919C07099
15754c26334g1335j93975G9037a72160A24384a0564D5117b5126H1325J5032b5251
15742D6223M4959a38827E13906a63456E4330i283m6339H3556K2065d3101B67345
$$ plain form
15730 -13227 405005 127327 124353 -28887 396230 -137028 -16164 -180438 -127830 -93754 182576
15718 23540 95449 -152341 -177949 -168329 -209165 115959 -95446 11043 -9692 -372715 -59440
15706 41714 131989 -114206 403900 -28401 -158652 2397 -193175 261945 -35810 101394 264426
15695 264426 -295381 -141448 -469437 -6151 -385262 -176158 158618 -37190 -57941 -82417
15685 -82417 -141616 -368060 76025 172253 39226 -236262 362615 -52457 -69469 -4379 305478
15673 44698 -82083 -73778 409621 56814 -112314 2251 -251650 -19449 -75343 133046 7108
15661 340232 -108752 75696 97465 -167287 -62434 -94395 78526 -196926 -205465 -198500 -117714
15650 -117714 -39325 -382021 -90083 -47922 -395124 -59850 -159686 -45333 -332073 47236 295209
$$ packed form
15730a3227D05005A27327k974b8887C96230a37028a6164j64274N2608L4076A82576
15718B3540P1909a52341k5608R620m0836A15959i5446A1043i692l63023e9440
15706D1714R0275a14206D03900b8401j30251B397a93175B61945c5810A01394J63032
15695B64426b95381a41448l27989f151l79111a76158A58618c7190k0751k4476
15685h2417n9199k26444G6025R6228C9226b36262C62615e2457j7012d379C05478
15673D4698h2083Q305D09621E6814a12314B251b51650a9449n5894A33046G108
15661C40232a08752G5696K1769a67287f2434l1961G8526a96926q539O965Q0786
15650a17714c9325l42696i0083M2161l47202e9850r9836d5333k86740D7236K47973
$$ plain form
15639 295209 -304403 84853 -242195 3868 -221457 -236337 -50660 -267826 -21767 9386 -14445
15627 91140 -100143 -335679 -41398 73914 571575 156553 260696 69743 -211849 -357051
15617 -357051 122239 129066 -185789 92285 196053 305383 -264848 -474842 65671 -176367
15606 -206039 327108 216964 133562 88247 -279868 -327002 224292 8176 1019 44204 -158353
15594 206183 -214122 -133373 294171 244267 217918 341965 -139735 291455 -56815 -82124
15584 -82124 14267 -271815 66281 -47090 -147738 -25324 -38337 -63786 460649 168739 87399
15573 87399 -128482 373538 149022 -154702 55823 61313 15817 56280 -107022 197588 -112749
15561 -450418 -308365 -204555 -102142 586422 -259143 -190683 -95484 -148068 43789 -4577 43586
$$ packed form
15639B95209c04403H4853b42195C868b21457j4880e0660k17166b1767I386a4445
15627I1140a00143k35536d1398G3914M97661A56553J04143F9743b11849j45202
15617c57051A22239O827a85789I2285J03768J09330b64848k09994F5671a76367
15606b06039C27108j10144q3402m5315b79868m7134B24292H176A019M3185a58353
15594B06183b14122Q0749B94171m9904k6349J24047a39735B91455e6815k5309
15584h2124A4267b71815F6281d7090j00648b5324j3013k5449D60649A68739q1340
15573H7399a28482C73538A49022a54702E5823N490A5817M0463a07022A97588a12749
15561d50418J42053J03810a02142E86422b59143O8460R5199n2584D3789d577D3586
$$ plain form
15549 -175164 245590 41318 408149 35632 142626 -228054 209366 360995 -348661 90433
15538 106442 -116179 -215926 -257515 -320276 -82871 57781 45804 -293687 122982 51599 -43843
15526 -53504 -163341 -196860 -4613 267283 -183732 -90855 129162 -98571 -6359 -43094 219746
15514 175595 -73040 -46510 250098 203082 337870 112197 205188 127747 384852 225112
15504 225112 192889 110186 227542 72257 294056 -114039 96608 21990 62978 -112855 66608
15492 208896 224826 157375 215802 108395 -135937 -327434 367003 -153080 -116101 225081
15481 93886 238604 -211653 243553 4276 92901 -310668 310474 -247186 -20361 -238587
15471 -238587 494742 -183895 19296 351892 230106 215347 -289477 124272 276446 423277
$$ packed form
15549a75164B45590D1318L66831C5632J06994b28054B09366J51629c48661I0433
15538A06442a16179r9747m1589o2761h2871E7781j1977b93687A22982E1599d3843
15526e3504j09837l3519d613B67283a83732i0855A29162i8571f359l6735B19746
15514A75595g3040K6530B50098m7016J34788A12197R2991p7441K57105j59740
15504B25112l2223q2703J17356G2257K21799a14039I6608B1990M0988a12855F6608
15492B08896J5930o7451N8427j07407a35937j91497C67003a53080L6979B25081
15481I3886J44718b11653B43553D276Q8625c10668C10474b47186b0361k18226
15471b38587D94742a83895A9296L32596j21786j4759b89477A24272J52174J46831
$$ plain form
15461 423277 52139 481195 593140 494065 570646 -9477 547903 62754 -63937 -39276 -27038
15450 -27038 31484 -184095 29869 14376 11705 186877 95152 -81628 58119 198339 -62825
15438 75618 -218536 68341 -17277 106004 -86628 38383 244525 158067 26154 -16303 688730
15426 721044 1004204 1135402 846317 634343 243784 112830 199810 308157 65813 107529
15416 107529 437095 -73117 39814 -166905 49520 178977 107779 -256473 307164 136431
15405 -175032 -5522 277113 124003 -60521 -139769 -14526 -109625 -39430 -88930 456524 38925
15393 86045 318315 -79396 -68615 -33412 76312 -16617 -380579 78397 464932 159917 98185
15382 98185 58455 67731 -15927 144646 -40848 -60074 -121552 -36891 150817 196832 274284
$$ packed form
15461D23277E2139M29056J11945r9075P6581i477E47903F2754f3937K4661J2238
15450b7038C1484a84095B9869A4376k671J75172r1725h1628E8119J40220f2825
15438G5618b18536F8341a7277A06004h6628C8383K06142q6458B6154a6303F88730
15426G21044K83160J31198k89085k11974B43784A12830Q6980J08347F5813M1716
15416A07529L29566g3117C9814a66905D9520J29457p1198b56473C07164A36431
15405a75032e522B77113A24003f0521p9248a4526r5099c9430m9500D56524C8925
15393H6045K32270g9396J0781c3412G6312a6617l63962G8397L86535A59917o1732
15382I8185l9730R276a5927A44646d0848j9226o1478c6891A50817M6015P7452
$$ plain form
15371 274284 18506 239869 138222 -59622 367964 111689 -154570 295307 -66211 -213445
15361 -213445 348256 185198 106327 194060 591764 467333 19740 -17430 329541 -98712
15350 108510 -64470 260950 181850 43946 102639 -194477 140367 174583 -35664 341717 284529
15339 284529 57538 129878 135387 287713 -177468 96192 205070 174779 60605 287345 -197116
15327 457475 151207 253376 335704 333768 -30252 207196 270154 35245 477088 -43435 106500
15315 342249 253863 -108244 316648 242909 113269 -87687 246207 -96020 -117685 -162909 209258
15303 -61892 312473 223228 110074 214708 45337 361668 123522 188176 -11994 432 269268
15292 269268 269494 28624 -43636 56458 274221 93658 148423 -77706 64052 47482 198289
$$ packed form
15371B74284A8506K21363j01647e9622C67964A11689a54570B95307f6211j47234
15361b13445C48256j63058p8871Q7733L97704j24431A9740a7430C29541i8712
15350A08510f4470B60950p9100D3946N8693a94477A40367L4216c5664C41717n7188
15339B84529E7538P2340N509J52326a77468I6192J08878l0291F0605K26740a97116
15327D57475A51207J02169Q2328j936c0252B07196O2958C5245M41843d3435A06500
15315C42249q8386a08244C16648p3739A13269h7687B46207i6020k1665m5224B09258
15303f1892C12473q9245A10074J04634D5337L16331A23522O4654a1994D32K68836
15292B69268K26B8624d3636E6458K17763I3658N4765g7706F4052j6570J50807
$$ plain form
15281 198289 44794 151352 96714 6214 196084 113893 -143441 43648 128209 278742 -129807
15269 -13484 -283563 58152 -25953 -29398 90091 -99008 -97076 -98777 -179034 43898 -32994 76998
15256 13447 263297 155063 117802 -34550 62628 64140 203107 -97620 -13407 271025 252834
15245 252834 -151414 -28778 131629 302551 64911 -145316 72777 -172207 378916 155912
15234 -165799 -56377 121063 -41693 153857 283971 456223 667772 1120088 1746340 1327537
15224 1327537 1706591 1351035 305621 137989 513746 159583 155142 14247 -225 -160319
15214 -160319 113790 96300 411815 56010 180425 115026 -306775 -119577 16297 -12289
15203 367333 254800 -79182 391056 53923 122961 86641 -220397 294147 151025 133080
$$ packed form
15281A98289D4794J06558n4638F214J89870q2191a43441D3648Q4561J50533a29807
15269a3484k70079E8152b5953l445I0091i9008J932j701q0257D3898c2994G6998
15256A3447K49850j08234l7261c4550F2628J512J38967i7620a3407B71025j8191
15245B52834a51414b8778A31629J70922F4911a45316G2777a72207C78916A55912
15234a65799e6377A21063d1693A53857J30114J72252K11549M52316O26252m18803
15224A327537L79054l55556C05621A37989L75757A59583m441A4247b25j60094
15214a60319A13790j7490L15515E6010J24415o5399c06775a19577A6297a2289
15203C67333j12533g9182C91056E3923O9038l6320b20397B94147j43122j7945
$$ plain form
15193 133080 67405 185162 -44776 275681 94318 49666 -1549 250088 -88973 -304496 -65529
15181 319611 173933 404441 137737 175562 85038 186482 8075 -34609 -428268 278936
15170 27340 -176053 342282 111227 155885 -128358 -132942 234792 -637 57487 -127573 40801
15158 253398 125770 -30102 -72491 311432 -30184 48976 129501 -135243 -239335 50821 162815
15147 162815 298129 157344 -247260 157486 -79465 102795 103809 236018 -136877 230165
15136 90597 -128328 57920 93086 444966 126292 -9366 211282 192960 78862 -67618 139733
15124 -38940 133334 151327 -351196 207063 270310 116493 -2212 1047 362054 235812 55549
15112 99496 413322 107188 -41073 147846 87042 104532 40017 102116 335564 82528 713422
$$ packed form
15193A33080o5675J17757d4776B75681I4318m4652a549B50088h8973k15523f5529
15181C19611j45678K30508A37737L7825H5038J01444H075c4609l93659B78936
15170B7340a76053C42282A11227M4658a28358m584B34792f37E7487a27573D0801
15158B53398A25770c0102m2389C11432c0184D8976Q0525a35243j04092E0821J11994
15147A62815J35314j40785b47260A57486g9465A02795J014J32209a36877B30165
15136I0597a28328E7920L5166L51880A26292i366B11282j8322G8862f7618A39733
15124c8940A33334J7993c51196B07063O3247A16493b212A047L61007j26242E5549
15112I9496L13826A07188d1073A47846o0804J7490D0017O2099K33448H2528O30894
$$ plain form
15101 713422 265633 216891 153273 -97549 -65421 104947 -151139 200055 158117 54526 1455
15089 -150881 -44100 -63227 340806 -125166 34160 69483 451796 212051 90913 34511 47560
15078 47560 337681 304071 37432 264866 206728 169667 168154 490436 345856 250951 331318
15067 331318 -6562 300885 -97695 -56828 501997 -202643 291288 341688 208139 -87 293486
15055 -37551 193651 319086 -204662 89241 85450 114164 -52171 85392 14831 259140 188249
15044 188249 277634 521517 351268 420192 488625 116732 309076 -48543 231996 94186
15033 268481 -17222 364239 331791 213564 259344 387326 502114 226595 176123 267508
15023 267508 36008 270063 373809 370003 413272 427415 471578 536367 440442 509982 923559
$$ packed form
15101G13422B65633m8742o3618i7549L2128A04947a51139B00055m1938E4526A455
15089a50881d4100j9127C40806a25166C4160L5323L82313B12051I0913C4511J3049
15078D7560K90121l3610C7432K27434n8138l7061j513L22282j44580r4905Q0367
15067C31318f562C00885i7695M0867E01997b02643B91288N0400j33549h7B93486
15055c7551A93651J25435b04662H9241l791K8714e2171H5392A4831K44309p0891
15044A88249Q9385K43883j70249O8924O8433A16732J92344d8543B31996I4186
15033B68481a7222C64239l2448j18227M5780J27982J14788B26595n0472R1385
15023B67508C6008K34055J03746l806M3269J4143M4163O4789r5925O9540M13577
$$ plain form
15012 923559 654317 484418 479877 305821 419561 177381 691913 562519 782343 778898
15002 778898 483290 370303 507564 237619 414172 536875 485123 592106 406557 204446
14992 204446 340288 88889 390989 496821 330938 403874 373972 734361 845563 603024
14982 603024 395745 165382 469163 342343 334429 116560 604201 728199 754393 603959
14972 603959 658576 252528 624059 226098 574728 945825 620113 712970 937295 623653
14962 623653 397699 548167 529294 496434 354762 398124 570438 697538 664055 496975
14952 496975 160167 651768 346500 403496 106925 222840 109562 656998 256313 351606
14942 351606 525700 106838 501483 186033 -174033 371056 299463 366025 367261 396037
$$ packed form
15012I23559k69242j69899m541j74056J13740A77381N14532j29394K19824l445
15002G78898k95608j12987J37261B37619J76553J22703n1752J06983j85549k02111
14992B04446J35842H8889L02100J05832j65883P2936k9902L60389J11202k42539
14982F03024k07279A65382L03781j26820p914A16560M87641J23998K6194j50434
14972F03959N4617B52528L71531B26098L48630L71097l25712R2857K24325l13642
14962F23653k25954J50468j8873l2860j41672M3362J72314J27100l3483j67080
14952D96975A60167M91601l05268N6996A06925J15915A09562N47436B56313R5293
14942C51606J74094A06838L94645A86033a74033C71056p1593O6562J236K8776
$$ plain form
14932 396037 492881 383500 421306 503763 451953 529530 291429 754896 922062 477797
14922 477797 661601 660873 671265 395814 1013383 641974 933781 1065211 1241257 1497210
14912 1497210 1368320 1710183 1384617 1684168 1726455 1753084 1648715 1663914 1948669 1448620
14902 1448620 2104078 2272543 2076934 2090308 1745735 1327643 1441659 1023208 861103 998079
14892 998079 395708 505869 424849 268842 396345 236938 249723 378490 365662 692591
14882 692591 258055 43664 317648 434094 459993 597204 335700 833738 429954 515320
14872 515320 652993 776991 752682 650391 815198 835116 713752 981507 784206 674635
14862 674635 969675 817467 857245 442597 740657 360238 624380 531211 659253 658887
$$ packed form
14932C96037R6844j09381L7806Q2457n1810P7577k38101M63467J67166m44265
14922D77797J83804p28J0392k75451O17569l71409K91807J31430J76046K55953
14912A497210j28890L41863l25566K99551M2287K6629j04369J5199K84755n00049
14902A448620O55458J68465j95609J3374l44573m18092J14016m18451j62105J36976
14892I98079C95708J10161q1020j56007J27503j59407J2785J28767j2828L26929
14882F92591B58055D3664K73984J16446K5899J37211k61504M98038m03784Q5366
14872E15320J37673J23998k4309j02291J64807J9918j21364K67755j97301j09571
14862F74635K95040j52208L9778m14648K98060C60238K64142r3169J28042l66
$$ plain form
14852 658887 606642 273178 642497 1023134 817948 685506 881836 404079 779095 535549
14842 535549 439309 596655 469167 565628 2811 681788 494680 706029 379755 636906
14832 636906 884547 545209 707923 1108128 965510 1340055 1152499 835956 1001880 1665097
14822 1665097 901091 885899 709272 804322 740146 849935 398478 601403 501762 798882
14812 798882 724356 868727 725048 595077 950389 554487 807761 703520 390902 407515
14802 407515 918930 650346 668256 562690 632435 493688 705782 822706 647222 706376
14792 706376 798454 1022207 788963 681161 1224100 982269 1137973 588702 629648 799092
14782 799092 580498 647335 898472 662319 240149 349767 665262 959932 635840 665314
$$ packed form
14852F58887n2245B73178L69319L80637k05186j32442J96330D04079L75016k43546
14842E35549r6240J57346j27488R6461B811O78977j87108K11349l26274K57151
14832F36906K47641l39338J62714M00205j42618L74545j87556l16543J65924O63217
14822A665097p64006j5192j76627R5050o4176J09789C98478K02925r9641K97120
14812G98882p4526J44371j43679j29971L55312l95902K53274j04241l12618J6613
14802D07515N11415k68584J7910j05566O9745j38747K12094J16924j75484N9154
14792G06376R2078K23753k33244j07802N42939k41831J55704n49271M0946J69444
14782G99092k18594O6837K51137k36153B40149J09618L15495K94670l24092K9474
$$ plain form
14772 665314 687965 533556 630977 455948 685530 770467 626367 788151 570007 580344
14762 580344 937256 687217 672748 1041334 912905 943337 717127 722617 654681 457465
14752 457465 282952 516212 481392 439477 1119118 569919 607636 758501 441844 849597
14742 849597 691588 574542 578987 684527 676057 408524 533059 397750 949237 507458
14732 507458 516820 655976 844169 590706 985836 922777 826854 727962 795045 1019379 993879
14721 993879 940073 916131 808910 1134241 900069 1152548 1189538 1416210 1448724 1153170
14711 1153170 1487341 1819965 1532572 1486286 1264154 1064024 1036528 1121834 1060386 833874
14701 833874 1163919 796232 675830 916402 689012 702499 899932 1057796 1023768 1324925
$$ packed form
14772F65314K2651j54409R7421j75029K29582Q4937j44100J61784k18144J0337
14762E80344L56912k50039j4469L68586j28429L0432k26210N490o7936j97216
14752D57465j74513K33260l4820m1915O79641n49199L7717J50865l16657M07753
14742H49597j58009j17046M445J05540q470k67533J24535j35309N51487m41779
14732E07458R362J39156J88193k53463L95130o3059r5923r8892O7083K24334k5500
14721I93879n3806k3942j07221L25331k34172K52479L6990K26672L2514k95554
14711A153170L34171L32624k87393m6286k22132k00130k7496Q5306o1448k26512
14701H33874L30045l67687j20402K40572k27390J3487J97433J57864l4028L01157
$$ plain form
14691 1324925 1118389 1047034 1251592 1239135 1724399 1682036 1857116 1766190 1662554 1520994
14681 1520994 1077260 1072921 1083797 1078731 682916 829997 1162207 1347487 1032570 1274596
14671 1274596 1001694 1214334 936768 792503 1232338 846034 937974 901435 1013469 1261100
14661 1261100 1157447 1174735 1151049 1008713 1109322 1163325 912612 947750 1225933 1263796
14651 1263796 1051343 784187 1179482 1207968 1272547 1193929 1110059 922057 908004 782586
14641 782586 1156759 1412968 1320582 1122159 1279917 1267002 1436465 1019451 938129 1226214
14631 1226214 1381267 1181869 1218381 1213821 1252460 1147569 1366284 1319085 1214064 1134424
14621 1134424 997497 1094415 1399842 1202656 1131340 1251206 1063183 1108607 1502806 1469174
$$ packed form
14691A324925k06536p1355K04558j2457M85264m2363J75080r0926j03636j41560
14681A520994m43734m339J0876n066l95815J47081L32210J85280l14917K42026
14671A274596k72902K12640k77566j44265M39835l86304R1940l6539J12034K47631
14661A261100j03653J7288k3686j42336J00609N4003k50713L5138K78183L7863
14651A263796k12453k67156L95295K8486O4579p8618q3870j88002j4053j25418
14641G82586L74173K56209r2386j98423J57758j2915J69463m17014q1322K88085
14631A226214J55053j99398L6512m560L8639j04891K18715m7199j05021p9640
14621A134424j36927R6918L05427j97186p1316J19866j88023M5424L94199l3632
$$ plain form
14611 1469174 1575510 1491452 1350038 1347351 1366397 1398616 856444 1308547 1789258 1380256
14601 1380256 2008254 1350500 1223974 1300439 1581200 1395739 1575325 1544050 1629394 1366973
14591 1366973 1451340 1823088 1698716 1682465 1680253 1593865 1260173 1533994 1867323 1547179
14581 1547179 2064014 1841388 1870399 1836912 1853143 1661412 2032403 1774311 1690522 1669004
14571 1669004 1833984 1910797 1878761 1585176 1959978 2048956 1998907 2165562 2135173 2288514
14561 2288514 2106519 2047304 2067636 2226708 2244925 2294909 2259607 2522686 2577697 2828902
14551 2828902 2252705 2553706 2480932 2505784 2511637 2725365 2897252 2904454 3303587 3232064 3597391
14540 3597391 3723199 4210827 4793240 5074108 5734371 7279070 9676395 13694379 19535018
$$ packed form
14611A469174J06336q4058j41414k687J9046L2219n42172M52103M80711m09002
14601A380256O27998o57754j26526P6465K80761j85461J79586l1275Q5344k62421
14591A366973Q4367L71748j24372j6251k212q6388l33692K73821L33329l20144
14581A547179N16835k22626K9011l3487J6231j91731L70991k58092q3789k1518
14571A669004J64980P6813l2036k93585L74802Q8978n0049J66655l0389J53341
14561B288514j81995n9215K0332J59072J8217M9984l5302K63079N5011K51205
14551B828902n76197L01001p2774K4852N853K13728J71887P202L99133p1523L65327
14540C597391J25808M87628N82413K80868O60263J544699K397325M017984N840639
$$ plain form
14531 19535018 29950311 33400077 20301186 11674839 7000918 5146362 4475465 4075676
14523 4075676 4548617 5849044 4473489 3155533 2781316 2757625 2647013 2444673 2539890
14514 2539890 2640683 2486725 2224894 2298450 2398172 2197715 2332642 2273160 2630345 2650433
14504 2650433 2741492 2306983 2652127 2652004 2662006 2577116 2679665 2670012 2781429 2699250 2514896
14493 2514896 2865646 2811952 3079213 3129323 3074573 2856650 3296653 3205513 2822198 3296238
14483 3296238 3289708 2880840 3152074 3546054 3172342 3403811 3566084 3776235 3448182 3561881
14473 3561881 3475757 3579483 3734594 3542362 4085809 3564828 3885203 3875427 4113678 3960100
14463 3960100 3809118 3999971 3944734 4149669 4517034 4070245 4342616 4332698 4559095 4671207
$$ packed form
14531A9535018J0415293L449766j3098891q626347m673921j854556o70897l99789
14523D075676M72941J300427j375555j317956l74217k3691j10612k02340R5217
14514B539890J00793j53958k61831P3556R9722k00457J34927n9482L57185K0088
14504B650433R1059m34509L45144j23J0002q4890J02549r653J11417q2179j84354
14493B514896L50750n3694K67261N0110n4750k17923M40003r1140l83315M74040
14483C296238o530m08868K71234L93980l73712K31469J62273K10151l28053J13699
14473C561881q6124J03726J55111j92232N43447n20981L20375r776K38251j53578
14463C960100j50982J90853n5237K04935L67365m46789K72371r918K26397J12112
$$ plain form
14453 4671207 4351360 4496195 4737267 4572170 4632061 4959733 4885046 4530458 4816730 4859570
14443 4859570 5501897 4994064 5543698 5150285 5414076 5528797 5526856 5621149 5234179 5468844
14433 5468844 6021860 6116986 5795669 6179186 6230502 6152710 6076327 6430574 5984169 6511140
14423 6511140 6448368 6390894 6538416 6772007 7118129 7056234 7006419 7209088 7572775 7320034
14413 7320034 7630576 7246721 7260261 7765815 8106895 7833241 8480531 8665401 8849312 9223938
14403 9223938 8873940 8890011 9087964 9179153 9492035 9245272 9189827 9306589 9292119 9719076
14393 9719076 10200118 9978898 10448730 10278796 10557359 10640167 11441286 10747895 10909179 11282028
14383 11282028 11564756 11368446 11932379 12236948 12592641 12507400 12676781 12557610 12974234
$$ packed form
14453D671207l19847J44835K41072j65097N9891L27672p4687l54588K86272M2840
14443D859570O42327n07833N49634l93413K63791J14721j941R4293l86970K34665
14433E468844N53016R5126l21317L83517N1316p7792p6383L54247m46405N26971
14423F511140o2772n7474J47522K33591L46122o1895m9815K02669L63687k52741
14413G320034L10542l83855J3540N05554L41080k73654O47290J84870J83911L74626
14403I223938l49998J6071J97953R1189L12882k46763n5445J16762j4470M26957
14393I719076M81042k21220M69832j69934K78563Q2808Q01119o93391J61284L72849
14383A1282028K82728j96310N63933L04569L55693q5241J69381j19171M16624
$$ plain form
14374 12974234 13403227 13442619 13690162 13748950 13957689 14323874 14846862 15142832 15705862 15248291
14364 15248291 15899069 16018058 16435000 16948567 17059337 17534121 17909778 17844032 18482567
14355 18482567 18997166 19021541 19324670 20214647 20360937 20917064 21447789 21626447 22312142
14346 22312142 22445724 23143608 22923000 23525506 24656616 24934688 25546353 26047434 26941533
14337 26941533 27652614 28313320 28464347 29370697 30262356 30823966 31820008 32966817 33621975
14328 33621975 34709709 35586407 36471225 37412646 38714925 39501957 40533109 41738078 42900948
14319 42900948 44443983 45616905 47134179 48786077 50345290 51967223 53369886 55207168
14311 55207168 57043552 59270648 61304029 63526024 65867940 68218681 70854947 73699375
$$ packed form
14374A2974234M28993L9392K47543N8788K08739L66185N22988K95970N63030m57571
14364A5248291O50778J18989M16942N13567J10770M74784L75657o5746O38535
14355A8482567N14599K4375L03129Q89977J46290N56127N30725J78658O85695
14346B2312142J33582O97884k20608O02506J131110K78072O11665N01081Q94099
14337B6941533P11081O60706J51027R06350Q91659N61610R96042J146809O55158
14328C3621975J087734Q76698Q84818R41421J302279P87032J031152J204969J162870
14319D2900948J543035J172922J517274J651898J559213J621933J402663J837282
14311E5207168J836384K227096K033381K221995K341916K350741K636266K844428
$$ plain form
14303 73699375 76372328 79193768 82223984 85422732 88739426 92318161 96114024 100054178
14295 100054178 104379902 109239740 113571964 118343086 124012435 130085267 135554381 141954882
14287 141954882 148813283 155768870 163395628 171591611 179959290 188635341 198345511 208124990
14279 208124990 218753535 230021588 241892692 254178644 267523312 280767751 294899136
14272 294899136 309612326 324000772 338619964 353594285 368257171 382745362 396791133
14265 396791133 409545307 421022822 431387310 440880363 449111847 456351149 463056868
14258 463056868 467551040 468416589 468841347 469352425 467879041 459995864 453813754 444559787
14250 444559787 432943961 420854084 407735232 394121780 381593985 368022428 354181093
$$ packed form
14303G3699375K672953K821440L030216L198748L316694L578735L795863L940154
14295A00054178M325724M859838M332224M771122N669349O072832N469114O400501
14287A41954882O858401O955587P626758Q195983Q367679Q676051R710170R779479
14279B08124990J0628545J1268053J1871104J2285952J3344668J3244439J4131385
14272B94899136J4713190J4388446J4619192J4974321J4662886J4488191J4045771
14265C96791133J2754174J1477515J0364488R493053Q231484P239302O705719
14258D63056868M494172Q65549M24758N11078j473384p883177o182110r253967
14250D44559787j1615826j2089877j3118852j3613452j2527795j3571557j3841335
$$ plain form
14243 354181093 340191610 326136464 312652374 298787920 285209403 272842799 260522570
14236 260522570 248810839 237138812 224940108 213902517 203352876 192940678 183037199
14229 183037199 174195533 165393552 157574046 149762908 142429790 136080638 129994240 124231375
14221 124231375 119067584 113555878 108803989 104460221 100033173 96030567 92291970 88556869
14213 88556869 85097916 81959019 78571128 75563624 72920689 70640380 68232323 65652730
14205 65652730 63751866 61466197 59350203 57295594 55951557 53761244 52449824 50782790
14197 50782790 49070497 47631212 46196778 44788224 43556927 42657329 41498468 40140305
14189 40140305 39275279 37581953 37199014 35954101 35184342 34319591 33251550 32069131 31499795
$$ packed form
14243C54181093j3989483j4055146j3484090j3864454j3578517j2366604j2320229
14236B60522570j1711731j1672027j2198704j1037591j0549641j0412198r903479
14229A83037199q841666q801981p819506p811138p333118o349152o086398n762865
14221A24231375n163791n511706m751889m343768m427048m002606l738597l735101
14213H8556869l458953l138897l387891l007504k642935k280309k408057k579593
14205F5652730j900864k285669k115994k054609j344037k190313j311420j667034
14197E0782790j712293j439285j434434j408554j231297q99598j158861j358163
14189D0140305q65026j693326l82939j244913p69759q64751j068041j182419n69336
$$ plain form
14180 31499795 31035143 30115163 29506283 28836755 27579389 27316448 26921224 26179628 25305048
14171 25305048 25019375 24267599 23900123 23346835 22632465 22312670 21638504 21596020 20812751
14162 20812751 20472525 20097909 19562934 19081295 18602270 18229593 17690411 17840929 17516833
14153 17516833 17071326 16727413 16102611 16402404 15603244 15702520 15328959 15066793 14712958
14144 14712958 14548258 14374325 13717995 13897976 13480145 13084777 13145462 12482336 12407918 12469060
14134 12469060 12132433 12043470 11904538 11621964 11068747 11343669 10790556 11055479 10874163
14125 10874163 10739736 10374835 10276158 10205825 10192667 9880947 9720494 9409481 9398243 9480936
14115 9480936 8921027 8801238 9164104 8421159 8500445 8276926 8403253 8438138 8278772 8229698
$$ packed form
14180C1499795m64652r19980o08880o69528j257366k62941l95224p41596q74580
14171B5305048k85673p51776l67476n53288p14370l19795o74166m2484p83269
14162B0812751l40226l74616n34975m81639m79025l72677n39182J50518l24096
14153A7516833m45507l43913o24802K99793p99160R9276l73561k62166l53835
14144A4712958j64700j73933o56330J79981m17831l95368O0685o63126p4418O1142
14134A2469060l36627q8963j38932k82574n53217K74922n53113K64923j81316
14125A0874163j34427l64901r8677p0333j3158l11720j60453l11013j1238Q2693
14115I480936n59909j19789L62866p42945P9286k23519J26327L4885j59366m9074
$$ plain form
14105 8229698 7676964 8110266 8047252 7472215 7656667 7481753 7178339 7330625 7231669 7141811
14095 7141811 6960900 7032352 6752215 6611972 6833041 6820936 6753043 6640385 6530592 6521645
14085 6521645 6303491 6261647 6048948 6045941 5819183 5856914 6106353 5583838 5745429 5589913
14075 5589913 5336257 5451615 5473863 5241580 5307704 4939056 5528122 5297720 5115760 4896658
14065 4896658 4871257 4758205 4754626 4743779 4824308 4771882 4610652 4651681 4788763 4725843 4498787
14054 4498787 4534441 4574011 4103010 4527613 4214049 4273631 4483171 4314969 4012667 4044783
14044 4044783 4202315 4351038 3846352 4020740 3919189 4119794 4047284 3830195 3825569 3798952
14034 3798952 3453433 3620522 3591114 3742711 3511656 3529497 3527409 3574081 3157244 3235079
$$ packed form
14105H229698n52734M33302o3014n75037J84452j74914l03414J52286r8956q9858
14095G141811j80911P1452k80137j40243K21069j2105o7893j12658j09793q947
14085F521645k18154m1844k12699l007k26758L7731K49439n22515J61591j55516
14075E589913k53656J15358K2248k32283O6124l68648N89066k30402j81960k19102
14065D896658k5401j13052l579j0847Q0529n2426j61230M1029J37082o2920k27056
14054D498787L5654L9570m71001M24603l13564N9582K09540j68202l02302L2116
14044D044783J57532J48723n04686J74388j01551K00605p2510k17089m626k6617
14034C798952l45519J67089k9408J51597k31055J7841k088M6672m16837P7835
$$ plain form
14024 3235079 3288070 3288171 3373863 3146655 3058434 3313276 3046193 3168181 3141718 3460154 3164068
14013 3164068 3052911 3124586 2921261 2918536 2899448 3238162 2967072 2811103 2864402 3047724
14003 3047724 2499377 2739676 2650704 2718709 2870480 2938147 2934861 2321136 2774843 2483857
13993 2483857 2545717 2401549 2657230 2592613 2466240 2316636 2684203 2413507 2550097 2370678
13983 2370678 2376182 2442742 2061887 2584600 2769260 2994498 3548417 3659759 4366214 5711595
13973 5711595 8862615 14123356 24081605 34930564 24437258 15825148 10469034 8078524
13965 8078524 6166838 5184291 4714575 4326088 4021960 3473317 3658538 3415055 3004749
13956 3004749 2890608 2959224 2582213 2572837 2390621 2733870 2637614 2523548 2505926 2261202
$$ packed form
14024C235079N2991J01Q5692k27208q8221K54842k67083J21988k6463L18436k96086
14013C164068j11157P1675k03325k725j9088L38714k71090j55969N3299J83322
14003C047724n48347K40299q8972O8005J51771O7667l286o13725M53707k90986
13993B483857O1860j44168K55681o4617j26373j49604L67567k70696J36590j79419
13983B370678N504O6560l80855N22713J84660K25238N53919J11342P06455J345381
13973E711595L151020N260741R958249J0848959j0493306q612110n356114k390510
13965H078524j911686r82547m69716l88487l04128n48643J85221k43483m10306
13956C004749j14141O8616l77011r376j82216L43249r6256j14066j7622k44724
$$ plain form
13946 2261202 2527938 2063022 2138334 2162548 2048150 2193567 2214931 2220677 2074569 2298582
13936 2298582 1936594 2052975 1967513 1714374 1615254 1644539 1863646 1685836 1781607 1961725
13926 1961725 1962040 1832933 1718307 1873718 1666426 1921081 2153608 1763809 1811377 1671669
13916 1671669 1887592 1886550 1826726 1737306 2089971 1528495 1619791 1817787 1747689 1715217 1563003
13905 1563003 1731636 1364597 1665878 1470132 1555206 1378926 1918457 1605941 1500164 1370397
13895 1370397 1664206 1342550 1166692 1679387 1426871 1461261 1674953 1475503 1648939 1442570
13885 1442570 1432852 1091167 1541100 1261288 1405288 1579681 1562810 1239166 1417803 1376729
13875 1376729 1548158 1065963 1047650 1374204 1154879 1010511 1075752 1452479 1389781 1002398
$$ packed form
13946B261202K66736m64916P5312K4214j14398J45417K1364N746j46108K24013
13936B298582l61988J16381q5462k53139r9120K9285K19107j77810R5771J80118
13926A961725L15j29107j14626J55411k07292K54655K32527l89799M7568j39708
13916A671669K15923j042n9824q9420L52665n61476R1296J97996p0098l2472j52214
13905A563003J68633l67039L01281j95746Q5074j76280N39531l12516j05777j29767
13895A370397K93809l21656j75858N12695k52516L4390K13692j99450J73436k06369
13885A442570r718l41685M49933k79812J44000J74393j6871l23644J78637m1074
13875A376729J71429m82195j8313L26554k19325j44368O5241L76727o2698l87383
$$ plain form
13865 1002398 1513863 1232612 1062792 1308741 1380064 1030025 1145477 1260106 1166757 1460975
13855 1460975 1398021 929356 1312429 1038286 1130895 1075675 917470 1155812 990041 1182626
13845 1182626 1205497 1283284 1271564 1380244 1112699 871726 969005 989921 1186339 837360
13835 837360 1098750 992493 1128847 1265345 1235782 1001340 1405654 1190109 1218375 1129131
13825 1129131 965259 959523 779439 744278 1033348 953006 806914 1334713 733578 805657
13815 805657 922945 1033304 932510 983619 824253 1071635 864929 907047 934691 857455
13805 857455 691759 1152589 1051393 930879 685442 810138 843467 636186 915432 561331
13795 561331 641430 797603 729612 702301 913687 1024289 631449 778584 809083 914698
$$ packed form
13865A002398N11465k81251j69820K45949P1323l50039J15452J14629r3349K94218
13855A460975o2954m68665L83073k74143R2609n5220j58205K38342j65771J92585
13845A182626K2871P7787j1720J08680k67545k40973R7279K0916J96418l48979
13835H37360K61390j06257J36354J36498k9563k34442M04314k15545K8266q9244
13825A129131j63872n736j80084l5161K89070q0342j46092N27799o01135P2079
13815H05657J17288J10359j00794N1109j59366K47382k06706M2118K7644p7236
13805H57455j65696M60830j01196j20514k45437J24696L3329k07281K79246l54101
13795E61331Q0099J56173o7991k7311K11386J10602l92840J47135L0499J05615
$$ plain form
13785 914698 782006 805667 648845 796844 971024 615047 917059 772999 814453 831574
13775 831574 523576 750092 578520 769349 753680 325484 552283 652280 673437 896034
13765 896034 963054 719841 876784 561043 780608 739534 477779 920744 868452 839986
13755 839986 669314 849814 762225 694722 724815 706918 702346 447157 782683 652021 800197
13744 800197 746513 700195 571992 607311 756936 608553 680715 785158 803744 625844
13734 625844 557528 688976 820376 643076 371330 782182 888662 607981 527333 517043
13724 517043 964480 738101 918673 578406 433929 592090 363790 587233 885893 520267
13714 520267 779996 594757 740606 633782 693345 688911 509749 477406 439675 675806
$$ packed form
13785I14698j32692K3661j56822J47999J74180l55977L02012j44060M1454J7121
13775H31574l07998K26516j71572J90829j5669C25484K26799R9997K1157K22597
13765H96034O7020k43213J56943l15741K19565m1074k61755M42965n2292k8466
13755H39986j70672J80500q7589o7503L0093j7897m572k55189L35526j30662J48176
13744H00197n3684m6318j28203L5319J49625j48383P2162J04443J8586j77900
13734F25844o8316J31448J31400j77300k71746M10852J06480k80681q0648j0290
13724E17043M47437k26379J80572l40267j44477J58161k28300K23443K98660l65626
13714E20267K59729j85239J45849j06824N9563m434j79162l2343l7731K36131
$$ plain form
13704 675806 722866 697186 633370 603435 647216 514062 378175 451312 608718 506317 497029
13693 497029 362468 612247 564002 541273 540165 360583 671929 248117 324446 681230
13683 681230 585372 624341 523578 496197 459993 697801 588608 386762 820215 704787
13673 704787 282431 187898 673897 153421 590044 971248 417772 385957 634746 576767
13663 576767 588089 487866 150869 447737 198326 534028 564753 661558 378538 457527
13653 457527 395787 653743 408348 393434 357780 103451 775595 593939 543373 334559
13643 334559 405291 588961 479624 462406 179000 295221 436345 378622 483959 572022
13633 572022 284163 287952 586512 393061 161389 588736 459049 711715 616416 925334
$$ packed form
13704F75806M7060k5680o3816k9935M3781j33154j35887P3137J57406j02401r288
13693D97029j34561K49779m8245k2729j108j79582L11346B48117P6329L56784
13683F81230r5858L8969j00763k7381l6204K37808j09193k01846M33453j15428
13673G04787B82431r4533M85999A53421M36623L81204D17772l1815K48789n7979
13663E76767J1322j00223A50869K96868A98326L35702L0725R6805k83020P8989
13653D57527o1740K57956k45395j4914l5654A03451O72144j81656n0566k08814
13643C34559P0732J83670j09337j7218A79000J16221J41124n7723J05337Q8063
13633E72022B84163L789K98560j93451A61389M27347j29687K52666r5299L08918
$$ plain form
13623 925334 399275 201522 154305 267236 466588 416991 800388 377355 327303 211867
13613 211867 311796 581532 746016 -7526 562547 253823 332274 738320 674847 562010
13603 562010 100093 521362 50879 309601 217303 551544 248328 444507 240498 317913
13593 317913 452517 311614 224905 193082 231221 245981 441304 310556 186874 357547
13583 357547 329435 265365 461662 147317 156805 428966 138538 137553 291820 806586 390969
13571 381139 639857 340483 430489 171932 175662 259524 625407 613179 331437 165633
13560 197242 288730 192986 522139 364794 329210 651507 527732 243249 405074 280253
13550 280253 80998 9718 130149 -67345 371632 472147 303209 258259 123356 2551 -33972
$$ packed form
13623I25334C99275j97753m7217J12931J99352m9597L83397C77355n0052j15436
13613B11867R9929K69736J64484g526E62547B53823P8451M06046o3473j12837
13603E62010A00093M21269E0879K58722r2298L34241B48328J96179k04009P7415
13593C17913J34604j40903q6709l1823L8139J4760J95323j30748j23682J70673
13583C57547k8112o4070J96297A47317R488K72161A38538r85J54267N14766C90969
13571C81139K58718k99374R0006A71932L730Q3862L65883j2228k81742A65633
13560A97242R1488r5744L29153j57345l5584L22297j23775B43249J61825j24821
13550B80253H0998I718J20431f7345C71632J00515j68938m4950A23356B551c3972
$$ plain form
13538 274546 211735 227736 333054 527841 310547 122496 560153 310610 399942 541378
13528 541378 -29150 330085 41020 207205 166130 395362 578214 142561 277006 652348
13518 652348 108103 441773 507302 492703 282655 70178 220623 324623 234299 373655
13508 373655 195319 369332 52016 683207 426685 369919 -19724 178716 9100 -2194 546617
13496 214671 296715 125216 254273 364140 142129 92079 421100 436557 270034 260949
13486 260949 586941 83162 338623 165531 332934 184002 127549 -10304 280585 421649
13476 421649 355841 382313 268689 377157 618867 180594 -24611 366692 424466 268782
13466 268782 321059 384156 169222 -46225 252425 259138 631378 278256 154386 311105
$$ packed form
13538B74546o2811J6001J05318J94787k17294A22496M37657k49543Q9332J41436
13528E41378b9150C30085D1020J66185m1075K29232J82852A42561J34445L75342
13518F52348A08103L33670O5529j4599k10048G0178J50445J04000r0324J39356
13508C73655j78336J74013E2016O31191k56522n6766a9724A78716I100b194E46617
13496B14671Q2044A25216J29057J09867A42129n0050L29021J5457j66523r085
13486B60949L25992H3162K55461A65531J67403j48932n6453a0304B80585J41064
13476D21649o5808K6472j13624J08468K41710A80594b4611C66692N7774j55684
13466B68782N2277O3097A69222d6225B52425O713L72240B78256j23870J56719
$$ plain form
13456 311105 229689 -207719 -44643 257370 498234 141291 -50978 117999 157179 341231
13446 341231 3738 245458 95677 596827 480862 299084 107991 50680 -148293 8153 27909
13435 27909 -45953 126818 79897 -164126 281741 -78670 234160 368128 330663 304417 190646
13424 190646 412734 27113 88978 -8363 291895 148408 335171 263600 345702 221455 392899
13413 392899 17874 465956 226117 305572 35429 281951 -3551 239992 226020 109968 49459
13401 -13689 238076 163987 19236 55270 89107 252942 132557 224180 776334 158483 66604
13389 57494 443952 -3262 395162 148076 43246 57812 391117 209307 232275 216152 70831
13377 81817 274798 43362 119496 411217 204863 12470 124191 -59996 249220 124488
$$ packed form
13456C11105q1416b07719d4643B57370K40864A41291e0978A17999L9180J84052
13446C41231C738K41720I5677N01150j15965j81778A07991E0680a48293H153J9756
13435B7909d5953A26818m6921a64126B81741g8670B34160J33968l7465k6246j13771
13424A90646K22088B7113O1865h363B91895j43487J86763p1571Q2102j24247J71444
13413C92899A7874M48082B26117P9455C5429K46522c551B39992j3972A09968D9459
13401a3689B38076p4089A9236L6034L3837J63835j20385R1623N52154A58483F6604
13389E7494L86458c262C95162A48076D3246J4566L33305j81810K2968j6123G0831
13377H1817J92981D3362P6134K91721B04863A2470J11721e9996B49220A24488
$$ plain form
13366 -58907 251698 -29550 261100 276441 293877 351114 341144 405415 307868 118420 -12858
13354 -131734 336067 360364 324602 105990 306302 438770 251744 52386 433598 202529
13343 257856 279706 392472 -117224 -91132 269966 376027 4679 261536 297353 29914 90620
13332 90620 194392 105568 529917 207019 358051 420090 151635 327507 -2866 69677 49774
13321 49774 197726 320971 533325 591152 442566 307836 -108107 93072 164304 204902
13311 204902 416177 300078 327906 46460 -143979 324283 158316 36549 171130 221085
13301 221085 -57911 247410 421314 300750 353325 209500 82511 505043 510050 301046
13291 301046 266579 181442 -319641 47534 -106567 49988 -109921 261683 284122 118059
$$ packed form
13366e8907B51698b9550B61100J5341J7436N7237r970O4271r7547A18420a2858
13354a31734C36067K4297l5762A05990K00312J32468j87026E2386L81212B02529
13343B57856K1850J12766a17224K6092B69966J06061D679K56857L5817B9914O0706
13332I0620J03772q8824M24349B07019J51032O2039A51635J75872b866F9677j9903
13321D9774J47952J23245K12354N7827j48586j34730a08107I3072P1232M0598
13311B04902K11275j16099K7828D6460a43979C24283A58316C6549J34581M9955
13301B21085e7911B47410J73904j20564N2575j43825H2511M22532N007k09004
13291C01046l4467q5137c19641D7534a06567D9988a09921B61683K2439A18059
$$ plain form
13280 -122476 102510 -39945 249662 -39636 312055 90474 40619 79967 -20550 138409 -68401
13268 -50411 188225 116900 185742 81410 -135074 135166 -269002 400024 338113 112422
13257 11992 195599 228740 128131 220285 388008 105324 -36370 187321 203915 518596
13247 518596 72239 228128 111437 141062 -114608 -13006 2124 227970 95987 84235 372007
13236 372007 177996 35924 56618 152118 -129649 388468 263577 406313 27992 273781
13226 273781 -32605 229862 -32192 208062 121504 282251 -19406 113459 154304 208731 60438
13214 464670 1198 123119 41877 346575 234793 438054 287620 156465 -28333 -241408
13204 -241408 266943 234316 -253254 401709 199657 137158 78094 10813 371237 -81451
$$ packed form
13280a22476A02510c9945B49662c9636C12055I0474D0619L9348b0550A38409f8401
13268e0411A88225p1325O8842H1410a35074A35166b69002D00024o1911A12422
13257A1992J83607L3141j00609R2154J67723A05324c6370A87321J6594L14681
13247E18596G2239J55889A11437K9625a14608a3006B124K25846I5987j1752K87772
13236C72007A77996C5924K0694R5500a29649C88468j24891J42736B7992K45789
13226B73781c2605B29862c2192B08062q6558J60747a9406A13459M0845N4427F0438
13214D64670A198J21921D1877L04698j11782K03261j50434j31155b8333k13075
13204b41408B66943l2627b53254D01709A99657o2499n9064A0813L60424h1451
$$ plain form
13193 83145 1512 96963 136475 421518 15447 -23607 5030 -224777 122614 -113407 161876
13181 84382 411400 -132836 26114 -325204 196609 -53486 202055 247789 241023 383076 247831
13170 247831 192318 213459 95442 105127 54801 81963 -126900 162238 158596 -47327 -86694
13159 -86694 -253272 419437 -56529 396761 -254834 238916 104569 -34997 107002 76166
13149 76166 -253729 -6861 62138 -93004 332747 226041 238442 -36794 124890 -53978 25643
13137 235356 79751 -93661 -24227 -83342 405892 -18919 -75651 -2250 -19894 325041 64443
13125 -25702 100392 129083 183876 30013 405991 82801 179639 129894 -15769 124680 119842
13114 119842 271160 -30345 -34782 68662 42151 298733 -19000 -110155 -80730 321897 38349
$$ packed form
13193H3145A512R5451L9512K85043A5447b3607E030b24777A22614a13407A61876
13181H4382L27018a32836B6114c25204A96609e3486B02055M5734o766J42053j35245
13170B47831n5513K1141I5442R685n0326K7162a26900A62238l642d7327l9367
13159h6694j66578D19437e6529C96761b54834B38916A04569c4997A07002l0836
13149G6166b53729f861F2138i3004C32747j06706J2401c6794A24890e3978B5643
13137B35356G9751i3661b4227n9115D05892a8919n6732b250j7644C25041F4443
13125b5702A00392K8691N4793C0013L75978H2801R6838m9745a5769A24680m838
13114A19842J51318c0345m437F8662k6511K56582a9000r1155K9425C21897C8349
$$ plain form
13102 -119793 386543 108855 177342 1401 -61895 -162499 -178882 43687 329061 143231 84373
13091 84373 -222966 251335 48496 115881 140768 29200 115045 -48290 -292670 47835 17922
13079 112704 241967 56823 31503 152525 16994 -51601 23949 75106 55313 -82853 158237
13067 -280372 275388 -277574 -73804 -100284 240367 64969 162311 -57419 154011 -232128
13056 34529 -76597 -142642 410370 4303 162744 198608 83963 64574 37223 -9642 -142806
13045 -142806 67163 -201316 111313 -128905 238116 318321 228641 130386 236137 181080
13035 181080 -97731 26370 -30989 89112 103137 90675 184396 1226 45167 -116486 115402
13023 -140234 171469 55266 -25216 -184655 43393 561 56909 197447 142823 -26954 301987
$$ packed form
13102a19793C86543A08855O8487A401f1895j00604j6383D3687K85374A43231n8858
13091H4373b22966B51335D8496O7385K4887B9200Q5845d8290k44380D7835A7922
13079A12704J29263E6823k5320J21022A6994e1601B3949N1157j9793h2853A58237
13067b80372B75388b77574g3804k6480B40367F4969R7342e7419A54011b32128
13056C4529g6597o6045D10370D303J58441L5864H3963j9389k7351i642j33164
13045a42806F7163b01316A11313a28905B38116Q0205q9680r8255J05751n5057
13035A81080i7731B6370c0989H9112J4025j2462R3721A226M3941a16486A15402
13023a40234A71469E5266b5216j59439D3393E61N6348J40538n4624b6954C01987
$$ plain form
13011 117744 85067 22 271654 18017 201856 132602 152101 34470 95023 199872 122006
13000 122006 32568 65857 136081 167523 17997 -238948 -268716 -54374 -12647 416452 100065
12988 151583 -2249 32362 -89648 -57123 218416 -255871 212752 228119 289132 244818 -130932
12976 73172 -43305 1713 114443 139944 -39489 -182673 -46481 156445 127349 -35648 81467
12964 -46239 97906 133549 125460 175535 121654 -12288 -232806 -58551 -207765 53258 177429
12953 177429 -159945 -46610 105372 236949 263116 244894 352830 28598 215271 -114512
12942 244265 -151428 -147680 145650 30890 209430 -329291 95767 -69582 32218 -68003 -21206
12930 137738 186104 -60000 60193 264314 283279 59559 143342 352021 77964 147331 46957
$$ packed form
13011A17744l2677B2K71632A8017J83839o9254J9499C4470O0553J04849p7866
13000A22006C2568L3289P0224L1442A7997b38948k9768e4374a2647D16452A00065
12988A51583b249C2362h9648L2525B18416b55871B12752J5367O1013m4314a30932
12976G3172d3305A713J12730K5501c9489j43184d6481A56445k9096c5648H1467
12964d6239I7906L5643q089N0075n3881a2288k20518e8551j49214E3258J24171
12953A77429a59945d6610A05372J31577K6167j8222J07936B8598J86673a14512
12942B44265a51428L748A45650C0890J78540c29291I5767f9582C2218f8003b1206
12930A37738M8366f0000F0193K04121J8965E9559Q3783K08679G7964O9367D6957
$$ plain form
12918 304733 275925 5034 398097 296164 122162 28849 269204 102494 -102080 -323370
12908 -323370 -14964 80789 -118204 -102315 282918 146894 -247246 296629 -184593 -154260
12898 -154260 -357903 -271611 183059 102573 46811 187765 -497133 -248656 -180233 -135093
12888 -135093 100159 -268899 217887 -124435 41779 -145136 -66555 -168384 -53381 26294
12877 -225126 165448 -82791 270941 184453 -36130 398549 123776 56775 57704 -280081 106708
12865 -17948 104547 -133853 205964 -18098 168172 40696 18111 91495 -219288 -168261 193603
12853 213890 209733 -169079 -160736 43700 124117 -93930 -35426 -140242 -125971 -272836 8736
12841 -15436 -21991 24333 -122854 165012 -232121 139264 134459 -150942 -58587 -152784 205335
$$ packed form
12918C04733k8808E034L93063j01933A22162B8849K40355A02494a02080k21290
12908c23370a4964H0789a18204J5889B82918j36024b47246B96629a84593L0333
12898a54260k03643Q6292A83059q0486D6811J40954d97133K48477O8423M5140
12888a35093A00159b68899B17887a24435D1779a45136f6555j01829e3381B6294
12877b25126A65448h2791B70941q6488c6130C98549A23776E6775R29b80081A06708
12865a7948A04547a33853B05964a8098A68172D0696A8111P3384b19288N1027A93603
12853B13890m157a69079Q343D3700Q0417i3930c5426j04816J4271j46865H736
12841a5436o555B4333a22854A65012b32121A39264m805a50942e8587r4197B05335
$$ plain form
12829 -250484 75716 121339 48039 202395 134517 136551 -78922 87883 216068 -43524 144491
12817 140999 159657 -123596 79673 -369538 106757 -56845 -88528 -155651 71393 -20601 240583
12805 -224364 -334865 -182003 23 -106375 -48572 -146639 57921 -47304 -5321 258633 -45050
12793 -158692 34451 125644 56255 -316750 -213090 -314761 -172577 8184 136123 -250638
12782 247518 -116896 -221500 -27691 -52142 51311 144398 -229318 38398 -118022 -11511 -133074
12771 -133074 188339 -108637 139634 80936 -54663 -30256 -71532 -179167 -25536 -512680
12761 -512680 -253631 296333 -108990 -127800 -191366 -13600 195820 255584 -95685 123133
12750 -304290 50042 242107 130464 -201810 -99741 148985 43426 -135281 183919 116820
$$ packed form
12829b50484G5716M5623D8039J54356o7878K034g8922H7883J28185d3524A44491
12817A40999J8658a23596G9673c69538A06757e6845l1683o7123G1393b0601B40583
12805b24364j10501J52862B3a06375d8572r8067E7921d7304e321B58633d5050
12793a58692C4451R1193E6255c16750J03660j01671J42184H184J27939b50638
12782B47518a16896j04604b7691k4451E1311R3087b29318C8398a18022a1511j21563
12771a33074A88339a08637A39634n8698e4663K4407m1276j07635b5536m87144
12761e12680b53631B96333a08990j8810o3566a3600A95820N9764i5685A23133
12750c04290E0042J92065j11643b01810i9741A48985D3426a35281A83919o7099
$$ plain form
12740 116820 248497 -140096 -136363 -288238 -134487 142803 -321179 240706 -12195 -127531
12730 -127531 22026 -133110 191919 -17797 181683 319473 37297 -9355 110748 82085 -1118
12718 399352 60030 113415 209853 325167 87353 89451 96846 -10812 192648 -508399 233785
12706 -26375 186962 86581 -416841 -47761 -75136 -141249 -73484 175340 -44124 -10197 -66901
12695 -66901 -1269 168287 191915 406876 -57447 140923 299655 -838 41816 37879 265090
12684 265090 -200077 97001 86446 -106113 157612 134215 306828 45136 25936 -109621
12673 198082 88906 -39723 309896 474873 -27778 -63944 83788 11337 -438013 18244 186122
12662 186122 -70137 -176394 199511 -91769 -16114 -117040 -124871 6977 16109 -77429 165220
$$ packed form
12740A16820J31677a40096L733j51875a34487A42803c21179B40706a2195j15336
12730a27531B2026a33110A91919a7797A81683J37790C7297i355A10748k8663a118
12718C99352F0030N3385R6438J15314H7353K098P395a0812A92648e08399B33785
12706b6375A86962H6581d16841d7761k7375o6113O7765A75340d4124a0197n6704
12695f6901a269A68287K3628K14961e7447A40923J58732h38D1816l937K27211
12684B65090b00077I7001j0555a06113A57612k3397J72613D5136j9200a09621
12673A98082H8906c9723C09896J64977b7778l6166H3788A1337d38013A8244J67878
12662A86122g0137j06257A99511i1769a6114j00926p831F977R132g7429A65220
$$ plain form
12650 1139 -285674 91994 226076 169544 -44040 -63384 129449 145128 11826 272080 139049
12639 139049 124178 312286 76467 206438 86969 3438 -27534 230275 91255 11443 129898
12628 129898 21703 114084 -19030 129182 122965 -177998 146046 141642 -107543 191383 -140199
12616 45429 -23480 -215010 247184 244417 343277 -71596 371835 -22284 237586 179017 263246
12605 263246 -179675 -69182 68514 229648 -420690 34592 108272 -70253 -98094 104923 -142577
12593 312434 -56390 -1384 86008 254322 -130372 -89874 320048 234916 110315 247521 116509
12581 -3145 69104 8658 -355975 -187391 -7721 412791 74855 180647 40728 148566 -115095
12569 -195004 116889 54701 51467 73118 -10619 9970 10000 339848 -112798 8480 -72013 -187707
$$ packed form
12650A139b85674I1994J34082n6532d4040j9344A29449J5679A1826K60254j33031
12639A39049j4871J88108G6467J29971H6969C438b7534B30275I1255A1443J18455
12628A29898B1703R2381a9030A29182o217a77998A46046m404a07543A91383a40199
12616D5429b3480j91530B47184k767R8860g1596C71835b2284B37586n8569Q4229
12605B63246a79675f9182F8514J61134d20690C4592P3680g0253k7841A04923a42577
12593C12434e6390a384H6008J68314a30372M0498C20048q5132A10315J37206A16509
12581c145F9104H658c55975J68584g721D12791G4855J05792D0728J07838a15095
12569a95004A16889E4701l234K1651a0619I970L0L29848a12798H480g2013j15694
$$ plain form
12557 -187707 -119448 68879 -390514 -397404 -15838 139713 -25165 -18243 283154 13139 33203
12546 33203 172211 109607 -31005 96194 71518 -53775 -394579 -46576 -321639 -107704 -163110
12535 -163110 4960 145629 101377 88015 72100 -31075 18911 252841 -198951 7352 -63678
12523 459914 71711 -36097 270403 -25528 -26913 -112192 81904 -142732 113649 162533 -123678
12511 20295 -8448 54173 -40104 156909 111402 83212 -233633 -273434 31587 305651 2843
12499 -476691 278010 -15796 -32652 -154907 46995 -243195 -244354 -37822 81607 258608 -131316
12487 -25640 -93470 537 -246707 -51154 -84056 137851 62264 -200465 228992 -179072 -76000
12475 -11495 -246406 -72243 131254 96491 171 -274127 -50775 104034 -88828 28681 -208248
$$ packed form
12557a87707O8259F8879c90514o890a5838A39713b5165O922B83154A3139K0064
12546C3203J39008o2604c1005I6194k4676e3775l40804d6576k75063a07704n5406
12535a63110D960J40669m4252j3362j5915c1075A8911K33930a98951G352f3678
12523D59914G1711c6097B70403b5528j385q5279H1904a42732A13649M8884a23678
12511B0295h448E4173d0104A56909m5507k8190b33633l9801C1587K74064B843
12499d76691B78010a5796j6856j22255D6995b43195j159c7822H1607J77001a31316
12487b5640o7830E37b46707e1154l2902A37851F2264b00465B28992a79072g6000
12475a1495k34911g2243A31254l4763A71b74127e0775A04034h8828B8681b08248
$$ plain form
12463 -75452 -84604 -372550 -95156 11233 165035 89917 81716 84689 634831 -249681 -135904
12452 -135904 -122116 -133034 -119616 -214887 -246824 -187099 -9923 -325523 -44008 -395523 249106
12440 -219819 -351108 -333309 -65600 -139094 316275 -135465 -456503 -56198 292191 -45213
12429 -22524 204688 -191434 50018 -46378 133706 41762 78774 -11270 -9379 -321082 -43148
12417 362581 -130979 -106542 64862 -274813 -199009 -114694 -134038 -38564 -59078 39122 -241043
12405 139933 -182545 -125046 92287 -256221 -406283 -258447 11799 107380 -57452 -137634 -133190
12394 -133190 -285312 42413 293269 71425 -62198 -137573 -181316 358923 -31711 -145811 -55390
12382 22552 -38301 -47162 17244 -144998 -84018 218597 -108850 202493 -51197 290053 85557
$$ packed form
12463g5452r152k87946i5156A1233J53802p5118q201K973N50142b49681J13777
12452a35904J3788j0918J3418r5271l1937N9725i923l15600d4008l51515B49106
12440b19819j31289J7799f5600p3494C16275a35465l21038e6198B92191d5213
12429b2524B04688a91434E0018d6378A33706D1762L7012a1270J891l11703d3148
12417C62581a30979K4437F4862b74813P5804Q4315j9344c8564k0514C9122b41043
12405A39933a82545N7499I2287b56221j50062J47836A1799R5581e7452q0182M444
12394a33190j52122D2413K50856G1425f2198p5375m3743C58923c1711j14100e5390
12382B2552c8301q861A7244a44998O0980B18597a08850B02493e1197B90053H5557
$$ plain form
12370 89884 188962 -163493 -237643 147385 248807 241106 -265390 189271 166886 -104978 155851
12358 -76725 55393 105568 149666 165251 -7598 213825 247815 -52280 322214 -127913 -166197
12347 -166197 -204878 -40808 90176 5258 -77403 114116 100453 38228 73747 480846 -77906
12335 -2508 138094 192505 -239122 -13773 183269 67683 148404 148064 137945 151753 105501 24928
12322 -318795 -57888 62847 -128648 100667 -206609 228167 -66252 -9076 339720 52415 70228
12311 70228 20328 47896 266853 -70886 -62086 407018 372724 157237 216681 116669 -94396
12299 192542 59364 10568 125656 151673 -91094 430699 -25347 122873 -191546 108933
12288 27223 128966 235722 132355 253473 101151 -70192 -405871 9150 -89508 -78903 -20881
$$ packed form
12370H9884R9078a63493p4150A47385J01422p701b65390A89271k2385a04978A55851
12358g6725E5393N0175M4098J5585g598B13825L3990e2280C22214a27913l8284
12347a66197l8681d0808I0176E258g7403A14116j3663C8228L5519M07099g7906
12335b508A38094N4411b39122a3773A83269F7683Q0721l40j0119J3808m6252B4928
12322c18795e7888F2847a28648A00667b06609B28167f6252i076C39720E2415J7813
12311G0228B0328K7568K18957g0886Q800D07018l4294A57237N9444j00012i4396
12299A92542E9364A0568J15088K6017i1094D30699b5347A22873a91546A08933
12288B7223J01743J06756j03367J21118A01151g0192l35679I150h9508J0605b0881
$$ plain form
12276 -1697 119511 32491 151805 -95906 339602 181665 16233 412837 138823 190313 235539
12265 235539 204161 66417 94682 199619 121312 30614 -129587 478457 224039 186789 181514
12254 181514 20271 -125293 330306 151983 127062 24923 395658 584650 21989 205867
12244 205867 345290 -302266 -18207 -43516 235523 -110073 107423 -135701 392851 30640
12233 -109007 52474 -203869 -50390 -75232 -26639 126955 80498 164765 -165598 338035 59515
12221 63424 251957 -33226 317816 157683 3536 -153404 43365 171717 -112018 288987
12210 161202 197937 -40347 170132 247056 203513 183629 285874 -102218 402052 305028 269384
12199 269384 252688 130315 44185 190312 154706 386417 291390 291014 -4674 298334 139672
$$ packed form
12276a697A19511C2491J19314i5906C39602j57937A6233L96604A38823N1490M5226
12265B35539l1378F6417K8265J04937p8307C0614a29587D78457B24039l7250n275
12254A81514B0271a25293C30306A51983k4921B4923L70735J88992B1989J83878
12244B05867J39423c02266a8207k5309B35523a10073A07423a35701C92851C0640
12233a09007E2474b03869e0390k4842b6639A26955m6457Q4267a65598C38035E9515
12221F3424J88533c3226C17816A57683C536a53404D3365J28352a12018B88987
12210A61202L6735d0347A70132P6924m3543j9884J02245a02218D02052r7024l5644
12199B69384j6696j22373D4185J46127l5606K31711r5027l76d674B98334A39672
$$ plain form
12187 164199 281973 -203669 265550 10566 244457 390537 4375 -164915 277579 498978
12177 498978 186164 471696 -50566 -351697 25621 169823 100050 328704 -26217 341849
12166 323794 67951 106192 150589 437018 -3970 366969 51295 461065 202500 203263 430197
12155 430197 103285 483404 -114340 112630 214407 218528 92689 358631 56103 220835
12145 220835 104229 41222 397041 172324 132661 162745 204889 -297795 50585 -133151
12134 145451 -280306 -227679 -43582 168182 -135071 207226 559303 -79693 244673 -32744
12123 132099 162276 411026 116030 201789 89102 196839 -10459 363041 228547 32254
12112 62717 396672 268027 274215 77918 -211846 -109517 29778 90873 355510 90634 -155250
$$ packed form
12187A64199J17774b03669B65550A0566K33891J46080D375a64915B77579K21399
12177D98978A86164K85532e0566l01131B5621J44202o9773K28654b6217C41849
12166C23794F7951L8241M4397K86429c970C66969E1295M09770B02500P63K26934
12155D30197A03285L80119a14340A12630J01777M121I2689K65942E6103J64732
12145B20835A04229D1222L55819A72324l9663L0084M2144b97795E0585a33151
12134A45451b80306N2627d3582A68182a35071B07226L52077g9693B44673c2744
12123A32099L0177K48750A16030Q5759H9102J07737a0459C63041j34494C2254
12112F2717L33955j28645O188G7918b11846J02329B9778O1095K64637I0634a55250
$$ plain form
12100 -120373 117809 -72414 198276 333206 410986 218952 139371 45594 305361 52665
12089 99609 160854 54113 -97900 -174981 74184 253228 181543 226413 118841 74650 -173629
12077 337387 137054 1969 129634 265863 -244535 294959 403143 465094 332444 51106
12066 48282 205083 230248 22454 257365 89098 144745 70375 -195247 223908 202686 98417
12054 -160539 235570 15707 54581 123452 165470 272721 126609 190200 285239 311466 131877
12042 187069 168159 9137 58155 198925 186877 -56393 144943 317307 -42535 -179574 -237988
12031 -237988 -163969 8819 -17307 113697 250221 -159366 157122 -56356 163504 82438 -483230
12019 -73240 -288403 54823 185011 -218244 269783 -44721 -26647 120265 -88395 80829 16108
$$ packed form
12100a20373A17809g2414A98276J34930P7780j92034p9581D5594K59767E2665
12089I9609O1245E4113i7900p7081G4184J79044p1685M4870j07572m4191a73629
12077C37387A37054A969J27665J36229b44535B94959J08184O1951j32650E1106
12066D8282J56801K5165B2454K34911H9098N5647G0375a95247B23908k1222I8417
12054a60539B35570A5707L8874O8871M2018J07251A26609O3591R5039K6227A31877
12042A87069j8910I137M9018J40770j2048e6393A44943J72364d2535j37039n8414
12031b37988P4019H819a7307A13697J36524a59366A57122e6356A63504q1066d83230
12019g3240k15163E4823J30188b18244B69783d4721J8074A20265h8395H0829A6108
$$ plain form
12007 165798 -72546 111917 -18395 134746 -126110 -98812 91803 89135 142812 -62271 115379
11995 348090 344398 143912 -56840 175087 -109386 -23040 146843 -28555 -154817 237148
11984 45661 -155489 -22318 60290 -179291 41552 82090 -8713 30765 56854 -49517 -219325
11973 -219325 -76651 208872 149366 23098 -56346 -131819 -315687 41714 246772 176660 100324
11962 100324 -23632 -98566 -18921 -234455 -59635 42172 -330531 -385370 117406 -27140 140666
11950 -200736 154379 -15551 -360180 160205 -120283 -223877 7134 98122 153866 167431 -271237
11938 115492 -182884 -85740 -72076 -55971 32952 333572 -286099 -87267 -265347 48385 132416
11927 132416 -176343 -329562 -57428 135850 -283869 -376268 -68599 -110094 200541 172791
$$ packed form
12007A65798g2546A11917a8395A34746a26110K7298I1803k668N3677f2271A15379
11995C48090l692A43912e6840A75087a09386b3040A46843b8555j26262B37148
11984D5661a55489b2318F0290a79291D1552M0538h713C0765K6089d9517j69808
11973b19325g6651B08872n9506B3098e6346p5473j83868D1714K05058p0112p6336
11962A00324b3632p4934a8921k15534e9635D2172c30531n4839A17406b7140A40666
11950b00736A54379a5551l44629A60205a20283j03594G134R0988N5744J3565b71237
11938A15492a82884h5740J3664J6105C2952L00620b86099h7267j78080D8385Q4031
11927A32416a76343j53219e7428A35850b83869r2399f8599m1495B00541k7750
$$ plain form
11917 172791 -18428 -56480 -35700 -136265 -112491 41162 38284 -114058 79263 211418 75809
11905 -116841 -91078 41919 -206832 147553 30148 155442 17292 -247782 170736 370646
11895 370646 63490 187172 -55235 76509 -242864 4604 39888 51512 -264643 25505 -212038
11883 150574 265699 93317 323749 74728 -115134 1607 39096 -16090 -222201 85162 -4861
11871 43307 149749 -203135 85115 119359 161729 -62364 -326381 480230 166737 -483861
11860 -116366 -205004 -257474 155389 -74461 -8768 -103996 -87830 -402531 -197646 30115 -63632
11848 47888 172309 -462666 -175913 53799 331779 -198483 -18353 -231657 -314351 184996
11837 -56628 -207624 116488 -216944 -202717 113204 215648 -23092 38055 187276 -182097
$$ packed form
11917A72791a8428l8052K0780j00565K3774D1162k878a14058G9263J32155G5809
11905a16841K5763D1919b06832A47553C0148J25294A7292b47782A70736J99910
11895C70646F3490J23682e5235G6509b42864D604L5284J1624b64643B5505b12038
11883A50574J15125I3317K30432G4728a15134A607L7489a6090k06111H5162d861
11871D3307J06442b03135H5115L4244M2370f2364k64017D80230A66737d83861
11860a16366q8638n2470A55389g4461h768r5228J6166l14701a97646C0115f3632
11848D7888J24421d62666a75913E3799K77980a98483a8353k13304q2694A84996
11837e6628j50996A16488b16944J4227A13204J02444b3092C8055J49221a82097
$$ plain form
11826 111823 150468 -59491 -94313 77046 -238107 -41806 67841 221952 -47615 122139 -118094
11814 -39480 -158219 -2453 -347098 318854 -7131 -64068 -30535 229630 -120007 -175857 188710
11802 -144751 -352105 -263125 -35250 -222150 -56538 -70930 232840 -76675 -208257 8983 -162406
11790 -323135 117677 -22674 -192787 -147460 -142091 -492583 -159088 -325735 -11926 -120680
11780 -120680 135733 -215770 359937 105074 -23274 144853 80162 -92365 -350126 -142944
11769 167027 -129667 51377 156168 -24085 23555 -29460 23988 270104 -375455 -98282 258209
11757 262512 -218136 345184 -232976 302317 72616 -199670 -254994 17456 108301 118904
11747 118904 70573 -93229 263541 102854 -421305 -1727 -234245 204941 101229 73739
$$ packed form
11826A11823L8645e9491l4822G7046b38107d1806F7841J54111d7615A22139a18094
11814c9480j18739b453l44645C18854g131n6937c0535B29630a20007n5850A88710
11802a44751k07354Q8980c5250j86900e6538j4392B32840g6675j31582H983a62406
11790c23135A17677b2674j70113M5327N369l50492a59088j66647a1926j08754
11780a20680A35733b15770C59937A05074b3274A44853o4691i2365k57761a42944
11769A67027a29667E1377J04791b4085B3555b9460B3988K46116c75455i8282B58209
11757B62512b18136C45184b32976C02317G2616a99670n5324A7456R0845J0603
11747A18904m8331i3229B63541A02854d21305a727k32518B04941A01229k7490
$$ plain form
11737 73739 -56410 147555 -381374 50116 202057 -164203 -33212 116 32431 -323561 -2216
11725 -386816 119896 339131 -66042 248901 33799 180414 118469 -237689 372964 20097
11714 -46366 223199 82609 143442 -223622 -25900 96751 119053 199951 103252 87669 -48404
11702 -288376 165561 104938 -177303 232602 -185322 117574 -75738 19840 194738 -62254
11691 -112435 39460 -238644 -257959 59224 105952 193049 132437 13520 68360 -256524 217631
11679 39364 42838 731 114470 110970 117272 152499 63182 155410 -244871 8040 -111809 4093
11666 97831 182856 229212 33922 186975 -45629 16807 -173693 217008 138409 107729 166600
11655 166600 32294 -116743 25738 21214 -116103 -155816 -205744 29539 57447 -50694 -41768
$$ packed form
11737G3739e6410A47555c81374E0116J51941a64203c3212A16L2315c23561b216
11725c86816A19896K19235f6042B48901C3799J46615o1945b37689C72964B0097
11714d6366B23199H2609O0833b23622b5900I6751K2302Q0898r6699j5583d8404
11702b88376A65561o0623a77303B32602a85322A17574g5738A9840J74898f2254
11691a12435C9460b38644j9315E9224M6728Q7097o0612A3520N4840b56524B17631
11679C9364L474G31J13739l500O302L5227F3182R2228b44871H040a11809D093
11666I7831Q5025M6356C3922J53053d5629A6807a73693B17008p8599l0680N8871
11655A66600C2294a16743B5738m524a16103l9713m9928B9539K7908e0694Q926
$$ plain form
11644 -41768 84942 -291275 61677 285424 -182262 -26976 209096 -62373 365483 236460
11634 236460 60498 59054 78896 -180046 48087 -68035 31406 -362676 277900 1018 185298
11623 185298 -100907 20190 222487 -193862 -53474 177165 -278238 -110396 -306550 -75883
11612 399507 -112251 130591 113753 292886 72436 -67843 -56065 105002 239875 -132544
11601 245153 -11823 -138805 161066 23746 -16125 -164148 175013 274773 35953 -15778 -380253
11590 -380253 -120066 90587 108966 183953 -135502 356585 18379 -105295 -142228 -165102 -4851
11578 -86552 -252493 -197986 -288652 -77220 -15103 -228498 258529 -148737 176691 -126400
11567 299417 263288 236283 -126760 -114451 145999 -164674 175364 31643 -127434 -205665
$$ packed form
11644d1768H4942b91275F1677K23747a82262b6976B09096f2373C65483j29023
11634B36460F0498j444J9842a80046D8087f8035C1406c62676B77900A018J84280
11623A85298a00907B0190K02297a93862e3474A77165b78238a10396j96154g5883
11612C99507a12251A30591j6838J79133G2436f7843J1778A05002J34873a32544
11601B45153a1823j26982A61066B3746a6125j48023A75013R9760C5953a5778l64475
11590c80253a20066I0587J8379P4987a35502C56585A8379a05295l6933k2874d851
11578h6552j65941N4507r0666g7220a5103k13395B58529a48737A76691a26400
11567B99417l6129k7005a26760J2309A45999a64674A75364C1643a27434p8231
$$ plain form
11557 -205665 143825 -238274 306187 104853 -99697 187271 13560 295459 -84418 -93389
11547 -93389 -180955 299349 51197 105288 103768 -58571 256004 118115 187391 167321 -34792
11535 -95359 141381 36714 26757 180531 -221787 -75570 -168912 -116766 -146021 194258 148558
11524 148558 137685 -45797 93624 -268783 52394 132929 309993 22116 42346 -92660 53553
11512 214944 196002 223626 27866 84812 313475 -81450 433015 -13162 44730 22610 99008
11501 99008 -99577 301338 -35122 107063 395934 343537 64687 -88317 -27550 84511 269228
11490 269228 -164612 247027 270588 348765 174680 46464 223132 -39846 -87213 195086
11479 -181874 92345 41843 330845 291830 35396 192154 -1814 129861 226753 20731 329263
$$ packed form
11557b05665A43825b38274C06187A04853i9697A87271A3560K81899h4418q971
11547i3389q7566B99349E1197N4091j520e8571B56004A18115O9276k0070c4792
11535i5359A41381C6714r957J53774b21787g5570r3342N2146k9255A94258m5700
11524A48558j0873d5797I3624b68783E2394Q0535J77064B2116K0230i2660E3553
11512B14944j8942K7624B7866N6946K28663h1450D33015a3162D4730k2120P6398
11501I9008i9577C01338c5122A07063K88871n2397F4687h8317b7550H4511J84717
11490B69228a64612B47027K3561P8177j74085D6464J76668c9846m7367A95086
11479a81874I2345D1843K89002l9015C5396J56758a814A29861R6892B0731L08532
$$ plain form
11468 329263 32023 335196 157343 151913 -208198 314231 -72726 -52492 184595 -41018 195311
11456 94629 194265 138198 57628 28863 -88367 -95612 235549 95798 91258 -82362 -106386 153944
11443 -175449 372308 387090 -90080 -63371 -215653 -83080 -31974 -83265 -38810 13154 310442
11432 310442 -223080 116073 87415 317323 37000 -1089 -5281 32912 7924 147029 3319
11420 -403030 -76784 281874 181983 143554 219676 125835 -231054 -175903 299658 -130593 -21142
11408 -101155 -241209 -18272 -172160 -170964 -195052 187900 41090 357697 149494 18452 38026
11397 38026 -28336 281810 306673 116398 -242905 -96264 424478 43924 -211472 -179030 -156307
11386 -156307 -49057 221667 181787 43116 63293 -293601 -96885 79970 -86859 -8073 -49358
$$ packed form
11468C29263C2023L03173A57343n430b08198C14231g2726K0234A84595d1018A95311
11456I4629R9636n6067E7628k8765h8367p245B35549I5798m540h2362k4024A53944
11443a75449C72308J4782i0080K6709j52282h3080c1974n1291c8810A3154K97288
11432C10442b23080A16073k8658K29908C7000a089m192C2912G924J39105C319
11420d03030g6784B81874r9891l8429P6122r3841b31054N5151B99658a30593b1142
11408a01155j40054a8272j53888J196k4088A87900D1090L16607A49494A8452J9574
11397C8026b8336B81810K4863A16398b42905i6264D24478D3924b11472L2442K2723
11386a56307d9057B21667l9880D3116K0177b93601i6885G9970h6859h073m1285
$$ plain form
11375 -49358 -326227 -351487 -320991 371826 156240 163922 88257 -170717 -213027 -29601 -246354
11364 -246354 40633 -288143 197235 169680 -18060 -60951 371843 261945 -48560 33983 442095
11353 442095 9263 63518 -148517 -3944 113150 -197561 40055 -257348 93991 -159861 16214
11341 -41006 75242 -115626 10585 -13384 -112256 401913 241694 -149629 -118029 -121811 16505
11329 -68202 152274 208790 -29212 -56782 134289 18657 -83100 234763 -33265 381714 -140638
11317 -336894 143470 45090 -323447 -74519 -45637 -64556 177815 209429 -98855 111312 -274081
11305 -42811 -105843 -413176 113352 -25356 -152662 -86836 47026 -262244 44603 106579 -80482
11293 -102274 -160607 -108005 41736 -223676 -571712 -10846 -152099 -217030 -244771 284481 -74004
$$ packed form
11375d9358k76869k5260L0496C71826A56240P682p5665a70717m2310b9601k16753
11364b46354D0633b88143A97235k7555a8060m2891C71843j09898d8560C3983M08112
11353D42095I263N4255a48517c944A13150a97561D0055b57348I3991a59861A6214
11341d1006G5242a15626A0585a3384r8872D01913j60219a49629L1600l782A6505
11329f8202A52274N6516b9212k7570A34289A8657h3100B34763c3265C81714a40638
11317c36894A43470D5090c23447g4519K8882j8919A77815L1614i8855A11312b74081
11305d2811o3032l07333A13352b5356j27306O5826D7026b62244D4603O1976h0482
11293a02274n8333N2602D1736b23676l48036a0846j41253o4931k7741B84481g4004
$$ plain form
11281 -150090 -21141 211829 38635 -203726 151345 -97730 13052 -80725 -425815 -63037 -87954
11270 -87954 -33207 -129931 -227637 -61360 -229858 -245034 112939 -168522 -51322 -299844 -64032
11258 95256 -326561 216120 -200597 -190627 154398 17774 -364715 -291359 247533 -40562 -59377
11247 -59377 -271868 97920 -257596 139448 277566 -164889 -86778 -87023 -153769 -363322 11984
11235 -292585 35413 208605 -70118 -84597 -376317 -143653 -225532 -187731 -282581 -69259 -191215
11224 -191215 31822 224367 100893 -73100 -53387 204402 -123170 -58759 191290 119844
11214 119844 -213503 -319531 -202987 -46935 51607 -110262 -161424 101742 167603 -177856
11203 -32578 -103523 32754 -50926 173271 45084 28715 -448124 27356 117983 -242527 -233707
$$ packed form
11281a50090b1141B11829C8635b03726A51345i7730A3052h0725l45090f3037k4917
11270h7954c3207r6724r7706f1360j68498j5176A12939a68522e1322k48522f4032
11258I5256c26561B16120b00597R970A54398A7774c64715P3356B47533d0562j8815
11247e9377k12491I7920b57596A39448J38118a64889P8111k45o6746k09553A1984
11235b92585C5413J73192g0118j4479k91720a43653q1879L7801r4850f9259j21956
11224a91215C1822J92545A00893g3100J9713B04402a23170e8759A91290p1446
11214A19844b13503j06028J16544d6935E1607a10262n1162A01742O5861a77856
11203c2578p0945C2754e0926A73271D5084j6369d48124B7356R0627b42527Q820
$$ plain form
11192 -233707 -294449 -195387 -44048 -27976 -247548 224516 82017 -185361 20583 -293561 49471
11180 -480606 -95363 39197 -172695 40994 -34990 -18121 103989 -30274 -200085 -35206 -91320
11169 -91320 -411876 132801 -64544 41639 175764 -63035 5639 -131833 -181181 -68206 291713
11157 38853 -91693 -20922 258620 70985 186074 99836 -120059 -316437 129697 -20269 171677
11145 6911 -272806 -371817 76145 -34962 -237101 45408 -148679 -55036 -347704 -28164 -30499
11134 -30499 -187950 195076 -154939 -47228 -132748 -83306 -207693 -157569 -164346 106953 -198256
11122 -38353 103738 -205031 -288167 -65016 110947 -229089 48836 382505 -17442 -126267
11112 -126267 112662 214758 217802 -71838 -198532 491738 66212 125705 -271070 400381
$$ packed form
11192b33707o0742R9062d4048J6072k19572B24516H2017a85361B0583b93561D9471
11180d80606i5363C9197a72695D0994c4990J6869A03989c0274j69811c5206n6114
11169i1320l20556A32801f4544D1639J34125f3035E639a31833m9348f8206B91713
11157C8853i1693b0922B58620G0985J15089q6238a20059j96378A29697b0269A71677
11145F911b72806r9011G6145c4962k02139D5408a48679e5036k92668b8164k335
11134c0499j57451A95076a54939d7228q5520M9442j24387N0124o777A06953a98256
11122c8353A03738b05031q3136f5016A10947b29089D8836L33669a7442j08825
11112a26267A12662J02096L044g1838j26694D91738F6212N9493b71070D00381
$$ plain form
11101 -41487 68085 -152250 150347 -303646 -2617 -41713 247311 -15237 59520 -21964 -114699
11090 -114699 95907 -72184 204854 -93688 45417 176171 504737 -26802 114602 317399
11080 317399 447414 158746 -54272 -15459 223096 -142245 125544 196190 -11926 472566
11069 44368 148662 -92583 148805 -246909 96907 358824 345369 109492 172175 122448 74411
11058 74411 -54176 523569 68743 3896 273818 174987 -9674 344678 -79306 373992 306035
11047 306035 436333 84013 83351 403409 347994 65312 241396 112504 633082 423765 175704
11035 365648 442232 456618 495758 382441 705771 411338 697064 446756 546136 784731
11025 784731 606659 249520 457304 590077 546412 540780 393136 362380 872871 970419
$$ packed form
11101d1487F8085a52250A50347c03646b617l9096B47311a5237E9520b1964r2735
11090a14699I5907g2184B04854i3688D5417J30754L28566b6802A14602K02797
11080C17399J30015A58746e4272a5459B23096a42245A25544P0646a1926D72566
11069D4368J04294i2583A48805b46909I6907K61917j3455A09492O2683m9727m8037
11058G4411e4176E23569F8743C896K69922r8831i674C44678g9306C73992o7957
11047C06035J30298H4013o62L20058n5415F5312J76084A12504N20578k09317A75704
11035C65648P6584J4386L9140j13317L23330k94433K85726k50308R9380K38595
11025G84731j78072B49520K07784J32773m3665n632j47644l0756N10491R7548
$$ plain form
11015 970419 322000 650215 691090 388011 536704 550037 711027 638022 703112 590432
11005 590432 251212 817960 406292 653644 247997 587679 509245 530996 281943 328667
10995 328667 627407 401514 476885 569711 514659 231278 43749 569548 621510 340661
10985 340661 544858 503523 505309 675020 583435 941081 750556 494414 565242 731605
10975 731605 586388 346228 772355 592240 857999 775351 567107 1038426 935301 642909
10965 642909 682963 1021642 903687 1146357 783150 1082811 1220751 1177281 1418163 1679514
10955 1679514 1849073 1676653 1997351 1741074 1784544 1778930 1862702 1631221 1761537 1574531
10945 1574531 1465691 1571253 1513170 1466853 1602375 1636042 1683913 1641126 1786383 1940864
$$ packed form
11015I70419C22000L28215M0875l03079J48693J3333J60990p3005O5090j12680
11005E90432B51212N66748D06292K47352B47997L39682p8434K1751k49053M6724
10995C28667K98740k25893P5371R2826n5052B31278D3749N25799N1962k80849
10985C40661K04197m1335J786J69711r1585L57646j90525k56142P0828J66363
10975G31605j45217k40160M26127j80115K65759q2648k08244M71319j03125k92392
10965F42909M0054L38679j17955K42670l63207K99661J37940m3470K40882K61351
10955A679514J69559j72420L20698k56277M3470n614Q3772k31481J30316j87006
10945A574531j08840J05562n8083m6317J35522L3667M7871m2787J45257J54481
$$ plain form
10935 1940864 1589624 1360367 930920 1336999 1098592 840751 843586 652264 470592 452766
10925 452766 496244 498117 179674 365897 52937 -72300 -21630 234045 125556 -171539 100321
10913 206329 -99865 63558 -195589 100928 197030 -147790 -130614 174214 -9386 -101849 -72591
10902 -72591 211 245179 162256 -99832 125329 79778 -112679 182697 -98137 -102939 70063
10890 219602 -110111 -137342 -153297 -182136 -247134 12370 80764 -335720 -106833 -131306 -47526
10878 -47105 160883 167227 -169515 -265134 -224196 162962 -127138 -107825 -170645 87702 115290
10867 115290 163045 190677 -140920 -138129 7963 -142832 -125968 141837 -67270 -193067 -183266
10856 -183266 290906 201798 137045 -20441 34473 26777 95245 -92997 -329311 -30228 24312
$$ packed form
10935A940864l51240k29257m29447M06079k38407k57841K835j91322j81672j7826
10925D52766M3478J873A79674J86223E2937g2300b1630B34045j08489a71539A00321
10913B06329i9865F3558a95589A00928R6102a47790J7176A74214i386r2463K9258
10902g2591B11K44968q2923i9832A25329m5551a12679A82697i8137m802G0063
10890B19602a10111k7231j5955k8839o4998A2370O8394c35720a06833k4473d7526
10878d7105A60883O344a69515r5619M0938A62962a27138J9313o2820H7702K7588
10867A15290M7755K7632a40920K791G963a42832J6864A41837f7270j25797R801
10856a83266B90906q9108o4753b0441C4473p696O8468i2997k36314c0228B4312
$$ plain form
10844 -358306 -185064 -364816 -197023 -230700 13770 -113952 18947 -61994 -144872 -422527
10834 -422527 -114645 -221108 -74578 -116713 -200236 205498 142406 -167956 -288764 -57747
10823 -451140 -133171 -93530 -205656 190682 -41659 -143045 -83514 -156810 -80937 -96687 95677
10811 -296001 182745 183751 -291064 -93425 -392541 284599 295591 -56004 100885 -93195 -10891
10799 174381 -197125 -123431 -248701 -324369 71033 128543 -162202 35035 100363 182151 -119490
10787 74515 65412 -72836 -64153 15984 -135151 -99443 -363769 -297469 152095 33715 -120361
10775 231625 127634 220744 -7948 -184174 44375 40959 115309 102303 -365808 -21917 -18557
10764 -18557 -46539 -121697 28259 135764 -34731 87078 -95971 93002 -266054 221227 -38037
$$ packed form
10844c58306J73242j79752J67793l3677A3770a13952A8947f1994q2878k77655
10834d22527a14645j06463g4578m2135q3523B05498o3092a67956j20808e7747
10823d51140a33171L9641j12126A90682d1659j01386N9531p3296P5873j5750I5677
10811b96001A82745J006b91064i3425k99116B84599J0992e6004A00885i3195a0891
10799A74381a97125P3694j25270p5668G1033N7510a62202C5035O5328Q1788a19490
10787G4515r103g2836Q683A5984a35151L5708k64326O6300A52095C3715a20361
10775B31625j03991R3110g948j76226D4375l416P4350j3006c65808b1917L360
10764a8557k7982p5158B8259J07505c4731H7078i5971I3002b66054B21227c8037
$$ plain form
10752 -32184 263392 -54604 93710 -80844 -173724 366781 -250627 -547 195678 -280851 -23749
10740 76109 -51582 -126307 -333519 -14436 22264 -146180 71188 -213450 -122306 -149938 -39135
10728 65688 32908 110288 -59474 -45640 -67124 196998 -172772 95099 -235006 -11038 -167437
10717 -167437 -79957 -57332 -136449 -171720 -169490 -22089 -129622 87986 -33621 87581 -28834
10705 -57484 -86567 26151 209577 -299930 -115976 -98950 -207122 145192 67559 58622 -11876
10693 1407 113921 -112258 289058 -135360 -151101 126113 -229775 11870 -340169 181169
10682 -31962 79341 -79449 -341047 96877 -37168 -290332 233031 243975 149083 -115667 114297
10670 -143468 -203023 230925 -64664 91275 -101654 -3559 144347 5856 50599 -55553 3874
$$ packed form
10752c2184B63392e4604I3710h0844r2880C66781b50627e47A95678b80851b3749
10740G6109e1582p4725k07212a4436B2264a46180G1188b13450R1144k7632c9135
10728F5688l2780P7380e9474J3834k1484A96998a72772I5099b35006a1038j56399
10717a67437g9957K2625p9117l5271K230b2089j07533H7986c3621H7581b8834
10705e7484k9083B6151J83426b99930a15976J7026j08172A45192F7559q937a1876
10693A407J12514a12258B89058a35360j5741A26113b29775A1870c40169A81169
10682c1962G9341g9449k61598I6877c7168k53164B33031J0944r4892a15667A14297
10670a43468n9555B30925f4664I1275a01654c559A44347E856M4743e5553C874
$$ plain form
10658 -142932 62569 -273794 -122825 162210 -4546 -27875 13851 -30886 -140614 -5297 -134501
10647 -134501 376721 -180273 30838 165072 -79985 -56613 -21139 -22323 -16039 346240 172882
10635 -417236 95510 -105638 -198849 -137334 -227403 -134225 -145327 -173167 -100026 -304731 28641
10623 -34665 84731 87664 37280 -215034 -1132 19861 -39468 -222127 -228077 38422 -336928 -104718
10610 -372312 -381680 106966 -142974 195834 33345 6773 -126862 -257336 -86730 -105583 -26043
10598 -275303 -445747 19328 127466 304054 206716 221416 -248356 -38494 -361351 -185710
10588 -185710 26169 298512 -158123 -19223 -136886 -264982 -117654 -119124 -125964 -148935 -228343
10577 -228343 -181573 -74083 -252260 -304174 -70921 -389125 134335 -39327 -80184 85850 -324517
$$ packed form
10658a42932F2569b73794a22825A62210d546k3329A3851c0886j09728e297j29204
10647a34501C76721a80273C0838J34234g9985K3372b1139j184O284C46240A72882
10635d17236I5510a05638r3211O1515r0069R3178j1102k7840P3141k04705B8641
10623c4665H4731K933C7280b15034a132A9861c9468j82659n950C8422c36928a04718
10610c72312r368A06966a42974A95834C3345F773a26862j30474h6730j8853b6043
10598b75303j70444A9328J08138J76588r7338J4700b48356c8494l22857J75641
10588a85710B6169K72343a58123a9223j17663j28096a17654j470o840k2971p9408
10577b28343M6770g4083j78177n1914g0921l18204A34335c9327m0857H5850c24517
$$ plain form
10565 -295403 -373243 -252433 125647 -141004 44994 -141564 -305385 -21959 -154429 -265894
10555 -265894 281963 -131373 107908 -258551 42749 -77733 -173866 -186423 -158949 -118711 119096
10543 -86257 129719 -126807 95760 -322200 -24421 16004 -114116 77964 -34520 293094 -78884
10531 -121208 -281088 182859 240746 121175 50805 315707 -397483 80407 293394 170822
10521 170822 -99057 -351497 -23272 -411020 204170 -114142 169898 -249910 263857 129
10510 40744 -252160 -128142 -119159 -12632 228256 -249638 -119406 326800 -121381 -201984
10500 -201984 -148717 -388625 221527 -128136 42217 146787 91315 193765 -165079 39281
10489 -452013 -5642 -63745 39116 -265155 112847 -63604 9010 -301236 -25416 -106123 225496
$$ packed form
10565b95403p7840J20810A25647a41004D4994a41564j63821b1959j32470j11465
10555b65894B81963a31373A07908b58551D2749g7733r6133j2557K7474M0238A19096
10543h6257A29719a26807I5760c22200b4421A6004a14116G7964c4520B93094g8884
10531a21208j59880A82859N7887j19571E0805K64902c97483H0407K12987j22572
10521A70822i9057k52440b3272l87748B04170a14142A69898b49910B63857A29
10510D0744b52160J24018Q983a2632B28256b49638a19406C26800a21381q0603
10500b01984N3267k39908B21527a28136D2217J04570n5472J02450a65079C9281
10489d52013e642n8103C9116b65155A12847f3604I010c01236b5416q0707B25496
$$ plain form
10477 -30126 -129421 -86876 -284856 -202855 -119070 147278 59885 -304385 59496 364961 33063
10465 37891 228222 187218 -2745 111601 146581 408528 435087 318829 718695 69104 362225
10454 362225 218437 347969 43118 181438 104745 22285 -3967 224123 117837 -296424
10443 101355 -419499 9386 90092 -183548 -86056 -231247 -28967 -97383 108079 49961 -161485
10431 147390 81718 127217 -62353 -73524 -282973 12697 34181 -102997 -23603 -43848 -152463
10420 -152463 61327 319479 245965 289298 58035 9401 -305765 -135102 241185 -410758 -156141
10408 123332 -122631 -162736 -416383 -240469 -250696 -47711 59137 -365074 77303 -159685
10397 -73792 30399 93039 -300909 176361 -24842 -24097 8043 -47429 -29888 -107944 58539 -81609
$$ packed form
10477c0126r9295M2545j97980Q2001Q3785A47278E9885c04385E9496L05465C3063
10465C7891J90331m1004b745A11601L4980K61947K6559j16258L99866F9104K93121
10454C62225j43788J29532D3118J38320p6693B2285c967B24123j06286b96424
10443A01355d19499I386Q0706a83548h6056j45191b8967o8416A08079D9961a61485
10431A47390o5672M5499f2353j1171k09449A2697K1484a02997b3603k0245j08615
10420a52463F1327K58152p3514M3333E8035I401c05765a35102B41185d10758a56141
10408A23332a22631m0105k53647J75914j0227d7711E9137c65074G7303a59685
10397g3792C0399O2640c00909A76361b4842P45H043d7429J7541p8056E8539h1609
$$ plain form
10384 -506119 -41225 -365122 -239081 146492 141664 -56770 41961 344629 184806 412846
10374 412846 114996 -104706 94705 155537 313783 -58983 119584 -404440 -5042 119102
10363 256234 -4811 -251820 -110964 -73806 247936 353084 -58380 -127591 571424 272199
10352 216954 -20121 235347 163064 27755 208180 277394 377705 436332 143047 -62025 5
10340 226143 411200 306269 -84935 128398 232079 92105 341918 93248 431535 282872
10330 282872 27963 471104 236949 329506 285357 415404 134975 330441 254198 -91992
10319 46269 -50911 147798 -38828 251739 266109 -125703 341423 106518 81115 -22366 159808
10307 10255 30014 -146198 97512 74811 -77366 -59842 -3882 531549 -66252 97935 10111
$$ packed form
10384e06119d1225l23897J26041A46492m828e6770D1961L02668j59823K28040
10374D12846A14996a04706I4705O0832J58246e8983A19584d04440e042A19102
10363B56234d811k47009a10964L7158B47936J05148e8380o9211E71424B72199
10352B16954b0121B35347p2283B7755J80425O9214J00311N8627A43047f2025E
10340B26143J85057j04931h4935A28398J03681I2105K49813I3248L38287j48663
10330B82872B7963M43141k34155R2557m4149J30047A34975J95466p6243i1992
10319D6269e0911A47798c8828B51739J4370a25703C41423A06518k5403b2366A59808
10307A0255J9759a46198I7512k2701g7366J7524c882E31549f6252I7935A0111
$$ plain form
10295 -88848 -101642 -237327 -108176 179829 283607 289792 15772 -428634 71642 107051 -217229
10283 139992 -159670 16099 -18603 193837 -153754 204778 -325321 -250004 -84434 -19040
10272 -154067 211412 -296927 -249147 -68090 187024 -221477 155041 80527 -6915 13991 -76666
10260 225602 -197045 -160920 49884 23972 149737 -120418 -120124 26924 -396149 -185580 196484
10248 -155673 -40271 -113360 55522 -61060 -81399 2319 252766 67422 -62440 281494 -4662
10236 105842 331902 500093 -309025 3311 6215 401197 -28629 -73767 -57868 -152569 -143608
10225 -143608 197589 176563 -491383 -51205 -220863 7312 -238022 102818 171038 -151237
10214 -291958 -127712 186744 43355 -210613 -101605 87486 71250 -89702 -410355 15554
$$ packed form
10295h8848j2794j35685a08176A79829J03778O185A5772d28634G1642L5409b17229
10283A39992a59670A6099a8603A93837a53754B04778c25321P5317h4434a9040
10272a54067B11412b96927M7780f8090A87024b21477A55041p4514f915A3991g6666
10260B25602a97045L6125D9884B3972J25765a20418K94B6924c96149a85580A96484
10248a55673d0271p3089E5522f1060k0339B319K50447F7422f2440B81494d662
10236A05842K26060J68191c09025C311K904L94982b8629m5138J5899r4701Q961
10225a43608A97589k1026d91383e1205j69658G312b38022A02818O8220a51237
10214b91958a27712A86744D3355b10613a01605H7486j6236h9702l20653A5554
$$ plain form
10203 11897 105921 -239565 101635 -26645 -25871 -43981 115469 197992 89494 100802 31987
10191 59216 -159821 3570 -147847 50174 -123909 -268603 -1284 -45152 113728 -104424 -194443
10180 -194443 -400293 -107377 -109641 236559 -169161 -164950 22022 26438 190239 -191204 -5663
10168 -197991 45347 41538 43835 -202039 -223386 -195549 149613 -238667 -217638 35671 47377
10157 47377 -231525 -135653 -102139 -29143 129880 68059 -121294 -78266 -65806 -100677 -77698
10146 -77698 -212480 -192765 126091 315403 -209211 -435285 74847 -253257 -10593 80895
10135 71673 75148 -91007 -162185 202589 66563 -201936 -148246 -14034 -75078 -167854 127151
10123 161235 57068 32282 -13868 95936 -379823 -4 -9775 -78161 183430 293663 -318813 89435
$$ packed form
10203A1897R4024b39565A01635b6645P74j8110A15469Q2523H9494J1308C1987
10191E9216a59821C570a47847E0174a23909j44694a284m3868A13728a04424r0019
10180a94443k05850a07377k264B36559a69161M211B2022M416J63801a91204e663
10168a97991D5347l809K297b02039k1347K7837A49613b38667K1029C5671J1706
10157D7377b31525R5872L3514b9143A29880o1821a21294M3028J2460l4871K2979
10146g7698j34782J9715A26091J89312b09211k26074G4847b53257a0593H0895
10135G1673L475i1007p1178B02589F6563b01936N3690a4034o1044r2776A27151
10123A61235E7068k4786a3868I5936c79823dr771o8386A83430J10233c18813H9435
$$ plain form
10110 -154276 -79004 -159188 -232278 -78152 -143505 2930 -224535 -277477 -86872 174476 -45080
10098 159609 35833 -209584 -53945 -88517 60526 83916 -340749 -202810 -83258 151220 -287508
10086 301426 54367 117509 161173 56072 300465 -99097 -164089 -84898 171113 -163601 -261524
10075 -261524 -298100 -19174 141593 -237841 66665 -140325 -156562 82166 -225118 -123082
10065 -123082 -86194 -95993 -18576 -232720 55188 7589 -345474 55295 -63220 -326593 -365186
10054 -365186 -75705 -197567 -56718 21787 287693 -52290 -276113 -247077 -105337 -170105 -111562
10043 -111562 -17396 50793 44306 -252224 243508 -94752 43763 51356 -33019 3451 -145653
10031 -147157 17551 -120365 -106276 -70449 -115437 -72082 -132349 139628 -135509 -14729 -37077
$$ packed form
10110a54276P5272q0184p3090g8152o5353B930b24535n2942h6872A74476d5080
10098A59609C5833b09584e3945l4572F0526K3390c40749J37939h3258A51220b87508
10086C01426E4367O3142M3664E6072K44393i9097o4992P9191A71113a63601r7923
10075b61524l6576a9174A41593b37841F6665a40325j6237H2166b25118J02036
10065a23082L6888r799a8576k14144E5188G589c45474E5295f3220k63373l8593
10054c65186g5705j21862e6718B1787K65906e2290k23823K9036a05337o4768N8543
10043a11562a7396E0793o487b52224B43508i4752D3763P593c3019C451a45653
10031a47157A7551a20365J4089L5827m4988M3355o0267A39628a35509a4729k2348
$$ plain form
10020 -37077 -102352 147758 -205733 120716 -11930 227630 -88830 71753 47010 129991 -104592
10008 -442713 -104023 91266 -135427 35454 -283063 -116394 -12933 457884 -82947 176957
9997 -117590 -130010 103747 66370 -91020 -198546 -192205 -196793 7093 -381646 -26396 53305 136899
9985 136899 -33544 -14596 273518 -9625 129985 -2944 -5435 185893 -95802 -304792 -73569
9973 -258878 -212424 351816 -11846 -144972 -312811 45850 -21068 14093 -204347 185993 -74453
9961 -163393 -236180 -178405 -401356 149989 -286184 -268348 30782 -78795 188115 107447 -285652
9949 -46562 228006 257104 75769 243749 -32917 -237172 273855 -1830 107247 -201856 -52602
9937 -67364 -78970 89218 -277906 -93326 -49534 -225775 -274972 -377636 107266 18151 -144202
$$ packed form
10020c7077o5275A47758b05733A20716a1930B27630h8830G1753k4743Q2981a04592
10008d42713a04023I1266a35427C5454b83063a16394a2933D57884h2947A76957
9997a17590j2420A03747l7377i1020j07526O341m588G093c81646b6396E3305Q3594
9985A36899c3544a4596B73518i625A29985b944k491A85893i5802k08990g3569
9973b58878M6454C51816a1846j33126j67839D5850b1068A4093b04347A85993g4453
9961a63393p2787N7775k22951A49989b86184J7836C0782g8795A88115q0668b85652
9949d6562B28006K9098G5769J67980c2917k04255B73855a830A07247b01856e2602
9937f7364j1606H9218b77906i3326M3792j76241m9197j02664A07266A8151a44202
$$ plain form
9925 -212887 -90107 15759 -119618 39298 -124156 -20629 43965 -108606 -210427 283463 -186996
9913 -328549 -177530 -149699 80763 -341748 54222 60500 20304 -84736 -89684 40396 136480 -231233
9900 -74731 -173947 -129751 -377150 -189318 -206230 62790 195430 131098 29764 -314269 96217
9888 -115826 -238306 -301974 -152698 -87115 -178705 118783 18368 -152279 -218230 -163683 183096
9876 -123185 -257491 300547 -12797 -283295 -267058 -91092 -144143 239441 -113862 -111539 146560
9864 -13323 131569 -77441 -401783 95166 23311 -169792 -60345 -35821 229217 39470 111230
9853 111230 -294041 259138 89827 98759 16132 88210 30641 -345039 252933 44920 -180254
9841 19627 70374 -176079 -10570 -193225 -204629 38328 -259651 119712 -82621 -3481 -111253
$$ packed form
9925b12887i0107A5759a19618C9298a24156b0629D3965a08606j01821B83463a86996
9913c28549J51019K7831H0763c41748E4222O278B0304h4736m948D0396R6084b31233
9900g4731r9216M4196k47399J87832j6912F2790J32640o4332B9764c14269I6217
9888a15826j22480o3668J49276O5583r1590A18783A8368a52279o5951N4547A83096
9876a23185j34306C00547a2797k70498J6237i1092n3051B39441a13862K323A46560
9864a3323A31569g7441l24342I5166B3311a69792f0345K4524B29217C9470P1760
9853A11230b94041B59138H9827Q932A6132P2078C0641c45039B52933D4920a80254
9841A9627N0747a76079a0570j82655j1404C8328b59651A19712h2621c481j07772
$$ plain form
9830 -111253 -338154 -65134 -133622 -62630 230815 -147856 89889 -90430 -341721 -30467 -337451
9819 -337451 171320 76548 -207552 -63960 -15073 -144263 244089 -146024 -231852 -360762
9809 -360762 -19316 -8896 -390179 83823 244494 20063 176209 -200938 -31907 -155594 113848
9797 109351 111801 86755 -233353 10953 -168655 -99892 66851 35970 -304652 69804 -73588
9785 140321 30489 -60757 -31308 60120 -50766 -56679 99154 127425 3655 -129600 -187853 -184637
9773 -184637 52242 -171938 78877 29190 -249260 -272497 -62400 -69637 -115389 221691 -319165
9761 -111455 -336803 -119342 294051 108028 -182967 55611 -234346 26266 -133526 -377250
9751 -377250 97999 -108364 -91081 -99354 -464093 -196562 60385 259801 23248 -209406 -188423
$$ packed form
9830a11253k26901f5134o8488f2630B30815a47856H9889i0430k51291c0467l06984
9819c37451A71320G6548b07552f3960a5073j29190B44089a46024q5828j28910
9809c60762a9316h896l81283H3823J60671B0063J56146b00938c1907j23687A13848
9797A09351K450k5046b33353A0953a68655O8763F6851l0881c04652F9804g3588
9785A40321C0489f0757K9449F0120e0766n913I9154K8271C655a29600n8253L216
9773a84637E2242a71938G8877B9190b49260k3237f2400p237m5752B21691c19165
9761a11455k25348a19342B94051A08028a82967E5611b34346B6266a33526k43724
9751c77250I7999a08364J7283q273l64739a96562F0385J99416B3248b09406K0983
$$ plain form
9740 -188423 36454 -31426 -49780 -90813 -35821 -201126 136397 -48476 -79865 5171 -112461
9728 316038 -234984 -274426 -266138 -110315 -215066 -161500 -230910 -223921 145347 -116138 -92182
9717 -92182 108156 1012 34232 228217 -319572 -180140 -91561 159309 -380232 77828 53917
9706 53917 -69052 31856 -300184 80836 -85074 -5481 -27021 -30337 -24907 -233280 -348156 -64363
9693 -359594 224287 -2710 -23060 65090 80915 103561 -74628 -80337 -235748 -21326 -88549 -369593
9681 -369593 41182 27953 119811 180590 171446 -88923 -173727 -271152 380585 -150639 146776
9669 78794 73622 8467 148041 237116 -68866 44802 -10216 -121485 -250590 -44951 94385 91802
9657 91802 14862 40457 2275 -167554 -232281 43563 -12115 -171867 40298 -133932 -131813 -157148
$$ packed form
9740a88423C6454c1426j8354m1033c5821j65305A36397d8476l1389E171a12461
9728C16038b34984l9442Q288a10315j04751N3566o9410O989A45347a16138K3956
9717i2182A08156A012L3220J93985c19572J39432Q8579A59309c80232G7828k3911
9706E3917f9052C1856c00184H0836h5074e481k1540l316N430k08373j14876f4363
9693c59594B24287b710k0350F5090J5825K2646g4628n709j55411b1326o7223k81044
9681c69593D1182j3229R1858O0779r144h8923q4804r7425C80585a50639A46776
9669G8794n172H467J39574Q9075f8866D4802a0216j11269j29105d4951I4385k583
9657I1802A4862K5595B275a67554o4727D3563a2115j59752D0298a33932K119k5335
$$ plain form
9645 -157148 73422 30633 -252590 112656 129133 -92498 -90658 -63520 175880 -329826 -200260
9634 -200260 -130608 109905 -228621 79841 -166770 -111276 -31151 178026 -290090 -22776 -147169
9623 -147169 54014 3948 -84877 -110828 121383 -81977 -124515 -175952 43015 102912 -103164
9611 82537 227620 -192444 -81119 58293 278918 -343359 4468 -393734 -11731 304382 -119637
9599 -141565 -254773 -149166 86861 175939 133362 3283 329626 -301027 -35667 277104 -39691
9587 -10341 -292880 -54373 -103826 -44164 -99601 74258 81468 -49429 44989 -176929 20014 47982
9575 47982 74422 -31 -296846 97317 -306923 -103629 -148105 255486 -114287 -15286 287337
9563 349594 -196990 -42816 -51513 358391 -168489 68431 -8555 -294948 -88756 -202655 -522662
$$ packed form
9645a57148G3422C0633b52590A12656J6477i2498J840K7138A75880c29826J29566
9634b00260O9652A09905b28621G9841a66770N5494c1151A78026b90090b2776j24393
9623a47169E4014C948h4877k5951A21383h1977m2538n1437D3015N9897a03164
9611H2537J45083a92444h1119E8293K20625c43359D468c93734a1731C04382a19637
9599a41565j13208J05607H6861Q9078m2577C283L26343c01027c5667B77104c9691
9587a0341k82539e4373m9453d4164n5437G4258P210d9429D4989a76929B0014K7968
9575D7982K6440c1k96815I7317c06923a03629m4476B55486a14287a5286B87337
9563C49594a96990d2816q697C58391a68489F8431h555k86393h8756j13899l20007
$$ plain form
9552 -522662 -98233 466571 -359715 -113132 -270751 -191969 74709 65662 -361726 51153 -159593
9540 -371845 -421894 -100094 -115122 10873 -398297 -235512 -172888 -142923 -86094 -24072 -123314
9529 -123314 -125981 -371369 -173636 -340251 -218973 261448 -150517 6 -207947 208100 55670
9517 -8820 -69798 -261567 -152065 25013 -62519 -415275 117305 -16435 123092 10465 -149643
9505 -157487 -352015 168000 -394993 73383 140961 -112465 -112731 -249146 -291215 -201829 79853
9493 -32543 -20194 -190365 202159 -185742 -115475 -138219 -334664 191929 115568 17653 -462040
9481 13048 357643 -96644 8020 134430 237193 -397307 -135329 -114892 84563 -163157 -55134
9469 -157319 -70976 83543 97572 -26333 -199691 -119767 50650 -21941 -135712 70713 -428172
$$ packed form
9552e22662i8233D66571c59715a13132j57619P8782G4709r047c61726E1153a59593
9540c71845n0049a00094j5028A0873c98297J62785O2624K9965N6829b4072r9242
9529a23314k667k45388a73636j66615J21278B61448a50517Fb07947B08100E5670
9517h820o0978j91769J09502B5013f2519l52756A17305a6435A23092A0465a49643
9505a57487j94528A68000c94993G3383O7578a12465k66j36415m2069Q9386G9853
9493c2543J2349j70171B02159a85742P0267k2744j96445A91929p6361A7653d62040
9481A3048L44595i6644H020J26410J02763c97307a35329K0437H4563a63157e5134
9469a57319g0976H3543J4029b6333j73358P9924E0650b1941j13771G0713d28172
$$ plain form
9457 -144462 -37501 -196355 -142285 -310503 -201323 121392 -32628 77415 96176 -163058 30739
9445 -15472 -233668 -211608 -59931 -147891 90629 -188279 -244292 -55168 -135724 -368522 -278558
9434 -278558 -76695 -73805 -268874 156009 -131692 -117217 -141058 -222963 -79041 153279 64418
9422 -1648 21307 -86465 -117269 157834 87361 117185 -44393 100426 -140143 -42349 158575
9410 36770 -225613 51169 248924 -227684 152076 -281260 39321 79101 204996 -262823
9399 -149704 -29431 7978 -296462 19742 194266 -165589 -137577 -96503 123498 -209274 -306668
9388 -306668 42496 -7459 111300 50215 145979 -209850 -133497 -399566 -390792 -148224 -100103
9377 -100103 -236748 -203891 -259496 157972 12914 -284730 56220 252994 15979 -93307 285724
$$ packed form
9457a44462c7501j58854N4070j68218J09180A21392c2628G7415J8761a63058C0739
9445a5472k18196K2060e9931q7960I0629a88279n6013e5168q0556k32798Q9964
9434b78558g6695K890j95069A56009a31692J4475k3841q1905g9041A53279F4418
9422a648B1307h6465l0804A57834p0473K9824d4393A00426a40143d2349A58575
9410C6770b25613E1169J97755b27684A52076b81260C9321L9780J25895b62823
9399a49704b9431G978b96462A9742J74524a65589K8012M1074A23498b09274r7394
9388c06668D2496g459A11300E0215R5764b09850P6353k66069Q774a48224M8121
9377a00103j36645L2857n5605A57972A2914b84730E6220J96774A5979i3307B85724
$$ plain form
9365 -204296 75375 143228 4324 -489568 -240716 -175988 -212576 -316184 -163590 -276845 60942
9353 112245 -84195 -99576 69627 165721 319340 392526 32531 -39160 -91512 -37148 -192030
9342 -192030 72983 237207 -192574 262606 -191859 255688 -73362 66988 -247276 -165159
9332 -165159 74279 -24243 -112370 129191 -451 -226186 -110788 108277 78368 54474 69814
9321 69814 5250 -37492 31343 -112751 -11115 41841 -78401 -184353 106904 200468 65372
9309 119756 -171195 264035 -554984 -181677 -130500 -154191 -99368 19997 -194635 -126150 -427683
9298 -427683 -173379 -242375 -40091 -204342 25185 68536 61758 79024 -103118 79934 496906
9287 496906 -482274 -69898 161270 -503164 -248768 -20690 -95688 105611 89265 -101242
$$ packed form
9365b04296G5375O7853D324d89568b40716O4728l6588j03608J52594j13255F0942
9353A12245h4195j5381F9627R6094J53619P3186C2531c9160n2352c7148j54882
9342a92030G2983J64224a92574B62606a91859B55688g3362F6988b47276Q2117
9332a65159G4279b4243q8127A29191d51k25735a10788A08277k9909k3894J5340
9321F9814E250c7492C1343a12751a1115D1841g8401j05952A06904R3564F5372
9309A19756a71195B64035e54984a81677N1177k3691N4823A9997a94635O8485l01533
9298d27683a73379o8996d0091j64251B5185M3351o778J7266a03118G9934M16972
9287D96906d82274f9898A61270e03164b48768b0690p4998A05611j6346a01242
$$ plain form
9276 -169960 -192934 -104101 80352 46806 436740 -117427 -339802 -35975 -558693 270760 -201195
9264 -222443 -27194 118197 -281648 -196137 351348 -108874 129971 48364 126264 -189685
9253 -80984 38892 -195198 -186224 240275 -351455 -85116 -60720 -431061 -127908 -112828 29009
9241 -108455 -105407 -27516 15316 -175448 -31720 251977 1029 -211190 151057 -158024 -147112
9230 -147112 -142815 21243 13721 257802 198288 -240452 66181 38916 24037 -169974 101924
9218 -259251 -2214 -38651 -88883 -251259 80772 165296 251492 -258730 -193611 -241567 49069
9206 -27822 -171479 32780 -179156 -7848 253767 -144956 123135 47640 37446 -149751 -105583
9195 -105583 159975 -222511 -91978 -72049 97452 -268358 -301258 87648 19993 -8442 -185413
$$ packed form
9276a69960k2974Q8833H0352l3546L89934a17427k22375c5975n22718B70760b01195
9264b22443b7194A18197b81648Q5511C51348a08874A29971D8364P7900a89685
9253h0984C8892a95198Q974B40275c51455h5116K4396l70341a27908J5080B9009
9241a08455L048b7516A5316a75448c1720B51977A029b11190A51057a58024J0912
9230a47112M297B1243p522K44081n9514b40452F6181k7265j4879a69974A01924
9218b59251b214l6437n0232j62376H0772Q4524Q6196b58730O5119m7956D9069
9206b7822j43657C2780a79156g848B53767a44956A23135D7640j0194a49751M4168
9195a05583A59975b22511i1978J9929I7452b68358l2900H7648A9993h442j76971
$$ plain form
9184 -185413 68881 -312474 -39778 -96311 95534 -72583 -419774 -14823 224835 102130 -35859
9172 28564 38751 120765 -272609 -63585 187582 -71756 -192719 -230852 -158241 -55733 145679
9160 -26728 -206885 -397796 -59457 -198376 93472 -177974 103693 9902 192947 25769 44396
9149 44396 320278 -38873 274098 -187875 -85127 275438 124157 -175759 -310625 -234652
9139 -234652 88068 -274575 -85605 101156 -155410 -119288 134612 236311 -184161 -134909
9129 -134909 87140 272195 17004 81795 -349850 -245721 238736 365864 -91527 -393 -106121
9118 -106121 -125993 158248 81585 112711 -61219 150815 141522 -57564 -38598 -59721 -84849
9107 -84849 -168224 -240379 -271382 -153507 35508 136675 -328662 -43059 -191003 -246063 19635
$$ packed form
9184a85413F8881c12474c9778n6533I5534g2583l47191a4823B24835A02130c5859
9172B8564J0187Q2014b72609f3585A87582g1756j20963l8133P2611e5733A45679
9160b6728j80157j90911e9457j38919I3472a77974A03693I902J83045B5769J8627
9149D4396K75882c8873B74098a87875h5127B75438A24157a75759j34866P5973
9139b34652H8068b74575h5605A01156a55410L6122A34612J01699a84161M9252
9129a34909H7140J85055A7004O4791c49850J04129B38736J27128i1527c93j05728
9118a06121j9872A58248p6663L1126f1219A50815r293e7564J8966k1123k5128
9107h4849q3375p2155l1003J17875C5508J01167c28662d3059j47944n5060A9635
$$ plain form
9095 154573 -233147 -237634 265512 -184169 -116744 -103930 46750 153047 3058 -81458 -71241
9084 -71241 -33142 -64276 -70777 284890 -271598 -27371 -114419 -198475 -46699 206502 222003
9073 222003 -20353 16441 -82751 -139515 -49467 -5161 246021 -338720 -68447 -317324 -64194
9061 32884 -43458 -261904 -130427 42628 -354768 -51786 -278760 -21907 6494 266224 -248467
9049 91757 -136295 93950 -144219 240591 -134600 -29087 -235175 -44381 -18385 154844 -90165
9037 -49936 -129505 263392 -70786 21800 13628 1060 115437 -57570 -126202 -21130 253046 -292320
9024 -277889 93304 -106180 -279518 -233217 -22144 -216391 -366157 201969 -192698 -135229
9014 -135229 -338966 224097 223706 -384816 -251204 -127654 -79271 88575 -250514 -184180 63790
$$ packed form
9095A54573b33147m487B65512a84169O7425J2814D6750J06297C058h1458J0217
9084g1241c3142l1134o501B84890b71598b7371q7048q4056d6699B06502J5501
9073B22003b0353A6441h2751n6764d9467e161B46021c38720f8447k48877f4194
9061C2884d3458k18446a30427D2628c54768e1786k26974b1907F494K59730b48467
9049I1757a36295I3950a44219B40591a34600b9087k06088d4381a8385A54844i0165
9037d9936p9569B63392g0786B1800q172A060J14377e7570o8632b1130B53046b92320
9024b77889I3304a06180j73338M6301b2144j94247j49766B01969a92698N7469
9014a35229k03737B24097l91c84816J33612J23550M8383H8575b50514O6334F3790
$$ plain form
9002 184168 -414041 -190693 133319 -83092 -38877 -196840 -194092 -112337 141295 140665 -214578
8990 -631068 -206700 -147293 -129501 -93676 -60436 -331013 82459 71603 50659 -80355 201033
8978 98791 -156451 40282 329674 -61968 -106096 -69670 14983 -510393 -122315 -182346 -344458
8967 -344458 64050 13415 -8565 -97810 -95898 -268046 -133566 208031 60561 -252184 -45130
8955 165594 -171532 223553 -25593 -15020 141483 293725 -154181 62861 166189 -288457
8944 138019 -83081 -65396 -104452 -204530 44572 -219237 -287421 -126214 -244323 -138257 -2161
8932 -431241 -175871 62084 292539 6379 56805 -317985 57075 46314 -280954 85203 147467
8921 147467 -213290 123382 69299 18182 -82550 88432 239629 219361 317585 134065 85790
$$ packed form
9002A84168d14041a90693A33319h3092c8877j57963K748Q1755A41295o30b14578
8990f31068b06700N9407J7792L5825L3240k70577H2459j0856k0944h0355B01033
8978I8791a56451D0282K89392f1968m4128L6426A4983e10393a22315o0031j62112
8967c44458F4050A3415h565q9245J912j72148a33566B08031F0561b52184d5130
8955A65594a71532B23553b5593J0573A41483J52242a54181F2861J03328b88457
8944A38019h3081J7685l9056j00078D4572b19237o8184a26214j18109J06066b161
8932d31241a75871F2084K30455F379N0426c17985E7075j0761b80954H5203O2264
8921A47467b13290A23382n4083A8182h2550H8432J51197k0268R8224A34065m8275
$$ plain form
8910 85790 351391 562573 329880 503056 973780 1733880 2437074 4692489 6571071 2905083
8899 1618185 436443 791327 113168 384938 165665 105954 135174 174423 131785 350394
8889 350394 12800 39133 137166 129557 -40797 36891 -44235 -35889 323470 -192330 -135020 -142132
8877 -142132 33210 -190935 -227129 59013 229363 13692 103432 -397795 -142593 -143844 -354152
8866 -354152 155031 -226987 282989 156021 54227 -98567 -11884 229964 8593 -108030 -36262
$$ packed form
8910H5790K65601K11182k32693J73176M70724P60100P03194K255415J878582B905083
8899A618185D36443L54884A13168K71770A65665n9711K9220L9249m2638K18609
8889C50394A2800K6333R8033p609d0797C6891d4235Q346C23470a92330N7310p112
8877a42132C3210a90935l6194E9013J70350A3692Q9740c97795a42593j251k10308
8866c54152A55031b26987B82989j26968E4227i8567a1884B29964H593a08030c6262
$$ [...]
##END NTUPLES=NMR SPECTRUM
##END=
