
##TITLE=AC1167_Meta-centauros3_5898838_SFqeAGUjo0
##JCAMPDX= 6.0         $$ Bruker NMR JCAMP-DX V2.0
##DATA TYPE= NMR SPECTRUM
##DATA CLASS= NTUPLES
##ORIGIN= BRUKER
##OWNER= Administrator
$$ 1.72 TOPSPIN		Version 2.1
$$ 2012-04-10 10:22:35.984 -0500  Administrator@TOPSPIN
$$ Compression mode = diff/dup
##.OBSERVE FREQUENCY= 400.13188235
##.OBSERVE NUCLEUS= ^1H
##.ACQUISITION MODE= SIMULTANEOUS (DQD)
##.ACQUISITION SCHEME= undefined
##.AVERAGES= 64
##.DIGITISER RES= 22
##SPECTROMETER/DATA SYSTEM= spect
##.PULSE SEQUENCE= noesygpps1d.comp
##.SOLVENT NAME= COFFEE_meoh
##.SHIFT REFERENCE= INTERNAL, COFFEE_meoh, 1, 14.96876
##AUDIT TRAIL= $$ (NUMBER, WHEN, WHO, WHERE, PROCESS, VERSION, WHAT)
$$ ##TITLE= Audit trail, TOPSPIN		Version 2.1
$$ ##JCAMPDX= 5.01
$$ ##ORIGIN= Bruker BioSpin GmbH
$$ ##OWNER= Administrator
$$ $$ C:\Bruker\TOPSPIN/data/COFFEE/nmr/AC1167_Meta-centauros3_5898838_SFqeAGUjo0/12/pdata/1/auditp.txt
$$ ##AUDIT TRAIL=  $$ (NUMBER, WHEN, WHO, WHERE, PROCESS, VERSION, WHAT)
(   1,<2012-04-04 08:59:08.562 -0500>,<Administrator>,<TOPSPIN>,<go>,<TOPSPIN 2.1>,
      <created by zg
	started at 2012-04-04 08:47:37.015 -0500,
	POWCHK enabled, PULCHK disabled,
       configuration hash MD5:
       1A 1E CE 29 27 FD 77 03 67 4E F0 E3 C4 B2 CB 90
       data hash MD5: 64K
       77 E2 8F EA F8 60 99 50 9F EE 00 50 27 51 DA 29>)
(   2,<2012-04-04 08:59:11.406 -0500>,<Administrator>,<TOPSPIN>,<proc1d>,<TOPSPIN 2.1>,
      <Start of raw data processing
       efp LB = 0.3 FT_mod = 6 PKNL = 1 PHC0 = 0 PHC1 = 0 SI = 128K 
       data hash MD5: 128K
       C5 F1 08 C9 75 9C 37 3D B8 75 49 3F F7 2D 7F 40>)
(   3,<2012-04-04 08:59:12.593 -0500>,<Administrator>,<TOPSPIN>,<proc1d>,<TOPSPIN 2.1>,
      <pk PHC0 = 33.28308 PHC1 = 0 
       data hash MD5: 128K
       F1 78 E1 1E C4 4F CC A6 AF BB 72 02 BA D3 E8 50>)
(   4,<2012-04-04 08:59:13.046 -0500>,<Administrator>,<TOPSPIN>,<proc1d>,<TOPSPIN 2.1>,
      <abs ABSG = 1 
       data hash MD5: 128K
       C0 D2 67 5E 6E A7 76 FB 9B 1D 8A 78 9D 21 28 57>)
(   5,<2012-04-04 08:59:13.125 -0500>,<Administrator>,<TOPSPIN>,<proc1d>,<TOPSPIN 2.1>,
      <abs ABSG = 2 
       data hash MD5: 128K
       8E F0 20 72 4A D8 EB 18 4B 5C E9 4F 45 AB EB 11>)
(   6,<2012-04-04 08:59:13.171 -0500>,<Administrator>,<TOPSPIN>,<proc1d>,<TOPSPIN 2.1>,
      <abs ABSG = 3 
       data hash MD5: 128K
       EC DA D1 AE D1 42 2F 1B 55 5C 9B 49 03 DB 71 C5>)
(   7,<2012-04-04 08:59:13.218 -0500>,<Administrator>,<TOPSPIN>,<proc1d>,<TOPSPIN 2.1>,
      <abs ABSG = 4 
       data hash MD5: 128K
       B7 29 0C A7 3D B3 00 54 33 7B B4 C3 74 A1 C3 69>)
(   8,<2012-04-04 08:59:13.281 -0500>,<Administrator>,<TOPSPIN>,<proc1d>,<TOPSPIN 2.1>,
      <abs ABSG = 5 
       data hash MD5: 128K
       21 A8 9E 96 57 4B 2C EA 29 FE B6 98 F4 CB B3 DD>)
(   9,<2012-04-04 08:59:13.515 -0500>,<Administrator>,<TOPSPIN>,<audit>,<TOPSPIN 2.1>,
      <user comment:
       ICON-NMR User ID: COFFEE
       data hash MD5: 128K
$$ [...]
##$TP07= 0
##$TPNAME0= <>
##$TPNAME1= <>
##$TPNAME2= <>
##$TPNAME3= <>
##$TPNAME4= <>
##$TPNAME5= <>
##$TPNAME6= <>
##$TPNAME7= <>
##$TPOAL= (0..7)
0.5 0.5 0.5 0.5 0.5 0.5 0.5 0.5
##$TPOFFS= (0..7)
0 0 0 0 0 0 0 0
##$TUNHIN= 0
##$TUNHOUT= 0
##$TUNXOUT= 0
##$USERA1= <user>
##$USERA2= <user>
##$USERA3= <user>
##$USERA4= <user>
##$USERA5= <user>
##$V9= 5
##$VALIST= <valist>
##$VCLIST= <CCCCCCCCCCCCCCC>
##$VD= 0
##$VDLIST= <DDDDDDDDDDDDDDD>
##$VPLIST= <PPPPPPPPPPPPPPP>
##$VTLIST= <TTTTTTTTTTTTTTT>
##$WBST= 2048
##$WBSW= 25
##$XGAIN= (0..3)
0 0 0 0
##$XL= 0
##$YL= 0
##$YMAX_a= 14273165
##$YMIN_a= -6183559
##$ZGOPTNS= <>
##$ZL1= 120
##$ZL2= 120
##$ZL3= 120
##$ZL4= 120
##$ABSF1= 14.96876
##$ABSF2= -5.583771
##$ABSG= 5
##$ABSL= 3
##$ALPHA= 0
##$AQORDER= 0
##$ASSFAC= 0
##$ASSFACI= 0
##$ASSFACX= 0
##$ASSWID= 0
##$AUNMP= <proc_prof1d_extract.lims>
##$AXLEFT= 0
##$AXNAME= <>
##$AXNUC= <1H>
##$AXRIGHT= 0
##$AXTYPE= 0
##$AXUNIT= <>
##$AZFE= 0.1
##$AZFW= 0.1
##$BCFW= 0
##$BC_mod= 0
##$BYTORDP= 0
##$COROFFS= 0
##$CY= 15
##$DATMOD= 1
##$DC= 0
##$DFILT= <>
##$DTYPP= 0
##$F1P= 0
##$F2P= 0
##$FCOR= 0.5
##$FTSIZE= 131072
##$FT_mod= 6
##$GAMMA= 0
##$GB= 0
##$INTBC= 1
##$INTSCL= 1
##$ISEN= 128
##$LB= 0.3
##$LEV0= 0
##$LPBIN= 0
##$MAXI= 10000
##$MC2= 0
##$MEAN= 0
##$ME_mod= 0
##$MI= 0
##$NCOEF= 0
##$NC_proc= -3
##$NLEV= 6
##$NOISF1= 0
##$NOISF2= 0
##$NSP= 0
##$NTH_PI= 0
##$NZP= 0
##$OFFSET= 14.96876
##$PC= 1
##$PHC0= 33.28308
##$PHC1= 0
##$PH_mod= 1
##$PKNL= yes
##$PPARMOD= 0
##$PPDIAG= 0
##$PPIPTYP= 0
##$PPMPNUM= 2147483647
##$PPRESOL= 1
##$PSCAL= 4
##$PSIGN= 0
##$PYNMP= <proc.py>
##$REVERSE= no
##$SF= 400.130004743003
##$SI= 131072
##$SIGF1= 0
##$SIGF2= 0
##$SINO= 400
##$SIOLD= 131072
##$SPECTYP= <>
##$SREGLST= <1H.CDCl3>
##$SSB= 0
##$STSI= 131072
##$STSR= 0
##$SW_p= 8223.68421052632
##$SYMM= 0
##$S_DEV= 0
##$TDeff= 65536
##$TDoff= 0
##$TI= <>
##$TILT= no
##$TM1= 0
##$TM2= 0
##$TOPLEV= 0
##$USERP1= <user>
##$USERP2= <user>
##$USERP3= <user>
##$USERP4= <user>
##$USERP5= <user>
##$WDW= 1
##$XDIM= 131072
##$YMAX_p= 494848615
##$YMIN_p= -334395737
##$CURPLOT= <Network HP LaserJet P1505>
##$CURPRIN= <$Network HP LaserJet P1505>
##$DFORMAT= <normdp>
##$LAYOUT= <+/1D_H.xwp>
##$LFORMAT= <normlp>
##$PFORMAT= <normpl>
##$SURQMSG= 1
$$ End of Bruker specific parameters
$$ ---------------------------------
##NTUPLES= NMR SPECTRUM
##VAR_NAME=  FREQUENCY,     SPECTRUM/REAL,   SPECTRUM/IMAG
##SYMBOL=    X,             R,               I
##VAR_TYPE=  INDEPENDENT,   DEPENDENT,       DEPENDENT
##VAR_FORM=  AFFN,          ASDF,            ASDF
##VAR_DIM=   131072,        131072,          131072
##UNITS=     HZ,            ARBITRARY UNITS, ARBITRARY UNITS
##FACTOR=    0.0627417313425165, 1,          1
##FIRST=     8223.62146879498, 2243,         -93170
##LAST=      0,             4527,            -94360
##MIN=       0,             -334395737,      0
##MAX=       8223.62146879498, 494848615,    0
$$ Real data points
##PAGE= N=1
##DATA TABLE= (X++(R..R)), XYDATA
$$ [...]
$$ plain form
60676 1783178 1771439 1760842 1752639 1746022 1738885 1730092 1720567 1712107 1705629 1700838 1697146 1694209 1691720
60663 1691720 1689415 1687552 1686848 1687557 1688931 1689958 1690364 1690651 1691408 1692865 1694736 1696120 1695943 1693970 1691071
60648 1691071 1687911 1683645 1676658 1666637 1655245 1644643 1635824 1628507 1622042 1615925 1609691 1602811 1594969
60635 1594969 1586511 1578451 1571588 1565340 1557799 1547410 1534516 1520865 1507751 1495087 1482116 1468405
60623 1468405 1454003 1439227 1424612 1410697 1397529 1384512 1371045 1357272 1344164 1332936 1324336
60612 1324336 1318334 1314375 1311956 1310943 1311314 1312733 1314587 1316499 1318745 1322169 1327457 1334236 1340979 1346255
60598 1346255 1350155 1354042 1358845 1364196 1369445 1374740 1380449 1386064 1390493 1393310 1395238 1397687 1402148 1409401
60584 1409401 1418498 1426997 1433258 1438355 1444775 1453255 1461975 1469009 1474593 1480610 1488695 1499250 1511506
$$ packed form
60676A783178j1739j0597q203o617p137q793r525q460o478m791l692k937k489
60663A691720k305j863p04P09J374J027M06K87P57J457J871J384j77j973k899
60648A691071l160m266o987j0021j1392j0602q819p317o465o117o234o880p842
60635A594969q458q060o863o248p541j0389j2894j3651j3114j2664j2971j3711
60623A468405j4402j4776j4615j3915j3168j3017j3467j3773j3108j1228q600
60612A324336o002l959k419j013L71J419J854J912K246L424N288O779O743N276
60598A346255L900L887M803N351N249N295N709N615M429K817J928K449M461P253
60584A409401R097Q499O261N097O420Q480Q720P034N584O017Q085J0555J2256
$$ plain form
60571 1511506 1523846 1534612 1543417 1551685 1561587 1574453 1590153 1607522 1625072 1641724 1657306 1672326
60559 1672326 1687094 1701227 1714064 1725199 1734386 1741259 1745580 1747682 1748409 1748568 1748452 1747753 1745804 1742085
60545 1742085 1736778 1730872 1725436 1720585 1715196 1707917 1698500 1687893 1676831 1664850 1651283 1636885 1623504
60532 1623504 1612075 1601942 1592469 1584234 1577928 1573095 1569013 1566132 1565445 1566795 1568977 1571151 1572989 1573750
60518 1573750 1572737 1570748 1569558 1569552 1569295 1568018 1567124 1568161 1570506 1572432 1573775 1576008 1579863 1584353 1588435
60503 1588435 1592397 1596969 1601874 1606156 1609485 1612165 1613859 1613361 1610166 1605674 1602028 1600017 1598915 1598311
60489 1598311 1599048 1601993 1606795 1612643 1619594 1628385 1639496 1653365 1671143 1693949 1721332 1751574 1783910
60476 1783910 1819609 1860373 1906247 1955549 2006252 2056742 2105373 2149771 2186731 2212850 2225635
$$ packed form
60571A511506J2340J0766Q805Q268R902J2866J5700J7369J7550J6652J5582J5020
60559A672326J4768J4133J2837J1135R187O873M321K102P27J59j16o99j949l719
60545A742085n307n906n436m851n389p279r417j0607j1062j1981j3567j4398j3381
60532A623504j1429j0133r473q235o306m833m082k881o87J350K182K174J838P61
60518A573750j013j989j190ok57j277q94J037K345J926J343K233L855M490M082
60503A588435L962M572M905M282L329K680J694m98l195m492l646k011j102o04
60489A598311P37K945M802N848O951Q791J1111J3869J7778K2806K7383L0242L2336
60476A783910L5699M0764M5874M9302N0703N0490M8631M4398L6960K6119J2785
$$ plain form
60465 2225635 2224522 2211232 2189305 2163028 2136011 2110121 2085824 2063709 2045375 2032501 2025532 2023954
60453 2023954 2027619 2037095 2052683 2073571 2098027 2124097 2150410 2176870 2204612 2234992 2268803 2306718
60441 2306718 2349906 2399525 2455985 2519490 2591022 2671994 2763117 2864544 2977127 3102654 3242599
60430 3242599 3397121 3565374 3746492 3940533 4148968 4374019 4617231 4879329 5162000
60421 5162000 5468709 5802235 6161550 6541342 6932656 7321308 7686094 8001605 8244554
60412 8244554 8397317 8447187 8386598 8216868 7950554 7608224 7212704 6785683 6346591 5911221
60402 5911221 5490614 5091854 4719656 4376854 4064412 3782213 3529677 3305115 3105244
60393 3105244 2926320 2765588 2621274 2491880 2376203 2273510 2182849 2102470 2030430 1965474
$$ packed form
60465B225635j113j3290k1927k6277k7017k5890k4297k2115j8334j2874o969j578
60453B023954L665R476J5588K0888K4456K6070K6313K6460K7742L0380L3811L7915
60441B306718M3188M9619N6460O3505P1532Q0972R1123J01427J12583J25527J39945
60430C242599J54522J68253J81118J94041K08435K25051K43212K62098K82671
60421E162000L06709L33526L59315L79792L91314L88652L64786L15511K42949
60412H244554J52763M9870o0589j69730k66314l42330l95520m27021m39092m35370
60402E911221m20607l98760l72198l42802l12442k82199k52536k24562j99871
60393C105244j78924j60732j44314j29394j15677j02693r0661q0379p2040o4956
$$ plain form
60383 1965474 1906919 1853934 1805168 1758829 1713219 1667946 1624536 1584906 1549112 1515610 1483783
60372 1483783 1454758 1429433 1407193 1387233 1369612 1354083 1339305 1324277 1309333 1294746 1279859
60361 1279859 1264921 1252251 1243752 1238388 1233928 1230164 1228280 1227877 1227097 1225643 1225303 1227135 1230170 1233510
60347 1233510 1237895 1244167 1251520 1258280 1263618 1267677 1270784 1273333 1276041 1279668 1284647 1291239 1299639 1309627
60333 1309627 1320366 1330882 1340678 1349888 1358886 1367652 1375414 1381258 1385220 1388316 1391290 1393935 1395991
60320 1395991 1397836 1399545 1400012 1398039 1393891 1388906 1384068 1379962 1377556 1377661 1379711 1382389 1385487 1389977
60306 1389977 1396126 1402749 1408638 1413760 1418693 1423931 1430166 1438238 1448043 1458146 1467324 1476131 1486291
60293 1486291 1498638 1512130 1524926 1536089 1546245 1556814 1568891 1582840 1598522 1615370 1632336
$$ packed form
60383A965474n8555n2985m8766m6339m5610m5273m3410l9630l5794l3502l1827
60372A483783k9025k5325k2240j9960j7621j5529j4778j5028j4944j4587j4887
60361A279859j4938j2670q499n364m460l764j884m03p80j454l40J832L035L340
60347A233510M385O272P353O760N338M059L107K549K708L627M979O592Q400R988
60333A309627J0739J0516R796R210Q998Q766P762N844L962L096K974K645K056
60320A395991J845J709M67j973m148m985m838m106k406J05K050K678L098M490
60306A389977O149O623N889N122M933N238O235Q072R805J0103R178Q807J0160
60293A486291J2347J3492J2796J1163J0156J0569J2077J3949J5682J6848J6966
$$ plain form
60282 1632336 1648458 1663783 1679218 1695227 1711140 1725926 1738935 1749634 1757652 1763784 1770068 1777958
60270 1777958 1787131 1797027 1808702 1823823 1842281 1862195 1882061 1901530 1920080 1936285 1948685 1956374
60258 1956374 1958517 1954266 1943571 1927400 1907009 1883591 1858632 1833801 1810236 1788441 1768770 1751441
60246 1751441 1736208 1722758 1711234 1701662 1693172 1684836 1677159 1671646 1668943 1668408 1669501 1672430 1677258
60233 1677258 1683516 1690891 1699215 1707580 1714766 1720980 1727879 1736100 1743935 1749449 1753128 1757331 1763599 1771524
60219 1771524 1780096 1789124 1799044 1809848 1820709 1830763 1840208 1850369 1862464 1876530 1891837 1908121
60207 1908121 1925936 1945999 1968712 1994178 2022205 2052491 2085307 2121671 2162282 2206703 2254467
60196 2254467 2306619 2365050 2430341 2501327 2576833 2656955 2742643 2835118 2935801 3045760 3164902
$$ packed form
60282A632336J6122J5325J5435J6009J5913J4786J3009J0699Q018O132O284P890
60270A777958R173R896J1675J5121J8458J9914J9866J9469J8550J6205J2400P689
60258A956374K143m251j0695j6171k0391k3418k4959k4831k3565k1795j9671j7329
60246A751441j5233j3450j1524r572q490q336p677n513k703n35J093K929M828
60233A677258O258P375Q324Q365P186O214O899Q221P835N514L679M203O268P925
60219A771524Q572R028R920J0804J0861J0054R445J0161J2095J4066J5307J6284
60207A908121J7815K0063K2713K5466K8027L0286L2816L6364M0611M4421M7764
60196B254467N2152N8431O5291P0986P5506Q0122Q5688R2475J00683J09959J19142
$$ plain form
60185 3164902 3292531 3428772 3574564 3730205 3895002 4068380 4250061 4438840 4632462
60176 4632462 4829124 5027721 5225946 5419409 5603562 5775594 5933814 6076320 6201347
60167 6201347 6308084 6396085 6464467 6512559 6540829 6550500 6543009 6520720 6487347 6446581 6400793
60156 6400793 6352127 6304358 6262328 6229564 6207394 6196343 6197540 6212796 6244159 6293484 6361707
60145 6361707 6448400 6552555 6673662 6811283 6963605 7127368 7299606 7478704 7663156 7849586
60135 7849586 8032481 8205680 8363783 8502542 8618900 8711193 8778918 8821553 8837577 8825269
60125 8825269 8784816 8719267 8633132 8530512 8414961 8290446 8161378 8031802 7905406 7786445
60115 7786445 7679849 7590045 7519967 7471148 7444195 7439199 7456315 7495979 7557863 7639662 7737716
$$ packed form
60185C164902J27629J36241J45792J55641J64797J73378J81681J88779J93622
60176D632462J96662J98597J98225J93463J84153J72032J58220J42506J25027
60167F201347J06737Q8001O8382M8092K8270R671p491k2289l3373m0766m5788
60156F400793m8666m7769m2030l2764k2170j1051J197J5256L1363M9325O8223
60145F361707Q6693J04155J21107J37621J52322J63763J72238J79098J84452J86430
60135G849586J82895J73199J58103J38759J16358R2293O7725M2635J6024j2308
60125H825269m0453o5549q6135j02620j15551j24515j29068j29576j26396j18961
60115G786445j06596q9804p0078m8819k6953m996J7116L9664O1884Q1799R8054
$$ plain form
60104 7737716 7848966 7971350 8101988 8235955 8367556 8492156 8606254 8706659 8790778 8857645
60094 8857645 8907888 8942613 8962770 8969710 8965965 8955262 8941866 8929919 8923365 8926320 8943183 8978070
60082 8978070 9034278 9114346 9220384 9354141 9517156 9711197 9938123 10199056 10494387 10825145
60072 10825145 11193338 11599812 12042531 12518349 13025870 13564651 14131591 14719877 15321622
60063 15321622 15929614 16535814 17130044 17701407 18239895 18735776 19179065 19561287 19877018
60054 19877018 20122372 20292559 20382260 20388192 20310384 20151388 19915441 19608447 19238141 18814323
60044 18814323 18349205 17856735 17350459 16841951 16341536 15859704 15406662 14990519 14616588
60035 14616588 14288297 14008070 13777443 13597117 13467005 13385720 13349893 13354493 13394045 13463412
$$ packed form
60104G737716J11250J22384J30638J33967J31601J24600J14098J00405Q4119O6867
60094H857645N0243L4725K0157O940l745j0703j3396j1947o554K955J6863L4887
60082H978070N6208Q0068J06038J33757J63015J94041K26926K60933K95331L30758
60072A0825145L68193M06474M42719M75818N07521N38781N66940N88286O01745
60063A5321622O07992O06200N94230N71363N38488M95881M43289L82222L15731
60054A9877018K45354J70187Q9701N932p7808j58996k35947l06994l70306m23818
60044A8814323m65118m92470n06276n08508n00415m81832m53042m16143l73931
60035A4616588l28291k80227k30627j80326j30112q1285l5827M600L9552O9367
$$ plain form
60025 13463412 13557363 13669533 13791942 13915711 14032473 14135086 14217028 14271762 14293620 14279470
60015 14279470 14229200 14144747 14029045 13885241 13715561 13520772 13301659 13061136 12803990 12534553
60005 12534553 12255916 11971665 11687016 11407407 11136816 10877930 10633030 10404174 10193571
59996 10193571 10004519 9841191 9706778 9602414 9528133 9483802 9468605 9480840 9519218 9583571
59986 9583571 9673532 9787295 9922197 10075409 10243069 10419498 10598157 10772794 10937200 11084976
59976 11084976 11210468 11309352 11377985 11413517 11415259 11384372 11321100 11223874 11092643 10931824 10748364
59965 10748364 10548090 10335719 10117102 9898884 9686153 9482384 9291491 9117946 8964770
59956 8964770 8833196 8724504 8640658 8582962 8551700 8547528 8571935 8625824 8708589 8818975 8956053
$$ packed form
60025A3463412R3951J12170J22409J23769J16762J02613Q1942N4734K1858j4150
60015A4279470n0270q4453j15702j43804j69680j94789k19113k40523k57146k69437
60005A2534553k78637k84251k84649k79609k70591k58886k44900k28856k10603
59996A0193571j89052j63328j34413j04364p4281m4331j5197J2235L8378O4353
59986I583571Q9961J13763J34902J53212J67660J76429J78659J74637J64406J47776
59976A1084976J25492R8884O8633L5532J742l0887o3272r7226j31231j60819j83460
59965A0748364k00274k12371k18617k18218k12731k03769j90893j73545j53176
59956H964770j31574j08692q3846n7696l1262m172K4407N3889Q2765J10386J37078
$$ plain form
59945 8956053 9119116 9307352 9519660 9754007 10006750 10272941 10546891 10821767 11089348
59936 11089348 11341480 11571752 11775015 11945946 12079565 12173104 12226159 12239068 12212224 12146825
59926 12146825 12045115 11910036 11745848 11558933 11356532 11144578 10927932 10712640 10506380
59917 10506380 10316241 10147137 10002479 9884947 9796104 9736412 9706175 9705624 9733895 9789148 9870115
59906 9870115 9976382 10106553 10256995 10423031 10600586 10786127 10975746 11165013 11349530
59897 11349530 11525553 11690572 11843415 11983328 12109196 12220407 12318243 12405316 12483641 12554540
59887 12554540 12620799 12687840 12762242 12849884 12955756 13084588 13241005 13429693 13655687 13923709
59877 13923709 14236756 14595863 15001443 15453957 15952701 16494286 17072338 17677910 18299817
$$ packed form
59945H956053J63063J88236K12308K34347K52743K66191K73950K74876K67581
59936A1089348K52132K30272K03263J70931J33619R3539N3055J2909k6844o5399
59926A2146825j01710j35079j64188j86915k02401k11954k16646k15292k06260
59917A0506380j90139j69104j44658j17532q8843n9692l0237n51K8271N5253Q0967
59906I870115J06267J30171J50442J66036J77555J85541J89619J89267J84517
59897A1349530J76023J65019J52843J39913J25868J11211R7836Q7073P8325P0899
59887A2554540O6259O7041P4402Q7642J05872J28832J56417J88688K25994K68022
59877A3923709L13047L59107M05580M52514M98744N41585N78052O05572O21907
$$ plain form
59868 18299817 18925057 19539031 20124754 20662070 21128996 21504933 21773113 21921361 21942915
59859 21942915 21837903 21613582 21282454 20860143 20364375 19814090 19228020 18623782 18017800
59850 18017800 17424720 16856139 16320529 15824825 15375371 14976894 14631482 14339446 14100846
59841 14100846 13915584 13782487 13699232 13663447 13673598 13728596 13826340 13962439 14130377 14322810
59831 14322810 14532160 14749639 14964462 15164839 15339280 15476419 15564577 15593224 15555072 15446243
59821 15446243 15265453 15014868 14701372 14334870 13924864 13480057 13011023 12530583 12050264
59812 12050264 11577835 11119049 10679768 10264751 9875852 9513350 9178434 8872978 8597532
59803 8597532 8350994 8131736 7937601 7765155 7610515 7471146 7345821 7232641 7128025
$$ packed form
59868A8299817O25240O13974N85723N37316M66926L75937K68180J48248K1554
59859B1942915j05012k24321l31128m22311m95768n50285n86070o04238o05982
59850A8017800n93080n68581n35610m95704m49454l98477l45412k92036k38600
59841A4100846j85262j33097q3255l5785J0151N4998R7744J36099J67938J92433
59831A4322810K09350K17479K14823K00377J74441J37139Q8158K8647l8152j08829
59821A5446243j80790k50585l13496l66502m10006m44807m69034m80440m80319
59812A2050264m72429m58786m39281m15017l88899l62502l34916l05456k75446
59803H597532k46538k19258j94135j72446j54640j39369j25325j13180j04616
$$ plain form
59794 7128025 7027959 6929821 6833098 6738938 6649051 6564485 6485407 6412304 6346878 6290851 6243760
59783 6243760 6202670 6164328 6127101 6090402 6052643 6010541 5960841 5902506 5836994 5766677 5693534
59772 5693534 5619300 5545904 5475148 5408469 5347654 5295272 5253551 5223148 5203774 5195660 5199415 5214632
59760 5214632 5239733 5273248 5314384 5362502 5417186 5479006 5549153 5628095 5715377 5810664 5913725
59749 5913725 6022978 6135035 6245981 6352259 6450435 6537705 6613404 6679059 6736368 6786000
59739 6786000 6828653 6866020 6899993 6932077 6964368 7000196 7042968 7095093 7158681 7236403 7330893
59728 7330893 7444175 7578533 7737219 7923447 8139271 8386106 8665688 8979861 9330147
59719 9330147 9718100 10145034 10610237 11109880 11638109 12187649 12747049 13296804 13809115
$$ packed form
59794G128025j00066r8138r6723r4160q9887q4566p9078p3103o5426n6027m7091
59783F243760m1090l8342l7227l6699l7759m2102m9700n8335o5512p0317p3143
59772E693534p4234p3396p0756o6679o0815n2382m1721l0403j9374q114L755J5217
59760E214632K5101L3515M1136M8118N4684O1820P0147P8942Q7282R5287J03061
59749E913725J09253J12057J10946J06278R8176Q7270P5699O5655N7309M9632
59739F786000M2653L7367L3973L2084L2291L5828M2772N2125O3588P7722R4490
59728G330893J13282J34358J58686J86228K15824K46835K79582L14173L50286
59719I330147L87953M26934M65203M99643N28229N49540N59400N49755N12311
$$ plain form
59710 13809115 14252231 14596401 14819028 14908608 14866701 14706885 14451171 14125643 13756465 13366915
59700 13366915 12976205 12599951 12250620 11936862 11662914 11429541 11236077 11082082 10967924
59691 10967924 10894212 10860456 10864373 10903024 10974640 11078697 11214612 11381662 11580328 11812327
59681 11812327 12078717 12379102 12713227 13082127 13487103 13928955 14409327 14931689 15499746
59672 15499746 16115597 16780393 17495883 18264172 19086628 19964185 20897867 21887397 22929299
59663 22929299 24017295 25144043 26301272 27478387 28662155 29838112 30992185 32112150
59655 32112150 33189667 34222010 35211823 36165348 37091174 37999925 38903664 39814282 40741491
59646 40741491 41691033 42663620 43654840 44655322 45650294 46619552 47539708 48387745 49142730
$$ packed form
59710A3809115M43116L44170K22627Q9580m1907j59816k55714l25528l69178l89550
59700A3366915l90710l76254l49331l13758k73948k33373j93464j53995j14158
59691A0967924p3712l3756L917L8651P1616J04057J35915J67050J98666K31999
59681A1812327K66390L00385L34125L68900M04976M41852M80372N22362N68057
59672A5499746O15851O64796P15490P68289Q22456Q77557R33682R89530J041902
59663B2929299J087996J126748J157229J177115J183768J175957J154073J119965
59655C2112150J077517J032343R89813R53525R25826R08751R03739R10618R27209
59646D0741491R49542R72587R91220J000482R94972R69258R20156Q48037P54985
$$ plain form
59637 49142730 49785587 50300367 50677906 50918065 51028409 51022257 50918570 50741341 50516484 50269150
59627 50269150 50024210 49807000 49640992 49545035 49534368 49623502 49826083 50152174 50607475 51195203
59617 51195203 51916996 52771600 53753771 54854299 56059314 57348365 58692915 60055963
59609 60055963 61392041 62648074 63766128 64687065 65353675 65714626 65731157 65384305 64678150
59600 64678150 63637847 62305166 60733560 58982754 57113334 55182491 53240901 51330055
59592 51330055 49480694 47712927 46036637 44450796 42942972 41490988 40066533 38639947
59584 38639947 37186591 35693594 34162678 32606931 31045229 29498710 27988525 26532617
59576 26532617 25143297 23828156 22592155 21437579 20363503 19367791 18449363 17606874
$$ packed form
59637D9142730O42857N14780L77539K40159J10344o152j03687j77229k24857k47334
59627E0269150k44940k17210j66008r5957j0667Q9134K02581L26091M55301N87728
59617E1195203P21793Q54604R82171J100528J205015J289051J344550J363048
59609F0055963J336078J256033J118054R20937O66610L60951J6531l46852p06155
59600F4678150j040303j332681j571606j750806j869420j930843j941590j910846
59592E1330055j849361j767767j676290j585841j507824j451984j424455j426586
59584C8639947j453356j492997j530916j555747j561702j546519j510185j455908
59576B6532617j389320j315141j236001j154576j074076r95712r18428q42489
$$ plain form
59568 17606874 16835934 16129804 15482544 14889650 14346429 13848488 13393904 12982314 12611230
59559 12611230 12275329 11969782 11692123 11440159 11210214 10998434 10801968 10617667 10441148
59550 10441148 10268535 10098108 9929228 9760400 9589178 9413364 9232020 9046089 8858149
59541 8858149 8670553 8483828 8298151 8116150 7942273 7779008 7625702 7481797 7349299
59532 7349299 7230873 7127186 7037499 6961583 6899551 6850735 6814123 6789368 6776374 6774433 6782583
59521 6782583 6800176 6826399 6859932 6899759 6945660 6997283 7053495 7113216 7176090 7241884 7310367
59510 7310367 7382660 7461697 7550253 7649113 7757971 7877466 8009517 8156331 8319910 8501872
59500 8501872 8702791 8922148 9159720 9416813 9695644 9997983 10324751 10676169 11051650
$$ packed form
59568A7606874p70940p06130o47260n92894n43221m97941m54584m11590l71084
59559A2611230l35901l05547k77659k51964k29945k11780j96466j84301j76519
59550A0441148j72613j70427j68880j68828j71222j75814j81344j85931j87940
59541H858149j87596j86725j85677j82001j73877j63265j53306j43905j32498
59532G349299j18426j03687q9687p5916o2032m8816l6612k4755j2994j941Q150
59521F782583J7593K6223L3533L9827M5901N1623N6212N9721O2874O5794O8483
59510G310367P2293P9037Q8556R8860J08858J19495J32051J46814J63579J81962
59500H501872K00919K19357K37572K57093K78831L02339L26768L51418L75481
$$ plain form
59491 11051650 11450111 11870871 12313509 12776223 13255005 13744938 14241453 14739675 15233572
59482 15233572 15716881 16184350 16631313 17052956 17445436 17807492 18139673 18441590 18710543
59473 18710543 18942998 19137313 19295435 19422640 19525745 19611307 19685327 19754081 19824190 19901562
59463 19901562 19990712 20094907 20215648 20351243 20496385 20643388 20782966 20903499 20990830 21030206
59453 21030206 21008760 20916658 20747461 20498489 20170466 19766404 19291517 18754398 18166983 17542428
59443 17542428 16893626 16233790 15576544 14933613 14313003 13720451 13161874 12643119 12167807
59434 12167807 11736610 11348318 11000818 10691782 10419815 10184896 9986940 9824287 9694378
59425 9694378 9595311 9525865 9484708 9470855 9484464 9526028 9595150 9691213 9814735 9966663 10146623
$$ packed form
59491A1051650L98461M20760M42638M62714M78782M89933M96515M98222M93897
59482A5233572M83309M67469M46963M21643L92480L62056L32181L01917K68953
59473A8710543K32455J94315J58122J27205J03105Q5562P4020O8754P0109P7372
59463A9901562Q9150J04195J20741J35595J45142J47003J39578J20533Q7331L9376
59453B1030206k1446r2102j69197k48972l28023m04062m74887n37119n87415o24555
59443A7542428o48802o59836o57246o42931o20610n92552n58577n18755m75312
59434A2167807m31197l88292l47500l09036k71967k34919j97956j62653j29909
59425I694378r9067o9446m1157j3853J3609M1564O9122R6063J23522J51928J79960
$$ plain form
59414 10146623 10353248 10585968 10844884 11128714 11434257 11757976 12096507 12444994 12796254
59405 12796254 13142133 13474486 13784019 14059486 14289410 14464291 14576566 14619547 14588233 14481602
59395 14481602 14303252 14059459 13757179 13404032 13009327 12583981 12139042 11684292 11227916
59386 11227916 10776727 10336252 9910859 9504221 9119446 8758316 8420607 8105001 7811038
59377 7811038 7539771 7292432 7068840 6867342 6685775 6522297 6375854 6246225 6133113
59368 6133113 6034942 5949199 5874563 5812124 5763648 5728850 5705065 5689509 5681258 5681058 5689910 5708141
59356 5708141 5735353 5770750 5813471 5863006 5919716 5985021 6060357 6144991 6234819 6324205 6409851
59345 6409851 6493081 6578623 6671661 6775914 6893700 7027156 7179248 7353205 7550280 7768158
$$ packed form
59414A0146623K06625K32720K58916K83830L05543L23719L38531L48487L51260
59405A2796254L45879L32353L09533K75467K29924J74881J12275M2981l1314j06631
59395A4481602j78350k43793l02280l53147l94705m25346m44939m54750m56376
59386A1227916m51189m40475m25393m06638l84775l61130l37709l15606k93963
59377G811038k71267k47339k23592k01498j81567j63478j46443j29629j13112
59368F133113r8171q5743p4636o2439m8476l4798k3785j5556q251k00Q852J8231
59356E708141K7212L5397M2721M9535N6710O5305P5336Q4634Q9828Q9386Q5646
59345F409851Q3230Q5542R3038J04253J17786J33456J52092J73957J97075K17878
$$ plain form
59335 7768158 8002370 8249569 8509306 8783543 9076171 9393145 9741260 10125587 10548810
59326 10548810 11013401 11523029 12080807 12687471 13342553 14046491 14800135 15602618 16450546
59317 16450546 17338222 18256823 19193542 20133124 21060614 21962178 22824237 23633935 24381282
59308 24381282 25060304 25668138 26204068 26669543 27067893 27402947 27677402 27891906 28045067
59299 28045067 28134589 28158780 28116439 28005070 27820727 27561389 27230146 26833771 26378809 25870975
59289 25870975 25317946 24729964 24116279 23482335 22831162 22165751 21488625 20800512 20101698
59280 20101698 19394760 18684772 17977028 17275952 16586347 15914249 15265595 14644475 14053244
59271 14053244 13493969 12969115 12480892 12030462 11617892 11242392 10902346 10595498 10319737
$$ packed form
59335G768158K34212K47199K59737K74237K92628L16974L48115L84327M23223
59326A0548810M64591N09628N57778O06664O55082P03938P53644Q02483Q47928
59317A6450546Q87676R18601R36719R39582R27490R01564Q62059Q09698P47347
59308B4381282O79022O07834N35930M65475L98350L35054K74455K14504J53161
59299B8045067Q9522K4191m2341j11369j84343k59338l31243l96375m54962n07834
59289B5870975n53029n87982o13685o33944o51173o65411o77126o88113o98814
59280B0101698p06938p09988p07744p01076o89605o72098o48654o21120n91231
59271A4053244n59275n24854m88223m50430m12570l75500l40046l06848k75761
$$ plain form
59262 10319737 10073773 9856742 9667150 9502688 9361304 9241995 9144226 9066929 9008510 8967645
59252 8967645 8943557 8935372 8941392 8959041 8985615 9019275 9059272 9104835 9153852 9203067 9249715 9292450
59240 9292450 9330577 9363199 9389635 9410004 9424740 9434026 9438503 9440171 9441805 9445591 9453062 9466190
59228 9466190 9487784 9520592 9566473 9626497 9701575 9793019 9902676 10032084 10181017 10347135
59218 10347135 10527568 10720627 10925383 11139917 11360597 11582721 11800958 12009289 12201660
59209 12201660 12373177 12520058 12637953 12720852 12762463 12759218 12712481 12628361 12515421 12381992
59199 12381992 12234876 12079752 11921774 11765252 11613179 11467608 11330274 11202292 11083470
59190 11083470 10972672 10869081 10772838 10684475 10604012 10530692 10463500 10402189 10348023 10303412 10270723
$$ packed form
59262A0319737k45964k17031j89592j64462j41384j19309r7769p7297n8419m0865
59252H967645k4088q185O020J7649K6574L3660L9997M5563M9017M9215M6648M2735
59240I292450L8127L2622K6436K0369J4736R286M477J668J634L786P471J3128
59228I466190K1594L2808M5881O0024P5078R1444J09657J29408J48933J66118
59218A0347135J80433J93059K04756K14534K20680K22124K18237K08331J92371
59209A2201660J71517J46881J17895Q2899M1611l245m6737q4120j12940j33429
59199A2381992j47116j55124j57978j56522j52073j45571j37334j27982j18822
59190A1083470j10798j03591r6243q8363q0463p3320o7192o1311n4166m4611l2689
$$ plain form
59179 10270723 10251871 10249116 10265550 10304278 10367706 10458306 10579484 10734764 10926290 11154877
59169 11154877 11421363 11727113 12073196 12459724 12885775 13348924 13844284 14364121 14898130
59160 14898130 15433507 15954948 16445476 16887742 17264537 17558846 17755062 17841328 17811083 17662781
59150 17662781 17399103 17027110 16558880 16011226 15403745 14755846 14084452 13403821 12726927
59141 12726927 12066053 11431441 10829727 10264201 9736438 9247406 8797526 8386385 8012352
59132 8012352 7672314 7362429 7079900 6823695 6592992 6385414 6197627 6027287 5873509
59123 5873509 5735647 5612580 5503067 5405927 5319866 5243898 5177795 5121308 5073151 5031785 4997162
59112 4997162 4970592 4952733 4942863 4940353 4945752 4959770 4982123 5011959 5048688 5091785 5140457 5194289
$$ packed form
59179A0270723j8852k755J6434L8728O3428R0600J21178J55280J91526K28587
59169A1154877K66486L05750L46083L86528M26051M63149M95360N19837N34009
59160A4898130N35377N21441M90528M42266L76795K94309J96216Q6266l0245j48302
59150A7662781k63678l71993m68230n47654o07481o47899o71394o80631o76894
59141A2726927o60874o34612o01714n65526n27763m89032m49880m11141l74033
59132H012352l40038l09885k82529k56205k30703k07578j87787j70340j53778
59123E873509j37862j23067j09513r7140q6061p5968o6103n6487m8157m1366l4623
59112D997162k6570j7859r870k510N399J4018K2353K9836L6729M3097M8672N3832
$$ plain form
59100 5194289 5253842 5319981 5392890 5472138 5557328 5648105 5743795 5843514 5946426 6051363 6156260
59089 6156260 6258581 6356600 6450097 6539583 6624752 6703726 6773815 6832959 6880354 6915905 6939746
59078 6939746 6952632 6956298 6952796 6943626 6930066 6914073 6898084 6883905 6872556 6865421 6864880 6873472 6892961
59065 6892961 6924657 6970055 7030402 7105745 7195162 7298317 7416623 7552607 7708188 7883651
59055 7883651 8078092 8290482 8520241 8767195 9031284 9312149 9608733 9919486 10243059
59046 10243059 10578150 10921926 11268721 11610757 11939582 12245956 12519047 12747589 12922284
59037 12922284 13036127 13082819 13057299 12959150 12793969 12570036 12294655 11974676 11618795 11236913
59027 11236913 10837518 10427219 10012311 9598930 9191817 8794561 8410976 8044443 7695602
$$ packed form
59100E194289N9553O6139P2909P9248Q5190R0777R5690R9719J02912J04937J04897
59089F156260J02321R8019R3497Q9486Q5169P8974P0089N9144M7395L5551K3841
59078F939746J2886L666l502r170j3560j5993j5989j4179j1349p135n41Q592J9489
59065F892961L1696M5398O0347P5343Q9417J03155J18306J35984J55581J75463
59055G883651J94441K12390K29759K46954K64089K80865K96584L10753L23573
59046A0243059L35091L43776L46795L42036L28825L06374K73091K28542J74695
59037A2922284J13843M6692k5520r8149j65181k23933k75381l19979l55881l81882
59027A1236913l99395m10299m14908m13381m07113l97256l83585l66533l48841
$$ plain form
59018 7695602 7362475 7043692 6740528 6455144 6188003 5937818 5703185 5483244 5277112
59009 5277112 5083560 4901429 4730034 4569050 4418049 4276291 4143156 4018723 3903365
59000 3903365 3796620 3697049 3603579 3516303 3435497 3360525 3290251 3223736 3159914 3097517 3036272
58989 3036272 2977275 2921042 2866036 2810512 2755085 2701977 2652219 2605132 2560141 2517382 2476754
58978 2476754 2438085 2402233 2370357 2342024 2315603 2290663 2268459 2249877 2234616 2222660 2214782
58967 2214782 2210965 2209829 2210321 2212621 2216691 2221179 2224601 2226752 2228425 2230603 2234057 2238596 2242487 2244071
58953 2244071 2244252 2245900 2250313 2255926 2261182 2266845 2274362 2283582 2293601 2304579 2317139 2330911 2345249
58940 2345249 2360703 2378186 2397094 2415717 2433442 2451332 2470502 2490886 2511799 2533044 2555265
$$ packed form
59018G695602l33127l18783l03164k85384k67141k50185k34633k19941k06132
59009E277112j93552j82131j71395j60984j51001j41758j33135j24433j15358
59000C903365j06745r9571r3470q7276q0806p4972p0274o6515o3822o2397o1245
58989C036272n8997n6233n5006n5524n5427n3108m9758m7087m4991m2759m0628
58978B476754l8669l5852l1876k8333k6421k4940k2204j8582j5261j1956p878
58967B214782l817j136M92K300M070M488L422K151J673K178L454M539L891J584
58953B244071J81J648M413N613N256N663P517R220J0019J0978J2560J3772J4338
58940B345249J5454J7483J8908J8623J7725J7890J9170K0384K0913K1245K2221
$$ plain form
58929 2555265 2579429 2605746 2632991 2659508 2685386 2713007 2744683 2780101 2816693 2852211 2886355
58918 2886355 2920313 2955560 2993015 3032601 3073303 3114084 3155048 3197744 3244218 3295570 3351199
58907 3351199 3409464 3469122 3529985 3592391 3656796 3724161 3795746 3871682 3950584 4031527 4115560
58896 4115560 4203992 4296117 4390581 4488503 4592872 4704631 4821634 4942308 5068438 5203282
58886 5203282 5348496 5504092 5670117 5847146 6035920 6237406 6452362 6680304 6920015
58877 6920015 7171868 7438520 7722637 8025238 8347123 8690445 9057482 9448988 9865274
58868 9865274 10308234 10781041 11286479 11826726 12404251 13021775 13681725 14386432 15138201
58859 15138201 15938373 16787114 17684895 18633056 19631611 20677184 21764026 22885730 24033899
$$ packed form
58929B555265K4164K6317K7245K6517K5878K7621L1676L5418L6592L5518L4144
58918B886355L3958L5247L7455L9586M0702M0781M0964M2696M6474N1352N5629
58907C351199N8265N9658O0863O2406O4405O7365P1585P5936P8902Q0943Q4033
58896D115560Q8432R2125R4464R7922J04369J11759J17003J20674J26130J34844
58886E203282J45214J55596J66025J77029J88774K01486K14956K27942K39711
58877F920015K51853K66652K84117L02601L21885L43322L67037L91506M16286
58868I865274M42960M72807N05438N40247N77525O17524O59950P04707P51769
58859A5138201Q00172Q48741Q97781R48161R98555J045573J086842J121704J148169
$$ plain form
58850 24033899 25195381 26352225 27483821 28567307 29576217 30481271 31254123 31870485
58842 31870485 32310421 32558071 32603192 32443597 32086237 31546286 30844942 30006930 29058609
58833 29058609 28026817 26937780 25815744 24682068 23555218 22450679 21380267 20352050
58825 20352050 19371690 18443818 17571871 16757057 15998072 15291803 14634290 14021604 13450401
58816 13450401 12917597 12419647 11952918 11514990 11104878 10721595 10363172 10027586 9713902
58807 9713902 9421799 9150454 8898527 8664964 8449267 8251099 8069786 7904046 7752297
58798 7752297 7613775 7489182 7379477 7284218 7202056 7132768 7077344 7035808 7006452 6987957 6981033
58787 6981033 6987130 7006630 7039270 7085435 7145960 7221168 7310815 7414566 7532118 7663478 7809459
$$ packed form
58850B4033899J161482J156844J131596J083486J008910R05054P72852O16362
58842C1870485M39936K47650M5121j59595l57360n39951p01344q38012r48321
58833B9058609j031792j089037j122036j133676j126850j104539j070412j028217
58825B0352050r80360r27872q71947q14814p58985p06269o57513o12686n71203
58816A3450401n32804m97950m66729m37928m10112l83283l58423l35586l13684
58807I713902k92103k71345k51927k33563k15697j98168j81313j65740j51749
58798G752297j38522j24593j09705r5259q2162o9288n5424m1536k9356j8495o924
58787F981033O097J9500L2640M6165O0525P5208Q9647J03751J17552J31360J45981
$$ plain form
58776 7809459 7971200 8149088 8343152 8554587 8785465 9036554 9306981 9596733 9908027
58767 9908027 10243375 10603863 10990404 11405164 11850434 12327336 12837161 13383178 13969832
58758 13969832 14600741 15278322 16004400 16780229 17606663 18484828 19415233 20395207 21418381
58749 21418381 22477222 23563988 24667596 25770993 26852974 27890828 28859459 29729988
58741 29729988 30472463 31060262 31471423 31688488 31700990 31508640 31120447 30551233 29820443
58732 29820443 28952710 27975900 26917268 25802037 24654116 23495196 22342747 21210661
58724 21210661 20111514 19055987 18050183 17095964 16194438 15347208 14554016 13811629 13116261
58715 13116261 12465672 11858155 11290988 10760948 10265303 9801386 9366011 8956269 8570586
$$ packed form
58776G809459J61741J77888J94064K11435K30878K51089K70427K89752L11294
58767I908027L35348L60488L86541M14760M45270M76902N09825N46017N86654
58758A3969832O30909O77581P26078P75829Q26434Q78165R30405R79974J023174
58749B1418381J058841J086766J103608J103397J081981J037854R68631Q70529
58741B9729988P42475N87799M11161K17065J2502j92350l88193n69214p30790
58732B9820443q67733r76810j058632j115231j147921j158920j152449j132086
58724B1210661j099147j055527j005804r54219r01526q47230p93192p42387o95368
58715A3116261o50589o07517n67167n30040m95645m63917m35375m09742l85683
$$ plain form
58706 8570586 8208567 7869934 7553649 7257722 6979959 6719149 6475122 6247306 6033898
58697 6033898 5833023 5643955 5466491 5300052 5144392 5000264 4868080 4746531 4633709
58688 4633709 4528964 4432436 4343398 4260373 4182379 4108939 4039462 3973754 3912349 3855090 3800311
58677 3800311 3746721 3695136 3646813 3601126 3556642 3513394 3471951 3431105 3388746 3344626 3300121
58666 3300121 3255714 3210831 3165590 3120274 3073347 3022583 2968295 2913108 2858239 2802238 2743875
58655 2743875 2684207 2625259 2568429 2514585 2464045 2416010 2369469 2324724 2282583 2242311 2202383
58644 2202383 2163257 2127261 2095408 2066138 2037462 2008671 1979877 1951753 1925720 1902402 1879906
58633 1879906 1855843 1831046 1808858 1790490 1773727 1756761 1740550 1726405 1713870 1702326 1692429
$$ packed form
58706H570586l62019l38633l16285k95927k77763k60810k44027k27816k13408
58697F033898k00875j89068j77464j66439j55660j44128j32184j21549j12822
58688D633709j04745r6528q9038q3025p7994p3440o9477o5708o1405n7259n4779
58677C800311n3590n1585m8323m5687m4484m3248m1443m0846m2359m4120m4505
58666C300121m4407m4883m5241m5316m6927n0764n4288n5187n4869n6001n8363
58655B743875n9668n8948n6830n3844n0540m8035m6541m4745m2141m0272l9928
58644B202383l9126l5996l1853k9270k8676k8791k8794k8124k6033k3318k2496
58633A879906k4063k4797k2188j8368j6763j6966j6211j4145j2535j1544r897
$$ plain form
58622 1692429 1684306 1676130 1666042 1654228 1642033 1630409 1620155 1612136 1606167 1600989 1596182 1592685 1590789
58609 1590789 1589273 1587337 1585678 1584651 1583165 1580636 1578549 1578745 1581338 1585367 1590266 1595654 1600879 1605839
58595 1605839 1611236 1617348 1623774 1631065 1641052 1654664 1670849 1688623 1708723 1732118 1758319 1786383
58583 1786383 1816481 1849343 1885232 1924482 1967901 2015675 2067042 2122000 2182119 2248513 2320221
58572 2320221 2395817 2475639 2561191 2653270 2751888 2857503 2971302 3094771 3229630 3377419
58562 3377419 3538494 3712194 3898733 4100200 4319130 4556814 4813326 5088147 5380078
58553 5380078 5687262 6007597 6338220 6674351 7009496 7336533 7646996 7929243 8169514
58544 8169514 8355967 8480945 8539702 8529468 8451097 8310117 8115068 7875853 7603788 7310804
$$ packed form
58622A692429q123q176j0088j1814j2195j1624j0254q019n969n178m807l497j896
58609A590789j516j936j659j027j486k529k087J96K593M029M899N388N225M960
58595A605839N397O112O426P291R987J3612J6185J7774K0100K3395K6201K8064
58583A786383L0098L2862L5889L9250M3419M7774N1367N4958O0119O6394P1708
58572B320221P5596P9822Q5552R2079R8618J05615J13799J23469J34859J47789
58562C377419J61075J73700J86539K01467K18930K37684K56512K74821K91931
58553E380078L07184L20335L30623L36131L35145L27037L10463K82247K40271
58544H169514J86453J24978N8757j0234p8371j40980j95049k39215k72065k92984
$$ plain form
58534 7310804 7006698 6697966 6389842 6087889 5796731 5518963 5256462 5011342 4784535
58525 4784535 4575006 4381705 4205081 4045686 3902605 3774391 3660177 3558597 3466789 3381697
58515 3381697 3301642 3226021 3154665 3087988 3026159 2967376 2908671 2849215 2791036 2735505 2681127
58504 2681127 2626091 2570944 2517015 2463908 2410503 2357158 2305213 2255268 2207326 2161505 2117414
58493 2117414 2074126 2031968 1992834 1957476 1924181 1891597 1860995 1833874 1809162 1785108 1762558
58482 1762558 1743755 1728696 1715030 1701051 1686753 1672326 1657624 1643020 1629179 1615979 1602769
58471 1602769 1589363 1575703 1561081 1544843 1527409 1509626 1491720 1473682 1455828 1438017 1419220
58460 1419220 1398905 1378062 1357947 1338779 1320536 1303862 1289091 1275412 1262100 1249573 1238327
$$ packed form
58534G310804l04106l08732l08124l01953k91158k77768k62501k45120k26807
58525D784535k09529j93301j76624j59395j43081j28214j14214j01580r1808q5092
58515C381697q0055p5621p1356o6677o1829n8783n8705n9456n8179n5531n4378
58504B681127n5036n5147n3929n3107n3405n3345n1945m9945m7942m5821m4091
58493B117414m3288m2158l9134l5358l3295l2584l0602k7121k4712k4054k2550
58482A762558j8803j5059j3666j3979j4298j4427j4702j4604j3841j3200j3210
58471A602769j3406j3660j4622j6238j7434j7783j7906j8038j7854j7811j8797
58460A419220k0315k0843k0115j9168j8243j6674j4771j3679j3312j2527j1246
$$ plain form
58449 1238327 1227936 1218092 1209412 1202257 1196003 1190465 1186548 1184412 1182487 1179534 1176333 1174225 1173507 1174223
58435 1174223 1176670 1179751 1180689 1178090 1173727 1169945 1167151 1165238 1165134 1166849 1168158 1167687 1167490 1169939 1173746
58420 1173746 1175862 1175982 1176184 1177156 1177819 1178122 1179265 1181249 1182676 1183022 1182971 1182506 1180622 1176980 1172228 1166632
58404 1166632 1159723 1151259 1141614 1131631 1122713 1116037 1110814 1104626 1096483 1088039 1080686 1073311 1064471 1054914
58390 1054914 1046026 1037584 1029142 1021933 1017084 1013438 1009482 1005986 1004326 1003605 1001974 999591 997678 995805
58376 995805 992726 989012 986287 984634 983120 981992 982071 982841 983417 984400 986567 988900 990369 992447 997256
58361 997256 1004264 1011448 1018685 1027224 1036739 1045692 1053885 1062056 1069835 1076746 1084257 1093888 1103995 1111368
58347 1111368 1115529 1118833 1122978 1128051 1134329 1142044 1149704 1155238 1158508 1160574 1161400 1160727 1160063 1160993 1162425
$$ packed form
58449A238327j0391r844q680p155o254n538l917k136j925k953l201k108p18P16
58435A174223K447L081R38k599m363l782k794j913j04J715J309m71j97K449L807
58420A173746K116J20K02R72O63L03J143J984J427L46n1m65j884l642m752n596
58404A166632o909q464r645r983q918o676n223o188q143q444p353p375q840r557
58390A054914q888q442q442p209m849l646l956l496j660p21j631k383j913j873
58376I95805l079l714k725j653j514j128P9P70N76R83K167K333J469K078M809
58361I97256P008P184P237Q539R515Q953Q193Q171P779O911P511R631J0107P373
58347A111368M161L304M145N073O278P715P660N534L270K066Q26o73o64R30J432
$$ plain form
58332 1162425 1162363 1161533 1162339 1165051 1167993 1170730 1174074 1177628 1180342 1182896 1186701 1191280 1195359 1199488 1204668
58317 1204668 1209691 1213134 1216775 1223401 1232273 1240400 1247406 1255398 1264974 1275363 1287548 1302872 1319016
58304 1319016 1331851 1341247 1350884 1362380 1373818 1384083 1394227 1404150 1412246 1419017 1427012 1436400 1444379
58291 1444379 1449703 1454111 1458610 1462128 1464810 1469042 1476019 1484228 1492168 1499890 1507580 1515506 1525392 1538743
58277 1538743 1553771 1567238 1579277 1593046 1609734 1627405 1644723 1662127 1679323 1695330 1711192
58266 1711192 1729073 1748569 1767395 1785560 1805217 1826598 1847865 1868698 1890144 1911347 1930552
58255 1930552 1948965 1969370 1991347 2012357 2033017 2056387 2082332 2107708 2132096 2158163 2186239
58244 2186239 2213889 2241249 2271354 2304437 2336975 2367209 2396787 2426486 2455343 2484450 2516437
$$ packed form
58332A162425o2q30Q06K712K942K737L344L554K714K554L805M579M079M129N180
58317A204668N023L443L641O626Q872Q127P006P992R576J0389J2185J5324J6144
58304A319016J2835R396R637J1496J1438J0265J0144R923Q096O771P995R388P979
58291A444379N324M408M499L518K682M232O977Q209P940P722P690P926R886J3351
58277A538743J5028J3467J2039J3769J6688J7671J7318J7404J7196J6007J5862
58266A711192J7881J9496J8826J8165J9657K1381K1267K0833K1446K1203J9205
58255A930552J8413K0405K1977K1010K0660K3370K5945K5376K4388K6067K8076
58244B186239K7650K7360L0105L3083L2538L0234K9578K9699K8857K9107L1987
$$ plain form
58233 2516437 2550747 2584599 2618917 2657850 2702050 2748074 2794797 2844626 2897848 2951847 3006675
58222 3006675 3065426 3128271 3192033 3256253 3323604 3393925 3464404 3536181 3613876 3697715 3783075
58211 3783075 3868615 3957664 4050717 4144253 4238364 4337925 4444602 4555233 4669494 4791347
58201 4791347 4921419 5056005 5195345 5344728 5505697 5674492 5850779 6039142 6240176
58192 6240176 6449231 6665920 6895499 7138878 7391203 7652471 7929174 8222929 8528315
58183 8528315 8844891 9180138 9537127 9910722 10299870 10712241 11152791 11619449 12114020
58174 12114020 12645134 13216212 13823327 14469336 15166722 15921654 16729053 17588242 18508484
58165 18508484 19493420 20535858 21634785 22802083 24046112 25365387 26765489 28264545
$$ packed form
58233B516437L4310L3852L4318L8933M4200M6024M6723M9829N3222N3999N4828
58222C006675N8751O2845O3762O4220O7351P0321P0479P1777P7695Q3839Q5360
58211C783075Q5540Q9049R3053R3536R4111R9561J06677J10631J14261J21853
58201D791347J30072J34586J39340J49383J60969J68795J76287J88363K01034
58192F240176K09055K16689K29579K43379K52325K61268K76703K93755L05386
58183H528315L16576L35247L56989L73595L89148M12371M40550M66658M94571
58174A2114020N31114N71078O07115O46009O97386P54932Q07399Q59189R20242
58165A8508484R84936J042438J098927J167298J244029J319275J400102J499056
$$ plain form
58157 28264545 29874474 31595247 33435374 35417630 37555506 39845286 42291281 44916535
58149 44916535 47738970 50763141 54009537 57527836 61370001 65579635 70222436 75397168
58141 75397168 81203652 87736348 95124647 103536845 113126437 124026645 136423961 150578149
58133 150578149 166730519 185038773 205611820 228524982 253822696 281725682 312883129
58126 312883129 347902352 385833764 422808016 452628322 469483734 470731688 457607135
58119 457607135 433800491 403526046 370360847 336888449 304704057 274611957 246959065
58112 246959065 221898977 199461420 179556036 162034186 146738097 133474359 122003789
58105 122003789 112105622 103618480 96397431 90282691 85143497 80908343 77520980 74906914
$$ packed form
58157B8264545J609929J720773J840127J982256K137876K289780K445995K625254
58149D4916535K822435L024171L246396L518299L842165M209634M642801N174732
58141G5397168N806484O532696P388299Q412198R589592J0900208J2397316J4154188
58133A50578149J6152370J8308254K0573047K2913162K5297714K7902986L1157447
58126C12883129L5019223L7931412L6974252K9820306J6855412J247954j3124553
58119D57607135k3806644l0274445l3165199l3472398l2184392l0092100k7652892
58112B46959065k5060088k2437557j9905384j7521850j5296089j3263738j1470570
58105A22003789r898167q487142p221049o114740n139194m235154l387363k614066
$$ plain form
58097 74906914 73003163 71765342 71122240 71003366 71462301 72664009 74587268 76715116
58089 76715116 78128674 77999245 76027655 72477911 67898271 62838061 57715431 52795971
58081 52795971 48215238 44021663 40220670 36799442 33735809 31004604 28580355 26433368
58073 26433368 24528816 22833643 21321350 19969135 18755240 17660509 16668367 15762741
58065 15762741 14929778 14160948 13450055 12788217 12166101 11579240 11025852 10501013 9998572
58056 9998572 9517668 9061853 8632531 8228072 7848105 7493203 7160692 6845290 6543434
58047 6543434 6253324 5972356 5698948 5435686 5186324 4950638 4725947 4512220 4311603
58038 4311603 4124280 3948781 3785053 3633381 3491666 3357559 3231963 3116903 3011392
$$ packed form
58097G4906914j903751j237821o43102j18874M58935J201708J923259K127848
58089G6715116J413558j29429j971590l549744m579640n060210n122630m919460
58081E2795971m580733m193575l800993l421228l063633k731205k424249k146987
58073B6433368j904552j695173j512293j352215j213895j094731r92142r05626
58065A5762741q32963p68830p10893o61838o22116n86861n53388n24839n02441
58056I998572m80904m55815m29322m04459l79967l54902l32511l15402l01856
58047F543434k90110k80968k73408k63262k49362k35686k24691k13727k00617
58038D311603j87323j75499j63728j51672j41715j34107j25596j15060j05511
$$ plain form
58029 3011392 2913004 2821840 2739223 2663911 2593289 2526809 2464686 2404807 2344766 2285581 2229673
58018 2229673 2176474 2123677 2071524 2022112 1975456 1929844 1885184 1842644 1801820 1761486 1722277
58007 1722277 1685632 1651011 1617150 1585039 1556721 1532121 1509790 1489627 1472148 1456375 1441254
57996 1441254 1427698 1416285 1404550 1389922 1374049 1360668 1350175 1339738 1328007 1316185 1304877
57985 1304877 1293264 1281447 1270709 1261365 1252651 1244629 1238059 1232699 1227637 1222796 1218388 1213888 1209395
57972 1209395 1206756 1207155 1208798 1209164 1208249 1207343 1206074 1203440 1200517 1199259 1199386 1198975 1197324 1194869 1191391
57957 1191391 1186721 1182075 1178138 1173069 1165200 1156426 1149823 1145016 1139144 1131529 1123910 1116500 1107399 1096084
57943 1096084 1084460 1074145 1065262 1057958 1052559 1048194 1043676 1039783 1038298 1038899 1039397 1038932 1038570 1038798 1038824
$$ packed form
58029C011392r8388r1164q2617p5312p0622o6480o2123n9879o0041n9185n5908
58018B229673n3199n2797n2153m9412m6656m5612m4660m2540m0824m0334l9209
58007A722277l6645l4621l3861l2111k8318k4600k2331k0163j7479j5773j5121
57996A441254j3556j1413j1735j4628j5873j3381j0493j0437j1731j1822j1308
57985A304877j1613j1817j0738r344q714q022o570n360n062m841m408m500m493
57972A209395k639L99J643L66r15r06j269k634k923j258J27m11j651k455l478
57957A191391m670m646l937n069p869q774o603m807n872p615p619p410r101j1315
57943A096084j1624j0315q883p304n399m365m518l893j485O01M98m65l62K28K6
$$ plain form
57928 1038824 1038341 1037608 1035779 1031557 1025641 1020326 1016570 1013577 1011180 1010319 1011008 1012044 1013010 1014576 1016736
57913 1016736 1018661 1020217 1021634 1021772 1018909 1013287 1006781 1000157 992782 984944 978034 972275 966608 960921
57899 960921 955989 951014 943955 934881 926415 919936 913710 905918 897480 890620 886239 883757 882113 880110
57885 880110 877225 874780 874824 877175 879204 879309 878998 880570 884207 888380 891766 893649 893598 892012 890214 888935
57869 888935 887189 883296 876449 866829 855013 842022 829337 818134 808612 800382 793219 787274 782821
57856 782821 779905 778164 777314 777862 780630 785193 789821 793699 798090 804257 811436 818415 825912 835315 845710
57841 845710 854473 860683 865849 871133 875845 878975 880418 880220 878333 875520 872998 870707 867309 862196
57827 862196 856098 849448 841825 833542 826172 820725 816520 812434 808013 802882 796512 789472 783763 780969
$$ packed form
57928A038824m83p33j829m222n916n315l756k993k397q61O89J036R66J566K160
57913A016736J925J556J417J38k863n622o506o624p375p838o910n759n667n687
57899I60921m932m975p059r074q466o479o226p792q438o860m381k482j644k003
57885H80110k885k445M4K351K029J05l11J572L637M173L386J883n1j586j798j279
57869H88935j746l893o847r620j1816j2991j2685j1203r522q230p163n945m453
57856G82821k916j741q50N48K768M563M628L878M391O167P179O979P497R403J0395
57841H45710Q763O210N166N284M712L130J443j98j887k813k522k291l398n113
57827H62196o098o650p623q283p370n447m205m086m421n131o370p040n709k794
$$ plain form
57813 780969 780756 781756 783152 784947 787497 791345 796851 803547 810347 816679 822982 830083 838563 848391
57799 848391 858443 866735 872067 875187 877554 879582 881070 882380 883468 882507 877586 869558 861067 852790
57785 852790 842966 830952 818945 809339 802256 796444 790857 784522 776635 767842 759975 753691 747766 741337
57771 741337 735113 729559 723780 717438 711976 708290 704535 698072 688685 678340 668406 658590 648129 636761
57757 636761 624746 612887 602202 592856 583881 574611 565767 558450 552727 548068 544501 542362 541270
57744 541270 540231 538700 537078 536336 537369 540269 544164 548259 552999 559412 567515 576587 586909 599504
57730 599504 613586 626043 634571 640037 644719 649472 653923 658249 662977 667529 670496 671277 670432 668540
57716 668540 665614 661450 655869 648770 640533 632103 624331 617611 612359 608985 606918 604563 600996 597093
$$ packed form
57813G80969k13J000J396J795K550L848N506O696O800O332O303P101Q480R828
57799H48391J0052Q292N332L120K367K028J488J310J088r61m921q028q491q277
57785H52790r824j2014j2007r606p083n812n587o335p887q793p867o284n925o429
57771G41337o224n554n779o342n462l686l755o463r387j0345r934r816j0461j1368
57757F36761j2015j1859j0685r346q975r270q844p317n723m659l567k139j092
57744E41270j039j531j622p42J033K900L895M095M740O413Q103R072J0322J2595
57730E99504J4082J2457Q528N466M682M753M451M326M728M552K967P81q45j892
57716F68540k926m164n581p099q237q430p772o720n252l374k067k355l567l903
$$ plain form
57702 597093 594418 593773 595337 599065 603934 607732 608996 608788 609648 613297 620161 630206 642662 655235
57688 655235 665162 671546 675965 680674 686794 694143 701955 709560 716734 723711 730765 737963 745334 752916
57674 752916 760555 768106 775902 784420 793451 802451 811831 822909 836249 851105 866953 884399 903869
57661 903869 924575 945715 967756 991524 1016980 1043922 1072979 1104616 1137773 1170844 1203636
57650 1203636 1237442 1273613 1313043 1356479 1404179 1455519 1509788 1566960 1626951 1688975 1752898
57639 1752898 1820735 1895512 1978766 2070034 2168442 2273916 2387336 2510491 2645357 2792518
57629 2792518 2951014 3120815 3304484 3504858 3721815 3953079 4197544 4455568 4725876
57620 4725876 5004148 5284866 5562622 5830892 6081128 6304024 6491081 6635262 6732319 6782797
$$ packed form
57702E97093k675o45J564L728M869L798J264k08Q60L649O864J0045J2456J2573
57688F55235R927O384M419M709O120P349P812P605P174O977P054P198P371P582
57674G52916P639P551P796Q518R031R000R380J1078J3340J4856J5848J7446J9470
57661I03869K0706K1140K2041K3768K5456K6942K9057L1637L3157L3071L2792
57650A203636L3806L6171L9430M3436M7700N1340N4269N7172N9991O2024O3923
57639A752898O7837P4777Q3254R1268R8408J05474J13420J23155J34866J47161
57629B792518J58496J69801J83669K00374K16957K31264K44465K58024K70308
57620D725876K78272K80718K77756K68270K50236K22896J87057J44181R7057N0478
$$ plain form
57610 6782797 6791946 6767045 6715309 6643530 6556623 6454119 6329039 6172465 5980355 5756412
57600 5756412 5509721 5250869 4989732 4734885 4493246 4269367 4064952 3879580 3712492
57591 3712492 3563649 3432926 3319060 3220384 3136319 3067050 3011850 2968812 2936270 2913355 2899084
57580 2899084 2892321 2893156 2903149 2923513 2953924 2993573 3042471 3101131 3170003 3249859 3341772 3445881
57568 3445881 3561115 3687080 3825370 3977770 4143626 4320230 4505559 4699346 4901048
57559 4901048 5107399 5312144 5507539 5685873 5840060 5963448 6049675 6093229 6090520 6040568
57549 6040568 5945189 5809127 5639735 5445260 5232610 5007055 4774024 4540040 4311009 4090128
57539 4090128 3878227 3675688 3483333 3301960 3132175 2974713 2830026 2697349 2574795
$$ packed form
57610F782797R149k4901n1736p1779q6907j02504j25080j56574j92110k23943
57600E756412k46691k58852k61137k54847k41639k23879k04415j85372j67088
57591C712492j48843j30723j13866r8676q4065o9269n5200m3038l2542k2915j4271
57580B899084o763Q35R993K0364L0411L9649M8898N8660O8872P9856R1913J04109
57568C445881J15234J25965J38290J52400J65856J76604J85329J93787K01702
57559D901048K06351K04745J95395J78334J54187J23388Q6227M3554k709m9952
57549F040568r5379j36062j69392j94475k12650k25555k33031k33984k29031k20881
57539D090128k11901k02539j92355j81373j69785j57462j44687j32677j22554
$$ plain form
57530 2574795 2460746 2354839 2257539 2169110 2089108 2016491 1949914 1888114 1830311 1776396 1726659
57519 1726659 1681154 1639233 1599828 1562372 1527254 1495145 1466161 1440153 1417530 1398952 1384145
57508 1384145 1371837 1361185 1352546 1346446 1342533 1340165 1339422 1340737 1343835 1347849 1352423 1358118 1365730 1375648
57494 1375648 1387862 1402139 1418196 1436069 1456425 1480260 1508175 1539985 1574987 1612645 1653245
57483 1653245 1697930 1747964 1803897 1865605 1932965 2006205 2085862 2172975 2269080 2375161 2490598
57472 2490598 2614132 2745888 2887142 3037698 3194924 3356259 3521252 3689569 3857887
57463 3857887 4020525 4172729 4311469 4432735 4529744 4594819 4622566 4611220 4562295 4479903
57453 4479903 4369862 4238397 4091169 3933113 3768590 3601509 3435668 3274916 3122455
$$ packed form
57530B574795j14049j05907r7300q8429q0002p2617o6577o1800n7803n3915m9737
57519A726659m5505m1921l9405l7456l5118l2109k8984k6008k2623j8578j4807
57508A384145j2308j0652q639o100l913k368p43J315L098M014M574N695P612R918
57494A375648J2214J4277J6057J7873K0356K3835K7915L1810L5002L7658M0600
57483A653245M4685N0034N5933O1708O7360P3240P9657Q7113R6105J06081J15437
57472B490598J23534J31756J41254J50556J57226J61335J64993J68317J68318
57463C857887J62638J52204J38740J21266R7009O5075K7747j1346m8925q2392
57453D479903j10041j31465j47228j58056j64523j67081j65841j60752j52461
$$ plain form
57444 3122455 2979972 2847934 2726712 2616772 2517862 2428924 2349155 2278505 2216784 2162986
57434 2162986 2116008 2075611 2042192 2015908 1996400 1983007 1974996 1971921 1974132 1982527 1997271 2017048
57422 2017048 2040163 2066373 2097179 2134287 2178162 2228241 2284193 2346753 2417428 2497609 2587818
57411 2587818 2687440 2795043 2909278 3029855 3157497 3292513 3433330 3576633 3718638 3855415
57401 3855415 3981898 4091669 4178539 4238000 4266783 4261954 4221681 4146742 4040529 3907778 3754041
57390 3754041 3585764 3409320 3229328 3048610 2869854 2696404 2531092 2375172 2228910
57381 2228910 2092561 1966313 1849873 1742673 1644176 1553611 1469866 1392094 1320149 1254015
57371 1254015 1192986 1135757 1081368 1029925 982325 939064 899163 860638 822371 785238 750942
$$ packed form
57444C122455j42483j32038j21222j09940r8910q8938p9769p0650o1721n3798
57434B162986m6978m0397l3419k6284j9508j3393q011l075K211Q395J4744J9777
57422B017048K3115K6210L0806L7108M3875N0079N5952O2560P0675Q0181R0209
57411B587818R9622J07603J14235J20577J27642J35016J40817J43303J42005J36777
57401C855415J26483J09771Q6870N9461K8783m829m0273p4939j06213j32751j53737
57390C754041j68277j76444j79992j80718j78756j73450j65312j55920j46262
57381B228910j36349j26248j16440j07200r8497r0565q3745p7772p1945o6134
57371A254015o1029n7229n4389n1443m7600m3261l9901l8525l8267l7133l4296
$$ plain form
57360 750942 720175 692441 667159 643926 621992 600663 580252 561632 544724 528434 512160
57349 512160 496357 481461 467386 454345 443012 433504 425165 417719 411505 406334 401349 396401 392254
57336 392254 388883 385057 380256 375463 371135 365999 359136 351732 345238 339138 332411 326042 321988 320293
57322 320293 319298 318334 318097 318432 317854 315673 312947 310819 309272 307936 306804 305662 303992 302003 300832
57307 300832 301184 302581 304381 306703 309872 313561 316964 319469 320997 322030 323276 324882 326138 326491 326559
57292 326559 327387 328927 330153 330593 330883 331804 333578 336091 339004 341675 343786 345996 349183 353232 357359
57277 357359 361477 366189 371557 377030 382658 389299 397463 406857 417131 427987 438405 446933 453262
57264 453262 458733 464942 472508 481345 491280 502048 513255 524647 536046 547235 558476 570820
$$ packed form
57360G50942l0767k7734k5282k3233k1934k1329k0411j8620j6908j6290j6274
57349E12160j5803j4896j4075j3041j1333r508q339p446o214n171m985m948m147
57336C92254l371l826m801m793m328n136o863p404o494o100o727o369m054j695
57322C20293r95r64k37L35n78k181k726k128j547j336j132j142j670j989j171
57307C00832L52J397J800K322L169L689L403K505J528J033J246J606J256L53O8
57292C26559Q28J540J226M40K90R21J774K513K913K671K111K210L187M049M127
57277C57359M118M712N368N473N628O641Q164R394J0274J0856J0418Q528O329
57264D53262N471O209P566Q837R935J0768J1207J1392J1399J1189J1241J2344
$$ plain form
57252 570820 584939 599900 614159 627828 642979 661630 684206 709812 737071 764860 793320
57241 793320 824091 858610 896355 935669 975839 1017113 1059242 1101765 1145507 1191978 1241177
57230 1241177 1291746 1343498 1398026 1456409 1517973 1581733 1647452 1714762 1782805 1851248 1920131
57219 1920131 1988294 2053543 2114901 2173018 2227673 2276475 2316767 2347389 2367948 2377987 2377832 2368956
57207 2368956 2352857 2330722 2304485 2276613 2248440 2220452 2194708 2174875 2162958 2157760 2157435 2161800
57195 2161800 2171278 2185548 2204296 2227408 2253253 2278604 2301503 2322600 2342722 2361208 2378026
57184 2378026 2395589 2416772 2442404 2471767 2503819 2536951 2569644 2602760 2639184 2679795 2721777
57173 2721777 2762268 2801505 2840980 2881058 2922293 2966583 3014824 3065514 3117611 3172160 3228928
$$ packed form
57252E70820J4119J4961J4259J3669J5151J8651K2576K5606K7259K7789K8460
57241G93320L0771L4519L7745L9314M0170M1274M2129M2523M3742M6471M9199
57230A241177N0569N1752N4528N8383O1564O3760O5719O7310O8043O8443O8883
57219A920131O8163O5249O1358N8117N4655M8802M0292L0622K0559J0039j55q876
57207B368956j6099k2135k6237k7872k8173k7988k5744j9833j1917n198l25M365
57195B161800R478J4270J8748K3112K5845K5351K2899K1097K0122J8486J6818
57184B378026J7563K1183K5632K9363L2052L3132L2693L3116L6424M0611M1982
57173B721777M0491L9237L9475M0078M1235M4290M8241N0690N2097N4549N6768
$$ plain form
57162 3228928 3284333 3335751 3385384 3436638 3489041 3540326 3591362 3644848 3700545 3755974 3811045
57151 3811045 3868134 3928064 3989581 4052465 4117653 4184301 4249924 4313546 4376036 4437680 4498199
57140 4498199 4558835 4621466 4685664 4749081 4810527 4870356 4928483 4984463 5038786 5091594 5141191
57129 5141191 5186544 5229820 5273021 5313261 5345324 5368472 5387006 5404497 5421333 5437788 5455317
57118 5455317 5474078 5492516 5510095 5527624 5544891 5561076 5577556 5597155 5620521 5646218 5674007
57107 5674007 5704499 5735586 5762851 5783936 5799495 5810108 5815810 5818406 5820395 5821315 5818728 5812813 5806211
57094 5806211 5799344 5789863 5776804 5761118 5741828 5716007 5683228 5646117 5605976 5561662 5512769 5459365
57082 5459365 5398159 5323502 5232925 5127533 5006648 4866814 4706787 4528796 4334076 4121605
$$ packed form
57162C228928N5405N1418M9633N1254N2403N1285N1036N3486N5697N5429N5071
57151C811045N7089N9930O1517O2884O5188O6648O5623O3622O2490O1644O0519
57140D498199O0636O2631O4198O3417O1446N9829N8127N5980N4323N2808M9597
57129E141191M5353M3276M3201M0240L2063K3148J8534J7491J6836J6455J7529
57118E455317J8761J8438J7579J7529J7267J6185J6480J9599K3366K5697K7789
57107E674007L0492L1087K7265K1085J5559J0613N702K596J989R20k587n915o602
57094E806211o867r481j3059j5686j9290k5821l2779l7111m0141m4314m8893n3404
57082E459365o1206p4657r0577j05392j20885j39834j60027j77991j94720k12471
$$ plain form
57072 4121605 3891723 3646083 3383195 3098633 2790155 2458027 2100316 1712925 1293918
57063 1293918 841794 349406 -194189 -795845 -1458661 -2189950 -3001363 -3901082 -4894083
57054 -4894083 -5991080 -7209174 -8562889 -10063144 -11725920 -13572506 -15619586 -17878560
57046 -17878560 -20366507 -23108728 -26130290 -29457082 -33127615 -37193184 -41705970 -46720124
57038 -46720124 -52305326 -58544883 -65521227 -73322719 -82067143 -91896922 -102943929 -115311237
57030 -115311237 -129074709 -144255901 -160775676 -178452434 -197015246 -216028132 -234799664
57023 -234799664 -252550821 -268877496 -284029920 -298508995 -312201741 -323909837 -331803200
57016 -331803200 -334395737 -331199510 -322673627 -309762432 -293489368 -274793463 -254529705
$$ packed form
57072D121605k29882k45640k62888k84562l08478l32128l57711l87391m19007
57063A293918m52124C49406a94189o01656o62816p31289q11413q99719r93001
57054d894083j096997j218094j353715j500255j662776j846586k047080k258974
57046a7878560k487947k742221l021562l326792l670533m065569m512786n014154
57038d6720124n585202o239557o976344p801492q744424r829779j1047007j2367308
57030a15311237j3763472j5181192j6519775j7676758j8562812j9012886j8771532
57023b34799664j7751157j6326675j5152424j4479075j3692746j1708096p893363
57016c31803200k592537L196227Q525883J2911195J6273064J8695905K0263758
$$ plain form
57009 -254529705 -233498893 -212426854 -191891961 -172270541 -153762885 -136472299 -120458486
57002 -120458486 -105744646 -92322110 -80170431 -69263375 -59552833 -50963296 -43408448
56995 -43408448 -36801439 -31046925 -26039772 -21681517 -17891209 -14598149 -11735848 -9248388
56987 -9248388 -7092790 -5229053 -3614774 -2212948 -997078 55250 966784 1755710 2434431
56978 2434431 3017135 3521984 3962589 4344205 4671867 4955761 5204996 5422403 5609448
56969 5609448 5770642 5909476 6025420 6118860 6194332 6255531 6301905 6333671 6355836 6373763 6388541
56958 6388541 6399545 6407460 6411687 6408415 6394096 6367540 6326672 6267563 6189461 6096735 5992745 5875316
56946 5875316 5741045 5590511 5426486 5251132 5068877 4888754 4719387 4563171 4418841
$$ packed form
57009b54529705K1030812K1072039K0534893J9621420J8507656J7290586J6013813
57002a20458486J4713840J3422536J2151679J0907056R710542Q589537P554848
56995d3408448O607009N754514N007153M358255L790308L293060K862301K487460
56987i248388K155598J863737J614279J401826i97078E5250R11534P88926O78721
56978B434431N82704N04849M40605L81616L27662K83894K49235K17407J87045
56969E609448J61194J38834J15944R3440P5472O1199M6374L1766K2165J7927J4778
56958F388541J1004P915M227l272j4319k6556m0868n9109p8102r2726j03990j17429
56946E875316j34271j50534j64025j75354j82255j80123j69367j56216j44330
$$ plain form
56937 4418841 4288274 4177049 4087387 4010952 3927803 3813449 3651409 3442037 3198723 2935907
56927 2935907 2662983 2388186 2121745 1871951 1641645 1431208 1241821 1073315 922036
56918 922036 783970 657924 543498 438651 341952 254985 179968 116858 64832 24325 -4773
56906 -24960 -38797 -46516 -47777 -43836 -36064 -24412 -9262 7415 24817 44765 67961 90818 108529
56893 108529 119433 123939 121317 110748 94240 75418 56089 36378 17510 2005 -8610 -14577
56881 -14577 -16821 -16362 -13926 -8934 205 13913 30933 50871 75175 104315 136124 168612 202039
56868 202039 235817 265467 285561 294631 294847 288193 275607 258857 240352 221257 201804 183061
56856 183061 166433 151893 138474 126079 115167 105263 95548 86490 79230 73745 69006 64504 60313
$$ packed form
56937D418841j30567j11225q9662p6435q3149j14354j62040k09372k43314k62816
56927B935907k72924k74797k66441k49794k30306k10437j89387j68506j51279
56918I22036j38066j26046j14426j04847r6699q6967p5017o3110n2026B4325d773
56906b4960j3837p719j261L941P772J1652i262G415J7402J9948K3196K2857J7711
56893A08529J0904M506k622j0569j6508j8822j9329j9711A7510B005h610n967
56881a4577k244M59K436M992B05J3708J7020J9938K4304K9140L1809L2488L3427
56868B02039L3778K9650K0094R070K16o654j2586j6750j8505j9095j9453j8743
56856A83061j6628j4540j3419j2395j0912r904r715r058p260n485m739m502m191
$$ plain form
56843 60313 56257 52354 49558 48892 50434 54108 60540 69903 80899 92202 104197 118257 135280
56830 135280 155940 181001 209936 240433 270799 301737 334193 366515 395351 418476 435341
56819 435341 445886 450480 450245 446058 438038 427128 415903 406341 398077 390430 384835 383540 387058 394770
56805 394770 406963 424421 446883 473677 505120 541842 583538 629212 676758 720772 752996
56794 752996 767711 765711 751367 727874 697820 666000 637457 613322 591864 573244 560218 554547
56782 554547 555818 563704 578489 599432 625451 657592 698283 748202 806300 872199 944842 1018176
56770 1018176 1081477 1125415 1146052 1143297 1118997 1077771 1026569 971166 914331 858128 805809
56759 805809 760303 722706 693416 673036 661075 655464 654700 659357 670729 689270 714992 747866
$$ packed form
56843F0313m056l903k796o66J542L674O432R363J0996J1303J1995J4060J7023
56830A35280K0660K5061K8935L0497L0366L0938L2456L2322K8836K3125J6865
56819D35341J0545M594k35m187q020j0910j1225r562q264p647n595j295L518P712
56805C94770J2193J7458K2462K6794L1443L6722M1696M5674M7546M4014L2224
56794G52996J4715k000j4344k3493l0054l1820k8543k4135k1458j8620j3026n671
56782E54547J271P886J4785K0943K6019L2141M0691M9919N8098O5899P2643P3334
56770A018176O3301M3938K0637k755k4300m1226n1202n5403n6835n6203n2319
56759H05809m5506l7597k9290k0380j1961n611p64M657J1372J8541K5722L2874
$$ plain form
56747 747866 786826 829274 871853 910464 939650 954265 952819 937866 912702 879366 840072 797989
56735 797989 755175 711708 668372 628572 595919 571098 552517 538842 529400 523369 520539 522309
56723 522309 530229 543602 559760 576542 593350 609697 623662 632157 632457 623632 606962 585054
56711 585054 560428 534758 509025 483850 459732 437276 416970 398512 381033 364560 350443
56700 350443 339332 329577 319037 307942 298358 291134 285020 278647 271730 264360 256811 250182 245520
56687 245520 242008 237607 231765 225962 221391 217758 214589 211825 208704 203978 198032 193068 190412 189155
56673 189155 188099 187252 186600 185176 182549 179737 177488 175011 171455 167402 163874 161149 159490 159638 161431
56658 161431 163322 164419 165754 168347 171415 173932 176601 180503 184725 187121 186948 185363 183756 182932 183328
$$ packed form
56747G47866L8960M2448M2579L8611K9186J4615j446j4953k5164l3336l9294m2083
56735G97989m2814m3467m3336l9800l2653k4821j8581j3675r442o031k830J770
56723E22309P920J3373J6158J6782J6808J6347J3965Q495L00q825j6670k1908
56711E85054k4626k5670k5733k5175k4118k2456k0306j8458j7479j6473j4117
56700C50443j1111r755j0540j1095r584p224o114o373o917p370p549o629m662
56687B45520l512m401n842n803m571l633l169k764l121m726n946m964k656j257
56673A89155j056q47o52j424k627k812k249k477l556m053l528k725j659J48J793
56658A61431J891J097J335K593L068K517K669L902M222K396j73j585j607q24L96
$$ plain form
56643 183328 184717 185988 186428 186922 188883 192400 196418 200252 203848 206997 209440 211566 213985 216541 218515
56628 218515 219513 219341 217406 213343 208169 203902 201747 201112 200436 198662 195972 193435 191957 191491 191411 191415 191491
56611 191491 191237 190152 188765 188486 189878 191923 193416 194308 195223 196361 197414 197988 197804 197025 196555 197301
56595 197301 198971 200333 200707 200311 199301 197851 197204 198980 202814 206067 206593 204613 201459 197962 194759
56580 194759 192616 191353 189708 187275 185383 185109 185607 185403 184236 182601 180655 178620 177141 176140 174468
56565 174468 171802 169806 170252 172933 176453 179845 182341 182906 181526 179838 179063 178361 176690 175143 175655
56550 175655 178265 181384 184085 186497 188578 190210 192029 194569 197030 198345 198999 200278 202134 203327
56536 203327 203466 203504 204439 206591 209708 212685 213847 212890 211873 212912 215550 217925 219834 222769 227281
$$ packed form
56643A83328J389J271M40M94J961L517M018L834L596L149K443K126K419K556J974
56628B18515R98j72j935m063n174m267k155o35o76j774k690k537j478m66q0MP6
56611A91491k54j085j387k79J392K045J493Q92R15J138J053N74j84p79m70P46
56595A97301J670J362L74l96j010j450o47J776L834L253N26j980l154l497l203
56580A94759k143j263j645k433j892k74M98k04j167j635j946k035j479j001j672
56565A74468k666j996M46K681L520L392K496N65j380j688p75p02j671j547N12
56550A75655K610L119K701K412K081J632J819K540K461J315O54J279J856J193
56536B03327J39L8R35K152L117K977J162r57j017J039K638K375J909K935M512
$$ plain form
56521 227281 232179 236267 239202 240708 240588 239715 239650 241082 243643 247078 251389 256107 260710 265564 271175
56506 271175 276721 280790 283533 286796 292052 299285 307695 316377 324482 331962 339892 348882 357505 363707
56492 363707 367482 370793 375006 379808 384499 388862 392680 395666 397947 399634 400140 398967 396645 393674
56478 393674 389256 382721 375614 370407 367382 364740 361593 358677 355972 351916 345772 338933 333075 328489
56464 328489 324930 322642 321625 321022 320086 318988 318205 317781 317466 316816 315120 312106 308716 306197 304558 302952
56448 302952 301348 300441 300004 298847 296560 293993 291794 289731 287670 285961 284661 283405 282133 281006 279795
56433 279795 278436 277735 278199 278810 278665 279229 282712 288460 293407 296325 299192 303767 309223 314108 318541
56418 318541 323235 328086 332937 338359 344662 351256 357716 364179 370182 374691 377966 381792 387079 392793
$$ packed form
56521B27281M898M088K935J506j20q73o5J432K561L435M311M718M603M854N611
56506B71175N546M069K743L263N256P233Q410Q682Q105P480P930Q990Q623O202
56492C63707L775L311M213M802M691M363L818K986K281J687N06j173k322k971
56478C93674m418o535p107n207l025k642l147k916k705m056o144o839n858m586
56464C28489l559k288j017o03r36j098p83m24l15o50j696l014l390k519j639j606
56448C02952j604r07m37j157k287k567k199k063k061j709j300j256j272j127j211
56433B79795j359p01M64O11j45N64L483N748M947K918K867M575N456M885M433
56418C18541M694M851M851N422O303O594O460O463O003M509L275L826N287N714
$$ plain form
56404 392793 398055 403577 410058 416793 423069 429475 436522 443286 448790 453634 458988 464822 470237 474655
56390 474655 477716 478977 478793 478623 479399 480302 480080 478900 477983 478028 478723 479278 478836 477027 474474 472061 469381
56373 469381 464905 458082 450236 443010 436987 432125 428252 424539 419802 414007 408430 403799 399459 394756
56359 394756 389892 384921 379430 373834 369449 366426 363117 358401 353239 348986 345638 342782 340858 340231
56345 340231 340214 340089 339921 339414 337397 333707 330385 329558 331125 333611 336221 338751 340595 341404 342051 343623
56329 343623 345910 347856 348960 349406 349535 349957 351465 354097 357003 359749 362884 366803 371145 375687 380509
56314 380509 384855 387435 388584 390488 394448 399470 404278 408775 412573 414281 413930 414215 417368 422167 425792
56299 425792 427303 427630 427493 427332 428111 430144 431898 431800 430631 430510 432097 434246 435810 436535 436773 437543 440245
$$ packed form
56404C92793N262N522O481O735O276O406P047O764N504M844N354N834N415M418
56390D74655L061J261j84j70P76R03k22j180r17M5O95N55m42j809k553k413k680
56373D69381m476o823p846p226o023m862l873l713m737n795n577m631m340m703
56359C94756m864m971n491n596m385l023l309m716n162m253l348k856j924o27
56345C40231j7j25j68n07k017l690l322q27J567K486K610K530J844Q09O47J572
56329C43623K287J946J104M46J29M22J508K632K906K746L135L919M342M542M822
56314C80509M346K580J149J904L960N022M808M497L798J708l51K85L153M799L625
56299D25792J511L27j37j61P79K033J754r8j169j21J587K149J564P25K38P70K702
$$ plain form
56282 440245 445353 452085 459921 469134 479155 488180 495547 502773 511008 519357 527229 536276 548015 561311
56268 561311 574333 587328 601175 614795 626588 637231 648679 661394 674769 689063 704524
56257 704524 719753 733431 746585 760648 774464 785945 795652 805765 816244 824958 830985 834820
56245 834820 835945 833513 829361 827111 827967 830172 832783 837017 843401 850531 857516 865259 874456 884561
56231 884561 895475 908215 923152 939475 957072 977150 1000335 1025832 1052999 1082204 1113662
56220 1113662 1147062 1182637 1221095 1262279 1305520 1351436 1401519 1455757 1512782 1572892 1638832
56209 1638832 1712619 1793309 1878956 1969455 2066470 2171561 2285377 2408201 2540703 2684322
56199 2684322 2840670 3010101 3191456 3384073 3589171 3807831 4038125 4275812 4517480
$$ packed form
56282D40245N108O732P836R213J0021R025P367P226Q235Q349P872R047J1739J3296
56268E61311J3022J2995J3847J3620J1793J0643J1448J2715J3375J4294J5461
56257G04524J5229J3678J3154J4063J3816J1481R707J0113J0479Q714O027L835
56245H34820J125k432m152k250Q56K205K611M234O384P130O985P743R197J0105
56231H84561J0914J2740J4937J6323J7597K0078K3185K5497K7167K9205L1458
56220A113662L3400L5575L8458M1184M3241M5916N0083N4238N7025O0110O5940
56209A638832P3787Q0690Q5647R0499R7015J05091J13816J22824J32502J43619
56199B684322J56348J69431J81355J92617K05098K18660K30294K37687K41668
$$ plain form
56190 4517480 4761519 5006282 5248904 5485807 5712967 5925693 6119214 6289248 6431466
56181 6431466 6541785 6618771 6664677 6682484 6673182 6637801 6580450 6506384 6417941 6315361 6201082
56170 6201082 6080035 5955583 5827935 5696743 5562505 5424968 5282631 5134577 4980985
56161 4980985 4821841 4657245 4488969 4319437 4149152 3977486 3806016 3638382 3476312
56152 3476312 3318175 3162140 3008777 2860210 2718808 2587008 2466243 2355467 2252562
56143 2252562 2157341 2071185 1993677 1921916 1853635 1789067 1729456 1675545 1627551 1584735 1545085
56132 1545085 1507337 1472966 1444083 1419897 1397689 1376629 1357811 1341133 1325420 1311423 1301263
56121 1301263 1294763 1289762 1286302 1286906 1291965 1298389 1303856 1309374 1316648 1326009 1337902 1353273 1371241
$$ packed form
56190D517480K44039K44763K42622K36903K27160K12726J93521J70034J42218
56181F431466J10319P6986M5906J7807r302l5381n7351p4066q8443j02580j14279
56170F201082j21047j24452j27648j31192j34238j37537j42337j48054j53592
56161D980985j59144j64596j68276j69532j70285j71666j71470j67634j62070
56152C476312j58137j56035j53363j48567j41402j31800j20765j10776j02905
56143B252562r5221q6156p7508p1761o8281o4568n9611n3911m7994m2816l9650
56132A545085l7748l4371k8883k4186k2208k1060j8818j6678j5713j3997j0160
56121A301263o500n001l460O04N059O424N467N518P274R361J1893J5371J7968
$$ plain form
56108 1371241 1389226 1406500 1424853 1444653 1463138 1477869 1489335 1499073 1507784 1516150 1524824 1532727
56096 1532727 1538160 1542317 1548667 1558133 1568279 1578297 1591119 1608885 1629859 1652085 1677068 1707389
56084 1707389 1743121 1783049 1827554 1878186 1935855 2001079 2074765 2157849 2251529 2358191 2480017
56073 2480017 2616327 2764437 2923138 3092442 3269390 3447063 3618431 3778724 3924300
56064 3924300 4053147 4167541 4272818 4371959 4463441 4544074 4610409 4657457 4680515 4679662 4659304
56053 4659304 4623125 4573071 4512549 4444948 4368058 4275404 4164654 4039894 3904791 3759674
56043 3759674 3607326 3455344 3309539 3170192 3037617 2915703 2806412 2706211 2612072 2526391
56033 2526391 2452075 2387360 2329412 2278494 2234447 2193563 2153420 2116755 2086148 2058843 2031403
$$ packed form
56108A371241J7985J7274J8353J9800J8485J4731J1466R738Q711Q366Q674P903
56096A532727N433M157O350R466J0146J0018J2822J7766K0974K2226K4983L0321
56084A707389L5732L9928M4505N0632N7669O5224P3686Q3084R3680J06662J21826
56073B480017J36310J48110J58701J69304J76948J77673J71368J60293J45576
56064C924300J28847J14394J05277R9141R1482Q0633O6335M7048K3058q53k0358
56053D659304l6179n0054o0522o7601p6890r2654j10750j24760j35103j45117
56043C759674j52348j51982j45805j39347j32575j21914j09291j00201r4139q5681
56033B526391p4316o4715n7948n0918m4047m0884m0143l6665l0607k7305k7440
$$ plain form
56022 2031403 2005667 1985319 1969923 1956998 1946862 1940872 1937784 1936149 1937572 1943626 1952385 1961822 1973508
56009 1973508 1989211 2007080 2025101 2044926 2068295 2092949 2116123 2138904 2163270 2188164 2212311
55998 2212311 2237417 2264849 2292751 2320035 2349096 2380825 2411612 2439660 2469623 2506178 2547537
55987 2547537 2590197 2635429 2685681 2739027 2792913 2849312 2910599 2974340 3037633 3102495 3171531
55976 3171531 3242687 3313903 3388357 3469189 3553568 3638000 3724775 3817040 3912585 4009148 4110706
55965 4110706 4221475 4338727 4458904 4585616 4723654 4869981 5018912 5171581 5332025
55956 5332025 5498682 5668568 5845505 6035286 6236609 6445254 6662873 6893125 7133981
55947 7133981 7382861 7644480 7924170 8218605 8522991 8842100 9183555 9545386 9921566
$$ packed form
56022B031403k5736k0348j5396j2925j0136n990l088j635J423O054Q759R437J1686
56009A973508J5703J7869J8021J9825K3369K4654K3174K2781K4366K4894K4147
55998B212311K5106K7432K7902K7284K9061L1729L0787K8048K9963L6555M1359
55987B547537M2660M5232N0252N3346N3886N6399O1287O3741O3293O4862O9036
55976C171531P1156P1216P4454Q0832Q4379Q4432Q6775R2265R5545R6563J01558
55965D110706J10769J17252J20177J26712J38038J46327J48931J52669J60444
55956E332025J66657J69886J76937J89781K01323K08645K17619K30252K40856
55947G133981K48880K61619K79690K94435L04386L19109L41455L61831L76180
$$ plain form
55938 9921566 10315189 10734773 11182057 11655060 12158760 12700982 13282154 13900749 14563872
55929 14563872 15280412 16049079 16865622 17735875 18668397 19660744 20707482 21815476 22996417
55920 22996417 24251465 25579606 26994263 28514553 30147480 31896718 33780468 35820007
55912 35820007 38018037 40369898 42889030 45600109 48517231 51655194 55055134 58774015
55904 58774015 62859183 67362577 72370709 77991274 84324150 91480657 99614887 108892733
55896 108892733 119446035 131408934 144988548 160451290 178065980 198129306 221017348
55889 221017348 247120934 276755973 310196265 347528846 387839856 428072504 462895044
55882 462895044 486428407 494848615 487859148 468120044 439551900 405932239 370290938
$$ packed form
55938I921566L93623M19584M47284M73003N03700N42222N81172O18595O63123
55929A4563872P16540P68667Q16543Q70253R32522R92347J046738J107994J180941
55920B2996417J255048J328141J414657J520290J632927J749238J883750K039539
55912C5820007K198030K351861K519132K711079K917122L137963L399940L718881
55904E8774015M085168M503394N008132N620565O332876P156507Q134230R277846
55896A08892733J0553302J1962899J3579614J5462742J7614690K0063326K2888042
55889B21017348K6103586K9635039L3440292L7332581M0311010M0232648L4822540
55882D62895044K3533363Q420208o989467j9739104k8568144l3619661l5641301
$$ plain form
55875 370290938 334792648 300808284 269121173 240168555 214161459 191099910 170821695
55868 170821695 153096676 137669666 124251929 112547148 102307960 93342425 85473463
55861 85473463 78529410 72372518 66901542 62023028 57646372 53704914 50152545 46936385
55853 46936385 43995361 41285511 38783946 36467191 34306706 32286312 30403381 28650164
55845 28650164 27010710 25476624 24048884 22723024 21487718 20337870 19273799 18287215
55837 18287215 17362899 16494668 15685695 14932720 14223763 13552152 12919557 12324157 11758377
55828 11758377 11219675 10712059 10235678 9785431 9360248 8963268 8592472 8241182 7907640
55819 7907640 7594007 7296359 7006376 6723092 6452709 6196457 5948651 5707017 5474760
$$ packed form
55875C70290938l5498290l3984364l1687111k8952618k6007096k3061549k0278215
55868A70821695j7725019j5427010j3417737j1704781j0239188q965535p868962
55861H5473463o944053o156892n470976m878514m376656l941458l552369l216160
55853D6936385k941024k709850k501565k316755k160485k020394j882931j753217
55845B8650164j639454j534086j427740j325860j235306j149848j064071r86584
55837A8287215r24316q68231q08973p52975p08957o71611o32595n95400n65780
55828A1758377n38702n07616m76381m50247m25183l96980l70796l51290l33542
55819G907640l13633k97648k89983k83284k70383k56252k47806k41634k32257
$$ plain form
55810 5474760 5251705 5033315 4819724 4616577 4425704 4243449 4068829 3904693 3750254
55801 3750254 3601333 3458809 3328315 3210772 3101652 3000173 2910530 2833069 2762887 2698255
55791 2698255 2641731 2591420 2539801 2483350 2425545 2368735 2311130 2253793 2202339 2158897 2119625
55780 2119625 2082589 2050829 2025059 2000461 1973585 1945917 1918061 1887047 1852120 1816692 1781656
55769 1781656 1743067 1699514 1655698 1615471 1577034 1538243 1500986 1466770 1433167 1398428 1365125
55758 1365125 1335729 1308684 1282019 1256983 1235121 1215373 1196725 1180255 1166243 1152714 1138911
55747 1138911 1126678 1116677 1107091 1097861 1091998 1090500 1089896 1087073 1082777 1078221 1072105 1063406 1053592 1043668
55733 1043668 1032302 1018859 1004906 990808 974502 955839 938433 924737 912675 899670 886679
$$ packed form
55810E474760k23055k18390k13591k03147j90873j82255j74620j64136j54439
55801C750254j48921j42524j30494j17543j09120j01479q9643p7461p0182o4632
55791B698255n6524n0311n1619n6451n7805n6810n7605n7337n1454m3442l9272
55780B119625l7036l1760k5770k4598k6876k7668k7856l1014l4927l5428l5036
55769A781656l8589m3553m3816m0227l8437l8791l7257l4216l3603l4739l3303
55758A365125k9396k7045k6665k5036k1862j9748j8648j6470j4012j3529j3803
55747A138911j2233j0001r586r230n863j498o04k823m296m556o116q699r814r924
55733A043668j1366j3443j3953j4098j6306j8663j7406j3696j2062j3005j2991
$$ plain form
55722 886679 875476 865023 853612 842368 833774 828361 824831 821772 817665 811138 802620 793884 784921
55709 784921 773497 758731 742799 728274 716334 708158 704930 705218 705193 702595 697952 691339 681372 668404
55695 668404 655130 642498 628264 611189 593562 577994 564667 553087 543288 533802 521813 507182
55683 507182 493210 481722 470679 458390 446580 437041 428630 420131 413066 409067 407117 405937 406431
55670 406431 409168 411982 412709 412014 410996 408402 402992 396435 390897 385487 378103 369462 362472 358526 356726
55655 356726 355996 355909 356018 356027 356171 356566 357159 358876 363198 369863 376741 382711 388717 395362 401951 408823 417821
55638 417821 428891 438821 445045 448387 450491 451190 450363 449983 451981 455931 460613 465808 470894 474021 474745
55623 474745 475228 476793 477609 475997 473658 472975 473179 471981 469318 466744 464560 462254 460575 460516 461100 460487
$$ packed form
55722H86679j1203j0453j1411j1244q594n413l530l059m107o527q518q736q963
55709G84921j1424j4766j5932j4525j1940q176l228K88k5k598m643o613r967j2968
55695F68404j3274j2632j4234j7075j7627j5568j3327j1580r799r486j1989j4631
55683E07182j3972j1488j1043j2289j1810r539q411q499p065l999j950j180M94
55670D06431K737K814P27o95j018k594n410o557n538n410p384q641o990l946j800
55655C56726p30q7J09RJ44L95N93J717M322O665O878N970O006O645O589O872Q998
55638D17821J1070R930O224L342K104O99q27l80J998L950M682N195N086L127P24
55623D74745M83J565Q16j612k339o83K04j198k663k574k184k306j679n9N84o13
$$ plain form
55607 460487 458510 456267 454202 452478 452002 453086 454188 453987 453706 455418 458944 462265 464213 465111 465612
55592 465612 466325 467666 468780 467770 464205 460080 456984 453879 448996 442242 434138 424168 412092 399452
55578 399452 387921 377367 366964 356672 346165 334168 320582 307504 296424 286286 276038
55567 276038 266799 259346 251885 243093 235284 231440 230652 229536 226685 222717 217318 209864 202190 197224
55553 197224 194972 192776 189462 186558 185438 185742 186715 187810 187967 186258 183334 180653 178641 177120 176643
55538 176643 177438 177951 176579 174094 172158 170470 167910 165610 165772 167760 168533 167173 166105 167303 169877
55523 169877 172157 173738 174515 173723 171157 167958 165217 162835 160361 158080 156744 156887 158524 160955 163077
55508 163077 164506 165954 167872 169620 170829 172448 175125 177652 178615 178670 179498 181435 183913 187264 191924
$$ packed form
55607D60487j977k243k065j724m76J084J102k01k81J712L526L321J948Q98N01
55592D65612P13J341J114j010l565m125l096l105m883o754q104r970j2076j2640
55578C99452j1531j0554j0403j0292j0507j1997j3586j3078j1080j0138j0248
55567B76038r239p453p461q792p809l844p88j116k851l968n399p454p674m966
55553A97224k252k196l314k904j120L04R73J095J57j709k924k681k012j521m77
55538A76643P95N13j372k485j936j688k560k300J62J988P73j360j068J198K574
55523A69877K280J581P77p92k566l199k741k382k474k281j336J43J637K431K122
55508A63077J429J448J918J748J209J619K677K527R63N5Q28J937K478L351M660
$$ plain form
55493 191924 196488 198774 198541 197295 195909 194473 193983 195776 199299 202531 204666 206492 208155 208662 207836
55478 207836 206891 206703 207097 207989 209660 211726 213315 214428 215730 217016 217360 216792 216391 216596 216780 216514 216067
55461 216067 215673 215355 215216 214911 213410 210425 207293 205071 202690 198602 193280 188224 183449 178138 172909
55446 172909 168954 165445 160433 154095 148489 144145 139395 133292 126818 120948 115720 111411 108427 105878
55432 105878 102562 99511 99117 101315 103063 102157 99257 95681 91757 88143 86266 86285 86637 86577 87109 88453
55416 88453 88819 87048 84598 83432 83402 82978 81254 78213 74340 70904 69364 69637 70197 70361 70937 72064
55400 72064 72350 71054 69401 68584 68101 67143 66062 65364 64762 64322 65006 66860 68182 67800 66664 65910 64901
55383 64901 62785 60539 59605 59534 58968 58162 58620 60561 62596 63924 65292 67460 69812 71011 70571 69486
$$ packed form
55493A91924M564K286k33j246j386j436m90J793L523L232K135J826J663N07q26
55478B07836r45j88L94Q92J671K066J589J113J302J286L44n68m01K05J84k66m47
55461B16067l94l18j39l05j501k985l132k222k381m088n322n056m775n311n229
55446A72909l955l509n012o338n606m344m750o103o474n870n228m309k984k549
55432A05878l316l051l94K198J748r06k900l576l924l614j877J9L52o0N32J344
55416H8453L66j771k450j166l0m24j724l041l873l436j540K73N60J64N76J127
55400G2064K86j296j653q17m83r58j081o98o02m40O84J854J322l82j136p54j009
55383F4901k116k246r34p1n66q06M58J941K035J328J368K168K352J199m40j085
$$ plain form
55367 69486 69345 70683 72296 72643 71758 70988 70949 70880 70188 69396 69129 69358 70124 71714 73455 73617 71518 68757
55349 68757 67366 67510 67827 67288 65903 64300 63471 64327 66731 69288 70628 70541 69683 68894 68996 70367 72312
55332 72312 73643 74088 74194 73666 71142 66191 60446 56101 54116 54128 54998 55056 53120 49937 47506 46620 46303
55315 46303 45917 46007 46405 45562 43105 41262 42085 44602 46460 47274 48458 50530 52520 53724 54342 54404 53468
55298 53468 51562 49453 47860 46957 46514 46128 45673 45757 46955 48297 47738 44894 42049 41295 41759 41086 38754
55281 38754 36317 34879 34001 33036 32237 32350 33883 36650 39374 40276 38939 37149 36923 38165 39252 39372
55265 39372 39052 38745 38355 38144 38918 41064 44238 47993 51796 54480 54700 52273 48415 44556 41425 39241
55249 39241 38048 37681 37883 38569 39613 40566 41061 41399 42192 43445 44455 44514 43349 41095 38381 36335 35879
$$ packed form
55367F9486j41J338J613L47q85p70l9o9o92p92k67K29P66J590J741J62k099k761
55349F8757j391J44L17n39j385j603q29Q56K404K557J340q7q58p89J02J371J945
55332G2312J331M45J06n28k524m951n745m345j985J2Q70N8j936l183k431q86l17
55315D6303l86R0L98q43k457j843Q23K517J858Q14J184K072J990J204O18O2r36
55298E3468j906k109j593r03m43l86m55Q4J198J342n59k844k845p54M64o73k332
55281C8754k437j438q78r65p99J13J533K767K724R02j337j790k26J242J087J20
55265C9372l20l07l90k11P74K146L174L755L803K684K20k427l858l859l131k184
55249C9241j193l67K02O86J044R53M95L38P93J253J010N9j165k254k714k046m56
$$ plain form
55232 35879 36857 38204 39135 39984 41762 44881 48332 50329 50045 48481 47206 46509 45498 43821 42308 41821
55216 41821 42472 44095 46387 48211 48035 45824 43566 43134 44390 46039 47352 48159 48064 46830 45116 43951
55200 43951 43875 45179 48105 51818 53978 52706 48796 44928 42832 42118 41625 40813 39761 38742 38166 38498
55184 38498 39928 42119 44161 44924 44116 43161 44144 47363 50648 51663 50217 47761 45446 43498 41859
55169 41859 40515 39576 39604 41245 43972 45948 45987 44958 44507 45091 46170 47467 48906 50010 50638 51794
55153 51794 54467 57932 60307 60539 58876 55898 52278 49192 47664 47561 48184 49549 52012 54965 57162
55138 57162 58246 58873 59474 60065 61088 63118 65598 67050 66724 65161 63119 61026 59429 58770 58619 58232
55122 58232 57890 58445 59513 59686 58963 59296 61832 64931 66130 65146 63608 62407 60742 57817 54374 52122
$$ packed form
55232C5879R78J347R31Q49J778L119L451J997k84j564j275o97j011j677j513m87
55216D1821O51J623K292J824j76k211k258m32J256J649J313Q07r5j234j714j165
55200D3951p6J304K926L713K160j272l910l868k096p14m93q12j052j019n76L32
55184C8498J430K191K042P63q08r55R83L219L285J015j446k456k315j948j639
55169D1859j344r39K8J641K727J976L9j029m51N84J079J297J439J104O28J156
55153E1794K673L465K375K32j663k978l620l086j528j03O23J365K463K953K197
55138E7162J084O27O01N91J023K030K480J452l26j563k042k093j597o59j51l87
55122E8232l42N55J068J73p23L33K536L099J199r84j538j201j665k925l443k252
$$ plain form
55106 52122 52076 53649 55127 54986 53025 50360 48355 47670 48220 49535 50791 50840 48947 45749 43069 42305
55090 42305 43101 43990 44379 45264 47670 51004 53688 55032 55583 55749 55202 53826 52238 50901 49655 48651
55074 48651 48828 50698 53349 55450 56711 57625 58355 58751 59081 59990 61927 65147 69736 74979 79245 81364
55058 81364 81876 82193 82793 82976 82164 80753 79740 79883 81001 81888 81370 79656 78033 77132 76588 76728 78959
55041 78959 83403 87608 89223 88933 89071 90179 90961 91120 91999 94203 96559 97989 98907 100080 101350 102191
55025 102191 102621 102930 103148 103246 103347 103562 104049 105163 106936 108526 108969 108428 108031 108577 110095 112331 114741
55008 114741 116272 116291 115652 115808 116838 117362 116420 114481 112553 111217 110566 110242 109610 108717 108805 110917 114316
54991 114316 117349 119493 121256 122567 122941 123017 123946 125157 124616 121642 117644 113727 109633 105785 104144
$$ packed form
55106E2122m6J573J478j41j961k665k005o85N50J315J256M9j893l198k680p64
55090D2305P96Q89L89Q85K406L334K684J344N51J66n47j376j588j337j246j004
55074D8651J77J870K651K101J261R14P30L96L30R09J937L220M589N243M266K119
55058H1364N12L17O00J83q12j411j013J43J118Q87n18j714j623r01n44J40K231
55041G8959M444M205J615k90J38J108P82J59Q79K204K356J430R18J173J270Q41
55025A02191M30L09K18R8J01K15M87J114J773J590M43n41l97N46J518K236K410
55008A14741J531J9o39J56J030N24r42j939j928j336o51l24o32q93Q8K112L399
54991A14316L033K144J763J311L74P6R29J211n41k974l998l917m094l848j641
$$ plain form
54976 104144 105626 108351 109976 110428 110828 111075 110298 108929 108472 109486 111142 112509 113120 112593 110893 108825
54960 108825 107346 106557 106096 106087 106725 107384 107252 106666 106749 107902 109651 111804 114409 116446 116015 112667 108664
54943 108664 106958 108220 110535 111715 111154 109510 107405 105040 102712 101095 100825 102079 104541 107454 109631
54928 109631 109947 108340 106142 105078 105939 108226 110650 111714 110520 107811 105941 106917 110409 114287 117002
54913 117002 118763 120481 122486 124521 126254 127517 128523 130030 132731 136359 139958 143176 146663 151033
54899 151033 156051 161162 166298 171819 177986 184735 191745 198690 205748 213714 223174 233745 244808 256782
54885 256782 270737 286610 302728 317339 329784 339797 346585 349305 347905 342790 334010 321478
54873 321478 305944 289156 272894 257955 244213 231610 220745 212136 205106 198166 190808 184172
$$ packed form
54976A04144J482K725J625M52M00K47p77j369m57J014J656J367O11n27j700k068
54960A08825j479p89m61rO38O59j32n86Q3J153J749K153K605K037m31l348m003
54943A08664j706J262K315J180n61j644k105k365k328j617k70J254K462K913K177
54928A09631L16j607k198j064Q61K287K424J064j194k709j870R76L492L878K715
54913A17002J761J718K005K035J733J263J006J507K701L628L599L218L487M370
54899A51033N018N111N136N521O167O749P010O945P058P966R460J0571J1063J1974
54885B56782J3955J5873J6118J4611J2445J0013O788K720j400n115q780j2532
54873C21478j5534j6788j6262j4939j3742j2603j0865q609p030o940p358o636
$$ plain form
54861 184172 179482 176579 174631 173353 172557 171453 169870 169515 172231 177208 181720 184713 187908 193042 199866
54846 199866 207680 217148 229321 243851 259219 274036 287391 298640 307627 314526 318873 319395 315327
54833 315327 307363 296934 285324 273738 263141 253260 242635 230518 218190 207670 199561 192750
54821 192750 185703 177629 168898 160798 154513 150019 146410 143232 140666 138398 135513 132032 129442 128946
54807 128946 129903 130597 129926 127875 125089 122494 120721 119498 118088 116313 114348 111798 108348 105220 104129
54792 104129 104435 103391 100023 96752 95990 97097 98232 99268 100833 102052 101726 100804 101221 102828 103819 103938
54776 103938 104774 106727 107989 107231 105472 104413 104380 104748 105225 105818 106412 107159 108561 110490 111800 111727 111288
54759 111288 112522 116376 121796 126909 130605 132775 133448 132548 130785 130019 131685 135073 138182 140371 143062
$$ packed form
54861A84172m690k903j948j278p96j104j583l55K716M977M512K993L195N134O824
54846A99866P814R468J2173J4530J5368J4817J3355J1249Q987O899M347N22m068
54833C15327p964j0429j1610j1586j0597r881j0625j2117j2328j0520q109o811
54821A92750p047q074q731q100o285m494l609l178k566k268k885l481k590m96
54807A28946R57O94o71k051k786k595j773j223j410j775j965k550l450l128j091
54792A04129L06j044l368l271p62J107J135J036J565J219l26r22M17J607R91J19
54776A03938Q36J953J262p58j759j059l3L68M77N93N94P47J402J929J310p3m39
54759A11288J234L854N420N113L696K170O73r00j763p66J666L388L109K189K691
$$ plain form
54744 143062 147693 154244 162183 171362 181094 189709 196469 203075 211885 223266 235920 249237 263764
54731 263764 279665 296147 312465 328248 342720 354638 363304 368910 371782 371990 369824 366043 361419
54718 361419 356204 349975 342002 332291 322375 314296 308462 303371 297914 292855 289314 286952 284828 283131
54704 283131 282805 284201 287318 292574 299947 308028 315405 322616 331321 341995 353819 366490 380653
54691 380653 396708 414506 434020 455175 477294 499885 523341 547537 570303 588921 602693
54680 602693 612401 617753 617335 610868 599490 583851 563972 541019 517072 492813 467534 441818
54668 441818 417982 397083 377606 358177 339816 324369 312264 302893 295714 289819 283780 277073
54656 277073 270513 264391 257564 249497 241776 236172 232309 228661 224841 221472 218561 215618 212949 211448
$$ packed form
54744A43062M631O551P939R179R732Q615O760O606Q810J1381J2654J3317J4527
54731B63764J5901J6482J6318J5783J4472J1918Q666N606K872K08k166l781m624
54718C61419n215o229p973r711r916q079n834n091n457n059l541k362k124j697
54704B83131l26J396L117N256P373Q081P377P211Q705J0674J1824J2671J4163
54691C80653J6055J7798J9514K1155K2119K2591K3456K4196K2766J8618J3772
54680F02693R708N352m18o467j1378j5639j9879k2953k3947k4259k5279k5716
54668D41818k3836k0899j9477j9429j8361j5447j2105r371p179n895o039o707
54656B77073o560o122o827q067p721n604l863l648l820l369k911k943k669j501
$$ plain form
54642 211448 211260 211626 211876 211784 211304 210630 210184 210013 209719 209332 209474 210202 210744 211023 212200 214731 217194 218343
54624 218343 219159 221182 223756 224912 224609 225098 227956 232430 236981 241026 244738 248382 252301 256576 260427
54609 260427 262914 264504 266905 271048 276332 282173 288994 296929 304755 311363 317535 324923 333532 341563
54595 341563 347955 353939 361522 371059 380959 389494 396429 403088 411374 422657 437022 453339 470324
54582 470324 487783 506641 527734 550963 575845 602366 630635 659855 688270 714328 737527
54571 737527 757915 774961 787137 792599 790357 780884 765537 745388 720905 692731 662159 630472
54559 630472 598344 566517 536524 509895 486802 466291 447706 431127 416565 403632 392007
54548 392007 381374 370979 360280 350150 342303 337054 332593 326981 320073 312959 306329 300148 294317
$$ packed form
54642B11448j88L66K50r2m80o74m46j71k94l87J42P28N42K79J177K531K463J149
54624B18343Q16K023K574J156l03M89K858M474M551M045L712L644L919M275L851
54609B60427K487J590K401M143N284N841O821P935P826O608O172P388Q609Q031
54595C41563O392N984P583R537R900Q535O935O659Q286J1283J4365J6317J6985
54582D70324J7459J8858K1093K3229K4882K6521K8269K9220K8415K6058K3199
54571G37527K0388J7046J2176N462k242r473j5347k0149k4483k8174l0572l1687
54559F30472l2128l1827k9993k6629k3093k0511j8585j6579j4562j2933j1625
54548C92007j0633j0395j0699j0130p847n249m461n612o908p114o630o181n831
$$ plain form
54535 294317 288860 283684 278612 273395 267447 260071 251351 242372 234211 227110 220792 214926 208964 202277
54521 202277 195089 188742 184486 182373 181733 182013 182524 182023 179582 175823 172530 170939 170766 170828 170297 169405
54505 169405 169084 169804 170733 170452 168556 166066 164180 163244 163116 163730 164837 165942 167092 169122 172472 176299
54489 176299 179349 181233 182345 183167 184457 187438 192641 198789 203867 207419 211019 216325 223398 231229
54475 231229 239466 249089 261244 275518 289772 302072 312641 323264 335004 347412 359958 372760
54463 372760 385197 395150 400920 403205 403979 403969 402335 398190 391059 380344 365972 349640 333892 319701
54449 319701 306139 292607 279952 268914 258951 249485 241154 234676 229259 223399 216820 210457 204698
54436 204698 198826 192356 185896 180320 175901 172852 171966 173796 177383 180726 182667 183655 184412 184659 183750
$$ packed form
54535B94317n457n176n072n217n948p376q720q979q161p101o318n866n962o687
54521B02277p188o347m256k113o40K80N11n01k441l759l293j591j73O2n31q92
54505A69405l21P20R29k81j896k490j886r36j28O14J107J105J150K030L350L827
54489A76299L050J884J112Q22J290K981N203O148N078L552L600N306P073P831
54475B31229Q237R623J2155J4274J4254J2300J0569J0623J1740J2408J2546J2802
54463C72760J2437R953N770K285P74j0j634m145p131j0715j4372j6332j5748j4191
54449C19701j3562j3532j2655j1038r963r466q331o478n417n860o579o363n759
54436B04698n872o470o460n576m419l049q86J830L587L343J941R88P57K47r09
$$ plain form
54421 183750 181977 180319 179112 177836 176290 175191 175432 177390 181074 186134 191405 195347 197617 199683
54407 199683 203213 208152 212858 215727 216263 215020 213196 211922 211328 210459 208525 205939 203648 201973 200756
54392 200756 200134 200186 200032 198377 195152 191762 189432 187907 186110 183501 180551 178292 177616 178532 179786 179614
54376 179614 177278 173653 170135 167299 164944 162996 161695 160897 159964 158787 158467 160092 162828 164020 161822
54361 161822 157354 153700 153021 155199 158888 162875 166365 169004 171255 174100 177819 181503 184172 185966
54347 185966 187796 190259 193345 196854 200568 204204 207685 211461 216308 222681 230115 237053 241609 243101
54333 243101 242806 242657 243388 244584 246114 248264 250543 251791 251682 250710 248452 243703 237066 231467 228664
54318 228664 226852 223332 218130 213083 208665 204125 200031 198042 198129 198258 197160 195511 193993 192124 189645
$$ packed form
54421A83750j773j658j207j276j546j099K41J958L684N060N271L942K270K066
54407A99683L530M939M706K869N36j243j824j274n94q69j934k586k291j675j217
54392B00756o22N2j54j655l225l390k330j525j797k609k950k259o76R16J254j72
54376A79614k336l625l518k836k355j948j301p98r33j177l20J625K736J192k198
54361A61822m468l654o79K178L689L987L490K639K251K845L719L684K669J794
54347A85966J830K463L086L509L714L636L481L776M847O373P434O938M556J492
54333B43101k95j49P31J196J530K150K279J248j09r72k258m749o637n599k803
54318B28664j812l520n202n047m418m540m094j989Q7J29j098j649j518j869k479
$$ plain form
54303 189645 187427 186158 185370 184412 183254 181766 179491 176827 175292 175825 177698 179719 181504 182940 183493
54288 183493 182960 182162 181970 182251 182460 182684 183456 185040 187489 190729 194007 195936 195902 194973 194729 195595 196849
54271 196849 197720 197833 197084 195883 195113 195069 194658 192427 188299 183669 179865 176972 174152 170656 166546 162708
54255 162708 160065 158623 157544 156261 155000 153831 151863 148209 143515 139715 138062 137896 137481 135606 132192
54240 132192 127773 122937 118254 114319 111438 109345 107605 106317 105997 106573 107039 106598 105676 105154 104968 104372
54224 104372 103316 102583 102525 102720 103056 104055 105702 106992 107318 107557 108950 111399 113589 114538 114466 114416 115416
54207 115416 117717 120469 122383 122973 122837 122767 123198 124568 127179 130220 132014 131973 131389 131425 131249 129461 126558
54190 126558 124448 123788 123470 122840 122790 124174 126489 128931 131592 134556 136691 136639 134780 133077 132855 133603
$$ packed form
54303A89645k218j269p88r58j158j488k275k664j535N33J873K021J785J436N53
54288A83493n33p98j92K81K09K24P72J584K449L240L278J929l4r29k44Q66J254
54271A96849Q71J13p49j201p70m4m11k231m128m630l804k893k820l496m110l838
54255A62708k643j442j079j283j261j169j968l654m694l800j653j66m15j875l414
54240A32192m419m836m683l935k881k093j740j288l20N76M66m41r22n22j86n96
54224A04372j056p33n8J95L36R99J647J290L26K39J393K449K190R49p2n0J000
54207A15416K301K752J914N90j36p0M31J370K611L041J794m1n84L6j76j788k903
54190A26558k110o60l18o30n0J384K315K442K661K964K135n2j859j703k22P48
$$ plain form
54174 133603 134169 134371 134942 136314 138105 139674 140820 141888 143409 145594 147919 149315 149076 147610 145957
54159 145957 144573 143037 141050 139027 137317 135482 133127 131093 130869 132768 135367 136910 136778 135539 134295
54144 134295 134137 135507 137651 139124 139237 138632 138226 138028 137414 136231 135156 134970 135704 136523 136613 136347 137261
54127 137261 140314 144307 146789 146590 144736 142792 141190 139545 137708 135854 134095 132640 131898 131850 131760 130956
54111 130956 129546 127962 126276 124498 123024 122214 121930 122050 123064 125488 128890 132002 133602 133029 130375
54096 130375 126759 123963 123041 123428 123821 123576 122837 121876 121111 121302 122792 124681 125479 124495 122079 118831 115357
54079 115357 112513 110985 110551 110443 110372 110548 110816 110565 109561 108277 107314 106984 107343 108052 108369 107941 107449 107795
54061 107795 108821 109638 110032 110553 111191 111006 109392 106911 104562 102914 102222 102614 103751 104916 105858 107032
$$ packed form
54174A33603N66K02N71J372J791J569J146J068J521K185K325J396k39j466j653
54159A45957j384j536j987k023j710j835k355k034k24J899K599J543j32j239j244
54144A34295j58J370K144J473J13o05m06j98o14j183j075j86P34Q19R0k66R14
54127A37261L053L993K482j99j854j944j602j645j837j854j759j455p42m8r0q04
54111A30956j410j584j686j778j474q10k84J20J014K424L402L112J600n73k654
54096A30375l616k796r22L87L93k45p39r61p65J91J490J889P98r84k416l248l474
54079A15357k844j528m34j08p1J76K68k51j004j284r63l30L59P09L17m28m92L46
54061A07795J026Q17L94N21O38j85j614k481k349j648o92L92J137J165R42J174
$$ plain form
54045 107032 108717 110393 111311 111263 110551 109636 109049 109254 110402 112503 115633 119350 122108 122277 120090 117812
54029 117812 117602 119812 123375 126875 128903 128506 126147 123552 121948 121051 120178 119457 119130 118586 117243 115866
54013 115866 115879 117551 119801 121555 122390 122067 120441 117894 115101 112398 110040 108839 109592 111902 114425
53998 114425 116410 118139 119802 120963 121509 122281 124183 127178 130542 133658 136279 138587 141284 145115 149842
53983 149842 154214 157303 159451 161591 164201 167409 171538 176825 182883 189154 195763 203339 212057 221276
53969 221276 230048 237615 243706 248931 254730 262233 271039 279614 286929 293226 299151 304747 309621 313671
53955 313671 317269 320947 325033 329500 334008 338164 341546 343287 342183 338066 333014 330044 330058 330819 329523
53940 329523 325655 320684 315797 311155 306952 303623 300666 296444 289909 282007 274840 269901 267379 266480
$$ packed form
54045A07032J685J676R18m8p12r15n87K05J148K101L130L717K758J69k187k278
54029A17812k10K210L563L500K028l97k359k595j604q97q73p21l27n44j343j377
54013A15866J3J672K250J754Q35l23j626k547k793k703k358j201P53K310K523
53998A14425J985J729J663J161N46P72J902K995L364L116K621K308K697L831M727
53983A49842M372L089K148K140K610L208M129N287O058O271O609P576Q718R219
53969B21276Q772P567O091N225N799P503Q806Q575P315O297N925N596M874M050
53955C13671L598L678M086M467M508M156L382J741j104m117n052k970J4P61j296
53940C29523l868m971m887m642m203l329k957m222o535p902p167m939k522q99
$$ plain form
53926 266480 265817 264110 261309 258812 257819 257733 256870 254662 252145 250122 247819 244151 239713 236513 235632 235934
53910 235934 235509 233975 232761 233152 234646 235652 235496 235094 235490 236389 236736 236557 237427 240777 246158 251622
53894 251622 255666 258398 260824 263485 266025 267853 268875 269578 270704 273026 277231 283578 291431 299316
53880 299316 305842 310831 315402 320789 327205 334021 340818 347752 354868 361629 367594 373144 378816 383956
53866 383956 386787 386375 384089 382536 382976 384171 383934 381655 379117 378897 382067 387491 393232 398380 403285
53851 403285 408282 412894 416656 420310 425542 433442 443545 454486 465279 475750 485892 495115 502326
53838 502326 506717 508375 508079 506634 504507 501982 499311 496611 493851 491041 488214 485162 481407 476473
53824 476473 469954 461437 450895 439226 427740 416827 405823 394526 384015 375190 367257 358666
$$ packed form
53926B66480o63j707k801k497r93q6q63k208k517k023k303l668m438l200q81L02
53910B35934m25j534j214L91J494J006j56m02L96Q99L47j79Q70L350N381N464
53894B51622M044K732K426K661K540J828J022P03J126K322M205O347P853P885
53880B99316O526M989M571N387O416O816O797O934P116O761N965N550N672N140
53866C83956K831m12k286j553M40J195k37k279k538k20L170N424N741N148M905
53851D03285M997M612L762L654N232P900J0103J0941J0793J0471J0142R223P211
53838E02326M391J658k96j445k127k525k671k700k760k810k827l052l755m934
53824D76473o519q517j0542j1669j1486j0913j1004j1297j0511q825p933q591
$$ plain form
53812 358666 349078 339286 329580 319591 309782 301649 295806 290930 285216 278198 270698 263768 258217 254407
53798 254407 251785 249136 245877 242474 239090 234689 228473 221622 216399 213642 212118 210323 207920 205244
53784 205244 202419 199616 197564 196992 197549 197741 196209 193022 189673 187714 187330 187228 185900 183031 179955
53769 179955 178898 181335 186409 190934 191738 188459 183701 180326 179085 178958 178944 178856 178944 179511 180718 182317
53753 182317 183758 184931 186391 188442 190554 192235 193962 196494 199730 203145 207029 212254 218875 225922
53739 225922 232635 238962 244751 249543 253732 259054 267063 277268 287372 295341 301010 305795 311045 316797
53725 316797 322128 326536 330602 335213 340585 346317 351774 355829 356855 354124 349130 344541 341693 339920
53711 339920 338337 337138 336692 336352 334951 331951 327499 321934 315963 310864 307613 305778 303926 301289 298516
$$ packed form
53812C58666r588r792r706r989r809q133n843m876n714p018p500o930n551l810
53798B54407k622k649l259l403l384m401o216o851n223k757j524j795k403k676
53784B05244k825k803k052n72N57J92j532l187l349j959l84j02j328k869l076
53769A79955j057K437N074M525Q04l279m758l375j241j27j4q8Q8N67J207J599
53753A82317J441J173J460K051K112J681J727K532L236L415L884N225O621P047
53739B25922O713O327N789M792M189N322Q009J0205J0104P969N669M785N250N752
53725C16797N331M408M066M611N372N732N457M055J026k731m994m589k848j773
53711C39920j583j199m46l40j401l000m452n565n971n099l251j835j852k637k773
$$ plain form
53696 298516 296620 295444 293498 289381 283325 277288 273340 271889 271530 270501 268126 264933 261887 259686
53682 259686 258410 257488 256113 253998 251688 249982 249073 248420 247334 245468 242739 239152 235026 231246 228758
53667 228758 227611 226870 225971 225787 227545 230651 232578 231406 227891 224521 223047 223434 224572 225208 224664 223593
53651 223593 223758 226164 229569 231768 232230 232544 234200 236898 239230 240167 239583 238106 236843 236821 238498 242140
53635 242140 248296 256924 266182 273374 277531 280095 282802 285955 289242 292897 297106 301150 304215 306460
53621 306460 308417 309973 310910 311929 314037 317167 320284 322602 323893 323934 322742 321172 320230 319696 318361
53606 318361 315846 313302 312022 312067 312700 313524 314628 315894 316664 316202 314399 312069 310430 310059 310383 310431 309992
53589 309992 309714 310142 311067 311963 312718 313699 315139 316715 317939 318968 320631 323194 325422 325713 324260 323137
$$ packed form
53696B98516j896j176j946m117o056o037l948j451l59j029k375l193l046k201
53682B59686j276r22j375k115k310j706r09o53j086j866k729l587m126l780k488
53667B28758j147p41q99j84J758L106J927j172l515l370j474L87J138O36n44j071
53651B23593J65K406L405K199M62L14J656K698K332R37n84j477j263k2J677L642
53635B42140O156Q628R258P192M157K564K707L153L287L655M209M044L065K245
53621C06460J957J556R37J019K108L130L117K318J291M1j192j570r42n34j335
53606C18361k515k544j280M5O33Q24J104J266P70m62j803k330j639l71L24M8m39
53589C09992k78M28R25Q96P55R81J440J576J224J029J663K563K228K91j453j123
$$ plain form
53573 323137 323755 325212 325927 326031 326935 329045 331267 332715 333642 334623 336071 338781 343583 349794 355168 358353
53557 358353 360596 364034 368896 373494 376588 378683 380911 383662 386597 389327 391746 394010 396449 399300
53543 399300 402608 406695 412424 420327 429398 437539 443545 448120 452633 457500 462240 466485 470210 473383
53529 473383 476262 479821 484950 491142 496840 501215 504825 508325 511624 514843 519000 524637 530384 534113
53515 534113 535353 535588 536360 538088 540705 544127 547740 550512 552164 553378 554278 553782 551365 548710 548251
53500 548251 550227 552301 552312 550612 549329 549914 551807 553229 552947 551369 550078 550397 552469 555655 559406
53485 559406 563364 566959 569599 571491 573805 577562 582339 586403 588432 589124 590775 595089 601597 608646
53471 608646 615663 623680 633560 644560 655148 664698 673712 682780 692006 701375 711059 721348 732616
$$ packed form
53573C23137O18J457P15J04R04K110K222J448R27R81J448K710M802O211N374L185
53557C58353K243L438M862M598L094K095K228K751K935K730K419K264K439K851
53543C99300L308M087N729P903R071Q141O006M575M513M867M740M245L725L173
53529D73383K879L559N129O192N698M375L610L500L299L219M157N637N747L729
53515E34113J240K35P72J728K617L422L613K772J652J214R00m96k417k655m59
53500E48251J976K074J1j700j283N85J893J422k82j578j291L19K072L186L751
53485E59406L958L595K640J892K314L757M777M064K029O92J651M314O508P049
53471F08646P017Q017R880J1000J0588R550R014R068R226R369R684J0289J1268
$$ plain form
53458 732616 745344 759874 776221 794217 813544 833361 852451 870297 887758 906079 925476
53447 925476 945261 965080 985345 1006720 1029942 1055872 1084655 1114906 1144869 1174556 1205510
53436 1205510 1238112 1270563 1301526 1332504 1366023 1402082 1438079 1472235 1505450 1539330 1573871
53425 1573871 1608050 1641621 1674970 1707661 1738563 1767629 1796548 1827113 1859503 1892429 1924363
53414 1924363 1954217 1981516 2006759 2031474 2057287 2084765 2113309 2141845 2169243 2194488 2217292
53403 2217292 2238523 2259318 2279605 2298043 2313475 2325793 2335332 2342243 2346805 2349518 2350255 2347818 2341054
53390 2341054 2330216 2316916 2302998 2289517 2276136 2261142 2242753 2221090 2198345 2176483 2155494
53379 2155494 2134520 2113633 2093241 2072410 2049579 2024861 2000121 1976562 1953640 1930746 1908490
$$ packed form
53458G32616J2728J4530J6347J7996J9327J9817J9090J7846J7461J8321J9397
53447I25476J9785J9819K0265K1375K3222K5930K8783L0251K9963K9687L0954
53436A205510L2602L2451L0963L0978L3519L6059L5997L4156L3215L3880L4541
53425A573871L4179L3571L3349L2691L0902K9066K8919L0565L2390L2926L1934
53414A924363K9854K7299K5243K4715K5813K7478K8544K8536K7398K5245K2804
53403B217292K1231K0795K0287J8438J5432J2318R539O911M562K713P37k437o764
53390B341054j0838j3300j3918j3481j3381j4994j8389k1663k2745k1862k0989
53379B155494k0974k0887k0392k0831k2831k4718k4740k3559k2922k2894k2256
$$ plain form
53368 1908490 1887577 1867699 1848548 1831023 1816328 1804471 1794597 1786255 1779400 1773669 1768798 1765512
53356 1765512 1764785 1766246 1768429 1770841 1774699 1781202 1790004 1800105 1811584 1825524 1842450 1861636 1882080
53343 1882080 1903566 1926564 1951523 1978669 2008274 2040664 2075722 2112585 2150164 2188176 2227551
53332 2227551 2269746 2315607 2364953 2416964 2470759 2525761 2582111 2640875 2703219 2768904 2836017
53321 2836017 2902841 2969733 3038346 3109111 3180488 3250942 3320503 3389678 3457834 3523835 3587647
53310 3587647 3650028 3710877 3769196 3824615 3877549 3927575 3973038 4012805 4047183 4076494 4100087
53299 4100087 4117696 4130561 4139924 4145135 4144450 4136959 4122487 4100497 4070792 4034945 3995254 3952365
53287 3952365 3905617 3855679 3804883 3754355 3702574 3647725 3590061 3531023 3471419 3411735 3353091
$$ packed form
53368A908490k0913j9878j9151j7525j4695j1857r874q342o855n731m871l286
53356A765512p27J461K183K412L858O503Q802J0101J1479J3940J6926J9186K0444
53343A882080K1486K2998K4959K7146K9605L2390L5058L6863L7579L8012L9375
53332B227551M2195M5861M9346N2011N3795N5002N6350N8764O2344O5685O7113
53321B836017O6824O6892O8613P0765P1377P0454O9561O9175O8156O6001O3812
53310C587647O2381O0849N8319N5419N2934N0026M5463L9767L4378K9311K3593
53299D100087J7609J2865R363N211o85p491j4472k1990k9705l5847l9691m2889
53287C952365m6748m9938n0796n0528n1781n4849n7664n9038n9604n9684n8644
$$ plain form
53276 3353091 3296314 3240698 3185195 3130585 3079073 3031600 2986595 2941552 2895090 2847521 2800224
53265 2800224 2754734 2711810 2671089 2631895 2594205 2558377 2524296 2491591 2460678 2432629 2407697
53254 2407697 2384763 2362688 2341554 2321906 2303203 2283831 2262775 2240700 2219183 2199227 2180767
53243 2180767 2163280 2146312 2129419 2112233 2095131 2079609 2067321 2058557 2052078 2046685 2042605 2041055
53231 2041055 2042687 2046863 2052325 2058374 2065400 2074393 2085865 2099300 2113855 2129549 2147295 2167693
53219 2167693 2190352 2214635 2240517 2268152 2297057 2326309 2355205 2383142 2409200 2432631 2453640
53208 2453640 2472898 2490300 2504966 2516520 2525495 2532259 2536444 2537928 2537603 2536394 2533855 2528422 2518897
53195 2518897 2505304 2488629 2470240 2451306 2432077 2411719 2389197 2364197 2336777 2306621 2273611
$$ packed form
53276C353091n6777n5616n5503n4610n1512m7473m5005m5043m6462m7569m7297
53265B800224m5490m2924m0721l9194l7690l5828l4081l2705l0913k8049k4932
53254B407697k2934k2075k1134j9648j8703j9372k1056k2075k1517j9956j8460
53243B180767j7487j6968j6893j7186j7102j5522j2288q764o479n393m080j550
53231B041055J632M176N462O049P026Q993J1472J3435J4555J5694J7746K0398
53219B167693K2659K4283K5882K7635K8905K9252K8896K7937K6058K3431K1009
53208B453640J9258J7402J4666J1554Q975O764M185J484l25j209k539n433r525
53195B518897j3593j6675j8389j8934j9229k0358k2522k5000k7420l0156l3010
$$ plain form
53184 2273611 2239000 2204900 2172146 2139551 2105867 2071706 2038650 2007048 1975817 1944248 1912898
53173 1912898 1882450 1852667 1822995 1793606 1765222 1738204 1712252 1686844 1661698 1636985 1613208
53162 1613208 1590554 1568316 1545491 1522175 1499669 1478854 1459200 1440109 1422415 1407327 1394230
53151 1394230 1380904 1366023 1350233 1334415 1318132 1300524 1281730 1262438 1242621 1221746 1199958
53140 1199958 1178076 1156474 1134775 1112820 1091272 1070991 1052218 1034564 1017469 1000520 983634
53129 983634 967066 951003 934970 917928 899262 879570 860268 842314 825396 808329 790089
53118 790089 770396 749589 728452 708331 690872 676870 665343 654290 642535 630395 618499
53107 618499 606714 594822 583645 574678 568610 564683 561285 556669 549514 539785 529254 520250 513500
$$ packed form
53184B273611l4611l4100l2754l2595l3684l4161l3056l1602l1231l1569l1350
53173A912898l0448k9783k9672k9389k8384k7018k5952k5408k5146k4713k3777
53162A613208k2654k2238k2825k3316k2506k0815j9654j9091j7694j5088j3097
53151A394230j3326j4881j5790j5818j6283j7608j8794j9292j9817k0875k1788
53140A199958k1882k1602k1699k1955k1548k0281j8773j7654j7095j6949j6886
53129I83634j6568j6063j6033j7042j8666j9692j9302j7954j6918j7067j8240
53118G90089j9693k0807k1137k0121j7459j4002j1527j1053j1755j2140j1896
53107F18499j1785j1892j1177q967o068l927l398m616p155r729j0531r004o750
$$ plain form
53094 513500 507771 502031 497007 493745 491319 487408 481282 474967 470754 468437 465958 462174 457865 454114
53080 454114 450981 448188 445921 444003 441117 436075 429716 424321 421063 419080 417333 416122 415993 416168 415396
53065 415396 414019 413845 415744 418348 419675 419384 418844 419312 420641 421765 421946 421337 420464 419439 417868 415487
53049 415487 412646 409994 407905 406443 405784 406297 408107 410737 413213 414457 413894 412051 410285 409280 407811
53034 407811 403747 396624 388545 382051 377670 374172 370595 366918 362982 358134 352460 347343 343931 341598
53020 341598 338793 335090 331496 328769 326307 323002 318559 313648 309177 305783 303629 302226 300635 298225
53006 298225 295265 292535 290363 288220 285309 281599 278300 277169 278939 282298 284656 284110 280665 275757
52992 275757 271059 267650 265691 264550 263617 263162 263835 265190 265577 264113 261968 260818 260618 259930 258052 255599
$$ packed form
53094E13500n729n740n024l262k426l911o126o315m213k317k479l784m309l751
53080D54114l133k793k267j918k886n042o359n395l258j983j747j211j29J75p72
53065D15396j377j74J899K604J327k91n40M68J329J124J81o09q73j025j571k381
53049D15487k841k652k089j462o59N13J810K630K476J244n63j843j766j005j469
53034D07811m064p123q079o494m381l498l577l677l936m848n674n117l412k333
53020C41598k805l703l594k727k462l305m443m911m471l394k154j403j591k410
53006B98225k960k730k172k143k911l710l299j131J770L359K358n46l445m908
52992B75757m698l409j959j141r33m55O73J355L87j464k145j150k00o88j878k453
$$ plain form
52976 255599 253118 250397 247377 244535 242004 239378 236903 235810 236619 237959 237974 236371 234132 231749 228946
52961 228946 226042 224363 224711 226100 226605 225341 223227 221886 222038 223106 224194 225045 225740 225824 224552 222244
52945 222244 220710 221673 225010 228990 232035 233766 234609 235176 236113 237790 239566 239833 237520 233633 230679
52930 230679 230151 230905 230551 228279 225603 224282 224407 225081 226105 227860 229915 231120 231306 231877 234274 238676
52914 238676 244441 250870 256935 261245 263307 264377 266223 269374 273237 277514 282611 288806 295742 302714
52900 302714 308938 313821 317610 321546 326560 331810 335264 335867 334679 333787 334613 337118 340046 341807 341636
52885 341636 339951 337359 333691 328768 323875 321288 321890 323964 324773 322869 318718 313875 310087 308546 309173
52870 309173 310681 311762 312150 312338 312619 312785 312536 311812 310844 310131 310176 310952 311895 312684 313742 315527 317566
$$ packed form
52976B55599k481k721l020k842k531k626k475j093Q09J340J5j603k239k383k803
52961B28946k904j679L48J389N05j264k114j341J52J068J088Q51O95Q4j272k308
52945B22244j534R63L337L980L045J731Q43N67R37J677J776K67k313l887k954
52930B30679n28P54l54k272k676j321J25O74J024J755K055J205J86N71K397M402
52914B38676N765O429O065M310K062J070J846L151L863M277N097O195O936O972
52900C02714O224M883L789L936N014N250L454O03j188q92Q26K505K928J761j71
52885C41636j685k592l668m923m893k587O02K074Q09j904m151m843l788j541O27
52870C09173J508J081L88J88K81J66k49p24r68p13M5P76R43P89J058J785K039
$$ plain form
52853 317566 318776 318749 318263 318453 319851 322253 325128 327988 330639 333186 335538 337009 336941 335924 335765 337746
52837 337746 341273 344749 347334 349146 350123 349908 349018 348948 350422 352349 353319 353475 353945 354845 355040 353896 352196
52820 352196 351123 351124 352040 353553 355056 355762 355411 354574 354033 354300 355730 358394 361626 364490 367005 369979
52804 369979 373237 375080 374421 372545 371597 372027 372868 374099 377056 382223 388070 392730 395817 397896 399068
52789 399068 399113 398654 399142 401444 404998 408611 411703 414509 417318 419977 422330 424832 428349 433252 438902
52774 438902 444012 447453 448832 448564 447258 444793 440304 433679 426777 422140 420293 419182 416672 412717
52760 412717 408577 404844 401179 397351 393571 390029 386795 383865 380675 376132 369918 363355 358095 354315
52746 354315 351092 348117 345818 343984 341591 338285 335045 332930 331806 330683 328829 326372 324104 322704
$$ packed form
52853C17566J210k7m86J90J398K402K875K860K651K547K352J471o8j017j59J981
52837C37746L527L476K585J812R77k15q90p0J474J927R70J56M70R00J95j144j700
52820C52196j073JR16J513J503P06l51q37n41K67J430K664L232K864K515K974
52804C69979L258J843o59j876r48M30Q41J231K957N167N847M660L087K079J172
52789C99068M5m59M88K302L554L613L092K806K809K659K353K502L517M903N650
52774D38902N110L441J379k68j306k465m489o625o902m637j847j111k510l955
52760D12717m140l733l665l828l780l542l234k930l190m543o214o563n260l780
52746C54315l223k975k299j834k393l306l240k115j124j123j854k457k268j400
$$ plain form
52732 322704 321875 320545 318271 315866 313954 311583 307434 301986 297130 293766 291145 288602 286482 284967
52718 284967 283369 281197 278854 276696 274318 271293 267718 263593 258705 253742 250453 249788 250568 250836 249974
52703 249974 248753 247864 247095 245557 242143 236249 228725 221727 217045 214773 213854 213275 212287 210145 206455
52688 206455 201597 196345 191337 187146 184294 182724 181691 180604 179631 179201 179462 180367 181571 182030 180663
52673 180663 177840 175214 173498 171514 168301 165032 163559 163847 164258 163937 163563 163958 165154 166740 168048
52658 168048 168108 166489 164192 162727 162340 162111 161716 161881 162909 163906 164033 163674 163857 165032 166823 168457 169123
52641 169123 168422 166916 166006 166976 170094 174479 178571 181073 182087 183264 186254 190968 195817 199472 201751
52626 201751 202965 203372 203509 204095 205130 205672 204924 203045 200496 197224 193173 189245 186893 186570 187043 186642
$$ packed form
52732C22704q29j330k274k405j912k371m149n448m856l364k621k543k120j515
52718B84967j598k172k343k158k378l025l575m125m888m963l289o65P80K68q62
52703B49974j221q89p69j538l414n894p524o998m682k272r19n79r88k142l690
52688B06455m858n252n008m191k852j570j033j087r73m30K61R05J204M59j367
52673A80663k823k626j716j984l213l269j473K88M11l21l74L95J196J586J308
52658A68048O0j619k297j465l87k29l95J65J028R97J27l59J83J175J791J634O66
52641A69123p01j506r10R70L118M385M092K502J014J177K990M714M849L655K279
52626B01751J214M07J37N86J035N42p48j879k549l272m051l928k352l23M73m01
$$ plain form
52610 186642 185104 183765 183692 183882 182069 177551 172505 169826 170101 171483 172082 171392 169565 166799 163927 162312
52594 162312 162228 162205 160986 159406 159111 159816 159292 156290 152234 149412 148440 148282 148157 148357 149388 151149 153202
52577 153202 155278 157353 159629 162516 166157 169822 172408 173858 175497 178385 181775 183913 184153 183535 183262
52562 183262 183305 182692 180632 177131 172819 168444 164429 161002 158823 158967 161683 165542 168675 170684 172423
52547 172423 174047 174549 173515 172084 171471 171550 171669 171952 172855 174125 175167 176004 176934 177743 178273 179366 182042
52530 182042 185795 188781 189892 189819 189817 190198 190465 190365 190300 190791 191861 193056 194139 195563 197860 200590 202561
52513 202561 203423 204380 206730 210203 213419 215658 217420 219450 221895 224422 226671 228584 230536 232927 235497
52498 235497 237493 238757 239983 241468 242425 242230 241581 241513 241998 242596 243765 246168 249152 251446 253307 256384
$$ packed form
52610A86642j538j339p3J90j813m518n046k679K75J382N99o90j827k766k872j615
52594A62312q4k3j219j580k95P05n24l002m056k822r72j58j25K00J031J761K053
52577A53202K076K075K276K887L641L665K586J450J639K888L390K138K40o18k73
52562A83262M3o13k060l501m312m375m015l427k179J44K716L859L133K009J739
52547A72423J624N02j034j431o13P9J19K83R03J270J042Q37R30Q09N30J093K676
52530A82042L753K986J111p3kL81K67j00o5M91J070J195J083J424K297K730J971
52513B02561Q62R57K350L473L216K239J762K030K445K527K249J913J952K391K570
52498B35497J996J264J226J485R57j95o49o8M85N98J169K403K984K294J861L077
$$ plain form
52482 256384 261249 266382 270006 271758 272181 271737 270999 270888 271921 273680 275492 277219 279111 281342 283971
52467 283971 286881 289550 291338 292083 292112 291733 291246 291225 292006 292933 292851 291388 289093 286569 284357 283461 284640
52450 284640 287067 288913 289638 290550 292698 295454 297783 299737 301719 303155 303037 301418 299485 298323 298088
52435 298088 298120 297408 295258 291945 288526 285817 283921 282850 283022 284784 287869 291548 295030 297732 299699
52420 299699 301707 304283 306666 307590 307149 306871 307638 308576 308427 307236 306255 306910 310097 315560 321484 325593
52404 325593 327144 327204 326895 326466 326215 326755 327715 327654 326243 325237 326182 328375 330300 331922 333995 336053 336792
52387 336792 336093 335152 334860 335213 335934 336492 335981 334340 333326 334813 338124 340440 339946 337420 334696 332806
52371 332806 331921 332015 333024 334859 337478 340450 342610 342870 341370 339247 337408 335984 334651 332804 329901
$$ packed form
52482B56384M865N133L624J752M23m44p38j11J033J759J812J727J892K231K629
52467B83971K910K669J788P45K9l79m87k1P81R27q2j463k295k524k212q96J179
52450B84640K427J846P25R12K148K756K329J954J982J436j18j619j933j162k35
52435B98088L2p12k150l313l419k709j896j071J72J762L085L679L482K702J967
52420B99699K008K576K383R24m41k78P67R38j49j191r81O55L187N463N924M109
52404C25593J551O0l09m29k51N40R60o1j411j006R45K193J925J622K073K058P39
52387C36792o99r41k92L53P21N58n11j641j014J487L311K316m94k526k724j890
52371C32806q85R4J009J835K619K972K160K60j500k123j839j424j333j847k903
$$ plain form
52356 329901 326526 324589 325363 327659 329104 328939 328292 328005 327726 327208 326852 326544 325436 323474 321880 321416
52340 321416 321340 320868 320603 321511 323266 324692 325400 326091 327429 329330 331300 332964 334351 335936 338211 340928
52324 340928 342980 343338 342062 340399 339975 341689 344966 348063 349503 349270 348519 348566 350466 354772 360598 365434
52308 365434 367303 367193 367974 370730 373589 374688 374843 376264 379766 384497 389656 395104 400526 405206 408851
52293 408851 411950 415206 418966 423236 427873 432764 437861 442896 447139 449952 451764 453919 457327 461804
52279 461804 466905 472539 478340 483331 487026 490210 493821 497613 500872 503955 507974 513078 518241 522874
52265 522874 527582 533026 538964 545033 551771 559969 569230 578055 585680 593262 602693 614267 626162 636527
52251 636527 645636 655432 667319 681155 696259 712259 728618 744408 759383 774622 791196 808760
$$ packed form
52356C29901l375j937P74K296J445j65o47k87k79n18l56l08j108j962j594m64
52340C21416p6m72k65R08J755J426P08O91J338J901J970J664J387J585K275K717
52324C40928K052L58j276j663m24J714L277L097J440k33p51M7J900M306N826M836
52308C65434J869j10P81K756K859J099J55J421L502M731N159N448N422M680L645
52293D08851L099L256L760M270M637M891N097N035M243K813J812K155L408M477
52279D61804N101N634N801M991L695L184L611L792L259L083M019N104N163M633
52265E22874M708N444N938O069O738Q198R261Q825P625P582R431J1574J1895J0365
52251F36527R109R796J1887J3836J5104J6000J6359J5790J4975J5239J6574J7564
$$ plain form
52239 808760 826405 844595 864995 888226 912791 936768 959944 983725 1009280 1036350 1063902
52228 1063902 1091533 1119926 1149856 1181052 1212352 1242987 1273237 1303725 1334588 1365703 1397219
52217 1397219 1429204 1461011 1491639 1520706 1548533 1575289 1600555 1623830 1645106 1664842 1683527
52206 1683527 1701210 1717248 1730796 1741902 1751844 1761804 1771336 1778689 1782587 1783208 1781628 1779110 1776893
52193 1776893 1775720 1775142 1773930 1771595 1768954 1766897 1765282 1763627 1762344 1762603 1765277 1770614 1778667 1789283
52179 1789283 1801658 1814553 1827214 1839903 1853615 1869506 1888292 1909597 1931943 1953903 1975304
52168 1975304 1996783 2018263 2038681 2057481 2075601 2094336 2113569 2131775 2147552 2160566 2171112
52157 2171112 2179427 2185711 2190427 2194140 2196983 2198304 2196833 2191485 2182295 2170495 2157389 2143237 2127470
$$ packed form
52239H08760J7645J8190K0400K3231K4565K3977K3176K3781K5555K7070K7552
52228A063902K7631K8393K9930L1196L1300L0635L0250L0488L0863L1115L1516
52217A397219L1985L1807L0628K9067K7827K6756K5266K3275K1276J9736J8685
52206A683527J7683J6038J3548J1106R942R960R532P353L898O21j580k518k217
52193A776893j173n78j212k335k641k057j615j655j283K59K674N337Q053J0616
52179A789283J2375J2895J2661J2689J3712J5891J8786K1305K2346K1960K1401
52168A975304K1479K1480K0418J8800J8120J8735J9233J8206J5777J3014J0546
52157B171112Q315O284M716L713K843J321j471n348r190j1800j3106j4152j5767
$$ plain form
52144 2127470 2109802 2090562 2070074 2048575 2027068 2007411 1990694 1975719 1959920 1941927 1922755
52133 1922755 1904470 1888239 1873882 1860746 1848410 1836661 1825290 1814163 1803375 1793201 1783904
52122 1783904 1775688 1768820 1763576 1759827 1756673 1752788 1747326 1740442 1732894 1725307 1717877 1710511 1703003 1695286
52108 1695286 1687713 1680926 1675198 1670097 1665060 1660026 1655062 1649643 1642854 1634447 1625254 1616486 1608891 1602592
52094 1602592 1597262 1592322 1587292 1582139 1577098 1572239 1567483 1562875 1558314 1553088 1546377 1538355 1530168 1522598
52080 1522598 1515453 1508573 1502497 1497407 1492117 1485232 1477155 1469957 1465151 1462255 1459629 1455941 1450653 1443925
52066 1443925 1436670 1430180 1425021 1420457 1415442 1410068 1405525 1402725 1401509 1401247 1401552 1401971 1401567 1399706 1397270
52051 1397270 1396397 1398544 1403227 1409043 1415571 1423587 1433485 1444311 1454902 1465703 1478880 1496445 1518444
$$ packed form
52144B127470j7668j9240k0488k1499k1507j9657j6717j4975j5799j7993j9172
52133A922755j8285j6231j4357j3136j2336j1749j1371j1127j0788j0174r297
52122A783904q216o868n244l749l154l885n462o884p548p587p430p366p508p717
52108A695286p573o787n728n101n037n034m964n419o789q407r193q768p595o299
52094A602592n330m940n030n153n041m859m756m608m561n226o711q022q187p570
52080A522598p145o880o076n090n290o885q077p198m806k896k626l688n288o728
52066A443925p255o490n159m564n015n374m543k800j216k62L05M19m04j861k436
52051A397270q73K147M683N816O528Q016R898J0826J0591J0801J3177J7565K1999
$$ plain form
52038 1518444 1543128 1568771 1595031 1622382 1650701 1679158 1707693 1737824 1771262 1808037 1846674
52027 1846674 1886049 1926249 1967534 2009280 2050364 2090080 2128357 2165445 2201578 2236512 2269235
52016 2269235 2298684 2324939 2349099 2371667 2391780 2408504 2422122 2433488 2442726 2449411 2453510 2455275
52004 2455275 2454638 2451645 2447056 2441363 2433540 2422184 2407930 2393228 2379287 2364730 2348120 2330561
51992 2330561 2314471 2300594 2287683 2274844 2262789 2252619 2244536 2238157 2233226 2229499 2226506 2224080
51980 2224080 2222741 2223047 2224712 2226848 2229048 2231849 2236045 2241773 2248378 2255093 2261759 2268927 2277238 2286586
51966 2286586 2295932 2304105 2310855 2316889 2322707 2327581 2330130 2329856 2327622 2324398 2320002 2313612 2305136 2295307
51952 2295307 2284397 2271629 2256188 2238240 2218518 2197387 2174797 2150664 2124679 2096098 2064462
$$ packed form
52038A518444K4684K5643K6260K7351K8319K8457K8535L0131L3438L6775L8637
52027A846674L9375M0200M1285M1746M1084L9716L8277L7088L6133L4934L2723
52016B269235K9449K6255K4160K2568K0113J6724J3618J1366R238O685M099J765
52004B455275o37k993m589n693p823j1356j4254j4702j3941j4557j6610j7559
51992B330561j6090j3877j2911j2839j2055j0170q083o379m931l727k993k426
51980B224080j339L06J665K136K200K801M196N728O605O715O666P168Q311R348
51966B286586R346Q173O750O034N818M874K549k74k234l224m396o390q476r829
51952B295307j0910j2768j5441j7948j9722k1131k2590k4133k5985k8581l1636
$$ plain form
51941 2064462 2030356 1994692 1957461 1918178 1877485 1836950 1796756 1754808 1709228 1660947 1612717
51930 1612717 1566191 1521288 1478007 1437014 1398084 1359502 1319904 1279608 1239293 1198454 1156421
51919 1156421 1114192 1073871 1036451 1001384 968084 936522 906263 876382 846982 819636 795493
51908 795493 773697 752466 731027 709704 688779 668378 649183 632081 617046 603231 590307
51897 590307 578857 569202 560579 551882 542672 533146 523686 514882 507477 501618 496328 490241 482844 474761
51883 474761 466976 460082 454127 448800 443777 439144 435405 432816 430884 428840 426397 423622 420285 415984
51869 415984 410847 405462 399990 394166 388492 384480 382964 382717 381700 379447 377276 376107 375053 372533
51855 372533 368092 362698 357647 353599 350445 347766 345561 344472 344937 346116 346232 344173 340199 335014 329071
$$ packed form
51941B064462l4106l5664l7231l9283m0693m0535m0194m1948m5580m8281m8230
51930A612717m6526m4903m3281m0993l8930l8582l9598m0296m0315m0839m2033
51919A156421m2229m0321l7420l5067l3300l1562l0259k9881k9400k7346k4143
51908G95493k1796k1231k1439k1323k0925k0401j9195j7102j5035j3815j2924
51897E90307j1450r655q623q697r210r526r460q804p405n859n290o087p397q083
51883D74761p785o894n955n327n023m633l739k589j932k044k443k775l337m301
51869D15984n137n385n472n824n674m012j516k47j017k253k171j169j054k520
51855C72533m441n394n051m048l154k679k205j089M65J179J16k059l974n185n943
$$ plain form
51840 329071 323209 318868 316601 315031 312422 308841 305618 303059 300241 297062 294769 293828 292847 290630 288106
51825 288106 286775 286071 283921 279752 275398 272784 271949 271855 272005 272432 272810 272647 272169 272133 272646 272868 272114 270749
51807 270749 269610 268914 268250 267429 266744 266332 265897 265424 265737 267777 271408 275380 278511 280605 282262 284108
51791 284108 286279 288364 289879 291041 293007 296858 302239 307369 310561 311504 311026 310037 308932 307799 306893
51776 306893 306848 308234 310729 313057 314243 314739 315681 317135 317921 317208 315444 313568 312286 312434 314751 318470
51760 318470 321218 321496 320548 320564 321689 322288 321735 321201 321562 322215 322508 322846 323449 323266 321381 318779 317452
51743 317452 318019 319261 319855 319584 318853 317962 317157 316676 316428 316146 316152 317336 319902 322578 323668 322796 321147
51726 321147 320191 320639 322427 324894 326809 326993 325511 323787 323096 323346 323890 324957 327197 330017 331724 331692
$$ packed form
51840C29071n862m341k267j570k609l581l223k559k818l179k293r41r81k217k524
51825B88106j331p04k150m169m354k614q35r4J50M27L78j63m78l6N13K22p54j365
51807B70749j139o96o64q21o85m12m35m73L13K040L631L972L131K094J657J846
51791B84108K171K085J515J162J966L851N381N130L192R43m78r89j105j133r06
51776C06893m5J386K495K328J186M96R42J454P86p13j764j876j282J48K317L719
51760C18470K748K78r48J6J125N99n53n34L61O53K93L38O03j83j885k602j327
51743C17452N67J242N94k71p31q91q05m81k48k82OJ184K566K676J090q72j649
51726C21147r56M48J788K467J915J84j482j724o91K50N44J067K240K820J707l2
$$ plain form
51710 331692 331294 331915 333006 333165 332542 332790 334613 336597 336999 335884 334929 335626 338243 342152 346339 349615
51694 349615 351161 351512 352620 356234 362022 367813 372008 375324 379671 385804 392868 400007 407354 415254
51680 415254 423612 432449 442100 452122 460821 466852 470712 473710 475981 476668 475838 474986 475511 477509 480095
51665 480095 482137 482818 482363 482162 483123 483973 482469 478580 475161 474827 477212 480028 481806 482705 483431 484544
51649 484544 486405 488751 490412 490252 488359 485805 483450 481515 480008 478801 477468 475703 473871 472549
51635 472549 471622 470445 468895 467591 467061 467340 468507 470976 474879 479637 484550 489604 495461 502790 511733
51620 511733 521747 531744 540569 547687 553360 557954 561030 561317 557802 550957 542820 535767 531039 528289
51606 528289 526251 523723 520198 516169 512915 511649 512588 515009 518176 521718 524971 526709 526195 524182 522102
$$ packed form
51710C31692l98O21J091J59o23K48J823J984M02j115r55O97K617L909M187L276
51694C49615J546L51J108L614N788N791M195L316M347O133P064P139P347P900
51680D15254Q358Q837R651J0022Q699O031L860K998K271O87q30q52N25J998K586
51665D80095K042O81m55k01R61Q50j504l889l419l34K385K816J778Q99P26J113
51649D84544J861K346J661j60j893k554k355j935j507j207j333j765j832j322
51635D72549r27j177j550j304n30K79J167K469L903M758M913N054N857P329Q943
51620E11733J0014R997Q825P118N673M594L076K87l515o845q137p053m728k750
51606E28289k038k528l525m029l254j266R39K421L167L542L253J738n14k013k080
$$ plain form
51591 522102 520318 517792 513548 507832 501581 495265 488704 481746 474692 468115 462519 458106 454524 450832
51577 450832 446011 439775 432931 426839 422423 419620 417641 415697 413501 411306 409539 408352 407393 405998
51563 405998 403656 400310 396238 391809 387383 383235 379452 376079 373450 372023 371614 371266 370387 369678 370189
51548 370189 371648 372608 372345 371638 371347 371119 370147 368526 367067 366188 365766 365781 366418 367693 369533 372022 375010
51531 375010 377869 380288 382990 386758 391047 394588 397293 400312 403985 407072 408710 409982 412526 416371
51517 416371 420361 424193 428603 433548 437575 439542 440075 440715 442151 443858 444948 444663 442411 438254 433540
51502 433540 430353 429897 431600 433917 435650 436382 436191 435579 435491 436723 439071 441434 443044 444377 446581 450118
51486 450118 454232 457802 460566 463431 467494 472705 477607 480576 481387 481364 481975 483572 485590 487568 489544
$$ packed form
51591E22102j784k526m244n716o251o316o561o958p054o577n596m413l582l692
51577D50832m821o236o844o092m416k803j979j944k196k195j767j187r59j395
51563D05998k342l346m072m429m426m148l783l373k629j427m09l48q79p09N11
51548C70189J459R60k63p07k91k28r72j621j459q79m22J5O37J275J840K489K988
51531C75010K859K419K702L768M289L541K705L019L673L087J638J272K544L845
51517D16371L990L832M410M945M027J967N33O40J436J707J090k85k252m157m714
51502D33540l187m56J703K317J733P32j91o12q8J232K348K363J610J333K204L537
51486D50118M114L570K764K865M063N211M902K969Q11k3O11J597K018J978J976
$$ plain form
51471 489544 491660 493841 495914 497658 498695 498745 498228 498264 499673 502095 504459 506233 507856 509885 512116
51456 512116 513808 514419 513769 511719 508285 504128 500404 497803 496016 494292 492172 489381 485448 480012 473458
51441 473458 466738 460631 455516 451705 449414 448272 447460 446562 445863 445540 445012 443538 441256 439268 438698 439855
51425 439855 442081 444234 445396 445455 445106 445238 446232 447651 448500 448095 447073 447338 450453 456015 462061 467116
51409 467116 471294 475423 479906 484780 490171 496076 502162 508234 514463 520732 526308 530811 534942 539491
51395 539491 544036 547523 549911 552324 555603 559538 563581 567471 571001 573943 576496 579157 581809 583501
51381 583501 583512 582200 580498 579024 578039 577772 578180 578564 578023 576457 574873 574401 574965 575046 573123 569392 565691
51364 565691 563374 561616 558362 552665 545457 538228 531829 526621 522780 519849 516677 512499 507845 503929
$$ packed form
51471D89544K116K181K073J744J037N0n17L6J409K422K364J774J623K029K231
51456E12116J692O11o50k050l434m157l724k601j787j724k120k791l933n436o554
51441D73458o720o107n115l811k291j142q12q98o99l23n28j474k282j988n70J157
51425D39855K226K153J162N9l49J32R94J419Q49m05j022K65L115N562O046N055
51409D67116M178M129M483M874N391N905O086O072O229O269N576M503M131M549
51395E39491M545L487K388K413L279L935M043L890L530K942K553K661K652J692
51381E83501J1j312j702j474r85k67M08L84n41j566j584m72N64Q1j923l731l701
51364E65691k317j758l254n697p208p229o399n208l841k931l172m178m654l916
$$ plain form
51350 503929 501329 499626 498151 496604 494943 492978 490264 486563 482482 479343 478030 478088 478539 479302 480925
51335 480925 482931 483646 482325 480458 480057 481274 482576 482690 481261 478033 472804 466425 460742 456969 454620
51320 454620 452278 448884 444148 438424 432517 427119 422110 416774 410804 404551 398195 391368 383871 376075
51306 376075 368285 360494 353201 347496 343524 339765 334990 330246 327428 326279 324531 321168 317678 315316
51292 315316 312912 308808 303801 300327 299140 298456 296463 293331 290451 288912 289207 291445 295094 299043 302295
51277 302295 304225 304181 301850 298517 296836 298364 301878 304968 306799 308305 310069 311270 310931 309205 307115
51262 307115 305621 305287 306295 308368 310831 312961 314267 314812 315611 318328 323646 329944 334475 336204 336743
51247 336743 338092 340160 341135 339794 336656 333054 329824 327051 324567 322298 320135 317732 314656 310847
$$ packed form
51350E03929k600j703j475j547j661j965k714l701m081l139j313N8M51P63J623
51335D80925K006P15j321j867m01J217J302J14j429l228n229o379n683l773k349
51320D54620k342l394m736n724n907n398n009n336n970o253o356o827p497p796
51306C76075p790p791p293n705l972l759m775m744k818j149j748l363l490k362
51292C15316k404m104n007l474j187o84j993l132k880j539K95K238L649L949L252
51277C02295J930m4k331l333j681J528L514L090J831J506J764J201l39j726k090
51262C07115j494l34J008K073K463K130J306N45P99K717N318O298M531J729N39
51247C36743J349K068R75j341l138l602l230k773k484k269k163k403l076l809
$$ plain form
51233 310847 306794 303006 299501 296110 293147 291170 290000 288604 286273 283375 280613 278016 275227 272399
51219 272399 270155 268690 267429 265646 263180 260512 258391 257284 256991 256798 256162 255088 253768 252126 250044
51204 250044 247813 246020 245073 245002 245449 245616 244593 242301 239942 238960 239664 241289 243100 244683 245289 244101
51188 244101 241591 239750 240137 242190 244167 245278 245984 246491 246208 245015 243942 243764 243671 242398 240452 240012
51172 240012 242324 246050 248774 249497 248993 248248 247654 247648 248962 251569 254107 255201 255139 255451 256889 258573 259375
51155 259375 259377 259450 259940 260601 261614 263593 266312 268327 268658 268295 269131 271597 274296 276021 277105 278335 279425
51138 279425 279415 278187 276806 276428 277295 278690 279537 279292 278556 278410 278850 278476 276386 273738 272490 273052 274272
51121 274272 275421 276769 278159 278564 277639 276508 276221 276392 276047 274994 273531 271684 269669 268418 268496 268871
$$ packed form
51233C10847m053l788l505l391k963j977j170j396k331k898k762k597k789k828
51219B72399k244j465j261j783k466k668k121j107k93j93o36j074j320j642k082
51204B50044k231j793r47p1M47J67j023k292k359r82P04J625J811J583O06j188
51188B44101k510j841L87K053J977J111P06N07k83j193j073j78r3j273j946m40
51172B40012K312L726K724P23n04p45n94oJ314K607K538J094o2L12J438J684Q02
51155B59375KP3M90O61J013J979K719K015L31l63Q36K466K699J725J084J230J090
51138B79425j0j228j381l78Q67J395Q47k45p36j46M40l74k090k648j248N62J220
51121B74272J149J348J390M05r25j131k87J71l45j053j463j847k015j251P8L75
$$ plain form
51105 268871 267849 265097 261898 259538 258230 257453 256489 254693 252120 249948 249503 250641 251738 251421 249743
51090 249743 247541 245309 243050 240736 238420 236072 233581 231007 228798 227747 228362 230123 231689 232235 232313
51075 232313 233025 234666 236692 238655 240522 242202 243461 244280 244779 244890 244648 244508 244720 244652 243617 242245
51059 242245 241949 242956 243936 243919 243603 244225 245903 247678 248610 248366 247267 246194 245987 246583 247215 247660 248553
51042 248553 250159 251793 253020 254520 256842 259098 260047 260026 260642 262764 265915 269537 273668 278085 281822
51027 281822 284047 284707 284052 282267 280094 279009 279891 281863 283253 283613 283950 284962 285996 286317 286604 288129
51011 288129 290640 292333 292266 291794 292793 295237 297637 299303 300760 302052 302221 300976 299542 299026 299078 299046 299438
50994 299438 301033 303271 304865 305568 306070 306565 306839 307574 309888 313249 315457 315443 314888 316149 319479 323253
$$ packed form
51105B68871j022k752l199k360j308p77r64j796k573k172m45J138J097l17j678
51090B49743k202k232k259k314k316k348k491k574k209j051O15J761J566N46P8
51075B32313P12J641K026J963J867J680J259Q19M99J11k42j40K12o8j035j372
51059B42245k96J007R80j7l16O22J678J775R32k44j099j073k07N96O32M45Q93
51042B48553J606J634J227J500K322K256R49k1O16K122L151L622M131M417L737
51027B81822K225O60o55j785k173j085Q82J972J390L60L37J012J034L21K87J525
51011B88129K511J693o7m72R99K444K400J666J457J292J69j245j434n16N2l2L92
50994B99438J595K238J594P03N02M95K74P35K314L361K208j4n55J261L330L774
$$ plain form
50978 323253 326253 328583 330665 332416 333596 334322 334946 335661 336324 336647 336716 337264 338972 341420 343314 344187
50962 344187 345301 348324 353496 359628 365498 370501 374241 376520 377826 379058 380443 381355 381571 382099 384246
50947 384246 388235 393317 399017 405631 413406 421847 430222 438437 446991 456130 465498 474742 484121 494254
50933 494254 505434 517436 529899 542732 556408 572206 591810 615823 642492 668598 692180
50922 692180 714144 736982 762354 790359 820653 853409 889072 927751 969146 1012978 1059539
50911 1059539 1110025 1166043 1228345 1296202 1368525 1445476 1528286 1617440 1711815 1809892 1911070
50900 1911070 2015332 2122242 2231026 2341157 2451943 2561661 2668011 2769572 2865960 2956202
50890 2956202 3037722 3107660 3164882 3210099 3244309 3267988 3281834 3287404 3286257 3278803 3264710 3244567
$$ packed form
50978C23253L000K330K082J751J180P26O24P15O63L23O9N48J708K448J894Q73
50962C44187J114L023N172O132N870N003L740K279J306J232J385R12K16N28K147
50947C84246L989N082N700O614P775Q441Q375Q215Q554R139R368R244R379J0133
50933D94254J1180J2002J2463J2833J3676J5798J9604K4013K6669K6106K3582
50922F92180K1964K2838K5372K8005L0294L2756L5663L8679M1395M3832M6561
50911A059539N0486N6018O2302O7857P2323P6951Q2810Q9154R4375R8077J01178
50900A911070J04262J06910J08784J10131J10786J09718J06350J01561R6388R0242
50890B956202Q1520O9938N7222M5217L4210K3679J3846N570j147p454j4093k0143
$$ plain form
50878 3244567 3220586 3195351 3170190 3145078 3119850 3094796 3069838 3043619 3014012 2979643 2940649
50867 2940649 2897861 2851395 2800138 2742503 2677583 2605614 2527469 2443929 2355647 2263858 2170710
50856 2170710 2078438 1988230 1900279 1814939 1733323 1656550 1584846 1517827 1455358 1397718 1345197
50845 1345197 1297980 1256127 1218996 1184956 1152633 1122598 1096871 1076423 1060004 1045872 1033711
50834 1033711 1024039 1016557 1010300 1004930 1000700 997398 994740 993841 996803 1004170 1013830 1023113 1031242 1039250
50820 1039250 1048457 1059850 1074117 1091172 1109960 1129604 1150422 1173156 1197660 1223362 1250694
50809 1250694 1280966 1314760 1351404 1390187 1431306 1475495 1523454 1575842 1633050 1694823 1760888
50798 1760888 1832302 1911375 1999734 2096864 2201065 2311514 2429225 2556444 2695575 2848297
$$ packed form
50878C244567k3981k5235k5161k5112k5228k5054k4958k6219k9607l4369l8994
50867B940649m2788m6466n1257n7635o4920p1969p8145q3540q8282r1789r3148
50856B170710r2272r0208q7951q5340q1616p6773p1704o7019o2469n7640n2521
50845A345197m7217m1853l7131l4040l2323l0035k5727k0448j6419j4132j2161
50834A033711r672p482o257n370m230l302k658q99K962P367R660R283Q129Q008
50820A039250R207J1393J4267J7055J8788J9644K0818K2734K4504K5702K7332
50809A250694L0272L3794L6644L8783M1119M4189M7959N2388N7208O1773O6065
50798A760888P1414P9073Q8359R7130J04201J10449J17711J27219J39131J52722
$$ plain form
50788 2848297 3015157 3195868 3389809 3596004 3812914 4039037 4273650 4516057 4763822
50779 4763822 5012680 5258607 5499014 5731180 5950373 6150614 6326906 6475960 6595405
50770 6595405 6683705 6741117 6769897 6773353 6755139 6719270 6670008 6611454 6547560 6482193 6418361
50759 6418361 6357248 6298697 6242778 6190282 6141435 6094422 6045220 5988428 5918550 5831532 5725856
50748 5725856 5602159 5461774 5305767 5135064 4950864 4754932 4549994 4339801 4128141
50739 4128141 3917740 3710679 3509656 3317813 3137070 2967583 2809179 2662367 2527445
50730 2527445 2403641 2290037 2186647 2093626 2010012 1934359 1866241 1805945 1752844 1705389 1662970
50719 1662970 1626518 1596480 1571095 1547700 1525379 1505267 1488174 1472740 1456466 1438187 1419067
$$ packed form
50788B848297J66860J80711J93941K06195K16910K26123K34613K42407K47765
50779D763822K48858K45927K40407K32166K19193K00241J76292J49054J19445
50770F595405Q8300N7412K8780L456j8214l5869m9262n8554o3894o5367o3832
50759F418361o1113n8551n5919n2496m8847m7013m9202n6792o9878q7018j05676
50748E725856j23697j40385j56007j70703j84200j95932k04938k10193k11660
50739D128141k10401k07061k01023j91843j80743j69487j58404j46812j34922
50730B527445j23804j13604j03390r3021q3614p5653o8118o0296n3101m7455m2419
50719A662970l6452l0038k5385k3395k2321k0112j7093j5434j6274j8279j9120
$$ plain form
50708 1419067 1401360 1386727 1375735 1368301 1364014 1362136 1361869 1362830 1365017 1368269 1372067 1376099 1380852 1387386
50694 1387386 1396635 1409007 1424619 1443681 1466599 1493693 1524841 1559455 1596834 1636501 1678378
50683 1678378 1723071 1772127 1827377 1889339 1956461 2026530 2098741 2173918 2253097 2336865 2426024
50672 2426024 2521581 2623466 2730164 2840391 2954579 3074076 3199401 3329844 3464041 3599925
50662 3599925 3734483 3864704 3988777 4105627 4213274 4308451 4387899 4449287 4490818 4511056
50652 4511056 4509904 4489423 4453051 4404082 4345268 4279727 4211647 4145435 4083903 4027527 3975807
50641 3975807 3929150 3888658 3853973 3822304 3790249 3755882 3718114 3674634 3621925 3557492 3481015
50630 3481015 3393137 3294161 3184602 3066321 2942424 2816389 2691485 2570406 2454690 2344631
$$ packed form
50708A419067j7707j4633j0992p434m287j878k67R61K187L252L798M032M753O534
50694A387386R249J2372J5612J9062K2918K7094L1148L4614L7379L9667M1877
50683A678378M4693M9056N5250O1962O7122P0069P2211P5177P9179Q3768Q9159
50672B426024R5557J01885J06698J10227J14188J19497J25325J30443J34197J35884
50662C599925J34558J30221J24073J16850J07647R5177P9448O1388M1531K0238
50652D511056j152k0481l6372m8969n8814o5541o8080o6212o1532n6376n1720
50641C975807m6657m0492l4685l1669l2055l4367l7768m3480n2709o4433p6477
50630C481015q7878r8976j09559j18281j23897j26035j24904j21079j15716j10059
$$ plain form
50620 2344631 2240201 2142023 2051388 1969549 1897065 1833412 1777117 1726701 1681721 1642463 1608640
50609 1608640 1579186 1553636 1532821 1517469 1506829 1499524 1495291 1494775 1497933 1503887 1512526 1525082 1542469
50596 1542469 1563784 1587137 1611566 1637502 1665705 1696421 1729739 1766208 1806836 1852467 1903142
50585 1903142 1958017 2016147 2077626 2143831 2216144 2294371 2376750 2461684 2549188 2640349 2735451
50574 2735451 2832924 2930160 3025168 3117329 3206630 3292282 3372223 3444012 3506118 3558134 3599853
50563 3599853 3630731 3650615 3660575 3662313 3656801 3644075 3624407 3599044 3569713 3538149 3506353 3476424
50551 3476424 3449372 3424758 3402315 3383381 3369684 3361017 3355362 3351315 3349098 3348829 3349095 3348014 3344669
50538 3344669 3338304 3326710 3306771 3276731 3237051 3188932 3132735 3068070 2994780 2913551 2826118
$$ packed form
50620B344631j04430r8178r0635q1839p2484o3653n6295n0416m4980l9258l3823
50609A608640k9454k5550k0815j5352j0640p305m233n16L158N954Q639J2556J7387
50596A542469K1315K3353K4429K5936K8203L0716L3318L6469M0628M5631N0675
50585A903142N4875N8130O1479O6205P2313P8227Q2379Q4934Q7504R1161R5102
50574B735451R7473R7236R5008R2161Q9301Q5652P9941P1789O2106N2016M1719
50563C599853L0878J9884R960J738n512j2726j9668k5363k9331l1564l1796k9929
50551C476424k7052k4614k2443j8934j3697q667n655m047k217k69K66j081l345
50538C344669o365j1594j9939l0040l9680m8119n6197o4665p3290q1229q7433
$$ plain form
50527 2826118 2735275 2644095 2554479 2466558 2379962 2295575 2215477 2141148 2072313 2007897 1947597
50516 1947597 1891863 1840593 1792853 1748341 1708460 1675138 1648690 1627522 1610046 1596212 1586897
50505 1586897 1582293 1581507 1583533 1588099 1595552 1606409 1621284 1640737 1664598 1691372 1718946 1746344
50493 1746344 1774623 1805593 1839763 1876089 1913740 1953384 1996300 2042803 2092066 2143093 2195148
50482 2195148 2247545 2299893 2352707 2407110 2463738 2522312 2582320 2643672 2706763 2772661 2843302
50471 2843302 2920710 3005535 3096901 3194079 3297733 3409159 3528871 3656572 3792069 3935296
50461 3935296 4085449 4240731 4399177 4559346 4719915 4878745 5032647 5178206 5312832
50452 5312832 5434810 5542324 5632961 5704602 5756354 5787855 5797969 5785260 5749855 5693815 5619475
$$ packed form
50527B826118r0843r1180q9616q7921q6596q4387q0098p4329o8835o4416o0300
50516A947597n5734n1270m7740m4512l9881l3322k6448k1168j7476j3834r315
50505A586897m604p86K026M566P453J0857J4875J9453K3861K6774K7574K7398
50493A746344K8279L0970L4170L6326L7651L9644M2916M6503M9263N1027N2055
50482B195148N2397N2348N2814N4403N6628N8574O0008O1352O3091O5898P0641
50471B843302P7408Q4825R1366R7178J03654J11426J19712J27701J35497J43227
50461C935296J50153J55282J58446J60169J60569J58830J53902J45559J34626
50452E312832J21978J07514R0637P1641N1752L1501J0114j2709l5405n6040p4340
$$ plain form
50441 5619475 5528614 5423740 5308741 5187116 5060544 4930587 4801320 4678934 4568960 4474801
50431 4474801 4398294 4339894 4298132 4270517 4255674 4253665 4263866 4283597 4309245 4337395 4363887
50420 4363887 4382717 4387322 4373013 4337672 4280710 4202493 4104816 3990925 3864482 3728645 3586181
50409 3586181 3440027 3293362 3149145 3009625 2876261 2750009 2631577 2521277 2418930
50400 2418930 2324326 2237935 2160805 2093529 2035411 1984770 1939951 1900134 1865445 1836489 1813639
50389 1813639 1796787 1785767 1780608 1780889 1785184 1791916 1800912 1813405 1830346 1851260 1874915 1900365
50377 1900365 1927075 1954875 1984383 2016695 2051924 2088564 2125147 2162048 2200745 2241605 2283414
50366 2283414 2324894 2365640 2405329 2442993 2477509 2508348 2535620 2559942 2582426 2604109 2625084
$$ packed form
50441E619475r0861j04874j14999j21625j26572j29957j29267j22386j09974r4159
50431D474801p6507n8400m1762k7615j4843k009J0201J9731K5648K8150K6492
50420D363887J8830M605j4309l5341n6962p8217r7677j13891j26443j35837j42464
50409C586181j46154j46665j44217j39520j33364j26252j18432j10300j02347
50400B418930r4604q6391p7130o7276n8118n0641m4819l9817l4689k8956k2850
50389A813639j6852j1020n159K81M295O732Q996J2493J6941K0914K3655K5450
50377A900365K6710K7800K9508L2312L5229L6640L6583L6901L8697M0860M1809
50366B283414M1480M0746L9689L7664L4516L0839K7272K4322K2484K1683K0975
$$ plain form
50355 2625084 2644652 2662644 2680111 2698455 2718628 2741751 2769862 2804936 2846976 2893757 2942892
50344 2942892 2993863 3047685 3104808 3163961 3223268 3281924 3339979 3396603 3449434 3496001 3534845
50333 3534845 3564704 3583573 3589693 3582826 3563216 3529832 3481433 3419370 3347389 3268136 3181762 3088952
50321 3088952 2993376 2899514 2809416 2723555 2643825 2573272 2513114 2462095 2419078 2384639 2359841
50310 2359841 2344988 2339796 2343172 2352341 2363739 2375445 2387440 2398851 2406376 2406241 2396444 2376390 2345964
50297 2345964 2306266 2259986 2209462 2155142 2097201 2037618 1978896 1921392 1863716 1805646 1749135
50286 1749135 1696498 1648955 1606773 1569394 1535345 1503492 1474475 1449597 1428286 1408256 1388577
50275 1388577 1370993 1357445 1347702 1340367 1334980 1331959 1331286 1332575 1336001 1342171 1351151 1362430 1375711
$$ packed form
50355B625084J9568J7992J7467J8344K0173K3123K8111L5074M2040M6781M9135
50344B942892N0971N3822N7123N9153N9307N8656N8055N6624N2831M6567L8844
50333C534845K9859J8869O120o867j9610l3384m8399o2063p1981p9253q6374r2810
50321C088952r5576r3862r0098q5861p9730p0553o0158n1019m3017l4439k4798
50310B359841j4853n192L376R169J1398J1706J1995J1411P525j35r797k0054l0426
50297B345964l9698m6280n0524n4320n7941n9583n8722n7504n7676n8070n6511
50286A749135n2637m7543m2182l7379l4049l1853k9017k4878k1311k0030j9679
50275A388577j7584j3548r743p335n387l021o73J289L426O170Q980J1279J3281
$$ plain form
50262 1375711 1391146 1408822 1428444 1449463 1471316 1493635 1516294 1539073 1561380 1582849 1604161
50251 1604161 1626635 1650838 1676267 1702336 1728750 1754628 1778378 1799093 1817234 1833306 1846650
50240 1846650 1856362 1862632 1866232 1867195 1864971 1859573 1851631 1841491 1829084 1814671 1799087 1783207 1767497
50227 1767497 1751808 1735343 1717368 1698493 1680647 1664933 1649926 1633013 1613215 1591902 1570999
50216 1570999 1551465 1533397 1516481 1500003 1483171 1465889 1448832 1432605 1417206 1402406 1388288
50205 1388288 1375214 1363466 1352884 1342741 1332242 1321389 1311057 1301941 1293909 1286811 1281287 1277981
50193 1277981 1276413 1275606 1275662 1277722 1282271 1288257 1294040 1298667 1302214 1305489 1309416 1314159 1318835 1322519 1325258
50178 1325258 1327503 1329005 1329234 1328628 1328188 1327727 1325709 1321199 1314995 1308434 1302015 1295657 1289455 1283472 1277434
$$ packed form
50262A375711J5435J7676J9622K1019K1853K2319K2659K2779K2307K1469K1312
50251A604161K2474K4203K5429K6069K6414K5878K3750K0715J8141J6072J3344
50240A846650R712O270L600R63k224n398p942j0140j2407j4413j5584j5880j5710
50227A767497j5689j6465j7975j8875j7846j5714j5007j6913j9798k1313k0903
50216A570999j9534j8068j6916j6478j6832j7282j7057j6227j5399j4800j4118
50205A388288j3074j1748j0582j0143j0499j0853j0332r116q032p098n524l306
50193A277981j568q07N6K060M549N986N783M627L547L275L927M743M676L684K739
50178A325258K245J502K29o06m40m61k018m510o204o561o419o358o202n983o038
$$ plain form
50163 1277434 1271237 1265296 1259813 1254237 1248085 1241959 1237135 1234268 1233076 1233294 1235341 1239669 1245539 1250911
50149 1250911 1254189 1256101 1259177 1264917 1272101 1278472 1283298 1287219 1290339 1292115 1293040 1294571 1296856 1298007
50135 1298007 1296427 1292631 1287938 1282501 1275687 1267454 1258147 1247693 1236171 1224631 1214037 1203671 1191946
50122 1191946 1178836 1166313 1156004 1147297 1138205 1127535 1115595 1103104 1090121 1076478 1063062 1051898
50110 1051898 1044330 1039386 1034768 1029472 1024509 1020900 1018089 1014992 1011645 1008798 1006512 1004102 1000983 996651
50096 996651 990247 981294 970810 960772 952418 945637 939747 934041 927801 920724 913298 905971 898257 889720
50082 889720 881580 875854 872707 870218 867331 865532 866488 869208 870981 870525 868845 867420 867005 868108 871033
50067 871033 874915 877947 879350 880400 882924 887476 893627 901206 910139 919521 927962 934950 941065 946906
$$ packed form
50163A277434o197n941n483n576o152o126m824k867j192K18K047M328N870N372
50149A250911L278J912L076N740P184O371M826L921L120J776R25J531K285J151
50135A298007j580l796m693n437o814q233r307j0454j1522j1540j0594j0366j1725
50122A191946j3110j2523j0309q707r092j0670j1940j2491j2983j3643j3416j1164
50110A051898p568m944m618n296m963l609k811l097l347k847k286k410l119m332
50096I96651o404q953j0484j0038q354o781n890n706o240p077p426p327p714q537
50082H89720q140n726l147k489k887j799R56K720J773m56j680j425m15J103K925
50067H71033L882L032J403J050K524M552O151P579Q933R382Q441O988O115N841
$$ plain form
50053 946906 952701 958978 966557 975404 984241 991822 998091 1003768 1009391 1015068 1020457 1024687 1027192 1029153
50039 1029153 1033042 1039842 1047588 1053741 1058174 1062501 1067324 1071944 1076451 1082124 1089529 1097917 1106881 1117008
50025 1117008 1128324 1139695 1150655 1162458 1176255 1191339 1206291 1220923 1235889 1251137 1265962
50014 1265962 1280242 1294561 1309392 1325008 1341812 1359992 1378972 1397872 1416300 1434244 1451590
50003 1451590 1468219 1484143 1499166 1513006 1526099 1539439 1553063 1565720 1576835 1587741 1599898
49992 1599898 1612816 1625110 1636818 1649057 1661777 1673515 1683356 1691766 1699462 1706682 1713594 1720135
49980 1720135 1725324 1727923 1728052 1727045 1725567 1722979 1718675 1712724 1704849 1694082 1680275 1665053 1650421
49967 1650421 1637002 1624187 1611407 1598678 1586424 1575351 1566130 1558697 1552162 1545754 1539661 1534782
$$ packed form
50053I46906N795O277P579Q847Q837P581O269N677N623N677N389M230K505J961
50039A029153L889O800P746O153M433M327M823M620M507N673P405Q388Q964J0127
50025A117008J1316J1371J0960J1803J3797J5084J4952J4632J4966J5248J4825
50014A265962J4280J4319J4831J5616J6804J8180J8980J8900J8428J7944J7346
50003A451590J6629J5924J5023J3840J3093J3340J3624J2657J1115J0906J2157
49992A599898J2918J2294J1708J2239J2720J1738R841Q410P696P220O912O541
49980A720135N189K599J29j007j478k588m304n951p875j0767j3807j5222j4632
49967A650421j3419j2815j2780j2729j2254j1073r221p433o535o408o093m879
$$ plain form
49955 1534782 1531962 1531551 1533252 1536180 1539411 1542754 1546815 1552348 1559708 1568707 1578559 1588164 1597015 1605692
49941 1605692 1614961 1624607 1633664 1641380 1647109 1649805 1648912 1645649 1642019 1638291 1632715 1624097 1613351 1601867
49927 1601867 1589433 1574610 1556368 1534644 1510025 1483575 1456331 1428297 1398551 1366984 1335258
49916 1335258 1305319 1277540 1251047 1225286 1200403 1176504 1153455 1131359 1110607 1091617 1074929
49905 1074929 1061210 1050525 1041788 1033427 1024527 1015022 1005141 995119 985218 975588 966189 957034 948164
49892 948164 939309 930139 921034 912844 905395 897039 886406 874088 861857 850850 841286 833291 826866
49879 826866 821280 815550 809485 803419 797149 790122 782688 776164 771454 768319 766078 764181 762071 759424
$$ packed form
49955A534782k820m11J701K928L231L343M061N533P360Q999R852R605Q851Q677
49941A605692R269R646R057P716N729K696q93l263l630l728n576q618j0746j1484
49927A601867j2434j4823j8242k1724k4619k6450k7244k8034k9746l1567l1726
49916A335258k9939k7779k6493k5761k4883k3899k3049k2096k0752j8990j6688
49905A074929j3719j0685q737q361q900r505r881j0022r901r630r399r155q870
49892I48164q855r170r105q190p449q356j0633j2318j2231j1007r564p995o425
49879H26866n586n730o065o066o270p027p434o524m710l135k241j897k110k647
$$ [...]
##END NTUPLES=NMR SPECTRUM
##END=
