
##TITLE=AC1167_Meta-centauros3_5898838_SFqeAGUjo0
##JCAMPDX= 6.0         $$ Bruker NMR JCAMP-DX V2.0
##DATA TYPE= NMR SPECTRUM
##DATA CLASS= NTUPLES
##ORIGIN= BRUKER
##OWNER= Administrator
$$ 1.72 TOPSPIN		Version 2.1
$$ 2012-04-16 19:06:45.203 -0500  Administrator@TOPSPIN
$$ Compression mode = diff/dup
##.OBSERVE FREQUENCY= 400.13188235
##.OBSERVE NUCLEUS= ^1H
##.ACQUISITION MODE= SIMULTANEOUS (DQD)
##.ACQUISITION SCHEME= undefined
##.AVERAGES= 64
##.DIGITISER RES= 22
##SPECTROMETER/DATA SYSTEM= spect
##.PULSE SEQUENCE= noesygpps1d.comp
##.SOLVENT NAME= COFFEE_meoh
##.SHIFT REFERENCE= INTERNAL, COFFEE_meoh, 1, 14.96861
##AUDIT TRAIL= $$ (NUMBER, WHEN, WHO, WHERE, PROCESS, VERSION, WHAT)
$$ ##TITLE= Audit trail, TOPSPIN		Version 2.1
$$ ##JCAMPDX= 5.01
$$ ##ORIGIN= Bruker BioSpin GmbH
$$ ##OWNER= Administrator
$$ $$ C:\Bruker\TOPSPIN/data/COFFEE/nmr/AC1167_Meta-centauros3_5898838_SFqeAGUjo0/22/pdata/1/auditp.txt
$$ ##AUDIT TRAIL=  $$ (NUMBER, WHEN, WHO, WHERE, PROCESS, VERSION, WHAT)
(   1,<2012-04-15 18:49:25.921 -0500>,<Administrator>,<TOPSPIN>,<go>,<TOPSPIN 2.1>,
      <created by zg
	started at 2012-04-15 18:37:54.375 -0500,
	POWCHK enabled, PULCHK disabled,
       configuration hash MD5:
       1A 1E CE 29 27 FD 77 03 67 4E F0 E3 C4 B2 CB 90
       data hash MD5: 64K
       0E 98 DA 85 A9 B8 36 2D F4 33 C9 28 49 BB EB D4>)
(   2,<2012-04-15 18:49:28.609 -0500>,<Administrator>,<TOPSPIN>,<proc1d>,<TOPSPIN 2.1>,
      <Start of raw data processing
       efp LB = 0.3 FT_mod = 6 PKNL = 1 PHC0 = 0 PHC1 = 0 SI = 128K 
       data hash MD5: 128K
       04 5C B8 0A 2B C0 45 CA C2 3F D9 F6 23 62 DF 6D>)
(   3,<2012-04-15 18:49:29.859 -0500>,<Administrator>,<TOPSPIN>,<proc1d>,<TOPSPIN 2.1>,
      <pk PHC0 = 38.86963 PHC1 = 0 
       data hash MD5: 128K
       C5 45 F2 7B DD 36 B0 F7 7B 24 71 7E BC B2 CE 67>)
(   4,<2012-04-15 18:49:30.093 -0500>,<Administrator>,<TOPSPIN>,<proc1d>,<TOPSPIN 2.1>,
      <abs ABSG = 1 
       data hash MD5: 128K
       84 12 B8 DA F9 B7 DA 17 5C 0D 81 85 15 5E 54 04>)
(   5,<2012-04-15 18:49:30.171 -0500>,<Administrator>,<TOPSPIN>,<proc1d>,<TOPSPIN 2.1>,
      <abs ABSG = 2 
       data hash MD5: 128K
       87 BA 50 43 0F E4 2F B8 F0 03 88 55 72 AD AE 8D>)
(   6,<2012-04-15 18:49:30.265 -0500>,<Administrator>,<TOPSPIN>,<proc1d>,<TOPSPIN 2.1>,
      <abs ABSG = 3 
       data hash MD5: 128K
       DE 58 CC A3 2F DB 67 BE 42 1C AF FE 43 BA 14 BA>)
(   7,<2012-04-15 18:49:30.453 -0500>,<Administrator>,<TOPSPIN>,<proc1d>,<TOPSPIN 2.1>,
      <abs ABSG = 4 
       data hash MD5: 128K
       AF 6F FF 6D 9D AD 2A 36 35 F0 24 9C 6F DA 23 5F>)
(   8,<2012-04-15 18:49:30.500 -0500>,<Administrator>,<TOPSPIN>,<proc1d>,<TOPSPIN 2.1>,
      <abs ABSG = 5 
       data hash MD5: 128K
       49 60 25 13 80 61 22 05 8A 18 CA E3 78 2D 26 2D>)
(   9,<2012-04-15 18:49:30.734 -0500>,<Administrator>,<TOPSPIN>,<audit>,<TOPSPIN 2.1>,
      <user comment:
       ICON-NMR User ID: COFFEE
       data hash MD5: 128K
$$ [...]
##$TP07= 0
##$TPNAME0= <>
##$TPNAME1= <>
##$TPNAME2= <>
##$TPNAME3= <>
##$TPNAME4= <>
##$TPNAME5= <>
##$TPNAME6= <>
##$TPNAME7= <>
##$TPOAL= (0..7)
0.5 0.5 0.5 0.5 0.5 0.5 0.5 0.5
##$TPOFFS= (0..7)
0 0 0 0 0 0 0 0
##$TUNHIN= 0
##$TUNHOUT= 0
##$TUNXOUT= 0
##$USERA1= <user>
##$USERA2= <user>
##$USERA3= <user>
##$USERA4= <user>
##$USERA5= <user>
##$V9= 5
##$VALIST= <valist>
##$VCLIST= <CCCCCCCCCCCCCCC>
##$VD= 0
##$VDLIST= <DDDDDDDDDDDDDDD>
##$VPLIST= <PPPPPPPPPPPPPPP>
##$VTLIST= <TTTTTTTTTTTTTTT>
##$WBST= 2048
##$WBSW= 25
##$XGAIN= (0..3)
0 0 0 0
##$XL= 0
##$YL= 0
##$YMAX_a= 11238892
##$YMIN_a= -7002683
##$ZGOPTNS= <>
##$ZL1= 120
##$ZL2= 120
##$ZL3= 120
##$ZL4= 120
##$ABSF1= 14.96861
##$ABSF2= -5.58392
##$ABSG= 5
##$ABSL= 3
##$ALPHA= 0
##$AQORDER= 0
##$ASSFAC= 0
##$ASSFACI= 0
##$ASSFACX= 0
##$ASSWID= 0
##$AUNMP= <proc_prof1d_extract.lims>
##$AXLEFT= 0
##$AXNAME= <>
##$AXNUC= <1H>
##$AXRIGHT= 0
##$AXTYPE= 0
##$AXUNIT= <>
##$AZFE= 0.1
##$AZFW= 0.1
##$BCFW= 0
##$BC_mod= 0
##$BYTORDP= 0
##$COROFFS= 0
##$CY= 15
##$DATMOD= 1
##$DC= 0
##$DFILT= <>
##$DTYPP= 0
##$F1P= 0
##$F2P= 0
##$FCOR= 0.5
##$FTSIZE= 131072
##$FT_mod= 6
##$GAMMA= 0
##$GB= 0
##$INTBC= 1
##$INTSCL= 1
##$ISEN= 128
##$LB= 0.3
##$LEV0= 0
##$LPBIN= 0
##$MAXI= 10000
##$MC2= 0
##$MEAN= 0
##$ME_mod= 0
##$MI= 0
##$NCOEF= 0
##$NC_proc= -2
##$NLEV= 6
##$NOISF1= 0
##$NOISF2= 0
##$NSP= 0
##$NTH_PI= 0
##$NZP= 0
##$OFFSET= 14.96861
##$PC= 1
##$PHC0= 38.86963
##$PHC1= 0
##$PH_mod= 1
##$PKNL= yes
##$PPARMOD= 0
##$PPDIAG= 0
##$PPIPTYP= 0
##$PPMPNUM= 2147483647
##$PPRESOL= 1
##$PSCAL= 4
##$PSIGN= 0
##$PYNMP= <proc.py>
##$REVERSE= no
##$SF= 400.130004803294
##$SI= 131072
##$SIGF1= 0
##$SIGF2= 0
##$SINO= 400
##$SIOLD= 131072
##$SPECTYP= <>
##$SREGLST= <1H.CDCl3>
##$SSB= 0
##$STSI= 131072
##$STSR= 0
##$SW_p= 8223.68421052632
##$SYMM= 0
##$S_DEV= 0
##$TDeff= 65536
##$TDoff= 0
##$TI= <>
##$TILT= no
##$TM1= 0
##$TM2= 0
##$TOPLEV= 0
##$USERP1= <user>
##$USERP2= <user>
##$USERP3= <user>
##$USERP4= <user>
##$USERP5= <user>
##$WDW= 1
##$XDIM= 131072
##$YMAX_p= 250386720
##$YMIN_p= -365098854
##$CURPLOT= <Network HP LaserJet P1505>
##$CURPRIN= <$Network HP LaserJet P1505>
##$DFORMAT= <normdp>
##$LAYOUT= <+/1D_H.xwp>
##$LFORMAT= <normlp>
##$PFORMAT= <normpl>
##$SURQMSG= 1
$$ End of Bruker specific parameters
$$ ---------------------------------
##NTUPLES= NMR SPECTRUM
##VAR_NAME=  FREQUENCY,     SPECTRUM/REAL,   SPECTRUM/IMAG
##SYMBOL=    X,             R,               I
##VAR_TYPE=  INDEPENDENT,   DEPENDENT,       DEPENDENT
##VAR_FORM=  AFFN,          ASDF,            ASDF
##VAR_DIM=   131072,        131072,          131072
##UNITS=     HZ,            ARBITRARY UNITS, ARBITRARY UNITS
##FACTOR=    0.0627417313425165, 1,          1
##FIRST=     8223.62146879498, 15,           -43779
##LAST=      0,             2713,            -44044
##MIN=       0,             -365098854,      0
##MAX=       8223.62146879498, 250386720,    0
$$ Real data points
##PAGE= N=1
##DATA TABLE= (X++(R..R)), XYDATA
$$ [...]
$$ plain form
62023 2175167 2206012 2237035 2268733 2301278 2333982 2365905 2396707 2426528 2455455 2483736 2512265
62012 2512265 2542230 2574248 2608310 2644430 2682721 2722759 2763605 2804687 2846188 2888243 2930206
62001 2930206 2970973 3009659 3045631 3078344 3107564 3133547 3156589 3176567 3193207 3206576 3216853
61990 3216853 3223792 3226956 3226565 3223690 3219399 3213974 3207176 3199088 3190393 3181821 3173599 3165571 3157636 3149777
61976 3149777 3141750 3133134 3123942 3114831 3106428 3098631 3090912 3083093 3075381 3067764 3059999 3052236 3045073 3038728
61962 3038728 3032612 3026077 3019298 3013106 3008128 3004324 3001184 2998094 2994622 2990642 2986206 2981367 2976346 2971766
61948 2971766 2968259 2965649 2962952 2959426 2955264 2950988 2946464 2940955 2933983 2925820 2917134 2908381 2899454 2889782
61934 2889782 2878753 2866118 2851944 2836352 2819504 2801672 2782938 2762936 2741333 2718498 2695131
$$ packed form
62023B175167L0845L1023L1698L2545L2704L1923L0802K9821K8927K8281K8529
62012B512265K9965L2018L4062L6120L8291M0038M0846M1082M1501M2055M1963
62001B930206M0767L8686L5972L2713K9220K5983K3042J9978J6640J3369J0277
61990C216853O939L164l91k875m291n425o798q088q695q572q222q028p935p859
61976C149777q027q616r192r111q403p797p719p819p712p617p765p763p163o345
61962C038728o116o535o779o192m978l804l140l090l472l980m436m839n021m580
61948B971766l507k610k697l526m162m276m524n509o972q163q686q753q927r672
61934B889782j1029j2635j4174j5592j6848j7832j8734k0002k1603k2835k3367
$$ plain form
61923 2695131 2671275 2646405 2620601 2594812 2569711 2545082 2520698 2496930 2473916 2450955 2427545
61912 2427545 2404340 2382229 2360977 2339746 2318544 2298242 2279357 2261676 2244828 2228380 2211606
61901 2211606 2194141 2176791 2160778 2146207 2132142 2118195 2105055 2093328 2082714 2072629 2062874
61890 2062874 2053494 2044664 2036892 2030622 2025550 2021072 2017491 2015847 2016333 2017902 2019898 2023084 2028469 2036007
61876 2036007 2045177 2056123 2069345 2084799 2102191 2121832 2144430 2170298 2199501 2232464 2269667
61865 2269667 2310863 2355396 2403362 2455926 2514407 2579512 2651488 2730594 2817386 2912954 3018922
61854 3018922 3136875 3267774 3412351 3572188 3750099 3949253 4171985 4419410 4691990
61845 4691990 4990502 5316513 5671748 6056607 6469151 6905220 7358838 7821663 8281697
$$ packed form
61923B695131k3856k4870k5804k5789k5101k4629k4384k3768k3014k2961k3410
61912B427545k3205k2111k1252k1231k1202k0302j8885j7681j6848j6448j6774
61901B211606j7465j7350j6013j4571j4065j3947j3140j1727j0614j0085r755
61890B062874r380q830p772o270n072m478l581j644M86J569J996L186N385P538
61876B036007R170J0946J3222J5454J7392J9641K2598K5868K9203L2963L7203
61865B269667M1196M4533M7966N2564N8481O5105P1976P9106Q6792R5568J05968
61854C018922J17953J30899J44577J59837J77911J99154K22732K47425K72580
61845D691990K98512L26011L55235L84859M12544M36069M53618M62825M60034
$$ plain form
61836 8281697 8722567 9124124 9464229 9721507 9878759 9925915 9861322 9691259 9428425 9089948
61826 9089948 8694924 8262072 7808228 7347739 6892086 6449691 6026298 5625835 5250956
61817 5250956 4903039 4582241 4287927 4018991 3773806 3550257 3346214 3159958 2990053
61808 2990053 2835028 2693439 2564185 2446460 2339338 2241630 2152246 2070505 1995988 1928244
61798 1928244 1866817 1811311 1761080 1714983 1671855 1631337 1593914 1560049 1529639 1502405 1478339
61787 1478339 1457359 1438868 1422139 1406968 1393521 1381736 1371345 1362374 1355080 1349385 1344835 1341114
61775 1341114 1338120 1335589 1333233 1331394 1330922 1332151 1334506 1337405 1341027 1345899 1352156 1359619 1368188 1377740
61761 1377740 1388086 1399467 1412720 1428420 1446157 1465182 1485502 1507746 1532181 1558580 1587053
$$ packed form
61836H281697M40870M01557L40105K57278J57252M7156o4593j70063k62834l38477
61826I089948l95024m32852m53844m60489m55653m42395m23393m00463l74879
61817E250956l47917l20798k94314k68936k45185k23549k04043j86256j69905
61808B990053j55025j41589j29254j17725j07122r7708q9384q1741p4517o7744
61798A928244o1427n5506n0231m6097m3128m0518l7423l3865l0410k7234k4066
61787A478339k0980j8491j6729j5171j3447j1785j0391q971p294n695m550l721
61775A341114k994k531k356j839m72J229K355K899L622M872O257P463Q569R552
61761A377740J0346J1381J3253J5700J7737J9025K0320K2244K4435K6399K8473
$$ plain form
61750 1587053 1618348 1653167 1691691 1733944 1780119 1830275 1884126 1941466 2002649 2068405 2139376
61739 2139376 2215953 2298389 2386792 2481061 2581101 2687203 2800219 2921369 3051835 3192448
61729 3192448 3343783 3506627 3682335 3872649 4079288 4303857 4548208 4814724 5106291
61720 5106291 5426168 5777970 6165617 6593037 7063714 7580348 8144817 8758312 9421245
61711 9421245 10132605 10888987 11683771 12506452 13341587 14167417 14955165 15670158 16274763
61702 16274763 16732549 17013222 17097689 16981642 16675920 16203546 15595194 14884898 14106480
61693 14106480 13290597 12462787 11643018 10846424 10084181 9363969 8690363 8065489 7489673
61684 7489673 6961744 6479311 6039424 5639204 5275733 4945549 4644823 4370323 4119839
$$ packed form
61750A587053L1295L4819L8524M2253M6175N0156N3851N7340O1183O5756P0971
61739B139376P6577Q2436Q8403R4269J00040J06102J13016J21150J30466J40613
61729C192448J51335J62844J75708J90314K06639K24569K44351K66516K91567
61720E106291L19877L51802L87647M27420M70677N16634N64469O13495O62933
61711I421245P11360P56382P94784Q22681Q35135Q25830P87748P14993O04605
61702A6274763M57786K80673Q4467j16047l05722m72374o08352p10296p78418
61693A4106480q15883q27810q19769p96594p62243p20212o73606o24874n75816
61684G489673n27929m82433m39887m00220l63471l30184l00726k74500k50484
$$ plain form
61675 4119839 3891454 3682864 3491792 3316647 3156159 3008669 2872501 2746877 2631611
61666 2631611 2525835 2427840 2336471 2251859 2174250 2102761 2035987 1973368 1915182 1861382 1811169
61655 1811169 1763752 1718936 1676820 1637272 1599876 1564213 1530185 1498176 1468722 1441681 1415865
61644 1415865 1389902 1363492 1337604 1313454 1291518 1271361 1252004 1232450 1212336 1192251 1173215
61633 1173215 1155673 1139181 1123080 1107257 1092100 1077929 1064655 1051935 1039526 1027502 1016136
61622 1016136 1005572 995659 986132 976817 967619 958442 949316 940491 932256 924696 917745 911345 905366 899526
61608 899526 893628 887836 882473 877541 872639 867342 861550 855497 849591 844171 839235 834442 829566 824866
61594 824866 820821 817554 814743 812014 809155 806040 802670 799365 796657 794855 793833 793221 792696 792102 791544
$$ packed form
61675D119839k28385k08590j91072j75145j60488j47490j36168j25624j15266
61666B631611j05776r7995r1369q4612p7609p1489o6774o2619n8186n3800n0213
61655A811169m7417m4816m2116l9548l7396l5663l4028l2009k9454k7041k5816
61644A415865k5963k6410k5888k4150k1936k0157j9357j9554k0114k0085j9036
61633A173215j7542j6492j6101j5823j5157j4171j3274j2720j2409j2024j1366
61622A016136j0564r913r527r315r198r177r126q825q235p560o951o400n979n840
61608H99526n898n792n363m932m902n297n792o053n906n420m936m793m876m700
61594H24866m045l267k811k729k859l115l370l305k708j802j022o12n25n94n58
$$ plain form
61579 791544 791327 791614 792214 792878 793714 794956 796423 797639 798506 799369 800275 800689 800284 799580 799307 799387 799038 797747
61561 797747 795632 792966 789906 786824 784280 782344 780357 777748 774775 771985 769230 765831 761680 757487
61547 757487 753755 750105 745983 741507 737086 732579 727557 722276 717694 714411 712154 710433 709179 708437
61533 708437 707998 707777 708203 709751 712205 714764 716897 718869 721550 725881 732335 740621 749934 759664 769756
61518 769756 780341 791335 802738 815043 828883 844289 860693 877676 895415 914262 934176
61507 934176 954750 975721 997306 1019989 1043923 1068549 1092905 1116338 1138787 1160323 1180706
61496 1180706 1199611 1217110 1233700 1249895 1265926 1281665 1296587 1309896 1320887 1329345 1335611 1340348
61484 1340348 1344107 1346832 1347782 1346265 1342496 1337391 1331512 1324794 1317439 1310331 1304069 1298252 1292433 1287347
$$ packed form
61579G91544k17K87O00O64Q36J242J467J216Q67Q63R06M14m05p04k73Q0l49j291
61561G97747k115k666l060l082k544j936j987k609k973k790k755l399m151m193
61547G57487l732l650m122m476m421m507n022n281m582l283k257j721j254p42
61533G08437m39k21M26J548K454K559K133J972K681M331O454Q286R313R730J0092
61518G69756J0585J0994J1403J2305J3840J5406J6404J6983J7739J8847J9914
61507I34176K0574K0971K1585K2683K3934K4626K4356K3433K2449K1536K0383
61496A180706J8905J7499J6590J6195J6031J5739J4922J3309J0991Q458O266M737
61484A340348L759K725R50j517l769n105n879o718p355p108o262n817n819n086
$$ plain form
61470 1287347 1284353 1283934 1285550 1288847 1294143 1301653 1311148 1322647 1336809 1354249 1374956 1398726 1425772
61457 1425772 1456634 1491833 1531844 1577108 1627880 1684286 1746694 1815743 1892009 1975954 2068238
61446 2068238 2169636 2280601 2401322 2532218 2673728 2825358 2985528 3152625 3325479
61437 3325479 3502129 3678424 3848345 4005550 4144273 4259315 4346255 4402182 4426266 4419824
61427 4419824 4386028 4329090 4252980 4160749 4055287 3940480 3821026 3701022 3583169 3469319
61417 3469319 3361229 3260391 3167674 3083578 3008746 2943750 2888436 2841933 2803514 2773187 2751217
61406 2751217 2737338 2730805 2731196 2738693 2753347 2774346 2800307 2830185 2863526 2899949 2938742 2979063
61394 2979063 3020232 3061633 3102557 3142365 3180775 3217896 3254012 3289378 3324159 3358565 3393004
$$ packed form
61470A287347k994m19J616L297N296P510R495J1499J4162J7440K0707K3770K7046
61457A425772L0862L5199M0011M5264N0772N6406O2408O9049P6266Q3945R2284
61446B068238J01398J10965J20721J30896J41510J51630J60170J67097J72854
61437C325479J76650J76295J69921J57205J38723J15042Q6940N5927K4084o442
61427D419824l3796n6938p6110r2231j05462j14807j19454j20004j17853j13850
61417C469319j08090j00838r2717q4096p4832o4996n5314m6503l8419l0327k1970
61406B751217j3879o533L91P497J4654K0999K5961K9878L3341L6423L8793M0321
61394B979063M1169M1401M0924L9808L8410L7121L6116L5366L4781L4406L4439
$$ plain form
61383 3393004 3427944 3463454 3499008 3533965 3568138 3601600 3634002 3664472 3692222 3716904 3738288
61372 3738288 3755980 3769651 3779214 3784561 3785418 3781679 3773599 3761439 3745298 3725625 3703606 3680571
61360 3680571 3657184 3633613 3610321 3588143 3567562 3548504 3531038 3515823 3503475 3493833 3486274 3480622
61348 3480622 3477221 3476011 3475951 3475674 3474512 3472498 3469541 3465092 3458883 3451567 3444194 3437237 3430646 3424918 3421646
61333 3421646 3422759 3429557 3442755 3463270 3492484 3531732 3581820 3643232 3716562 3802590 3901890 4014483
61321 4014483 4139899 4277611 4427365 4588899 4761166 4941718 5126835 5312230 5493570
61312 5493570 5666334 5825339 5964676 6078416 6161750 6211934 6228653 6213711 6170069 6100583
61302 6100583 6007297 5891824 5756363 5604174 5439093 5264818 5084686 4901728 4718580 4537360
$$ packed form
61383C393004L4940L5510L5554L4957L4173L3462L2402L0470K7750K4682K1384
61372C738288J7692J3671R563N347Q57l739q080j2160j6141j9673k2019k3035
61360C680571k3387k3571k3292k2178k0581j9058j7466j5215j2348r642p559n652
61348C480622l401j210o0k77j162k014k957m449o209p316p373o957o591n728l272
61333C421646J113O798J3198K0515K9214L9248N0088O1412P3330Q6028R9300J12593
61321D014483J25416J37712J49754J61534J72267J80552J85117J85395J81340
61312E493570J72764J59005J39337J13740Q3334N0184J6719j4942m3642o9486
61302F100583r3286j15473j35461j52189j65081j74275j80132j82958j83148j81220
$$ plain form
61292 4537360 4359765 4187186 4020658 3860979 3709140 3566531 3434467 3313565 3203680
61283 3203680 3104266 3014665 2934348 2863269 2801867 2750400 2708423 2675164 2650140 2632972 2622838
61272 2622838 2618764 2620447 2628182 2641871 2660643 2683583 2710191 2739841 2771327 2803492 2835974 2868866
61260 2868866 2901866 2934184 2965196 2994710 3022555 3048269 3071378 3091795 3109815 3125746 3139623
61249 3139623 3151208 3160152 3166037 3168319 3166458 3160255 3149957 3135879 3118077 3096649 3072161 3045377
61237 3045377 3016525 2985222 2951218 2914930 2877098 2838185 2798365 2757956 2717658 2678348 2640673
61226 2640673 2604851 2570931 2539265 2510517 2485080 2462713 2443005 2425926 2411510 2399163 2387831
61215 2387831 2376864 2366265 2356034 2345701 2334613 2322413 2309205 2295618 2282633 2270892 2260211
$$ packed form
61292D537360j77595j72579j66528j59679j51839j42609j32064j20902j09885
61283C203680r9414q9601q0317p1079o1402n1467m1977l3259k5024j7168j0134
61272B622838m074J683P735J3689J8772K2940K6608K9650L1486L2165L2482L2892
61260B868866L3000L2318L1012K9514K7845K5714K3109K0417J8020J5931J3877
61249C139623J1585Q944N885K282j861o203j0298j4078j7802k1428k4488k6784
61237C045377k8852l1303l4004l6288l7832l8913l9820m0409m0298l9310l7675
61226B640673l5822l3920l1666k8748k5437k2367j9708j7079j4416j2347j1332
61215B387831j0967j0599j0231j0333j1088j2200j3208j3587j2985j1741j0681
$$ plain form
61204 2260211 2250254 2241605 2235476 2232354 2231790 2233806 2239700 2250871 2267488 2289003 2315564 2348232 2387996
61191 2387996 2435141 2489483 2550681 2618260 2691558 2769555 2850522 2931990 3011221 3085464 3151602
61180 3151602 3205931 3244728 3264971 3264567 3242536 3199529 3137881 3060666 2970734 2870850 2764223
61169 2764223 2654251 2543887 2435589 2331633 2233873 2143175 2059400 1981845 1909614 1842037
61159 1842037 1779276 1722274 1671580 1626393 1585296 1547694 1513966 1484372 1458538 1436017 1416720
61148 1416720 1400665 1387802 1378196 1371888 1368513 1367523 1368834 1372705 1378879 1386365 1394330 1402650 1411236 1419276
61134 1419276 1425646 1429901 1432438 1433736 1433759 1432137 1428711 1423760 1417651 1410353 1401434 1390594 1378004 1363941
61120 1363941 1348405 1331473 1313855 1296496 1279523 1262085 1243475 1224041 1204697 1185911 1167511
$$ packed form
61204B260211r957q649o129l122n64K016N894J1171J6617K1515K6561L2668L9764
61191B387996M7145N4342O1198O7579P3298P7997Q0967Q1468P9231P4243O6138
61180C151602N4329L8797K0243m04k2031m3007o1648p7215q9932r9884j06627
61169B764223j09972j10364j08298j03956r7760r0698q3775p7555p2231o7577
61159A842037o2761n7002n0694m5187m1097l7602l3728k9594k5834k2521j9297
61148A416720j6055j2863r606o308l375r90J311L871O174P486P965Q320Q586Q040
61134A419276O370M255K537J298K3j622l426m951o109p298q919j0840j2590j4063
61120A363941j5536j6932j7618j7359j6973j7438j8610j9434j9344j8786j8400
$$ plain form
61109 1167511 1149245 1130983 1112433 1093123 1072899 1052199 1031612 1011288 991005 970781 951087
61098 951087 932395 914701 897760 881577 866365 852017 837983 823732 809082 793982 778332
61087 778332 762255 746229 730636 715280 699698 683892 668628 655019 643881 635229 628243 621889
61075 621889 615807 610461 606327 603266 600960 599644 599935 602051 605596 610052 615136 620673 626503 632576
61061 632576 638925 645494 652205 659137 666410 673873 681070 687611 693495 699161 705312 712499 720663 729089
61047 729089 736898 743494 748550 751905 753626 753893 752629 749596 745126 740307 736035 732154 728006 723460
61033 723460 718826 714036 708675 702758 696828 691177 685605 680006 674634 669581 664552 659424 654591 650433
61019 650433 646723 642830 638276 632939 626970 620775 614919 609861 605741 602402 599528 596878 594549 592839
$$ packed form
61109A167511j8266j8262j8550j9310k0224k0700k0587k0324k0283k0224j9694
61098I51087j8692j7694j6941j6183j5212j4348j4034j4251j4650j5100j5650
61087G78332j6077j6026j5593j5356j5582j5806j5264j3609j1138q652o986o354
61075F21889o082n346m134l061k306j316K91K116L545M456N084N537N830O073
61061F32576O349O569O711O932P273P463P197O541N884N666O151P187Q164Q426
61047G29089P809O596N056L355J721K67j264l033m470m819m272l881m148m546
61033G23460m634m790n361n917n930n651n572n599n372n053n029n128m833m158
61019F50433l710l893m554n337n969o195n856n058m120l339k874k650k329j710
$$ plain form
61005 592839 591618 590167 588099 586261 586002 587510 589537 590950 591948 593382 595506 597976 600716 604074 608139
60990 608139 612448 616534 620454 624608 629222 634201 639419 644892 650589 656281 661842 667696 674683 683295
60976 683295 693282 704095 715471 727409 739943 753297 768020 784460 802204 820491 839147 858750
60964 858750 879838 902269 925431 948769 972152 996042 1021405 1049155 1079538 1112117 1146231
60953 1146231 1181491 1218100 1256983 1299383 1346032 1396883 1451818 1511211 1575469 1644534 1718367
60942 1718367 1797488 1882357 1972595 2067679 2168199 2275737 2391800 2517772 2655557 2807030
60932 2807030 2972874 3153179 3349549 3565673 3805844 4074392 4377100 4721915 5117358
60923 5117358 5570962 6089556 6679814 7348196 8102431 8954761 9922750 11025859 12282294
$$ packed form
61005E92839j221j451k068j838k59J508K027J413R98J434K124K470K740L358M065
60990F08139M309M086L920M154M614M979N218N473N697N692N561N854O987Q612
60976F83295R987J0813J1376J1938J2534J3354J4723J6440J7744J8287J8656J9603
60964H58750K1088K2431K3162K3338K3383K3890K5363K7750L0383L2579L4114
60953A146231L5260L6609L8883M2400M6649N0851N4935N9393O4258O9065P3833
60942A718367P9121Q4869R0238R5084J00520J07538J16063J25972J37785J51473
60932B807030J65844J80305J96370K16124K40171K68548L02708L44815L95443
60923E117358M53604N18594N90258O68382P54235Q52330R67989J103109J256435
$$ plain form
60914 12282294 13706688 15297379 17005998 18709898 20226798 21384212 22101329 22420490
60906 22420490 22469371 22395818 22325468 22345466 22483974 22679872 22780912 22601790 22014885 21007487
60896 21007487 19669078 18134086 16530040 14954601 13472181 12116564 10897301 9810108
60888 9810108 8846062 7995125 7246257 6588280 6011447 5507562 5068812 4687004 4353639
60879 4353639 4060297 3799337 3564741 3352189 3158241 2979839 2814784 2662139 2521600
60870 2521600 2392510 2273663 2163776 2061800 1966836 1877976 1794202 1714438 1637893 1564489
60860 1564489 1494786 1429321 1368067 1310498 1256072 1204556 1156074 1110948 1069401 1031305 996201
60849 996201 963564 933040 904532 878149 854027 832078 811953 793309 776016 760005 745019
$$ packed form
60914A2282294J424394J590691J708619J703900J516900J157414P17117L19161
60906B2420490M8881p3553p0350J9998J38508J95898J01040j79122n86905j007398
60896B1007487j338409j534992j604046j575439j482420j355617j219263j087193
60888I810108r64046q50937p48868o57977n76833n03885m38750l81808l33365
60879D353639k93342k60960k34596k12552j93948j78402j65055j52645j40539
60870B521600j29090j18847j09887j01976r4964q8860q3774p9764p6545p3404
60860A564489o9703o5465o1254n7569n4426n1516m8482m5126m1547l8096l5104
60849I96201l2637l0524k8508k6383k4122k1949k0125j8644j7293j6011j4986
$$ plain form
60838 745019 730699 716910 703922 692236 682218 673747 666291 659443 653350 648348 644305 640674 637229
60825 637229 634243 631826 629644 627555 625958 625063 624302 622994 621225 619434 617412 614483 610568 606459 602931
60810 602931 600120 597796 595649 593182 589863 585669 581236 577217 573748 570614 567713 565203 563361 562413
60796 562413 562431 563386 565341 568369 572144 575969 579624 583897 589816 597480 606167 615444 625539 636578
60782 636578 648128 659641 670780 681115 690099 697700 704570 711222 717454 722949 728024 733249 738586
60769 738586 743395 747155 749753 751244 751882 752307 753189 754524 755624 755928 755502 754666 753546 752267 751225 750653
60753 750653 749970 748072 744501 740059 735971 732588 729208 725055 720036 714435 708334 701737 695018 688744
60739 688744 682961 677064 670629 664166 658738 654877 652120 649706 647546 646282 646468 647901 649934 652259
$$ packed form
60838G45019j4320j3789j2988j1686j0018q471p456o848o093n002m043l631l445
60825F37229k986k417k182k089j597q95p61j308j769j791k022k929l915m109l528
60810F02931k811k324k147k467l319m194m433m019l469l134k901k510j842r48
60796E62413J8R55J955L028L775L825L655M273N919P664Q687R277J0095J1039
60782F36578J1550J1513J1139J0335Q984P601O870O652O232N495N075N225N337
60769G38586M809L760K598J491O38M25Q82J335J100L04m26q36j120j279j042n72
60753G50653o83j898l571m442m088l383l380m153n019n601o101o597o719o274
60739F88744n783n897o435o463n428l861k757k414k160j264J86J433K033K325
$$ plain form
60725 652259 655166 659091 664172 670248 677051 684278 691726 699546 708159 717741 727902 738079 748110
60712 748110 758209 768461 778597 788311 797639 806902 816240 825198 832877 838675 842904 846432 849716
60699 849716 852457 854295 855405 856137 856462 856272 856011 856439 857725 859197 860060 860062 859414 858431 857377 856362 855221
60682 855221 853647 851488 848752 845326 841003 835868 830295 824396 817812 810366 802677 795715 789829 784571
60668 784571 779518 774921 771360 769014 767524 766436 765562 764971 764913 765785 767824 770634 773232 774831 775523 775949
60652 775949 776409 776554 775890 774303 772072 769638 767339 765102 762386 758735 754378 749937 745564 740885 735860
60637 735860 731143 727297 724151 721297 718754 716629 714505 711717 708079 703832 699066 693706 687979 682348
60623 682348 676933 671357 665204 658345 650936 643396 636275 629701 623085 615872 608564 602477 598361 595704
$$ packed form
60725F52259K907L925N081O076O803P227P448P820Q613R582J0161J0177J0031
60712G48110J0099J0252J0136R714R328R263R338Q958P679N798M229L528L284
60699H49716K741J838J110P32L25j90k61M28J286J472Q63Ko48r83j054j015j141
60682H55221j574k159k736l426m323n135n573n899o584p446p689o962n886n258
60668G84571n053m597l561k346j490j088q74n91n8Q72K039K810K598J599O92M26
60652G75949M60J45o64j587k231k434k299k237k716l651m357m441m373m679n025
60637G35860m717l846l146k854k543k125k124k788l638m247m766n360n727n631
60623F82348n415n576o153o859p409p540p121o574o616p213p308o087m116k657
$$ plain form
60609 595704 593551 591626 590418 590483 591817 593738 595264 595871 595976 596496 597918 600023 602398 604819 607159
60594 607159 609420 612010 615473 619694 623753 626890 629307 631659 634089 636223 637987 639939 642656 646011
60580 646011 649180 651322 652350 653136 654822 657806 661495 665198 669013 673539 678902 684576 690215 696168
60566 696168 702890 710221 717741 725615 734432 744107 753517 761653 768766 775894 783450 790857 797542 803647
60552 803647 809547 815127 819939 823715 826362 827694 827615 826478 824839 822811 819919 815684 810097 803478 796058
60537 796058 787872 778947 769460 759663 749763 740033 731045 723556 717964 713991 711115 709133 708007 707363
60523 707363 706684 705972 705632 705577 705068 703715 702070 700893 700348 700314 700884 701958 702787 702723 702257 702643 704515 707399
60505 707399 710582 713885 717512 721521 725598 729217 732046 734344 736703 739236 741326 742517 743245 744272
$$ packed form
60609E95704k153j925j208O5J334J921J526O07J05N20J422K105K375K421K340
60594F07159K261K590L463M221M059L137K417K352K430K134J764J952K717L355
60580F46011L169K142J028P86J686K984L689L703L815M526N363N674N639N953
60566F96168O722P331P520P874Q817R675R410Q136P113P128P556P407O685O105
60552H03647N900N580M812L776K647J332p9j137j639k028k892m235n587o619p420
60537G96058q186q925r487r797r900r730q988p489n592l973k876j982j126o44
60523G07363o79p12l40n5n09j353j645j177n45l4N70J074Q29o4m66L86J872K884
60505G07399L183L303L627M009M077L619K829K298K359K533K090J191P28J027
$$ plain form
60491 744272 745762 747489 749602 752448 755749 758765 761407 764661 769785 777480 787825 800527 815158
60478 815158 831530 849936 870775 893993 919001 944782 969680 991558 1008906 1021611 1029986 1033322
60466 1033322 1030340 1021073 1007430 991774 975664 960095 946044 934252 925015 918573 915283 915176 917789
60453 917789 922662 929635 938477 948658 959678 971282 983386 996206 1010472 1026900 1045451 1065657
60441 1065657 1087752 1112856 1141973 1175499 1213816 1257633 1307516 1363776 1427040 1498174 1577298
60430 1577298 1663548 1756185 1855428 1962000 2076664 2200604 2335473 2482450 2641732 2813199
60420 2813199 2996512 3189429 3385995 3576621 3749461 3891781 3991552 4039714 4031846 3968224
60410 3968224 3853284 3695515 3506644 3299175 3083823 2868887 2660753 2463854 2280376
$$ packed form
60491G44272J490J727K113K846L301L016K642L254N124P695J0345J2702J4631
60478H15158J6372J8406K0839K3218K5008K5781K4898K1878J7348J2705Q375L336
60466A033322k982r267j3643j5656j6110j5569j4051j1792r237o442l290j07K613
60453I17789M873O973Q842J0181J1020J1604J2104J2820J4266J6428J8551K0206
60441A065657K2095K5104K9117L3526L8317M3817M9883N6260O3264P1134P9124
60430A577298Q6250R2637R9243J06572J14664J23940J34869J46977J59282J71467
60420B813199J83313J92917J96566J90626J72840J42320R9771M8162p868o3622
60410C968224j14940j57769j88871k07469k15352k14936k08134j96899j83478
$$ plain form
60401 2280376 2110988 1955948 1815162 1687791 1572730 1469484 1377902 1297220 1226040 1163077
60391 1163077 1107211 1056988 1010942 968552 930232 896219 866005 838942 814834 793636 774968
60380 774968 758104 742269 726937 712099 698177 685378 673218 660962 648457 636229 624914
60369 624914 614918 606422 599243 592732 586259 579820 573912 568898 564822 561647 559194 556930 554327 551533
60355 551533 549321 548306 548499 549601 551351 553528 555910 558388 560949 563565 566197 568901 571779 574916
60341 574916 578344 581850 584770 586425 587045 587900 590125 593742 598149 603069 608413 613595 617837 621145 624311
60326 624311 627859 631487 634536 636506 637039 636020 633946 631808 630374 629701 629378 628951 628078 626580 624530
60311 624530 622240 620183 618968 619098 620496 622422 624154 625602 627068 628691 630503 632741 635658 639187
$$ packed form
60401B280376j69388j55040j40786j27371j15061j03246r1582q0682p1180o2963
60391A163077n5866n0223m6046m2390l8320l4013l0214k7063k4108k1198j8668
60380G74968j6864j5835j5332j4838j3922j2799j2160j2256j2505j2228j1315
60369F24914r996q496p179o511o473o439n908n014m076l175k453k264k603k794
60355E51533k212j015J93J102J750K177K382K478K561K616K632K704K878L137
60341E74916L428L506K920J655O20Q55K225L617M407M920N344N182M242L308L166
60326F24311L548L628L049J970N33j019k074k138j434o73l23m27q73j498k050
60311F24530k290k057j215J30J398J926J732J448J466J623J812K238K917L529
$$ plain form
60297 639187 643133 647448 651952 656160 659954 664082 669323 675359 681297 687123 693770 701633 709931 717785
60283 717785 725182 732528 739858 746910 753476 759247 763727 766745 768830 770725 772709 774616 776352 778164
60269 778164 780459 783526 787345 791696 796480 801695 806858 810752 812330 811754 810046 807793 804731 800514
60255 800514 795157 788692 781220 773529 766825 761380 756117 750112 743973 739112 736077 734275 732979 731923
60241 731923 731033 730257 729746 729758 730306 731243 732648 734806 737789 741369 745288 749329 753157 756431 759120 761451
60225 761451 763544 765388 767211 769483 772441 775894 779655 783819 788354 792763 796632 800397 805020 810764
60211 810764 816794 822320 827710 833941 841214 848835 856551 865295 876201 889286 903622 918610 934616
60198 934616 952400 972329 994260 1017955 1043490 1071268 1101647 1134628 1170127 1208503 1250451
$$ packed form
60297F39187L946M315M504M208L794M128N241O036N938N826O647P863Q298P854
60283G17785P397P346P330P052O566N771M480L018K085J895J984J907J736J812
60269G78164K295L067L819M351M784N215N163L894J578n76j708k253l062m217
60255H00514n357o465p472p691o704n445n263o005o139m861l035j802j296j056
60241G31923q90p76n11J2N48R37J405K158K983L580L919M041L828L274K689K331
60225G61451K093J844J823K272K958L453L761M164M535M409L869L765M623N744
60211H10764O030N526N390O231P273P621P716Q744J0906J3085J4336J4988J6006
60198I34616J7784J9929K1931K3695K5535K7778L0379L2981L5499L8376M1948
$$ plain form
60187 1250451 1296252 1345589 1398368 1455266 1517087 1583945 1655529 1731781 1812665 1897560 1985629
60176 1985629 2076609 2170447 2266066 2361175 2453486 2541588 2624566 2701446 2771242 2832957 2885338
60165 2885338 2927188 2958259 2979343 2991173 2993845 2987731 2974402 2956039 2934246 2910051 2884816 2860389
60153 2860389 2838385 2819843 2805755 2797441 2796178 2802657 2817030 2839309 2869685 2908560 2956369 3013222
60141 3013222 3078583 3151327 3230187 3314141 3402262 3493087 3584202 3672629 3755731 3831695 3899142
60130 3899142 3956535 4002196 4034874 4054105 4060040 4053091 4033703 4002350 3959812 3907650 3848381 3784986
60118 3784986 3720174 3656131 3594726 3537699 3486684 3443241 3408825 3384524 3370906 3368218 3376599 3395896
60106 3395896 3425515 3464715 3512787 3568526 3629681 3693400 3757178 3818972 3876588 3927769 3971138
$$ packed form
60187A250451M5801M9337N2779N6898O1821O6858P1584P6252Q0884Q4895Q8069
60176A985629R0980R3838R5619R5109R2311Q8102Q2978P6880O9796O1715N2381
60165B885338M1850L1071K1084J1830K672o114j3329j8363k1793k4195k5235k4427
60153B860389k2004j8542j4088q314j263O479J4373K2279L0376L8875M7809N6853
60141C013222O5361P2744P8860Q3954Q8121R0825R1115Q8427Q3102P5964O7447
60130C899142N7393M5661L2678J9231N935o949j9388l1353m2538n2162n9269o3395
60118C784986o4812o4043o1405n7027n1015m3443l4416k4301j3618k688Q381J9297
60106C395896K9619L9200M8072N5739O1155O3719O3778O1794N7616N1181M3369
$$ plain form
60095 3971138 4006593 4034441 4054444 4066025 4069230 4065377 4056868 4046394 4036059 4027143 4020884 4019318
60083 4019318 4024977 4039769 4064587 4100064 4147235 4207270 4281094 4369616 4474042 4595533 4734683
60072 4734683 4891546 5066094 5258494 5469031 5697774 5943955 6205450 6479065 6761574
60063 6761574 7050289 7342433 7634099 7920052 8194523 8452129 8688237 8898862 9080465
60054 9080465 9229951 9344741 9422667 9461652 9459789 9416118 9331463 9208519 9051222 8864246
60044 8864246 8652879 8422955 8180737 7932801 7685666 7445048 7215434 7000546 6803911
60035 6803911 6628506 6475962 6346700 6240966 6159352 6102235 6069104 6058418 6067707 6093769 6133249
60024 6133249 6183233 6240958 6302913 6364637 6421590 6469962 6506758 6529753 6537643 6529936 6506481 6467350
$$ packed form
60095C971138L5455K7848K0003J1581L205l853q509j0474j0335q916o259j566
60083D019318N659J4792K4818L5477M7171O0035P3824Q8522J04426J21491J39150
60072D734683J56863J74548J92400K10537K28743K46181K61495K73615K82509
60063F761574K88715K92144K91666K85953K74471K57606K36108K10625J81603
60054I080465J49486J14790P7926L8985j863m3671q4655j22944j57297j86976
60044H864246k11367k29924k42218k47936k47135k40618k29614k14888j96635
60035F803911j75405j52544j29262j05734q1614n7117l3131j0686R289K6062L9480
60024F133249M9984N7725O1955O1724N6953M8372L6796K2995P890p707k3455l9131
$$ plain form
60012 6467350 6413169 6345137 6264540 6172476 6070018 5958236 5838043 5710559 5577724 5442128
60002 5442128 5306178 5171897 5041412 4916848 4799589 4690421 4590752 4502913 4428741 4368493
59992 4368493 4321673 4288324 4268842 4263119 4270739 4291782 4326531 4374400 4433741 4502782 4580179 4664501
59980 4664501 4753501 4844060 4932645 5015831 5090611 5154362 5204627 5239268 5257072 5258044 5242800 5211702
59968 5211702 5164713 5102073 5025003 4935891 4837890 4734295 4628194 4522571 4420222 4323101
59958 4323101 4231946 4147194 4070313 4003681 3949108 3907102 3877731 3861470 3858739 3869274 3892589
59947 3892589 3928805 3978580 4042397 4120167 4211186 4314175 4427629 4550321 4680941 4816904
59937 4816904 4953921 5087127 5212345 5326179 5425766 5509184 5575589 5624193 5653389 5661569 5648560
$$ packed form
60012F467350n4181o8032q0597r2064j02458j11782j20193j27484j32835j35596
60002E442128j35950j34281j30485j24564j17259j09168r9669q7839p4172o0248
59992D368493m6820l3349j9482n723P620K1043L4749M7869N9341O9041P7397Q4322
59980D664501Q9000R0559Q8585Q3186P4780O3751N0265L4641J7804R72j5244l1098
59968E211702m6989o2640p7070q9112r8001j03595j06101j05623j02349r7121
59958D323101r1155q4752p6881o6632n4573m2006k9371j6261k731J0535K3315
59947C892589L6216M9775O3817P7770R1019J02989J13454J22692J30620J35963
59937D816904J37017J33206J25218J13834R9587Q3418O6405M8604K9196Q180j3009
$$ plain form
59926 5648560 5615584 5564095 5495491 5411937 5316671 5213280 5105141 4995639 4888316 4786448
59916 4786448 4692713 4609325 4538197 4480807 4438020 4410086 4396746 4397482 4411903 4439822 4480796 4533730
59904 4533730 4597027 4668973 4747880 4832150 4920395 5011174 5102410 5191450 5276075 5355134 5427968
59893 5427968 5493732 5551753 5602193 5645775 5683183 5715363 5744162 5771949 5800646 5831843 5867858
59882 5867858 5912055 5967910 6038242 6125398 6231561 6358538 6507539 6679398 6874782 7093893
59872 7093893 7336033 7599378 7880900 8176252 8479703 8784106 9080933 9360602 9613152
59863 9613152 9828856 9998606 10114595 10171448 10167053 10102393 9981008 9808883 9594329 9346946
59853 9346946 9076177 8790665 8498581 8207774 7925189 7656217 7404661 7173291 6964356
$$ packed form
59926E648560l2976n1489o8604q3554r5266j03391j08139j09502j07323j01868
59916D786448r3735q3388p1128n7390m2787k7934j3340P36J4421K7919M0974N2934
59904D533730O3297P1946P8907Q4270Q8245R0779R1236Q9040Q4625P9059P2834
59893E427968O5764N8021N0440M3582L7408L2180K8799K7787K8697L1197L6015
59882E867858M4197N5855P0332Q7156J06163J26977J49001J71859J95384K19111
59872G093893K42140K63345K81522K95352L03451L04403K96827K79669K52550
59863I613152K15704J69750J15989N6853m395o4660j21385j72125k14554k47383
59853I346946k70769k85512k92084k90807k82585k68972k51556k31370k08935
$$ plain form
59844 6964356 6779620 6620058 6485784 6376658 6292936 6235041 6202729 6194891 6210188 6247298 6304330
59833 6304330 6378515 6466759 6565991 6672593 6781967 6888994 6988443 7074540 7140826 7181293 7191590
59822 7191590 7168915 7111470 7018944 6893372 6738784 6559993 6361976 6149818 5928424 5702296
59812 5702296 5475961 5254086 5040324 4836384 4643081 4462081 4295624 4144663 4008367
59803 4008367 3885610 3775924 3678681 3592329 3515163 3446302 3385259 3330924 3281463 3235124 3190843
59792 3190843 3148208 3107108 3067508 3029541 2993787 2961143 2932112 2906379 2883353 2862828 2844626
59781 2844626 2827832 2810962 2792785 2772481 2749148 2722006 2691237 2658009 2623415 2587813 2551382
59770 2551382 2514877 2479653 2447283 2419242 2396523 2379317 2367282 2360135 2357716 2359580 2365048 2373753
$$ packed form
59844F964356j84736j59562j34274j09126q3722n7895l2312p838J5297L7110N7032
59833F304330P4185Q8244R9232J06602J09374J07027R9449Q6097O6286M0467J0297
59822G191590k2675n7445r2526j25572j54588j78791j98017k12158k21394k26128
59812E702296k26335k21875k13762k03940j93303j81000j66457j50961j36296
59803D008367j22757j09686r7243q6352p7166o8861o1043n4335m9461m6339m4281
59792C190843m2635m1100l9600l7967l5754l2644k9031k5733k3026k0525j8202
59781B844626j6794j6870j8177k0304k3333k7142l0769l3228l4594l5602l6431
59770B551382l6505l5224l2370k8041k2719j7206j2035p147k419J864N468Q705
$$ plain form
59758 2373753 2385784 2401308 2420448 2443583 2471317 2504041 2541658 2583522 2628239 2673889 2719189
59747 2719189 2764378 2810228 2856114 2899852 2939605 2975173 3007124 3035491 3059893 3080400 3097616
59736 3097616 3112264 3125300 3138259 3152999 3171066 3193565 3221519 3255999 3297972 3348320 3408193
59725 3408193 3479291 3563627 3662872 3777899 3909103 4057177 4223285 4408377 4612697 4836150
59715 4836150 5078515 5338422 5611875 5891645 6167308 6425063 6648226 6819913 6927263
59706 6927263 6964612 6934225 6845105 6710494 6544548 6359701 6166204 5972902 5787117 5613791
59696 5613791 5455787 5315359 5194584 5094350 5014044 4952867 4910765 4887706 4882880 4895223 4924114
59685 4924114 4968906 5028394 5101546 5188509 5290289 5407607 5540622 5689611 5855375 6038907
$$ packed form
59758B373753J2031J5524J9140K3135K7734L2724L7617M1864M4717M5650M5300
59747B719189M5189M5850M5886M3738L9753L5568L1951K8367K4402K0507J7216
59736C097616J4648J3036J2959J4740J8067K2499K7954L4480M1973N0348N9873
59725C408193P1098Q4336R9245J15027J31204J48074J66108J85092K04320K23453
59715D836150K42365K59907K73453K79770K75663K57755K23163J71687J07350
59706F927263L7349l0387q9120j34611j65946j84847j93497j93302j85785j73326
59696E613791j58004j40428j20775j00234q0306o1177m2102k3059m826J2343K8891
59685D924114M4792N9488P3152Q6963J01780J17318J33015J48989J65764J83532
$$ plain form
59675 6038907 6240948 6461916 6702197 6962704 7245194 7551769 7883899 8242185 8627085
59666 8627085 9039348 9479462 9947004 10440705 10958568 11497334 12051978 12616157 13183132
59657 13183132 13746167 14298525 14834019 15348299 15839963 16310618 16763914 17204418 17637193
59648 17637193 18067907 18502330 18944850 19397206 19858537 20325823 20793519 21253053 21693678
59639 21693678 22104181 22473766 22792199 23050812 23244282 23371280 23433660 23435996 23386111 23294878
59629 23294878 23174480 23036807 22893465 22756382 22637490 22547776 22496625 22491632 22538730 22642790
59619 22642790 22808202 23038571 23335912 23700628 24132046 24627878 25182740 25787640 26430810
59610 26430810 27097797 27770027 28423928 29032079 29564968 29992242 30284842 30419092 30380651
$$ packed form
59675F038907K02041K20968K40281K60507K82490L06575L32130L58286L84900
59666H627085M12263M40114M67542M93701N17863N38766N54644N64179N66975
59657A3183132N63035N52358N35494N14280M91664M70655M53296M40504M32775
59648A7637193M30714M34423M42520M52356M61331M67286M67696M59534M40625
59639B1693678M10503L69585L18433K58613J93470J26998O2380K336m9885r1233
59629B3294878j20398j37673j43342j37083j18892q9714n1151m993M7098J04060
59619B2642790J65412K30369K97341L64716M31418M95832N54862O04900O43170
59610B6430810O66987O72230O53901O08151N32889M27274K92600J34250l8441
$$ plain form
59601 30380651 30165893 29781144 29241626 28570067 27794146 26943454 26047122 25132038 24221111
59592 24221111 23332244 22478518 21668516 20905870 20188727 19510005 18857951 18217002 17570436
59583 17570436 16905067 16215078 15502349 14774285 14041706 13317073 12612028 11935044 11291074
59574 11291074 10682915 10112381 9580572 9087936 8634308 8218548 7838348 7490929 7173890
59565 7173890 6885144 6622366 6383097 6165231 5967011 5786781 5623167 5475233 5341965
59556 5341965 5221808 5113084 5014478 4924595 4841453 4763029 4688000 4615322 4543371 4470269 4394836
59545 4394836 4316618 4235242 4150604 4063558 3975617 3887916 3801135 3716297 3634771 3557360 3484140
59534 3484140 3415335 3351700 3293830 3241806 3195788 3156346 3123782 3097591 3076958 3061501 3051277
$$ packed form
59601C0380651k14758l84749n39518o71559p75921q50692q96332r15084r10927
59592B4221111q88867q53726q10002p62646p17143o78722o52054o40949o46566
59583A7570436o65369o89989p12729p28064p32579p24633p05045o76984o43970
59574A1291074o08159n70534n31809m92636m53628m15760l80200l47419l17039
59565G173890k88746k62778k39269k17866j98220j80230j63614j47934j33268
59556E341965j20157j08724r8606q9883q3142p8424p5029p2678p1951p3102p5433
59545D394836p8218q1376q4638q7046q7941q7701q6781q4838q1526p7411p3220
59534C484140o8805o3635n7870n2024m6018l9442l2564k6191k0633j5457j0224
$$ plain form
59523 3051277 3046375 3046798 3052453 3062936 3077447 3095107 3115304 3137705 3162147 3188615 3217115 3247462
59511 3247462 3279271 3312293 3346788 3383572 3423768 3468394 3518108 3573386 3634900 3703511 3779873
59500 3779873 3864309 3957214 4059201 4170761 4292174 4424050 4567452 4722973 4890016 5067511
59490 5067511 5255134 5453261 5661826 5879691 6104889 6334863 6566466 6796465 7022291
59481 7022291 7241937 7453086 7652951 7839336 8011380 8168714 8309972 8432600 8534407
59472 8534407 8615284 8677370 8723740 8757203 8780359 8796354 8809025 8822292 8839681 8864308 8898755
59461 8898755 8944749 9003207 9074468 9157718 9249709 9344418 9434322 9511970 9570480 9603451 9605221
59450 9605221 9571274 9498352 9384620 9230169 9037180 8809471 8552044 8271009 7973166 7665219
$$ packed form
59523C051277m902M23N655J0483J4511J7660K0197K2401K4442K6468K8500L0347
59511C247462L1809L3022L4495L6784M0196M4626M9714N5278O1514O8611P6362
59500C779873Q4436R2905J01987J11560J21413J31876J43402J55521J67043J77495
59490E067511J87623J98127K08565K17865K25198K29974K31603K29999K25826
59481G022291K19646K11149J99865J86385J72044J57334J41258J22628J01807
59472H534407Q0877O2086M6370L3463K3156J5995J2671J3267J7389K4627L4447
59461H898755M5994N8458P1261Q3250R1991R4709Q9904P7648N8510L2971J770
59450I605221l3947p2922j13732j54451j92989k27709k57427k81035k97843l07947
$$ plain form
59440 7665219 7353579 7044761 6744934 6458453 6187418 5933115 5697326 5481750 5286919
59431 5286919 5112444 4957867 4822625 4705723 4606163 4523365 4456619 4404730 4366991 4343915
59421 4343915 4336116 4342966 4363326 4397143 4445210 4507585 4583401 4672215 4774443 4890332 5019340
59410 5019340 5160577 5312891 5474299 5641927 5812619 5983012 6149056 6306037 6449014
59401 6449014 6572649 6671069 6739034 6773416 6772893 6736584 6664304 6558238 6423000 6263497 6083613
59390 6083613 5887239 5679313 5464929 5248080 5031933 4819615 4613914 4416568 4228599
59381 4228599 4051142 3885394 3731908 3590383 3460063 3340081 3229616 3128163 3035693 2952449
59371 2952449 2878556 2813737 2757214 2707926 2665062 2628327 2597532 2572190 2551879 2536762 2527142
$$ packed form
59440G665219l11640l08818k99827k86481k71035k54303k35789k15576j94831
59431E286919j74475j54577j35242j16902r9560q2798o6746n1889l7739k3076
59421D343915p799O850K0360L3817M8067O2375P5816Q8814J02228J15889J29008
59410E019340J41237J52314J61408J67628J70692J70393J66044J56981J42977
59401F449014J23635R8420O7965L4382n23l6309p2280j06066j35238j59503j79884
59390F083613j96374k07926k14384k16849k16147k12318k05701j97346j87969
59381D228599j77457j65748j53486j41525j30320j19982j10465j01453r2470q3244
59371B952449p3893o4819n6523m9288m2864l6735l0795k5342k0311j5117r620
$$ plain form
59360 2527142 2522556 2521865 2524248 2529643 2538191 2549811 2564541 2582934 2605930 2634249 2667439 2703083
59348 2703083 2737442 2767852 2794732 2820990 2849794 2883316 2922927 2969323 3022511 3082708 3151184
59337 3151184 3229035 3314975 3405605 3498491 3594243 3695434 3804686 3924427 4057299 4205619
59327 4205619 4370694 4553391 4755035 4977262 5221462 5488888 5780835 6098110 6440622
59318 6440622 6807895 7199409 7613669 8047031 8493923 8948008 9402709 9850945 10285212
59309 10285212 10698487 11085297 11442259 11767776 12061086 12321532 12548862 12743952 12908555
59300 12908555 13044041 13150664 13227957 13275076 13290556 13272393 13218870 13129000 13002135 12838009
59290 12838009 12637822 12404908 12143804 11858884 11553987 11232618 10897739 10551520 10195814
$$ packed form
59360B527142m586o91K383N395Q548J1620J4730J8393K2996K8319L3190L5644
59348B703083L4359L0410K6880K6258K8804L3522L9611M6396N3188O0197O8476
59337C151184P7851Q5940R0630R2886R5752J01191J09252J19741J32872J48320
59327D205619J65075J82697K01644K22227K44200K67426K91947L17275L42512
59318F440622L67273L91514M14260M33362M46892M54085M54701M48236M34267
59309A0285212M13275L86810L56962L25517K93310K60446K27330J95090J64603
59300A2908555J35486J06623P7293M7119J5480j8163n3523q9870j26865j64126
59290A2838009k00187k32914k61104k84920l04897l21369l34879l46219l55706
$$ plain form
59281 10195814 9832771 9464826 9094489 8724594 8358445 7999295 7649843 7312494 6989702
59272 6989702 6683578 6395303 6125298 5873762 5640774 5426166 5229660 5050986 4889548
59263 4889548 4744267 4614076 4498439 4397075 4309369 4234315 4170790 4117631 4073740 4038534
59253 4038534 4012166 3994927 3986482 3985887 3992108 4004251 4021448 4042885 4067891 4095785 4125676 4156589
59241 4156589 4187683 4218209 4247356 4274368 4298826 4320764 4340505 4358284 4373896 4386892 4397434
59230 4397434 4406881 4417163 4429572 4444566 4462662 4484976 4512794 4547190 4589257 4640133 4700364
59219 4700364 4769578 4847033 4932069 5023711 5120199 5219402 5319508 5418867 5515145 5604802 5683481
59208 5683481 5747045 5792647 5819124 5826414 5814960 5786015 5742238 5687154 5623793 5554297 5480920
$$ packed form
59281A0195814l63043l67945l70337l69895l66149l59150l49452l37349l22792
59272F989702l06124k88275k70005k51536k32988k14608j96506j78674j61438
59263D889548j45281j30191j15637j01364q7706p5054o3525n3159m3891l5206
59253D038534k6368j7239q445n95O221J2143J7197K1437K5006K7894K9891L0913
59241D156589L1094L0526K9147K7012K4458K1938J9741J7779J5612J2996J0542
59230D397434R447J0282J2409J4994J8096K2314K7818L4396M2067N0876O0231
59219D700364O9214P7455Q5036R1642R6488R9203J00106R9359R6278Q9657P8679
59208E683481O3564M5602K6477P290j1454k8945m3777n5084o3361o9496p3377
$$ plain form
59197 5480920 5406597 5334071 5264904 5199752 5139165 5083688 5033484 4988315 4947730 4911037 4877331
59186 4877331 4845928 4816665 4789629 4764813 4742254 4722288 4705511 4692609 4684375 4681771 4685980 4698505
59174 4698505 4721059 4755045 4801363 4861139 4936366 5029205 5140826 5271666 5422596 5594796
59164 5594796 5788270 6001388 6232048 6478091 6735945 6999675 7262030 7515654 7752645
59155 7752645 7963842 8139810 8272520 8355702 8384316 8355006 8267308 8123978 7930201 7692837
59145 7692837 7420062 7120810 6804007 6478090 6150714 5828309 5515757 5216527 4932972
59136 4932972 4666511 4418041 4188378 3977960 3786081 3611027 3451318 3306300 3175356
59127 3175356 3057262 2950792 2855306 2770060 2693448 2623653 2559785 2501851 2449912 2403812 2363388
$$ packed form
59197E480920p4323p2526o9167o5152o0587n5477n0204m5169m0585l6693l3706
59186D877331l1403k9263k7036k4816k2559j9966j6777j2902q234k604M209J2525
59174D698505K2554L3986M6318N9776P5227R2839J11621J30840J50930J72200
59164E594796J93474K13118K30660K46043K57854K63730K62355K53624K36991
59155G752645K11197J75968J32710Q3182K8614k9310q7698j43330j93777k37364
59145G692837k72775k99252l16803l25917l27376l22405l12552k99230k83555
59136D932972k66461k48470k29663k10418j91879j75054j59709j45018j30944
59127C175356j18094j06470r5486q5246p6612o9795o3868n7934n1939m6100m0424
$$ plain form
59116 2363388 2328292 2297767 2271159 2248545 2230456 2217041 2207822 2202092 2199277 2199211 2202337 2209325 2220180
59103 2220180 2234064 2250319 2269242 2291580 2317653 2347350 2380424 2416284 2454033 2493385 2535242
59092 2535242 2580721 2629765 2681200 2733820 2786849 2839606 2891442 2942005 2991040 3037801 3080946
59081 3080946 3119075 3151339 3177750 3199028 3215832 3228005 3234914 3236603 3234158 3228864 3221692 3213788
59069 3213788 3206668 3201413 3198329 3197849 3201064 3208894 3221521 3239303 3263493 3295271 3334757 3381767 3436838
59056 3436838 3500539 3572404 3651670 3738668 3834376 3939006 4052203 4174350 4306309 4447760
59046 4447760 4596891 4751889 4911665 5074823 5238840 5400534 5556467 5702355 5832677
59037 5832677 5941482 6023575 6075139 6093939 6079430 6032519 5955196 5850465 5722255 5574693
$$ packed form
59116B363388l5096l0525k6608k2614j8089j3415r219n730k815o6L126O988J0855
59103B220180J3884J6255J8923K2338K6073K9697L3074L5860L7749L9352M1857
59092B535242M5479M9044N1435N2620N3029N2757N1836N0563M9035M6761M3145
59081C080946L8129L2264K6411K1278J6804J2173O909J689k445n294p172p904
59069C213788p120n255l084m80L215P830J2627J7782K4190L1778L9486M7010N5071
59056C436838O3701P1865P9266Q6998R5708J04630J13197J22147J31959J41451
59046D447760J49131J54998J59776J63158J64017J61694J55933J45888J30322
59037E832677J08805Q2093N1564J8800j4509m6911p7323j04731j28210j47562
$$ plain form
59027 5574693 5411344 5235442 5050632 4860902 4669733 4479660 4292553 4109820 3932373
59018 3932373 3760815 3595668 3437291 3285905 3142094 3006793 2880236 2761304 2648656
59009 2648656 2542200 2442671 2350072 2263503 2182419 2106991 2037036 1971557 1909735 1851666 1797691
58998 1797691 1747539 1700557 1656370 1614896 1575981 1539345 1504759 1472118 1441407 1412573 1385228
58987 1385228 1358588 1332051 1305816 1280616 1256824 1234141 1212200 1191096 1171176 1152452 1134451
58976 1134451 1116727 1099532 1083858 1070548 1059427 1049585 1040439 1032139 1024991 1019168 1015046 1013060 1012894
58963 1012894 1013511 1014365 1015846 1018180 1020694 1022797 1024857 1027350 1029794 1031432 1032412 1033414 1034607 1035838 1037470
58948 1037470 1040048 1043476 1047349 1051770 1056964 1062434 1067514 1072490 1078199 1084729 1091467 1098260 1105497 1113111
$$ packed form
59027E574693j63349j75902j84810j89730j91169j90073j87107j82733j77447
59018C932373j71558j65147j58377j51386j43811j35301j26557j18932j12648
59009B648656j06456r9529r2599q6569q1084p5428o9955o5479o1822n8069n3975
58998A797691n0152m6982m4187m1474l8915l6636l4586l2641l0711k8834k7345
58987A385228k6640k6537k6235k5200k3792k2683k1941k1104j9920j8724j8001
58976A134451j7724j7195j5674j3310j1121r842r146q300p148n823m122j986j66
58963A012894O17Q54J481K334K514K103K060K493K444J638R80J002J193J231J632
58948A037470K578L428L873M421N194N470N080M976N709O530O738O793P237P614
$$ plain form
58934 1113111 1120507 1127568 1134815 1142503 1150391 1158554 1167642 1178069 1189484 1201173 1212605 1223664 1234795
58921 1234795 1246734 1259714 1273219 1286957 1301476 1317178 1333311 1348852 1363961 1379675 1396642
58910 1396642 1415104 1435609 1458520 1483109 1508304 1534137 1561343 1589837 1618845 1648355 1679091
58899 1679091 1711139 1743954 1777757 1813509 1851311 1890139 1929499 1970189 2013221 2059038 2107983
58888 2107983 2160322 2215602 2273207 2333819 2399159 2470012 2545671 2625545 2709992 2799261 2893098
58877 2893098 2992028 3097759 3211550 3333280 3462727 3600617 3747733 3904197 4070526 4248359
58867 4248359 4439181 4643237 4860715 5093248 5343263 5612416 5901565 6211725 6544182
58858 6544182 6899982 7280032 7685353 8116589 8573579 9055717 9562046 10090202 10635573
$$ packed form
58934A113111P396P061P247P688P888Q163R088J0427J1415J1689J1432J1059J1131
58921A234795J1939J2980J3505J3738J4519J5702J6133J5541J5109J5714J6967
58910A396642J8462K0505K2911K4589K5195K5833K7206K8494K9008K9510L0736
58899A679091L2048L2815L3803L5752L7802L8828L9360M0690M3032M5817M8945
58888B107983N2339N5280N7605O0612O5340P0853P5659P9874Q4447Q9269R3837
58877B893098R8930J05731J13791J21730J29447J37890J47116J56464J66329J77833
58867D248359J90822K04056K17478K32533K50015K69153K89149L10160L32457
58858F544182L55800L80050M05321M31236M56990M82138N06329N28156N45371
$$ plain form
58849 10635573 11191972 11752635 12309848 12853808 13372387 13851911 14278172 14637461 14917673
58840 14917673 15109002 15204348 15200182 15097640 14902356 14622900 14269557 13854222 13390073 12890294
58830 12890294 12367011 11831280 11293122 10760974 10241488 9740012 9260709 8806071 8377053
58821 8377053 7974066 7597275 7245945 6918439 6613259 6329363 6065216 5818454 5587011
58812 5587011 5369900 5166506 4975920 4797412 4630794 4475798 4331764 4198291 4075412
58803 4075412 3962624 3858532 3761980 3672804 3591061 3516341 3448406 3387588 3333851 3286244 3244036
58792 3244036 3207709 3178055 3154950 3137779 3126466 3121264 3122017 3128480 3141013 3160257 3186377 3219202
58780 3219202 3258710 3304747 3356672 3413966 3476937 3546335 3622558 3705732 3796219 3894575 4001279
$$ packed form
58849A0635573N56399N60663N57213N43960N18579M79524M26261L59289K80212
58840A4917673J91329R5346m166j02542j95284k79456l53343m15335m64149m99779
58830A2890294n23283n35731n38158n32148n19486n01476m79303m54638m29018
58821H377053m02987l76791l51330l27506l05180k83896k64147k46762k31443
58812E587011k17111k03394j90586j78508j66618j54996j44034j33473j22879
58803D075412j12788j04092r6552q9176q1743p4720o7935o0818n3737m7607m2208
58792C244036l6327k9654k3105j7171j1313n202P53O463J2533J9244K6120L2825
58780C219202L9508M6037N1925N7294O2971O9398P6223Q3174R0487R8356J06704
$$ plain form
58769 4001279 4116902 4242198 4377679 4523444 4679816 4847792 5028607 5223357 5433327
58760 5433327 5660127 5905072 6168921 6452672 6758054 7086783 7439817 7817837 8221927
58751 8221927 8653037 9110829 9593250 10096879 10617272 11149083 11685804 12218913 12737143
58742 12737143 13227091 13674763 14066412 14388540 14628712 14777393 14829004 14781690 14637264 14401697
58732 14401697 14084578 13697341 13252294 12762830 12242740 11704134 11156502 10608032 10066710
58723 10066710 9539445 9031052 8544778 8083052 7647105 7236774 6851558 6491284 6155236
58714 6155236 5841502 5547982 5273471 5017194 4777935 4554213 4344675 4147890 3962515
58705 3962515 3788153 3625228 3473536 3331750 3198771 3074483 2958627 2850123 2748293
$$ packed form
58769D001279J15623J25296J35481J45765J56372J67976J80815J94750K09970
58760E433327K26800K44945K63849K83751L05382L28729L53034L78020M04090
58751H221927M31110M57792M82421N03629N20393N31811N36721N33109N18230
58742A2737143M89948M47672L91649L22128K40172J48681N1611m7314j44426k35567
58732A4401697l17119l87237m45047m89464n20090n38606n47632n48470n41322
58723A0066710n27265n08393m86274m61726m35947m10331l85216l60274l36048
58714F155236l13734k93520k74511k56277k39259k23722k09538j96785j85375
58705C962515j74362j62925j51692j41786j32979j24288j15856j08504j01830
$$ plain form
58696 2748293 2653622 2566349 2485292 2409044 2337437 2270877 2209145 2151863 2099263 2051374 2007190
58685 2007190 1965694 1926988 1891425 1858373 1826931 1797111 1769220 1742803 1717365 1693445 1671666
58674 1671666 1651245 1630712 1609738 1589103 1569243 1549975 1531296 1513274 1495288 1476343 1455950
58663 1455950 1433994 1410165 1384467 1357919 1331752 1306109 1280295 1254023 1227647 1201533 1175904
58652 1175904 1150974 1126643 1102511 1078756 1056359 1035827 1016457 997542 979474 962768 946890
58641 946890 931124 915872 901953 889233 877046 865328 854263 843391 832182 820965 810238
58630 810238 799696 789053 779127 770889 764022 757642 751870 747389 743979 740867 738080 736050 734234 731545
58616 731545 727987 724639 722188 720617 720017 720425 721000 720560 718972 717072 715388 713853 712495 711404 710265
$$ packed form
58696B748293r4671q7273q1057p6248p1607o6560o1732n7282n2600m7889m4184
58685B007190m1496l8706l5563l3052l1442k9820k7891k6417k5438k3920k1779
58674A671666k0421k0533k0974k0635j9860j9268j8679j8022j7986j8945k0393
58663A455950k1956k3829k5698k6548k6167k5643k5814k6272k6376k6114k5629
58652A175904k4930k4331k4132k3755k2397k0532j9370j8915j8068j6706j5878
58641I46890j5766j5252j3919j2720j2187j1718j1065j0872j1209j1217j0727
58630H10238j0542j0643r926q238o867o380n772m481l410l112k787k030j816k689
58616G31545l558l348k451j571o00M08N75m40j588j900j684j535j358j091j139
$$ plain form
58601 710265 708833 707608 707216 707556 708302 709663 711728 713834 715651 718166 722421 727979 733869 740262 747839
58586 747839 756247 764778 774009 785215 798597 813542 830062 848464 868191 888700 910992 936487
58574 936487 964778 994307 1024912 1057814 1093329 1130661 1169961 1212608 1259281 1309581 1363765
58563 1363765 1423096 1488201 1558827 1635552 1720012 1813007 1913945 2022573 2139749 2266051
58553 2266051 2401052 2544351 2695816 2854217 3016764 3180308 3341614 3496116 3637734
58544 3637734 3760569 3859878 3931443 3971636 3978888 3954140 3899536 3817779 3712968 3590648 3456276
58533 3456276 3314343 3168946 3023915 2881882 2744248 2612427 2488193 2372584 2265496
58524 2265496 2166597 2075712 1992272 1915553 1845690 1783363 1728186 1678390 1632356 1589582 1550052
$$ packed form
58601G10265j432j225l92L40P46J361K065K106J817K515M255N558N890O393P577
58586G47839Q408Q531R231J1206J3382J4945J6520J8402J9727K0509K2292K5495
58574I36487K8291K9529L0605L2902L5515L7332L9300M2647M6673N0300N4184
58563A363765N9331O5105P0626P6725Q4460R2995J00938J08628J17176J26302
58553B266051J35001J43299J51465J58401J62547J63544J61306J54502J41618
58544C637734J22835R9309P1565M0193P252k4748n4604q1757j04811j22320j34372
58533C456276j41933j45397j45031j42033j37634j31821j24234j15609j07088
58524B265496r8899r0885q3440p6719o9863o2327n5177m9796m6034m2774l9530
$$ plain form
58513 1550052 1513592 1479934 1448503 1418099 1387624 1357125 1327412 1298945 1271911 1246720 1223203
58502 1223203 1199835 1175233 1150028 1125853 1102862 1079837 1056341 1033014 1010038 987240 965526
58491 965526 946240 928986 911998 894816 878676 864093 850078 836203 823475 812520 802594 793050
58479 793050 784237 776351 768847 761553 755013 749278 743646 737952 732796 728285 723877 719605 715919 712245
58465 712245 707371 701432 695752 690486 684174 676030 666895 657538 647755 637613 627882 618734 609616 600765
58451 600765 593190 586820 580449 573829 567984 563116 558215 553260 549753 548354 547822 547009 546065 545109 543618
58436 543618 541797 540625 539875 538089 535267 533495 533970 535388 536193 536483 536638 536088 534693 533631 533692 534132
58420 534132 534237 534449 535092 535583 535838 536814 538798 540741 542045 543267 544361 544129 542312 540315 538913 537174
$$ packed form
58513A550052l6460l3658l1431l0404l0475l0499k9713k8467k7034k5191k3517
58502A223203k3368k4602k5205k4175k2991k3025k3496k3327k2976k2798k1714
58491I65526j9286j7254j6988j7182j6140j4583j4015j3875j2728j0955r926r544
58479G93050q813p886p504p294o540n735n632n694n156m511m408m272l686l674
58465G12245m874n939n680n266o312q144r135r357r783j0142r731r148r118q851
58451F00765p575o370o371o620n845m868m901m955l507j399n32q13r44r56j491
58436E43618j821j172p50j786k822j772M75J418Q05K90J55n50j395j062O1M40
58420E34132J05K12O43M91K55R76J984J943J304J222J094k32j817j997j402j739
$$ plain form
58404 537174 534569 532104 530295 528042 524714 521411 519012 516825 514311 512129 510361 507727 503892 500464
58390 500464 498343 496105 492452 488268 484711 481249 477195 473351 470486 467914 465143 463113 462250 461139
58376 461139 458766 456318 455125 454570 453715 453164 453523 453736 452854 451950 452429 453867 455184 456537 458408 460252
58360 460252 461605 463121 465109 466673 467726 470054 474779 480518 485698 490878 497034 503344 508600 513266
58346 513266 518325 523601 528833 534752 541427 547265 551303 554727 558525 561570 562836 563481 564790 566058
58332 566058 566518 567398 569909 573045 575536 578135 581885 586044 589914 594707 601211 607492 611342 613204 614289
58317 614289 613863 611150 608112 607349 608589 609918 611113 613141 615767 618335 621738 627072 633433 639334 645041
58302 645041 651312 657248 661675 665251 668973 672116 673834 675195 677359 679425 680301 680898 682203 683132 682701
$$ packed form
58404E37174k605k465j809k253l328l303k399k187k514k182j768k634l835l428
58390E00464k121k238l653m184l557l462m054l844k865k572k771k030q63j111
58376D61139k373k448j193n55q55n51L59K13q82r04M79J438J317J353J871J844
58360D60252J353J516J988J564J053K328M725N739N180N180O156O310N256M666
58346E13266N059N276N232N919O675N838M038L424L798L045J266O45J309J268
58332E66058M60Q80K511L136K491K599L750M159L870M793O504O281L850J862J085
58317F14289m26k713l038p63J240J329J195K028K626K568L403N334O361N901N707
58302F45041O271N936M427L576L722L143J718J361K164K066Q76N97J305R29m31
$$ plain form
58287 682701 682317 683363 684652 684906 685594 688461 692415 695847 699821 705799 712359 717558 722555 729497 737707
58272 737707 745430 753433 763309 773940 783244 791828 801490 811797 821572 831887 844011 856269 866659
58259 866659 876642 888461 900595 910030 917343 925359 934317 942604 950812 960790 971882 982180 992284
58246 992284 1003982 1016587 1028447 1040495 1054355 1068709 1081639 1094637 1109947 1125957 1139875
58235 1139875 1153047 1168704 1186215 1202602 1218109 1235096 1252990 1269621 1286134 1305290 1326253
58224 1326253 1346488 1367387 1392436 1421003 1449597 1478161 1509490 1543493 1577752 1612723 1650670
58213 1650670 1690495 1729423 1768713 1811766 1857695 1902820 1947382 1994530 2043793 2092176 2140861
58202 2140861 2194160 2252426 2312432 2374058 2440123 2510417 2582623 2658273 2741091 2830365 2922753
$$ packed form
58287F82701l84J046J289K54O88K867L954L432L974N978O560N199M997O942Q210
58272G37707P723Q003R876J0631R304Q584R662J0307R775J0315J2124J2258J0390
58259H66659R983J1819J2134R435P313Q016Q958Q287Q208R978J1092J0298J0104
58246I92284J1698J2605J1860J2048J3860J4354J2930J2998J5310J6010J3918
58235A139875J3172J5657J7511J6387J5507J6987J7894J6631J6513J9156K0963
58224A326253K0235K0899K5049K8567K8594K8564L1329L4003L4259L4971L7947
58213A650670L9825L8928L9290M3053M5929M5125M4562M7148M9263M8383M8685
58202B140861N3299N8266O0006O1626O6065P0294P2206P5650Q2818Q9274R2388
$$ plain form
58191 2922753 3019468 3124494 3237060 3353493 3475358 3607859 3751301 3902144 4061315 4232948
58181 4232948 4415996 4605843 4803406 5013966 5238177 5473378 5722328 5990819 6277879
58172 6277879 6578620 6895588 7236561 7602291 7987738 8394374 8829313 9293254 9782023
58163 9782023 10299522 10856054 11454238 12090188 12768270 13500223 14289659 15132231 16030951
58154 16030951 16995469 18026378 19117461 20274290 21513534 22844253 24269518 25807381
58146 25807381 27490270 29343578 31387503 33661657 36225725 39137528 42458271 46279390
58138 46279390 50712890 55853601 61783694 68612119 76465761 85436804 95582890 106983179
58130 106983179 119759185 134086177 150281687 168773466 189558858 211295790 230962185
$$ packed form
58191B922753R6715J05026J12566J16433J21865J32501J43442J50843J59171J71633
58181D232948J83048J89847J97563K10560K24211K35201K48950K68491K87060
58172F277879L00741L16968L40973L65730L85447M06636M34939M63941M88769
58163I782023N17499N56532N98184O35950O78082P31953P89436Q42572Q98720
58154A6030951R64518J030909J091083J156829J239244J330719J425265J537863
58146B5807381J682889J853308K043925K274154K564068K911803L320743L821119
58138D6279390M433500N140711N930093O828425P853642Q971043J0146086J1400289
58130A06983179J2776006J4326992J6195510J8491779K0785392K1736932J9666395
$$ plain form
58123 230962185 244852448 250386720 247274227 237196371 222585548 205617505 187875745
58116 187875745 170401098 153797779 138356186 124204731 111405338 99959848 89809684
58109 89809684 80875586 73085863 66362005 60605981 55717014 51605340 48184015 45366623
58101 45366623 43083647 41289582 39947167 39015563 38464102 38292677 38518034 39102602 39858181
58092 39858181 40420476 40373301 39462524 37719969 35392372 32769681 30076896 27467524 25040699
58083 25040699 22839897 20863608 19097230 17528612 16137478 14893914 13776333 12777585
58075 12777585 11889680 11096581 10385391 9750438 9181910 8663105 8183152 7741058 7333806
58066 7333806 6951850 6589914 6251184 5936860 5641517 5362148 5101909 4861377 4635384
$$ packed form
58123B30962185J3890263N534272l112493j0077856j4610823j6968043j7741760
58116A87875745j7474647j6603319j5441593j4151455j2799393j1445490j0150164
58109H9809684q934098p789723o723858n756024m888967m111674l421325k817392
58101D5366623k282976j794065j342415r31604n51461j71425K25357N84568P55579
58092C9858181N62295m7175r10777j742555k327597k622691k692785k609372k426825
58083B5040699k200802j976289j766378j568618j391134j243564j117581r98748
58075A2777585q87905p93099p11190o34953n68528n18805m79953m42094m07252
58066G333806l81956l61936l38730l14324k95343k79369k60239k40532k25993
$$ plain form
58057 4635384 4421812 4224463 4043932 3874380 3712449 3560718 3419186 3281896 3145577
58048 3145577 3013540 2887617 2764066 2640983 2522178 2410072 2301893 2196422 2097497 2007249
58038 2007249 1922512 1841405 1767018 1701076 1640285 1582410 1529797 1483400 1439397 1395364 1354048
58027 1354048 1317372 1282326 1246509 1212330 1181849 1152565 1122175 1092719 1066116 1040045 1012140
58016 1012140 984229 958776 934856 911011 888417 868040 848152 827661 808510 792053 776504
58005 776504 760558 745950 733895 722647 711210 701761 695621 690356 683602 676408 670162 663674 656077
57992 656077 649213 644307 639429 633014 626740 622220 617985 612581 607601 604715 602509 599210 595897 594160
57978 594160 593071 591261 589687 589640 590217 590282 590731 592456 594134 594385 594013 593992 593423 591617 589933 589388 588600
$$ packed form
58057D635384k13572j97349j80531j69552j61931j51731j41532j37290j36319
58048C145577j32037j25923j23551j23083j18805j12106j08179j05471r8925r0248
58038B007249q4737q1107p4387o5942o0791n7875n2613m6397m4003m4033m1316
58027A354048l6676l5046l5817l4179l0481k9284l0390k9456k6603k6071k7905
58016A012140k7911k5453k3920k3845k2594k0377j9888k0491j9151j6457j5549
58005G76504j5946j4608j2055j1248j1437r449o140n265o754p194o246o488p597
57992F56077o864m906m878o415o274m520m235n404m980k886k206l299l313j737
57978E94160j089j810j574m7N77O5M49J725J678K51l72k1n69j806j684n45p88
$$ plain form
57961 588600 586208 583145 580501 577433 573233 569207 566291 563081 558303 552997 548112 542329 534616 526722
57947 526722 520629 515523 509691 503495 498119 493159 487831 482875 479081 475549 471515 468226 466923 466632
57933 466632 465954 465262 465113 464326 461860 458908 456936 455273 452883 450904 451086 453004 455000 456671 458393
57918 458393 459641 459820 459707 460244 460938 460940 460480 459818 458287 455787 453575 452051 449613 445379 441160 438850
57902 438850 437733 436317 434928 434273 433254 430641 427407 424996 422684 418969 414267 409891 405630 400722
57888 400722 396133 393446 392389 391651 391237 391926 393348 394669 396264 398665 400851 401674 401978 403183 404660
57873 404660 404705 403279 401626 399824 396826 392429 387313 381751 376024 371335 368460 366259 363308 360153 358094
57858 358094 356704 354668 352240 350716 350091 349409 348905 349711 351847 354423 357380 361152 365148 368523 371936
$$ packed form
57961E88600k392l063k644l068m200m026k916l210m778n306m885n783p713p894
57947E26722o093n106n832o196n376m960n328m956l794l532m034l289j303k91
57933D66632o78o92j49p87k466k952j972j663k390j979J82J918J996J671J722
57918D58393J248J79j13N37O94Km60o62j531k500k212j524k438m234m219k310
57902D38850j117j416j389o55j019k613l234k411k312l715m702m376m261m908
57888D00722m589k687j057p38m14O89J422J321J595K401K186Q23L04J205J477
57873D04660M5j426j653j802k998m397n116n562n727m689k875k201k951l155k059
57858C58094j390k036k428j524o25o82n04Q06K136K576K957L772L996L375L413
$$ plain form
57843 371936 376513 381496 385043 387057 389203 392240 395246 397414 398713 398846 397339 394777 392341 390133
57829 390133 387392 384160 381094 377797 373068 366962 361108 356762 353775 351535 349689 347871 345793 343680
57815 343680 341852 340137 338473 337535 337792 338604 339320 340568 343202 346660 349666 351966 354129 356317 358572
57800 358572 361567 365607 369545 372137 373767 375410 376712 376776 376018 375370 374256 371402 367205 363351 360284
57785 360284 356931 352822 348653 344734 340591 336153 331818 327399 322440 317470 313500 310403 307215 303832
57771 303832 300888 298180 294841 290985 287573 284625 281015 276090 270185 263664 256797 250411 245253 240800
57757 240800 235976 230850 226326 222550 219027 215924 213722 211907 209641 207369 206119 205541 204443 202999
57743 202999 202523 203199 203992 204819 206817 210214 213866 217198 220884 225180 229256 232546 235256 237222 237823
$$ packed form
57843C71936M577M983L547K014K146L037L006K168J299J33j507k562k436k208
57829C90133k741l232l066l297m729o106n854m346k987k240j846j818k078k113
57815C43680j828j715j664r38K57Q12P16J248K634L458L006K300K163K188K255
57800C58572K995M040L938K592J630J643J302O4p58o48j114k854m197l854l067
57785C60284l353m109m169l919m143m438m335m419m959m970l970l097l188l383
57771C03832k944k708l339l856l412k948l610m925n905o521o867o386n158m453
57757B40800m824n126m524l776l523l103k202j815k266k272j250n78j098j444
57743B02999m76O76P93Q27J998L397L652L332L686M296M076L290K710J966O01
$$ plain form
57728 237823 237410 237307 238054 238971 239724 240869 242564 244139 245236 246103 246632 246383 245583 244715 243219 240178 236226
57711 236226 232982 230610 227828 224457 221912 220739 219741 218180 216894 216452 215998 214839 213590 212884 212447
57696 212447 212290 213318 215840 218842 221548 224391 227638 230471 232399 234319 237161 240562 243748 246703
57682 246703 249772 253080 257016 262093 267728 272350 275476 278485 282614 287427 292047 296573 301280 305618
57668 305618 309150 312580 316834 321907 327512 334073 342077 351105 360339 369544 378958 388761 399173 410468
57654 410468 422601 435484 449665 465726 482867 499406 515048 531283 549135 568052 587746
57643 587746 609451 634250 661425 689722 719208 750797 784879 821573 861473 905041 951968
57632 951968 1002110 1056392 1115927 1180960 1251563 1328619 1413254 1505943 1606944 1716792 1835574
$$ packed form
57728B37823m13j03P47R17P53J145J695J575J097Q67N29k49q00q68j496l041l952
57711B36226l244k372k782l371k545j173r98j561j286m42m54j159j249p06m37
57696B12447j57J028K522L002K706K843L247K833J928J920K842L401L186K955
57682B46703L069L308L936N077N635M622L126L009M129M813M620M526M707M338
57668C05618L532L430M254N073N605O561Q004R028R234R205R414R803J0412J1295
57654D10468J2133J2883J4181J6061J7141J6539J5642J6235J7852J8917J9694
57643E87746K1705K4799K7175K8297K9486L1589L4082L6694L9900M3568M6927
57632I51968N0142N4282N9535O5033P0603P7056Q4635R2689J01001J09848J18782
$$ plain form
57621 1835574 1962439 2096569 2237679 2384605 2534158 2682163 2824801 2958089 3077190
57612 3077190 3177674 3257138 3314871 3350832 3366008 3362789 3343245 3306846 3250715 3172077 3070336
57601 3070336 2947945 2810503 2665507 2519716 2377459 2241460 2114205 1997568 1891919
57592 1891919 1796725 1711656 1636340 1569763 1511011 1460191 1417698 1382959 1354664 1331737 1313327
57581 1313327 1298524 1287050 1279750 1277508 1280151 1287159 1298679 1314824 1334733 1357663 1384534 1417184
57569 1417184 1456397 1501819 1553408 1611659 1676600 1747861 1825736 1911017 2003682 2102659 2206763
57558 2206763 2314748 2424300 2532018 2634559 2728903 2811365 2877314 2922442 2943917 2940422 2912008
57547 2912008 2860405 2788887 2701291 2601156 2491714 2376184 2257712 2139071 2022386 1909011
$$ packed form
57621A835574J26865J34130J41110J46926J49553J48005J42638J33288J19101
57612C077190J00484P9464N7733L5961J5176l219j9544l6399n6131p8638j01741
57601C070336j22391j37442j44996j45791j42257j35999j27255j16637j05649
57592A891919r5194q5069p5316o6577n8752n0820m2493l4739k8295k2927j8410
57581A313327j4803j1474p300k242K643P008J1520J6145J9909K2930K6871L2650
57569A417184L9213M5422N1589N8251O4941P1261P7875Q5281R2665R8977J04104
57558B206763J07985J09552J07718J02541R4344Q2462O5949M5128K1475l495k8414
57547B912008n1603p1518q7596j00135j09442j15530j18472j18641j16685j13375
$$ plain form
57537 1909011 1799796 1695565 1597245 1505445 1420240 1341482 1268934 1202021 1140010 1082722 1030574
57526 1030574 983582 940778 900902 863281 827823 794822 764964 738763 715580 693971 673409
57515 673409 654816 638875 624751 611256 598425 587037 577264 568708 561193 554601 548425 542346 536922
57502 536922 532950 530606 529805 530765 533394 536754 540032 543536 547921 553111 558841 565582 573852 583271 593417
57487 593417 605009 619013 635111 652379 671079 692440 716910 743990 773579 806126 841478
57476 841478 878965 918777 962052 1009520 1061134 1117118 1178161 1244285 1314607 1388545 1466351
57465 1466351 1548138 1633132 1720050 1807312 1892572 1972661 2044244 2104179 2149534 2178150 2189188
57454 2189188 2182499 2157818 2115626 2058576 1990798 1915591 1834705 1749892 1663847 1579242 1497798
$$ packed form
57537A909011j09215j04231r8320r1800q5205p8758p2548o6913o2011n7288n2148
57526A030574m6992m2804l9876l7621l5458l3001k9858k6201k3183k1609k0562
57515F73409j8593j5941j4124j3495j2831j1388r773q556p515o592o176o079n424
57502E36922l972k344q01R60K629L360L278L504M385N190N730O741Q270R419J0146
57487E93417J1592J4004J6098J7268J8700K1361K4470K7080K9589L2547L5352
57476H41478L7487L9812M3275M7468N1614N5984O1043O6124P0322P3938P7806
57465A466351Q1787Q4994Q6918Q7262Q5260Q0089P1583N9935M5355K8616J1038
57454B189188o689k4681m2192n7050o7778p5207q0886q4813q6045q4605q1444
$$ plain form
57443 1497798 1420611 1348408 1281097 1218033 1159256 1105739 1058069 1015645 977615 943891 914697
57432 914697 889736 868315 849931 834458 822101 813342 808413 806692 807126 809408 814216 822179 833169
57419 833169 846774 862919 881843 903946 929756 959602 993257 1030429 1071604 1117897 1170021
57408 1170021 1227872 1290915 1358318 1428813 1501283 1575521 1651696 1728903 1804737 1876078 1939412
57397 1939412 1990675 2026061 2043529 2042828 2024001 1986912 1932566 1863865 1784447 1697333 1604990 1509849
57385 1509849 1414087 1319337 1227035 1138639 1055217 977217 904760 837747 775683 718076 665026
57374 665026 616724 572371 530530 490754 453967 420915 391114 363700 338430 315329 294138
57363 294138 274617 256774 240278 224336 208588 193491 179396 166004 153240 141814 132111 123217
$$ packed form
57443A497798p7187p2203o7311o3064n8777n3517m7670m2424l8030l3724k9194
57432I14697k4961k1421j8384j5473j2357q759m929j721M34K282M808P963J0990
57419H33169J3605J6145J8924K2103K5810K9846L3655L7172M1175M6293N2124
57408A170021N7851O3043O7403P0495P2470P4238P6175P7207P5834P1341O3334
57397A939412N1263L5386J7468p01j8827l7089n4346o8701p9418q7114r2343r5141
57385A509849r5762r4750r2302q8396q3422p8000p2457o7013o2064n7607n3050
57374F65026m8302m4353m1841l9776l6787l3052k9801k7414k5270k3101k1191
57363B94138j9521j7843j6496j5942j5748j5097j4095j3392j2764j1426r703q894
$$ plain form
57351 123217 113928 104360 95690 88542 82363 76283 69945 63512 57368 51889 47168 42935 38831 34699
57337 34699 30534 26396 22471 18965 15803 12728 9737 7135 5082 3453 2125 1007 -217 -1954 -4263
57322 -4263 -6940 -9961 -13337 -16661 -19497 -22211 -25704 -30256 -35333 -40472 -45517 -49963 -53146 -55353 -57732
57307 -57732 -60709 -63504 -65673 -68070 -71507 -75308 -78035 -79062 -78762 -77746 -76669 -76223 -76519 -76711 -75828 -73642
57291 -73642 -70358 -66040 -60948 -55872 -51376 -47010 -41932 -36026 -29905 -24117 -18842 -14049 -9464 -4696
57276 124 4272 7388 10212 13799 18374 23383 28308 32975 37476 42192 47511 53138 58186 62398 66604
57261 66604 71483 76536 81042 85337 90233 95704 101172 106820 113514 121429 129681 137462 144816 152226
57247 152226 160064 168526 177493 186398 194774 203091 212504 223597 235810 248259 260775 273924 288305
$$ packed form
57351A23217r289r568q670p148o179o080o338o433o144n479m721m233m104m132
57337C4699m165m138l925l506l162l075k991k602k053j629j328A007b17j737k309
57322d263k677l021l376l324k836k714l493m552n077n139n045m446l183k207k379
57307e7732k977k795k169k397l437l801k727j027L00J016J077M46k96j92Q83K186
57291g3642L284M318N092N076M496M366N078N906O121N788N275M793M585d696
57276A24M148L116K824L587M575N009M925M667M501M716N319N627N048M212M206
57261F6604M879N053M506M295M896N471N468N648O694P915Q252P781P354P410
57247A52226P838Q462Q967Q905Q376Q317R413J1093J2213J2449J2516J3149J4381
$$ plain form
57234 288305 304033 320772 338048 355520 373094 390967 409668 429814 451485 473975 496507
57223 496507 519039 541812 564279 585185 603795 620293 634738 646326 654009 657249 655912 650098
57211 650098 640400 627639 611978 592990 570987 547508 524056 501053 478538 457006 436915 418101
57199 418101 400431 384387 370357 358022 347151 338203 331375 325856 320983 317394 315918 315919 315892 315332
57185 315332 314925 315208 316152 317792 320197 322903 325329 327667 330526 333936 337526 341385 345763 350181 353881
57170 353881 357037 360472 364284 367745 370528 373007 375348 377281 378894 380685 382734 384652 386540 389187
57156 389187 393119 398164 404109 411159 419618 429645 441391 454908 470053 486855 505633 526083
57144 526083 546720 566171 584770 603953 624303 645184 666126 687448 709448 731954 754779
$$ packed form
57234B88305J5728J6739J7276J7472J7574J7873J8701K0146K1671K2490K2532
57223D96507K2532K2773K2467K0906J8610J6498J4445J1588P683L240j337n814
57211F50098r698j2761j5661j8988k2003k3479k3452k3003k2515k1532k0091j8814
57199D18101j7670j6044j4030j2335j0871q948o828n519m873l589j476Jk7n60
57185C15332m07K83R44J640K405K706K426K338K859L410L590L859M378M418L700
57170C53881L156L435L812L461K783K479K341J933J613J791K049J918J888K647
57156C89187L932N045N945P050Q459J0027J1746J3517J5145J6802J8778K0450
57144E26083K0637J9451J8599J9183K0350K0881K0942K1322K2000K2506K2825
$$ plain form
57133 754779 777813 800578 822488 843498 863820 883269 901759 920210 939842 960725 981998
57122 981998 1003283 1024657 1045533 1064986 1083224 1101240 1118862 1134603 1147753 1159164 1169552
57111 1169552 1178409 1185187 1190255 1193991 1196083 1196471 1195917 1194830 1192407 1187722 1180918 1172649 1163017 1151651
57097 1151651 1138223 1122334 1103420 1081191 1055718 1026935 994727 959551 922127 882323 839187
57086 839187 792139 741269 686480 627438 564404 497752 426404 347993 260874 164761 59162
57074 -57367 -186060 -327455 -482653 -653657 -842083 -1049074 -1277021 -1529753 -1810407 -2120691
57064 -2120691 -2462850 -2840510 -3256730 -3713123 -4212151 -4758706 -5358432 -6016198 -6737561
57055 -6737561 -7530073 -8401883 -9360690 -10415457 -11577753 -12860334 -14276298 -15841137 -17574090
$$ packed form
57133G54779K3034K2765K1910K1010K0322J9449J8490J8451J9632K0883K1273
57122I81998K1285K1374K0876J9453J8238J8016J7622J5741J3150J1411J0388
57111A169552Q857O778N068L736K092L88n54j087k423m685o804q269r632j1366
57097A151651j3428j5889j8914k2229k5473k8783l2208l5176l7424l9804m3136
57086H39187m7048n0870n4789n9042o3034o6652p1348p8411q7119r6113E9162
57074e7367j28693j41395j55198j71004j88426k06991k27947k52732k80654l10284
57064b120691l42159l77660m16220m56393m99028n46555n99726o57766p21363
57055f737561p92512q71810r58807j054767j162296j282581j415964j564839j732953
$$ plain form
57046 -17574090 -19496597 -21632001 -24008998 -26664322 -29641821 -32992436 -36777631 -41071087
57038 -41071087 -45956290 -51526314 -57887846 -65160658 -73468500 -82930325 -93655376 -105731188
57030 -105731188 -119203791 -134070960 -150294961 -167806535 -186488632 -206187107 -226780040
57023 -226780040 -248217641 -270388718 -292825685 -314489568 -333882020 -349458320 -360057518
57016 -360057518 -365098854 -364538604 -358743991 -348390516 -334365076 -317630624 -299075444
57009 -299075444 -279415942 -259188219 -238797813 -218569949 -198770935 -179614402 -161276935
57002 -161276935 -143922414 -127711830 -112786246 -99238693 -87099200 -76339434 -66886664
56995 -66886664 -58637909 -51472874 -45265301 -39890863 -35232181 -31183490 -27654383 -24569869
$$ packed form
57046a7574090j922507k135404k376997k655324k977499l350615l785195m293456
57038d1071087m885203n570024o361532p272812q307842r461825j0725051j2075812
57030a05731188j3472603j4867169j6224001j7511574j8682097j9698475k0592933
57023b26780040k1437601k2171077k2436967k1663883j9392452j5576300j0599198
57016c60057518n041336N60250N794613J0353475J4025440J6734452J8555180
57009b99075444J9659502K0227723K0390406K0227864J9799014J9156533J8337467
57002a61276935J7354521J6210584J4925584J3547553J2139493J0759766R452770
56995f6886664Q248755P165035O207573N374438M658682M048691L529107L084514
$$ plain form
56987 -24569869 -21867230 -19493193 -17402726 -15557647 -13924613 -12474286 -11182032 -10028072
56979 -10028072 -8996069 -8071553 -7241418 -6494058 -5819462 -5209292 -4656680 -4155522 -3699974
56970 -3699974 -3284942 -2906606 -2561737 -2246645 -1957555 -1691976 -1448761 -1226616 -1023304
56961 -1023304 -836598 -665279 -508612 -365393 -234029 -113193 -1782 101585 198463 289920
56951 289920 376287 457471 533164 602728 665337 720615 769161 812130 850119 882569 908684
56940 908684 928910 944751 956192 959286 947139 913947 858361 783541 695210 600078 504896 415077
56928 415077 333371 260119 194869 137458 87684 44716 7304 -25730 -55509 -83213 -109766 -135260
56916 -135260 -158941 -179811 -197256 -211264 -222207 -230397 -235768 -237982 -236858 -232700 -226252 -218434 -209998
$$ packed form
56987b4569869K702639K374037K090467J845079J633034J450327J292254J153960
56979a0028072J032003R24516Q30135P47360O74596O10170N52612N01158M55548
56970c699974M15032L78336L44869L15092K89090K65579K43215K22145K03312
56961a023304J86706J71319J56667J43219J31364a13193a782A01585R6878R1457
56951B89920Q6367Q1184P5693O9564O2609N5278M8546M2969L7989L2450K6115
56940I08684K0226J5841J1441L094j2147l3192n5586p4820q8331r5132r5182q9819
56928D15077q1706p3252o5250n7411m9774m2968G304b5730k9779k7704k6553k5494
56916a35260k3681k0870j7445j4008j0943q190n371k214J124M158O448P818Q436
$$ plain form
56903 -209998 -201219 -191898 -181836 -171284 -160732 -150324 -139794 -129073 -118681 -109461 -102174 -97396
56891 -97396 -95333 -95498 -96851 -98619 -100777 -103543 -106685 -109653 -112091 -113833 -114619 -114301 -113208 -111784 -109864
56876 -109864 -106794 -102297 -96767 -90563 -83408 -74770 -64628 -53848 -44132 -37652 -36192 -40125 -48220 -58558
56862 -58558 -69528 -80076 -89679 -98538 -107423 -116688 -125506 -132578 -137527 -141161 -144336 -147064 -148905 -149675
56848 -149675 -149433 -148172 -145988 -143380 -140884 -138437 -135452 -131529 -126763 -121376 -115416 -108879 -101794 -94048
56834 -94048 -85410 -75773 -65065 -52877 -38712 -22833 -6287 10364 27913 47424 68542 89382
56822 89382 107926 122948 133824 140406 143267 143355 141062 136229 129265 121592 114582 108579 103420 99331
56808 99331 96748 95742 96331 99036 104437 112349 122135 133756 147881 164787 183554 202249 218473
$$ packed form
56903b09998Q779R321J0062J0552J0552J0408J0530J0721J0392R220P287M778
56891i7396K063j65j353j768k158k766l142k968k438j742p86L18J093J424J920
56876a09864L070M497N530O204P155Q638J0142J0780R716O480J460l933q095j0338
56862e8558j0970j0548r603q859q885r265q818p072m949l634l175k728j841p70
56848a49675K42J261K184K608K496K447K985L923M766N387N960O537P085P746
56834i4048Q638R637J0708J2188J4165J5879f287A0364J7549J9511K1118K0840
56822H9382J8544J5022J0876O582K861Q8k293m833o964p673p010o003n159m089
56808I9331k583j006N89K705N401P912R786J1621J4125J6906J8767J8695J6224
$$ plain form
56795 218473 229831 234728 233220 226911 217789 207271 196257 185575 176037 168212 162406 158833 157706
56782 157706 159176 163227 169712 178737 191053 207729 229088 254157 281470 310115 339413 367662
56770 367662 391803 408669 416404 414805 404892 388474 367778 345029 322190 300873 282101 266036
56758 266036 252272 240691 231881 226583 224898 226276 230245 236949 246947 260627 277906 298341 321085
56745 321085 344414 365417 380734 387999 386660 377630 362652 344000 324015 304229 285108 266969
56733 266969 250705 237096 225857 216171 208000 202120 198958 198223 199744 203757 210039 217608 225840 235233
56719 235233 246267 257694 266683 270770 269401 263631 254744 243393 229927 215153 200419 186855
56707 186855 174786 164048 154561 146206 138469 130838 123583 117581 113204 109800 106448 102852 99356 96442
$$ packed form
56795B18473J1358M897j508o309r122j0518j1014j0682r538p825n806l573j127
56782A57706J470M051O485R025J2316J6676K1359K5069K7313K8645K9298K8249
56770C67662K4141J6866P735j599r913j6418k0696k2749k2839k1317j8772j6065
56758B66036j3764j1581q810n298j685J378L969O704R998J3680J7279K0435K2744
56745C21085K3329K1003J5317P265j339r030j4978j8652j9985j9786j9121j8139
56733B66969j6264j3609j1239r686q171n880l162p35J521M013O282P569Q232R393
56719B35233J1034J1427Q989M087j369n770q887j1351j3466j4774j4734j3564
56707A86855j2069j0738r487q355p737p631p255o002m377l404l352l596l496k914
$$ plain form
56693 96442 94379 93076 92117 91169 90348 89854 89329 88142 86360 84838 84128 83868 83561 83364 83645 84185 84360
56676 84360 83880 82909 81723 80657 80208 80661 81621 82259 82050 81119 80041 79472 79767 80603 81073 80455 78937 77463
56658 77463 76960 77748 79440 81158 82043 81914 81465 81635 82772 84400 85707 86223 86234 86588 87857 89606 90778
56641 90778 90915 90686 90963 91758 92386 92424 92088 91756 91518 91208 90634 89750 88762 88130 88278 89252 90654 91875 92466
56622 92466 92504 92639 93542 95150 96610 97127 96737 96146 95965 96231 96540 96451 95832 94920 94114 93700 93790 94386 95327
56603 95327 96292 97080 97791 98532 99060 99045 98620 98325 98539 99259 100315 101378 101875 101451 100575 100162 100489 100976 101117
56584 101117 101086 101235 101519 101718 101815 101859 101801 101701 101738 101836 101621 100881 99692 98028 95757 93101 90518 87996 85182
56565 85182 82456 80955 81023 81373 80542 78631 76895 76037 75730 75516 75362 75331 75346 75325 75166 74704 73988 73420 73236
$$ packed form
56693I6442k063j303r59r48q21m94n25j187j782j522p10k60l07j97K81N40J75
56676H4360m80r71j186j066m49M53R60O38k09r31j078n69K95Q36M70o18j518j474
56658G7463n03P88J692J718Q85j29m49J70J137J628J307N16J1L54J269J749J172
56641I0778J37k29K77P95O28L8l36l32k38l10n74q84r88o32J48R74J402J221N91
56622I2466L8J35R03J608J460N17l90n91j81K66L09q9o19r12q06m14R0N96R41
56603I5327R65P88P11P41N28j5m25k95K14P20J056J063M97m24q76m13L27M87J41
56584A01117l1J49K84J99R7M4n8j00L7R8k15p40j189j664k271k656k583k522k814
56565H5182k726j501O8L50q31j911j736q58l07k14j54l1J5k1j59m62p16n68j84
$$ plain form
56546 73236 73072 72427 71358 70369 69871 70094 71195 73002 74868 76236 77111 77684 77883 77767 77958 79071 80940
56529 80940 82996 85115 87478 89814 91499 92339 92619 92433 91617 90369 89311 88832 88845 89306 90460 92411
56513 92411 94829 97266 99499 101485 103233 104850 106505 108340 110442 112797 115193 117398 119608 122428
56499 122428 126143 130304 134319 138096 141778 145184 148047 150518 152883 154979 156409 157204 157769 158260 158505
56484 158505 158476 158332 158027 157299 156086 154622 153105 151611 150273 149307 148793 148577 148281 147416 145854 144289 143722
56467 143722 144162 144348 143210 141116 139171 137797 136655 135543 134562 133613 132473 131301 130450 129885 129326 128804
56451 128804 128467 128072 127298 126414 125978 125960 125818 125327 124707 124063 123413 123203 124030 125794 127809 129794 132051 134532
56433 134532 136398 136906 136301 135524 135283 135559 135886 135976 136140 136941 138431 140031 141260 142118 142564 142311 141640 141694
$$ packed form
56546G3236j64o45j069r89m98K23J101J807J866J368Q75N73J99j16J91J113J869
56529H0940K056K119K363K336J685Q40K80j86q16j248j058m79J3M61J154J951
56513I2411K418K437K233J986J748J617J655J835K102K355K396K205K210K820
56499A22428L715M161M015L777L682L406K863K471K365K096J430P95N65M91K45
56484A58505k9j44l05p28j213j464j517j494j338r66n14k16k96q65j562j565n67
56467A43722M40J86j138k094j945j374j142j112r81r49j140j172q51n65n59n22
56451A28804l37l95p74q84m36j8j42m91o20o44o50k10Q27J764K015J985K257K481
56433A34532J866N08o05p77k41K76L27R0J64Q01J490J600J229Q58M46k53o71N4
$$ plain form
56415 141694 143283 145879 148532 151235 154509 158142 161388 164194 167149 170350 173288 175821 178348 180974
56401 180974 183476 186147 189811 194693 199909 204295 207258 208920 209988 211413 213577 215862 217510 218579
56387 218579 219507 220142 220031 219300 218382 217232 215756 214600 214370 214387 213466 211762 210479 209832 208708 206462 203706
56370 203706 201029 198304 195583 193417 191741 189619 186633 183525 180932 178486 175716 172941 170716 169138
56356 169138 168166 167856 167840 167317 165988 164364 162913 161566 160263 159141 158030 156618 155289 154832 155109 155059
56340 155059 154331 153807 154105 154631 154655 154365 154325 154708 155515 156683 157589 157406 156400 155970 156945 158762 160671 162724
56322 162724 165078 167319 169078 170471 171529 172098 172601 173815 175495 176395 176135 175844 176412 177378 178233 179483
56306 179483 181548 183740 185320 186551 187946 189467 191201 193660 196567 198637 199503 200589 202960 205571
$$ packed form
56415A41694J589K596K653K703L274L633L246K806K955L201K938K533K527K626
56401A80974K502K671L664M882N216M386K963J662J068J425K164K285J648J069
56387B18579R28O35j11p31r18j150j476j156k30J7r21j704j283o47j124k246k756
56370B03706k677k725k721k166j676k122k986l108k593k446k770k775k225j578
56356A69138r72l10j6n23j329j624j451j347j303j122j111j412j329m57K77n0
56340A55059p28n24K98N26K4k90m0L83Q07J168R06j83j006m30R75J817J909K053
56322A62724K354K241J759J393J058N69N03J214J680R00k60k91N68R66Q55J250
56306A79483K065K192J580J231J395J521J734K459K907K070Q66J086K371K611
$$ plain form
56292 205571 206965 207541 208629 210251 211366 211671 211670 211472 210963 210770 211762 213830 216207 218617 221177 223670
56276 223670 225985 228712 232251 235898 238927 241949 245916 250348 254022 257139 261263 267064 273453 279170
56262 279170 284220 289407 295298 301918 308891 315663 321899 327719 333388 339021 344702 350428 355750 360118
56248 360118 363894 368221 373476 378658 382753 385827 388238 389828 390624 391386 392615 393892 394969 396540 399117
56233 399117 402235 405637 410128 416191 422934 429637 437174 446526 456922 467024 477012 487901 499677
56220 499677 511881 525324 541319 559613 578815 598656 620120 643645 668792 695597 724659
56209 724659 755978 789226 825147 865242 909977 958579 1010664 1066930 1128166 1194673 1266617
56198 1266617 1344002 1426466 1513972 1607306 1706845 1811344 1919141 2029919 2143747 2258762
$$ packed form
56292B05571J394N76J088J622J115L05jj98n09j93R92K068K377K410K560K493
56276B23670K315K727L539L647L029L022L967M432L674L117M124N801O389N717
56262B79170N050N187N891O620O973O772O236N820N669N633N681N726N322M368
56248C60118L776M327N255N182M095L074K411J590P96P62J229J277J077J571K577
56233C99117L118L402M491O063O743O703P537R352J0396J0102R988J0889J1776
56220D99677J2204J3443J5995J8294J9202J9841K1464K3525K5147K6805K9062
56209G24659L1319L3248L5921M0095M4735M8602N2085N6266O1236O6507P1944
56198A266617P7385Q2464Q7506R3334R9539J04499J07797J10778J13828J15015
$$ plain form
56188 2258762 2371476 2479236 2580853 2674884 2758967 2831121 2890388 2936016 2967276 2984290 2987999
56177 2987999 2979265 2959054 2929386 2892798 2850730 2803506 2751883 2697431 2641253 2583346 2523349
56166 2523349 2461034 2396102 2328405 2258400 2186601 2112873 2037079 1960017 1882706 1805165 1727027
56155 1727027 1648999 1572577 1498599 1427131 1358376 1292547 1229238 1168168 1110206 1056541 1007279
56144 1007279 961967 920844 884204 851106 820242 791630 765987 742960 721550 701783 684253
56133 684253 668416 653122 638525 625695 614527 603830 593436 584473 577540 572143 567852 564545
56121 564545 561730 559185 557954 559045 561479 563400 564812 567354 571631 576812 582715 590156 599121 608548
56107 608548 618088 628300 639017 649267 658866 668307 677258 684991 692091 699638 706855 711883 714945
$$ packed form
56188B258762J12714J07760J01617R4031Q4083P2154N9267M5628L1260J7014L709
56177B987999q734k0211k9668l6588m2068m7224n1623n4452n6178n7907n9997
56166B523349o2315o4932o7697p0005p1799p3728p5794p7062p7311p7541p8138
56155A727027p8028p6422p3978p1468o8755o5829o3309o1070n7962n3665m9262
56144A007279m5312m1123l6640l3098l0864k8612k5643k3027k1410j9767j7530
56133F84253j5837j5294j4597j2830j1168j0697j0394q963o933n397m291l307
56121E64545k815k545j231J091K434J921J412K542M277N181N903P441Q965R427
56107F08548R540J0212J0717J0250R599R441Q951P733P100P547P217N028L062
$$ plain form
56094 714945 718384 723304 728535 733326 738770 745969 754852 765491 778681 794633 812860 833786 858629
56081 858629 887363 918669 952284 989568 1031529 1078284 1130690 1190276 1256956 1328640 1403385
56070 1403385 1479908 1555790 1627560 1693243 1752948 1806750 1854244 1896451 1935487 1971335 2001004
56059 2001004 2021647 2032640 2034261 2026735 2011445 1990918 1966570 1937983 1904608 1866235 1821580 1768898
56047 1768898 1708707 1643909 1576912 1508765 1441218 1376925 1317018 1260924 1209084 1163281 1123826
56036 1123826 1089100 1058463 1032896 1012159 994110 977608 963346 951143 939322 927598 917657
56025 917657 909929 902664 895122 888764 884271 880326 876332 873432 871925 870678 869999 871809 876037 880191
56011 880191 883593 888489 895704 902915 908785 915194 923595 932669 941434 951207 962519 973473 983195 993664
$$ packed form
56094G14945L439M920N231M791N444P199Q883J0639J3190J5952J8227K0926K4843
56081H58629K8734L1306L3615L7284M1961M6755N2406N9586O6680P1684P4745
56070A403385P6523P5882P1770O5683N9705N3802M7494M2207L9036L5848K9669
56059B001004K0643J0993J621p526j5290k0527k4348k8587l3375l8373m4655n2682
56047A768898o0191o4798o6997o8147o7547o4293n9907n6094n1840m5803l9455
56036A123826l4726l0637k5567k0737j8049j6502j4262j2203j1821j1724r941
56025I17657p728p265p542o358m493l945l994k900j507j247o79J810M228M154
56011H80191L402M896P215P211N870O409Q401R074Q765R773J1312J0954R722J0469
$$ plain form
55997 993664 1006172 1019227 1031870 1045678 1061508 1077605 1092920 1108862 1125799 1141475 1155077
55986 1155077 1169333 1186315 1204699 1223365 1244026 1267970 1293791 1320657 1350051 1382014 1413700
55975 1413700 1444082 1476070 1511410 1547781 1583651 1621540 1663325 1706617 1749172 1792707 1839067
55964 1839067 1886791 1934861 1985730 2041232 2099639 2160002 2224887 2295366 2368031 2440716 2516479
55953 2516479 2598094 2683457 2770605 2862324 2961420 3066245 3175383 3291900 3418461 3553114
55943 3553114 3694372 3845247 4007642 4178284 4355126 4542173 4742907 4954979 5176845
55934 5176845 5413413 5669140 5941621 6228248 6532930 6859826 7206816 7571765 7958712
55925 7958712 8371167 8806330 9263276 9749693 10273153 10833252 11429960 12071201 12763662
$$ packed form
55997I93664J2508J3055J2643J3808J5830J6097J5315J5942J6937J5676J3602
55986A155077J4256J6982J8384J8666K0661K3944K5821K6866K9394L1963L1686
55975A413700L0382L1988L5340L6371L5870L7889M1785M3292M2555M3535M6360
55964A839067M7724M8070N0869N5502N8407O0363O4885P0479P2665P2685P5763
55953B516479Q1615Q5363Q7148R1719R9096J04825J09138J16517J26561J34653
55943C553114J41258J50875J62395J70642J76842J87047K00734K12072K21866
55934E176845K36568K55727K72481K86627L04682L26896L46990L64949L86947
55925G958712M12455M35163M56946M86417N23460N60099N96708O41241O92461
$$ plain form
55916 12763662 13504752 14292671 15135253 16039412 17002010 18022023 19111704 20284987 21546750
55907 21546750 22906405 24390498 26028661 27840364 29851029 32108813 34671744 37595622
55899 37595622 40952160 44839215 49351085 54558914 60545063 67435490 75375500 84508441
55891 84508441 95014366 107129976 121082344 137040579 155136103 175290689 196634719
55884 196634719 216949104 232978052 241784251 242165525 234980606 222306814 206347413
55877 206347413 188858676 171084178 153835236 137575323 122545384 108884279 96661204
55870 96661204 85859106 76395389 68165902 61053109 54915676 49607551 45006747 41010691
55862 41010691 37517980 34436984 31703710 29272595 27097195 25134951 23361015 21759910
$$ packed form
55916A2763662P41090P87919Q42582R04159R62598J020013J089681J173283J261763
55907B1546750J359655J484093J638163J811703K010665K257784K562931K923878
55899C7595622L356538L887055M511870N207829N986149O890427P940010R132941
55891H4508441J0505925J2115610J3952368J5958235J8095524K0154586K1344030
55884A96634719K0314385J6028948Q806199L81274p184919j2673792j5959401
55877B06347413j7488737j7774498j7248942j6259913j5029939j3661105j2223075
55870I6661204j0802098r463717q229487p112793o137433n308125m600804l996056
55862D1010691l492711l080996k733274k431115k175400j962244j773936j601105
$$ plain form
55854 21759910 20309348 18985465 17776116 16674670 15666665 14735323 13874213 13082117
55846 13082117 12350670 11668437 11031987 10441893 9892457 9375767 8891308 8441532 8022022
55837 8022022 7625451 7251156 6901627 6573427 6260537 5963112 5684327 5421850 5170659
55828 5170659 4931159 4706588 4495346 4293507 4102094 3924462 3759074 3601792 3452639
55819 3452639 3313569 3182369 3055510 2934392 2822125 2716731 2614068 2514916 2422596 2335873
55809 2335873 2250716 2166983 2087059 2009918 1932734 1856574 1784495 1715864 1648449 1584237 1527187
55798 1527187 1476860 1430118 1387413 1351356 1320489 1290518 1260666 1232972 1206340 1177196 1145570
55787 1145570 1114970 1086609 1058963 1032571 1009963 990871 972286 953279 935409 918747 901933
$$ packed form
55854B1759910j450562j323883j209349j101446j008005r31342q61110p92096
55846A3082117p31447o82233o36450n90094n49436n16690m84459m49776m19510
55837H022022l96571l74295l49529l28200l12890k97425k78785k62477k51191
55828E170659k39500k24571k11242k01839j91413j77632j65388j57282j49153
55819C452639j39070j31200j26859j21118j12267j05394j02663r9152r2320q6723
55809B335873q5157q3733p9924p7141p7184p6160p2079o8631o7415o4212n7050
55798A527187n0327m6742m2705l6057l0867k9971k9852k7694k6632k9144l1626
55787A145570l0600k8361k7646k6392k2608j9092j8585j9007j7870j6662j6814
$$ plain form
55776 901933 885784 872387 860865 848292 834535 821905 810348 797349 782472 767758 753582
55765 753582 738254 721863 706558 692665 678202 662500 646920 631833 616227 600439 586078
55754 586078 573124 560097 547001 535215 524786 514799 506003 499959 495986 492077 488362 486438 485748
55741 485748 484103 481543 480272 480816 481487 481607 482055 482603 481813 479662 477333 474465 469546 462933 456560 450779
55725 450779 444396 437645 432078 427553 422384 416448 411249 407009 402647 398363 395080 391416 384584 374536
55711 374536 364040 354468 344693 334458 325470 318455 312119 305815 300448 296060 291158 285134 278920 272774
55697 272774 265948 258922 253312 249011 243987 237406 230404 223336 215040 205574 197102 191100 186834 183280
55683 183280 180406 178003 175456 173191 172240 172023 170772 168456 166973 167139 167925 168961 171081 173826 175139
$$ packed form
55776I01933j6149j3397j1522j2573j3757j2630j1557j2999j4877j4714j4176
55765G53582j5328j6391j5305j3893j4463j5702j5580j5087j5606j5788j4361
55754E86078j2954j3027j3096j1786j0429r987q796o044l973l909l715j924o90
55741D85748j645k560j271N44O71J20M48N48p90k151k329k868m919o613o373n781
55725D50779o383o751n567m525n169n936n199m240m362m284l283l664o832j0048
55711C74536j0496r572r775j0235q988p015o336o304n367m388m902o024o214o146
55697B72774o826p026n610m301n024o581p002p068q296r466q472o002m266l554
55683A83280k874k403k547k265r51k17j251k316j483J66P86J036K120K745J313
$$ plain form
55668 175139 174396 173304 172972 172497 171244 170072 169278 167677 164759 161682 159164 156545 153837 152496 153045
55653 153045 153971 154104 154197 155083 156139 156707 157327 158496 159784 161067 163040 165744 168176 170030 172106 174455
55637 174455 175951 176376 176989 178256 179055 179017 179598 181773 184563 187021 189884 193989 198687 203005 206902 210277
55621 210277 212267 212670 212688 213173 213406 212617 211378 210515 209901 209235 208802 208633 208057 206790 205361 203970 202278
55604 202278 200706 200355 201144 201672 201499 201766 202917 203772 203754 204072 205540 207006 207262 206849 206647 206170 204691
55587 204691 202790 201435 200547 199600 198511 196948 193954 189304 184156 179430 174743 169764 165181 161299 157035
55572 157035 151513 145429 139707 134049 128064 122632 118774 116065 113390 110492 107734 105093 102345 99547
55558 99547 96596 93212 89944 88063 87718 87349 85687 83129 80448 77552 74503 72352 71748 71861 71781 71780 72112
$$ packed form
55668A75139p43j092l32m75j253j172p94j601k918l077k518k619k708j341N49
55653A53045R26J33R3Q86J056N68O20J169J288J283J973K704K432J854K076K349
55637A74455J496M25O13J267P99l8N81K175K790K458K863M105M698M318L897L375
55621B10277J990M03J8M85K33p89j239q63o14o66m33j69n76j267j429j391j692
55604B02278j572l51P89N28j73K67J151Q55j8L18J468J466K56m13k02m77j479
55587B04691j901j355q88r47j089j563k994m650n148m726m687m979m583l882m264
55572A57035n522o084n722n658n985n432l858k709k675k898k758k641k748k798
55558I9547k951l384l268j881l45l69j662k558k681k896l049k151o04J13q0jL32
$$ plain form
55541 72112 71854 70280 68291 67133 66556 65579 64224 63251 62877 62890 63374 64312 65146 65579 66035 66549 66198 64565
55523 64565 62734 61828 61503 60882 60018 59352 58618 57458 56356 55912 55891 55829 55752 55476 54260 52087 50302 49971
55505 49971 50600 51442 52830 55030 56913 57267 56571 56134 56184 56097 55763 55411 54714 53348 51959 51442 51759 52373
55487 52373 53212 54302 55222 55875 56952 58678 60031 60256 60210 61060 62607 64094 65633 67431 68604 68333
55471 68333 67562 67994 69982 72730 75904 79518 82805 84777 85621 86235 86802 87013 87206 87864 88451 88044 86760
55454 86760 85323 83709 81499 79056 76941 74599 71092 66823 63108 60323 57835 55452 53504 51724
55440 51724 49512 47260 46057 46091 46501 46706 46706 46289 45201 43964 43238 42513 40746 38226 36465 36191 36640
55423 36640 36915 36791 36096 34533 32403 30503 29069 27684 26292 25390 25152 25180 25161 24941 24111 22490 20978
$$ packed form
55541G2112k58j574j989j158n77r77j355r73l74J3M84R38Q34M33M56N14l51j633
55523F4565j831r06l25o21q64o66p34j160j102m44k1o2p7k76j216k173j785l31
55505D9971O29Q42J388K200J883L54o96m37N0q7l34l52o97j366j389n17L17O14
55487E2373Q39J090R20O53J077J726J353K25m6Q50J547J487J539J798J173k71
55471F8333p71M32J988K748L174L614L287J972Q44O14N67K11J93O58N87m07j284
55454H6760j437j614k210k443k115k342l507m269l715k785k488k383j948j780
55440E1724k212k252j203L4M10K05%m17j088j237p26p25j767k520j761k74M49
55423C6640K75j24o95j563k130j900j434j385j392r02k38K8j9k20q30j621j512
$$ plain form
55406 20978 20910 22426 24282 25332 25462 25143 24889 25108 25710 25923 25189 24053 23519 23769 24282 24859 25646 26459
55388 26459 26951 27170 27092 26103 23903 21489 20079 19486 18745 17881 17675 18020 18025 17682 17888 18784 19565 20172 21648
55369 21648 24331 26942 28102 27808 26974 26307 26029 25949 25488 24309 23045 22707 23354 24106 24444 24628 24828 24819
55351 24819 24612 24518 24454 24032 23408 23180 23437 23727 23967 24458 25044 25235 25211 25688 26714 27588 28026 28414 28775 28557
55331 28557 27631 26534 25532 24431 23389 22899 22808 22507 22199 22852 24501 25735 25368 23727 21905 20660
55315 20660 20345 20933 21645 21440 20264 19049 18277 17547 16765 16531 16837 16647 15477 14305 14008 13856 12628
55298 12628 10560 9072 8890 9363 9525 9118 8603 8683 9757 11528 13188 14136 14370 14223 14083 14349 15163 16173
55280 16173 17014 18009 19690 21654 22696 22339 21489 21261 21805 22601 23231 23482 23268 22867 22819 23253 23704 23749 23368
$$ packed form
55406B0978o8J516J856J050J30l19k54K19O02K13p34j136n34K50N13N77P87Q13
55388B6459M92K19p8r89k200k414j410n93p41q64k06L45Nl43K06Q96P81O07J476
55369B1648K683K611J160k94q34o67k78q0m61j179j264l38O47P52L38J84K00r
55351B4819k07r4o4m22o24k28K57K90K40M91N86J91k4M77J026Q74M38L88L61k18
55331B8557r26j097j002j101j042m90r1l01l08O53J649J234l67j641j822j245
55315B0660l15N88P12k05j176j215p72p30p82k34L06j90j170j172k97j52j228
55298A2628k068j488j82M73J62m07n15Q0J074J771J660R48K34j47j40K66Q14J010
55280A6173Q41R95J681J964J042l57q50k28N44P96O30K51k14m01m8M34M51M5l81
$$ plain form
55261 23368 22600 21410 20069 19122 18757 18756 19126 20106 21357 21898 21219 19875 18663 17745 16893 16101 15572 15492
55243 15492 15969 16801 17251 16662 15414 14612 14646 14733 14135 13147 12535 12566 12996 13557 14069 14447 14848 15537 16458 17297
55223 17297 17958 18540 18926 18999 19189 20147 21770 23220 23966 24115 23751 22780 21542 20709 20328 19768 18830 18056
55205 18056 17620 16830 15159 13064 11365 10484 10678 12210 14729 17085 18370 18755 18969 19384 19929 20415 20594
55188 20594 20282 19646 19038 18529 18121 18256 19306 20601 20913 20050 19008 18414 17925 17473 17837 19340 21055
55171 21055 22066 22635 23267 23533 22766 21359 20350 20105 20171 20152 20117 20352 21171 22646 24213 24999 24934 24928 25598
55152 25598 26436 26728 26595 26523 26498 26274 26018 26030 26253 26555 27025 27468 27220 26040 24707 24062 23970 23824 23547 23391
55132 23391 23256 22990 22986 23708 24898 25934 26718 27552 28366 28723 28477 27858 27054 26164 25381 24796 24210 23500 22915
$$ packed form
55261B3368p68j190j341r47l65jL70R80J251N41o79j344j212r18q52p92n29q0
55243A5492M77Q32M50n89j248q02L4Q7n98r88o12L1M30N61N12L78M01O89R21Q39
55223A7297O61N82L86P3J90R58J623J450P46J49l64r71j238q33l81n60r38p74
55205A8056m36p90j671k095j699q81J94J532K519K356J285L85K14M15N45M86J79
55188B0594l12o36o08n09m08J35J050J295L12q63j042n94m89m52L64J503J715
55171B1055J011N69O32K66p67j407j009k45O6j9l5K35Q19J475J567P86o5oO70
55152B5598Q38K92j33p2k5k24k56J2K23L02M70M43k48j180j333o45r2j46k77j56
55132B3391j35k66mP22J190J036P84Q34Q14L57k46o19q04q90p83n85n86p10n85
$$ plain form
55113 22915 22657 22540 22391 22391 22528 22200 20929 19146 17747 17085 16889 16832 16730 16395 15828 15370 15319 15533 15668
55094 15668 15514 14907 13796 12606 12071 12353 12888 13363 14199 15586 16763 16932 16374 15988 16160 16706 17535 18721
55076 18721 20205 21915 23836 25577 26434 26366 26285 26798 27324 27150 26674 26703 27088 27100 26734 26591 26758 26897 27236
55057 27236 28427 30405 32338 33775 34971 36057 36740 37006 37291 37738 38010 38027 38216 38724 38985 38442 37292
55040 37292 36190 35584 35576 36144 37196 38491 39697 40520 40828 40791 40836 41301 42095 42805 43073 42827 42283 41800 41602
55021 41602 41592 41552 41435 41271 40953 40554 40643 41685 43160 44036 44124 44199 44636 44827 44264 43299 42430 41717 41390 42101
55001 42101 43860 45569 46350 46582 46866 46803 45784 44320 43539 43782 44562 45474 46181 46052 44836 43399 42864
54984 42864 43254 43849 44423 45186 45848 45868 45457 45347 45701 46134 46599 47312 47984 48140 48079 48517 49337 49663 49161 48395
$$ packed form
55113B2915k58j17j49%J37l28j271j783j399o62j96n7j02l35n67m58n1K14J35
55094A5668j54o07j111j190n35K82N35M75Q36J387J177J69n58l86J72N46Q29J186
55076A8721J484J710J921J741Q57o8q1N13N26j74m76K9L85J2l66j43J67J39L39
55057B7236J191J978J933J437J196J086O83K66K85M47K72J7J89N08K61n43j150
55040C7292j102o06qN68J052J295J206Q23L08l7M5M65P94P10K68k46n44m83j98
55021D1602j0m0j17j64l18l99Q9J042J475Q76Q8P5M37J91n63r65q69p13l27P11
55001D2101J759J709P81K32K84o3j019j464p81K43P80R12P07j29j216j437n35
54984D2864L90N95N74P63O62K0m11j10L54M33M65P13O72J56o1M38Q20L26n02p66
$$ plain form
54964 48395 47880 47627 47589 47690 47494 46696 45875 45861 46467 46782 46631 46741 47452 48323 49071 49883 50654 50967 50990 51405
54944 51405 52281 52976 53321 53836 54516 54583 53885 53418 53858 54491 54329 53454 52501 51466 49871 47785 46006 45318
54926 45318 45871 47051 47836 47676 47146 47293 48283 49296 49814 50203 50784 51163 51043 50955 51524 52494 53186 53623 54585
54907 54585 56559 59060 61000 61603 61062 60405 60567 61668 63312 65303 67629 69960 71926 73841 76486
54892 76486 80115 84290 88735 93579 98693 103657 108642 114468 121351 128368 134586 140056 145068 149127
54878 149127 151348 151431 149639 146165 141206 135394 129515 123893 118451 113220 108357 103752 99126 94502 90233
54863 90233 86542 83270 80131 77007 73922 70842 67744 64967 63359 63628 65415 67439 68862 70135 72095
54848 72095 74727 77495 80496 84386 89266 94511 99761 105297 111302 117495 123614 129522 134667 138160
$$ packed form
54964D8395n15k53l8J01j96p98q21j4O06L15j51J10P11Q71P48Q12P71L13K3M15
54944E1405Q76O95L45N15O80O7o98m67M40O33j62q75r53j035j595k086j779o88
54926D5318N53J180P85j60n30J47R90J013N18L89N81L79j20q8N69R70O92M37R62
54907E4585J974K501J940O03n41o57J62J101J644J991K326K331J966J915K645
54892G6486L629M175M445M844N114M964M985N826O883P017O218N470N012M059
54878A49127K221Q3j792l474m959n812n879n622n442n231m863m605m626m624m269
54863I0233l691l272l139l124l085l080l098k777j608K69J787K024J423J273J960
54848G2095K632K768L001L890M880N245N250N536O005O193O119N908N145L493
$$ plain form
54834 138160 139597 139154 136820 132365 126264 119648 112963 105639 97636 90322 84959 81037 77046 72513
54820 72513 68441 65926 65086 65192 65255 64495 62718 60324 57832 55570 53901 53266 53661 54441 54955 55008 54493
54803 54493 53138 51118 49435 49003 49587 50173 50202 49901 49575 49169 48566 47887 47357 47108 47098 47082 46686 45709 44359
54784 44359 43119 42449 42535 43094 43442 43062 42226 41767 42240 43539 45267 46990 48140 48298 47772 47384 47468 47582
54766 47582 47452 47555 48390 49651 50642 51121 51306 51369 51414 51732 52635 54146 56084 58295 60562 62537 64006
54749 64006 65076 65984 66927 68112 69583 70940 71745 72368 73876 76813 80587 84402 88246 92569 97479
54734 97479 102778 108436 114493 120762 127014 133256 139459 145284 150439 155003 159039 162178 163961 164361 163551
54719 163551 161395 157625 152530 147106 142460 139030 136324 133473 130289 127612 126238 125720 124878 123401 122069
$$ packed form
54834A38160J437m43k334m455o101o616o685p324q003p314n363l922l991m533
54820G2513m072k515q40J06O3p60j777k394k492k262j669o35L95P80N14N3n15
54803E4493j355k020j683m32N84N86K9l01l26m06o03o79n30k49j0j6l96r77j350
54784D4359j240o70Q6N59L48l80q36m59M73J299J728J723J150J58n26l88Q4J14
54766D7582j30J03Q35J261R91M79J85O3M5L18R03J511J938K211K267J975J469
54749F4006J070R08R43J185J471J357Q05O23J508K937L774L815L844M323M910
54734I7479N299N658O057O269O252O242O203N825N155M564M036L139J783M00q10
54719A63551k156l770n095n424m646l430k706k851l184k677j374n18q42j477j332
$$ plain form
54704 122069 121319 120602 119608 119184 120364 123100 126561 130075 133262 135935 138679 142932 149616 158014 166698
54689 166698 175267 184500 195178 207435 220902 234722 247681 259016 268885 277444 283828 286834 286343
54676 286343 283248 278180 271131 262267 252239 241570 230384 218829 207304 196197 185777 176245
54664 176245 167533 159277 151398 144379 138461 133013 127424 122155 118002 114670 111247 107931 106026 105916
54650 105916 106163 105144 102777 100111 97958 96516 95792 95699 95909 96070 96090 96062 96089 96248 96444 96273 95411 94226
54632 94226 93535 93618 93923 93905 93687 93629 93715 93746 93798 94092 94608 95210 96020 97272 98772 99813 99898 99476 99734 101493
54612 101493 104430 107532 110219 112655 115018 117107 118889 120896 123545 126454 128937 130884 132638 134328
54598 134328 135975 137999 140859 144266 147486 150430 153748 157698 161607 164673 166806 168530 170633 174042
$$ packed form
54704A22069p50p17r94m24J180K736L461L514L187K673K744M253O684Q398Q684
54689A66698Q569R233J0678J2257J3467J3820J2959J1335R869Q559O384L006m91
54676B86343l095n068p049q864j0028j0669j1186j1555j1525j1107j0420r532
54664A76245q712q256p879p019n918n448n589n269m153l332l423l316j905j10
54650A05916K47j019k367k666k153j442p24r3K10J61K0k8K7J59J96j71q62j185
54632I4226o91Q3L05j8k18n8Q6L1N2K94N16O02Q10J252J500J041Q5m22K58J759
54612A01493K937L102K687K436K363K089J782K007K649K909K483J947J754J690
54598A34328J647K024K860L407L220K944L318L950L909L066K133J724K103L409
$$ plain form
54584 174042 179421 186490 194232 202052 210415 220050 230945 242525 254556 267418 281524 296674 312018
54571 312018 326589 339868 351674 361413 367766 369619 367163 361589 353671 343210 329961 314528 298092
54558 298092 281650 265809 250936 237212 224704 213528 203766 195225 187625 181029 175679 171361 167436
54545 167436 163616 160161 157060 153640 149412 144840 140786 137468 134499 131663 129149 127105 125419 123900
54531 123900 122333 120417 117928 114944 111661 108133 104480 101171 98657 96734 94687 92142 89445 87081
54517 87081 85092 83239 81473 79910 78504 77008 75276 73423 71720 70500 70082 70542 71487 72279 72625 72762
54501 72762 72951 72977 72446 71444 70627 70605 71454 72837 74391 75928 77491 79248 81140 82662 83241 82916 82367
54484 82367 82241 82738 83915 85967 88886 92131 94994 97210 99067 101089 103724 107119 111029 115099 119357
$$ packed form
54584A74042N379P069P742P820Q363R635J0895J1580J2031J2862J4106J5150J5344
54571C12018J4571J3279J1806R739O353J853k456n574p918j0461j3249j5433j6436
54558B98092j6442j5841j4873j3724j2508j1176r762q541p600o596n350m318l925
54545A67436l820l455l101l420m228m572m054l318k969k836k514k044j686j519
54531A23900j567j916k489k984l283l528l653l309k514j923k047k545k697k364
54517H7081j989j853j766j563j406j496j732j853j703j220m18M60R45P92L46J37
54501G2762J89K6n31j002q17k2Q49J383J554J537J563J757J892J522N79l25n49
54484H2367j26M97J177K052K919L245K863K216J857K022K635L395L910M070M258
$$ plain form
54469 119357 124154 129594 135421 141534 148097 154881 161080 166227 170791 175351 179591 182642 184065 183833
54455 183833 181770 177821 172679 167325 161937 155948 149182 142230 135612 129342 123505 118571 114785 111747
54441 111747 108891 105976 102862 99284 95255 91340 88125 85543 83073 80542 78485 77620 78017 78899 79375
54426 79375 79337 79344 79595 79499 78622 77581 77404 78289 79587 80862 82303 84136 86279 88603 90911 92656 93349
54409 93349 93351 93640 94605 95662 96225 96458 96772 97150 97304 97068 96322 94982 93368 92193 91823 91836 91527 90554 88937
54390 88937 86842 84647 82838 81593 80735 80189 80079 80176 79798 78602 77071 75811 74744 73429 71935 70951
54374 70951 71088 72278 73761 74550 74152 72994 71938 71341 70921 70533 70509 71035 71762 72304 72657 72812 72565 72099
54356 72099 72146 73017 73963 74176 73979 74315 75379 76577 77623 78811 80193 81366 82257 83422 85268 87521
$$ packed form
54469A19357M797N440N827O113O563O784O199N147M564M560M240L051J423k32
54455A83833k063l949n142n354n388n989o766o952o618o270n837m934l786l038
54441A11747k856k915l114l578m029l915l215k582k470k531k057q65L97Q82M76
54426G9375l8PK51r6q77j041j77Q85J298J275J441J833K143K324K308J745O93
54409I3349KK89R65J057N63K33L14L78J54k36p46j340j614j175l70J3l09r73j617
54390H8937k095k195j809j245q58n46j10R7l78j196j531j260j067j315j494r84
54374G0951J37J190J483P89l98j158j056n97m20l88k4N26P27N42L53J55k47m66
54356G2099M7Q71R46K13j97L36J064J198J046J188J382J173Q91J165J846K253
$$ plain form
54340 87521 89750 91915 94127 96302 98433 100848 103781 106911 109687 111889 113521 114340 113970 112522 110662
54325 110662 108940 107344 105677 104004 102467 100921 99152 97367 96028 95144 94132 92607 90887 89455
54311 89455 88199 86665 84892 83483 82714 81996 80470 78056 75692 74505 74767 75647 76075 75796 75453 75695
54295 75695 76495 77367 77848 77623 76612 75333 74685 74962 75452 75545 75773 77014 78984 80510 81226 81952 83245
54278 83245 84547 85266 85781 86733 87917 88606 88598 88266 87813 87119 86259 85622 85457 85538 85381 84663 83463 82169 81005
54259 81005 79678 77733 75269 72985 71377 70229 68976 67237 64921 62299 60188 59568 60591 62197 63033
54244 63033 62534 60966 58860 56705 54888 53480 52259 51207 50702 50950 51449 51437 50727 49853 49492 49953 51033
54227 51033 52131 52596 52187 51137 49816 48552 47715 47527 47674 47521 46883 46210 45922 46036 46594 47822 49578
$$ packed form
54340H7521K229K165K212K175K131K415K933L130K776K202J632Q19l70j448j860
54325A10662j722j596j667j673j537j546j769j785j339q84j012j525j720j432
54311H9455j256j534j773j409p69p18j526k414k364j187K62Q80M28k79l43K42
54295G5695Q00Q72M81k25j011j279o48K77M90R3K28J241J970J526P16P26J293
54278H3245J302P19N15R52J184O89ql32m53o94q60o37j65Q1j57p18j200j294j164
54259H1005j327j945k464k284j608j148j253j739k316k622k111o20J023J606Q36
54244F3033m99j568k106k155j817j408j221j052n05K48M99j2p10q74l61M61J080
54227E1033J098M65m09j050j321j264q37j88J47j53o38o73k88J14N58J228J756
$$ plain form
54210 49578 51193 52269 53046 53658 53695 53041 52473 52664 53137 53095 52866 53526 55232 56913 57677 57648 57265 56632 55962
54191 55962 55968 57226 59397 61429 62418 62151 61084 59934 59112 58392 57263 55638 54086 53313 53523 54265 54808
54174 54808 54762 54454 54553 55204 55746 55542 54863 54572 55031 55730 56006 55795 55499 55355 55130 54491 53624 53290 54009 55311
54154 55311 56235 56602 57224 58605 60071 60674 60501 60448 60969 61742 62417 62982 63397 63436 63097 62706 62482 62319 62115
54135 62115 62042 62339 62949 63391 63012 61576 59736 58607 58585 58840 58309 56883 55287 54148 53701 54085 55206
54118 55206 56360 56633 55807 54411 52905 51295 49602 48203 47542 47793 48775 49882 50255 49542 48495 48297
54102 48297 49236 50498 51253 51410 51191 50631 49786 49004 48617 48576 48557 48253 47492 46415 45579 45532 46189 46946 47457
54083 47457 47907 48438 48706 48239 46958 45211 43565 42616 42588 42961 42825 41771 40199 38738 37743 37447 38085
$$ packed form
54210D9578J615J076P77O12L7o54n68J91M73m2k29O60J706J681P64k9l83o33o70
54191E5962OJ258K171K032R89k67j067j150q22p20j129j625j552p73K10P42N43
54174E4808m6l08R9O51N42k04o79k91M59O99K76k11k96j44k25o39q67l34P19J302
54154E5311R24L67O22J381J466O03j73n3N21P73O75N65M15L9l39l91k24j63k04
54135F2115p3K97O10M42l79j436j840j129k2K55n31j426j596j139m47L84J121
54118E5206J154K73q26j396j506j610j693j399o61K51R82J107L73p13j047j98
54102D8297R39J262P55J57k19n60q45p82l87m1j9l04p61j077q36m7O57P57N11
54083D7457M50N31K68m67j281j747j646r49k8L73j36j054j572j461r95k96O38
$$ plain form
54066 38085 39572 41367 42894 43869 44126 43558 42428 41310 40420 39383 37975 36718 36279 36566 36921 37027
54050 37027 37136 37495 38020 38622 39403 40352 41141 41489 41581 41946 42913 44288 45553 46312 46520 46363 46049 45754 45633
54031 45633 45726 45890 45953 45925 45900 45791 45340 44460 43414 42583 42124 41919 41817 41909 42523 43891 45778 47576 48865
54012 48865 49737 50484 51163 51661 51962 52053 51688 50648 49231 48119 47672 47596 47426 47106 46985 47371 48192 49063 49704
53993 49704 50314 51437 53346 55675 57818 59531 60936 62123 63101 64042 65239 66802 68608 70521 72403
53978 72403 74032 75327 76632 78453 80873 83496 85940 88198 90536 93297 96698 100613 104675 108811
53964 108811 113395 118509 123404 127290 130438 133737 137257 140038 141477 142135 142875 143896 145076 146609 148691
53949 148691 150932 152619 153396 153321 152489 150979 148984 146664 144018 141123 138246 135470 132521 129272 126141
$$ packed form
54066C8085J487J795J527R75K57n68j130j118q90j037j408j257m39K87L55J06
54050C7027J09L59N25O02P81R49P89L48R2L65R67J375J265P59K08j57l14k95j21
54031D5633R3J64O3k8k5j09m51q80j046q31m59k05j02R2O14J368J887J798J289
54012D8865Q72P47O79M98L01R1l65j040j417j112m47p6j70l20j21L86Q21Q71O41
53993D9704O10J123J909K329K143J713J405J187R78R41J197J563J806J913J882
53978G2403J629J295J305J821K420K623K444K258K338K761L401L915M062M136
53964A08811M584N114M895L886L148L299L520K781J439O58P40J021J180J533K082
53949A48691K241J687P77p5q32j510j995k320k646k895k877k776k949l249l131
$$ plain form
53934 126141 123535 121219 118763 116432 114935 114296 113625 112301 110877 110359 110861 111438 111187 110074 108587 107008
53918 107008 105390 104007 103342 103479 103926 104210 104376 104596 104592 103910 102677 101608 101236 101451 101913 102527 103337 104184
53900 104184 104725 104712 104175 103423 102896 102905 103425 104213 105103 106093 107230 108525 109930 111322 112638 114142 116264
53883 116264 118948 121416 122959 123799 124805 126513 128850 131605 134674 137971 141606 146068 151611 157485
53869 157485 162431 166022 168913 171657 173902 174967 174621 173088 170894 168956 168162 168450 168852 168816 168953 170039
53853 170039 171893 173837 175755 177989 180543 183177 186133 189994 194748 199557 203567 206576 208841 210649
53839 210649 212244 213857 215547 217057 217934 217881 217116 216330 216035 215886 214965 212851 210040 207138 204091 200600
53823 200600 196860 193291 189716 185384 179894 173664 167472 161802 156734 152100 147593 142888 137834 132634
$$ packed form
53934A26141k606k316k456k331j497o39o71j324j424n18N02N77k51j113j487j579
53918A07008j618j383o65J37M47K84J66K20mo82j233j069l72K15M62O14Q10Q47
53900A04184N41j3n37p52n27RN20P88Q90R90J137J295J405J392J316J504K122
53883A16264K684K468J543Q40J006J708K337K755L069L297L635M462N543N874
53869A57485M946L591K891K744K245J065l46j533k194j938p94K88M02l6J37J086
53853A70039J854J944J918K234K554K634K956L861M754M809M010L009K265J808
53839B10649J595J613J690J510Q77n3p65p86k95j49r21k114k811k902l047l491
53823B00600l740l569l575m332n490o230o192n670n068m634m507m705n054n200
$$ plain form
53809 132634 127848 124155 121832 120395 118944 117012 114842 112766 110647 108198 105565 103250 101603 100612
53795 100612 99974 99168 97769 96054 94989 95115 95582 94863 92487 89578 87518 86491 85627 84296 82820 81870
53779 81870 81486 81031 80141 79358 79512 80607 81755 82202 81976 81365 80305 78696 76986 75896 75670 75963 76391
53762 76391 76815 77140 77209 77012 76796 76874 77355 78032 78479 78427 78102 78045 78494 79231 80163 81672 84068 86938 89508
53743 89508 91515 93350 95398 97645 99977 102529 105522 108901 112233 115040 117312 119640 122595 125946
53729 125946 128832 130817 132401 134266 136422 138455 140239 141909 143442 144799 146341 148474 150908 152752
53715 152752 153397 152919 151680 150014 148335 147017 145960 144634 142707 140372 137952 135530 133131 130954 129241
53700 129241 128077 127416 127077 126654 125772 124543 123520 123014 122697 122025 120826 119343 117875 116613 115624 114837
$$ packed form
53809A32634m786l693k323j437j451j932k170k076k119k449k633k315j647r91
53795A00612o38q06j399j715j065J26M67p19k376k909k060j027q64j331j476r50
53779H1870l84m55q90p83J54J095J148M47k26o11j060j609j710j090k26K93M28
53762G6391M24L25O9j97k16P8M81O77M47n2l25n7M49P37R32J509K396K870K570
53743H9508K007J835K048K247K332K552K993L379L332K807K272K328K955L351
53729A25946K886J985J584J865K156K033J784J670J533J357J542K133K434J844
53715A52752O45m78j239j666j679j318j057j326j927k335k420k422k399k177j713
53700A29241j164o61l39m23q82j229j023n06l17o72j199j483j468j262r89p87
$$ plain form
53684 114837 114162 113758 113935 114622 115174 115019 114297 113501 112668 111433 109915 108924 108962 109375 108985 107431 105447 103858
53666 103858 102709 101523 100075 98679 97897 98087 99114 100392 101359 101958 102434 102691 102254 101026 99661 98890
53650 98890 98792 99057 99559 100261 100892 101299 101863 102990 104351 105263 105708 106351 107580 109162 110801 112394 113734
53633 113734 114651 115541 117005 118886 120383 121302 122431 124358 126736 129027 131218 133343 135043 136154 137055
53618 137055 137950 138392 138142 137848 138207 138985 139549 139871 140291 140719 140844 140812 140975 141268 141492 141893 142734 143569 143680
53599 143680 143045 142196 141363 140422 139470 138746 138135 137423 136888 136924 137240 137094 136241 135110 134222 133978 134684 136090
53581 136090 137253 137609 137800 138619 139589 139765 139560 140349 142241 143748 144009 143989 144900 146655 148593 150627 152712
53564 152712 154056 153941 152898 152131 152025 152040 151845 151836 152504 153865 155619 157474 159272 160990 162661 164258 165767
$$ packed form
53684A14837o75m04J77O87N52j55p22p96q33j235j518r91L8M13l90j554j984j589
53666A03858j149j186j448j396p82J90J027J278R67N99M76K57m37j228j365p71
53650I8890r8K65N02P02O31M07N64J127J361R12M45O43J229J582J639J593J340
53633A13734R17Q90J464J881J497R19J129J927K378K291K191K125J700J111R01
53618A37055Q95M42k50k94L59P78N64L22M20M28J25l2J63K93K24M01Q41Q35J11
53599A43680o35q49q33r41r52p24o11p12n35L6L16j46q53j131q88k44P06J406
53581A36090J163L56J91Q19R70J76k05P89J892J507K61k0R11J755J938K034K085
53564A52712J344j15j043p67j06J5j95rO68J361J754J855J798J718J671J597J509
$$ plain form
53547 165767 167438 169656 172473 175436 178038 180160 182072 184210 186907 190013 192834 194838 196379 198295
53533 198295 200836 203526 206086 208813 211834 214621 216634 218037 219427 221175 223239 225285 226797 227451
53519 227451 227604 228105 229426 231284 233187 234888 236186 236766 236550 235899 235297 235066 235382 236088 236512 236086 235218
53502 235218 234919 235417 235927 236048 236543 238236 240821 243415 245710 247891 249830 251123 251717 251931 252018 252155 252713
53485 252713 254053 256120 258494 260754 262613 263987 265063 266063 266812 267011 267044 267932 270191 273321 276730
53470 276730 280545 285007 289748 294241 298444 302402 305841 308897 312666 318118 324807 331563 338153 345255
53456 345255 353003 360665 367908 375396 383764 392764 401795 410725 419847 429465 439792 450923 462645
53443 462645 474561 486535 498759 511343 524182 537321 551063 565511 580282 594844 608991
$$ packed form
53547A65767J671K218K817K963K602K122J912K138K697L106K821K004J541J916
53533A98295K541K690K560K727L021K787K013J403J390J748K064K046J512O54
53519B27451J53N01J321J858J903J701J298N80k16o51o02k31L16P06M24m26q68
53502B35218k99M98N10J21M95J693K585K594K295K181J939J293N94K14Q7J37N58
53485B52713J340K067K374K260J859J374J076J000P49J99L3Q88K259L130L409
53470B76730L815M462M741M493M203L958L439L056L769N452O689O756O590P102
53456C45255P748P662P243P488Q368R000R031Q930R122R618J0327J1131J1722
53443D62645J1916J1974J2224J2584J2839J3139J3742J4448J4771J4562J4147
$$ plain form
53432 608991 622943 637183 652186 668063 684393 700580 716356 731800 747006 761963 776700
53421 776700 791309 805838 820286 834585 848485 861741 874653 888020 902178 916398 929770
53410 929770 942384 955046 967974 980512 992099 1002885 1013254 1023277 1032733 1041139 1047748 1052126
53398 1052126 1054895 1057298 1059772 1061504 1061586 1060060 1057477 1053994 1049432 1043829 1037347 1029925 1021511 1012504
53384 1012504 1003477 994535 985331 975622 965465 954913 943943 932677 921334 909873 898091 886164
53372 886164 874763 864353 854611 844903 835231 826341 818803 812389 806599 801512 797673 795202 793499 791991
53358 791991 790789 790335 790715 791668 793015 794719 796697 799042 802290 806951 812788 819080 825761 833698 843523
53343 843523 854607 865735 876622 888272 901780 917154 933405 949587 965619 982277 1000549
$$ packed form
53432F08991J3952J4240J5003J5877J6330J6187J5776J5444J5206J4957J4737
53421G76700J4609J4529J4448J4299J3900J3256J2912J3367J4158J4220J3372
53410I29770J2614J2662J2928J2538J1587J0786J0369J0023R456Q406O609M378
53398A052126K769K403K474J732Q2j526k583l483m562n603o482p422q414r007
53384A012504r027q942r204r709j0157j0552j0970j1266j1343j1461j1782j1927
53372H86164j1401j0410r742r708r672q890p538o414n790n087l839k471j703j508
53358G91991j202m54L80R53J347J704J978K345L248M661N837O292O681P937R825
53343H43523J1084J1128J0887J1650J3508J5374J6251J6182J6032J6658J8272
$$ plain form
53332 1000549 1020962 1043310 1066941 1091235 1115954 1141296 1167774 1195898 1225750 1256729 1287869
53321 1287869 1318511 1348684 1378857 1409465 1440797 1473101 1506337 1539810 1572409 1603407 1632785
53310 1632785 1660629 1686686 1710880 1733846 1756240 1777689 1797089 1813905 1828408 1840495 1849253
53299 1849253 1854195 1856203 1856414 1854655 1849797 1841449 1830450 1817646 1802984 1786077 1767020 1746258 1724039
53286 1724039 1700471 1675951 1651135 1626419 1601585 1576022 1549341 1521824 1494340 1467818 1442780
53275 1442780 1419260 1396874 1374888 1352573 1329858 1307509 1286350 1266378 1246920 1227563 1208586
53264 1208586 1190509 1173598 1157872 1143245 1129476 1116152 1102931 1089783 1077016 1065125 1054497
53253 1054497 1045033 1036061 1026800 1016992 1006978 997239 988009 979176 970329 960979 951059 941238 932505 925352
$$ packed form
53332A000549K0413K2348K3631K4294K4719K5342K6478K8124K9852L0979L1140
53321A287869L0642L0173L0173L0608L1332L2304L3236L3473L2599L0998K9378
53310A632785K7844K6057K4194K2966K2394K1449J9400J6816J4503J2087Q758
53299A849253M942K008K11j759m858q348j0999j2804j4662j6907j9057k0762k2219
53286A724039k3568k4520k4816k4716k4834k5563k6681k7517k7484k6522k5038
53275A442780k3520k2386k1986k2315k2715k2349k1159j9972j9458j9357j8977
53264A208586j8077j6911j5726j4627j3769j3324j3221j3148j2767j1891j0628
53253A054497r464q972r261r808j0014r739r230q833q847r350r920r821q733p153
$$ plain form
53239 925352 919521 914487 910011 906289 903826 903130 904200 906276 908411 910382 912788 916218 920613 925597
53225 925597 931168 937769 945777 955074 965195 975824 987129 999483 1012812 1026385 1039444 1051889
53213 1051889 1064105 1076277 1088174 1099428 1109616 1118163 1124729 1129806 1134374 1138726 1142039 1143384 1142758
53200 1142758 1140768 1137720 1133515 1128202 1122061 1115123 1107083 1097817 1087700 1077277 1066782 1056012 1044501
53187 1044501 1031794 1017751 1002690 987181 971673 956368 941364 926678 912186 897745 883442
53176 883442 869512 856012 842773 829759 817193 805164 793334 781313 769250 757747 747215
53165 747215 737546 728400 719537 710735 701660 692074 682168 672507 663593 655478 647767 640012 632204 624865
53151 624865 618489 612905 607386 601429 595142 588755 582062 574673 566548 557961 549082 539944 530712 521533
$$ packed form
53239I25352n831n034m476l722k463o96J070K076K135J971K406L430M395M984
53225I25597N571O601Q008R297J0121J0629J1305J2354J3329J3573J3059J2445
53213A051889J2216J2172J1897J1254J0188Q547O566N077M568M352L313J345o26
53200A142758j990l048m205n313o141o938q040r266j0117j0423j0495j0770j1511
53187A044501j2707j4043j5061j5509j5508j5305j5004j4686j4492j4441j4303
53176H83442j3930j3500j3239j3014j2566j2029j1830j2021j2063j1503j0532
53165G47215r669r146q863q802r075r586r906r661q914q115p711p755p808p339
53151F24865o376n584n519n957o287o387o693p389q125q587q879r138r232r179
$$ plain form
53137 521533 512194 502358 492269 482792 474549 467256 460070 452437 444484 436748 429567 422642 415262 407077
53123 407077 398489 390012 381493 372466 363108 354216 346209 338780 331637 324926 318634 312278 305613 299114
53109 299114 293306 288076 283171 278859 275464 272542 269217 265187 260848 256483 251925 247062 242265 238203
53095 238203 235408 233949 233288 232581 231328 229531 227136 223804 219675 215860 213475 212308 211092 208998 206296
53080 206296 203538 200815 198056 195543 193768 192908 192674 192663 192786 193310 194256 194922 194521 193382 192818 193334 193682
53063 193682 192451 190028 188002 187027 186417 185710 185306 185254 184679 183100 181418 180770 180986 180998 180396 179754 179582 179722
53045 179722 179905 180349 181458 183175 184855 185806 185856 185372 184735 183974 183006 182021 181363 181045 180673 179834 178428 176680
53027 176680 175037 173912 173244 172435 170967 168966 166839 164581 161874 158761 155737 153182 151119 149433 147844
$$ packed form
53137E21533r339r836j0089r477q243p293p186p633p953p736p181o925p380q185
53123D07077q588q477q519r027r358q892q007p429p143o711o292o356o665o499
53109B99114n808n230m905m312l395k922l325m030m339m365m558m863m797m062
53095B38203k795j459o61p07j253j797k395l332m129l815k385j167j216k094k702
53080B06296k758k723k759k513j775q60k34j1J23N24R46O66m01j139n64N16L48
53063A93682j231k423k026r75o10p07m04n2n75j579j682o48K16J2o02o42j72J40
53045A79722J83M44J109J717J680R51N0m84o37p61r68r85o58l18l72q39j406j748
53027A76680j643j125o68q09j468k001k127k258k707l113l024k555k063j686j589
$$ plain form
53012 147844 145829 143137 140329 138158 136507 134650 132611 131321 131140 131063 129950 127893 125793 124107 122702
52997 122702 121611 121183 121484 121968 121841 120614 118496 116455 115590 116138 117243 117920 117976 117736 117239 116180 114565
52980 114565 112938 111823 111165 110409 109071 107221 105424 104171 103442 102952 102697 102942 103690 104504 104954 104946 104543
52963 104543 103780 102777 101772 100901 100117 99307 98255 96609 94316 92112 91050 91396 92414 93433 94596
52948 94596 96292 98301 99944 100837 101122 101117 100993 100723 100233 99675 99554 100295 101661 102892 103467 103462 103227 103097 103374
52929 103374 104053 104535 104167 103127 102217 101741 101286 100768 100804 101660 102622 103025 103299 104318 106162 108101 109461
52912 109461 109999 109800 109371 109523 110607 112103 113355 114382 115597 117147 118976 121124 123437 125442 127073
52897 127073 129085 132050 135359 137957 139719 141293 142862 144025 144798 145828 147444 149291 151099 153129
$$ packed form
53012A47844k015k692k808k171j651j857k039j290j81p7j113k057k100j686j405
52997A22702j091m28L01M84j27j227k118k041q65N48J105O77N6k40m97j059j615
52980A14565j627j115o58p56j338j850j797j253p29m90k55K45P48Q14M50qm03
52963A04543p63j003j005q71p84q10j052j646k293k204j062L46J018J019J163
52948I4596J696K009J643Q93K85nj24k70m90n58j21P41J366J231N75nk35j30K77
52929A03374O79M82l68j040r10m76m55n18L6Q56R62M03K74J019J844J939J360
52912A09461N38j99m29J52J084J496J252J027J215J550J829K148K313K005J631
52897A27073K012K965L309K598J762J574J569J163P73J030J616J847J808K030
$$ plain form
52883 153129 155589 158093 159931 160524 159596 157353 154633 152462 151237 150584 149953 149085 147956 146754 145899 145652
52867 145652 145645 145156 143913 142286 140730 139447 138616 138464 138948 139742 140647 141717 142867 143746 144167 144395 144819
52850 144819 145432 145754 145225 143753 141974 140817 140677 141163 141833 142758 144026 145119 145439 145244 145366 146053 146777
52833 146777 147241 147857 148957 150138 150794 150941 151158 151923 153272 154953 156644 158104 159184 159669 159234 157826
52817 157826 156017 154659 154174 154436 155280 156674 158402 160026 161330 162432 163329 163770 163749 163748 164150 164712 164919
52800 164919 164658 164249 163885 163371 162409 161022 159659 158963 159365 160803 162828 164964 166978 168843 170587 172162
52784 172162 173438 174377 175242 176467 178206 180216 182326 184770 187724 190740 193091 194634 195884 197177 198195
52769 198195 198528 198357 198230 198319 198152 197191 195508 193745 192397 191264 189777 187782 185722 184038 182714 181480
$$ packed form
52883A53129K460K504J838N93r28k243k720k171j225o53o31q68j129j202q55k47
52867A45652pm89j243j627j556j283q31j52M84P94R05J070J150Q79M21K28M24
52850A44819O13L22n29j472j779j157j40M86O70R25J268J093L20j95J22O87P24
52833A46777M64O16J100J181O56J47K17P65J349J681J691J460J080M85m35j408
52817A57826j809j358m85K62Q44J394J728J624J304J102Q97M41k1jM02N62K07
52800A64919k61m09l64n14r62j387j363o96M02J438K025K136K014J865J744J575
52784A72162J276R39Q65J225J739K010K110K444K954L016K351J543J250J293J018
52769A98195L33j71j27Q9j67r61j683j763j348j133j487j995k060j684j324j234
$$ plain form
52753 181480 180081 178151 175252 171450 167539 164304 161756 159480 157455 156037 155283 154789 154164 153271 152084
52738 152084 150684 149339 148196 146971 145339 143501 141963 140796 139539 137778 135486 132901 130452 128619
52724 128619 127374 125933 123586 120695 118248 116585 115285 114225 113875 114306 114683 114199 112986 111691 110636
52709 110636 109729 108828 107794 106500 105100 104086 103805 104153 104848 105691 106422 106678 106352 105665 104737 103425 101785
52692 101785 100274 99145 97941 95946 93024 89763 86910 84816 83316 82020 80774 79837 79448 79313 78832
52677 78832 77767 76385 74994 73792 73151 73471 74534 75457 75547 74906 74030 73191 72427 71790 71287 70817 70290 69644
52659 69644 68760 67649 66700 66318 66348 66326 66296 66738 67607 68188 68146 68005 68215 68489 68577 68957 70024 71137 71318 70674
52639 70674 70294 70830 71830 72537 72811 73155 74130 75818 77635 78800 79149 79281 79707 80218 80468 80789 81866
$$ packed form
52753A81480j399j930k899l802l911l235k548k276k025j418p54m94o25q93j187
52738A52084j400j345j143j225j632j838j538j167j257j761k292k585k449j833
52724A28619j245j441k347k891k447j663j300j060l50M31L77m84j213j295j055
52709A10636r07r01j034j294j400j014k81L48O95Q43P31K56l26o87r28j312j640
52692A01785j511j129j204j995k922l261k853k094j500j296j246r37l89j35m81
52677G8832j065j382j391j202o41L20J063R23R0o41q76q39p64o37n03m70n27o46
52659F9644q84j111r49l82L0k2l0M42Q69N81m2j41K10K74Q8L80J067J113J81o44
52639G0674l80N36J000P07K74L44R75J688J817J165L49J32M26N11K50L21J077
$$ plain form
52622 81866 83750 85801 87528 89016 90506 92033 93520 94821 95585 95443 94480 93257 92248 91374 90124
52607 90124 88093 85466 83102 81891 81859 82006 81308 79718 77977 76642 75688 74891 74162 73484 72871 72441 72275
52590 72275 72154 71640 70497 68898 67241 65914 65118 64763 64585 64492 64651 65089 65441 65405 65252 65530 66380 67516
52572 67516 68832 70595 72990 75815 78653 81020 82282 81840 79707 76716 73921 71867 70502 69609 69061
52557 69061 68726 68404 68017 67772 67957 68484 68839 68624 68139 68164 69103 70541 71723 72247 72221 71980 71901 72261 72971
52538 72971 73567 73691 73532 73570 73905 74114 73843 73338 73275 74110 75652 77295 78638 79812 81140 82639 84086
52521 84086 85471 87006 88592 89714 90107 90237 90733 91573 92222 92475 92755 93523 94703 95789 96357 96387 96238
52504 96238 96413 97232 98650 100372 102135 103851 105546 107223 108733 109748 109956 109385 108495 107930 108141 109211
$$ packed form
52622H1866J884K051J727J488J490J527J487J301P64j42r63j223j009q74j250
52607I0124k031k627k364j211l2J47o98j590j741j335r54p97p29o78o13m30j66
52590G2275j21n14j143j599j657j327p96l55j78r3J59M38L52l6j53K78Q50J136
52572F7516J316J763K395K825K838K367J262m42k133k991k795k054j365q93n48
52557F9061l35l22l87k45J85N27L55k15m85K5R39J438J182N24k6k41p9L60P10
52538G2971N96J24j59L8L35K09k71n05o3Q35J542J643J343J174J328J499J447
52521H4086J385J535J586J122L93J30M96Q40O49K53K80P68J180J086N68L0j49
52504I6238J75Q19J418J722J763J716J695J677J510J015K08n71q90n65K11J070
$$ plain form
52488 109211 110855 112601 114109 115336 116324 116861 116665 115880 115089 114666 114393 113921 113357 113137 113475 114232 115257
52471 115257 116515 117836 118781 118966 118523 118168 118707 120364 122595 124557 125725 126082 125979 125987 126602 127771 128807
52454 128807 129205 129378 130204 131847 133546 134590 134926 134732 134001 132876 131872 131329 131020 130658 130442 130651 131059
52437 131059 131200 131027 130805 130552 130067 129461 129162 129360 129779 130035 129917 129267 127969 126272 124891 124532 125258 126497
52419 126497 127646 128524 129124 129277 128997 129032 130334 132661 134412 134462 133590 133299 133737 133898 133603 133868 135154 136568
52401 136568 137337 137843 138514 138793 138157 137259 136998 137163 137091 137121 138092 139733 140837 141081 141532 143107 145415 147451
52383 147451 148700 149281 149585 150105 151211 152753 154156 154976 155127 154594 153338 151575 149812 148502 147815 147697
52367 147697 147939 148274 148623 149141 149900 150747 151654 152775 153906 154293 153502 152149 151233 150971 150776 150151 149101
$$ packed form
52488A09211J644J746J508J227R88N37j96p85p91m23k73m72n64k20L38P57J025
52471A15257J258J321R45J85m43l55N39J657K231J962J168L57j03QO15J169J036
52454A28807L98J73Q26J643J699J044L36j94p31j125j004n43l09l62k16K09M08
52437A31059J41j73k22k53m85o06k99J98M19K56j18o50j298j697j381l59P26J239
52419A26497J149Q78O00J53k80L5J302K327J751N0q72k91M38J61k95K65J286J414
52401A36568P69N06O71K79o36q98k61J65p2L0R71J641J104K44M51J575K308K036
52383A47451J249N81L04N20J106J542J403Q20J51n33j256j763j763j310o87j18
52367A47697K42L35L49N18P59Q47R07J121J131L87p91j353r16k62j95o25j050
$$ plain form
52350 149101 147913 147008 146839 147477 148476 149552 150992 152978 154966 156327 157148 157690 157567 156358 154674 153604
52334 153604 153329 153222 153187 153805 155188 156667 157715 158306 158363 157835 157351 157746 158746 159134 158458 157606 157454 157960
52316 157960 158908 160472 162500 164187 165025 165364 165566 165490 165288 165720 166995 168186 168646 169166 170739 172832 173964
52299 173964 173708 173095 173254 174486 176574 179171 181803 184109 186200 188454 190971 193580 196194 198795 201264
52284 201264 203560 205897 208344 210516 212080 213344 214915 216921 218949 220611 221793 222594 223430 225037 227856
52269 227856 231478 235050 238135 240865 243408 245741 247941 250379 253491 257466 262008 266304 269572 271912
52255 271912 274357 277786 282050 286504 291072 296243 302212 308632 315294 322502 330574 339300 348206 357187
52241 357187 366673 377109 388325 399629 410623 421781 433869 446828 459680 471676 483143 494972
$$ packed form
52350A49101j188r05j69O38R99J076J440J986J988J361Q21N42j23j209j684j070
52334A53604k75j07l5O18J383J479J048N91N7n28m84L95J000L88o76q52j52N06
52316A57960R48J564K028J687Q38L39K02p6k02M32J275J191M60N20J573K093J132
52299A73964k56o13J59J232K088K597K632K306K091K254K517K609K614K601K469
52284B01264K296K337K447K172J564J264J571K006K028J662J182Q01Q36J607K819
52269B27856L622L572L085K730K543K333K200K438L112L975M542M296L268K340
52255B71912K445L429M264M454M568N171N969O420O662P208Q072Q726Q906Q981
52241C57187R486J0436J1216J1304J0994J1158J2088J2959J2852J1996J1467J1829
$$ plain form
52229 494972 507698 521357 535866 551034 566401 581474 596091 610311 624195 637965 652090
52218 652090 666770 681445 695189 707536 718655 728894 738489 747605 756208 763931 770466 776148 781734
52205 781734 787479 792679 796392 798485 799732 800934 802114 802755 802703 802505 802712 803117 803061 802404 801744 801690 802303
52188 802303 803309 804485 805754 807271 809542 813096 817915 823541 829747 836612 843867 850832 857309 863992
52174 863992 871580 879990 888894 898490 909099 920341 931304 941401 950617 959104 967052 974732 982142
52161 982142 988636 993349 996009 997071 997155 996654 995665 993959 991086 986858 981619 975862 969715 963069 955964
52146 955964 948522 940684 932332 923489 914174 904333 894204 884408 875322 866640 857949 849408 841425 833992
52132 833992 826881 820252 814509 809722 805727 802600 800394 798546 796222 793306 790482 788268 786459 784583
$$ packed form
52229D94972J2726J3659J4509J5168J5367J5073J4617J4220J3884J3770J4125
52218F52090J4680J4675J3744J2347J1119J0239R595R116Q603P723O535N682N586
52205G81734N745N200L713K093J247J202J180O41n2j98K07M05n6o57o60n4O13
52188H02303J006J176J269J517K271L554M819N626O206O865P255O965O477O683
52174H63992P588Q410Q904R596J0609J1242J0963J0097R216Q487P948P680P410
52161I82142O494M713K660J062Q4n01r89j706k873m228n239n757o147o646p105
52146I55964p442p838q352q843r315r841j0129r796r086q682q691q541p983p433
52132H33992p111o629n743m787l995l127k206j848k324k916k824k214j809j876
$$ plain form
52118 784583 782425 779975 777358 774969 773283 772299 771407 769937 767734 765176 762726 760404 757604 753695 748944
52103 748944 744485 741082 738351 735571 732781 730410 728203 725404 721888 718299 715092 712180 709574 707606
52089 707606 706280 705083 703624 701869 699613 696435 692493 688685 685590 682724 679337 675527 672095 669585
52075 669585 667887 666604 665438 664282 663162 662041 660637 658668 656303 654054 652115 650126 647730 645052
52061 645052 642531 640530 639246 638616 638183 637393 636232 635287 635010 635325 636071 637396 639466 642196 645556 649790
52045 649790 654995 660889 667402 675097 684550 695538 707364 719768 732969 746908 761076 775264
52033 775264 790029 806158 823877 842729 862078 881571 901180 920875 940230 958478 975118
52022 975118 990462 1005397 1020547 1035758 1050372 1063812 1075795 1086165 1094817 1101833 1107496 1111941
$$ packed form
52118G84583k158k450k617k389j686r84q92j470k203k558k450k322k800l909m751
52103G48944m459l403k731k780k790k371k207k799l516l589l207k912k606j968
52089G07606j326j197j459j755k256l178l942l808l095k866l387l810l432k510
52075F69585j698j283j166j156j120j121j404j969k365k249j939j989k396k678
52061F45052k521k001j284o30m33p90j161r45k77L15P46J325K070K730L360M234
52045F49790N205N894O513P695R453J0988J1826J2404J3201J3939J4168J4188
52033G75264J4765J6129J7719J8852J9349J9493J9609J9695J9355J8248J6640
52022I75118J5344J4935J5150J5211J4614J3440J1983J0370Q652P016N663M445
$$ plain form
52010 1111941 1114829 1115589 1114156 1111337 1108261 1105494 1102758 1099415 1095048 1089669 1083595 1077231 1070794 1064232
51996 1064232 1057506 1050850 1044566 1038596 1032576 1026383 1020426 1015314 1011443 1008942 1007757 1007626 1008123 1008892 1009790
51981 1009790 1010808 1012054 1013840 1016544 1020166 1024158 1027893 1031221 1034423 1037743 1041160 1044545 1047827 1050946
51967 1050946 1053814 1056426 1058883 1061167 1062912 1063558 1062717 1060373 1056710 1051927 1046284 1040147 1033745 1026939
51953 1026939 1019410 1011082 1002165 992822 983004 972575 961315 948841 934894 919820 904367 888864
51941 888864 872937 856206 838798 820918 802392 783097 763469 744051 724779 705247 685482
51930 685482 665884 646570 627354 608364 590025 572368 554927 537484 520401 504013 488133
51919 488133 472437 456958 441899 427213 412695 398412 384851 372594 361842 352139 342670 332964
$$ packed form
52010A111941K888P60j433k819l076k767k736l343m367n379o074o364o437o562
51996A064232o726o656o284n970o020o193n957n112l871k501j185j31M97P69Q98
51981A009790J018J246J786K704L622L992L735L328L202L320L417L385L282L119
51967A050946K868K612K457K284J745O46q41k344l663m783n643o137o402o806
51953A026939p529q328q917r343r818j0429j1260j2474j3947j5074j5453j5503
51941H88864j5927j6731j7408j7880j8526j9295j9628j9418j9272j9532j9765
51930F85482j9598j9314j9216j8990j8339j7657j7441j7443j7083j6388j5880
51919D88133j5696j5479j5059j4686j4518j4283j3561j2257j0752r703r469r706
$$ plain form
51907 332964 323270 314075 305493 297338 289577 282227 274976 267483 260100 253718 248753 244692 240800 236855
51893 236855 233000 229336 225932 222876 220025 216961 213462 209794 206326 203085 199932 196993 194592 192822
51879 192822 191380 189839 187996 185993 184115 182415 180607 178430 176068 174051 172736 172017 171438 170524 169182
51864 169182 167905 167316 167314 167063 166152 165276 165156 165249 164396 162519 160713 159608 158684 157439 156220 155378 154422 152715
51846 152715 150486 148479 146938 145548 144107 142744 141621 140765 140073 139242 137942 136282 134836 133978 133478
51831 133478 132948 132299 131503 130313 128625 126744 125002 123399 121937 120881 120352 120037 119676 119477 119676 120051
51815 120051 120306 120555 120962 121283 121271 121214 121479 121800 121630 121002 120429 120123 119928 119896 120267 120854 121095 120853 120676 121100
51795 121100 122040 123047 123822 124332 124672 124973 125390 126120 127424 129405 131702 133718 135353 137151 139413 141552
$$ packed form
51907C32964r694r195q582q155p761p350p251p493p383o382m965m061l892l945
51893B36855l855l664l404l056k851l064l499l668l468l241l153k939k401j770
51879A92822j442j541j843k003j878j700j808k177k362k017j315p19n79r14j342
51864A69182j277n89kk51r11q76j20R3q53j877j806j105r24j245j219q42r56j707
51846A52715k229k007j541j390j441j363j123q56o92q31j300j660j446q58n00
51831A33478n30o49p96j190j688j881j742j603j462j056n29l15l61j99J99L75
51815A20051K55K49M07L21j2n7K65L21j70o28n73l06j95l2L71N87K41k42j77M24
51795A21100R40J007P75N10L40L01M17P30J304J981K297K016J635J798K262K139
$$ plain form
51779 141552 142797 143168 143228 143148 142730 142141 141886 141977 141781 140868 139551 138448 137918 137973 138320 138466 138191 137938 138302
51760 138302 139146 139745 139857 140039 140752 141719 142404 142571 142129 140976 139457 138551 139048 140700 142481 143539 143626
51743 143626 142926 141881 141056 140794 140912 140902 140387 139322 137980 136868 136455 136757 137310 137752 138225 139061 140233
51726 140233 141333 141923 141685 140497 138720 137288 137044 137935 139140 140075 140918 142038 143262 144068 144327 144416 144517
51709 144517 144189 142944 141095 139670 139387 140020 140884 141702 142703 144062 145654 147359 149252 151256 152920
51694 152920 153815 154101 154454 155378 156720 157926 158727 159451 160696 162739 165379 168328 171589 175339 179629 184314
51678 184314 189216 194121 198690 202651 206131 209497 212764 215393 216906 217489 217739 217955 217987 217740 217452 217352
51662 217352 217296 216952 216148 214865 213109 211069 209357 208695 209285 210584 211784 212340 212092 211197 210131 209540 209804
$$ packed form
51779A41552J245L71O0q0m18n89k55R1j96r13j317j103n30N5L47J46k75k53L64
51760A38302Q44N99J12J82P13R67O85J67m42j153j519r06M97J652J781J058Q7
51743A43626p00j045q25k62J18j0n15j065j342j112m13L02N53M42M73Q36J172
51726A40233J100N90k38j188j777j432k44Q91J205R35Q43J120J224Q06K59Q9J01
51709A44517l28j245j849j425k83O33Q64Q18J001J359J592J705J893K004J664
51694A52920Q95K86L53R24J342J206Q01P24J245K043K640K949L261L750M290M685
51678A84314M902M905M569L961L480L366L267K629J513N83K50K16L2k47k88j00
51662B17352n6l44q04j283j756k040j712o62N90J299J200N56k48q95j066n91K64
$$ plain form
51645 209804 210709 211599 211819 211106 209815 208805 208733 209320 209564 208891 207778 207027 206877 207219 208224 210028 212012
51628 212012 213237 213707 214543 216644 219736 222974 225992 229038 232506 236686 241597 246697 250947 253487 254165
51613 254165 253314 251307 248470 245164 241731 238528 236006 234382 233211 231883 230638 230418 231372 232250 231906
51598 231906 230825 230423 231236 232530 233430 233550 232636 230506 227496 224325 221311 218244 215116 212373 210242
51583 210242 208385 206513 204905 203954 203550 203210 202583 201576 200239 198749 197337 195963 194299 192236 190168
51568 190168 188501 187093 185495 183628 181829 180265 178745 177247 176180 175801 175617 174847 173419 171984 170914
51553 170914 169838 168517 167588 167767 168602 168768 167601 165701 163935 162579 161676 161534 162313 163552 164615 165343
51537 165343 165960 166675 167654 169018 170418 171057 170612 169873 169958 171181 173103 175313 177548 179397 180642 181743
$$ packed form
51645B09804R05Q90K20p13j291j010p2N87K44o73j113p51j50L42J005J804J984
51628B12012J225M70Q36K101L092L238L018L046L468M180M911N100M250K540O78
51613B54165q51k007k837l306l433l203k522j624j171j328j245k20R54Q78l44
51598B31906j081m02Q13J294R00J20r14k130l010l171l014l067l128k743k131
51583B10242j857j872j608r51m04l40o27j007j337j490j412j374j664k063k068
51568A90168j667j408j598j867j799j564j520j498j067l79j84p70j428j435j070
51553A70914j076j321r29J79Q35J66j167j900j766j356r03j42P79J239J063P28
51537A65343O17P15R79J364J400O39m45p39Q5J223J922K210K235J849J245J101
$$ plain form
51521 181743 183284 184997 186091 186536 187258 188868 190899 192593 193887 195200 196668 197969 198687 198603 197852 197005
51505 197005 196782 197412 198392 199040 199225 199447 200248 201601 202849 203262 202651 201362 199745 197982 196488 195957 196617
51488 196617 197839 198945 200074 201712 203675 205315 206626 208369 210967 213957 216722 219170 221354 222934
51474 222934 223527 223296 222797 222314 221667 220710 219806 219619 220321 221214 221510 221470 222246 224340 226809 228457 229241 229830
51456 229830 230346 230538 230921 232463 234889 236366 235435 232648 229810 228091 227264 226410 224863 222653 220292 218099
51440 218099 215795 213039 210232 208255 207386 206978 206259 204961 203113 200829 198517 196745 195649 194873 194205
51425 194205 193785 193629 193541 193650 194286 195123 195205 194269 193378 193697 195160 196883 198382 199788 201288 203018 205258
51408 205258 208105 211101 213744 216279 219479 223629 228067 231820 234459 236328 238137 240365 242953 245556
$$ packed form
51521A81743J541J713J094M45P22J610K031J694J294J313J468J301P18q4p51q47
51505A97005k23O30R80O48J85K22Q01J353J248M13o11j289j617j763j494n31O60
51488A96617J222J106J129J638J963J640J311J743K598K990K765K448K184J580
51474B22934N93k31m99m83o47r57r04j87P02Q93K96m0P76K094K469J648P84N89
51456B29830N16J92L83J542K426J477r31k787k838j719q27q54j547k210k361k193
51440B18099k304k756k807j977q69m08p19j298j848k284k312j772j096p76o68
51425A94205m20j56q8J09O36Q37Q2r36q91L19J463J723J499J406J500J730K240
51408B05258K847K996K643K535L200M150M438L753K639J869J809K228K588K603
$$ plain form
51394 245556 247936 250012 251684 252958 254100 255297 256264 256679 256923 257762 259229 260447 260727 260292 259754 259481
51378 259481 259676 260467 261633 262743 263738 264846 265820 266049 265608 265411 265915 266467 266258 265140 263092 259858 255762
51361 255762 251998 249327 247191 244843 242555 240833 239246 237134 234861 233236 232124 230790 229227 228000
51347 228000 227011 225614 223859 222474 221644 220889 220169 220011 220434 220814 221014 221603 222664 223383 223245 222790 222728 223084
51329 223084 223609 224344 225189 225509 224713 222886 220514 218005 215725 213928 212271 209890 206385 202377 198695
51314 198695 195422 192154 188849 185874 183402 181217 179099 177059 175142 173192 170900 168090 164934 161794
51300 161794 158812 155832 152784 149814 146793 143234 139251 136205 135477 136688 137942 137909 136853 135496 133904
51285 133904 132039 130546 130171 130760 131464 131735 131615 131283 130824 130380 130104 130029 130125 130399 130813 131339 132194 133636
$$ packed form
51394B45556K380K076J672J274J142J197R67M15K44Q39J467J218K80m35n38k73
51378B59481J95P91J166J110R95J108R74K29m41j97N04N52k09j118k048l234m096
51361B55762l764k671k136k348k288j722j587k112k273j625j112j334j563j227
51347B28000r89j397j755j385q30p55p20j58M23L80K00N89J061P19j38m55o2L56
51329B23084N25P35Q45L20p96j827k372k509k280j797j657k381l505m008l682
51314A98695l273l268l305k975k472k185k118k040j917j950k292k810l156l140
51300A61794k982k980l048k970l021l559l983l046p28J211J254l3j056j357j592
51285A33904j865j493l75N89P04K71j20l32m59m44k76p5R6K74M14N26Q55J442
$$ plain form
51267 133636 135317 136277 135949 134868 134039 133962 134590 135843 137564 139235 140377 141187 142249 143660 144953 145919
51251 145919 146927 148282 149796 151259 152875 154837 156700 157712 157679 157142 156730 156596 156525 156167 155060 152819
51235 152819 149719 146837 145109 144256 143049 140745 137893 135550 134107 133151 132172 130933 129314 127257 124977
51220 124977 122986 121816 121729 122538 123516 123702 122594 120524 118214 116120 114401 113193 112498 111977 111327 110777
51204 110777 110726 110928 110624 109582 108532 108277 108751 109198 109051 108371 107609 107131 106944 106814 106692 106893 107662 108685
51186 108685 109342 109411 109214 109094 109109 109283 109782 110669 111757 112754 113350 113241 112396 111322 110645 110373 110002 109414 109201
51167 109201 109869 111192 112605 113853 114894 115535 115621 115401 115313 115465 115644 115766 115939 116058 115691 114650 113564
51150 113564 113543 115050 117229 118649 118772 118403 118583 119422 120294 120786 120945 120876 120699 120840 121714 123075 124183 124681
$$ packed form
51267A33636J681R60l28j081q29p7O28J253J721J671J142Q10J062J411J293R66
51251A45919J008J355J514J463J616J962J863J012l3n37m12j34p1l58j107k241
51235A52819l100k882j728q53j207k304k852k343j443r56r79j239j619k057k280
51220A24977j991j170q7Q09R78J86j108k070k310k094j719j208o95n21o50n50
51204A10777n1K02l04j042j050k55M74M47j47o80p62m78j87j30j22K01P69J023
51186A08685O57O9j97j20J5J74M99Q87J088R97N96j09q45j074o77k72l71n88k13
51167A09201O68J323J413J248J041O41Q6k20q8J52J79J22J73J19l67j041j086
51150A13564k1J507K179J420J23l69J80Q39Q72M92J59o9j77J41Q74J361J108M98
$$ plain form
51132 124681 124773 124540 123724 122385 121166 120604 120677 121266 122495 124171 125401 125361 124201 122746 121483 120215 118624
51115 118624 116767 115052 113857 113190 112675 112089 111840 112567 114173 115708 116395 116337 115997 115446 114570 113644 113178
51098 113178 113305 113674 113917 113981 114044 114222 114232 113409 111335 108490 105895 104047 102641 101345 100215 99216 98092
51081 98092 97064 96900 97724 98462 98228 97642 97940 99172 100275 100706 101049 101964 103344 104692 105691 106269 106651
51064 106651 107404 108870 110526 111456 111533 111523 111978 112651 113199 113789 114616 115387 115728 115810 116115 116763 117402 117677 117591
51045 117591 117471 117641 118030 118091 117336 115935 114522 113398 112348 111315 110829 111445 113016 114847 116420 117692
51029 117692 118838 119971 121208 122705 124474 126168 127217 127352 127003 126942 127431 127895 127651 126751 125851 125409 125414
51012 125414 125740 126302 126831 126936 126552 126012 125581 125259 125133 125540 126640 128048 129180 129798 130121 130555 131383 132470
$$ packed form
51132A24681R2k33q16j339j219n62P3N89J229J676J230m0j160j455j263j268j591
51115A18624j857j715j195o67n15n86k49P27J606J535O87n8l40n51q76r26m66
51098A13178J27L69K43O4O3J78J0q23k074k845k595j848j406j296j130r99j124
51081I8092j028j64Q24P38k34n86K98J232J103M31L43R15J380J348R99N78L82
51064A06651P53J466J656R30P7j0M55O73N48N90Q27P71L41Q2L05O48O39K75q6
51045A17591j20J70L89O1p55j401j413j124j050j033m86O16J571J831J573J272
51029A17692J146J133J237J497J769J694J049J35l49o1M89M64k44r00r00m42N
51012A25414L26N62N29J05l84n40m31l22j26M07J100J408J132O18L23M34Q28J087
$$ plain form
50994 132470 133194 132921 131754 130600 130341 131121 132496 134009 135393 136527 137500 138575 139858 141077 141920 142440
50978 142440 142967 143712 144616 145493 146163 146603 147110 148069 149346 150129 149746 148546 147644 147841 149009 150488 151689
50961 151689 152343 152528 152629 153010 153626 154172 154663 155559 157150 159098 160847 162337 163981 166055 168387 170704
50945 170704 173048 175703 178831 182290 185787 189187 192689 196651 201197 206024 210669 214980 219271 224037
50931 224037 229564 235819 242607 249876 257849 266814 276678 286911 297083 307441 318751 331573 345856
50918 345856 361234 377406 394171 411402 429306 448616 470303 495021 522798 553104 585221
50907 585221 618775 654082 691861 732564 776093 822177 870574 920740 971757 1022992 1074567
50896 1074567 1126643 1178466 1228598 1276034 1320533 1361813 1398945 1430732 1456376 1475681 1489031
$$ packed form
50994A32470P24k73j167j154k59P80J375J513J384J134R73J075J283J219Q43N20
50978A42440N27P45R04Q77O70M40N07R59J277P83l83j200r02J97J168J479J201
50961A51689O54J85J01L81O16N46M91Q96J591J948J749J490J644K074K332K317
50945A70704K344K655L128L459L497L400L502L962M546M827M645M311M291M766
50931B24037N527O255O788P269P973Q965R864J0233J0172J0358J1310J2822J4283
50918C45856J5378J6172J6765J7231J7904J9310K1687K4718K7777L0306L2117
50907E85221L3554L5307L7779M0703M3529M6084M8397N0166N1017N1235N1575
50896A074567N2076N1823N0132M7436M4499M1280L7132L1787K5644J9305J3350
$$ plain form
50885 1489031 1497348 1501778 1503148 1501765 1497638 1490671 1480863 1468804 1455968 1443920 1433081 1422681 1411969
50872 1411969 1400767 1388725 1374811 1358136 1338755 1317094 1293031 1266163 1236630 1204911 1170893
50861 1170893 1133857 1093528 1050698 1006677 962441 918429 874939 832515 791998 754168 719307
50850 719307 687228 657727 630729 605935 582814 561263 541884 525242 511107 498792 487915
50839 487915 478394 470008 462583 456409 451851 448595 445855 443249 440953 439029 437238 435626 434714 434863 435919
50824 435919 437655 440192 443770 448397 453881 459959 466328 472868 479951 488181 497762 508363 519638 531515
50810 531515 543996 557173 571551 587807 606045 625716 646510 668897 693458 720133 748574
50799 748574 778890 811584 846984 885259 926995 973351 1025494 1083981 1148599 1218695 1293799
$$ packed form
50885A489031Q317M430J370j383m127o967r808j2059j2836j2048j0839j0400j0712
50872A411969j1202j2042j3914j6675j9381k1661k4063k6868k9533l1719l4018
50861A170893l7036m0329m2830m4021m4236m4012m3490m2424m0517l7830l4861
50850G19307l2079k9501k6998k4794k3121k1551j9379j6642j4135j2315j0877
50839D87915r521q386p425o174m558l256k740k606k296j924j791j612r12J49J056
50824D35919J736K537L578M627N484O078O369O540P083Q230R581J0601J1275J1877
50810E31515J2481J3177J4378J6256J8238J9671K0794K2387K4561K6675K8441
50799G48574L0316L2694L5400L8275M1736M6356N2143N8487O4618P0096P5104
$$ plain form
50788 1293799 1374158 1460555 1553479 1652619 1757294 1867027 1981275 2098709 2217241 2334879
50778 2334879 2450238 2562046 2668370 2766620 2854296 2929651 2991694 3039821 3073706 3093628 3100746
50767 3100746 3096820 3083653 3062914 3036399 3006175 2974289 2942457 2912147 2884677 2860850 2840384
50756 2840384 2821876 2803460 2783467 2760414 2732575 2698002 2655244 2603977 2544660 2477575 2402502
50745 2402502 2319443 2229375 2134047 2035218 1934368 1832946 1732502 1634556 1540550 1451844 1369377
50734 1369377 1293286 1223080 1158258 1098555 1043690 993316 947359 906100 869644 837477 808716
50723 808716 782698 759242 738406 720109 703969 689499 676457 664854 654490 644734 635036 625557
50711 625557 616937 609457 602830 596860 591908 588469 586505 585365 584305 583045 581934 581614 582399 584140 586769
$$ packed form
50788A293799Q0359Q6397R2924R9140J04675J09733J14248J17434J18532J17638
50778B334879J15359J11808J06324R8250Q7676P5355O2043M8127L3885J9922P118
50767C100746l926j3167k0739k6515l0224l1886l1832l0310k7470k3827k0466
50756B840384j8508j8416j9993k3053k7839l4573m2758n1267n9317o7085p5073
50745B402502q3059r0068r5328r8829j00850j01422j00444r7946r4006q8706q2467
50734A369377p6091p0206o4822n9703n4865n0374m5957m1259l6456l2167k8761
50723H08716k6018k3456k0836j8297j6140j4470j3042j1603j0364r756r698r479
50711F25557q620p480o627n970m952l439j964j140j060j260j111l20P85J741K629
$$ plain form
50696 586769 590649 596001 602269 608726 615654 624227 635105 647776 661513 676320 692574 710318 729473
50683 729473 750332 773341 798648 826307 856583 889594 924948 962289 1002050 1045105 1091695
50672 1091695 1141193 1192927 1246880 1303533 1363307 1426143 1491291 1557517 1623730 1689327 1753704
50661 1753704 1815588 1873302 1925637 1972107 2012275 2045161 2069364 2083546 2086849 2079363 2062434 2038321
50649 2038321 2009332 1977276 1943615 1909788 1877228 1847202 1820709 1798302 1779828 1764452 1751044
50638 1751044 1738534 1725848 1711658 1694357 1672403 1644807 1611315 1572123 1527410 1477275 1422144
50627 1422144 1363178 1302220 1241450 1182887 1127770 1076103 1027051 980127 935904 895440 859211
50616 859211 826888 797928 771999 748897 728465 710673 695603 683293 673668 666501 661297 657444
$$ packed form
50696E86769L880N352O268O457O928Q573J0878J2671J3737J4807J6254J7744J9155
50683G29473K0859K3009K5307K7659L0276L3011L5354L7341L9761M3055M6590
50672A091695M9498N1734N3953N6653N9774O2836O5148O6226O6213O5597O4377
50661A753704O1884N7714N2335M6470M0168L2886K4203J4182L303p486j6929k4113
50649B038321k8989l2056l3661l3827l2560l0026k6493k2407j8474j5376j3408
50638A751044j2510j2686j4190j7301k1954k7596l3492l9192m4713n0135n5131
50627A422144n8966o0958o0770n8563n5117n1667m9052m6924m4223m0464l6229
50616H59211l2323k8960k5929k3102k0432j7792j5070j2310r625p167n204l853
$$ plain form
50604 657444 654715 653406 653657 654956 656764 659439 663912 670467 678420 687076 696454 706966 718960 732801
$$ packed form
50604F57444k729j309K51J299J808K675M473O555P953Q656R378J0512J1994J3841
$$ [...]
##END NTUPLES=NMR SPECTRUM
##END=
