
##TITLE=AC1167_Meta-centauros3_5898838_SFqeAGUjo0
##JCAMPDX= 6.0         $$ Bruker NMR JCAMP-DX V2.0
##DATA TYPE= NMR SPECTRUM
##DATA CLASS= NTUPLES
##ORIGIN= BRUKER
##OWNER= Administrator
$$ 1.72 TOPSPIN		Version 2.1
$$ 2012-04-16 19:06:35.562 -0500  Administrator@TOPSPIN
$$ Compression mode = diff/dup
##.OBSERVE FREQUENCY= 400.13188235
##.OBSERVE NUCLEUS= ^1H
##.ACQUISITION MODE= SIMULTANEOUS (DQD)
##.ACQUISITION SCHEME= undefined
##.AVERAGES= 8
##.DIGITISER RES= 22
##SPECTROMETER/DATA SYSTEM= spect
##.PULSE SEQUENCE= zg30
##.SOLVENT NAME= COFFEE_meoh
##.SHIFT REFERENCE= INTERNAL, COFFEE_meoh, 1, 14.98061
##AUDIT TRAIL= $$ (NUMBER, WHEN, WHO, WHERE, PROCESS, VERSION, WHAT)
$$ ##TITLE= Audit trail, TOPSPIN		Version 2.1
$$ ##JCAMPDX= 5.01
$$ ##ORIGIN= Bruker BioSpin GmbH
$$ ##OWNER= Administrator
$$ $$ C:\Bruker\TOPSPIN/data/COFFEE/nmr/AC1167_Meta-centauros3_5898838_SFqeAGUjo0/20/pdata/1/auditp.txt
$$ ##AUDIT TRAIL=  $$ (NUMBER, WHEN, WHO, WHERE, PROCESS, VERSION, WHAT)
(   1,<2012-04-15 18:35:48.828 -0500>,<Administrator>,<TOPSPIN>,<go>,<TOPSPIN 2.1>,
      <created by zg
	started at 2012-04-15 18:34:42.046 -0500,
	POWCHK enabled, PULCHK disabled,
       configuration hash MD5:
       1A 1E CE 29 27 FD 77 03 67 4E F0 E3 C4 B2 CB 90
       data hash MD5: 64K
       88 4C 92 16 13 F8 C3 B8 EE DE DD 34 33 FD 81 01>)
(   2,<2012-04-15 18:35:51.562 -0500>,<Administrator>,<TOPSPIN>,<proc1d>,<TOPSPIN 2.1>,
      <Start of raw data processing
       efp LB = 0 FT_mod = 6 PKNL = 1 PHC0 = 0 PHC1 = 0 SI = 32K 
       data hash MD5: 32K
       D5 EA 54 8A 28 38 C9 67 DC 14 F1 0C 71 32 76 AE>)
(   3,<2012-04-15 18:35:51.906 -0500>,<Administrator>,<TOPSPIN>,<proc1d>,<TOPSPIN 2.1>,
      <pk PHC0 = 217.1832 PHC1 = 0 
       data hash MD5: 32K
       45 DA 03 9C F9 7B AF 0D 25 E8 D8 7A F0 21 17 26>)
(   4,<2012-04-15 18:35:51.968 -0500>,<Administrator>,<TOPSPIN>,<proc1d>,<TOPSPIN 2.1>,
      <abs ABSG = 1 
       data hash MD5: 32K
       1E 9A 8F 0F 10 20 5B AB D8 B7 D7 8A BE 4D 7F 02>)
(   5,<2012-04-15 18:35:52.000 -0500>,<Administrator>,<TOPSPIN>,<proc1d>,<TOPSPIN 2.1>,
      <abs ABSG = 2 
       data hash MD5: 32K
       FA D1 6C E4 E9 94 95 33 12 EE 48 15 67 08 B5 3C>)
(   6,<2012-04-15 18:35:52.031 -0500>,<Administrator>,<TOPSPIN>,<proc1d>,<TOPSPIN 2.1>,
      <abs ABSG = 3 
       data hash MD5: 32K
       B1 1D F8 EC 46 2E 91 73 63 6B B1 41 E1 3F BE B8>)
(   7,<2012-04-15 18:35:52.062 -0500>,<Administrator>,<TOPSPIN>,<proc1d>,<TOPSPIN 2.1>,
      <abs ABSG = 4 
       data hash MD5: 32K
       C4 F3 2A 74 FF D9 C2 5E BA A4 DA A4 45 AF 23 5A>)
(   8,<2012-04-15 18:35:52.078 -0500>,<Administrator>,<TOPSPIN>,<proc1d>,<TOPSPIN 2.1>,
      <abs ABSG = 5 
       data hash MD5: 32K
       53 C8 77 CB 12 02 8F 6D 70 9C 39 4D CC 0E 40 E0>)
(   9,<2012-04-15 18:35:55.921 -0500>,<Administrator>,<TOPSPIN>,<audit>,<TOPSPIN 2.1>,
      <user comment:
       ICON-NMR User ID: COFFEE
       data hash MD5: 32K
       53 C8 77 CB 12 02 8F 6D 70 9C 39 4D CC 0E 40 E0>)
$$ [...]
##$TP= (0..7)
150 150 150 150 150 150 150 150
##$TP07= 0
##$TPNAME0= <>
##$TPNAME1= <>
##$TPNAME2= <>
##$TPNAME3= <>
##$TPNAME4= <>
##$TPNAME5= <>
##$TPNAME6= <>
##$TPNAME7= <>
##$TPOAL= (0..7)
0.5 0.5 0.5 0.5 0.5 0.5 0.5 0.5
##$TPOFFS= (0..7)
0 0 0 0 0 0 0 0
##$TUNHIN= 0
##$TUNHOUT= 0
##$TUNXOUT= 0
##$USERA1= <user>
##$USERA2= <user>
##$USERA3= <user>
##$USERA4= <user>
##$USERA5= <user>
##$V9= 5
##$VALIST= <valist>
##$VCLIST= <CCCCCCCCCCCCCCC>
##$VD= 0
##$VDLIST= <DDDDDDDDDDDDDDD>
##$VPLIST= <PPPPPPPPPPPPPPP>
##$VTLIST= <TTTTTTTTTTTTTTT>
##$WBST= 2048
##$WBSW= 25
##$XGAIN= (0..3)
0 0 0 0
##$XL= 0
##$YL= 0
##$YMAX_a= 496794
##$YMIN_a= -586403
##$ZGOPTNS= <>
##$ZL1= 120
##$ZL2= 120
##$ZL3= 120
##$ZL4= 120
##$ABSF1= 14.98061
##$ABSF2= -5.57192
##$ABSG= 5
##$ABSL= 3
##$ALPHA= 0
##$AQORDER= 0
##$ASSFAC= 0
##$ASSFACI= 0
##$ASSFACX= 0
##$ASSWID= 0
##$AUNMP= <proc_prof1d_extract_pilot.lims>
##$AXLEFT= 0
##$AXNAME= <>
##$AXNUC= <1H>
##$AXRIGHT= 0
##$AXTYPE= 0
##$AXUNIT= <>
##$AZFE= 0.1
##$AZFW= 0.1
##$BCFW= 0
##$BC_mod= 0
##$BYTORDP= 0
##$COROFFS= 0
##$CY= 15
##$DATMOD= 1
##$DC= 0
##$DFILT= <>
##$DTYPP= 0
##$F1P= 0
##$F2P= 0
##$FCOR= 0.5
##$FTSIZE= 32768
##$FT_mod= 6
##$GAMMA= 0
##$GB= 0
##$INTBC= 1
##$INTSCL= 1
##$ISEN= 128
##$LB= 0
##$LEV0= 0
##$LPBIN= 0
##$MAXI= 10000
##$MC2= 0
##$MEAN= 0
##$ME_mod= 0
##$MI= 0
##$NCOEF= 0
##$NC_proc= -8
##$NLEV= 6
##$NOISF1= 0
##$NOISF2= 0
##$NSP= 0
##$NTH_PI= 0
##$NZP= 0
##$OFFSET= 14.98061
##$PC= 1
##$PHC0= 217.1832
##$PHC1= 0
##$PH_mod= 1
##$PKNL= yes
##$PPARMOD= 0
##$PPDIAG= 0
##$PPIPTYP= 0
##$PPMPNUM= 2147483647
##$PPRESOL= 1
##$PSCAL= 4
##$PSIGN= 0
##$PYNMP= <proc.py>
##$REVERSE= no
##$SF= 400.13
##$SI= 32768
##$SIGF1= 0
##$SIGF2= 0
##$SINO= 400
##$SIOLD= 32768
##$SPECTYP= <>
##$SREGLST= <1H.CDCl3>
##$SSB= 0
##$STSI= 32768
##$STSR= 0
##$SW_p= 8223.68421052632
##$SYMM= 0
##$S_DEV= 0
##$TDeff= 65536
##$TDoff= 0
##$TI= <>
##$TILT= no
##$TM1= 0
##$TM2= 0
##$TOPLEV= 0
##$USERP1= <user>
##$USERP2= <user>
##$USERP3= <user>
##$USERP4= <user>
##$USERP5= <user>
##$WDW= 1
##$XDIM= 32768
##$YMAX_p= 465998930
##$YMIN_p= -691049
##$CURPLOT= <Network HP LaserJet P1505>
##$CURPRIN= <$Network HP LaserJet P1505>
##$DFORMAT= <normdp>
##$LAYOUT= <+/1D_H.xwp>
##$LFORMAT= <normlp>
##$PFORMAT= <normpl>
##$SURQMSG= 1
$$ End of Bruker specific parameters
$$ ---------------------------------
##NTUPLES= NMR SPECTRUM
##VAR_NAME=  FREQUENCY,     SPECTRUM/REAL,   SPECTRUM/IMAG
##SYMBOL=    X,             R,               I
##VAR_TYPE=  INDEPENDENT,   DEPENDENT,       DEPENDENT
##VAR_FORM=  AFFN,          ASDF,            ASDF
##VAR_DIM=   32768,         32768,           32768
##UNITS=     HZ,            ARBITRARY UNITS, ARBITRARY UNITS
##FACTOR=    0.250966925370066, 1,           1
##FIRST=     8223.43324360095, -29030,       105945
##LAST=      0,             121991,          -68519
##MIN=       0,             -691049,         0
##MAX=       8223.43324360095, 465998930,    0
$$ Real data points
##PAGE= N=1
##DATA TABLE= (X++(R..R)), XYDATA
$$ [...]
19466c90011A16313b33765O0912C6731L58861a31999G75b4346L716q5427I4415
$$ -390011 116313 -233765 -172853 36731 395592 -131999 775 -24346 -20630 -106057 94415
19454a62214H4727m1245J06116E7155k1968J84794l5055a47101j49720A28058
$$ -162214 84727 43482 149598 57155 35187 219981 184926 -147101 -296821 128058
19443b74272J21047l0833G5984B8500a21089j36608k6922e8632l9757k49235k3384
$$ -274272 -153225 -184058 75984 28500 -121089 -257697 -284619 -58632 -98389 -347624 -371008
19432c71008a19765k54044d1297m6387j53713J7030J07700k17503a4508E6976
$$ -371008 -119765 -373809 -41297 -87684 -241397 -224367 -116667 -334170 -14508 56976
19421d4580k46185a45051c361G5792O6438h4680j64535j35423K7914G9503r766
$$ -44580 -290765 -145051 -3361 75792 142230 -84680 -249215 -384638 -356724 79503 69737
19410F9737k5538b96165d8793F9292a0831A23311c3661C19830q6114a45418A45875
$$ 69737 44199 -296165 -48793 69292 -10831 123311 -33661 319830 233716 -145418 145875
19398e6715j7806A55552a33803l42893O7143C43924A17789g8832B22757a00606
$$ -56715 -74521 155552 -133803 -476696 -409553 343924 117789 -78832 222757 -100606
19387F1075a8750k3742C5749K9043b1497B03853a91360B05432D6672h2528L011
$$ 61075 -18750 -42492 35749 64792 -21497 203853 -191360 205432 46672 -82528 -79517
19376g9517p9705A53811n2317K1654b14118L9348b2111j12201c1698j52159e87
$$ -79517 -159222 153811 101494 123148 -214118 -174770 -22111 -134312 -31698 -183857 -587
19364e4703E9985f4642l32859J56152A71177b25677A77852a20031j78331D8900
$$ -54703 59985 -64642 -397501 -241349 171177 -225677 177852 -120031 -298362 48900
19353a8126r7554L1490B71713a34620j89574O482H9277d55519a66539f5973D1182
$$ -18126 -115680 -84190 271713 -134620 -324194 -317712 89277 -455519 -166539 -65973 41182
19341C9004A2472a49800o4461A70905b85412J12371j07012F4626N3285a29128
$$ 39004 12472 -149800 -214261 170905 -285412 -173041 -280053 64626 117911 -129128
19330A26700r966D9978f2341E9549J62962a22327G8006C6651a83064c2016a1633
$$ 126700 116734 49978 -62341 59549 222511 -122327 78006 36651 -183064 -32016 -11633
19318g6117l5203A7939d66308d844d47o0613A50343c00241J10934r1565A25322
$$ -76117 -111320 17939 -466308 -4844 -447 -61060 150343 -300241 -189307 -280872 125322
19306B13814a36987I2483a31702k59223a37p5512A02450m4436b28930a09852l9902
$$ 213814 -136987 92483 -131702 -390925 -137 -75649 102450 58014 -228930 -109852 -149754
19295a49754O9351j12121P3413a0311j32617o7025j09781a11687E5464g2526H3716
$$ -149754 -80403 -192524 -119111 -10311 -142928 -209953 -319734 -111687 55464 -72526 83716
19283a94067A93160m7738a26027j38294M5883D8540a09837j31753R9262a9892
$$ -194067 193160 145422 -126027 -264321 -218438 48540 -109837 -241590 -142328 -19892
19272A6612d0022J1504p0639a8770l25885a26628A09601b0376j54359B52022j14578
$$ 16612 -40022 -28518 -99157 -18770 -344655 -126628 109601 -20376 -174735 252022 137444
19261A37444a57517H992b1610k75701F3873D304J00775b12194d369j11123k37159
$$ 137444 -157517 8992 -21610 -297311 63873 4304 105079 -212194 -4369 -115492 -352651
19250c52651h1030k3510B0173K2472b34810a09962E0416J07860R398l7800a56381
$$ -352651 -81030 -104540 20173 42645 -234810 -109962 50416 158276 167674 129874 -156381
19238a82251N4493j03716g1363A6456c5912j2188j61411l6658e0599A85434h8913
$$ -182251 -127758 -231474 -71363 16456 -35912 -48100 -209511 -246169 -50599 185434 -88913
19226a20101j6241C5170J21842B616h8890h630q3728A6087K72289f4149n2766
$$ -120101 -136342 35170 157012 2616 -88890 -8630 -92358 16087 288376 -64149 -116915
19215a16915A15192E1235a38829p5756C4138c58213d2895D4506a55521j5125I1868
$$ -116915 115192 51235 -138829 -214585 34138 -358213 -42895 44506 -155521 -170646 91868
19203c15926i9793m5209G0811b89188J37034m9358R8480o9323l076g6872b5439
$$ -315926 -99793 -145002 70811 -289188 -152154 -201512 -103032 -172355 -175431 -76872 -25439
19191b58288c0477o7536J2428a2679j16535q2325Q2787H1470c18600I2718i0770
$$ -258288 -30477 -98013 -85585 -12679 -129214 -211539 -128752 81470 -318600 92718 -90770
19179g6555q5726O8808L6381A92909a10354l40261J73280a03617B14069e4540
$$ -76555 -162281 -93473 -57092 192909 -110354 -450615 -277335 -103617 214069 -54540
19168C02555A11416f9536E5046c55718A59572a70871B67966a33093E955J33523
$$ 302555 111416 -69536 55046 -355718 159572 -170871 267966 -133093 5955 139478
19158A39478a32380j39644J24001f9020j83488m5025J42850G2600d00406a06807
$$ 139478 -132380 -272024 -148023 -69020 -252508 -297533 -154683 72600 -400406 -106807
19147b47451B7195J92329h606n1511o4732C55543d2172k1080j74364F5474L2219
$$ -247451 27195 219524 -8606 -60117 -124849 355543 -42172 -63252 -237616 65474 97693
19136I7693M207k775g6547j48971k94295b4269D50315A08168J60357a29926O4518
$$ 97693 101900 99125 -76547 -225518 -519813 -24269 450315 108168 268525 -129926 -65408
19125f5408k72042a30108d0964j17484A7375b24591F7707a31922j02677B68550
$$ -65408 -337450 -130108 -40964 -158448 17375 -224591 67707 -131922 -234599 268550
19114d4826e262k97039a03424A69378a89393g049F7871a75053e7296k29421h1984
$$ -44826 -5262 -302301 -103424 169378 -189393 -7049 67871 -175053 -57296 -286717 -81984
19102b56703A23333C2280a60525a915C07724b19092A12635d1985E325J56034f9163
$$ -256703 123333 32280 -160525 -1915 307724 -219092 112635 -41985 5325 161359 -69163
19090c91060B5509M6118P6312a01168d6513l4790E902J9403b96872A90531P9872
$$ -391060 25509 71627 147939 -101168 -46513 -81303 5902 25305 -296872 190531 270403
19079B70403m9502a7122A19520L621C8044b27195A75089J35553a48027a6089k1869
$$ 270403 220901 -17122 119520 123141 38044 -227195 175089 310642 -148027 -16089 -37958
19068c7958A22721m9829a53716e3114r7509E8259c78069a14045j05996B17946
$$ -37958 122721 72892 -153716 -53114 -150623 58259 -378069 -114045 -220041 217946
19057A17463B5665b78428e1303A86880n8503a49627c9915l4903j72449A83079
$$ 117463 25665 -278428 -51303 186880 128377 -149627 -39915 -74818 -247267 183079
19046b7573o2481C39705B3619b23970j13906J62128d0516j89716A42009B0141
$$ -27573 -90054 339705 23619 -223970 -337876 -175748 -40516 -230232 142009 20141
19035a71879B0315b39258F8013b23902A98784d51905c5604B0922a88334c6096
$$ -171879 20315 -239258 68013 -223902 198784 -451905 -35604 20922 -188334 -36096
19024a10536J9621j87877A32957b40112q2756a08113j87391J29055l1315n9862
$$ -110536 -90915 -278792 132957 -240112 -322868 -108113 -295504 -166449 -197764 -257626
19014b57626J25381H0237a79608A94547D102a85498h5923B08189g2751k22950
$$ -257626 -132245 80237 -179608 194547 4102 -185498 -85923 208189 -72751 -295701
19004b95701e9931A11244A2594N3949b4642j89327A72351b5252B94308a39100
$$ -295701 -59931 111244 12594 66543 -24642 -213969 172351 -25252 294308 -139100
18993A39186F3336c06124D6497i9780a017j37507J5440C13337G2160a15789H1907
$$ 139186 63336 -306124 46497 -99780 -1017 -138524 -123084 313337 72160 -115789 81907
18981H7562e2253j22268M6703C9696a25248j99545a46866q0963g3125f638A74813
$$ 87562 -52253 -174521 -127818 39696 -125248 -324793 -146866 -227829 -73125 -6638 174813
18969F6289b20781J03921A71425b01346g9499A65408h3088B07454f6030A84167
$$ 66289 -220781 -116860 171425 -201346 -79499 165408 -83088 207454 -66030 184167
18958G9051J36328J280L57504p5069g2298A34585k6900K8052o6478L8241L05041
$$ 79051 215379 216659 574163 499094 -72298 134585 107685 135737 69259 107500 412541
18947D12541c10614M4384c7121j96680c4851m8495b1667l96569K08888A52605
$$ 412541 -310614 -266230 -37121 -233801 -34851 -83346 -21667 -418236 -209348 152605
18936c7058D871Q9412b22903B99377c19983a40006j42327m3631e9914l8274j19404
$$ -37058 4871 94283 -222903 299377 -319983 -140006 -282333 -325964 -59914 -98188 -217592
18925b17592J00830p6601g4024j33080B2395N9173h4971c9191k13214A17798j9071
$$ -217592 -116762 -193363 -74024 -207104 22395 81568 -84971 -39191 -252405 117798 98727
18914I8727j8253C6402d3539A349J33042d8314b007G2406j7849L0231D237J07101
$$ 98727 80474 36402 -43539 1349 134391 -48314 -2007 72406 54557 84788 4237 111338
18902A11338a63522r5702B2134b24739C4592e4530C41233H7632K63961J50457
$$ 111338 -163522 -259224 22134 -224739 34592 -54530 341233 87632 351593 502050
18892E02050A68329O2997H6081j7330f6866K1226j4041B52496g497k72210D9238
$$ 502050 168329 231326 86081 68751 -66866 -45640 -59681 252496 -7497 -279707 49238
18880A75430C3408d6959a9563l95474b6217C8423J11005a50242g2419j18430n9826
$$ 175430 33408 -46959 -19563 -415037 -26217 38423 149428 -150242 -72419 -190849 -250675
18869b50675A55844h777l109B5535a3485A83350c86564A37450i8637F4821L50600
$$ -250675 155844 -8777 -11886 25535 -13485 183350 -386564 137450 -98637 64821 415421
18858D15421a56102A43058n179E4653f2884K3347p530A1871a62186m5783N3817
$$ 415421 -156102 143058 137879 54653 -62884 -39537 -47067 11871 -162186 -207969 -154152
18847a54152k1709A34929e6544l06338B8123Q0101L100K5881b59A90511E4044
$$ -154152 -175861 134929 -56544 -362882 28123 108224 111324 137205 -259 190511 54044
18835G5641J24277o491b01606e8548c803A56762f4060p5345M0772A64525c91737
$$ 75641 199918 193427 -201606 -58548 -3803 156762 -64060 -139405 -98633 164525 -391737
18823A46229a09481H6237b62170g9701q1969A59706b27761I4976c13610a28072
$$ 146229 -109481 86237 -262170 -79701 -161670 159706 -227761 94976 -313610 -128072
18812c47287m26D3043h9125E302d2795j20699d1071j47032F8663J41797G5589
$$ -347287 -347713 43043 -89125 5302 -42795 -163494 -41071 -188103 68663 210460 75589
18800A49242a1895A47505J69050H0937f8598A37568E0586c15099B44337E664M5783
$$ 149242 -11895 147505 316555 80937 -68598 137568 50586 -315099 244337 5664 51447
18789E1447i481o6964M084A42549a66919B37915F8479b3243q2325i150j17562
$$ 51447 -9481 -76445 -72361 142549 -166919 237915 68479 -23243 -105568 -9150 -126712
18778a26712M4980k10456d8920m06669g0038l48644J74261A40455a17926F4578
$$ -126712 -81732 -292188 -48920 -455589 -70038 -418682 -244421 140455 -117926 64578
18767i4490a9851A62413g1664o2893B5824O3674C8157a08684A71941q3669f4293
$$ -94490 -19851 162413 -71664 -134557 25824 89498 38157 -108684 171941 88272 -64293
18755B62160b02930A47010C4685b5919n7714L7829H908B167M0818j8704J6057
$$ 262160 -202930 147010 34685 -25919 -83633 -45804 8908 2167 42985 24281 40338
18744D0338b45326A37841b57440Q9446K7414k34348R5766B94239A36142a10886
$$ 40338 -245326 137841 -257440 -167994 -140580 -374928 -279162 294239 136142 -110886
18733b66006J05171m287A72830A5353O5247a34171A32545c12979a207r2403d267
$$ -266006 -160835 -165122 172830 15353 80600 -134171 132545 -312979 -1207 -93610 -4267
18721B29534b45530a11953j17033C5306J24484d4989A26080a82115A31566n5715
$$ 229534 -245530 -111953 -228986 35306 159790 -44989 126080 -182115 131566 75851
18711G5851a25880G4686b21939a8655A75470e59785H3569a44375e9019F5169a99650
$$ 75851 -125880 74686 -221939 -18655 175470 -559785 83569 -144375 -59019 65169 -199650
18699a80483l1198d2106E1464J7003k6403b26195P0382C13715A4094b26574h5143
$$ -180483 -211681 -42106 51464 68467 42064 -226195 -155813 313715 14094 -226574 -85143
18687a00491l37430J82127j03045f3226L969C3113b74269P0715A00733f3989k8133
$$ -100491 -437921 -255794 -358839 -63226 -59257 33113 -274269 -203554 100733 -63989 -92122
18676i2122M3450j10631E9695b8526j71042r2439a31997K865p4383e2660j54423
$$ -92122 -48672 -159303 59695 -28526 -199568 -292007 -131997 -129132 -203515 -52660 -207083
18665b07083j9811C2678J59699a07548k581a638H9612J2466e12355H8163c3765
$$ -207083 -226894 32678 192377 -107548 -110129 -1638 89612 102078 -512355 88163 -33765
18653D3349q415J25484f6974j4370l00442A3303a91026C8941K37148b3814j27764
$$ 43349 34934 160418 -66974 -81344 -381786 13303 -191026 38941 276089 -23814 -151578
18642a51578I6518k7142a05430F6544J50928K8786D9712E65d65707L3197a51039
$$ -151578 96518 69376 -105430 66544 217472 246258 49712 565 -465707 -432510 -151039
18630c43897E2457c86388a07457l3622l73932A67859a22904I3177b25884J01413
$$ -343897 52457 -386388 -107457 -141079 -515011 167859 -122904 93177 -225884 -124471
18620a24471A7755i5514k53207A06831b87258a02657j84189f0508J6789G4933
$$ -124471 17755 -95514 -348721 106831 -287258 -102657 -286846 -60508 -43719 74933
18609c4775A0215a29456A81211E5182K2228J64707a40441j88541M6804i6190A3489
$$ -34775 10215 -129456 181211 55182 77410 242117 -140441 -328982 -282178 -96190 13489
18597a72900F4271b59870k0314b0665A38397e6492j28489B20448a01944H690c7740
$$ -172900 64271 -259870 -280184 -20665 138397 -56492 -184981 220448 -101944 8690 -37740
18585b5898G3025J2877e103E9582a80411c8401H3570b02040f8347B31498g4454
$$ -25898 73025 85902 -5103 59582 -180411 -38401 83570 -202040 -68347 231498 -74454
18573C4533a51689A9923m3J54489M8861m5641a17808A18894m638c3215A3363g3684
$$ 34533 -151689 19923 19880 174369 223230 177589 -117808 118894 114256 -33215 13363 -73684
18560A1215a3595C2096a04942B02176n1873c23418m6224g5568j22731c6376F6332
$$ 11215 -13595 32096 -104942 202176 150303 -323418 -369642 -75568 -198299 -36376 66332
18548A7552b02227C79253A0406L16677a34423l70061f5311n0250B15573b54559
$$ 17552 -202227 379253 10406 327083 -134423 -504484 -65311 -115561 215573 -254559
18537c42024B51106d49333b5103k94468A96651c189m4123j66028A83679j6790
$$ -342024 251106 -449333 -25103 -319571 196651 -3189 -47312 -213340 183679 166889
18527A66889f5591l9857M5830k00339a9439k17068a09492k66017h3553j33493
$$ 166889 -65591 -105448 -59618 -259957 -19439 -236507 -109492 -375509 -83553 -217046
18517b17046k3877k6548Q4588f5691o6060N0968A76958b47571A2811c20540F8035
$$ -217046 -240923 -267471 -182883 -65691 -131751 -80783 176958 -247571 12811 -320540 68035
18505A29749a51059A120M7790K6799b13853r1768D7918b62160A10104C5596a78159
$$ 129749 -151059 1120 48910 75709 -213853 -305621 47918 -262160 110104 35596 -178159
18493a37938j92308J45619C24213E796b74671l0935f1876E5337i3415i886D63181
$$ -137938 -330246 -184627 324213 5796 -274671 -305606 -61876 55337 -93415 -9886 463181
18481b71370e32l21283J36378A10009a09680m19143f7597q5835m9800A45820d6584
$$ -271370 -532 -321815 -185437 110009 -109680 -528823 -67597 -153432 -203232 145820 -46584
18469I8785M20732a35785b3774G1469a40599C1369i8908r0778M4386B72485j02719
$$ 98785 519517 -135785 -23774 71469 -140599 31369 -98908 -189686 -145300 272485 169766
18458A69766g2463m237A38969l6864J8170b4188j61070A7507h3874k52239a29894
$$ 169766 -72463 -76700 138969 102105 120275 -24188 -185258 17507 -83874 -336113 -129894
18446H3589B6932N2109Q0868a1299q4863j6902o3273R798N9200L8096i364A37653
$$ 83589 26932 79041 159909 -11299 -96162 -113064 -176337 -166539 -107339 -69243 -9364 137653
18433I2847R9755J8532c88490a92686E8349f9260j53379k59217H536J45317b03268
$$ 92847 192602 211134 -388490 -192686 58349 -69260 -222639 -481856 8536 153853 -203268
18421c06465a0701l5741C0272a66004N0679j23172J12202J1954O199k57281b0233
$$ -306465 -10701 -46442 30272 -166004 -115325 -238497 -126295 -114341 -108142 -365423 -20233
18409A12498J13708B8358A3238K16738r4377a42043a8092j55556j88461C47449
$$ 112498 226206 28358 13238 229976 135599 -142043 -18092 -173648 -362109 347449
18398a23911B04023g9444a2124A05052g3761F1060c21623B16428a30527B06138
$$ -123911 204023 -79444 -12124 105052 -73761 61060 -321623 216428 -130527 206138
18387B28986d55392B52456i5317I8988j6476j5006K41018d41519a49330O5758
$$ 228986 -455392 252456 -95317 98988 82512 67506 308524 -441519 -149330 -83572
18377h3572A60309a6292A16227a39979D1165d28832I966M6530i7544B38551a14174
$$ -83572 160309 -16292 116227 -139979 41165 -428832 9966 56496 -97544 238551 -114174
18365b71319B58177e3608l6437j96281h1196a8581j15698B49502d1575j4734j8085
$$ -271319 258177 -53608 -90045 -286326 -81196 -18581 -134279 249502 -41575 -56309 -74394
18354g4394R374B52267A23022A1846c0138I66b69202C5a29047j6353D2230h625
$$ -74394 -65020 252267 123022 11846 -30138 966 -269202 35 -129047 -145400 42230 -8625
18341F3614K65355c65267A48459D2454a26586E46K41008i440G2936a17073c1964
$$ 63614 328969 -365267 148459 42454 -126586 546 241554 -9440 72936 -117073 -31964
18329c60432H1609a10354M6364j20699h6225K0957G1496J75713a11201K8417j7644
$$ -360432 81609 -110354 -63990 -184689 -86225 -65268 71496 247209 -111201 -82784 -100428
18318a00428k2521n7034G396d3959p761A45561b9753a1249B49889a95444h1836
$$ -100428 -122949 -179983 7396 -43959 -51720 145561 -29753 -11249 249889 -195444 -81836
18306f6446j85013D5069h547j10448D6590a22210G174b53040P2552A84500b86553
$$ -66446 -251459 45069 -8547 -118995 46590 -122210 7174 -253040 -180488 184500 -286553
18294i4373l3757A38127J18505D8555d77152C607b22619J01321B5562Q9090e8162
$$ -94373 -128130 138127 256632 48555 -477152 3607 -222619 -121298 25562 114652 -58162
18282I0439f1416C18343j38253c2535E431J81739N9297m1870a64672g1082l71024
$$ 90439 -61416 318343 180090 -32535 5431 187170 246467 204597 -164672 -71082 -442106
18271d42106h3188j93924J04941A2632J73207F4541d2599H4593J385a5810q7659
$$ -442106 -83188 -277112 -172171 12632 185839 64541 -42599 84593 85978 -15810 -103469
18260a03469H3653a1302k5495j42139I8129k6793a32623c1408H2848f1213q6806
$$ -103469 83653 -11302 -36797 -178936 98129 71336 -132623 -31408 82848 -61213 -148019
18249a48019I1144c04659i6178j84485F0040K79583c04624a40864O6597q5083
$$ -148019 91144 -304659 -96178 -280663 60040 339623 -304624 -140864 -74267 -159350
18239a59350m937B16244r7679A4283c87345a03478C35450p0497a68120d4798A21815
$$ -159350 -164287 216244 118565 14283 -387345 -103478 335450 264953 -168120 -44798 121815
18227D6201L41634a58097j06987H6803a31752m4694Q7699p4200b1956A31288C8690
$$ 46201 387835 -158097 -265084 86803 -131752 -176446 -88747 -162947 -21956 131288 38690
18215a71783e7719G1362b40191o6942J44211C39070f9133B9162J48880J00454
$$ -171783 -57719 71362 -240191 -307133 -162922 339070 -69133 29162 178042 278496
18205B78496b75220J18625A79696B1333b90811B32135a88299l4906Q914f2069
$$ 278496 -275220 -156595 179696 21333 -290811 232135 -188299 -223205 -214291 -62069
18194a30510B35038r5582b19412C00424c94348A4509b06310I736c4178D0144a50367
$$ -130510 235038 139456 -219412 300424 -394348 14509 -206310 9736 -34178 40144 -150367
18182b8821m313k98073A62544b4091k06016a11340d0636n5715A49906b55350A35235
$$ -28821 -33134 -331207 162544 -24091 -230107 -111340 -40636 -96351 149906 -255350 135235
18170b45747B40767A9908E433a83447C05344D8260L2787Q7743c54933A06106a42376
$$ -245747 240767 19908 5433 -183447 305344 48260 81047 168790 -354933 106106 -142376
18158a4242I5159a05417d7643n050l8181a7516k00709I773i7196A4221m697b11577
$$ -14242 95159 -105417 -47643 -52693 -90874 -17516 -218225 9773 -97196 14221 9524 -211577
18145B41224b8058k22881d8765J3062C788a41202F5494f0416r7367k5812p5097
$$ 241224 -28058 -250939 -48765 -35703 3788 -141202 65494 -60416 -157783 -183595 -258692
18134b58692g2015G145M2912K8035a57843C6185R6438E425J99553C0443P0962
$$ -258692 -72015 7145 50057 78092 -157843 36185 132623 5425 204978 30443 101405
18123A01405b83605p2565A2478Q868a21274o1106M7122b2330k38048n4900I7119
$$ 101405 -283605 -356170 12478 21346 -121274 -182380 -135258 -22330 -260378 -315278 97119
18111c45898B93436B0498e358k52116i607k803j82319K4522A21143J48793A5899
$$ -345898 293436 20498 -5358 -257474 -9607 -12410 -194729 -170207 121143 269936 15899
18099B72109B5936i5245M3962D8290a28187l0598k8423N3077f599l41400b6959
$$ 272109 25936 -95245 -51283 48290 -128187 -158785 -187208 -134131 -6599 -347999 -26959
18087b1921p8970j7484C0762J23258A1029K1010b49623H7823J2938O315E742c8575
$$ -21921 -100891 -118375 30762 154020 11029 32039 -249623 87823 100761 107076 5742 -38575
18074d0565n0914A13159h5822I8491C6584b07092f1778A3559a11108N4427A38052
$$ -40565 -91479 113159 -85822 98491 36584 -207092 -61778 13559 -111108 -56681 138052
18062I8816a42123o7730D44782B3208f2025D28134B01339J13867a24103B18488
$$ 98816 -142123 -209853 444782 23208 -62025 428134 201339 315206 -124103 218488
18051F6602a64670A6510J86296b43980B1817f5075M725k2641I2576a3363A37279
$$ 66602 -164670 16510 202806 -243980 21817 -65075 -60350 -82991 92576 -13363 137279
18039A13428g0536p7059d0937o1115q6681j10404B35785n2713b42401N419P5082
$$ 113428 -70536 -147595 -40937 -102052 -188733 -299137 235785 183072 -242401 -236982 -161900
18028a61900B21860g6174j3p9221C5018L27638A66417N6426H3072J02328M6110
$$ -161900 221860 -76174 -76187 -155408 35018 362656 166417 222843 83072 185400 231510
18017B31510b63065j31699a04363A66641f1846C6722f5939E839b54103B22805
$$ 231510 -263065 -394764 -104363 166641 -61846 36722 -65939 5839 -254103 222805
18006B14417l9980d261I8808a41822B10645a36365C48326D8922J63869a12735
$$ 214417 174437 -4261 98808 -141822 210645 -136365 348326 48922 212791 -112735
17995A77024a95346K7547C48J15469a60515j88062A68905a77372A40146h8004
$$ 177024 -195346 -167799 348 115817 -160515 -348577 168905 -177372 140146 -88004
17984B96886d5000k21416J01394l3003A06761J48340J21436A19446a87402B10621
$$ 296886 -45000 -266416 -165022 -198025 106761 255101 376537 119446 -187402 210621
17973I2029A799a29466O2764A64658C1705b79408g3498A57880b90674C5188e0810
$$ 92029 1799 -129466 -66702 164658 31705 -279408 -73498 157880 -290674 35188 -50810
17961a79616A14936m3010j8201A2911c50680C3063N5056a19073B01988D0517P3100
$$ -179616 114936 71926 53725 12911 -350680 33063 88119 -119073 201988 40517 113617
17950A13617f5358F0188g2535J0755B94049b24378C7429L9535J76726j04523E8149
$$ 113617 -65358 60188 -72535 -61780 294049 -224378 37429 76964 253690 149167 58149
17938a63085g484C76358A53528K05448h9095k4511B28058A1837b82391A33219
$$ -163085 -7484 376358 153528 358976 -89095 -113606 228058 11837 -282391 133219
17927a03814B34711b01642A28452K5049A2662a29207b6992B2658c8881B20623
$$ -103814 234711 -201642 128452 153501 12662 -129207 -26992 22658 -38881 220623
17916a57420B78468c57248a57895N700c2790A5822a07868a5823r5304k4377B93234
$$ -157420 278468 -357248 -157895 -152195 -32790 15822 -107868 -15823 -111127 -135504 293234
17904f6152C93120a38900j20667m5181i2903o8120G5197J3036K07862D2941a08888
$$ -66152 393120 -138900 -259567 -304748 -92903 -161023 75197 88233 296095 42941 -108888
17892i659j79546d2903C19165E1503L74461H1269L7747B2473b70189P3318L0004
$$ -9659 -189205 -42903 319165 51503 425964 81269 119016 22473 -270189 -196871 -166867
17881a66867B873a82820f7805B63607a62923O3388K6287B63539b26199n5757E3734
$$ -166867 2873 -182820 -67805 263607 -162923 -99535 -73248 263539 -226199 -281956 53734
17869B82045J8647b7939K556O518A35089D0522a17816A5607K94321D6254a17412
$$ 282045 300692 -27939 -25383 -18865 135089 40522 -117816 15607 309928 46254 -117412
17857b57481A61207b38769D9544a63222H7342J74146q2090G378e0163n4959M9771
$$ -257481 161207 -238769 49544 -163222 87342 261488 179398 7378 -50163 -105122 -55351
17846e5351k43176D07272B7K69240j06474a46824K6101k12846F3556d0034j79594
$$ -55351 -298527 407272 27 269267 162793 -146824 -120723 -333569 63556 -40034 -219628
17835b19628Q8649j523o8332K2864P1413A37297J94183e2486J204k93086L6040
$$ -219628 -130979 -132502 -200834 -177970 -106557 137297 331480 -52486 -51282 -344368 -308328
17824c08328A97704d13267a06836A57352J25895C5435a6935A73841o6993J15117
$$ -308328 197704 -413267 -106836 157352 283247 35435 -16935 173841 106848 221965
17814B21965R9120j06487a69110d0993E2424L127E253a84933A84136F9461o642
$$ 221965 321085 214598 -169110 -40993 52424 55551 5253 -184933 184136 69461 62819
17803F2819d0640r1447d4877A12006E5079j6055J58207H4268g7912K3110C52519
$$ 62819 -40640 -132087 -44877 112006 55079 39024 197231 84268 -77912 -54802 352519
17791e7258l13741A55877a30093K7413A91733E5470R269K16948A20045a63157
$$ -57258 -370999 155877 -130093 -102680 191733 55470 64739 281687 120045 -163157
17780g8599B71869f4667D747c2517k26925c910j22969j1158B03805D1433b86131
$$ -78599 271869 -64667 4747 -32517 -259442 -3910 -126879 -138037 203805 41433 -286131
17768H1123e8755b1218C05564L8232I5892g5009B76145O6988g846r5355L7419
$$ 81123 -58755 -21218 305564 343796 95892 -75009 276145 343133 -7846 -103201 -65782
17757f5782l1160A78797G2812b11228C02837H505K49687b31197d6871B62012o7197
$$ -65782 -96942 178797 72812 -211228 302837 8505 258192 -231197 -46871 262012 194815
17746A94815b44516m2491B0619c5234k14684A18745h7320H0231j8421c000A66898
$$ 194815 -244516 -287007 20619 -35234 -249918 118745 -87320 80231 61810 -3000 166898
17734c55257C51688A28920k1756K59453G8573c9522o8804B03820e9271B24492
$$ -355257 351688 128920 107164 366617 78573 -39522 -108326 203820 -59271 224492
17723b1962H8653a26981O3066G7676e1366G3017J51362F054K79187o3818C0084
$$ -21962 88653 -126981 -63915 77676 -51366 73017 224379 6054 285241 221423 30084
17711h4305p4167A43270h5724A89545k1030M31356A35349J87831a4409C2588b26100
$$ -84305 -158472 143270 -85724 189545 168515 599871 135349 323180 -14409 32588 -226100
17699b3225B0779J9801a69324A17886b12237a04215D93470A63604k4112c9225
$$ -23225 20779 40580 -169324 117886 -212237 -104215 493470 163604 139492 -39225
17688H1125L53932A94184m7233k6320n6051J2086L07222A58989a68210L4264D13065
$$ 81125 435057 194184 146951 120631 64580 76666 383888 158989 -168210 -133946 413065
17676B80755b66116C1983h6765B27677A08583a80410B75020L2242A30591b6904
$$ 280755 -266116 31983 -86765 227677 108583 -180410 275020 307262 130591 -26904
17665a96963B59359j8936J33097j09206A22903K92612a02752B1352d1413k14731
$$ -196963 259359 240423 373520 264314 122903 415515 -102752 21352 -41413 -256144
17655b56144A04213b01158A89095M8838m1284o6284J42515M1772C5049J57165
$$ -256144 104213 -201158 189095 237933 196649 130365 272880 314652 35049 192214
17645A92214K9468h9189A50429c4396A48032P8286E6537J93641B3645K17333n6523
$$ 192214 221682 -89189 150429 -34396 148032 226318 56537 250178 23645 240978 184455
17634A84455K19875C7140a58168A47502B5163L23553n0530A14405J6386J09272
$$ 184455 404330 37140 -158168 147502 25163 348716 298186 114405 130791 240063
17624B40063a43579C87136A41167P6796i5272C8940a7766F7099J18134m4057c4616
$$ 240063 -143579 387136 141167 217963 -95272 38940 -17766 67099 185233 141176 -34616
17612a5890F1952h5612a0228B27677j03395a87426A6411g5525j56957B96855A35966
$$ -15890 61952 -85612 -10228 227677 124282 -187426 16411 -75525 -232482 296855 135966
17600E8920O4636E4583N8660P5425A6009c5990A42334a10735L2878A38252k1718
$$ 58920 123556 54583 113243 188668 16009 -35990 142334 -110735 -77857 138252 116534
17589A16534A6231K6569j4089c4700B77590C9443c309j58475A29500K07006a1205
$$ 116534 16231 42800 28711 -34700 277590 39443 -3309 -161784 129500 336506 -11205
17577B91932A09943d8333A0602J82793J06034g715j9074H445O4116M8004o986
$$ 291932 109943 -48333 10602 193395 299429 -7715 -26789 8445 72561 120565 113579
17566A13579a70322F9086P6192L28690A73706G1767A2214J03904D8847K53618
$$ 113579 -170322 69086 145278 473968 173706 71767 12214 116118 48847 302465
17556C02465n4147N024M4362O8091r2616n4464P7520A43043d6745A18945A6348
$$ 302465 248318 253342 297704 365795 273179 218715 296235 143043 -46745 118945 16348
17544A18471m011J91329g254B75815j32341L88379a30526H4718a08486B5766L00312
$$ 118471 114460 305789 -7254 275815 143474 531853 -130526 84718 -108486 25766 326078
17533C26078H5421l5695L58591j74069J26545A29960M8536q8350J54474J32665
$$ 326078 85421 49726 408317 234248 360793 129960 178496 90146 244620 377285
17523C77285B3872J63384b6922C11999K258J0611A47442J54719E6713J71192K3078
$$ 377285 23872 187256 -26922 311999 314257 324868 147442 302161 56713 227905 250983
17512B50983K78121J6250K69305o2805L35202l73580k57325J68292J20814j28635
$$ 250983 529104 545354 814659 751854 1087056 713476 456151 624443 745257 616622
17502F16622B42860K23665A44319d6938D81747l416L6203K71874J77842q0414
$$ 616622 242860 466525 144319 -46938 481747 478331 514534 786408 964250 883836
17492H83836k39360O9003A55405N36242j75570j27026r2826K31859p9784o5711
$$ 883836 644476 713479 155405 691647 516077 389051 296225 528084 448300 382589
17482C82589Q7183A89843N6504l5737C2886K2693J36098J9332h2226C30345l9972
$$ 382589 469772 189843 246347 210610 32886 55579 191677 211009 -82226 330345 290373
17471B90373N687K07852l0827A68133c7984H8701L22724I1313P5260p1656e4694
$$ 290373 296060 503912 473085 168133 -37984 88701 411425 91313 166573 94917 -54694
17459A43642J70782a5370F7592K12104J59512k12489K95542P9726a67188A46614
$$ 143642 314424 -15370 67592 279696 439208 226719 522261 601987 -167188 146614
17448A22971K93887A71933J07451A17293J96534J23998j74668I4094L58916O4169
$$ 122971 416858 171933 279384 117293 313827 437825 263157 94094 453010 517179
17438E17179j17380A06013J54962K309L5563j27658L14583J0126B12168K08302
$$ 517179 399799 106013 260975 263284 298847 171189 485772 495898 212168 420470
17428D20470A82209K4750Q5313P3951M1899A32080M62427k52391p6727R277R4302
$$ 420470 182209 206959 292272 366223 408122 132080 594507 342116 265389 274666 368968
17417C68968I8631J53646L4216q289G1159J62318I3275Q8242E4706K1573K38459
$$ 368968 98631 252277 286493 278204 71159 233477 93275 181517 54706 76279 314738
17406C14738r6563m4196J37564R538E7204K71390a9120B68807J33710j26114j15770
$$ 314738 218175 173979 311543 321081 57204 328594 -19120 268807 402517 276403 160633
17395A60633O4383J96524g4329A38156K12015j56200o3609M9901c7720D29150
$$ 160633 225016 421540 -74329 138156 350171 193971 130362 180263 -37720 429150
17384D57924j65849A13103J52038K10575A97506e590m401A54380P7168P003D1188
$$ 457924 292075 113103 265141 475716 197506 -5590 -9991 154380 231548 238551 41188
17372B13902f4984K4010G45M72109j68753E7728K00969B2155Q4021c638D03293
$$ 213902 -64984 -40974 745 472854 304101 57728 258697 22155 106176 -3638 403293
17360A33300B9093J93238L5411Q3761r7210N135k3468J50551Q7226l5357e8347
$$ 133300 29093 222331 257742 341503 244293 249428 225960 376511 463737 428380 -58347
17348D32287k07571k7005E82R1623d4926A90955o8083J05149j9711i2037C61029
$$ 432287 224716 197711 582 92205 -44926 190955 122872 228021 208310 -92037 361029
17336B24938k2478M0597k8173L58896H5940J68289j02919J09182Q7393j4732n6285
$$ 224938 202460 243057 214884 573780 85940 254229 151310 260492 347885 333153 276868
17325B76868j34990J716J21K11251P0631j46129L3537F4429Q6585O8153K09689
$$ 276868 141878 143594 143715 354966 425597 279468 313005 64429 151014 219167 428856
17314D28856A27063r799M6319J71720B3967N08588H1143J02394K51423j14600
$$ 428856 127063 117264 163583 335303 23967 532555 81143 183537 434960 320360
17304C20360g3483A68900a46373c7767D93016r9932J89681a078D85896r6732O9729
$$ 320360 -73483 168900 -146373 -37767 493016 393084 582765 -1078 485896 389164 458893
17293D58893p5261H9698m4514K64235J27515j37479n1736E0634L00564I0836D0109
$$ 458893 383632 89698 45184 309419 436934 299455 247719 50634 351198 90836 40109
17281B36715J55438p9640l9152n0853L08025B50637K29031A39217a2967A95832
$$ 236715 392153 312513 273361 222508 530533 250637 479668 139217 -12967 195832
17270C18503o6543G2814K03350J27461A50930a80259E82085C6008K05023c5329
$$ 318503 251960 72814 276164 403625 150930 -180259 582085 36008 241031 -35329
17259A02113K69074j17167o0095o2019a24498C93277q5607l1612J04804E7063
$$ 102113 371187 254020 193925 131906 -124498 393277 307670 276058 380862 57063
17248B21568J40375d8761A11663K40054n2020O1919A40936L00517j90892L02557
$$ 221568 361943 -48761 111663 351717 299697 361616 140936 441453 250561 553118
17238E53118a84190C97327j95845K42970k2834B02263L0589I0623J73527K13745
$$ 553118 -184190 397327 201482 444452 421618 202263 232852 90623 264150 477895
17228D77895B09310R4981J97297A68629l1716J67418L6645j07903J0835j19626
$$ 477895 209310 304291 501588 168629 136913 304331 340976 233073 243908 124282
17218A24282L91149j17306J29592k54168J08348A10431K75040K21326B21672K03322
$$ 124282 515431 398125 527717 273549 381897 110431 385471 606797 221672 424994
17208D24994k09009A05803J87196j6497K0581J9832L4437k6597J40794k27526
$$ 424994 215985 105803 292999 276502 297083 316915 351352 324755 465549 238023
17198B38023J53160j75320J61454J69574l0048A87110l6577K87494B18460A09173
$$ 238023 391183 215863 377317 546891 516843 187110 150533 438027 218460 109173
17187C71920O3000j05563J49003j0699J88054B09242Q5205O1908L94412B90408
$$ 371920 434920 329357 478360 467661 655715 209242 294447 356355 750767 290408
17176D78049K9729n1919r6178j46771L45210B06900P8242Q0758M1264M5537K51526
$$ 478049 507778 455859 359681 212910 558120 206900 285142 365900 407164 452701 704227
17165G04227B24053M50554r6165O3413k92138m4160J43779A92101L95768j69364
$$ 704227 224053 674607 578442 641855 349717 305557 449336 192101 587869 418505
17155D18505R5349B45999K01931j15291K24024j6052o9523p9210m1529n3998A38992
$$ 418505 513854 245999 447930 332639 556663 540611 471088 391878 350349 296351 138992
17143D93189j14167r5513K60522r3354J47149j43633m5338J79529j93715r496
$$ 493189 379022 283509 544031 450677 597826 454193 408855 588384 394669 385173
17133C85173K07915A02279a72965E85836j9424j29076L6660o3267J55913A93935
$$ 385173 593088 102279 -172965 585836 566412 437336 473996 410729 566642 193935
17122H37493k84944L32920j79858k96752J66876j08323J74285k68179N64428D10134
$$ 837493 552549 885469 705611 408859 575735 467412 641697 373518 937946 410134
17111C06417Q1497l6045L36838l40177K64904M4983H2217K39714K88454R9356
$$ 306417 387914 351869 688707 348530 613434 658417 82217 321931 610385 709741
17101G09741j70652K0505j25893L05240j43176J0058L86351k65223A51713M99728
$$ 709741 539089 559594 433701 738941 595765 605823 992174 726951 151713 651441
17091F51441J68071j88932J54881C81105j59139O8269M09390n9559j99768K32551
$$ 651441 819512 630580 785461 381105 221966 290235 699625 640066 440298 672849
17081F72849l2909j10623J10697J46236p8507j62527n0404n6089N6352R075J5448
$$ 672849 639940 529317 640014 786250 707743 545216 494812 438723 495075 504150 519598
17070E19598K0188L27829l29270p8841L87205k36696j70985K87508o3912k2889
$$ 519598 539786 867615 538345 459504 846709 610013 439028 726536 662624 639735
17060F39735j51684o7811L7454J19124K50839k93609M42701j69861j38983J03815
$$ 639735 488051 420240 457694 576818 827657 534048 976749 806888 667905 771720
17050G71720k96234O0544L14303l86028J69114J72529J5004l90046N46982j23694
$$ 771720 475486 536030 850333 464305 633419 805948 820952 430906 977888 854194
17040H54194J40087m02258J84190j3370K13661j28448L3562l57399K51733J11493
$$ 854194 994281 592023 776213 762843 976504 848056 881618 524219 775952 887445
17030H87445j65576L71214m70005K77514l14763J81030Q4535j32224J30821l20368
$$ 887445 721869 1093083 623078 900592 585829 766859 851394 719170 849991 529623
17020E29623J00973L72903m87540O77519k75953j84717K73470k72038j6427K33684
$$ 529623 630596 1003499 515959 1193478 917525 732808 1006278 734240 717813 951497
17010I51497j97207K50883k46476M0454N0997K55992o0882L13664m58095L149
$$ 951497 754290 1005173 758697 799151 850148 1106140 1045258 1358922 900827 903976
17000I03976K04758j96265J96528k10731J732m9648K80524j78279L68048l53250
$$ 903976 1108734 912469 1108997 898266 899998 850350 1130874 952595 1320643 967393
16990I67393k39038J06527K80594O232k02647L56351m03870n0292J1549K33931
$$ 967393 728355 834882 1115476 1121708 919061 1275412 871542 821250 832799 1066730
16980A066730K01115m2764P4119m64089L15138j01127O5098N1659M41492l59501
$$ 1066730 1267845 1225081 1299200 835111 1150249 1049122 1114220 1165879 1607371 1247870
16970A247870j37622l2984J21593J0159k79171M98786l69551K43857q6155O9983
$$ 1247870 1110248 1077264 1198857 1209016 929845 1428631 1059080 1302937 1216782 1286765
16960A286765J81311j76019n716K5207l7706k8147K15718J35770l90628J88288
$$ 1286765 1468076 1292057 1286341 1311548 1273842 1245695 1461413 1597183 1206555 1394843
16950A394843k28271L11349k7660J85028j85331k90429K87580j11510J98527k1278
$$ 1394843 1166572 1477921 1450261 1635289 1449958 1159529 1447109 1335599 1534126 1512848
16940A512848j1615m0603J55628K88182k66067j40742K54977j88932j4078j7110
$$ 1512848 1501233 1460630 1616258 1904440 1638373 1497631 1752608 1563676 1549598 1532488
16930A532488O1190J65560l21462J71700r9094p8899L19250N8303l91506L45816
$$ 1532488 1593678 1759238 1437776 1609476 1510382 1431483 1750733 1809036 1417530 1763346
16920A763346J80283j47915K26810m31782J17910r3919J28218j1327M85871j13450
$$ 1763346 1943629 1795714 2022524 1590742 1708652 1614733 1742951 1731624 2217495 2104045
16910B104045k43485J88670k15979N27552k48701J27436k08590j4029J52355k00621
$$ 2104045 1860560 2049230 1833251 2360803 2112102 2239538 2030948 2016919 2169274 1968653
16900A968653L8488K55917K09452j75579N4264J64379J23141j68246k55733K54105
$$ 1968653 2007141 2263058 2472510 2296931 2351195 2515574 2638715 2470469 2214736 2468841
16890B468841K04231q0829k08332j32505N4286K61631N5824r4426j1329K35308
$$ 2468841 2673072 2592243 2383911 2251406 2305692 2567323 2623147 2528721 2517392 2752700
16880B752700k28833K33590k93050J84750L11584q5263Q0270q0672J39845K14260
$$ 2752700 2523867 2757457 2464407 2649157 2960741 2875478 2955748 2875076 3014921 3229181
16870C229181l94439K38083K14151q3773L2355p7170n8198J03801K29597l10531
$$ 3229181 2834742 3072825 3286976 3203203 3235558 3158388 3100190 3203991 3433588 3123057
16860C123057K45267j3776K16313K43985k45257l32880P39579l42625M6944J00353
$$ 3123057 3368324 3354548 3570861 3814846 3569589 3236709 3976288 3633663 3680607 3780960
16850C780960K26512j90186J46134J36820j1360K14152j8946j83121J38726L82564
$$ 3780960 4007472 3817286 3963420 4100240 4088880 4303032 4284086 4100965 4239691 4622255
16840D622255k95010O79615o12085K13647q0944K06102L8079Q7314K07650o1264
$$ 4622255 4327245 5006860 4394775 4608422 4527478 4733580 4771659 4858973 5066623 5005359
16830E005359L49111Q4509k3018m4133M09793l23248L68902o846J13721J473K32411
$$ 5005359 5354470 5438979 5415961 5371828 5781621 5458373 5827275 5820429 5934150 5935623 6168034
16819F168034j7136J43993K29234J04027p0573J4283M31293K65490l41588K07802
$$ 6168034 6150898 6294891 6524125 6628152 6557579 6571862 7003155 7268645 6927057 7134859
16809G134859j15208Q68717k78751J413K53565J6743L44794M98115p1054n0472
$$ 7134859 7019651 7888368 7609617 7611030 7864595 7881338 8226132 8724247 8653193 8602721
16799H602721L05307L62347P4754r478N21035K64197p0561K79934J89291L40473
$$ 8602721 8908028 9270375 9345129 9335651 9856686 10120883 10050322 10330256 10519547 10860020
16789A0860020Q5894L06385K27748M50199k05241R45431q1991L53588L49169K57949
$$ 10860020 10945914 11252299 11480047 11930246 11725005 12670436 12588445 12942033 13291202 13549151
16779A3549151M04739K77366N66172L42712L29325N88938J51320P18530K18529
$$ 13549151 13953890 14231256 14797428 15140140 15469465 16058403 16209723 16928253 17146782
16770A7146782N22611M29006K03425Q73585N25833N52881Q03383L15414N01103
$$ 17146782 17669393 18098399 18301824 19175409 19701242 20254123 21057506 21372920 21874023
16761B1874023Q73334M94188Q77431O28086J049585M05368J391764O48326J032972
$$ 21874023 22747357 23241545 24118976 24747062 25796647 26202015 27593779 28242105 29275077
16752B9275077P53865J012763J099246J119606J113244J765317R04961J309102
$$ 29275077 30028942 31041705 32140951 33260557 34373801 36139118 37044079 38353181
16744C8353181J227135J867553J347253J161008K000148J820762J828435J932371
$$ 38353181 39580316 41447869 42795122 43956130 45956278 47777040 49605475 51537846
16736E1537846J726299K199753K063876K307150J942047K434260K997737K040082
$$ 51537846 53264145 55463898 57527774 59834924 61776971 64211231 67208968 69249050
16728F9249050K723375K858355K864398K503759K903354K853714L194277K579256
$$ 69249050 71972425 74830780 77695178 80198937 83102291 85956005 89150282 91729538
16720I1729538L079114L086665K455945K753196K597612K971382K021426K098322
$$ 91729538 94808652 97895317 100351262 103104458 105702070 108673452 110694878 112793200
16712A12793200J855468J585361J623137J143588Q74087M16855K09361o0199n24976
$$ 112793200 114648668 116234029 117857166 119000754 119874841 120291696 120501057 120440858 119915882
16703A19915882p69100j093580j455592j483547k121439k079685k370827k723771
$$ 119915882 119146782 118053202 116597610 115114063 112992624 110912939 108542112 105818341
16695A05818341k538494k688581k752354l126863k662872l067465l009717l142992
$$ 105818341 103279847 100591266 97838912 94712049 92049177 88981712 85971995 82829003
16687H2829003k635345k820139k870048k651674k452415k708978k430306k748989
$$ 82829003 80193658 77373519 74503471 71851797 69399382 66690404 64260098 61511109
16679F1511109k157469k214295k138928k048805j767133k196840j603869j947728
$$ 61511109 59353640 57139345 55000417 52951612 51184479 48987639 47383770 45436042
16671D5436042j779747j319031k001304j471822q90192j356135j223963j088517
$$ 45436042 43656295 42337264 40335960 38864138 37973946 36617811 35393848 34305331
16663C4305331j532850j045308q62925j045075j325137q93330n00983q73268r56912
$$ 34305331 32772481 31727173 30864248 29819173 28494036 27600706 27099723 26226455 25269543
16654B5269543p47868m11020j100040n35474j076653n12616l92011p03559o05394
$$ 25269543 24521675 24110655 23010615 22475141 21398488 20885872 20493861 19790302 19184908
16645A9184908m62207p35594l70451m38876n54488l65674m96244l35609n23218
$$ 19184908 18722701 17987107 17616656 17177780 16623292 16257618 15761374 15425765 14902547
16636A4902547p4467n87160k41124k54387Q1897q10249k60708m90984l83931N7659
$$ 14902547 14828080 14240920 13999796 13745409 13827306 13017057 12756349 12265365 11881434 11939093
16626A1939093o86442J36486m08687j15818l57109K0592l92101l51361M7197j68137
$$ 11939093 11252651 11389137 10980450 10864632 10507523 10528115 10136014 9784653 9831850 9663713
16616I663713n85118J16394l27053k2447l30521k96808P0608l52073j96086M148
$$ 9663713 9078595 9194989 8867936 8845489 8514968 8218160 8288768 7936695 7740609 7744757
16606G744757j35174l03812j77900L78826n48180R3835M3270j01240l54769j54990
$$ 7744757 7609583 7305771 7127871 7506697 6958517 7052352 7095622 6994382 6639613 6484623
16596F484623k38030j9241K29063k35041k3305k39980j61923J41071o88911K35183
$$ 6484623 6246593 6227352 6456415 6221374 6198069 5958089 5796166 5937237 5248326 5483509
16586E483509R1367n60643K87178L7454l67978N5492k21341m8332j02269L787
$$ 5483509 5574876 5014233 5301411 5338865 4970887 5026379 4805038 4756706 4654437 4658224
16576D658224k76466K14447J8362k34842n27o5302r9251J08223m54033R8607Q263
$$ 4658224 4381758 4596205 4614567 4379725 4379198 4313896 4214645 4322868 3868835 3967442 3975705
16565C975705n3982j35029K29796J756J59098k22050m85616J30481J37091k45661
$$ 3975705 3921723 3786694 4016490 4018246 4177344 3955294 3469678 3600159 3737250 3491589
16555C491589n7843K93263n07511J17073J35697o00490N86774j34079k93360J7066
$$ 3491589 3433746 3727009 3219498 3336571 3472268 2871778 3458552 3324473 3031113 3048179
16545C048179K19706j4950k97505J59432l66600K11644L8797j19616l49964J29872
$$ 3048179 3267885 3252935 2955430 3114862 2748262 2959906 2998703 2879087 2529123 2658995
16535B658995l5873p7383n3291M2267K8862o2903L07867M077o5285k4434o07306
$$ 2658995 2623122 2545739 2492448 2534715 2563577 2500674 2808541 2812618 2747333 2722899 2115593
16524B115593M90505j97628R2759j60632J72245j93540k16541Q3150K85349o6960
$$ 2115593 2606098 2408470 2501229 2340597 2512842 2319302 2102761 2185911 2471260 2404300
16514B404300l02180J40118o3843k54998K09936k43042N9669K8709Q0434L5537
$$ 2404300 2102120 2242238 2178395 1923397 2133333 1890291 1949960 1978669 2059103 2094640
16504B094640K9313l56351M05409p6749j39311J20450m18952J19057o3925K37139
$$ 2094640 2123953 1767602 2173011 2096262 1956951 2077401 1658449 1777506 1713581 1950720
16494A950720l61434K69307j29556J94719j14502p5235k99472L30278J14921l12484
$$ 1950720 1589286 1858593 1729037 1923756 1809254 1734019 1434547 1764825 1879746 1567262
16484A567262K45536j37628k00617J22541J83702m27425J3035K33124o3464K62406
$$ 1567262 1812798 1675170 1474553 1597094 1780796 1353371 1366406 1599530 1536066 1798472
16474A798472p0511k85462P0122j91775Q9729K74819j99776p9380k3475k04703
$$ 1798472 1727961 1442499 1512621 1320846 1410575 1685394 1485618 1406238 1382763 1178060
16464A178060K71061J25813j19463k6120J04015j59845n9935J58667m9186N1042
$$ 1178060 1449121 1574934 1455471 1429351 1533366 1373521 1313586 1472253 1423067 1474109
16454A474109k79165J66251l72927M14807j75321K13763k11070O7193K4298N0902
$$ 1474109 1194944 1361195 988268 1403075 1227754 1441517 1230447 1297640 1321938 1372840
16444A372840r8509Q3286J36038k53923K44428o42398K89442m0326K05152J46354
$$ 1372840 1274331 1357617 1493655 1239732 1484160 841762 1131204 1090878 1296030 1442384
16434A442384k33104l13740K31859j10184M1794R4704k38454l4000N2937L19955
$$ 1442384 1209280 895540 1127399 1017215 1059009 1153713 915259 881259 934196 1254151
16424A254151j55522Q2290o9923P1079q0993K36739k74255k43926K48711K61L0538
$$ 1254151 1098629 1180919 1110996 1182075 1101082 1337821 1063566 819640 1068351 1068612 1099150
16413A099150j32313L03336m89687K45737p4842q6051P2905r4598l41517O74246
$$ 1099150 966837 1270173 780486 1026223 951381 865330 938235 843637 502120 1176366
16403A176366k19940j6416j96202k2488L46187o0295M6664j99111k1862j09630
$$ 1176366 956426 940010 743808 721320 1067507 1007212 1053876 854765 832903 723273
16393G23273l7972J6132K80804l28932K62259n9642M3715J03535k66217P2391
$$ 723273 685301 701433 982237 653305 915564 855922 899637 1003172 736955 809346
16383H09346j42066l8753n5417K99780J84381l15384J44702j60919j49041J67953
$$ 809346 667280 628527 573110 872890 1057271 741887 886589 725670 576629 744582
16373G44582P5458l44765j34052O81939l56343p8829L18493q6620k00837l5270
$$ 744582 820040 475275 341223 1023162 666819 587990 906483 819863 619026 583756
16363E83756L13764j23942C36551L81464Q9811j19771m3258K55958p1926O2272
$$ 583756 897520 773578 336551 718015 807826 688055 644797 900755 828829 891101
16353H91101D20484J58465l1020J10181r8483J10842J64613l33636P5918J12799
$$ 891101 420484 578949 547929 658110 559627 670469 835082 501446 577364 690163
16343F90163Q9587p6353l03648M59431l21880K33295j21766k20089m1396K92020
$$ 690163 779750 703397 399749 859180 537300 770595 648829 428740 387344 679364
16333F79364k16576R0985j37172M28046o3629k34607r7140K39787B93375K95105
$$ 679364 462788 553773 416601 844647 781018 546411 449271 689058 293375 588480
16323E88480M8517k78967K25359j53544j6741K23987k37907K15877L7743l21241
$$ 588480 636997 358030 583389 429845 413104 637091 399184 615061 652804 331563
16313C31563K3092K12014J01222J72949j06010K0212m3799p5123k96836K93547
$$ 331563 354655 566669 667891 840840 734830 755042 711243 636120 339284 632831
16303F32831B02685K13565N3209j11910K58734n0755J1664o3620k55612N7457
$$ 632831 202685 416250 469459 357549 616283 565528 577192 513572 257960 315417
16293C15417K07291M0019j43224K00408K09241l28351J4285J17301k7261J88886
$$ 315417 522708 562727 419503 619911 829152 500801 515086 632387 605126 794012
16283G94012k83548A39945L04232j98523K07222J77979j99547K29024l21761L51426
$$ 794012 510464 139945 444177 245654 452876 630855 431308 660332 338571 689997
16273F89997k77095N8756K0586l934K9178B50984K96612B24818M3109J44660r8375
$$ 689997 412902 471658 492244 488310 517488 250984 547596 224818 267927 412587 314212
16262C14212E1210N07231J93265B46135A01345M36663n8139j03741n1463P321
$$ 314212 51210 558441 751706 246135 101345 538008 479869 376128 324665 331986
16252C31986A65017J44623M0611j55260K96707k761K8223j15637J98273A20187
$$ 331986 165017 309640 350251 194991 491698 488937 517160 401523 599796 120187
16241B35841L115L26062j31117n3083j77604Q3214M9515j21146m9449K22317j11535
$$ 235841 238956 565018 433901 380818 203214 286428 335943 214797 165348 387665 276130
16230B76130K01922L6591A49396K26725J105m6207m8968J52278A95602J57985
$$ 276130 478052 514643 149396 376121 377226 331019 282051 434329 195602 353587
16220C53587J6495q4182D8708K65396K27107D8221N12125A95140K99509K9301
$$ 353587 370082 285900 48708 314104 541211 48221 560346 195140 494649 523950
16210E23950B55332J5466P5284M0385b74297B25034p5231M22123B23454J37662
$$ 523950 255332 270798 346082 386467 -274297 225034 149803 571926 223454 361116
16200C61116m9178J71303j30188J54774B1495L37864A65803L8281P4882L6285
$$ 361116 311938 483241 353053 507827 21495 359359 165803 204084 278966 315251
16190C15251G0476J66958p8892K99725m2854A7492c4135C94919l0999j44207j3717
$$ 315251 70476 237434 158542 458267 415413 17492 -34135 394919 363920 219713 205996
16179B05996p8155K53970j56134e661C8097M74969n1974F6181K49329L28427h6502
$$ 205996 127841 381811 225677 -5661 38097 513066 461092 66181 315510 643937 -86502
16167D15175D4278J41038a2957j6638A75024k2769K06812A55103O9364J47965
$$ 415175 44278 185316 -12957 -29595 175024 152255 359067 155103 224467 372432
16157C72432G5163K12609n1721P9508j02790L65198A65351l2894k7465K32296
$$ 372432 75163 287772 236051 315559 212769 577967 165351 132457 104992 337288
16147C37288Q523A48471A9360J56727J27674I0989K60044M5323A54178J39098
$$ 337288 345811 148471 19360 176087 303761 90989 351033 396356 154178 293276
16137B93276F7253K97139A04074J88383B6622K47952b01871Q9985c6090F6445
$$ 293276 67253 364392 104074 292457 26622 274574 -201871 -111886 -36090 66445
16126A79144n420k8468K4597d2352A56542h245E4117J95425n6335J84271j38691
$$ 179144 173724 145256 169853 -42352 156542 -8245 54117 249542 193207 377478 238787
16115B38787Q0377J0417j59378d9306B36686a58754C35265g2405C78459D8449
$$ 238787 319164 329581 170203 -49306 236686 -158754 335265 -72405 378459 48449
16104G837K89356A07152b5971A009J30036e5495k8046C23464A01358O4120M210
$$ 7837 297193 107152 -25971 1009 131045 -55495 -83541 323464 101358 165478 169688
16093A69688j1698b586B77271q9389L05032a7340A52776a39800A5246K817L45589
$$ 169688 157990 -2586 277271 187882 492914 -17340 152776 -139800 15246 18063 363652
16082C63652a21438j36742c2584D79720k39742a05906C34619q916j53044j5902
$$ 363652 -121438 -258180 -32584 479720 239978 -105906 334619 325703 172659 156757
16072A56757O5829b65988I5142m0894J84373f5537B56120a42377A28293e6181
$$ 156757 222586 -265988 95142 54248 238621 -65537 256120 -142377 128293 -56181
16061A02422l9259O7882i0720a5388q7803A71638a30285A85618a53704A15959
$$ 102422 63163 131045 -90720 -15388 -103191 171638 -130285 185618 -153704 115959
16050H2862J9899a49361c1496k9347k28259J43289f7149b4351I1929J67041b05480
$$ 82862 102761 -149361 -31496 -60843 -289102 -145813 -67149 -24351 91929 258970 -205480
16038a06630A13660B7543H331a72986n7604A788J54203J72820d62547G2853a54162
$$ -106630 113660 27543 8331 -172986 -230590 1788 155991 328811 -462547 72853 -154162
16026b54049h2810m741j47777E8369K64337k0314H0241J44657n1250C082L164
$$ -254049 -82810 -87551 -235328 58369 322706 302392 80241 224898 173648 3082 6246
16015F246a99777B9161a66292D179J82789A4578J61636J32686E1821a96440g9348
$$ 6246 -199777 29161 -166292 4179 186968 14578 176214 308900 51821 -196440 -79348
16003B25954A01004A2254b1420I9215f5743C66225C2429J64487a23877A96783
$$ 225954 101004 12254 -21420 99215 -65743 366225 32429 196916 -123877 196783
15992H868K38442D0231J21128o1098g1480J5853m9394A45226C5118j0802e2598
$$ 8868 247310 40231 161359 100261 -71480 -55627 -105021 145226 35118 24316 -52598
15980B72107C881J6745r986N427O9152J91067j11794K06941J29758J69174L07015
$$ 272107 3881 20626 10640 16067 85219 276286 164492 371433 501191 670365 977380
15969I77380l94266P1008k9220j65122I6752M46071A4112J19520k6497A7040R3751
$$ 977380 583114 654122 624902 459780 96752 542823 14112 133632 107135 17040 110791
15958A10791J31189d46857h4850B41497A4340a7363k72412B63513b3417I3527
$$ 110791 241980 -446857 -84850 241497 14340 -17363 -289775 263513 -23417 93527
15947a06012C19128a70166c1443B59171c04154C34213b72441f692B2798b656I6157
$$ -106012 319128 -170166 -31443 259171 -304154 334213 -272441 -6692 22798 -2656 96157
15935a32427B43198j2596D5831o479J65546a8954C62699a89104B13429c8234j36277
$$ -132427 243198 230602 45831 39352 204898 -18954 362699 -189104 213429 -38234 -174511
15924a74511b8214B76200i3410j78113A86159h4926l6640B98562E2321a06449
$$ -174511 -28214 276200 -93410 -271523 186159 -84926 -121566 298562 52321 -106449
15913a05191l68631b25476O5557j74057g7043G0003J12812A4528h3657K7580A6819
$$ -105191 -473822 -225476 -159919 -333976 -77043 70003 182815 14528 -83657 -56077 16819
15901a19592j64829B8620R0681C6957K6738i2230B85952h7514c6359j11893H4387
$$ -119592 -284421 28620 119301 36957 63695 -92230 285952 -87514 -36359 -148252 84387
15889a39825i96A13648M6499h6175A92639a19896n6014j27887J31807A80010b74565
$$ -139825 -996 113648 160147 -86175 192639 -119896 -175910 -303797 -171990 180010 -274565
15877E6035a11482j62010J01644D4007h489k1079q5115A90341a0377B9791i0299
$$ 56035 -111482 -273492 -171848 44007 -8489 -29568 -114683 190341 -10377 29791 -90299
15865c1169o917h593k16894G0885Q1380g5791c6520G9450F086e8608B0698O6313
$$ -31169 -38086 -8593 -225487 70885 152265 -75791 -36520 79450 6086 -58608 20698 87011
15853H7011d1185m10921A57766O7779C4234J24716e7982A2726e5070o5841A25153
$$ 87011 -41185 -452106 157766 225545 34234 158950 -57982 12726 -55070 -120911 125153
15841a49127H2964i5211A76182b70484F1059K34472b38575A87578D6532J83868
$$ -149127 82964 -95211 176182 -270484 61059 295531 -238575 187578 46532 230400
15831B30400e2842D68708A01565K7712a25930B20303D8315K1119b09433j00210
$$ 230400 -52842 468708 101565 129277 -125930 220303 48315 69434 -209433 -309643
15821c09643F5563K66077l1010A14150J81092E0083A9688a32183A8560M34J05546
$$ -309643 65563 331640 300630 114150 295242 50083 19688 -132183 18560 18994 124540
15810A24540m867K3936b52865B7318b7649o5144D25488E8260h4911E9997N0086
$$ 124540 119673 143609 -252865 27318 -27649 -92793 425488 58260 -84911 59997 110083
15799A10083j6844J57689k8087q5839a40273B17392g5916B5782J23278a59782
$$ 110083 93239 250928 222841 137002 -140273 217392 -75916 25782 149060 -159782
15788d8612C98749E8177K4134b21493A55100G6727E840K68583A25506L741a97848
$$ -48612 398749 58177 82311 -221493 155100 76727 5840 274423 125506 129247 -197848
15776A08267E0844J86658Q7422a11864C70772a87003l6659d2361p7340e4934D667
$$ 108267 50844 237502 324924 -111864 370772 -187003 -223662 -42361 -119701 -54934 4667
15764E3903a74095H2067c25430i7200K8902j24908M9035A32137b37856F4861c21380
$$ 53903 -174095 82067 -325430 -97200 -68298 -193206 -144171 132137 -237856 64861 -321380
15752b9431B14390a9465j50858E8938A8669b39328A86564A0818K96592b49432
$$ -29431 214390 -19465 -170323 58938 18669 -239328 186564 10818 307410 -249432
15741A22537a28660A52814f8885I3941a22815j15895H7483d0654B24275a65428
$$ 122537 -128660 152814 -68885 93941 -122815 -238710 87483 -40654 224275 -165428
15730C327J8249O8542g6055A30266h2350l625h150I8772a97528O8360q6507o2146
$$ 3327 21576 90118 -76055 130266 -82350 -85975 -8150 98772 -197528 -129168 -215675 -277821
15718b77821e7388a4817A96503B6886a03286j04424j0490Q9165D06297j05197
$$ -277821 -57388 -14817 196503 26886 -103286 -207710 -218200 -129035 406297 301100
15708C01100f5698j1824j4691k10796K4420D77343a28900c8092A15922a86322
$$ 301100 -65698 -77522 -92213 -303009 -278589 477343 -128900 -38092 115922 -186322
15697d05358D32a88970Q7584A61040b09073A95189H1997d8563j59203A65159a06
$$ -405358 432 -188970 -101386 161040 -209073 195189 81997 -48563 -207766 165159 -106
15685g4629C904c3926A60983D2189b43475j0800f5875b6797j51244E9270O1859
$$ -74629 3904 -33926 160983 42189 -243475 -254275 -65875 -26797 -178041 59270 121129
15674A21129a62295B7040g4673H0791a28270k298A60934a11135A14908h5635A30066
$$ 121129 -162295 27040 -74673 80791 -128270 -130568 160934 -111135 114908 -85635 130066
15662b12984m1317L1229A76689E856d0166B08516B3618L6546a94891L5380C47705
$$ -212984 -254301 -223072 176689 5856 -40166 208516 23618 60164 -194891 -159511 347705
15650i2589E9856a76636B01667a75279G4792a24536d2688J1965p9749K6118E7123
$$ -92589 59856 -176636 201667 -175279 74792 -124536 -42688 -30723 -110472 -84354 57123
15638A74418a66100f1964A07886A4382b7173D2371a65995j40361N7423k960K6773
$$ 174418 -166100 -61964 107886 14382 -27173 42371 -165995 -306356 -248933 -251893 -225120
15627b25120A39093F1710J38120a50814j3384j5702o2701q9850J28001A02771
$$ -225120 139093 61710 199830 -150814 -164198 -179900 -242601 -332451 -204450 102771
15616B71003b05427k02922J36086O9745i2633l92090b12787A81613n8060O161
$$ 271003 -205427 -408349 -272263 -202518 -92633 -484723 -212787 181613 123553 129714
15606A29714J98605h9323E9925Q1939l8601a74735b4473J0487j00398M6711M405
$$ 129714 328319 -89323 59925 141864 103263 -174735 -24473 -13986 -114384 -67673 -63268
15595f3268A74876a39932d7727E0695b00551i7418K9751A76394g5657C2265a70601
$$ -63268 174876 -139932 -47727 50695 -200551 -97418 -67667 176394 -75657 32265 -170601
15583B4897h9493A35989D2535L8460a24823I0196l8481B392e0700A786K66515
$$ 24897 -89493 135989 42535 80995 -124823 90196 51715 2392 -50700 1786 268301
15572B68301c23081B49643D524a05029J2402E7715a7744j35274B79864c56039
$$ 268301 -323081 249643 4524 -105029 -92627 57715 -17744 -153018 279864 -356039
15561a39436c9970j44099A83842N3093A05993a4569B7591b02627f6858L1933j20638
$$ -139436 -39970 -184069 183842 236935 105993 -14569 27591 -202627 -66858 -34925 -155563
15550a55563B06314b68721C27285a21043B06444F4859b491k57878J01621f6275
$$ -155563 206314 -268721 327285 -121043 206444 64859 -2491 -260369 -158748 -66275
15539D8991i1025j89101H2858I06b64251A86098b6226k0261a2913B58031b70084
$$ 48991 -91025 -280126 82858 906 -264251 186098 -26226 -46487 -12913 258031 -270084
15527A54599Q794n2677J29056g55n6595D3967c08047E6724c01203B39148b63447
$$ 154599 163393 110716 239772 -755 -57350 43967 -308047 56724 -301203 239148 -263447
15515e1133H2877a60026R780n0775A62364a0308C7382P0434m1649N0266a16724
$$ -51133 82877 -160026 -150246 -201021 162364 -10308 37382 107816 66167 116433 -116724
15503A27237J59591D6428K63480B7713A1050h3398C91698A26438K93161b56370
$$ 127237 286828 46428 309908 27713 11050 -83398 391698 126438 419599 -256370
15492D64069A81662B2866a1745m5667C54347C0401J27189K3228p2602R2650J20008
$$ 464069 181662 22866 -11745 -57412 354347 30401 157590 180818 108216 200866 320874
15481C20874n7932J62998k8986A16414J57469G8969e5288b2777l8542I7825J21130
$$ 320874 262942 425940 396954 116414 273883 78969 -55288 -22777 -61319 97825 218955
15470B18955c21331B33837m9395a82376Q4243A23365k7040Q8338o9967D2668M78984
$$ 218955 -321331 233837 184442 -182376 -98133 123365 96325 184663 114696 42668 521652
15459E21652j66428n3944N7932j73158K41984A40794e6310A34498e6262p532q785
$$ 521652 355224 301280 359212 186054 428038 140794 -56310 134498 -56262 -63794 -72579
15448g2579q48E27977a91203P7226B87988H3343a66022F1327E991J67431h3339
$$ -72579 -73427 527977 -191203 -113977 287988 83343 -166022 61327 5991 173422 -83339
15436A94951J84518F130M0879M60206b11740A36308J79927k7938K4967J78529
$$ 194951 379469 6130 47009 507215 -211740 136308 316235 288297 313264 491793
15426D91793j72516O41850m33998J65953B33369J06820q0419A4155I1J91666a97351
$$ 491793 319277 961127 527129 693082 233369 340189 259770 14155 91 191757 -197351
15414i3613C5092K74918G7687e502B28713j02517c387r4138b7638r1440I0653
$$ -93613 35092 310010 77687 -5502 228713 126196 -3387 -97525 -27638 -119078 90653
15402B58632b51658O3957A29018b42332D3941K63968F0939N4897k4629d5272k07371
$$ 258632 -251658 -187701 129018 -242332 43941 307909 60939 115836 91207 -45272 -252643
15391b52643J01618A46593A0231b33326B65640A03699a24486A24410n3115c32302
$$ -252643 -151025 146593 10231 -233326 265640 103699 -124486 124410 71295 -332302
15380a37624F8272b57415A64164a23543B97653g2967j02475O0349n3585A02280
$$ -137624 68272 -257415 164164 -123543 297653 -72967 -175442 -115093 -168678 102280
15369B56634A3993d33130B23115e0982a6250B28975R946o992d5103a2893B03199
$$ 256634 13993 -433130 223115 -50982 -16250 228975 238921 231929 -45103 -12893 203199
15357F9029K5124Q5986F177J75128K7500k324n4214a38768C01251c5042B55103
$$ 69029 94153 180139 6177 181305 208805 206481 152267 -138768 301251 -35042 255103
15345A55710n4826m1697a73469A19705L17859A48286J49934l0341A05446K56895
$$ 155710 100884 59187 -173469 119705 437564 148286 298220 267879 105446 362341
15335C62341a00466A57926C5196h6953H8063O9467B5150K97018a5433C88385A42791
$$ 362341 -100466 157926 35196 -86953 88063 157530 25150 322168 -15433 388385 142791
15323C75693A71640n8887m2933K71210A18390J26354h9305A48812k3694a11945
$$ 375693 171640 112753 69820 341030 118390 244744 -89305 148812 125118 -111945
15312A40054K18608A8187a62276e5867n0405B80170O7505a50451C7718O4737O3766
$$ 140054 358662 18187 -162276 -55867 -106272 280170 347675 -150451 37718 102455 166221
15301A66221n904p6343k7026i677k08864B63482a17635F7303e076B02892a28450
$$ 166221 160317 83974 56948 -9677 -218541 263482 -117635 67303 -5076 202892 -128450
15289h4101F0085N1084a92858a6431D50881A25929a57930j58387g9138I9700l4624
$$ -84101 60085 111169 -192858 -16431 450881 125929 -157930 -316317 -79138 99700 65076
15278F5076a48641e0221B23589l5407a36292I1363P776a74094f4881k34700R6695
$$ 65076 -148641 -50221 223589 188182 -136292 91363 99139 -174094 -64881 -299581 -202886
15267b02886A306R6979R0368a29928B8064J45907o875J47885C6910f4836j34960
$$ -202886 1306 98285 188653 -129928 28064 173971 167096 314981 36910 -64836 -199796
15256a99796h4337H5318a54771g5880A64770J97193r6369A28662N8606a38981
$$ -199796 -84337 85318 -154771 -75880 164770 361963 265594 128662 187268 -138981
15245a17534B55131o5810b54947A71834B608d91495A57535J16245a30610j9976
$$ -117534 255131 189321 -254947 171834 2608 -491495 157535 273780 -130610 -150586
15235a50586M8007B39824n966a15988C39173J56744J60035L09095L32775R8930
$$ -150586 -102579 239824 233858 -115988 339173 495917 655952 965047 1297822 1396752
15225A396752n35826J06426l19656k64518j84970M6212j05748K81468g499A07314
$$ 1396752 860926 967352 647696 383178 198208 244420 138672 420140 -7499 107314
15214B05484a00851G3122C2802J51901p7515a73303G7964e4816A47999d8210L063
$$ 205484 -100851 73122 32802 184703 107188 -173303 77964 -54816 147999 -48210 -45147
15203d5147k95024A35852E6056a10396j20275j51732B90119l5608e2567B7266
$$ -45147 -340171 135852 56056 -110396 -230671 -382403 290119 254511 -52567 27266
15192C29717h66B41466r6993J36294p5689m8293J8836a45313D1946b45787a0122
$$ 329717 -866 241466 144473 280767 205078 156785 175621 -145313 41946 -245787 -10122
15180b5197j43769h0000A44633o9108K30316A804L0930a13024I1069M3479L6564
$$ -25197 -168966 -80000 144633 75525 305841 1804 32734 -113024 91069 134548 171112
15169A71112b33483A89464H8281m3237d8893j52830B01579H4410J29654L9063
$$ 171112 -233483 189464 88281 45044 -48893 -201723 201579 84410 214064 253127
15159B53127e6207A01401M4660r839h0639b3212D18233F8941J67381c27303B77699
$$ 253127 -56207 101401 146061 136222 -80639 -23212 418233 68941 236322 -327303 277699
15147G1636j5285A9220K68200a02067q7366I7369L28627h1309C56427I9682c3856
$$ 71636 56351 19220 287420 -102067 -189433 97369 425996 -81309 356427 99682 -33856
15135A83989l3602K9462J70326J3358A05891B7477M0915h5360D43378j25342A38103
$$ 183989 150387 179849 350175 363533 105891 27477 68392 -85360 443378 318036 138103
15123B17262r9847k7844j8477i8734f606A09192j6735R9184b9977F6473J53170
$$ 217262 117415 89571 71094 -98734 -6606 109192 92457 191641 -29977 66473 219643
15112B19643B8310d1644A57760G6762a65161I1977g6807B83179j28948n8382L22169
$$ 219643 28310 -41644 157760 76762 -165161 91977 -76807 283179 154231 95849 418018
15101D18018j5058C2673J12118K77274j42057A10385c1754A34390N2498d902n3736
$$ 418018 402960 32673 144791 422065 280008 110385 -31754 134390 186888 -4902 -58638
15090e8638J1689C48446a81704C9861J59608J12602a27093q8923H6593Q1077a12175
$$ -58638 -46949 348446 -181704 39861 199469 312071 -127093 -216016 86593 167670 -112175
15078a65328C97227A97306i2039H0858Q327a061q1067A0915K60256M0791h1736
$$ -165328 397227 197306 -92039 80858 89185 -1061 -82128 10915 271171 311962 -81736
15066A66060o8309b54434B19410P0944q0459k8538J21464A15646K278a67655I0097
$$ 166060 97751 -254434 219410 290354 209895 181357 302821 115646 117924 -167655 90097
15054A46590K16356H9064K56225A61092c3898B25028a39126I2115K63193A2138
$$ 146590 362946 89064 345289 161092 -33898 225028 -139126 92115 355308 12138
15043C89442A85891R805J97922k1424A21561a7611A48371K74687j6928j79683
$$ 389442 185891 195696 393618 372194 121561 -17611 148371 423058 406130 226447
15033B26447J49453e652B39114L16135B03385O5719L82764j87056L262j15584
$$ 226447 375900 -5652 239114 555249 203385 269104 651868 464812 468074 352490
15023C52490M3972L6698C2951K46016p7177o6191D3094M92707r4344K11178j09635
$$ 352490 396462 433160 32951 278967 201790 135599 43094 535801 441457 652635 543000
15012E43000K2699p7255n0021J3043J49301k06352K10837B27497J45543K80434
$$ 543000 565699 488444 438423 451466 600767 394415 605252 227497 373040 653474
15002F53474k30375K80614C31286L79207j99890k38668M43683B96329J06809N8459
$$ 653474 423099 703713 331286 710493 510603 271935 715618 296329 403138 461597
14992D61597j05877Q2767r8790L26963A53933M11455A52815N74656C59075K25457
$$ 461597 355720 438487 339697 666660 153933 565388 152815 727471 359075 584532
14982E84532j74701L24223l54252A02340M73619j71119J36064A32295M01161R0665
$$ 584532 409831 734054 379802 102340 575959 404840 540904 132295 533456 624121
14972F24121J13683J09774C35556K47983j31357M8683Q626l0264J83860l2724
$$ 624121 737804 847578 335556 583539 452182 500865 509491 479227 663087 630363
14962F30363M577k76709J66603n168k05035j0956J27534R1943A51335K12563k9999
$$ 630363 634940 358231 524834 519666 314631 303675 431209 523152 151335 363898 333899
14951C33899O0554G6842M10877k43698H1658K46208J57259k42168Q5818j09296
$$ 333899 394453 76842 487719 244021 81658 327866 485125 242957 328775 219479
14941B19479j9548m9277J14953J38199J28991B12611P6723L67942B47834j2338
$$ 219479 199931 150654 265607 403806 532797 212611 289334 657276 247834 235496
14931B35496j2936J55230A30984M21258J40617J24842B80231K28100K64437k98421
$$ 235496 222560 377790 130984 552242 692859 817701 280231 508331 772768 474347
14921D74347o4171M6017M45409k30048j70997M32562R1699D33721M86075N8554
$$ 474347 410176 456193 901602 671554 500557 933119 1024818 433721 919796 978350
14911I78350N51979R2466k33656M99379n82912L69760l4454k23780r4527J76323
$$ 978350 1530329 1622795 1389139 1888518 1305606 1675366 1640912 1417132 1322605 1498928
14901A498928L03336J23032j68913k01507m12676n31080K66562l48213P0916k01329
$$ 1498928 1802264 1925296 1756383 1554876 1142200 611120 877682 529469 600385 399056
14891C99056j82488M5645K25353l0469j0554j94294G1007L63784k04253J90955
$$ 399056 216568 262213 487566 457097 446543 252249 71007 434791 230538 421493
14881D21493j30638L42131k68634p3551J15427j63445M70384A42338K32585K34438
$$ 421493 290855 632986 364352 290801 406228 242783 713167 142338 374923 609361
14871F09361N7516q8070J98815P4434j13564K2608J38652j90006j39652J56316
$$ 609361 666877 578807 777622 852056 738492 761100 899752 709746 570094 726410
14861G26410k3924C33489L67073k93073J43914k58457K47368D2710J99190L33387
$$ 726410 702486 333489 700562 407489 551403 292946 540314 42710 241900 575287
14851E75287O6466j01741k03588N03199k80144A95873K20151M30230A22294j3112
$$ 575287 641753 540012 336424 839623 559479 195873 416024 846254 122294 109182
14841A09182k4185M55694q1071l3789j34086J91658J84027C29158K55012k63699
$$ 109182 84997 540691 459620 425831 291745 483403 667430 329158 584170 320471
14831C20471L6483k8670J31150Q6963K20438J74498N3766j60426k62937K77935
$$ 320471 356954 328284 459434 546397 766835 941333 995099 834673 571736 849671
14821H49671k2869J0862l07930P0224k62384J00460J10775N58k04592K57117j28781
$$ 849671 826802 837664 529734 599958 337574 438034 548809 549367 344775 601892 473111
14810D73111K64946C40777J44201k18322M662M28590J34760j63800l06066K14235
$$ 473111 738057 340777 484978 266656 271318 699908 834668 670868 364802 579037
14800E79037O3484k82750K44953j89049q1251L51976K5910j87170P4212k85495
$$ 579037 642521 359771 604724 415675 334424 686400 712310 525140 599352 313857
14790C13857M57018M9094k72969M85389j63851B47263M97954k66232L1964n4394
$$ 313857 770875 819969 547000 1032389 868538 247263 745217 478985 510949 456555
14780D56555j4876K72006k00693n0265m8473M27486p8545A59499M37095j87909
$$ 456555 441679 713685 512992 462727 414254 841740 763195 159499 596594 408685
14770D08685R4896k09775M68844l21345K90839B60333N60997j01423p0229k08106
$$ 408685 503581 293806 762650 441305 732144 260333 821330 719907 649678 441572
14760D41572L40128k54499K66643j20025L18491m32968r6214M7427J26656k83573
$$ 441572 781700 527201 793844 673819 992310 559342 463128 510555 637211 353638
14750C53638p62k3656K77917q4525J2538O5356B59037A27951N19319k65934L48165
$$ 353638 352876 329220 607137 522612 535150 600506 259037 127951 647270 381336 729501
14739G29501j07809M8799k48000J19327L59801m37538m8415N59295m28160Q113
$$ 729501 621692 670491 422491 541818 901619 464081 415666 974961 546801 554914
14729E54914A87164L58450j16681J80799k7138O7783J78927l62462J09462L22679
$$ 554914 187164 545614 428933 609732 582594 650377 829304 466842 576304 898983
14719H98983j29403J75479k86310N8073L13285k41230L31455j63772Q21509k81255
$$ 898983 769580 945059 658749 716822 1030107 788877 1120332 956560 1778069 1496814
14709A496814r4478k44888J54214E41467Q63222F33314L67206n7499n1200m43585
$$ 1496814 1402336 1157448 1311662 541467 1404689 633314 1000520 943021 891821 448236
14699D48236L98592J60469L1176j76208N027j23125Q3702m7007L93475j37273
$$ 448236 846828 1007297 1038473 862265 867292 744167 827869 780862 1174337 1037064
14689A037064K18275j52983K57889J09404J20508r0382K70716n70732J2514k96250
$$ 1037064 1255339 1102356 1360245 1469649 1590157 1499775 1770491 1199759 1212273 916023
14679I16023L5623j11579J009K84591l12918M738L4471q961r6800J23324K32893
$$ 916023 951646 840067 841076 1125667 812749 817487 851958 842997 746197 869521 1102414
14668A102414k25999m08730L54251P321J25988J9747j68990R525K29054p7102
$$ 1102414 876415 467685 821936 829257 955245 974992 806002 815527 1044581 967479
14658I67479k77314p9319J43355L55326m01017J18616J5261L13943k69610j41554
$$ 967479 690165 610846 754201 1109527 708510 827126 842387 1156330 886720 745166
14648G45166J15256o447m8947K53808j81743J79329o3412Q9244P8377k74213J18500
$$ 745166 860422 853975 805028 1058836 877093 1056422 993010 1082254 1160631 886418 1004918
14637A004918J43391J65436m1109k98503K50013q5571j93275K91176j99121L66928
$$ 1004918 1148309 1313745 1272636 974133 1224146 1138575 945300 1236476 1037355 1404283
14627A404283j00538j07970j75532j34347L74125k50242n8597K38596E64733O03595
$$ 1404283 1303745 1195775 1020243 885896 1260021 1009779 951182 1189778 564733 1168328
14617A168328j29583l51131O81989n05786K25278K91878j93062n3732o7804J99686
$$ 1168328 1038745 687614 1369603 863817 1089095 1380973 1187911 1134179 1066375 1266061
14607A266061l15075L02526k65678o2169o1351J52320J20362j15514M64754k46775
$$ 1266061 950986 1253512 987834 925665 864314 1016634 1136996 1021482 1486236 1239461
14597A239461j76298J31928p2558K30545J96508R1043J0101j28457k8130l54029
$$ 1239461 1063163 1195091 1122533 1353078 1549586 1640629 1650730 1522273 1494143 1140114
14587A140114K65156L47346m18135L39085m00406N8478L91628k68717q6961K92754
$$ 1140114 1405270 1752616 1334481 1673566 1273160 1331638 1723266 1454549 1367588 1660342
14577A660342j26652N188j88653j13374K16316M15160k45973j2270L715J04796
$$ 1660342 1533690 1538878 1350225 1236851 1453167 1868327 1622354 1610084 1613799 1718595
14567A718595k47671R3381J41114N4279R809P1729k91495l7929J80170K2113j17324
$$ 1718595 1470924 1564305 1705419 1759698 1769507 1841236 1549741 1511812 1691982 1714095 1596771
14556A596771M69229q8303l26142J51746L53111k71072k016K12651l85188M88123
$$ 1596771 2066000 1977697 1651555 1803301 2156412 1885340 1883324 2095975 1710787 2198910
14546B198910J89044R4154l9645K08974N1183M93059K36617K92886K82786Q50940
$$ 2198910 2387954 2482108 2442463 2651437 2702620 3195679 3432296 3725182 4007968 4858908
14536D858908O12468Q64568K101001M094700O292185J0187877J971639j3500645
$$ 4858908 5471376 6335944 8436945 12531645 18823830 29011707 30983346 17482701
14528A7482701p858200l868144j509746p98101L20548P50796l85613j241229j85145
$$ 17482701 9624501 5756357 4246611 3448510 3769058 4519854 4134241 2893012 2707867
14519B707867l48389J22356k70310q9292l08199J87760j28920L25960n84737K7413
$$ 2707867 2359478 2481834 2211524 2122232 1814033 2001793 1872873 2198833 1614096 1641509
14509A641509L90744l16343M47160N2565l77596J96415j7849M91964k39283K23273
$$ 1641509 2032253 1715910 2163070 2215635 1838039 2034454 2016605 2508569 2269286 2492559
14499B492559l05602j28372L35423K6684n2531K94546j44494j55666j08648N03420
$$ 2492559 2186957 2058585 2394008 2420692 2368161 2662707 2518213 2362547 2253899 2757319
14489B757319k72711L02735J08654l97172J49954L43645m23653M39094k8973j64829
$$ 2757319 2484608 2787343 2895997 2498825 2648779 2992424 2568771 3007865 2978892 2814063
14479B814063N2905M4699J01895J60155j83204J78070L36429n60182J0760M09017
$$ 2814063 2866968 2911667 3013562 3173717 2990513 3168583 3505012 2944830 2955590 3364607
14469C364607k24638R2532J1056K37745l00960J51157M5974O2548L0217J72583
$$ 3364607 3139969 3232501 3243557 3481302 3180342 3331499 3377473 3440021 3470238 3642821
14459C642821k25642J66038j92761K75347j25352n1031N5501L64180Q7089j22246
$$ 3642821 3417179 3583217 3390456 3665803 3540451 3489420 3544921 3909101 3996190 3873944
14449C873944J98350l0806Q4432J93022j33096k04069L18933J57842l504k13734
$$ 3873944 4072294 4041488 4125920 4318942 4185846 3981777 4300710 4458552 4455048 4241314
14439D241314K58450l25595M44312j40218J28420p2075J98869L95589K05967n66475
$$ 4241314 4499764 4174169 4618481 4478263 4606683 4534608 4733477 5129066 5335033 4768558
14429D768558L88039j39068O9230J29628K14150k09515q8929M20757J47211k9863
$$ 4768558 5156597 5017529 5086759 5216387 5430537 5221022 5132093 5552850 5700061 5670198
14419E670198l668N8738K59093J25269K69158q1088p2717O1687J90967Q8070k34806
$$ 5670198 5666530 5725268 5984361 6109630 6378788 6297700 6224983 6286670 6477637 6565707 6330901
14408F330901K10933L93224j99149Q43544j65953k1627K23703J24926j50689J83481
$$ 6330901 6541834 6935058 6735909 7579453 7413500 7391873 7615576 7740502 7589813 7773294
14398G773294j78669J20023j15584K82828J760O08446l01267M55632l0962L64538
$$ 7773294 7594625 7714648 7599064 7881892 7883652 8492098 8190831 8646463 8615501 8980039
14388H980039K19726K78037k26415R3301L21227q9999j08451N71914K34240j45027
$$ 8980039 9199765 9477802 9251387 9344688 9665915 9575916 9467465 10039379 10273619 10128592
14378A0128592J54930J37269L70339K65565Q9254L02462K13947N7997K15117J8294
$$ 10128592 10283522 10420791 10791130 11056695 11145949 11448411 11662358 11720355 11935472 11953766
14368A1953766L36266M93747J0612L74983K51773L44125K87968J13666J90024
$$ 11953766 12290032 12783779 12794391 13169374 13421147 13765272 14053240 14166906 14356930
14359A4356930L33778l2651O74981Q858N17278p3204J179123k61771P41069M47393
$$ 14356930 14690708 14658057 15333038 15341896 15859174 15785970 16965093 16703322 17444391 17891784
14349A7891784J1980N93501J72475M46882J07457N18722L57810O80593L25445
$$ 17891784 17903764 18497265 18669740 19116622 19224079 19742801 20100611 20781204 21106649
14340B1106649L52761J091726J54562O07643Q62022j508J110909L09922N07512
$$ 21106649 21459410 22551136 22705698 23313341 24175363 24173855 25284764 25594686 26102198
14331B6102198N48795J082724L46173J188370N13250J079113P43845Q76942R10687
$$ 26102198 26650993 27733717 28079890 29268260 29781510 30860623 31604468 32481410 33392097
14322C3392097O36393J421785J132015R38860J599758P55874J326908J220814
$$ 33392097 34028490 35450275 36582290 37521150 39120908 39876782 41203690 42424504
14314D2424504J488890J573641J412773J287924J962775J807884J831955J730216
$$ 42424504 43913394 45487035 46899808 48187732 50150507 51958391 53790346 55520562
14306E5520562J797539K363781K303011K321047K567427K215411K473866L202633
$$ 55520562 57318101 59681882 61984893 64305940 66873367 69088778 71562644 74765277
14298G4765277K903952L298506L467097L169810M033992M212567M153808M674570
$$ 74765277 77669229 80967735 84434832 87604642 91638634 95851201 100005009 104679579
14290A04679579N269464M747296N498447N577463O911641O973907P008717P493466
$$ 104679579 109949043 114696339 120194786 125772249 132683890 139657797 146666514 154159980
14282A54159980Q112280Q617053R106001R574218J0443882J0930235J1505244
$$ 154159980 162272260 170889313 179995314 189569532 200013414 210943649 222448893
14275B22448893J2001546J3366524J3375332J4018877J4674995J5356889J5257710
$$ 222448893 234450439 247816963 261192295 275211172 289886167 305243056 320500766
14268C20500766J5457981J4668876J4515134J4041333J3608792J2860831J1401416
$$ 320500766 335958747 350627623 365142757 379184090 392792882 405653713 417055129
14261D17055129J1044728J0515605J0456506P768256L456076J913192L640024
$$ 417055129 428099857 438615462 449071968 456840224 460296300 462209492 465849516
14254D65849516J49414o959664m077545p370623j1252463j2789223j2904735j3719563
$$ 465849516 465998930 459039266 454961721 447591098 436338635 423549412 410644677 396925114
14246C96925114j4150398j4172852j4869673j4784267j4669049j4883294j4482744
$$ 396925114 382774716 368601864 353732191 338947924 324278875 309395581 294912837
14239B94912837j4007304j4264132j3352019j2838482j1882976j1318881j1076717
$$ 294912837 280905533 266641401 253289382 240450900 228567924 217249043 206172326
14232B06172326j1265623j0988618r320449r179186q301728p970272p413694o750756
$$ 206172326 194906703 183918085 174597636 165418450 157116722 149146450 141732756 134982000
14224A34982000o319283o317897n431231n687397n098420m932258m032754l903404
$$ 134982000 128662717 122344820 116913589 111226192 106127772 101195514 97162760 93259356
14216I3259356l624122m029346l663080l514400k639564l237908k717864k421731
$$ 93259356 89635234 85605888 81942808 78428408 75788844 72550936 69833072 67411341
14208F7411341k889769k472302j854308k164001k107193k014871j377971k060262
$$ 67411341 64521572 62049270 60194962 58030961 55923768 53908897 52530926 50470664
14200E0470664j581042j512899j349313j579195j318318r47752j552032j102079
$$ 50470664 48889622 47376723 46027410 44448215 43129897 42182145 40630113 39528034
14192C9528034q73466j042099j318459j124141j040088r50348o78713o45080p89251
$$ 39528034 38654568 37612469 36294010 35169869 34129781 33179433 32500720 31855640 31066389
14183C1066389j197215n06205j271872j59624p70889o86647r19079n57082q16401
$$ 31066389 29869174 29362969 28091097 27931473 27160584 26473937 25554858 24997776 24181375
14174B4181375j60768p81207o18874m25545o69420n40194m92010j56914k74916
$$ 24181375 24020607 23239400 22620526 22194981 21525561 20985367 20493357 20336443 20061527
14165B0061527p87953k93962l35952l74189n08606m07255m51373k81552R2762
$$ 20061527 19273574 18979612 18643660 18269471 17760865 17353610 16902237 16620685 16713447
14156A6713447l47241n17008l28453l49403l76823k01412k07505k02993o857o88441
$$ 16713447 16366206 15849198 15520745 15171342 14794519 14593107 14385602 14182609 14175752 13487311
14146A3487311r8501j82458k69995k54653k44308l11484R961k77280j88170k82892
$$ 13487311 13388810 13206352 12936357 12681704 12437396 12125912 12135873 11858593 11670423 11387531
14136A1387531q0107o0337k40841k03749k45225l18801j38870J7373o06056K65932
$$ 11387531 11307424 11247087 11006246 10802497 10557272 10238471 10099601 10116974 9510918 9776850
14126I776850q136j48468l06928k79089n3026j50969M8296k17483K65808o17833
$$ 9776850 9768714 9620246 9313318 9034229 8981203 8830234 8878530 8661047 8926855 8309022
14116H309022J46788k93104m38900P840J13511k55648J260p9019k42862L02626
$$ 8309022 8455810 8162706 7723806 7731646 7845157 7589509 7590769 7511750 7268888 7571514
14106G571514o08562J93860Q4671l70362l7899j17301O994R6724o62882K33216
$$ 7571514 6962952 7156812 7241483 6871121 6833222 6715921 6722915 6819639 6156757 6389973
14096F389973o6193k13512N3217k3368m1590k74248j68310M08063j41839J26024
$$ 6389973 6323780 6110268 6163485 6140117 6098527 5824279 5655969 6064032 5922193 6048217
14086F048217l51170P2798j85680j36608j21869n7002J40010k08261r2720K18844
$$ 6048217 5697047 5769845 5584165 5447557 5325688 5268686 5408696 5200435 5107715 5326559
14076E326559l48511j01090j89882j51135L18321l31921L26155m23N017l85537
$$ 5326559 4978048 4876958 4687076 4535941 4854262 4522341 4848496 4848073 4853090 4467553
14066D467553j87647J66755j91598j45494K46697j08665j39314j92265J46718
$$ 4467553 4279906 4446661 4255063 4109569 4356266 4247601 4108287 3916022 4062740
14057D062740J20102l8078l75330N0846K80340k10659j42918K4974j79119K39141
$$ 4062740 4182842 4144764 3769434 3820280 4100620 3889961 3747043 3772017 3592898 3832039
14047C832039K15839j36714l77790J78746m89763K73451K78350l07191J80380
$$ 3832039 4047878 3911164 3533374 3712120 3222357 3495808 3774158 3466967 3647347
14038C647347M6608n81413K19621J11830r7915l01732k23693J32430j51992K66726
$$ 3647347 3693955 3112542 3332163 3443993 3346078 3044346 2820653 2953083 2801091 3067817
14028C067817j82935L32511l53437j54727L19890K3026J37313k73136J59204j43126
$$ 3067817 2884882 3217393 2863956 2709229 3029119 3052145 3189458 2916322 3075526 2932400
14018B932400j50231P1345J48969n1519k56965N6269K97822l72306Q9800j77387
$$ 2932400 2782169 2853514 3002483 2950964 2693999 2750268 3048090 2675784 2765584 2588197
14008B588197j79750p875J90337R5461k38476M308J14782j82852J80079k42690
$$ 2588197 2408447 2400572 2590909 2686370 2447894 2452202 2566984 2384132 2564211 2321521
13998B321521j08250K20779R1317o8502n6211K85231o05187J48216m1767K51674
$$ 2321521 2213271 2434050 2525367 2456865 2400654 2685885 2080698 2228914 2187147 2438821
13988B438821m35654J20836m7317j53033K56240M7781k49847J97522R0853L05553
$$ 2438821 2003167 2124003 2076686 1923653 2179893 2227674 1977827 2175349 2266202 2571755
13978B571755L14712q9276R96683j21802J897611K879079N943655J0074788R010420
$$ 2571755 2886467 2797191 3793874 3672072 5569683 8448762 14392417 24467205 33477625
13969C3477625j1522672q297090m788708j772795j659817q57950l90786m52295
$$ 33477625 21954953 13657863 8869155 7096360 5436543 4578593 4187807 3735512
13961C735512l31177l50275N8061m40274N3970K47226m89298j1109m44689L27104
$$ 3735512 3404335 3054060 3112121 2671847 2725817 2973043 2483745 2472636 2027947 2355051
13951B355051Q8556l82819O8795J52630j29236j94599j37319J96264k4548o655
$$ 2355051 2443607 2060788 2129583 2282213 2152977 1958378 1821059 2017323 1992775 1986120
13941A986120j16967L5441j07598j50950R5245J81872k02440K57638j55783k1495
$$ 1986120 1869153 1904594 1796996 1646046 1741291 1923163 1720723 1978361 1822578 1801083
13931A801083j07804J21841j03621n1460j15720J29015j43400q4549O7714J09084
$$ 1801083 1693279 1815120 1711499 1660039 1544319 1673334 1529934 1445385 1513099 1622183
13921A622183k4861P1851m18083M78323j72414p5836J62336k51050J63209N9126
$$ 1622183 1597322 1669173 1251090 1729413 1556999 1481163 1643499 1392449 1555658 1614784
13911A614784p2719j0212l33269K63052K45040n47516L28195K01562r6130l61991
$$ 1614784 1542065 1531853 1198584 1461636 1706676 1159160 1487355 1688917 1592787 1230796
13901A230796J39428J91641k83975J77775p7531k50760L12260k38435k24360N24158
$$ 1230796 1370224 1561865 1277890 1455665 1378134 1127374 1439634 1201199 976839 1500997
13891A500997l97156M65566k86642O2954j24106M2450J38876K06956m71695L4367
$$ 1500997 1103841 1569407 1282765 1345719 1221613 1264063 1402939 1609895 1138200 1172567
13881A172567N0891k8876R3491j06616K06602l22480K31822n5554j53310k221
$$ 1172567 1223458 1194582 1288073 1181457 1388059 1065579 1297401 1241847 1088537 1086316
13871A086316P5587k89517M31660j51896J44802j97320o894l23693P97616p1595
$$ 1086316 1161903 872386 1304046 1152150 1296952 1099632 1092738 769045 1566661 1495066
13861A495066m53247K49113k48129k07923M45035k30173J418q5533J00311j05929
$$ 1495066 1041819 1290932 1042803 834880 1279915 1049742 1051160 965627 1065938 960009
13851I60009M9041M24K0644k22781J27229L18425m23698p0534j96738M59732j69505
$$ 960009 1009050 1009474 1030118 807337 934566 1252991 829293 758759 562021 1021753 852248
13840H52248K2448K80469k07930J64514J41595k62893K46502q9961p4218m01811
$$ 852248 874696 1155165 947235 1111749 1253344 990451 1236953 1146992 1072774 670963
13830F70963L3772M13198k10354k51933l4400K48863o6935L41612j3487K670o5248
$$ 670963 704735 1117933 907579 655646 621246 870109 803174 1144786 1131299 1133969 1068721
13819A068721k49230j17020R0758J38920m388K9823K0253j58329M5507D06156
$$ 1068721 819491 702471 793229 932149 927761 957584 977837 819508 865015 406156
13808A012079m56973P8884K43851J71985j73609l49750P6765n3749J42051J30549
$$ 1012079 555106 633990 877841 1049826 876217 526467 603232 549483 691534 822083
13798H22083J57131p4446j47534m8130P8835j61685P8789j91694O31061m88848
$$ 822083 979214 904768 757234 709104 787939 626254 705043 513349 1144410 655562
13788F55562k18882Q4641J39144p841j4440K68834k51443Q7448j63305K17860
$$ 655562 436680 521321 660465 652624 638184 907018 655575 743023 579718 797578
13778G97578j15741j93715K44263K78996l45312J93630J04670D79293J1594J73604
$$ 797578 681837 488122 732385 1011381 666069 859699 964369 479293 490887 664491
13768F64491K0419o9764K26867k11442J5988M10842l59601J95474k58348J24904
$$ 664491 684910 615146 842013 630571 646559 1057401 697800 893274 634926 759830
13758G59830N7719l07401M3863K6025L66521l2567k37813j98110K41620A70535
$$ 759830 817549 510148 554011 580036 946557 913990 676177 478067 719687 170535
13747E90855J20123K7419J37787B91224M59221C60581J47238K32302l7150o5127
$$ 590855 710978 738397 876184 291224 750445 360581 507819 740121 702971 637844
13737F37844J52139k09379N6835K27591k71135k2378q6895j98962O3726K91859
$$ 637844 789983 580604 637439 865030 593895 571517 484622 285660 349386 641245
13727F41245O9081k46639J37734m590k58674K87296j21519L56679q0276j69457
$$ 641245 710326 463687 601421 596831 338157 625453 503934 860613 780337 610880
13717F10880J32241j6908k76890j3985K29566l0943K77316k92814L46919C38116
$$ 610880 743121 726213 449323 435338 664904 633961 911277 618463 965382 338116
13706B88716J41192K98394j69737J51420j44900k29702K85098j97912G9187J57032
$$ 288716 429908 728302 558565 709985 565085 335383 620481 422569 79187 236219
13696B36219K18888j24309L49453p8707L55638k86475q4916j62050R1444K68087
$$ 236219 455107 330798 680251 601544 957182 670707 585791 423741 515185 783272
13686G83272r9905K2328j61379n7767H5245K42139J25948A57629L73019j31122
$$ 783272 683367 705695 544316 486549 85245 327384 453332 157629 530648 399526
13676C99526L21251k97238K78781C41941J78335o4508L59860p2402l51427J20363
$$ 399526 720777 423539 702320 341941 520276 455768 815628 743226 391799 512162
13666E12162k38918Q8276N33974m46182J68816K22570m15740k5738K25029k51604
$$ 512162 273244 361520 895494 449312 618128 840698 424958 399220 624249 372645
13656C72645L75822j95494m8102o7226K1308A71562N36166C47697N0727j05803
$$ 372645 748467 552973 504871 437645 458953 171562 707728 347697 398424 292621
13646B92621J26627J68509O198j38852B25509P4617K99559B92563r1481N5847
$$ 292621 419248 587757 593955 455103 225509 300126 599685 292563 201082 256929
13636B56929j0228M74272L2226k67951B32130P90093D13660J19969k46229Q2826
$$ 256929 246701 720973 753199 485248 232130 1022223 413660 533629 287400 370226
13626C70226l3629M0792G1999K42293k8044J89130B16043G1167K5732J39193j4051
$$ 370226 336597 377389 71999 314292 286248 475378 216043 71167 96899 236092 222041
13615B22041m8107n7750L89547k0051j53015L10969k01149A20176N90034l51765
$$ 222041 173934 116184 505731 485680 332665 643634 442485 120176 710210 358445
13605C58445K46261B50210J06384J9435j17203K1093J25672J47176q8299G2659
$$ 358445 604706 250210 356594 376029 258826 279919 405591 552767 464468 72659
13594C14872F4379L66836C4081J89496M47460A78879L17254B6235K46028J76508
$$ 314872 64379 431215 34081 223577 671037 178879 496133 26235 272263 448771
13584D48771A29397K00735k340n8200j30390A3033J22404J52514j7939K00085
$$ 448771 129397 330132 327792 269592 139202 13033 135437 287951 270012 470097
13574D70097j55393J06843j55883K7729J61436j58873J37050P9249A74971K32122
$$ 470097 314704 421547 265664 293393 454829 295956 433006 512255 174971 407093
13564D07093N6523I8735P0604L4146F1169O26257e328A69943A3561a43214B52454
$$ 407093 463616 98735 169339 203485 61169 687426 -5328 169943 13561 -143214 252454
13552D77789j22616P0614j10886j40149B6819P5231N41996B08081M5199J93920
$$ 477789 355173 425787 314901 174752 26819 102050 644046 208081 253280 447200
13542D47200j98950J00939K91474A91049l2328L03574M53762B82536J71615I8977
$$ 447200 248250 349189 640663 191049 158721 462295 916057 282536 454151 98977
13531D60901B24700J11879K53219A87661M8776J14467L3491M0245l8828A37773
$$ 460901 224700 336579 589798 187661 236437 350904 384395 424640 385812 137773
13520A8842L93834j342j53711l6401L69415A34356M15362D90K68582J4129G5011
$$ 18842 412676 411334 257623 221222 590637 134356 549718 490 269072 283201 75011
13508A31428R1475M9251K91489b41584A55025K24135A37591n599E0365M11744
$$ 131428 222903 272154 563643 -241584 155025 379160 137591 131992 50365 462109
13498D62109A23107a03095A90594M0350R858b4410C56463A989R4522B3969K21943
$$ 462109 123107 -103095 190594 230944 240802 -24410 356463 1989 96511 23969 245912
13487B45912m0200K89699B23056J40728A03450K31783l7792j4156c7874D85941
$$ 245912 205712 495411 223056 363784 103450 335233 297441 283285 -37874 485941
13476B46426j14174h2163B63703J30347A40089J58148j13361b6009j9333A83927
$$ 246426 132252 -82163 263703 394050 140089 298237 184876 -26009 -45342 183927
13465C56049a13126C52639B7417L22988O8630j86450j3092m8121J3801K18665
$$ 356049 -113126 352639 27417 350405 419035 232585 219493 171372 185173 403838
13455D03838R199A66173N32029A51487K33221o0191j03407M5434A15378K2470
$$ 403838 413037 166173 698202 151487 384708 324517 221110 266544 115378 137848
13445A37848J85816j22556o6309n7092N7531K46385A81029q7219L19663c601A03670
$$ 137848 323664 201108 134799 77707 135238 381623 181029 93810 413473 -3601 103670
13433D18380B0000L75971e8841F8169M19570B28626A02145K5850L9660O2223m3621
$$ 418380 20000 395971 -58841 68169 487739 228626 102145 127995 167655 229878 186257
13422A86257N5269R6176d2349A39798L00159r712A96936K6587R7439m1546p8791
$$ 186257 241526 337702 -42349 139798 439957 430245 196936 223523 320962 279416 200625
13411B00625A7663i6681C12472A41617e2501B80109j2533n7090j7066D5100K36072
$$ 200625 17663 -96681 312472 141617 -52501 280109 267576 210486 193420 45100 281172
13400B81172A15791A008L7745f5790A53499L6794G2629J40525J02114F5038M68419
$$ 281172 115791 1008 38753 -65790 153499 190293 72629 213154 315268 65038 533457
13389E33457j98839M5129j76440K52884A15953J60366a26523j60839I6556P2147
$$ 533457 334618 379747 203307 456191 115953 276319 -126523 -287362 96556 168703
13379A68703a0454F5552k6364a6263k5038C05900e3090A86481J40768A18120r524
$$ 168703 -10454 65552 39188 -16263 -41301 305900 -53090 186481 327249 118120 108596
13368A08596L8148i3493B40240J60076A21963K09881c8740C1012K43976k3864
$$ 108596 146744 -93493 240240 400316 121963 331844 -38740 31012 274988 251124
13358B51124D5610h4686G9862J36207I5764K94560H8930R5646K78209D3854K95211
$$ 251124 45610 -84686 79862 216069 95764 390324 88930 184576 462785 43854 339065
13347C39065L5637l5926H5673k8970L51974K9455r4915L098g2485j44170C64944
$$ 339065 374702 338776 85673 56703 408677 438132 343217 346315 -72485 -216655 364944
13335C63867o3064A21800N238n0293a77986a194D18818A50651J56634o6392J13884
$$ 363867 300803 121800 127038 76745 -177986 -1194 418818 150651 307285 240893 354777
13324C54777A63252K78361h7188C30485A33916M5744L7688J6134j15776L15109
$$ 354777 163252 441613 -87188 330485 133916 179660 217348 233482 117706 432815
13314D32815A32284L5485m8848C1345J05630P321A6740e601j2702H9781K2721
$$ 432815 132284 167769 118921 31345 136975 144296 16740 -5601 -18303 89781 112502
13303A12502K13407e843A60094l8993a00071C12673a3580A98707c8976C64476
$$ 112502 325909 -5843 160094 121101 -100071 312673 -13580 198707 -38976 364476
13292F9595J5633M19769J4211j11183j6024l8078K8670c1595B70644j0560G8594
$$ 69595 85228 504997 519208 408025 392001 353923 382593 -31595 270644 260084 78594
13280a11069D85014k23688j18648B4107J67175E4583N6611b0082A74041Q8270
$$ -111069 485014 261326 142678 24107 191282 54583 111194 -20082 174041 262311
13270B62311b9713E47062A60974m6353R2372q2337L28193b81962A92304a59265
$$ 262311 -29713 547062 160974 114621 206993 124656 452849 -281962 192304 -159265
13259C31493j49924c04639A09160J64238p0072a4591j02774j10573A87580q4668
$$ 331493 181569 -304639 109160 273398 203326 -14591 -117365 -227938 187580 102912
13249A02912a96283A3057J40418K25934B1227e3049A07941A8511a26951B39642
$$ 102912 -196283 13057 153475 379409 21227 -53049 107941 18511 -126951 239642
13238B41559C9529K82297C0948b7454o7133A24770L08546E6131d3903C5100J53287
$$ 241559 39529 321826 30948 -27454 -94587 124770 433316 56131 -43903 35100 188387
13227A88387D7700h2692p8178H8835J57206k2586F116K88875b45726A34891J47689
$$ 188387 47700 -82692 -160870 88835 246041 223455 6116 294991 -245726 134891 282580
13216B82580F6332Q7118J75140b26401A48811a61409d3556C7286a6373D15828
$$ 282580 66332 153450 328590 -226401 148811 -161409 -43556 37286 -16373 415828
13205B21939a2784A04386K87671a3920k0632k46318F9087M51754G2930O0567J5601
$$ 221939 -12784 104386 392057 -13920 -34552 -280870 69087 520841 72930 133497 149098
13194A49098F4215j6265K6494h6900B2658J57379A6243K063J73410i3365C30374
$$ 149098 64215 47950 74444 -86900 22658 180037 16243 18306 191716 -93365 330374
13182E8234J18624l4212h9285B46658A12186P0026n3922C892K24994D2576a81731
$$ 58234 176858 142646 -89285 246658 112186 182212 128290 3892 228886 42576 -181731
13170A10721b1764A57808B2322K30494A1571J2905a81099D0105M2923L0281a13935
$$ 110721 -21764 157808 22322 252816 11571 24476 -181099 40105 83028 113309 -113935
13158B08424G5950a75753A04854M29C3022J3125J26866a56816B57653q1554K9548
$$ 208424 75950 -175753 104854 105283 33022 46147 173013 -156816 257653 176099 205647
13147B05647j1283f2578K3292A51462G4410Q7475n6798D633J77124Q2894p6021
$$ 205647 194364 -62578 -39286 151462 74410 161885 105087 4633 181757 264651 188630
13136A88630c58497A36833l9889b45487B93689j02061d4901p8384a7211A25849
$$ 188630 -358497 136833 96944 -245487 293689 191628 -44901 -123285 -17211 125849
13125I1190J00484a61450A36377K31349j1557B536K14542M929d247l1805m9015
$$ 91190 191674 -161450 136377 367726 356169 2536 217078 222007 -4247 -36052 -85067
13114h5067B2831b4666B70768H0761J4434K31209N0225a55259C0356h6472B77720
$$ -85067 22831 -24666 270768 80761 95195 326404 376629 -155259 30356 -86472 277720
13102c6475j08369C29481A57936J29601c3366l01333I5205B5141c71473I0456
$$ -36475 -144844 329481 157936 287537 -33366 -334699 95205 25141 -371473 90456
13091f8508l6782A48614h6349B88866G7309J0037c9916A48034G1336b16418C36766
$$ -68508 -105290 148614 -86349 288866 77309 87346 -39916 148034 71336 -216418 336766
13079b897C36858r7765b35873E44254j95766a09594c1736A2728J178J0405g4316
$$ -2897 336858 239093 -235873 544254 348488 -109594 -31736 12728 13906 24311 -74316
13067A50607A9010J39394b31376Q4125L948E9287i5594k51003H8011c2965m74078
$$ 150607 19010 158404 -231376 -147251 -143303 59287 -95594 -346597 88011 -32965 -507043
13056e07043b13548D07634b14597B38223G0010l2204J65696c653H2641J21436
$$ -507043 -213548 407634 -214597 238223 70010 37806 203502 -3653 82641 204077
13046B04077D6008L74348C3545J37915l0729k2362J84854j22594J60329E6094
$$ 204077 46008 420356 33545 171460 140731 118369 303223 180629 340958 56094
13035B722L00931C4941N894a7909k43777C34788h9029P572k59250A33189o0698
$$ 2722 303653 34941 40835 -17909 -261686 334788 -89029 -81457 -340707 133189 72491
13024G2491K97303p4126r0895J69896A18168M1932p8705a0467b412B43603G1806
$$ 72491 369794 295668 204773 374669 118168 160100 81395 -10467 -2412 243603 71806
13012g3732I563a33368A03869M2727a61590A02922B6906H199O5508J64719J3925
$$ -73732 9563 -133368 103869 146596 -161590 102922 26906 8199 73707 238426 252351
13001B52351d3756B25182a94046C9293K53561I6592J5290E1364a94868P6008A95594
$$ 252351 -43756 225182 -194046 39293 292854 96592 111882 51364 -194868 -118860 195594
12989F0346N2131i459A79572i5421D9334K27696I9978A5142J16622b66530a6365
$$ 60346 112477 -9459 179572 -95421 49334 277030 99978 15142 131764 -266530 -16365
12977i9725E2187B5785P1848r120g4423o5096A54355a38197e3833J0808o9117
$$ -99725 52187 25785 97633 88513 -74423 -139519 154355 -138197 -53833 -43025 -112142
12966a12142L4183H1036O7507c5356l5499j32356d9512A25459b2819C00810j29424
$$ -112142 -77959 81036 148543 -35356 -70855 -203211 -49512 125459 -22819 300810 171386
12955A71386G2257C1907A1591a59116B74206A9716K06565H2891J50943o6718b07312
$$ 171386 72257 31907 11591 -159116 274206 19716 226281 82891 233834 167116 -207312
12943A93023p9926c3946C8403b01744A68150B25a9476C7219J28951f2958B12709
$$ 193023 113097 -33946 38403 -201744 168150 225 -19476 37219 166170 -62958 212709
12931E3058r75b7873I4721a66243P6743E6648b2407E1838a62212k44668I4434
$$ 53058 52083 -27873 94721 -166243 -89500 56648 -22407 51838 -162212 -406880 94434
12919A50152J15902b27176b4150j73878A14104a54259A84556q3442J09966q3436
$$ 150152 266054 -227176 -24150 -198028 114104 -154259 184556 101114 211080 127644
12909A27644c0402C49689A08395M1397O665g7115j7414A020J79887c02213c5122
$$ 127644 -30402 349689 108395 149792 156457 -77115 -94529 1020 180907 -302213 -35122
12897A98265c4654l58884J71634B43489j7588o9807b07045A56914J08024b72967
$$ 198265 -34654 -393538 -221904 243489 225901 156094 -207045 156914 264938 -272967
12886i4493k16754C80516b22385c165j43353N0997l4103b186A28913Q0835a47996
$$ -94493 -311247 380516 -222385 -3165 -146518 -95521 -129624 -2186 128913 209748 -147996
12874a62716C35137a02752A2351K10670A05186a13585C57713A00351a36282j31124
$$ -162716 335137 -102752 12351 223021 105186 -113585 357713 100351 -136282 -267406
12864b67406B37381j16203j8232B0826K8519J41211E5897k7461h2863a2922A91762
$$ -267406 237381 121178 102946 20826 49345 190556 55897 28436 -82863 -12922 191762
12852A33622J36936a33147A48228D8911J7439N4781d9221a0297l0157B30731h293
$$ 133622 270558 -133147 148228 48911 66350 121131 -49221 -10297 -40454 230731 -8293
12840a13542A18504h5734n4311b2383j50331b567C13696k5492I3931a1242j79818
$$ -113542 118504 -85734 -140045 -22383 -172714 -2567 313696 288204 93931 -11242 -191060
12829a91060h4401F3822a2682k88714b3104M104B68464A09097a8810B1238d8667
$$ -191060 -84401 63822 -12682 -301396 -23104 -19000 268464 109097 -18810 21238 -48667
12817E8640J26447O5197C1887a08684A80056j9486j4054h4057d0631l02906e0434
$$ 58640 185087 250284 31887 -108684 180056 160570 146516 -84057 -40631 -343537 -50434
12805A97326C0492c45527A19765b1596C2174h9081B66680b272q3994b6479D932
$$ 197326 30492 -345527 119765 -21596 32174 -89081 266680 -2272 -86266 -26479 4932
12793c7123H2630b05224G9324a51746a3195G468a53230b9512A96114a23372M9126
$$ -37123 82630 -205224 79324 -151746 -13195 7468 -153230 -29512 196114 -123372 -74246
12782g4246A85934q2428e1080A9377h6805C8748J81548G920c722j00193j1108
$$ -74246 185934 103506 -51080 19377 -86805 38748 220296 7920 -3722 -103915 -115023
12771a15023C03959b4026A53447a52318A62915c2676E1745b17082a05891D7984
$$ -115023 303959 -24026 153447 -152318 162915 -32676 51745 -217082 -105891 47984
12760A08850m4957a0103o5120B07268a99483h4919j4546K6182B3479c6919C0024
$$ 108850 63893 -10103 -75223 207268 -199483 -84919 -99465 -73283 23479 -36919 30024
12748A60221h3060D5498a78793A28350L29379a35799B69446K7046c82915d9822
$$ 160221 -83060 45498 -178793 128350 457729 -135799 269446 296492 -382915 -49822
12737b77228I3385J84681E5114d1106A03185b1752D20191c45163N8493A44466
$$ -277228 93385 278066 55114 -41106 103185 -21752 420191 -345163 -286670 144466
12726i4784B5795b64534A40632K53042a06925B20908p9512k9202M93L8577b12939
$$ -94784 25795 -264534 140632 393674 -106925 220908 141396 112194 112687 151264 -212939
12714a09790B81358d6114j61676P2663A91336l6387a89439k3030f3467p7668M3918
$$ -109790 281358 -46114 -207790 -135127 191336 154949 -189439 -212469 -63467 -141135 -97217
12703i7217B6876a86795n2546D3613a43821o7995B46313k4828n2322E8027J46210
$$ -97217 26876 -186795 -239341 43613 -143821 -211816 246313 221485 169163 58027 204237
12692B04237k500D8851L65429C6931L05111A43271F8874k2704k1077K3143L9257
$$ 204237 201737 48851 414280 36931 342042 143271 68874 46170 25093 48236 87493
12681H7493d0958A71706C3647M2792i2012G3844A3591c68807B86934e6238A39499
$$ 87493 -40958 171706 33647 76439 -92012 73844 13591 -368807 286934 -56238 139499
12669C74068a44409A21381K05597B5581f619n2231I6144J232R0938E4378O2213
$$ 374068 -144409 121381 326978 25581 -6619 -58850 96144 97376 188314 54378 116591
12658A16591J11440o3550K06240c4127A68159b14260K8194f9398A04002a68049
$$ 116591 228031 164481 370721 -34127 168159 -214260 -186066 -69398 104002 -168049
12647A80724a42170C6050a18274d2570k4683B42073h9076A2929a22007A56599
$$ 180724 -142170 36050 -118274 -42570 -67253 242073 -89076 12929 -122007 156599
12636A35351J3449P7308a15772M8451A02685a80083O9361B079i0258F594L9158
$$ 135351 148800 226108 -115772 -67321 102685 -180083 -110722 2079 -90258 6594 45752
12625D5752k0232g5390j2404F0227K5195b11984j4466C8887J87230a2123B2146
$$ 45752 25520 -75390 -87794 60227 85422 -211984 -226450 38887 226117 -12123 22146
12613B35959G9601h9899B34261I0229K62424c356A30170b54855f0571D3128J14448
$$ 235959 79601 -89899 234261 90229 352653 -3356 130170 -254855 -60571 43128 157576
12602A57576b6231o081j18462f2266C9257K55493A46423m2665h0035n2254A73886
$$ 157576 -26231 -32312 -150774 -62266 39257 294750 146423 103758 -80035 -132289 173886
12590B49601j24344K32420j45604a58240K1871H9710J96580J02914A35082a46488
$$ 249601 125257 357677 212073 -158240 -136369 89710 286290 389204 135082 -146488
12579A07357J22806J22844j0925c6775q2000l84318a9753I6297J13708c95069
$$ 107357 230163 353007 342082 -36775 -118775 -503093 -19753 96297 210005 -395069
12568B27598D8097g2614A667a64204D1173P1297K16530A54039a40887c8267C89689
$$ 227598 48097 -72614 1667 -164204 41173 112470 329000 154039 -140887 -38267 389689
12556B31508b54091a7735k4349k36423B36810q0809g9568m5428e6028j01465n2032
$$ 231508 -254091 -17735 -42084 -278507 236810 156001 -79568 -124996 -56028 -157493 -209525
12545b09525B20489C6868b56008A04317a50377A88566A9453I514K30462i3805
$$ -209525 220489 36868 -256008 104317 -150377 188566 19453 9514 239976 -93805
12534A33582k0749i2054A77134I443J02706e7922j05690B0173R3781i668j02136
$$ 133582 112833 -92054 177134 9443 112149 -57922 -163612 20173 113954 -9668 -111804
12523a11804F9738f982F3678h627l25473A40678B2949e3567A95938m3309n1190
$$ -111804 69738 -6982 63678 -8627 -334100 140678 22949 -53567 195938 152629 101439
12512A01439e4198B39381a70057l6121C10298a7903k8003q1417A31743b5578j90193
$$ 101439 -54198 239381 -170057 -206178 310298 -17903 -45906 -127323 131743 -25578 -215771
12501b15771q8534D77448a2216F6141J17394f0908j05949B76453b19783A7447
$$ -215771 -304305 477448 -12216 66141 183535 -60908 -166857 276453 -219783 17447
12490A55397b18577A55155a20416p0054k7222O8243c0737A18896K3563d477C9614
$$ 155397 -218577 155155 -120416 -190470 -217692 -149449 -30737 118896 142459 -4477 39614
12478F96421b6448B32330a51636l6823B29182J393L56516F5635H773a92906A74238
$$ 696421 -26448 232330 -151636 -188459 229182 230575 587091 65635 8773 -192906 174238
12466c58194a57628j23325B54843D2313f0349D9455k1062a93620i04k41207f8774
$$ -358194 -157628 -280953 254843 42313 -60349 49455 28393 -193620 -904 -242111 -68774
12454h6555j01414F3351h5379n462A86405d6346B98853b55158G8650b35089A88190
$$ -86555 -187969 63351 -85379 -90841 186405 -46346 298853 -255158 78650 -235089 188190
12442b5173j33940c8012I1778a81643j6803J9333g6633j05623h8162B69238D2562
$$ -25173 -159113 -38012 91778 -181643 -198446 -179113 -76633 -182256 -88162 269238 42562
12430A49807c7839F0237k9232a15117B91307h0815B81210q9714j9381b74849I5122
$$ 149807 -37839 60237 31005 -115117 291307 -80815 281210 191496 172115 -274849 95122
12418A99902a20382J0812C46286b1429A21102K9958B7351K6830I661K68200a18177
$$ 199902 -120382 -109570 346286 -21429 121102 151060 27351 54181 9661 277861 -118177
12406d9814A58551J1209d3172C4378P565b55290e9948G4220b36090c7165j299
$$ -49814 158551 169760 -43172 34378 41943 -255290 -59948 74220 -236090 -37165 -38464
12395c8464C7804K41305a95324C099h5950j00710L1546D0101a66279D4538M3988
$$ -38464 37804 279109 -195324 3099 -85950 -186660 -155114 40101 -166279 44538 88526
12384H8526a47038p9768A78016c4920B61663C2221b47430B04852j6171D0162a63023
$$ 88526 -147038 -226806 178016 -34920 261663 32221 -247430 204852 188681 40162 -163023
12372B62576D4823K88956a33839A64306a792n7354b7798A88351l2571l3009c3270
$$ 262576 44823 333779 -133839 164306 -1792 -59146 -27798 188351 155780 122771 -33270
12360A81752F6153J59077k1121H5608K02840o0832a5101Q44j24559k48431e0967
$$ 181752 66153 225230 204109 85608 288448 227616 -15101 -14257 -138816 -387247 -50967
12348A13253c8430A01092i6250H3331l5175g7141C8452g5188k79513a33150A31953
$$ 113253 -38430 101092 -96250 83331 48156 -77141 38452 -75188 -354701 -133150 131953
12336b56876d7696A08310K4134a46421j77994o9058E2383H46K32666G7675a7161
$$ -256876 -47696 108310 132444 -146421 -324415 -393473 52383 846 233512 77675 -17161
12324A6014M534J76402K3850F634K6597K95089a38067D62803a77531B93660b580
$$ 16014 20548 196950 220800 6634 33231 328320 -138067 462803 -177531 293660 -2580
12312H8179J24462a48873B17477G9032A4511M12100K0288q6803a23617A36264
$$ 88179 212641 -148873 217477 79032 14511 426611 446899 360096 -123617 136264
12301C44462b69271A09994j6290J29427a10661f376l2267I6206b5290F6216N1252
$$ 344462 -269271 109994 93704 223131 -110661 -6376 -38643 96206 -25290 66216 117468
12290A17468D580Q8991a41332A39237b98937J34224d7472B07121j00614a11891
$$ 117468 4580 93571 -141332 139237 -298937 -164713 -47472 207121 106507 -111891
12279A96616a80004C34648e790g64k78365R6606B64500n522P111C9799R3387R1090
$$ 196616 -180004 334648 -5790 -764 -279129 -182523 264500 258978 266089 39799 133186 224276
12267B24276a75261R98E24a49014D62948k07970o6951a14200b3346G0083J90148
$$ 224276 -175261 -174263 524 -149014 462948 254978 188027 -114200 -23346 70083 260231
12256B60231j13126k8094J73205G2856J42335a93167i2559A22133J52205F7630
$$ 260231 147105 119011 292216 72856 215191 -193167 -92559 122133 274338 67630
12245g7587L3907a5171N442m2155A36708E1754J08072L48976a65963B96676A8323
$$ -77587 -43680 -15171 -9729 -51884 136708 51754 159826 508802 -165963 296676 18323
12233A69295a23189N426A21872c3428D46341B16301m4598p5550b3732j1922p8705
$$ 169295 -123189 -117763 121872 -33428 446341 216301 171703 96153 -23732 -35654 -114359
12222a14359D7789a20219P697C6003L64727H2925B3370a25313M5607L1028A53088
$$ -114359 47789 -120219 -112522 36003 400730 82925 23370 -125313 -79706 -48678 153088
12210A81345a38553B05291E1241J97716O494f4466B06067m1334g6003C0227J78196
$$ 181345 -138553 205291 51241 248957 255451 -64466 206067 164733 -76003 30227 208423
12199B08423r7371P056a16418B97618R6293A13387h0221G4159K919R1916j5375
$$ 208423 111052 118108 -116418 297618 393911 113387 -80221 74159 77078 168994 153619
12188A53619p3385b09821Q051O3394K870F3482e2659q7657A70382F3518a3897
$$ 153619 80234 -209821 -201770 -138376 -135506 63482 -52659 -140316 170382 63518 -13897
12176E0179J94492r1151l008J62287J12476b22632A73333K2233I4945a24280A27758
$$ 50179 244671 153520 150512 312799 425275 -222632 173333 195566 94945 -124280 127758
12164b5024j01504B05927g6240B06801E7834i0602F3205J02272a03386C49036
$$ -25024 -126528 205927 -76240 206801 57834 -90602 63205 165477 -103386 349036
12153B79582A27977E6841J69358F4882d2794C84996j8314j12408d2953B61187
$$ 279582 127977 56841 226199 64882 -42794 384996 366682 254274 -42953 261187
12142a12738A50974B7989a78483E7691K08078A5070R4370b5108j46969D02145
$$ -112738 150974 27989 -178483 57691 265769 15070 109440 -25108 -172077 402145
12131c2660C02687o1812A5077O7706Q4911c1211A34033g5632c1996C64708A5266
$$ -32660 302687 240875 15077 82783 167694 -31211 134033 -75632 -31996 364708 15266
12119G6629d30008a43031B53111m6854I4067e2627B85078n964A10511J76805h527
$$ 76629 -430008 -143031 253111 206257 94067 -52627 285078 279114 110511 287316 -8527
12107a31009D16822Q1222M3187B04134d9715A51072M26606k30081A06925C3286
$$ -131009 416822 498044 541231 204134 -49715 151072 577678 347597 106925 33286
12096H3387K8114J49773I2640L48646a25618D7415K01138I6141C4667l779K4978
$$ 83387 111501 261274 92640 441286 -125618 47415 248553 96141 34667 30888 55866
12085E5866K27826m1158J9461Q4418C1781J12496B3134a4805A96777g0059A6360
$$ 55866 283692 242534 261995 346413 31781 144277 23134 -14805 196777 -70059 16360
12073B58993B6817p198L14433q1347G5394J63175K98697b44985G1216b0908I6480
$$ 258993 26817 19619 334052 252705 75394 238569 537266 -244985 71216 -20908 96480
12061a76570B30355j8900K86152a80271A69249q962E1609J81814H2584a01036
$$ -176570 230355 211455 497607 -180271 169249 160287 51609 233423 82584 -101036
12050c3235C0043J52450C1155q683e4292k4591A10687b9761A66680a7270A10885
$$ -33235 30043 182493 31155 22472 -54292 -78883 110687 -29761 166680 -17270 110885
12038B00421a2677C15840I5289b99439c5276j8191B28755A01485N0678n5987b62175
$$ 200421 -12677 315840 95289 -299439 -35276 -53467 228755 101485 152163 96176 -262175
12026b21594g5517b2202M563r3446D2040R4654J07086a05089c305D31401H0517
$$ -221594 -75517 -22202 -17639 -111085 42040 136694 243780 -105089 -3305 431401 80517
12014G2656c4756h207A50886A4060f3350J1008B21792d3213A78901a09232B13561
$$ 72656 -34756 -8207 150886 14060 -63350 -52342 221792 -43213 178901 -109232 213561
12002G6543M3222D1165M7008J35637a87970n1905d4251o4501b5076j42181A6705
$$ 76543 119765 41165 88173 223810 -187970 -239875 -44251 -108752 -25076 -167257 16705
11990a39023M7898a8068A25641a6145k48318g5751q6202A07101l3636J86593j7520
$$ -139023 -91125 -18068 125641 -16145 -264463 -75751 -161953 107101 73465 260058 242538
11979B42538H009L0053e5818I133b45799d7211j03650p1060B13561f5164C82720
$$ 242538 8009 38062 -55818 9133 -245799 -47211 -150861 -221921 213561 -65164 382720
11967A68234k0888J34297A7398K51207C9187N6981C7491K02283g1657G3562a58787
$$ 168234 147346 281643 17398 268605 39187 96168 37491 239774 -71657 73562 -158787
11955a91033Q6853B05538o9525c7950D3059a99808i2400j4999A35385N8324a80554
$$ -191033 -104180 205538 136013 -37950 43059 -199808 -92400 -107399 135385 193709 -180554
11943e05643a64248o8341i0638E8872K5641C2889J57448r3918J00288i5080A4305
$$ -505643 -164248 -232589 -90638 58872 84513 32889 190337 96419 196707 -95080 14305
11931b12072h9115p0806j87235J58105D17282a97483C27924d36762B5003a83209
$$ -212072 -89115 -159921 -347156 -189051 417282 -197483 327924 -436762 25003 -183209
11920a38456m0282e2593e983j99500M8799N6486F849J52633E1733c95384h4069
$$ -138456 -178738 -52593 -5983 -205483 -156684 -100198 6849 159482 51733 -395384 -84069
11908A03220J21119H9310N8813a21360B39313E2927a9332M473l55728a17777e5740
$$ 103220 224339 89310 148123 -121360 239313 52927 -19332 -14859 -370587 -117777 -55740
11896D4536K6719l3500a56531C51858d0957B02404f3397A83916D1794L87352A0584
$$ 44536 71255 37755 -156531 351858 -40957 202404 -63397 183916 41794 429146 10584
11884a9386m9129G6482b31095G247c35821C37146j37399c01277a9686C0302a59909
$$ -19386 -68515 76482 -231095 7247 -335821 337146 199747 -301277 -19686 30302 -159909
11872B12425b59532A37982d65414A44939a0069A64033c8202l28487a1667r5198
$$ 212425 -259532 137982 -465414 144939 -10069 164033 -38202 -366689 -11667 -106865
11862a06865q872k07314B41040c92880j13549i2822A14800K7733k7800a34219
$$ -106865 -115737 -323051 241040 -392880 -506429 -92822 114800 142533 114733 -134219
11851c56971B80202F8084h2837J716J5792A04212a44658f518A72474a48869A17632
$$ -356971 280202 68084 -82837 -81121 -65329 104212 -144658 -6518 172474 -148869 117632
11839b57178G2755O4268a21836d326q7403H4581a79533l0962A17556f3680a9282
$$ -257178 72755 137023 -121836 -4326 -91729 84581 -179533 -210495 117556 -63680 -19282
11827a61363F9563c68293Q2080J06448B89409c18476a6345j67520l58787b16797
$$ -161363 69563 -368293 -286213 -179765 289409 -318476 -16345 -183865 -542652 -216797
11816A80732f7880A67111a18898k01668j02433A94336O8344a44147B6723d4733
$$ 180732 -67880 167111 -118898 -320566 -422999 194336 262680 -144147 26723 -44733
11805a5875C14837a49046f9253B18926j03693m2194J06815b53381e1543j5483
$$ -15875 314837 -149046 -69253 218926 115233 73039 179854 -253381 -51543 -67026
11795f7026R602H9054c19690B36860A8251a8647k97616h12o4171D5341J60506
$$ -67026 -57424 89054 -319690 236860 18251 -18647 -316263 -812 -64983 45341 205847
11784B05847C9433d5376a2223m0386B00819i910B18977a49250j4592E8091L2949
$$ 205847 39433 -45376 -12223 -52609 200819 -9910 218977 -149250 -163842 58091 91040
11773I1040K5527K00719j33199a76670j72860G3326B0160J18973O9590c53861
$$ 91040 116567 317286 184087 -176670 -349530 73326 20160 139133 208723 -353861
11762f7651j0046A29234a54603A93691D5329d5935p0227g39j28764K90b1096j90192
$$ -67651 -77697 129234 -154603 193691 45329 -45935 -116162 -739 -129503 -129213 -21096 -211288
11750b11288b3492C50739h5887D2901J12514o0578j2671h2050B23383B2098c1025
$$ -211288 -23492 350739 -85887 42901 155415 94837 82166 -82050 223383 22098 -31025
11738A46967a60686p4500A25412B3573a99683j19133A9457J48458a92896B62509
$$ 146967 -160686 -235186 125412 23573 -199683 -318816 19457 167915 -192896 262509
11727e8124G4777b26195A87550h7333F6354D630J40886a12873j38214g2909B25055
$$ -58124 74777 -226195 187550 -87333 66354 4630 145516 -112873 -251087 -72909 225055
11715a70251C35928p5278N0319C5740a0943k73906A35067e6108B93452A02183
$$ -170251 335928 260650 310969 35740 -10943 -284849 135067 -56108 293452 102183
11704C47664j70153j9202a00946C28534c3494q0404A13256A1119Q6674B8126a47925
$$ 347664 177511 158309 -100946 328534 -33494 -113898 113256 11119 97793 28126 -147925
11692A52633b2786C02168a32622B30169G4735c1338A5235O7888R220a09097K6382
$$ 152633 -22786 302168 -132622 230169 74735 -31338 15235 83123 92343 -109097 -82715
11681h2715I5469N6130a40867B24941a27733b6068q2492B45336E4480J86703b13865
$$ -82715 95469 151599 -140867 224941 -127733 -26068 -108560 245336 54480 241183 -213865
11669c25512A08428a32930A99835D5705M8289J41198f0109j11900A57690n4689
$$ -325512 108428 -132930 199835 45705 93994 235192 -60109 -172009 157690 103001
11659A03001L01085b99635C23971K3960a0449r3810A37139a6617A04959b02548
$$ 103001 404086 -299635 323971 347931 -10449 -104259 137139 -16617 104959 -202548
11648a9412j96462B52661q3530g9490n2316j56790b2293D7116a09502A23935J17473
$$ -19412 -215874 252661 169131 -79490 -131806 -288596 -22293 47116 -109502 123935 241408
11637B41408J10814A12728a28335c5456m0853B0393K19059G4451a04309k65752
$$ 241408 352222 112728 -128335 -35456 -76309 20393 239452 74451 -104309 -370061
11627c70061J14717L3151I4601N2856n4383b81510R6477B8157b19432e4347H7325
$$ -370061 -255344 -222193 94601 147457 93074 -281510 -185033 28157 -219432 -54347 87325
11615A01994a4761d791k8021k8168G3276f3814a5215B0342J38349N0684b04438
$$ 101994 -14761 -4791 -32812 -60980 73276 -63814 -15215 20342 158691 209375 -204438
11603b15552P7807a2128A45747I212a37003D67799a97954e7459j35183F6854h3599
$$ -215552 -137745 -12128 145747 9212 -137003 467799 -197954 -57459 -192642 66854 -83599
11591A55790D4342Q6619c3972m17246A19476g7808A39981A9699L3790a84922A1923
$$ 155790 44342 130961 -33972 -451218 119476 -77808 139981 19699 53489 -184922 11923
11579c6569A34043b7860A58162k6261N97J0901k1445j7259b74552G8311g2536
$$ -36569 134043 -27860 158162 131901 132498 143399 121954 104695 -274552 78311 -72536
11567B2604J0911M1770l6069A2747J80638Q2876k2908h5084A98586a82971g1222
$$ 22604 33515 75285 39216 12747 193385 276261 253353 -85084 198586 -182971 -71222
11555I3284J02402I6245P27g1770D04327b0928j4197p512B45966g738p2862D2335
$$ 93284 195686 96245 96972 -71770 404327 -20928 -35125 -42637 245966 -7738 -80600 42335
11542B28529n2798K81319A16387a15265H742a75357I4977L1714m2143a6853B98093
$$ 228529 175731 457050 116387 -115265 8742 -175357 94977 126691 84548 -16853 298093
11530A31851A5632O0144J48417a34974d079n2145a6223j9001k48928b8694E6278
$$ 131851 15632 75776 224193 -134974 -4079 -56224 -16223 -35224 -284152 -28694 56278
11518C6499b4222K484B18942H8699b02863f8249H6874c7616l05498j6725F5382
$$ 36499 -24222 -21738 218942 88699 -202863 -68249 86874 -37616 -343114 -359839 65382
11506D9577M53988b55840D10034a78438H7866q846l4283J04780a66215F2850J63394
$$ 49577 503565 -255840 410034 -178438 87866 79020 44737 149517 -166215 62850 226244
11495B26244a48324f0091C51047d1769H8695b24319A06483J21815a14241H2948
$$ 226244 -148324 -60091 351047 -41769 88695 -224319 106483 228298 -114241 82948
11484F9074J51250M6223a39786q9397c6257C14583b7470D2639A5486L75726C9916
$$ 69074 220324 266547 -139786 -229183 -36257 314583 -27470 42639 15486 391212 39916
11472B91343a98532B86030j16124m5133b5470D37774A92909b26900H5659g9687
$$ 291343 -198532 286030 169906 124773 -25470 437774 192909 -226900 85659 -79687
11461F9538R001P9501a4229j275j42659L446B10472c200C13938f3180A31766J00172
$$ 69538 78539 158040 -14229 -15504 -158163 -154717 210472 -3200 313938 -63180 131766 231938
11449B31938J96722b14206B87612I6818C0245K60993r7406b01548A2539L27028
$$ 231938 428660 -214206 287612 96818 30245 291238 193832 -201548 12539 339567
11439C39567d52601B42676C9788J13953a20980C0869J22806J6492a18733A52523
$$ 339567 -452601 242676 39788 153741 -120980 30869 153675 170167 -118733 152523
11428A05542a20503L2219E0033K38056A13806J12848J64571b10372B84312h8071
$$ 105542 -120503 -88284 50033 288089 113806 226654 391225 -210372 284312 -88071
11417H7001a88017A74149g0184C05938G7079J28474b7277l1736j70883L4054j28120
$$ 87001 -188017 174149 -70184 305938 77079 205553 -27277 -59013 -229896 -195842 -323962
11406c23962a37639B79609J08927B7568a55416P6266q590l1654M3733b8192D6469
$$ -323962 -137639 279609 388536 27568 -155416 -79150 -87740 -119394 -75661 -28192 46469
11394c25932k5707a70859Q109A29727A9370a90171K9576a0335k21638B54268g448
$$ -325932 -351639 -170859 -162750 129727 19370 -190171 -160595 -10335 -231973 254268 -7448
11382C72853a74606B77309J6967d665A4354L0826G484J68567B6141a14374e4387
$$ 372853 -174606 277309 294276 -4665 14354 45180 7484 176051 26141 -114374 -54387
11370A9431P4271O3940p1263B7632a59101k596H6917a3710j56534I7222B2637
$$ 19431 93702 157642 86379 27632 -159101 -161697 86917 -13710 -170244 97222 22637
11358A447K8476O4215k7441a75716c056m611B09497J88082i4485j60613E6297
$$ 1447 29923 94138 66697 -175716 -3056 -7667 209497 397579 -94485 -255098 56297
11346d8104j84758N3390H2198a34885M5277k25031G4030l0541a95126R5174I7850
$$ -48104 -232862 -179472 82198 -134885 -89608 -314639 74030 43489 -195126 -99952 97850
11334a32358A02318a73171B23069j09441J71192A15061b47813A57467j1536K93909
$$ -132358 102318 -173171 223069 113628 284820 115061 -247813 157467 145931 439840
11324D39840j91503J20195e7180b6292C0665a83725A59902a28963A46664g3992
$$ 439840 248337 368532 -57180 -26292 30665 -183725 159902 -128963 146664 -73992
11313E2718P9140a67359D1207g2318g098k75057E0504J01188J20014g0062F6888
$$ 52718 131858 -167359 41207 -72318 -7098 -282155 50504 151692 271706 -70062 66888
11301a00222B1461J38532M5833F3804J02501n8853b28815A59601a71799o8197
$$ -100222 21461 159993 205826 63804 166305 107452 -228815 159601 -171799 -239996
11291b39996a3998m5138j85429C5607a53707o9946g7056k87661A56234C513a44882
$$ -239996 -13998 -59136 -244565 35607 -153707 -223653 -77056 -364717 156234 3513 -144882
11279a05628B1904r562dA1458b4550A68880n0778O831J75660a5357j72397A07501
$$ -105628 21904 12342 -4 11458 -24550 168880 118102 124933 300593 -15357 -187754 107501
11266c39553e7741j38985j17236J29911b8621j11707c8495q0847o0194j43685
$$ -339553 -57741 -196726 -313962 -184051 -28621 -140328 -38495 -119342 -179536 -323221
11256c23221h9547K6696A37321g5469A72018d8701r1151I3215b9012n4094b12
$$ -323221 -89547 -62851 137321 -75469 172018 -48701 -139852 93215 -29012 -83106 -212
11244b9227j72954k40944i6469B68892m5114b7138r4906a9980n4415A18901b2772
$$ -29227 -202181 -443125 -96469 268892 223778 -27138 -122044 -19980 -74395 118901 -22772
11232b14456D38864B9614q574b51631A02069N1271a5333C56842G7364h5813k88264
$$ -214456 438864 29614 21040 -251631 102069 153340 -15333 356842 77364 -85813 -374077
11221c74077J82615A26012L7163G1930e7115k6638j33365A55261p4437K3118f7260
$$ -374077 -191462 126012 163175 71930 -57115 -83753 -217118 155261 80824 103942 -67260
11209A61119N3443p3572c56447a10888K2465j34200G8688e2970k48313J23353
$$ 161119 214562 140990 -356447 -110888 -88423 -222623 78688 -52970 -301283 -177930
11199a77930A0942M3262b9454j39708C17159B488a73377n422f7493A40194a94767
$$ -177930 10942 54204 -29454 -169162 317159 2488 -173377 -178799 -67493 140194 -194767
11187B15353K44580a53499g3730k76950A57407F1414a63323c6140A54771J50611
$$ 215353 459933 -153499 -73730 -350680 157407 61414 -163323 -36140 154771 305382
11177C05382p4440a6637k2083n1658k48160b6555p954Q751k13132A97914H6031
$$ 305382 230942 -16637 -38720 -90378 -338538 -26555 -34509 -25758 -238890 197914 86031
11165e5477A14846e5773k32319A41487g2764j4070B28759c94708f7718j02778
$$ -55477 114846 -55773 -288092 141487 -72764 -86834 228759 -394708 -67718 -170496
11155a70496b0727j36293o0079q9755C52451j5735G1000a42917a3692E3710a07523
$$ -170496 -20727 -157020 -217099 -306854 352451 336716 71000 -142917 -13692 53710 -107523
11143B96317b51219F4477K78756A35232f4419B9857R4865c65380k8354p0263J50125
$$ 296317 -251219 64477 343233 135232 -64419 29857 124722 -365380 -393734 -463997 -313872
11132c13872K5808Q7085f2866A00883b93028N1367h0851b0777A28610b25902m2285
$$ -313872 -288064 -200979 -62866 100883 -293028 -241661 -80851 -20777 128610 -225902 -268187
11121b68187I4236N1761a33319d2713B26811a38304I5039a86085A46675a37633
$$ -268187 94236 145997 -133319 -42713 226811 -138304 95039 -186085 146675 -137633
11110b32953A98736d5378A1249d5766A44464B1659L8744O1103a41449e8810j97962
$$ -232953 198736 -45378 11249 -45766 144464 21659 60403 121506 -141449 -58810 -256772
11099b56772A5898M0179K4211h947F4341J92987n6958q3476b75222a27927a877
$$ -256772 15898 56077 80288 -8947 64341 257328 200370 116894 -275222 -127927 -1877
11087I5843g9787A81025f7331A30200M677A6708a294H4781N8391O9512Q264a05626
$$ 95843 -79787 181025 -67331 130200 134877 16708 -1294 84781 143172 212684 220948 -105626
11074f7839A44274J39673a1958I2794K410R0740p0188R6280J44268j08517I2590
$$ -67839 144274 283947 -11958 92794 95204 185944 115756 212036 356304 247787 92590
11062g3176D96147m7273A06085k1300b36608i754D29949j74865R8010h5425D02596
$$ -73176 496147 448874 106085 84785 -236608 -9754 429949 255084 353094 -85425 402596
11050a24639o5291e4515B80208J36832l3584l3794A43573L40008k24958J76631
$$ -124639 -189930 -54515 280208 417040 383456 349662 143573 483581 258623 435254
11040D35254J29190B11862J62375J99920L0995j75428J68407m4480A90864K56073
$$ 435254 564444 211862 374237 574157 605152 429724 598131 553651 190864 446937
11030D46937K83814C32626m8406M80618B22153K05994R9306P5240P3359k2277
$$ 446937 730751 332626 284220 764838 222153 428147 527453 602693 676052 653775
11020F53775k05272j56760K03931j73714L25763C07759M08159j54934m2991R2468
$$ 653775 448503 291743 495674 321960 647723 307759 715918 560984 517993 610461
11010F10461o1391A23795M84141k5348L0119j7732J5506j44510Q1908m1595J82078
$$ 610461 549070 123795 607936 582588 612707 594975 610481 465971 547879 506284 688362
10999F88362o02k6473B09574K15974p9450N4728j66925M05522B43808L30297Q3429
$$ 688362 687760 661287 209574 425548 346098 400826 233901 639423 243808 574105 657534
10988F57534l28469J58192O6038j36529j71767L36741m0841M3242L562k38324
$$ 657534 329065 487257 553295 416766 244999 581740 540899 584141 587703 349379
10978C49379L26273B66439J79922j06283K37650q130l2665j49273J77623K87586
$$ 349379 675652 266439 446361 340078 577728 569598 536933 387660 565283 852869
10968H52869C96595J46352M08208o9545j94020N63862k63143Q9454k14202J25155
$$ 852869 396595 542947 951155 881610 687590 1251452 988309 1077763 863561 988716
10958I88716L45038p6482O9633K96920r6711L17076l11659M16348k46277J404
$$ 988716 1333754 1257272 1326905 1623825 1527114 1844190 1532531 1948879 1702602 1704006
10948A704006j17803k32899M438j1351O2930k22857L296K61643j77238J80716
$$ 1704006 1586203 1353304 1357742 1346391 1409321 1186464 1189760 1451403 1274165 1454881
10938A454881K96324l48285K40936k61074K9828j7573l15673j07342D80474P6539
$$ 1454881 1751205 1402920 1643856 1382782 1412610 1395037 1079364 972022 480474 557013
10928E57013A98232j9411L57261C834N99140j30415E8415K17648R803E1i9134
$$ 557013 198232 178821 536082 3834 602974 472559 58415 276063 285866 51 -99134
10916b54998A86256b8921A92651F1043d4099i733j29152F2164a41709B580L8513
$$ -254998 186256 -28921 192651 61043 -44099 -9733 -138885 62164 -141709 2580 41093
10905D1093J18001Q5758F593d5363q4210o1586D5652Q6805J6411h8441A61414
$$ 41093 159094 244852 6593 -45363 -129573 -191159 45652 132457 148868 -88441 161414
10893A01277a10044l5677A04699C4984J22324a06082H6026d5775I8824D8100J3527
$$ 101277 -110044 -145721 104699 34984 157308 -106082 86026 -45775 98824 48100 61627
10882F1627L7361c0814B385L9623J16469d36216A6383b72916P7974b9346j85061
$$ 61627 98988 -30814 2385 42008 158477 -436216 16383 -272916 -194942 -29346 -214407
10871b14407J06346C1157Q5272a34173j23760K1688F980g0623j67931J04098H831
$$ -214407 -108061 31157 116429 -134173 -257933 -236245 6980 -70623 -238554 -134456 8831
10859c85617i563I9453a33453p633B86850I4437J94858a91302i3847j98452f4485
$$ -385617 -9563 99453 -133453 -141086 286850 94437 289295 -191302 -93847 -292299 -64485
10847a0369B65323q6803b2733m32008A00672J61733d5420j7543C5975a79667l123
$$ -10369 265323 178520 -22733 -454741 100672 262405 -45420 -62963 35975 -179667 -182790
10836a82790e3774k2697m2858H1691L7875J77430A3429c00318i3243A05163c0328
$$ -182790 -53774 -76471 -119329 81691 119566 296996 13429 -300318 -93243 105163 -30328
10824i9171D1984b16863a3717E1239C419i3846B4400J57736E7795a59515A3061
$$ -99171 41984 -216863 -13717 51239 3419 -93846 24400 182136 57795 -159515 13061
10812A34674b39460o3271J07992K771F4165J8484e8401n8183d9720B37959a32833
$$ 134674 -239460 -302731 -194739 -191968 64165 82649 -58401 -116584 -49720 237959 -132833
10800B36574b87939E4472d8442B0471e02206a23720N8410E720B487L7009a02733
$$ 236574 -287939 54472 -48442 20471 -502206 -123720 -65310 5720 2487 39496 -102733
10788b62168A81205o6561b45336A14924c03751a51182B20186a00309n5044a0466
$$ -262168 181205 114644 -245336 114924 -303751 -151182 220186 -100309 -155353 -10466
10777B6838a58231j94651H1270b4403K190k01671A57527d1493j46258R2536k22957
$$ 26838 -158231 -352882 81270 -24403 -22213 -223884 157527 -41493 -187751 -95215 -318172
10766c18172A11603b4213d867r7566j93164B4758a90293H8341B5114a12978F1629
$$ -318172 111603 -24213 -4867 -102433 -295597 24758 -190293 88341 25114 -112978 61629
10754H9361a62390n9073F446e3857k34440i9033A64733c14714B93833G7370d68236
$$ 89361 -162390 -221463 6446 -53857 -288297 -99033 164733 -314714 293833 77370 -468236
10742A50738b25659d0299k50378g4419j06225d3067D5353b21611I5801g0111A50363
$$ 150738 -225659 -40299 -290677 -74419 -180644 -43067 45353 -221611 95801 -70111 150363
10730f5050A52874b23832A64224b26335C01922a8932k41430i8770l4324L9762
$$ -65050 152874 -223832 164224 -226335 301922 -18932 -260362 -98770 -133094 -93332
10720i3332M2309k08918f6733q1820b0729k86021A47137f6248C74383A79008d7558
$$ -93332 -51023 -259941 -66733 -148553 -20729 -306750 147137 -66248 374383 179008 -47558
10708c2342A84029a61024B24589j6141a40335d2846k62385f7787j94514B61785
$$ -32342 184029 -161024 224589 208448 -140335 -42846 -305231 -67787 -262301 261785
10697A35705i886k19432B57021a24415O0624q3386A57096j6092M05481a643n9364
$$ 135705 -9886 -229318 257021 -124415 -63791 -147177 157096 141004 546485 -1643 -61007
10686f1007l00358L8379R8483o1889A30641a29868C26384A19580J10305b73309
$$ -61007 -361365 -322986 -224503 -286392 130641 -129868 326384 119580 229885 -273309
10675d3373k80610Q3445d0005b953r4746k33072m5646J27109e2654B27780b19946
$$ -43373 -323983 -240538 -40005 -2953 -97699 -330771 -376417 -249308 -52654 227780 -219946
10663b38269M2299j15705a5374r2848k4904j28291B97614a20577B28716H8395
$$ -238269 -195970 -311675 -15374 -108222 -133126 -261417 297614 -120577 228716 88395
10652C620e32q765k96542g3026A39322j4547j0106g8152n4087D9587A8302J96968
$$ 3620 -532 -9297 -305839 -73026 139322 124775 114669 -78152 -132239 49587 18302 215270
10640B15270a58611O1437H4033a66035N5522j22406g5569A42363a56915l5698
$$ 215270 -158611 -97174 84033 -166035 -110513 -232919 -75569 142363 -156915 -192613
10630a92613d2982j39354n254P1363L7605A06871r210a03494E0377a38249L4050
$$ -192613 -42982 -182336 -187590 -116227 -78622 106871 97661 -103494 50377 -138249 -104199
10619a04199j16036J3209o10F1763k4971a12026r40K8742E5032P7366c07396G4934
$$ -104199 -220235 -207026 -207636 61763 36792 -112026 -112966 -84224 55032 132398 -307396 74934
10606b02127A9693g4361j2315m75868B67713F1636J05539a74970o7861d3587j1085
$$ -202127 19693 -74361 -86676 -562544 267713 61636 167175 -174970 -242831 -43587 -54672
10595e4672j72584D6160a5208B9811b3122j01885j1111H9087b43681R5612E0436
$$ -54672 -227256 46160 -15208 29811 -23122 -125007 -136118 89087 -243681 -148069 50436
10583d25933J30352F5998B963c22055G8679a3100k55870B79401A08294e5301A9120
$$ -425933 -295581 65998 2963 -322055 78679 -13100 -268970 279401 108294 -55301 19120
10571F6039c08318j3336a34306G4096L56581a42987A64795D1613P6912c93654
$$ 66039 -308318 -321654 -134306 74096 430677 -142987 164795 41613 118525 -393654
10560b85959I8720R349J09987C681J61453b12076R9766o794k56515k1904A1003
$$ -285959 98720 108069 218056 3681 165134 -212076 -112310 -119104 -375619 -397523 11003
10548a92092j31459A2843a140m278l36001C17889A36162b67048D9412a93440A07303
$$ -192092 -323551 12843 -1140 -5418 -341419 317889 136162 -267048 49412 -193440 107303
10536b84515d3136H6445k0056d5740C55862c50423A21329B8984R7256J32194a96510
$$ -284515 -43136 86445 66389 -45740 355862 -350423 121329 28984 126240 258434 -196510
10524c7362j45198g2691l32071a37730j35212O0581B68740f454l6877H6212b944
$$ -37362 -182560 -72691 -404762 -137730 -272942 -212361 268740 -6454 -43331 86212 -2944
10512B32906j1665F4104P9684g8495o1019I5355a35211d1245G1609K51101A00200
$$ 232906 221241 64104 143788 -78495 -139514 95355 -135211 -41245 71609 322710 100200
10500a24175C583c25265a15344a5342C55783A15671d4179G1527b12243B69892
$$ -124175 3583 -325265 -115344 -15342 355783 115671 -44179 71527 -212243 269892
10489c6975I5328i7367k6301q6105R7448j33446J4489A51353a64465D256a95134
$$ -36975 95328 -97367 -123668 -209773 -112325 -245771 -231282 151353 -164465 4256 -195134
10477B21523j02919J56774d1347o4035l03756E3687c3178l0300C79606A19772
$$ 221523 118604 275378 -41347 -105382 -409138 53687 -33178 -63478 379606 119772
10466c5176J3706n0250q9213C93948K3074A34J82448N2312K88975A73477g47H8766
$$ -35176 -21470 -71720 -160933 393948 417022 134 182582 234894 523869 173477 -747 88766
10453h8362A78364c01324a39055L8341b9008D4956b9714j24714A84057h9265j66864
$$ -88362 178364 -301324 -139055 -100714 -29008 44956 -29714 -154428 184057 -89265 -256129
10442b56129C50821A43592C4150J13670L1513b92899d4380m54510J76530g960
$$ -256129 350821 143592 34150 147820 179333 -292899 -44380 -498890 -322360 -7960
10431h9304K549c8199p9741B5070c3844A26798e3082q6645G0245b02137A65017
$$ -89304 -86755 -38199 -117940 25070 -33844 126798 -53082 -139727 70245 -202137 165017
10419a10696A16735A1437L92033B928i0733D4646d44934a156k22466C59943a77492
$$ -110696 116735 11437 403470 2928 -90733 44646 -444934 -1156 -223622 359943 -177492
10407A74284a6180l9854B1872a32257d1213A48835b48162f0080A06486a04437
$$ 174284 -16180 -56034 21872 -132257 -41213 148835 -248162 -60080 106486 -104437
10396c25161d8211r8578m8631J7287C09940d43273J47228J16241O9880M2133J9426
$$ -325161 -48211 -146789 -195420 -178133 309940 -443273 -296045 -179804 -109924 -67791 -48365
10385d8365l98178D4928b68631C22350c5565k74380a1824k51816E00836j98447
$$ -48365 -446543 44928 -268631 322350 -35565 -309945 -11824 -263640 500836 302389
10375C02389H9550a36849f0317G0326J96179A3522g6173B065J67641a96761O9866
$$ 302389 89550 -136849 -60317 70326 266505 13522 -76173 2065 169706 -196761 -126895
10364a26895A68616a46790A96303D3195j8025O8518a23017A96032L01975j65156
$$ -126895 168616 -146790 196303 43195 25170 93688 -123017 196032 498007 332851
10354C32851o2498J17480J09412B44862j09118N3792F6565J6732M0955k0528m0930
$$ 332851 270353 387833 497245 244862 135744 189536 66565 83297 124252 103724 62794
10343F2794K42570q1340J67716r7132A10242K27220e8572B29660G9659M6009B3549
$$ 62794 305364 224024 391740 294608 110242 337462 -58572 229660 79659 125668 23549
10331F13248B52357L7979C0251a2954A72393K35481J8728f4018B28833J84133
$$ 613248 252357 290336 30251 -12954 172393 407874 426602 -64018 228833 412966
10321D12966H0800L39499j65992R3827j44483k0773d5433K1785j53344A76252
$$ 412966 80800 420299 254307 348134 203651 182878 -45433 -23648 -176992 176252
10310A82167J33816j19772c8498B61289a7092I7953N3985a82327B55435j07499
$$ 182167 315983 196211 -38498 261289 -17092 97953 151938 -182327 255435 147936
10300A47936a26643B32523J8562j19367K83431j31130b5639F406N9403J32775
$$ 147936 -126643 232523 251085 131718 415149 284019 -25639 6406 65809 198584
10290A98584k9424h3058o9332f7594o7205a0036k59577a5034F5078a01937j45966
$$ 198584 169160 -83058 -152390 -67594 -134799 -10036 -269613 -15034 65078 -101937 -247903
10279b47903A46926n6139N9353C7423J03885F3376K64804e58456G5399a21599
$$ -247903 146926 90787 150140 37423 141308 63376 328180 -558456 75399 -121599
10268B11109l2901P1537F788a39562O188a4916r6232l67587c5424j00211j97321
$$ 211109 178208 249745 6788 -139562 -133374 -14916 -111148 -478735 -35424 -135635 -332956
10257c32956J04395A1363d6697d343l9337a4249I287P7710B6693b53342c1801
$$ -332956 -228561 11363 -46697 -4343 -43680 -14249 9287 86997 26693 -253342 -31801
10245b01696A1671c09647A74906E6330a25008l3756B74045j24763J80157J5093
$$ -201696 11671 -309647 174906 56330 -125008 -158764 274045 149282 329439 344532
10235C44532J12811K4814B4752D965i3075M0906j53924c9770Q816n8241I4734
$$ 344532 457343 482157 24752 4965 -93075 -52169 -206093 -39770 -30954 -89195 94734
10223B23925A3153J0057h5360K6070B02582P4584a10566B09334b03225A20210
$$ 223925 13153 23210 -85360 -59290 202582 277166 -110566 209334 -203225 120210
10212b28211J06292d6603k94973a50226b2543o2674k10711J38560n8829N3042
$$ -228211 -121919 -46603 -341576 -150226 -22543 -85217 -295928 -157368 -216197 -163155
10202a63155l14903I3298a86292J3029E2232c45522J15410G4650b7567H7047M3405
$$ -163155 -478058 93298 -186292 -173263 52232 -345522 -230112 74650 -27567 87047 130452
10191A30452c9330l18229a76205D1569J97125b28285A04471f4511B9614J25884
$$ 130452 -39330 -357559 -176205 41569 238694 -228285 104471 -64511 29614 155498
10181A55498e2672B38599A06944i4570k6872J6839K3724o8573A41029b25259e371
$$ 155498 -52672 238599 106944 -94570 -121442 -104603 -80879 -149452 141029 -225259 -5371
10169c4711l10247a0831G9747J2341f3496j97144F4062a15042B7376J31539E5177
$$ -34711 -344958 -10831 79747 92088 -63496 -260640 64062 -115042 27376 158915 55177
10157e1142k54443J25852A9727c59844b5677F0007c9907C7336b88425n5675L028
$$ -51142 -305585 -179733 19727 -359844 -25677 60007 -39907 37336 -288425 -344100 -341072
10146c41072D4790a60570A49832e0070j55094B39851J1508a68033f3620A10882
$$ -341072 44790 -160570 149832 -50070 -205164 239851 251359 -168033 -63620 110882
10135E7977c81370a10785o8907l59115g562j12389j3265c9629a0307r4331A25391
$$ 57977 -381370 -110785 -179692 -538807 -7562 -119951 -133216 -39629 -10307 -104638 125391
10123B45656f1826l18139a73592a9294I4371c9160n3859B04561c01581C5663e5633
$$ 245656 -61826 -379965 -173592 -19294 94371 -39160 -93019 204561 -301581 35663 -55633
10111C64647A44401c77100B12865d18499a78583D24576c20039a41210b6590j02652
$$ 364647 144401 -377100 212865 -418499 -178583 424576 -320039 -141210 -26590 -129242
10101a29242k728k46045I3806g6983m9216A43457O1405p3065a47436k2109B02348
$$ -129242 -131970 -378015 93806 -76983 -126199 143457 204862 131797 -147436 -169545 202348
10089b41386D2169j2237g7911e84A49480e8907A23359d7180j25880G9215L0996
$$ -241386 42169 29932 -77911 -584 149480 -58907 123359 -47180 -173060 79215 110211
10078A10211b69118a06563l9790j89685D3451e5903A7825h2848a522j94892j10917
$$ 110211 -269118 -106563 -146353 -336038 43451 -55903 17825 -82848 -1522 -196414 -307331
10067c07331h9703B61922c390k92180b2598A54028A3260a71710d3263j3608j30245
$$ -307331 -89703 261922 -3390 -295570 -22598 154028 13260 -171710 -43263 -56871 -187116
10056a87116i0613B08776a83020a5311m685k09428j12536e005C4077M8356b3792
$$ -187116 -90613 208776 -183020 -15311 -19996 -229424 -341960 -5005 34077 82433 -23792
10044a60073b545j6978l04306i8916c4734A00100R0589m8163i715p136k15439
$$ -160073 -2545 -19523 -323829 -98916 -34734 100100 190689 142526 -9715 -16851 -232290
10033b32290a9698A18824a20012d749k18194P1698m7507A18997d0204B54335l1859
$$ -232290 -19698 118824 -120012 -4749 -222943 -151245 -198752 118997 -40204 254335 222476
10022B22476E5279q035a12468M8448m6219D5702a95447j86096J71664B61038H7933
$$ 222476 55279 47244 -112468 -64020 -110239 45702 -195447 -381543 -209879 261038 87933
10010F1704J1956K06103a41431k6792F2490B6474K9268N6403B2163K09154L2145
$$ 61704 73660 279763 -141431 -168223 62490 26474 55742 112145 22163 231317 263462
9999B63462b16031H6493B1161A385a79083M6167N1867L4634m38633G9636c22909
$$ 263462 -216031 86493 21161 1385 -179083 -132916 -81049 -46415 -485048 79636 -322909
9987b41937q7384J09073F775i7147j66283B42674d26337J64574J29697q5791F2587
$$ -241937 -329321 -220248 6775 -97147 -263430 242674 -426337 -261763 -132066 -217857 62587
9975b25221A12697a9265A56198a79344A6729a96821f8661j48692p967A52705b00420
$$ -225221 112697 -19265 156198 -179344 16729 -196821 -68661 -217353 -225320 152705 -200420
9963F1290a75545A06989J03891F5182b83654a22063b5772l3493B55347a31872
$$ 61290 -175545 106989 210880 65182 -283654 -122063 -25772 -59265 255347 -131872
9952A63648d74312a96657G5434f1680j24045E8312a44651B5578c48022c7389p3402
$$ 163648 -474312 -196657 75434 -61680 -185725 58312 -144651 25578 -348022 -37389 -110791
9941a10791P75b1984j53182A81696D4752b66008L7489R391P2127A92856b31744
$$ -110791 -110016 -21984 -175166 181696 44752 -266008 -228519 -219128 -147001 192856 -231744
9929E2257K9654K61475h0334j58353p1281a31236k088j96151I5271a42555n0700
$$ 52257 81911 343386 -80334 -238687 -309968 -131236 -133324 -329475 95271 -142555 -193255
9918a93255A08309D1566d40369g4946A30361N6391h8840I2112b10157C65501F6407
$$ -193255 108309 41566 -440369 -74946 130361 186752 -88840 92112 -210157 365501 66407
9906g9079j30396C3426a3651q3244b4138A42126J34A0587e7240A57714J53713
$$ -79079 -209475 33426 -13651 -96895 -24138 142126 142260 10587 -57240 157714 311427
9895C11427B882a27493k0187D1383K46936a27509A6970a80260A82796a13932L6187
$$ 311427 2882 -127493 -147680 41383 288319 -127509 16970 -180260 182796 -113932 -77745
9884g7745p3481L5313J9533D9101c18962B32681D7044K7686l0202a79766K6041
$$ -77745 -151226 -115913 -96380 49101 -318962 232681 47044 74730 44528 -179766 -153725
9873a53725j09820a01293m1837E8663a02235C134a98716m874B49597b28257C4271
$$ -153725 -263545 -101293 -143130 58663 -102235 3134 -198716 -203590 249597 -228257 34271
9861D7136J80331C1137b09625c5546l7890A24241B5062b02125F483b67857A21536
$$ 47136 227467 31137 -209625 -35546 -73436 124241 25062 -202125 6483 -267857 121536
9849F325K38371b69444j3831e2423A87950a92340b7226k24274p4452b8904B27836
$$ 6325 244696 -269444 -283275 -52423 187950 -192340 -27226 -251500 -325952 -28904 227836
9837B3446N6460a26656d0385n371b445m7382A56130k2390d45078b16936A75490
$$ 23446 79906 -126656 -40385 -45756 -2445 -49827 156130 133740 -445078 -216936 175490
9825d6919j39074k0998A6999J38921f0254B26910p6960g7896D4759J10414l7871
$$ -46919 -185993 -206991 16999 155920 -60254 226910 149950 -77896 44759 155173 117302
9814A17302D2575a33717k3713N6279m4379k6671j27079a25225j73554a46381j47627
$$ 117302 42575 -133717 -157430 -101151 -145530 -172201 -299280 -125225 -298779 -146381 -294008
9803b94008I322R9859a96368e8216k38495a4520j27273k9079F5547c1184G5531
$$ -294008 9322 109181 -196368 -58216 -296711 -14520 -141793 -170872 65547 -31184 75531
9791d7041j06209k88929D699L5086a48836A33093j2898E8547L20565a4427G1033
$$ -47041 -153250 -442179 4699 39785 -148836 133093 120195 58547 379112 -14427 71033
9779A4555e576k23790e9372D5567d7628j43245k01700I7231a18103D7483c08201
$$ 14555 -5576 -229366 -59372 45567 -47628 -190873 -392573 97231 -118103 47483 -308201
9767C49531A277a32508d1671l9313k71084E2766b41596e3601m7254o8234j9794
$$ 349531 1277 -132508 -41671 -80984 -352068 52766 -241596 -53601 -100855 -169089 -188883
9756a88883B04385c61871A1975a20622B30220c36350E7855b78288a1822q0205
$$ -188883 204385 -361871 11975 -120622 230220 -336350 57855 -278288 -11822 -92027
9746i2027A54107a8034k02583h5690p8052j62P4585B62634a57144b2285G1655
$$ -92027 154107 -18034 -220617 -85690 -163742 -163904 -89319 262634 -157144 -22285 71655
9734c45321a35018r8798B83153b03667G426P4187C1674a83346C5307b23344B04857
$$ -345321 -135018 -233816 283153 -203667 7426 81613 31674 -183346 35307 -223344 204857
9722e8014k08024e0208B08554B6931K6859b24365A05443D719J94755c20837d00
$$ -58014 -266038 -50208 208554 26931 53790 -224365 105443 4719 199474 -320837 -400
9710A0374a65438H0139b97268P6829I7374J0281a92782R5739a2566q9723n2022
$$ 10374 -165438 80139 -297268 -220439 97374 107655 -192782 -97043 -12566 -102289 -154311
9699a54311f6539j9724P771A5073a90678E6425a28793I2168M6020d11950a79869
$$ -154311 -66539 -86263 -78492 15073 -190678 56425 -128793 92168 138188 -411950 -179869
9687B10429p7034b40192J14267j2258A03366c09960J45812A47842m3795b75630
$$ 210429 133395 -240192 -125925 -138183 103366 -309960 -164148 147842 104047 -275630
9676F2312b04716E8046d62327a36207j48753A2896J64278a64510G126L57985b53234
$$ 62312 -204716 58046 -462327 -136207 -284960 12896 177174 -164510 7126 365111 -253234
9664a32652L5136n8990p9249b3629B21550o8996b79413B64896A0430b144k05205
$$ -132652 -97516 -156506 -235755 -23629 221550 152554 -279413 264896 10430 -2144 -207349
9653b07349g4379j18143d1976k07118c103R13k20751E5467a89132A10558J24000
$$ -207349 -74379 -192522 -41976 -249094 -3103 -2190 -222941 55467 -189132 110558 234558
9642B34558b34734K5976j80406i8627o6984A27860b38454A61828G2355B8673c29205
$$ 234558 -234734 -208758 -389164 -98627 -165611 127860 -238454 161828 72355 28673 -329205
9630g9724K4839j50819P8675e6882B15763n6336a20168B2954b17735K5766A66452
$$ -79724 -54885 -205704 -127029 -56882 215763 159427 -120168 22954 -217735 -191969 166452
9618A17082c88068B6551b2588C9119e8644B90000i9287K1762k75649J02740P7425
$$ 117082 -388068 26551 -22588 39119 -58644 290000 -99287 -77525 -353174 -250434 -173009
9607a73009n9285a14523A7545c46737A8985O4185a05617A21516c9075l65917B0913
$$ -173009 -232294 -114523 17545 -346737 18985 83170 -105617 121516 -39075 -404992 20913
9595d42236g6A49204c83391h6780A37331a23961j7630d8989j20315E1386b1259
$$ -442236 -76 149204 -383391 -86780 137331 -123961 -141591 -48989 -169304 51386 -21259
9583a98625j22106i2150a4533E02020B2799a11613G8067a12561a1756B7188e8911
$$ -198625 -320731 -92150 -14533 502020 22799 -111613 78067 -112561 -11756 27188 -58911
9571h743G5706C620a1523D6165a03571M0637K3081j11445J0404B8257a25807m3800
$$ -8743 75706 3620 -11523 46165 -103571 -62934 -39853 -151298 -140894 28257 -125807 -169607
9559a69607k03512B4087a32440l68486J82641F1671b3800j25289e5901k9106o4875
$$ -169607 -373119 24087 -132440 -500926 -318285 61671 -23800 -149089 -55901 -85007 -149882
9548a49882I1820c3246r0196B1393K96998A36370a57694A7010B141N9732J74122
$$ -149882 91820 -33246 -123442 21393 318391 136370 -157694 17010 2141 61873 235995
9537B35995a40618A58271b45628B83422j32929c68189A70853b06181a4262l76961
$$ 235995 -140618 158271 -245628 283422 150493 -368189 170853 -206181 -14262 -391223
9527c91223a10347M7057b0860C1620D257g1955B2119J46880C556c93195R0114
$$ -391223 -110347 -63290 -20860 31620 4257 -71955 22119 168999 3556 -393195 -303081
9516c03081a06940F9272P8191b70301A13650b38932f6460K2978j49169A86581
$$ -303081 -106940 69272 147463 -270301 113650 -238932 -66460 -43482 -192651 186581
9505e4697J6604l4039k52203c9320k44653a26749L8682A11787b02939A13465K9330
$$ -54697 -38093 -72132 -324335 -39320 -283973 -126749 -88067 111787 -202939 113465 142795
9494A42795J39743a65773L1905j54896H3353J69252a86093j04935E4516J44891
$$ 142795 282538 -165773 -133868 -288764 83353 252605 -186093 -291028 54516 199407
9484A99407c30344f0322a377k04115O5016J1362j84380A3551d3234C2376L6127
$$ 199407 -330344 -60322 -1377 -205492 -140476 -129114 -313494 13551 -43234 32376 68503
9473F8503K3243O3900d11293J53605f445A73533B8594J93481b59086A15649b20839
$$ 68503 91746 155646 -411293 -257688 -6445 173533 28594 222075 -259086 115649 -220839
9461i2086p049A3592c04071B48309i5450j09605A81215m5282k8760H477c39803
$$ -92086 -99135 13592 -304071 248309 -95450 -205055 181215 135933 107173 8477 -339803
9449a18548B96452c74867J34203d5408C7754g6940J7756H1561a43632N9438P050
$$ -118548 296452 -374867 -240664 -45408 37754 -76940 -59184 81561 -143632 -84194 -77144
9438g7144j4587j34818F5622d32597d4544E6778Q9934o0893r420a06198I3155
$$ -77144 -91731 -226549 65622 -432597 -44544 56778 146712 85819 76399 -106198 93155
9426c44327g8114l98983a57104M4411G5126L0196c92953b5144C64414D8957d48116
$$ -344327 -78114 -477097 -157104 -112693 75126 105322 -392953 -25144 364414 48957 -448116
9414f126C9921N3643a96239N3798A20224E8242Q1593a97332j4329R7878q8402
$$ -6126 39921 93564 -196239 -142441 120224 58242 139835 -197332 -211661 -113783 -202185
9403b02185f8585D62932a21651M078l1880A00623i1174j62770F6325d799I7016
$$ -202185 -68585 462932 -121651 -117573 -149453 100623 -91174 -253944 66325 -4799 97016
9391b16511E0775d5200l74575a21427J8133B45382h0551r8892j25990L3037e8923
$$ -216511 50775 -45200 -419775 -121427 -103294 245382 -80551 -179443 -305433 -272396 -58923
9379d183m0204J3288j01170B00917D9851h1118A44264e4611m702p3000B0169e6291
$$ -4183 -44387 -31099 -132269 200917 49851 -81118 144264 -54611 -59313 -132313 20169 -56291
9366b6656m9976b9611C9030R4687b2930B32495d6203l4784o5510C62263B958f7719
$$ -26656 -76632 -29611 39030 133717 -22930 232495 -46203 -80987 -146497 362263 2958 -67719
9353a67883d447k84859Q576C0499Q170h9550J9186E2344b08168p673I9775e4875
$$ -167883 -4447 -289306 -280730 30499 38669 -89550 -70364 52344 -208168 -215841 99775 -54875
9340A7049h1035b3881j94745p9305E006a66135P0554I7083a63212c3356p5950
$$ 17049 -81035 -23881 -218626 -297931 5006 -166135 -95581 97083 -163212 -33356 -109306
9329a09306A84865a68474a8896j6360E0410c03566g5608E5868f0314k55795C5984
$$ -109306 184865 -168474 -18896 -35256 50410 -303566 -75608 55868 -60314 -316109 35984
9317b72574e3173j27662k6260o137n5234F2852f7968r7876j85351a4689k10679
$$ -272574 -53173 -180835 -207095 -213232 -268466 62852 -67968 -165844 -351195 -14689 -225368
9306b25368a10666j93909a35692C02981b14642f3733c623q4604j28047j77761
$$ -225368 -110666 -304575 -135692 302981 -214642 -63733 -3623 -88227 -216274 -394035
9296c94035F1431G363b90349O0170a3735k9711n2663j63805P8979B39633d2020
$$ -394035 61431 7363 -290349 -230179 -13735 -43446 -96109 -259914 -180935 239633 -42020
9284a45367A16591h6493L4458D23734b56184C6749b30331a3212k6028A10582a03965
$$ -145367 116591 -86493 -52035 423734 -256184 36749 -230331 -13212 -39240 110582 -103965
9272B91407b54726Q4590b1948C6998b59294a01010J5974A44006E2468a60980p9158
$$ 291407 -254726 -170136 -21948 36998 -259294 -101010 -85036 144006 52468 -160980 -240138
9261b40138J05472j43983H9295b87759b8193e834q5905A54862k3801K41967d37732
$$ -240138 -134666 -278649 89295 -287759 -28193 -5834 -91739 154862 131061 373028 -437732
9249e5277l43281A47421k9074b52668A42402E9594g7494k1451p1736B78996a90562
$$ -55277 -398558 147421 118347 -252668 142402 59594 -77494 -98945 -170681 278996 -190562
9237b06750G0958a08979B22231F8771j5266a25083D4760P4845N9331J95731d88650
$$ -206750 70958 -108979 222231 68771 53505 -125083 44760 119605 178936 374667 -488650
9225A94908L1548E4855J08057e539B08114r6108a73666A28278e3442H1598J38369
$$ 194908 226456 54855 162912 -5539 208114 112006 -173666 128278 -53442 81598 219967
9214B19967F0606b13166e7925j4426F7310e8210G1708a54882A81788a94994I9704
$$ 219967 60606 -213166 -57925 -72351 67310 -58210 71708 -154882 181788 -194994 99704
9202a97722A9777J54647a23591M2583j33619m31433e7569j65945d0025j36837
$$ -197722 19777 174424 -123591 -81008 -214627 -646060 -57569 -223514 -40025 -176862
9192a76862A0648d86641H6351a49348r904j06162i0446A98667E559h8872k4009
$$ -176862 10648 -486641 86351 -149348 -159252 -265414 -90446 198667 5559 -88872 -112881
9181a12881o8461Q25A64807a44534k3911I6812b0411k84736J03730A89704a14798
$$ -112881 -181342 -180517 164807 -144534 -168445 96812 -20411 -305147 -201417 189704 -114798
9169b67029B5220J07616K6801c80201B8309a93427O7358J6293A96914a7352k52829
$$ -267029 25220 132836 159637 -380201 28309 -193427 -126069 -109776 196914 -17352 -270181
9158b70181A27779j5092a70032j13194F75g7089q6515j53644K0546B11823b92264
$$ -270181 127779 112687 -170032 -283226 675 -77089 -163604 -317248 -296702 211823 -292264
9146a50343L2243j78781h0338j84115A40342E8098a78253A93499b77407I4074
$$ -150343 -118100 -296881 -80338 -264453 140342 58098 -178253 193499 -277407 94074
9135h539D9339b1482q4391K3017c5248F3808a15024q0971g9156a8444j64355C9066
$$ -8539 49339 -21482 -105873 -82856 -35248 63808 -115024 -195995 -79156 -18444 -182799 39066
9122D6000b3884B22154j08479a47203A6244b33218A67379q0604C0985b35793j37399
$$ 46000 -23884 222154 113675 -147203 16244 -233218 167379 86775 30985 -235793 -373192
9111c73192B14079g5984b5378q2249O175p061n7740j06587A08697a12185j50702
$$ -373192 214079 -75984 -25378 -107627 -101452 -108513 -166253 -272840 108697 -112185 -262887
9100b62887J16018B04831a36306B88721b57202i366j42439N8809A3722a11031
$$ -262887 -146869 204831 -136306 288721 -257202 -9366 -151805 -92996 13722 -111031
9089A47574A7386a25260F1368J07205g9452K5754A38053F8613d8035j95429e7207
$$ 147574 17386 -125260 61368 168573 -79452 -53698 138053 68613 -48035 -243464 -57207
9077d2789c460l62773J57648A70639a18403N6919A93323b63541F6083a8204C5614
$$ -42789 -3460 -366233 -208585 170639 -118403 -61484 193323 -263541 66083 -18204 35614
9065a2002A77206a90599m878A21505k0261M4479B3272c9501p5526m938k234P379
$$ -12002 177206 -190599 -195477 121505 101244 145723 23272 -39501 -115027 -119965 -122199 -114820
9053a14820L2428j31895O4878j576P3886H871b18063c0343k43494j0030g3982
$$ -114820 -82392 -214287 -149409 -150985 -77099 8871 -218063 -30343 -273837 -283867 -73982
9041b67715a00320B54501D3499a96243l2549A33862k654c40193A37361a5818j02917
$$ -267715 -100320 254501 43499 -196243 -228792 133862 131208 -340193 137361 -15818 -118735
9030a18735j56304B63746a71635A5571f1754k53870a21839A38186c24976e7201
$$ -118735 -275039 263746 -171635 15571 -61754 -315624 -121839 138186 -324976 -57201
9019B90854f8317k2944p9565j39564a42777d1462k50107J32684f8496A76479m9262
$$ 290854 -68317 -91261 -170826 -310390 -142777 -41462 -291569 -158885 -68496 176479 127217
9008A27217l2654a57484P6031n5501p0936N5394l18340A66118g9566B88272g560
$$ 127217 94563 -157484 -81453 -136954 -207890 -152496 -470836 166118 -79566 288272 -7560
8996A15302c9I8174j8802J15841j9278a73636k44621H5585M6726d3453l6798j12228
$$ 115302 -39 98174 79372 195213 175935 -173636 -418257 85585 132311 -43453 -80251 -192479
8984a92479D7082a86235a4858j23841A01995a79025O6581m0788o1991B31880A12814
$$ -192479 47082 -186235 -14858 -138699 101995 -179025 -112444 -153232 -215223 231880 112814
8972c4712j0003p6208A08794E1833c20933H0682a15869j07738B13128G5894Q2701
$$ -34712 -44715 -120923 108794 51833 -320933 80682 -115869 -223607 213128 75894 158595
8961A58595a06429F036a08350b089B8591a20795j20202B964a42126a2882j55352
$$ 158595 -106429 6036 -108350 -2089 28591 -120795 -240997 2964 -142126 -12882 -168234
8950a68234O5081A27671j7808h5719l9715k42431B3679K43349j06805a28551c8873
$$ -168234 -103153 127671 109863 -85719 -125434 -367865 23679 267028 160223 -128551 -38873
8938a71647J0621A635a61927Q322l8594j37716m3544C49216a16072j64974J15435
$$ -171647 -161026 1635 -161927 -153605 -192199 -329915 -373459 349216 -116072 -281046 -165611
8927a65611c3457j86988C22237q1787c4753G5169b9861B6188a88224h997I1823
$$ -165611 -33457 -220445 322237 240450 -34753 75169 -29861 26188 -188224 -8997 91823
8915g8449a2319A64484C629K28917J2890M0921k5042j11324L19254K11256M88401
$$ -78449 -12319 164484 3629 232546 245436 286357 261315 149991 469245 680501 1168902
8904A168902J199064K152633o82184A712811p30191D18389j91054m3487h227F872
$$ 1168902 2367966 4520599 3838415 1712811 982620 418389 227335 183848 -8227 6872
8893D4960R2797J39766j33412a7386A0160J83392F7720b04151A77256a56200k32357
$$ 44960 137757 277523 144111 -17386 10160 193552 67720 -204151 177256 -156200 -388557
8882c88557J9284E6915R745L3715G542a4469A5739L7639a09743B39783a0723B1924
$$ -388557 -369273 56915 66660 100375 7542 -14469 15739 53378 -109743 239783 -10723 21924
8869c82619C80763a08156A24582i1792A30903j9425B5942J2989q21d73143b6837
$$ -382619 380763 -108156 124582 -91792 130903 111478 25942 38931 38110 -473143 -26837
8857e9070C910J28600a01869A6891L1903e1556C9421F282e6883r7016c7836H2331
$$ -59070 3910 132510 -101869 16891 48794 -51556 39421 6282 -56883 -153899 -37836 82331
8844a68509C5624d2378m94932a5071H9810e7086C56004A8472J53686J47538a9758
$$ -168509 35624 -42378 -537310 -15071 89810 -57086 356004 18472 172158 319696 -19758
8832a39084n7746k12346f1233N463k39872i5132C526L7179e7143B19634i794B7825
$$ -139084 -196830 -409176 -61233 -55770 -295642 -95132 3526 40705 -57143 219634 -9794 27825
$$ [...]
##END NTUPLES=NMR SPECTRUM
##END=
