
##TITLE=AC1168_Tolima-ibague-TPAAH12002_5898356_AT1AgFBPKt
##JCAMPDX= 6.0         $$ Bruker NMR JCAMP-DX V2.0
##DATA TYPE= NMR SPECTRUM
##DATA CLASS= NTUPLES
##ORIGIN= BRUKER
##OWNER= Administrator
$$ 1.72 TOPSPIN		Version 2.1
$$ 2012-04-03 16:43:15.500 -0500  Administrator@TOPSPIN
$$ Compression mode = diff/dup
##.OBSERVE FREQUENCY= 400.13188235
##.OBSERVE NUCLEUS= ^1H
##.ACQUISITION MODE= SIMULTANEOUS (DQD)
##.ACQUISITION SCHEME= undefined
##.AVERAGES= 8
##.DIGITISER RES= 22
##SPECTROMETER/DATA SYSTEM= spect
##.PULSE SEQUENCE= zg30
##.SOLVENT NAME= COFFEE_meoh
##.SHIFT REFERENCE= INTERNAL, COFFEE_meoh, 1, 14.98061
##AUDIT TRAIL= $$ (NUMBER, WHEN, WHO, WHERE, PROCESS, VERSION, WHAT)
$$ ##TITLE= Audit trail, TOPSPIN		Version 2.1
$$ ##JCAMPDX= 5.01
$$ ##ORIGIN= Bruker BioSpin GmbH
$$ ##OWNER= Administrator
$$ $$ C:\Bruker\TOPSPIN/data/COFFEE/nmr/AC1168_Tolima-ibague-TPAAH12002_5898356_AT1AgFBPKt/10/pdata/1/auditp.txt
$$ ##AUDIT TRAIL=  $$ (NUMBER, WHEN, WHO, WHERE, PROCESS, VERSION, WHAT)
(   1,<2012-04-03 16:43:08.078 -0500>,<Administrator>,<TOPSPIN>,<go>,<TOPSPIN 2.1>,
      <created by zg
	started at 2012-04-03 16:42:01.500 -0500,
	POWCHK enabled, PULCHK disabled,
       configuration hash MD5:
       1A 1E CE 29 27 FD 77 03 67 4E F0 E3 C4 B2 CB 90
       data hash MD5: 64K
       2E 74 A3 76 A3 71 86 77 22 72 76 AC EB 47 29 F2>)
(   2,<2012-04-03 16:43:10.953 -0500>,<Administrator>,<TOPSPIN>,<proc1d>,<TOPSPIN 2.1>,
      <Start of raw data processing
       efp LB = 0 FT_mod = 6 PKNL = 1 PHC0 = 0 PHC1 = 0 SI = 32K 
       data hash MD5: 32K
       F4 8C E9 FA 90 81 66 2D CD 2D A7 18 FE 86 77 F6>)
(   3,<2012-04-03 16:43:11.343 -0500>,<Administrator>,<TOPSPIN>,<proc1d>,<TOPSPIN 2.1>,
      <pk PHC0 = 213.1732 PHC1 = 0 
       data hash MD5: 32K
       5B 9E 95 69 32 D1 29 FD 02 89 F1 DF EB D1 1E DB>)
(   4,<2012-04-03 16:43:11.406 -0500>,<Administrator>,<TOPSPIN>,<proc1d>,<TOPSPIN 2.1>,
      <abs ABSG = 1 
       data hash MD5: 32K
       90 93 D0 8A 1C BA 74 08 07 AB B1 DE 96 FD 79 7E>)
(   5,<2012-04-03 16:43:11.437 -0500>,<Administrator>,<TOPSPIN>,<proc1d>,<TOPSPIN 2.1>,
      <abs ABSG = 2 
       data hash MD5: 32K
       C5 B4 17 E1 DA F1 6B 7C 84 69 D2 8E 87 BE B0 D1>)
(   6,<2012-04-03 16:43:11.468 -0500>,<Administrator>,<TOPSPIN>,<proc1d>,<TOPSPIN 2.1>,
      <abs ABSG = 3 
       data hash MD5: 32K
       71 E7 6D CD 9D B3 EC 93 82 3C 9C E0 D3 0F E8 47>)
(   7,<2012-04-03 16:43:11.515 -0500>,<Administrator>,<TOPSPIN>,<proc1d>,<TOPSPIN 2.1>,
      <abs ABSG = 4 
       data hash MD5: 32K
       40 E4 2A 11 BE B6 12 38 58 A3 39 7C 86 7E 46 92>)
(   8,<2012-04-03 16:43:11.578 -0500>,<Administrator>,<TOPSPIN>,<proc1d>,<TOPSPIN 2.1>,
      <abs ABSG = 5 
       data hash MD5: 32K
       9B B2 21 25 F5 7D CD BD 90 9B 68 19 F2 EE 75 04>)
$$ ##END=
$$ 
$$ $$ hash MD5
$$ $$ D8 75 74 7F 06 12 2B A8 0B 28 B4 D0 A2 8C 5C 6B
##$RELAX= 
##$RELAX= 
##$RELAX= 
##$RELAX= 
##$RELAX= 
##$RELAX= 
##$RELAX= 
$$ Bruker specific parameters
$$ [...]
150 150 150 150 150 150 150 150
##$TP07= 0
##$TPNAME0= <>
##$TPNAME1= <>
##$TPNAME2= <>
##$TPNAME3= <>
##$TPNAME4= <>
##$TPNAME5= <>
##$TPNAME6= <>
##$TPNAME7= <>
##$TPOAL= (0..7)
0.5 0.5 0.5 0.5 0.5 0.5 0.5 0.5
##$TPOFFS= (0..7)
0 0 0 0 0 0 0 0
##$TUNHIN= 0
##$TUNHOUT= 0
##$TUNXOUT= 0
##$USERA1= <user>
##$USERA2= <user>
##$USERA3= <user>
##$USERA4= <user>
##$USERA5= <user>
##$V9= 5
##$VALIST= <valist>
##$VCLIST= <CCCCCCCCCCCCCCC>
##$VD= 0
##$VDLIST= <DDDDDDDDDDDDDDD>
##$VPLIST= <PPPPPPPPPPPPPPP>
##$VTLIST= <TTTTTTTTTTTTTTT>
##$WBST= 2048
##$WBSW= 25
##$XGAIN= (0..3)
0 0 0 0
##$XL= 0
##$YL= 0
##$YMAX_a= 531319
##$YMIN_a= -649049
##$ZGOPTNS= <>
##$ZL1= 120
##$ZL2= 120
##$ZL3= 120
##$ZL4= 120
##$ABSF1= 14.98061
##$ABSF2= -5.57192
##$ABSG= 5
##$ABSL= 3
##$ALPHA= 0
##$AQORDER= 0
##$ASSFAC= 0
##$ASSFACI= 0
##$ASSFACX= 0
##$ASSWID= 0
##$AUNMP= <proc_prof1d_extract_pilot.lims>
##$AXLEFT= 0
##$AXNAME= <>
##$AXNUC= <1H>
##$AXRIGHT= 0
##$AXTYPE= 0
##$AXUNIT= <>
##$AZFE= 0.1
##$AZFW= 0.1
##$BCFW= 0
##$BC_mod= 0
##$BYTORDP= 0
##$COROFFS= 0
##$CY= 15
##$DATMOD= 1
##$DC= 0
##$DFILT= <>
##$DTYPP= 0
##$F1P= 0
##$F2P= 0
##$FCOR= 0.5
##$FTSIZE= 32768
##$FT_mod= 6
##$GAMMA= 0
##$GB= 0
##$INTBC= 1
##$INTSCL= 1
##$ISEN= 128
##$LB= 0
##$LEV0= 0
##$LPBIN= 0
##$MAXI= 10000
##$MC2= 0
##$MEAN= 0
##$ME_mod= 0
##$MI= 0
##$NCOEF= 0
##$NC_proc= -8
##$NLEV= 6
##$NOISF1= 0
##$NOISF2= 0
##$NSP= 0
##$NTH_PI= 0
##$NZP= 0
##$OFFSET= 14.98061
##$PC= 1
##$PHC0= 213.1732
##$PHC1= 0
##$PH_mod= 1
##$PKNL= yes
##$PPARMOD= 0
##$PPDIAG= 0
##$PPIPTYP= 0
##$PPMPNUM= 2147483647
##$PPRESOL= 1
##$PSCAL= 4
##$PSIGN= 0
##$PYNMP= <proc.py>
##$REVERSE= no
##$SF= 400.13
##$SI= 32768
##$SIGF1= 0
##$SIGF2= 0
##$SINO= 400
##$SIOLD= 32768
##$SPECTYP= <>
##$SREGLST= <1H.CDCl3>
##$SSB= 0
##$STSI= 32768
##$STSR= 0
##$SW_p= 8223.68421052632
##$SYMM= 0
##$S_DEV= 0
##$TDeff= 65536
##$TDoff= 0
##$TI= <>
##$TILT= no
##$TM1= 0
##$TM2= 0
##$TOPLEV= 0
##$USERP1= <user>
##$USERP2= <user>
##$USERP3= <user>
##$USERP4= <user>
##$USERP5= <user>
##$WDW= 1
##$XDIM= 32768
##$YMAX_p= 468140083
##$YMIN_p= -742714
##$CURPLOT= <Network HP LaserJet P1505>
##$CURPRIN= <$Network HP LaserJet P1505>
##$DFORMAT= <normdp>
##$LAYOUT= <+/1D_H.xwp>
##$LFORMAT= <normlp>
##$PFORMAT= <normpl>
##$SURQMSG= 1
$$ End of Bruker specific parameters
$$ ---------------------------------
##NTUPLES= NMR SPECTRUM
##VAR_NAME=  FREQUENCY,     SPECTRUM/REAL,   SPECTRUM/IMAG
##SYMBOL=    X,             R,               I
##VAR_TYPE=  INDEPENDENT,   DEPENDENT,       DEPENDENT
##VAR_FORM=  AFFN,          ASDF,            ASDF
##VAR_DIM=   32768,         32768,           32768
##UNITS=     HZ,            ARBITRARY UNITS, ARBITRARY UNITS
##FACTOR=    0.250966925370066, 1,           1
##FIRST=     8223.43324360095, -164210,      -12051
##LAST=      0,             -254431,         -144897
##MIN=       0,             -742714,         0
##MAX=       8223.43324360095, 468140083,    0
$$ Real data points
##PAGE= N=1
##DATA TABLE= (X++(R..R)), XYDATA
$$ [...]
19464C01798A7839a43958a8470B09777b57210C2485C652M179R381a89027J6373
$$ 301798 17839 -143958 -18470 209777 -257210 32485 3652 7831 17212 -189027 -172654
19453a72654J4130k3118g6497m07634g5364J6367G660J8294J33436a25967e8835
$$ -172654 -158524 -181642 -76497 -484131 -75364 -58997 7660 25954 159390 -125967 -58835
19441F8690a76564K4441e5865j08025M2334e774o7833j05537b6853I129L4381
$$ 68690 -176564 -152123 -55865 -163890 -121556 -5774 -73607 -179144 -26853 9129 43510
19430D3510a02634B09856B3992N5597a50029E3533A8934b08429e1448j13395j75934
$$ 43510 -102634 209856 23992 79589 -150029 53533 18934 -208429 -51448 -164843 -340777
19419c40777N790I0999c48831J69118P7792G8230c05752D517K76093a80041M2987
$$ -340777 -334987 90999 -348831 -179713 -101921 78230 -305752 4517 280610 -180041 -137054
19408a37054k54838A79269g8908b7514j45941P0063C0082a95816c7687G4494c7192
$$ -137054 -391892 179269 -78908 -27514 -173455 -103392 30082 -195816 -37687 74494 -37192
19396a34315A67149o8382k6011g6363l2473E2538d7271a7924C0700a0171A61613
$$ -134315 167149 98767 72756 -76363 -108836 52538 -47271 -17924 30700 -10171 161613
19384d0435j38152B64832J7434a28055N6848l99777b21229A37327n9970b22638
$$ -40435 -178587 264832 282266 -128055 -71207 -470984 -221229 137327 77357 -222638
19373D3075K2722b55048e9700k73607A1173K43018I1000a32744b4779j60057j29541
$$ 43075 65797 -255048 -59700 -333307 11173 254191 91000 -132744 -24779 -184836 -314377
19362c14377D0618a75289j8579l7561J10592M2523C4199K68097a88139Q1282B22881
$$ -314377 40618 -175289 -193868 -231429 -120837 -78314 34199 302296 -188139 -106857 222881
19350E2477d16836J30192J21834A75666o5782P7172o6667b22019j15060B00098
$$ 52477 -416836 -286644 -164810 175666 109884 187056 120389 -222019 -337079 200098
19339a76532Q3622j1744H3190b6824j43103k2284A00103c10473B1132b00569k10218
$$ -176532 -92910 -104654 83190 -26824 -169927 -192211 100103 -310473 21132 -200569 -410787
19328d10787I8649b5579E8210a10442l3996K6488C8627b11608j50477J28018J06844
$$ -410787 98649 -25579 58210 -110442 -144438 -117950 38627 -211608 -362085 -234067 -127223
19317a27223G6138a3083A21433c88935P1314B65222a62630A68545a60841n0610
$$ -127223 76138 -13083 121433 -388935 -317621 265222 -162630 168545 -160841 -211451
19307b11451a0335j22086A45181D4702K302c5225n0849k7245l69784b20797A63465
$$ -211451 -10335 -132421 145181 44702 47004 -35225 -86074 -113319 -483103 -220797 163465
19295B60895C492P8630c62977f8291l4334j20238b025j78004G5545c00195i8511
$$ 260895 3492 82122 -362977 -68291 -102625 -222863 -2025 -180029 75545 -300195 -98511
19283E6530a84062h1334k11371J30375P0500G2344A9368J48901a89704B94544
$$ 56530 -184062 -81334 -292705 -162330 -91830 72344 19368 168269 -189704 294544
19272d84071g3841j24276k13274d4770A90815b63461A58750d94937B34877i2958
$$ -484071 -73841 -198117 -411391 -44770 190815 -263461 158750 -494937 234877 -92958
19261i9290c6238m99334a95750N6388c675B45597a58988A6262P7234a23763C18160
$$ -99290 -36238 -535572 -195750 -139362 -3675 245597 -158988 16262 93496 -123763 318160
19249b81088h0711r0505e2245D1602a37917C8464h5791k6908b7939o1160L0179
$$ -281088 -80711 -171216 -52245 41602 -137917 38464 -85791 -112699 -27939 -89099 -58920
19238e8920k29007C02101d48566a97825I202B795K26982j03466e3056F2836c39003
$$ -58920 -287927 302101 -448566 -197825 9202 2795 229777 126311 -53056 62836 -339003
19226B1588a06647n7129d1730E0968b14379d8646F6724a25243j86804A22335K798
$$ 21588 -106647 -163776 -41730 50968 -214379 -48646 66724 -125243 -312047 122335 125133
19215A25133c34148f1679B98830G2983f23077a9830c64G8379e4625n32399a81098
$$ 125133 -334148 -61679 298830 72983 -623077 -19830 -364 78379 -54625 -587024 -181098
19203a32478e1766B2425e58198g7637l045A97015f0048B2536a11395A58373F3273
$$ -132478 -51766 22425 -558198 -77637 -80682 197015 -60048 22536 -111395 158373 63273
19191h5937k05997C307b35843j44313D23722c52153E8950J8502a09008C6498a68120
$$ -85937 -291934 3307 -235843 -380156 423722 -352153 58950 77452 -109008 36498 -168120
19179I2292g1027F4676c27306R246g1254k4785k17326J52948J8426A00708j3394
$$ 92292 -71027 64676 -327306 -318060 -71254 -96039 -313365 -160417 -141991 100708 87314
19168H7314j6098g3998J9187k2448C3644N2242b76211Q0724N8708C6017K4797
$$ 87314 71216 -73998 -54811 -77259 33644 85886 -276211 -195487 -136779 36017 60814
19157F0814a27245A03397b92738A20946b7041m9397o9580C5683J11341a95255
$$ 60814 -127245 103397 -292738 120946 -27041 -76438 -146018 35683 147024 -195255
19146d1413j72799K6384I11c50870L6930d7114B14436a58818k34233H9752J71951
$$ -41413 -214212 -187828 911 -350870 -313940 -47114 214436 -158818 -393051 89752 261703
19135B61703a42978P0383H0192h4305l096J7134F847b25881A00936m0890A5033
$$ 261703 -142978 -72595 80192 -84305 -87401 -70267 6847 -225881 100936 60046 15033
19123e5152b6679j67415k38774B57028b49146d6016q7957G5832a83124b1811F0817
$$ -55152 -26679 -194094 -432868 257028 -249146 -46016 -133973 75832 -183124 -21811 60817
19111G7879a28862A72483a84559A79636a32558A03348D7552d40816J84675L7528
$$ 77879 -128862 172483 -184559 179636 -132558 103348 47552 -440816 -256141 -218613
19101b18613e1406p5359l9250d1904B20163b36103E6965J35695K4605p8457b6741
$$ -218613 -51406 -126765 -166015 -41904 220163 -236103 56965 192660 217265 138808 -26741
19089d87233b395o4886p517A35887g3697q3958B55621g1797A88697a23986e7570
$$ -487233 -2395 -67281 -74798 135887 -73697 -157655 255621 -71797 188697 -123986 -57570
19077b81665B88804b07312A33571c82515a32734e8099B67939P1797A5115a55450
$$ -281665 288804 -207312 133571 -382515 -132734 -58099 267939 339736 15115 -155450
19066a13984j01461C2206K88898A53607a78796b1245E3066a27505A88028a40523
$$ -113984 -215445 32206 321104 153607 -178796 -21245 53066 -127505 188028 -140523
19055a52365A63586a23198c462A46032J0458f7443b8378m8497A15795J47140b8645
$$ -152365 163586 -123198 -3462 146032 156490 -67443 -28378 -76875 115795 262935 -28645
19043H2674d6613l7713k09591O7348I0157j8419a14968j2848A73139c86267e0275
$$ 82674 -46613 -84326 -293917 -226569 90157 71738 -114968 -127816 173139 -386267 -50275
19031i8713d768k04221E4418d18700b06932q9731a46678j12885A0309c4411A73553
$$ -98713 -4768 -208989 54418 -418700 -206932 -296663 -146678 -259563 10309 -34411 173553
19019b70739j1085f108l00907e7002J9523A0316J92791F2897a43293k4293A04158
$$ -270739 -281824 -6108 -307015 -57002 -37479 10316 203107 62897 -143293 -167586 104158
19007c10455e3736B33951f4689c1022n3331D9131h9663j29339E8171e497l19246
$$ -310455 -53736 233951 -64689 -31022 -84353 49131 -89663 -219002 58171 -5497 -324743
18996c24743f235A02828A4910c47010F2411a96461H7117a1706A52428B9898b61877
$$ -324743 -6235 102828 14910 -347010 62411 -196461 87117 -11706 152428 29898 -261877
18984c9457p6969P909L3297k99100B529a11100G4164a70955L5175d4064a7010
$$ -39457 -116426 -108517 -75220 -374320 2529 -111100 74164 -170955 -135780 -44064 -17010
18972b20581H3953a12929m5593j34241I734J94775A01445d7713j15310d6269j2910
$$ -220581 83953 -112929 -158522 -292763 9734 204509 101445 -47713 -163023 -46269 -59179
18961e9179m8628p739R811E07206j48429j25086I9990R985d23393D7277L9983
$$ -59179 -107807 -115546 -105735 507206 358777 233691 99990 109975 -423393 47277 87260
18950H7260j8763J6591a73941A1573L10488c55063H6828a47197k69337I6999a79690
$$ 87260 68497 85088 -173941 11573 322061 -355063 86828 -147197 -416534 96999 -179690
18938B13937c74076a05689j37672B14147b33128A47932D1112h5184B6534m768
$$ 213937 -374076 -105689 -243361 214147 -233128 147932 41112 -85184 26534 21766
18928B1766c9321j38605K4316C5473c63317h8136a7052j3302k33410C76340b73716
$$ 21766 -39321 -177926 -153610 35473 -363317 -88136 -17052 -30354 -263764 376340 -273716
18916G378d5351n024k56168f2441C77162c65850a65096p1158P6508A8531P6904
$$ 7378 -45351 -50375 -306543 -62441 377162 -365850 -165096 -236254 -159746 18531 95435
18905I5435c50666R91J32317a5023j41975C8537a7232A12402J34818E8760J42944
$$ 95435 -350666 -349675 -217358 -15023 -156998 38537 -17232 112402 247220 58760 201704
18894B01704K00779L3172A05363K3350J61279F2774a5390k34739J06904M2896
$$ 201704 402483 435655 105363 128713 289992 62774 -15390 -250129 -143225 -100329
18884a00329M4125d00j01672k96850i8629D909h8869m0818A11707g504m1544n0706
$$ -100329 -56204 -400 -102072 -398922 -98629 4909 -88869 -129687 111707 -7504 -49048 -99754
18872i9754B23867J8007a90267B06505h4036M1449I3650l0578a7158A91932c32004
$$ -99754 223867 241874 -190267 206505 -84036 -42587 93650 63072 -17158 191932 -332004
18860D6058e7152G479N8280J08988a40128j43362G369a11073p672L2693k10743
$$ 46058 -57152 7479 65759 174747 -140128 -283490 7369 -111073 -118745 -86052 -296795
18849b96795h499C15218a91866k06280a85848C7340L8721J06421L4747F3222a13976
$$ -296795 -8499 315218 -191866 -398146 -185848 37340 76061 182482 217229 63222 -113976
18837a91786d7758n57848H7875b4114B87785a34461G522Q6378a21240l57263a83472
$$ -191786 -47758 -605606 87875 -24114 287785 -134461 7522 93900 -121240 -478503 -183472
18825h3469c7082j64263r3975J43492b943l13691Q8210J1296d0206k37704A2360
$$ -83469 -37082 -201345 -295320 -151828 -2943 -316634 -228424 -217128 -40206 -277910 12360
18813B09305b75468J37325B59968a89167C5021a28066p1846a0700C61013a5428
$$ 209305 -275468 -138143 259968 -189167 35021 -128066 -199912 -10700 361013 -15428
18802A19201a8156C07212H4640l9720b4608k557C21127e6593D3286L4675M8287
$$ 119201 -18156 307212 84640 44920 -24608 -27165 321127 -56593 43286 77961 126248
18791A26248j1073J50003G3329k2086M476b24293A20811a30381A90323a5130I8629
$$ 126248 115175 265178 73329 51243 55719 -224293 120811 -130381 190323 -15130 98629
18779b48645A13577b843p9573I8384c2277k66701c8998j75795c76q2151l77999
$$ -248645 113577 -2843 -82416 98384 -32277 -298978 -38998 -214793 -376 -82527 -460526
18768d60526a22164J1723A28595E0593b8940j1877k6855k3600F0292L3034i9428
$$ -460526 -122164 -110441 128595 50593 -28940 -40817 -67672 -91272 60292 93326 -99428
18756b43852C18790a84958n887Q8522r9945A13742r412e3567r6120l6002A41521
$$ -243852 318790 -184958 -190845 -102323 -202268 113742 104330 -53567 -149687 -185689 141521
18744a43836Q420f3416B41960a14777j6754B22954D0779A6084a87722d245A30668
$$ -143836 -135416 -63416 241960 -114777 -131531 222954 40779 16084 -187722 -4245 130668
18732c197j2814A21614b45843M3064G8090e7882A11788a35968B08164a16026l26346
$$ -3197 -16011 121614 -245843 -202779 78090 -57882 111788 -135968 208164 -116026 -442372
18721d42372a0358n3605B4216J45597c09178P7540J15743j07104A96183j0759
$$ -442372 -10358 -63963 24216 169813 -309178 -231638 -115895 -222999 196183 185424
18711A85424g7781j358A23203A7913a85878H2706C2107o61a16790j60622G5957
$$ 185424 -77781 -79139 123203 17913 -185878 82706 32107 31446 -116790 -277412 75957
18699b26037Q0512j10468A02272b52957G1377q721b68438c8279A4147a97522C38771
$$ -226037 -145525 -255993 102272 -252957 71377 62656 -268438 -38279 14147 -197522 338771
18687d09247f7484j00661k84029H371a11064k80768a51869j15179k18846a14329
$$ -409247 -67484 -168145 -452174 8371 -111064 -391832 -151869 -267048 -485894 -114329
18676e6892q8891f4115b4955G336R5039a20011C551f9127C50876A56848A6028
$$ -56892 -145783 -64115 -24955 7336 102375 -120011 3551 -69127 350876 156848 16028
18664b16349q769J02173j22169A04653a37070m470j27913D3486P9319R3044d8713
$$ -216349 -225118 -122945 -245114 104653 -137070 -141540 -269453 43486 122805 215849 -48713
18652d18409i975D9494a81791A14786a80457c8881J1932j5817a590j12350I5422
$$ -418409 -9975 49494 -181791 114786 -180457 -38881 -26949 -42766 -1590 -113940 95422
18640d8265j25296B83289G2965e6673J8864j22300j50791i95p8532j17341B1574
$$ -48265 -173561 283289 72965 -56673 -37809 -160109 -310900 -995 -79527 -196868 21574
18628f5698B142K96232b56586G3423l4463h1961r2674B76943d60377B26409c5344
$$ -65698 2142 298374 -256586 73423 38960 -81961 -174635 276943 -460377 226409 -35344
18616A43039a25782o4595p3166B6222a04231m1987C07657d64979B9815c12126
$$ 143039 -125782 -190377 -263543 26222 -104231 -146218 307657 -464979 29815 -312126
18605g112A18697M079d05593A95701d4621I8773a44366j31248A90833A3038b02022
$$ -7112 118697 122776 -405593 195701 -44621 98773 -144366 -275614 190833 13038 -202022
18593d7731j66755O6429f0249p055j87102J8428B04723c27225M1200A10630g2014
$$ -47731 -214486 -148057 -60249 -67304 -254406 -235978 204723 -327225 -286025 110630 -72014
18581a81071A31316i0801B18481g4188A29736c45468g738I9233a11989n4374B054
$$ -181071 131316 -90801 218481 -74188 129736 -345468 -7738 99233 -111989 -166363 2054
18569b46352h6174r9354A76613c4404A57789A8033c6069k03161Q5589o8768B6537
$$ -246352 -86174 -185528 176613 -34404 157789 18033 -36069 -239230 -153641 -222409 26537
18557a96887O477n04C0341d40390F3893d6702B89261A1212a92998c0346j32125
$$ -196887 -190410 -190914 30341 -440390 63893 -46702 289261 11212 -192998 -30346 -162471
18546a62471B8218O3164a0555k88665J29303H393J21294E0513e5552j62427M4059
$$ -162471 28218 91382 -10555 -299220 -169917 8393 129687 50513 -55552 -217979 -173920
18535a73920G3525c7159A03009a38678A0907K8519K85911b6024k05323H2218H799
$$ -173920 73525 -37159 103009 -138678 10907 39426 325337 -26024 -231347 82218 8799
18523a17665A81612A1120a40677j41324A43918G0949L6737c3730J5840A01523
$$ -117665 181612 11120 -140677 -282001 143918 70949 107686 -33730 -17890 101523
18512a99624D5804b70338e1508E9271J0225e5388k27892A40810i9933m1779B49085
$$ -199624 45804 -270338 -51508 59271 69496 -55388 -283280 140810 -99933 -141712 249085
18500A43114e206k24469B30490k7586E3940H387f730l20758C8490R948J98424
$$ 143114 -5206 -229675 230490 202904 53940 8387 -6730 -327488 38490 48438 246862
18489B46862e9096n8553B49607i9486L0398k6075D2502a53017d5685k4441j35818
$$ 246862 -59096 -117649 249607 -99486 -69088 -95163 42502 -153017 -45685 -70126 -205944
18478b05944a02965M1414B46470h6514j49891B47290F1531a08038j8400A30818
$$ -205944 -102965 -61551 246470 -86514 -236405 247290 61531 -108038 -126438 130818
18467B40437J08326A16143Q3516b88914l96776B42429a87681j06327g6789j13192
$$ 240437 348763 116143 199659 -288914 -685690 242429 -187681 -294008 -76789 -189981
18457a89981B93249b85823a14315A47768a30900B35456a16277d4839j54651M965
$$ -189981 293249 -285823 -114315 147768 -130900 235456 -116277 -44839 -199490 -194525
18447a94525M4575j756C06576b51726a19041A7623a54882A3155b81766j90643
$$ -194525 -149950 -151706 306576 -251726 -119041 17623 -154882 13155 -281766 -472409
18437d72409K22887O4093f2304D10787a69291j8471l01364A76287b33962R0664
$$ -472409 -249522 -185429 -62304 410787 -169291 -187762 -489126 176287 -233962 -143298
18427a43298M4748j57998B77677Q245b10372d0869k2026m5004L5738B60844F6868
$$ -143298 -98550 -256548 277677 285922 -210372 -40869 -62895 -107899 -72161 260844 66868
18415b37590n5693D5471L68216j38488J42080a45767I0414M7117i6292A21293
$$ -237590 -293283 45471 413687 275199 417279 -145767 90414 137531 -96292 121293
18404A72313L573b75656A71066b2254j53925Q332E6921j9309a49883g646j67291
$$ 172313 175886 -275656 171066 -22254 -176179 -167847 56921 37612 -149883 -7646 -174937
18393a74937a9877j53493A97185d4195a7076C59000c5013D787J67500J3818B0173
$$ -174937 -19877 -173370 197185 -44195 -17076 359000 -35013 4787 172287 186105 20173
18381A8912h840j18483G9860C6041J84303b01641j20670J55572C7759a94480l2280
$$ 18912 -8840 -127323 79860 36041 220344 -201641 -322311 -166739 37759 -194480 -226760
18370b26760B7330m126R2764A6301f5770l9817d7276o977a7821E4115b12886k2741
$$ -226760 27330 23204 115968 16301 -65770 -105587 -47276 -54253 -17821 54115 -212886 -235627
18358b35627B80222b15834j37225B42626G4843k7790h6555k632A6914L6200N7544
$$ -235627 280222 -215834 -353059 242626 74843 47053 -86555 -89187 16914 53114 110658
18347A10658a93741G0587b7986A24465n4375K00208r5121h2230j28895B5409K0100
$$ 110658 -193741 70587 -27986 124465 70090 270298 175177 -82230 -211125 25409 45509
18336D5509f6388j74996b1766B9289b71116A60831Q5766b99526D3544g6683C20481
$$ 45509 -66388 -241384 -21766 29289 -271116 160831 246597 -299526 43544 -76683 320481
18324B37253a94801n2390J04229d1980I3905O3384a60064N1720F1551a63519A6277
$$ 237253 -194801 -247191 -142962 -41980 93905 157289 -160064 -108344 61551 -163519 16277
18312F0021J0926a72704P3565F3210c2443m0039D2472b65364k9747h2357B45780
$$ 60021 70947 -172704 -99139 63210 -32443 -72482 42472 -265364 -295111 -82357 245780
18300A3080Q0358c20408c8284j1693A28893G92N8786b5176A50498a17801k3449
$$ 13080 93438 -320408 -38284 -49977 128893 792 59578 -25176 150498 -117801 -141250
18289a41250N0090B23839r2414a03483k24844A68813e0587l9185J4949A60822
$$ -141250 -91160 223839 131425 -103483 -328327 168813 -50587 -89772 -74823 160822
18278D40143a81659K3485C88217A052i6711E4172K0020b86836a6006A25702a66668
$$ 440143 -181659 -158174 388217 1052 -96711 54172 74192 -286836 -16006 125702 -166668
18266a76583K3031j51270i7969c2447B74804a10928k2103r0945j7331A9191J78786
$$ -176583 -153552 -304822 -97969 -32447 274804 -110928 -133031 -223976 -241307 19191 197977
18255A97977d0962k44505D924J16420D4517a31148a2947m22068h2804A72448h6633
$$ 197977 -40962 -285467 4924 121344 44517 -131148 -12947 -435015 -82804 172448 -86633
18243a33432G023M0200e8949E3744h6235l57984A45112c3902A27388Q9972j04111
$$ -133432 7023 47223 -58949 53744 -86235 -444219 145112 -33902 127388 217360 113249
18232A13249B9211b74962J13796j26113P1285j04753h015m3448H340l162M3827
$$ 113249 29211 -274962 -161166 -287279 -215994 -320747 -8015 -51463 8340 5178 49005
18221D9005B2848N0159a63721A08156c19617K3517k13956B6957k497e5982j27273
$$ 49005 22848 73007 -163721 108156 -319617 -296100 -510056 26957 24460 -55982 -183255
18210a83255D9612j1572d4144C6798b55340A8928a38907a0256j45141E6441K5997
$$ -183255 49612 38040 -44144 36798 -255340 18928 -138907 -10256 -155397 56441 82438
18199H2438i6679k46070e7379b8289j96697a9481k11010J05414l26184G5233A0786
$$ 82438 -96679 -342749 -57379 -28289 -224986 -19481 -230491 -125077 -451261 75233 10786
18187e6934A158e2622G5449O8983a32036A82984I112b5318m3409l6349B4658c8413
$$ -56934 1158 -52622 75449 144432 -132036 182984 9112 -25318 -68727 -105076 24658 -38413
18174A76205a78311A45830O8720b27256C9296o51J59872b02106M2419q1218r075
$$ 176205 -178311 145830 214550 -227256 39296 38645 198517 -202106 -159687 -240905 -249980
18163b49980G8155a77121e1255j48871D2608a1935k48066n9305h5622B21954E7641
$$ -249980 78155 -177121 -51255 -200126 42608 -11935 -260001 -319306 -85622 221954 57641
18151A96808a14660m2319B32292c24266J42143A65669m5188A8508c2969B00400
$$ 196808 -114660 -156979 232292 -324266 -182123 165669 120481 18508 -32969 200400
18140a44016j28277j78434I7039B8415P3373l2749a44282I5797a9126l15391C6881
$$ -144016 -272293 -450727 97039 28415 101788 69039 -144282 95797 -19126 -334517 36881
18128b59863C2058J96170f7986n5747n1435f1884n105C5570i5501C0681c67718
$$ -259863 32058 228228 -67986 -123733 -175168 -61884 -66989 35570 -95501 30681 -367718
18116A48212c5217G5614a11735A63755J07249I3290K5398a00682F0245b73672
$$ 148212 -35217 75614 -111735 163755 271004 93290 118688 -100682 60245 -273672
18105H7777i3428J9363K9180A51029p2785J92150I3675K31102C3581c03363A47262
$$ 87777 -93428 -74065 -44885 151029 78244 270394 93675 324777 33581 -303363 147262
18093A9941R7660Q0849i5516A22017a18908K8438A52988c27139E6407J82926H0585
$$ 19941 117601 198450 -95516 122017 -118908 -90470 152988 -327139 56407 239333 80585
18081D9477a52711L3846A446R9053f05j94388a3318j59234P420A06477b42914
$$ 49477 -152711 -118865 1446 100499 -605 -194993 -13318 -172552 -165132 106477 -242914
18069C70716C2510b06653A71134l1555Q9883d634B41791D5557M5045M82O9239
$$ 370716 32510 -206653 171134 139579 229462 -4634 241791 45557 90602 91084 160323
18058A60323a07363A84351a86208A93920Q50a07854A17146Q1620G5405c10969
$$ 160323 -107363 184351 -186208 193920 194770 -107854 117146 198766 75405 -310969
18047B84842a7071B10767a3785j43580A50718p3047f7214C6138K63538a93862
$$ 284842 -17071 210767 -13785 -157365 150718 77671 -67214 36138 299676 -193862
18036B54601p2165H9952B0265a30020o8788H739c6030B49029o342F5136i7819
$$ 254601 182436 89952 20265 -130020 -198808 8739 -36030 249029 242687 65136 -97819
18024f2250A52922o1914J80260h0983c0971j08196A55266b92415J20643I8829
$$ -62250 152922 91008 271268 -80983 -30971 -139167 155266 -292415 -171772 98829
18013b52482g606l3101A8603J55765J4202E440b07897g5726A26936a64379k72251
$$ -252482 -7606 -40707 18603 174368 188570 5440 -207897 -75726 126936 -164379 -436630
18002d36630a66549a7228G4483A1487c38930H1295K25872q1871l1576i554G9385
$$ -436630 -166549 -17228 74483 11487 -338930 81295 307167 225296 193720 -9554 79385
17990a29730J8595C06780A6845a73999c5000A60605L6500g9485I2409a75155g321
$$ -129730 -111135 306780 16845 -173999 -35000 160605 197105 -79485 92409 -175155 -7321
17978b42619i4991r1497A25027f2195B09489a45503o9051Q9385c4828l9408L6240
$$ -242619 -94991 -186488 125027 -62195 209489 -145503 -214554 -125169 -34828 -74236 -37996
17967c7996O732B79692a53408f9732k36231A25554n6096N0462P5634c7246j49102
$$ -37996 -31264 279692 -153408 -69732 -305963 125554 69458 119920 195554 -37246 -186348
17956a86348j16017A62730l370a3495G1598O2925b08720j72303A39612L44851
$$ -186348 -302365 162730 159360 -13495 71598 134523 -208720 -381023 139612 484463
17946D84463j89350F1084A6533g3562F5337J79012E1561i7753E9015a18271B17873
$$ 484463 295113 61084 16533 -73562 65337 244349 51561 -97753 59015 -118271 217873
17934c70075B8665e16010C84473C4666b27218F3495b72722B37104g2167j4302
$$ -370075 28665 -516010 384473 34666 -227218 63495 -272722 237104 -72167 -86469
17924h6469A3134a37162B75538j16531b19107K111C9381c7564B96750c5591h622
$$ -86469 13134 -137162 275538 159007 -219107 -216996 39381 -37564 296750 -35591 -8622
17912a13778M1863b9460C12766j55437A4232a4916q7363C19659q8933a67854B59995
$$ -113778 -71915 -29460 312766 157329 14232 -14916 -102279 319659 230726 -167854 259995
17900e1765A78526e4159A31251m1666J19552c29157h6618F5116N1325m4077J47363
$$ -51765 178526 -54159 131251 89585 209137 -329157 -86618 65116 116441 72364 219727
17889B19727c1544B500b28222a9184B07464b19510A41416K99872A30896N8216
$$ 219727 -31544 2500 -228222 -19184 207464 -219510 141416 441288 130896 189112
17879A89112a5221D7220M9519c55703A84590G9793b513G6258L67133j84756a07520
$$ 189112 -15221 47220 96739 -355703 184590 79793 -2513 76258 443391 258635 -107520
17867b07512i5755I6929a32210q6052d5722A65501f4859A87213a65091j08241
$$ -207512 -95755 96929 -132210 -218262 -45722 165501 -64859 187213 -165091 -273332
17857b73332B67541G7450b3868I1373a68960c6373E8819B6470J9920M3675a32365
$$ -273332 267541 77450 -23868 91373 -168960 -36373 58819 26470 46390 90065 -132365
17845A64498F7015K5513J19339J2588j10230J9808a6434B49256j15503E8317K94065
$$ 164498 67015 92528 211867 224455 114225 134033 -16434 249256 133753 58317 352382
17834C52382a44885p2241C9596m437j6373L9955B9065f0371E5503H620J30727
$$ 352382 -144885 -217126 39596 35159 18786 58741 29065 -60371 55503 8620 139347
17823A39347a08269H8294J33774a41854C56553a04436l02578a41893C99148j40181
$$ 139347 -108269 88294 222068 -141854 356553 -104436 -407014 -141893 399148 258967
17813B58967F8009J63994g4839b0015C7367c49979C4459e4378I9050J95387a43860
$$ 258967 68009 232003 -74839 -20015 37367 -349979 34459 -54378 99050 294437 -143860
17801b977B27593K4869E6989a39197B07864B4044L27657p129A33917K01234d3544
$$ -2977 227593 252462 56989 -139197 207864 24044 351701 344572 133917 335151 -43544
17789b43714A23925a54517I3021K6965b02485B39544K36531j65384H8145I033
$$ -243714 123925 -154517 93021 119986 -202485 239544 476075 310691 88145 9033
17778E1218b6338H6965q677B8435J40166f6775k59997b9500E0331k0495J18755
$$ 51218 -26338 86965 78288 28435 168601 -66775 -326772 -29500 50331 29836 148591
17767A48591L3416c7520C09389b02419C49473h750k42581H8995J50981h688r8159
$$ 148591 182007 -37520 309389 -202419 349473 -8750 -251331 88995 239976 -8688 -106847
17756a06847L73H1667b88663A34610o4317J19826a71560C74210b79287C9612J40220
$$ -106847 -106474 81667 -288663 134610 70293 190119 -171560 374210 -279287 39612 179832
17745A79832M9815J991a00717l2550O3330A5482K01660J43426e5529C1197J10822
$$ 179832 229647 231638 -100717 -133267 -69937 15482 217142 360568 -55529 31197 142019
17734A42019J6633Q0944c5425A8258L2640O2690A0028a03580a9316A70572B8989
$$ 142019 158652 239596 -35425 18258 50898 113588 10028 -103580 -19316 170572 28989
17722F6498h8992k347A60171g5216k4655J0376A59111I594P6176i6711A62063
$$ 66498 -88992 -91339 160171 -75216 -99871 -89495 159111 9594 85770 -96711 162063
17710D2443J96560m5802n0633m3957K15700f411j22276A55708c5567j2913C03630
$$ 42443 239003 193201 142568 98611 314311 -6411 -128687 155708 -35567 -48480 303630
17698A57990c50I8147h0900k0906r209H124O9353C2020J3333i12A65045J70328
$$ 157990 -350 98147 -80900 -101806 -111015 8124 77477 32020 45353 -912 165045 335373
17686C35373G7566g6516a7661A12882a56428A1436M2990k5225b33245e541j55862
$$ 335373 77566 -76516 -17661 112882 -156428 11436 54426 29201 -233245 -5541 -161403
17675a61403C8129a26525A78654p4650a84887A51491o8880d6412D4879O1609C3216
$$ -161403 38129 -126525 178654 104004 -184887 151491 82611 -46412 44879 106488 33216
17663c51919C35315I9574m0983L533N3955n3442J74715D5006J82568B1368d6603
$$ -351919 335315 99574 58591 62124 116079 62637 237352 45006 227574 21368 -46603
17651C1204L19106j1661A55144Q8891J41798A05329K73237A9410J31081J46169
$$ 31204 350310 338649 155144 244035 385833 105329 378566 19410 150491 296660
17641B96660P9185b0275i721A45596m620l6314K23676a32122F9428N9577O71449
$$ 296660 375845 -20275 -9721 145596 140976 104662 328338 -132122 69428 129005 800454
17630H00454B84836O3551D5747J12056A0676L49713b47862a09915D07329A88502
$$ 800454 284836 348387 45747 157803 10676 360389 -247862 -109915 407329 188502
17619B3843J29049Q507K34720A19970a10659k9122A48676a94523B2758c3405J1117
$$ 23843 152892 161399 396119 119970 -110659 -139781 148676 -194523 22758 -33405 -22288
17608b2288A59448D209a7162B04605a13576H3885J21136r6160K32426C7943a54785
$$ -22288 159448 4209 -17162 204605 -113576 83885 205021 108861 341287 37943 -154785
17596c7452D46086D9320J04397J54182a09972A23318J89764F1355N5918a66204
$$ -37452 446086 49320 153717 307899 -109972 123318 313082 61355 117273 -166204
17585F4161B9076N56287A55153B950J20700m6734J45326d9260A08036J06758n8403
$$ 64161 29076 585363 155153 2950 123650 76916 222242 -49260 108036 214794 156391
17574A56391J97957j52290a9734D15096j77465k8830f6407B43959b40128f7678
$$ 156391 354348 202058 -19734 415096 237631 208801 -66407 243959 -240128 -67678
17563G5141a96248A26784J78379M2446A73380e7122D4600J30434a57073A37810
$$ 75141 -196248 126784 305163 347609 173380 -57122 44600 175034 -157073 137810
17552b03066O122A9481b16195B04384p4592A067Q5532M45387F2653j0221a09018
$$ -203066 -196944 19481 -216195 204384 129792 1067 86599 531986 62653 52432 -109018
17540A65097K56700j31179M7935q1607r164a60151C33455J6761q6147E8042L09684
$$ 165097 421797 290618 338553 256946 247782 -160151 333455 350216 264069 58042 367726
17529C67726j40643K34661g1752C69887j84205D4985J70127r8809K51632K11106
$$ 367726 227083 461744 -71752 369887 185682 44985 215112 116303 367935 579041
17519E79041k85042q3175J93521j37620H4688N06940L4814J04146k71319K24042
$$ 579041 293999 210824 404345 266725 84688 591628 626442 730588 459269 683311
17509F83311L77787q7805l85645k6847j78988K1625K00071l1009j54254J13803
$$ 683311 1061098 973293 587648 560801 381813 403438 603509 572500 418246 532049
17499E32049A94676L94230J78301m0854K08197M74375n97005j89139J50771k34832
$$ 532049 194676 588906 767207 726353 934550 1408925 811920 622781 773552 538720
17489E38720A53604L20859L42075B94170o49A01915O06400A86745p1796N04730
$$ 538720 153604 474463 816538 294170 293521 101915 708315 186745 114949 619679
17479F19679F1334L84287B11892J31730g6143C92170J27837B37105o2253K41750
$$ 619679 61334 445621 211892 343622 -76143 392170 520007 237105 174852 416602
17469D16602j19856n7733K76035B32653J47093j71056K41117a1448B27878l0362
$$ 416602 296746 239013 515048 232653 379746 208690 449807 -11448 227878 197516
17459A97516D0918r086L6523K30429I4821K58664K1164A38016K80896D4885K05141
$$ 197516 40918 31832 68355 298784 94821 353485 374649 138016 418912 44885 250026
17448B50026p1075K56814j62025P7980A47667L04859A92064K75941A11571J62446
$$ 250026 178951 435765 273740 351720 147667 452526 192064 468005 111571 274017
17438B74017p1596J10413A53498h7326C99572j38515K84272B14784J52751K9837
$$ 274017 202421 312834 153498 -87326 399572 261057 545329 214784 367535 397372
17428C97372K01547P577j83003j8882j29720K95944B21928q2630J18550L77052
$$ 397372 598919 606496 423493 404611 274891 570835 221928 139298 257848 634900
17418F34900j05706c9835C14402J44046A85591A7699K59300J52022j13844G4396
$$ 634900 529194 -39835 314402 458448 185591 17699 276999 429021 315177 74396
17407E28895k20762m8013r5953A8960M49940A69073j6957P4293L18967j35866
$$ 528895 308133 260120 164167 18960 468900 169073 152116 226409 545376 409510
17397D09510L43756C27581j21861O8285J38455A70756J59090J33793A04363q018
$$ 409510 753266 327581 205720 274005 412460 170756 329846 463639 104363 96345
17387I6345J99014r8197L8041a01922B43009J77437H9988M243K53812L5992D3887
$$ 96345 295359 197162 235203 -101922 243009 420446 89988 94231 348043 384035 43887
17375b16317B92518J65496J42031d643A85880M96125k81671p6651J58000j71873
$$ -216317 292518 458014 600045 -4643 185880 682005 400334 323683 481683 309810
17365C09810j21893f0262B84989A39265K35404K7684p0983m1598j39796P4819
$$ 309810 187917 -60262 284989 139265 374669 402353 331370 289772 149976 224795
17355B24795O0778J33815j15204K27369k62550J14275j8739I4670J18117J60206
$$ 224795 285573 419388 304184 531553 269003 383278 364539 94670 212787 372993
17345C72993j49841c63052C53705J56490A51868K99057j26109k4376o4777F2273
$$ 372993 223152 -363052 353705 510195 151868 450925 324816 300440 235663 62273
17334a07454B84465r6917L48504A03372M33328m6072j90219F0731K44717J0358
$$ -107454 284465 187548 536052 103372 536700 490628 300409 60731 305448 315806
17324C15806j10915B5416K29553j03599K63111J4959A23336J60828N041D3724
$$ 315806 204891 25416 254969 151370 414481 429440 123336 284164 289205 43724
17313E97154A07244L36060E5215L01131A68370K74954j08928j25446q5437K59046
$$ 597154 107244 443304 55215 356346 168370 443324 334396 208950 123513 382559
17303C82559H5642K23109a51762C25278m8266o904C7716J39871K03248n591J2487
$$ 382559 85642 308751 -151762 325278 277012 270108 37716 177587 380835 375244 387731
17292C87731j41018J5196o4580J00109h340B75398H0036M57508k22712J42695
$$ 387731 246713 261909 197329 297438 -8340 275398 80036 537544 314832 457527
17282D57527l6945O5552j3480A88224J49541G111N28383C3321M7631m408J27349
$$ 457527 420582 486134 472654 188224 337765 7111 535494 33321 80952 76544 203893
17271B03893L01041k49430J2611K34812m02J15272r1125J06633C05839K45769
$$ 203893 504934 255504 268115 502927 502525 617797 526672 633305 305839 551608
17261E51608j67151A80707J12553q3269J64638N8345b5646C34180j33602J76682
$$ 551608 384457 180707 293260 209991 374629 432974 -25646 334180 200578 377260
17251C77260O3408j4148j50360n5541J31807J16308B05201J63057j15731J65858
$$ 377260 440668 426520 276160 220619 352426 468734 205201 368258 252527 418385
17241D18385F2685J46237a35261F71545A68296L32206L7274L0816j20277j70353
$$ 418385 62685 208922 -135261 671545 168296 500502 537776 568592 448315 277962
17231B77962L8282R0619Q2467K5231j79279j64949J36449m9189K09008J93530
$$ 277962 316244 406863 489330 514561 335282 170333 306782 257593 466601 660131
17221F60131d1190B23185K84494j72483O2653J07302r3442p3571K49426k22973
$$ 660131 -41190 223185 507679 335196 397849 505151 411709 338138 587564 364591
17211C64591R842K556L017J29964J51349p9579A72553M9726J67985p096j66177
$$ 364591 374433 376989 380006 509970 661319 581740 172553 222279 390264 383168 216991
17200B16991K44554A59791J19012a4313C88003o5369G9800K45182K38230j42851
$$ 216991 461545 159791 278803 -14313 388003 322634 79800 324982 563212 420361
17190D20361K9080M5910m6079K4089J58472k31240J01244J3859q0237k04562J56700
$$ 420361 449441 495351 449272 473361 631833 400593 501837 515696 435459 230897 387597
17179C87597J6277O9571j71990P9729E8716M97791q8711K43607k26720j26583
$$ 387597 403874 473445 301455 381184 58716 556507 467796 711403 484683 358100
17169C58100o5186L09893l5994B39113J70057j73088K14344o2914J19943q9327
$$ 358100 292914 602807 566813 239113 409170 236082 450426 387512 507455 418128
17159D18128J61832A89379M72831C13631M8833j3804K62277j50673J54927B98393
$$ 418128 579960 189379 662210 313631 362464 348660 610937 460264 615191 298393
17148B24605L62123j59107j32119n4712N04521l34578o7536n4414J41916o4235
$$ 224605 586728 427621 295502 240790 745311 410733 343197 288783 430699 366464
17138C66464N79904k99886d0566C67004N3539K80796n0433n2123L8062C13204
$$ 366464 946368 646482 -40566 367004 420543 701339 650906 598783 636845 313204
17127C01082M62781k03539q4688J41711k31122L26384B55654M67665k7138L7445
$$ 301082 763863 560324 475636 617347 386225 712609 255654 723319 696181 733626
17117G33626l41991J65151k41684L24431J0740k27929J84974k01047J59814K8779
$$ 733626 391635 556786 315102 639533 650273 422344 607318 406271 566085 594864
17107E94864N482K4068K45042k68263l9613J47664k41919L62101l21052M08333
$$ 594864 600346 624414 869456 601193 561580 709244 467325 829426 508374 916707
17097I16707l75083L42988l04081K51269j72992N0529M0877M9021C81023J1655
$$ 916707 541624 884612 580531 831800 658808 709337 750214 799235 381023 392678
17087C92678K00683K47630j74930K00517k73325L7775M8006j16000M02363j94047
$$ 392678 593361 840991 666061 866578 593253 631028 679034 563034 965397 771350
17077G71350l85245P5574K55389J0379j03842K13362m1999r5045j62380M29169
$$ 771350 386105 461679 717068 727447 623605 836967 794968 699923 537543 966712
17067I66712l53230J77013j60143J86138k31656J65671N606J24530l6546j24101
$$ 966712 613482 790495 630352 816490 584834 750505 756111 880641 844095 719994
17057G19994k5590j47133Q9947Q6450M47146k43341l44765K42018M3278l1933
$$ 719994 694404 547271 637218 723668 1170814 927473 582708 824726 868004 836071
17047H36071r9377J89094r2145j22385J65504n4114J9171n3202n3515m482R8547
$$ 836071 736694 925788 833643 711258 876762 822648 841819 788617 735102 730620 829167
17036H29167j08449M5620q193j49205J19941j17477M16349Q1152j71261M2470
$$ 829167 720718 766338 758145 608940 728881 611404 1027753 1108905 937644 980114
17026I80114j08309o3627J04505J10929J37355m58909K81439l5698K24669n1844
$$ 980114 871805 808178 912683 1023612 1160967 702058 983497 947799 1172468 1120624
17016A120624m6561k29079k88307L07975J52574N0898O4455l21596J10653j32108
$$ 1120624 1074063 844984 556677 864652 1017226 1068124 1132579 810983 921636 789528
17006G89528K62543r2494n0214o2078L36141j38664k30510L53734J14338j49535
$$ 789528 1052071 959577 909363 847285 1183426 1044762 814252 1167986 1282324 1132789
16996A132789k51367K12968n3642J22482k39318K41957M6231J56904k74640j63251
$$ 1132789 881422 1094390 1040748 1163230 923912 1165869 1212100 1369004 1094364 931113
16986I31113Q994K21770p1180o5397m2979L98232k89604K21410J17295P3824j96552
$$ 931113 940107 1161877 1090697 1025300 982321 1380553 1090949 1312359 1429654 1503478 1306926
16975A306926K2670N1985J8283k37272K25160N2348j40144J96315j57421l5962
$$ 1306926 1329596 1381581 1399864 1162592 1387752 1440100 1299956 1496271 1338850 1302888
16965A302888L4676K23080j77110L55757o23603L23264l36787L46912J01902O9303
$$ 1302888 1337564 1560644 1383534 1739291 1115688 1438952 1102165 1449077 1550979 1620282
16955A620282k7128l16940K38359L17728k97008O3004K593k20133Q6675K23179
$$ 1620282 1593154 1276214 1514573 1832301 1535293 1598297 1600890 1380757 1467432 1690611
16945A690611j65004K49224m6411n517o8434K36502q2343k20522M60373q9033
$$ 1690611 1525607 1774831 1728420 1722903 1654469 1890971 1808628 1588106 2048479 1959446
16935A959446P2116l58763M04768J8583n55336N13565J39493o63526L51297k95703
$$ 1959446 2031562 1672799 2077567 2096150 1540814 2054379 2193872 1530346 1881643 1585940
16925A585940N73963l01224J06017O3776K21334K9778J29323n45098J22840N3632
$$ 1585940 2159903 1858679 1964696 2028472 2249806 2279584 2408907 1863809 1986649 2040281
16915B040281m3760J11809j67112M02931k48036l1142J95196k385J93704J77854
$$ 2040281 1996521 2108330 1941218 2344149 2096113 2064971 2260167 2257782 2451486 2629340
16905B629340j31889R9213k31177q1989L82368l07334l2457L81143J60669j60173
$$ 2629340 2497451 2596664 2365487 2283498 2665866 2358532 2326075 2707218 2867887 2707714
16895B707714m1478n9163J25923m3756L77018m53429K17430J7400j17473J07784
$$ 2707714 2666236 2607073 2732996 2689240 3066258 2612829 2830259 2847659 2730186 2837970
16885B837970l2786m5894j173J87800O4414j5737L00640k22989L08119k04104
$$ 2837970 2805184 2759290 2758117 2945917 3010331 2994594 3295234 3072245 3380364 3176260
16875C176260K927k04880L19347P8651J51146Q5657l7105J7443k81311L35423
$$ 3176260 3179187 2974307 3293654 3372305 3523451 3609108 3572003 3589446 3308135 3643558
16865C643558J06825j21332o8461J13897J72140Q1951l8816o8905L26541J0083
$$ 3643558 3750383 3629051 3560590 3674487 3846627 3928578 3889762 3820857 4147398 4157481
16855D157481l00916K2678N04969p5101n9195r035J07505J34679j47176K31348
$$ 4157481 3856565 3879243 4384212 4309111 4249916 4240881 4348386 4483065 4335889 4567237
16845D567237O02107m74430K54669q4580O8919n6114M78544J5010m52581M85152
$$ 4567237 5169344 4694914 4949583 4865003 4933922 4877808 5356352 5371362 4918781 5403933
16835E403933N6687N843L26292j44663Q014J74739K21788J4457K2211L94393l38967
$$ 5403933 5460620 5466463 5792755 5648092 5656106 5830845 6052633 6067090 6089301 6483694 6144727
16824F144727J3870K60327R2296K23780K12170K27135K53122k94478J76447K50479
$$ 6144727 6158597 6418924 6511220 6735000 6947170 7174305 7427427 7132949 7309396 7559875
16814G559875P0167L03776J34674K21119j01298M5006J06201N23614j94288L96805
$$ 7559875 7630042 7933818 8068492 8289611 8188313 8233319 8339520 8863134 8668846 9065651
16804I065651j85600O22128O2617J72793N9701J09327J16884O42783L11313m3192
$$ 9065651 8880051 9502179 9564796 9737589 9797290 9906617 10023501 10666284 10977597 10934405
16794A0934405L96194m6173L42615J78364N57998K23900p4955M14005P02346o56
$$ 10934405 11330599 11284426 11627041 11805405 12363403 12587303 12512348 12926353 13628699 13628043
16784A3628043K4502N53002M29782M22473K79023K45921P37656J32672M71587
$$ 13628043 13652545 14205547 14635329 15057802 15336825 15582746 16320402 16453074 16924661
16775A6924661O35959M92860K95163L01213P51027M40941O92188N98573M97622
$$ 16924661 17560620 18053480 18348643 18649856 19400883 19841824 20534012 21132585 21630207
16766B1630207N45034L83670P50788P99913N02603J061267R28132Q05805Q86437
$$ 21630207 22175241 22558911 23309699 24109612 24612215 25673482 26601614 27407419 28293856
16757B8293856R74839Q76604Q85300J076820R63465J420408P79313J412188J274416
$$ 28293856 29268695 30145299 31030599 32107419 33070884 34491292 35270605 36682793 37957209
16748C7957209J422045J278930J356441J507152J610169K017361J822161J379591
$$ 37957209 39379254 40658184 42014625 43521777 45131946 47149307 48971468 50351059
16740E0351059K380826J315368K196320K205790K355039K293281K159054K727527
$$ 50351059 52731885 54047253 56243573 58449363 60804402 63097683 65256737 67984264
16732F7984264K771244K783833K868459K446424L009402L084243L237236L029641
$$ 67984264 70755508 73539341 76407800 78854224 81863626 84947869 88185105 91214746
16724I1214746K850392L178415L523852K783106L207360L014976L021484K787460
$$ 91214746 94065138 97243553 100767405 103550511 106757871 109772847 112794331 115581791
16716A15581791K424423K715610J818999K054641J669208J127038J457759K79151
$$ 115581791 118006214 120721824 122540823 124595464 126264672 127391710 128849469 129128620
16708A29128620P23742n0520o80723n31402r83182j185234j618954k298209j704016
$$ 129128620 129852362 129801842 129121119 128589717 127606535 126421301 124802347 122504138 120800122
16699A20800122k608978k984189k833610k552310l534980k410894l532380l118795
$$ 120800122 118191144 115206955 112373345 109821035 106286055 103875161 100342781 97223986
16691I7223986l190261l226531l155232k947389k897808l074742k909930k744219
$$ 97223986 94033725 90807194 87651962 84704573 81806765 78732023 75822093 73077874
16683G3077874l161543k037865l017075k361241k199902k451340k061728k205548
$$ 73077874 69916331 67878466 64861391 62500150 60300248 57848908 55787180 53581632
16675E3581632j944701k157551j660922j707740k116856j237983j584610j699516
$$ 53581632 51636931 49479380 47818458 46110718 43993862 42755879 41171269 39471753
16667C9471753j279441j298881j157831j324762j340687r63877j143384r03240
$$ 39471753 38192312 36893431 35735600 34410838 33070151 32106274 30962890 30059650
16659C0059650p50708j024690n75055j305438j077043o90663m89512q26630p19076
$$ 30059650 29308942 28284252 27709197 26403759 25326716 24636053 24146541 23319911 22600835
16650B2600835m84933p50811p86032m54580q78095j31648n78821n79483k0056
$$ 22600835 22115902 21365091 20579059 20124479 19246384 19114736 18535915 17956432 17936376
16641A7936376p03741m86682m49920l35307n78511k53706m22941m43670n31609
$$ 17936376 17232635 16745953 16296033 15960726 15382215 15128509 14705568 14261898 13730289
16632A3730289N7045l14630p57606j05060P749l85310n42044K3230l00362m59433
$$ 13730289 13787334 13472704 12715098 12610038 12617787 12232477 11690433 11713663 11413301 10953868
16622A0953868k12285j06063m66345o6069k4121l26157m60733r1792n6894k25177
$$ 10953868 10741583 10635520 10169175 10103106 10078985 9752828 9292095 9200303 9143409 8918232
16612H918232l35786K18673l15881o530o5192m88056j59795j69988j48819K42526
$$ 8918232 8582446 8801119 8485238 8478708 8413516 7925460 7765665 7595677 7446858 7689384
16602G689384n99631j60750j59318p2277j96688K26037l65037k06425J40132j47921
$$ 7689384 7089753 6929003 6769685 6697408 6500720 6726757 6361720 6155295 6295427 6147506
16592F147506J94092J02464l87273p0321j4493m44978j04297K4901j29351p4723
$$ 6147506 6341598 6444062 6056789 5986468 5971975 5526997 5422700 5447601 5318250 5243527
16582E243527L2646k80584m2773L768q4527l4999j10695K13100l99903Q2905k13977
$$ 5243527 5276173 4995589 4952816 4956584 4872057 4837058 4726363 4939463 4539560 4622465 4408488
16571D408488l06511K69443o0304M3381j03842k26852O3815n2790K07568l85961
$$ 4408488 4101977 4371420 4311116 4354497 4250655 4023803 4087618 4034828 4242396 3856435
16561C856435j58617J11317k03625K93634k09035j23197j46846L757K26308k18642
$$ 3856435 3697818 3809135 3605510 3899144 3690109 3566912 3420066 3423823 3650131 3431489
16551C431489o6915O5290l73711K64199j33984O7199l15708K73849N5443l72093
$$ 3431489 3364574 3429864 3056153 3320352 3186368 3253567 2937859 3211708 3267151 2895058
16541B895058J69477j84120J44156J7250m89222J44620K81998j17600j59742k66589
$$ 2895058 3064535 2880415 3024571 3041821 2552599 2697219 2979217 2861617 2701875 2435286
16531B435286P0129q5594J46175K00673m17299J32600o1672k6058j23048j78103
$$ 2435286 2505415 2419821 2565996 2766669 2349370 2481970 2420298 2394240 2271192 2093089
16521B093089L3784K86417k61239K73250J39927l18956l14514L55058j50071J76898
$$ 2093089 2126873 2413290 2152051 2425301 2565228 2246272 1931758 2286816 2136745 2313643
16511B313643l16033J13500j16096N5526J30496n8767J47793l91697J71520j70381
$$ 2313643 1997610 2111110 1995014 2050540 2181036 2122269 2270062 1878365 2049885 1879504
16501A879504J62630p5319k56387K58776L12824l34589k58104L19706j71161l58671
$$ 1879504 2042134 1966815 1710428 1969204 2282028 1947439 1689335 2009041 1837880 1479209
16491A479209J39825k10737j52788M02783k5031K7273K3022j7494J15293o1706
$$ 1479209 1619034 1408297 1255509 1658292 1633261 1660534 1683556 1666062 1781355 1719649
16481A719649J21156l61626K56959O5354m73891r1220J02236N33992m43867r2800
$$ 1719649 1840805 1479179 1736138 1801492 1327601 1236381 1338617 1872609 1428742 1335942
16471A335942p2211j11049L55671j38382L45399o3268n05221N45347l25823K15612
$$ 1335942 1263731 1152682 1508353 1369971 1715370 1652102 1146881 1692228 1366405 1582017
16461A582017j62999K62108k98994k30116J35303J58883p1166p5060m7532J84666
$$ 1582017 1419018 1681126 1382132 1152016 1287319 1446202 1375036 1299976 1252444 1437110
16451A437110m9757k96836j41925M6301K11375L76441n03691J35626j37173k02480
$$ 1437110 1387353 1090517 948592 994893 1206268 1582709 1079018 1214644 1077471 874991
16441H74991M63598l64532K52196j13471J22171k94381M81781j62167j2429L8571
$$ 874991 1338589 974057 1226253 1112782 1234953 940572 1422353 1260186 1247757 1286328
16431A286328m8628k41253L2083j14408J99906O7384m7377j32529q2189K26781
$$ 1286328 1237700 996447 1028530 914122 1114028 1181412 1134035 1001506 919317 1146098
16421A146098P1658m18125N29206l80985j15362O5969l1574J64982L9523K2632
$$ 1146098 1217756 799631 1328837 947852 832490 898459 866885 1031867 1071390 1094022
16411A094022l21021M24029m76028J27976j14374N22260n18895K62939J9817k09338
$$ 1094022 773001 1197030 721002 848978 734604 1256864 737969 1000908 1020725 811387
16401H11387R0806j90963K34950l5349j08600O6625J44569k50062p3896M2520
$$ 811387 902193 711230 946180 910831 802231 868856 1013425 763363 689467 731987
16391G31987J88656j54844J32980O5243j26333l24135N23043j07378m33950R8
$$ 731987 920643 765799 898779 964022 837689 513554 1036597 929219 495269 495367
16381D95367L16536j95342J75925L12701m16001J40312R0673k6905L9838j74395
$$ 495367 811903 616561 792486 1105187 689186 829498 920171 893266 933104 758709
16371G58709j30168j39525J28872N01837m95474L599R4001J24229N0090j09990
$$ 758709 628541 489016 617888 1119725 624251 627850 721851 846080 896170 786180
16361G86180l4309k0809Q5571k63071J57299L4925m8439q6117j71720N39153p1906
$$ 786180 751871 731062 816633 553562 710861 745786 697347 611230 439510 978663 906757
16350I06757k02006j07791j8230j98405J70755J02812j64211l9273J94938k04277
$$ 906757 704751 596960 578730 380325 551080 653892 489681 450408 645346 441069
16340D41069K54175m3252J07268k89898j25679L14385r6178k4669p1387K77349
$$ 441069 695244 651992 759260 469362 343683 658068 561890 537221 465834 743183
16330G43183q1745j61989p9769K08774o1559Q701J0268k8340j67889J99947k49562
$$ 743183 661438 499449 419680 628454 566895 575596 585864 557524 389635 589582 340020
16319C40020k4807K09367J7499j67694l4992M18658k79665J57980M7095m2172
$$ 340020 315213 524580 542079 374385 339393 758051 478386 636366 683461 641289
16309F41289j33190A75860M61850M8075K38809j56503k09641k40937K54323K4750
$$ 641289 508099 175860 637710 685785 924594 768091 558450 317513 571836 596586
16299E96586K18936k86778j87815K61129k08199L48083k40953j23341K7160M28975
$$ 596586 815522 528744 340929 602058 393859 741942 500989 377648 404808 833783
16289H33783C75589J71628j20551J89585j24313j64051M00177r8315j39038j0547
$$ 833783 375589 547217 426666 616251 491938 327887 728064 629749 490711 480164
16279D80164m0839l3810R758k7196M50651C13235r3768M53957I6250L71440K50600
$$ 480164 439325 405515 415273 388077 838728 313235 219467 673424 96250 467690 718290
16268G18290k62418j40181G695L27508j8389K70126j83606q3144j05517K06364
$$ 718290 455872 315691 7695 335203 316814 586940 403334 320190 214673 421037
16258D21037n4152R1279j27064k2187j3734A04924Q973N67885B38218Q3385q9796
$$ 421037 366885 458164 331100 308913 295179 104924 113897 681782 238218 321603 231807
16247B31807L39293q2010m3712j81455K41374J20518k51580A79561J685N80063
$$ 231807 571100 489090 445378 263923 505297 625815 374235 179561 181246 761309
16237G61309A00293M84268j36862B22584J72751A80362B3112M08899B11806M31101
$$ 761309 100293 584561 447699 222584 395335 180362 23112 432011 211806 642907
16227F42907A86073L43372B24278H5167c9495A31776M66096J24899l09153H4935
$$ 642907 186073 529445 224278 85167 -39495 131776 597872 722771 413618 84935
16216A43879K96814A60318J99637R0244j73857L5090B0634R6135J63073A32479
$$ 143879 440693 160318 359955 450199 276342 311432 20634 116769 279842 132479
16205B61602H3994K92845I2216M51506k36642R2506l5965A18821l3282l2388J59907
$$ 261602 83994 376839 92216 543722 307080 399586 363621 118821 85539 53151 213058
16194B13058L8945H8768k5276a1376D40214j20430m8617j9692J01289l0496l4129
$$ 213058 252003 88768 63492 -11376 440214 319784 271167 251475 352764 322268 288139
16183B88139j00242K86778k21560m1156j1417A00155b2563E07945j32451G8019
$$ 288139 187897 474675 253115 211959 200542 100155 -22563 507945 375494 78019
16172B83170A2571P18422A65448M24660k7562n5592A47730e2672G4473J91572
$$ 283170 12571 730993 165448 590108 562546 506954 147730 -52672 74473 266045
16162B66045I7602a81729A10775h309B80996n1471K90063c1546F1107M05880H4677
$$ 266045 97602 -181729 110775 -8309 280996 229525 519588 -31546 61107 466987 84677
16150B58183M3175p3052e2623A67413E1962L77348A93995J37379N2427l4151B2091
$$ 258183 301358 228306 -52623 167413 51962 429310 193995 331374 383801 349650 22091
16138A21225P3823J7155m826O6968J71756A42432K09187A45721e2037C68740J39845
$$ 121225 195048 212203 207377 274345 446101 142432 351619 145721 -52037 368740 508585
16127E08585p3005j71042A07501h2293B97606A24704b35916A25263J36087e5304
$$ 508585 435580 264538 107501 -82293 297606 124704 -235916 125263 261350 -55304
16116b46662g7288B34964D2419J48355E5104K56373a54703A29015L10959E4838
$$ -246662 -77288 234964 42419 190774 55104 311477 -154703 129015 439974 54838
16105A19346k2831L1308K13789j58057L9119K6378d7886A12069J44590J43163
$$ 119346 96515 127823 341612 183555 222674 249052 -47886 112069 256659 399822
16095C99822A90551f2303A06980K35141a61988M9359c5182A85728q5950J8823
$$ 399822 190551 -62303 106980 342121 -161988 -112629 -35182 185728 99778 118601
16085A18601J47324a1948C57392D2341J93552n8008i3067C29137A00340b3091
$$ 118601 265925 -11948 357392 42341 235893 177885 -93067 329137 100340 -23091
16074A93582L64075I2456a72658l23617B12873J8918j4536f4409l2513i728B43481
$$ 193582 557657 92456 -172658 -496275 212873 231791 217255 -64409 -96922 -9728 243481
16062d2119H3344a24739G6434O2499f7545F3765L890L0850P8857h0768A13113
$$ -42119 83344 -124739 76434 138933 -67545 63765 67655 98505 177362 -80768 113113
16050A59835l4351L40332f8732D9594k0507N3610N9127m5812J93119h8563B44805
$$ 159835 125484 465816 -68732 49594 29087 82697 141824 96012 289131 -88563 244805
16038A17761b12675C5221a33682e2310A27145P5524E7500J81801a14375o5740
$$ 117761 -212675 35221 -133682 -52310 127145 202669 57500 239301 -114375 -180115
16028a80115h948G9053b2452k39779F05240C01936C3614a49087k11966B14856
$$ -180115 -8948 79053 -22452 -262231 605240 301936 33614 -149087 -361053 214856
16017d576B46111a6048B78066b47763F2554l929M0951b24558B40632a97340C6881
$$ -4576 246111 -16048 278066 -247763 62554 58625 99576 -224558 240632 -197340 36881
16005A78389a73883D85656C8596b20563A00384M0656c11058B32374b956j20435
$$ 178389 -173883 485656 38596 -220563 100384 141040 -311058 232374 -2956 -123391
15995a23391d9090F7091M0153B254K75352A30083a96957d2798j45043i2941H9225
$$ -123391 -49090 67091 107244 2254 277606 130083 -196957 -42798 -187841 -92941 89225
15983b56406D8916L6125E777J94726K3981B0394L6134J54310l1673L39106K4228
$$ -256406 48916 85041 5777 200503 224484 20394 56528 210838 179165 518271 542499
15972E42499n03K63203K75317J44962n4006n30984k94628O9980m1047A31942J48695
$$ 542499 541996 805199 1080516 1225478 1171472 640488 345860 415840 374793 131942 280637
15961B80637R7576j63393r8890C7320J37668a2514l8056g606A36720g414j9170
$$ 280637 378213 214820 115930 37320 174988 -12514 -50570 -7606 136720 -7414 -26584
15950b6584n7651A06636i8072F658M4324c38578A19276K58104H4031b08766F9090
$$ -26584 -84235 106636 -98072 6658 50982 -338578 119276 377380 84031 -208766 69090
15938f2828A45223h0236A77996J13529A21235b36902A6505J1328J24754h1582
$$ -62828 145223 -80236 177996 291525 121235 -236902 16505 27833 152587 -81582
15927i7693a3667j05468k31843I933a89055d924j3158k35324a621q4640j64342
$$ -97693 -13667 -119135 -350978 9933 -189055 -4924 -18082 -253406 -1621 -86261 -250603
15916b50603J02J25117c185q1165k4335m9973c3999o8462A0445k463R5660f3830
$$ -250603 -250501 -125384 -3185 -84350 -108685 -158658 -33999 -102461 10445 7982 103642 -63830
15903b91653A75949a08565r9739B58743E265b11832b0311j49232D2406M8720J47768
$$ -291653 175949 -108565 -208304 258743 5265 -211832 -20311 -169543 42406 91126 238894
15892B38894f9062k98476N6622E7876J94759r7666m8431l7017M5195i7162R221
$$ 238894 -69062 -367538 -310916 57876 252635 154969 106538 69521 114716 -97162 -87941
15881h7941d554j33061p8200o3141a00380A68627a48325A26105P35D3082R0227
$$ -87941 -4554 -137615 -215815 -278956 -100380 168627 -148325 126105 126840 43082 133309
15870A33309a51943p3413A62203K0341C1667e1689E1749J27806C0760P3853a30054
$$ 133309 -151943 -225356 162203 182544 31667 -51689 51749 179555 30760 104613 -130054
15858A70531P2744b52192p7604F7046M4078d767k12974A75386E6624e3445B0615
$$ 170531 243275 -252192 -329796 67046 111124 -4767 -217741 175386 56624 -53445 20615
15846C7998J09465g7819I5017g0704D1193J66133i8977j28591b7491B09045Q2667
$$ 37998 147463 -77819 95017 -70704 41193 207326 -98977 -227568 -27491 209045 291712
15835B91712d2184j77923A87610c9384j97059A31091a26366j32518E7544J41227
$$ 291712 -42184 -220107 187610 -39384 -236443 131091 -126366 -258884 57544 198771
15825A98771e1958H2388b85550P8188B85548a9007A04405N4378a34570i33j06491
$$ 198771 -51958 82388 -285550 -207362 285548 -19007 104405 158783 -134570 -933 -107424
15814a07424C17468j51810H2251l0694O9198i2423j48889A77412C7480a04464
$$ -107424 317468 165658 82251 51557 120755 -92423 -241312 177412 37480 -104464
15803a05526d1145C7510N0186a10312B3734b4068j65620C8346N22617b3027B46359
$$ -105526 -41145 37510 87696 -110312 23734 -24068 -189688 38346 560963 -23027 246359
15791c39566J01413N701g5022L1131A3944h2302j14878j10742a0991j80111j85468
$$ -339566 -238153 -232452 -75022 -43891 13944 -82302 -197180 -307922 -10991 -191102 -376570
15780c76570F6081P8628F0418a77122j25208D9589J55472A1590a00151A63052
$$ -376570 66081 144709 60418 -177122 -302330 49589 205061 11590 -100151 163052
15769A07092M34h4195A73082p1436a9483A00766R3863J5446g055H1457d21599
$$ 107092 107526 -84195 173082 101646 -19483 100766 194629 210075 -7055 81457 -421599
15757a02195q9886d813o0115m2729A4322a98835e1927I1053R708i9432k18634
$$ -102195 -192081 -4813 -64928 -107657 14322 -198835 -51927 91053 100761 -99432 -318066
15746c18066A26850b13731A4066L44086a74307k6974B76072q9615D803h6931j8587
$$ -318066 126850 -213731 14066 358152 -174307 -201281 276072 186457 4803 -86931 -105518
15735a05518A32083k1247l6386a71750G1427M81J14326p6339Q0719c1896k31399
$$ -105518 132083 110836 74450 -171750 71427 71908 186234 109895 190614 -31896 -263295
15724b63295h1940M0064j88942D8023e5351G8887c02241J02416i6407B9821a22820
$$ -263295 -81940 -41876 -230818 48023 -55351 78887 -302241 -199825 -96407 29821 -122820
15712d2234o7158A38896O0799a78074H01J35335a12697k9807A11274h8918J83
$$ -42234 -109392 138896 199695 -178074 801 136136 -112697 -142504 111274 -88918 -88735
15701h8735k67889a11313D8078b26255A15115a9540o4405j11504Q7059p6833E5022
$$ -88735 -356624 -111313 48078 -226255 115115 -19540 -83945 -195449 -108390 -185223 55022
15689b39207D444J78997K0151a13022o2756C20323g8188C7480a13997A72619J49
$$ -239207 4444 183441 203592 -113022 -175778 320323 -78188 37480 -113997 172619 172768
15678A72768J9034a78394K456J0428A37729M4124a70168E1868e7480k47859P7716
$$ 172768 191802 -178394 -175938 -165510 137729 181853 -170168 51868 -57480 -305339 -227623
15667b27623B99330D1657L1490A5858N0390R2888E1956j4154L5644a55802A69913
$$ -227623 299330 41657 73147 15858 66248 159136 51956 37802 73446 -155802 169913
15655A71739l0606C3878P5301b478E15989b54390C52529B1040K8262P2239O6866
$$ 171739 141133 33878 109179 -2478 515989 -254390 352529 21040 49302 121541 188407
15644A88407d8442m2626A1089K2365a97986A9934f1275B16131A05067f0853j98404
$$ 188407 -48442 -91068 11089 33454 -197986 19934 -61275 216131 105067 -60853 -259257
15633b59257M5156h569j48812q8872a9363j56057C93180j20365a00405k1461A99196
$$ -259257 -214101 -8569 -157381 -246253 -19363 -175420 393180 272815 -100405 -121866 199196
15621c5157j20289G4084e8518I2311a75537g6616q9604f5299I3104b65430a19070
$$ -35157 -155446 74084 -58518 92311 -175537 -76616 -166220 -65299 93104 -265430 -119070
15609b66312c614j37666A03192C9819a62347J2767j25186a6622j18093A26259
$$ -266312 -3614 -141280 103192 39819 -162347 -149580 -274766 -16622 -134715 126259
15598F3352d3155J4390C52768C3333a50465r0688K4391P911A23769d46522h0707
$$ 63352 -43155 -28765 352768 33333 -150465 -241153 -216762 -208851 123769 -446522 -80707
15586b36202I5555J10849a05839I1137b13444i0932o1787H5316a54019G5731a69489
$$ -236202 95555 206404 -105839 91137 -213444 -90932 -152719 85316 -154019 75731 -169489
15574eA27489a84412Q7982A3490a4887l46368A6772a13409A91235M2521G8629
$$ -5 127489 -184412 -96430 13490 -14887 -361255 16772 -113409 191235 233756 78629
15562g3869b1625m5985a461k94729B3217a51213n5160e748m4762l19986J03080
$$ -73869 -21625 -67610 -1461 -296190 23217 -151213 -206373 -5748 -50510 -370496 -267416
15551b67416A59783a51537A85185B5454J74302p5213j5837K84469c01795A20462
$$ -267416 159783 -151537 185185 25454 199756 124543 108706 393175 -301795 120462
15540a11030c2128B03873E2820D014K05926m9834D8297J5611k7543e8440l8697
$$ -111030 -32128 203873 52820 4014 209940 160106 48297 63908 36365 -58440 -97137
15529i7137J0694A65414b27234I9626d3695k48063A03526b067B89062a83150j07399
$$ -97137 -86443 165414 -227234 99626 -43695 -291758 103526 -2067 289062 -183150 -290549
15518b90549b4299p1110j17675B50664b5875B16494e9814j9942C17972m4953B8753
$$ -290549 -24299 -95409 -213084 250664 -25875 216494 -59814 -79756 317972 273019 28753
15506B85807H3120b3884B24701a02470b899j86212A97097J2230D9686Q9143a7543
$$ 285807 83120 -23884 224701 -102470 -2899 -189111 197097 209327 49686 138829 -17543
15494I5449k3116J79995q4153h3066B51168A16462P1588h8360b4580B19924H4360
$$ 95449 72333 252328 168175 -83066 251168 116462 188050 -88360 -24580 219924 84360
15482B71960h434j6056B97526o4218a5687A78894n508j1018e1448A4697b0440
$$ 271960 -8434 -24490 297526 233308 -15687 178894 173386 162368 -51448 14697 -20440
15470a56231F78P0112b76154a28932A4537J51328A9625J03953P0875n1368M33012
$$ -156231 678 70790 -276154 -128932 14537 165865 19625 123578 194453 143085 576097
15459E76097k06969M10911k17745j17450O6767J15564F9590J95991a05981C18389
$$ 576097 369128 780039 562294 444844 511611 627175 69590 265581 -105981 318389
15448a36380A40154b6021R039D8036B1363a13372k03816b5165k9007k8935D00199
$$ -136380 140154 -26021 -16982 48036 21363 -113372 -317188 -25165 -54172 -83107 400199
15436b07853D850O8528a38855A62024J14812K38190j20023J45591j0929M3075
$$ -207853 4850 73378 -138855 162024 276836 515026 395003 540594 529665 572740
15426E72740M80295P8652P8197n33874k32766i5338C6441L49953l2065b5689J0966
$$ 572740 1053035 1131687 1209884 676010 443244 -95338 36441 386394 354329 -25689 -14723
15415a4723A15056f0676m0152a5899j6385C41617i7349k13906A85807C661i1872
$$ -14723 115056 -60676 -100828 -15899 -32284 341617 -97349 -311255 185807 3661 -91872
15403a42825A78948f4266F7089N2680e9814A07504i0190c3681n4326q9791g1315
$$ -142825 178948 -64266 67089 119769 -59814 107504 -90190 -33681 -88007 -177798 -71315
15391A98939M8073a36415C9353J5637b03370B39635b11741I1280b69595k016B62124
$$ 198939 247012 -136415 39353 54990 -203370 239635 -211741 91280 -269595 -271611 262124
15379a58913C02257b40376N4916l896j10419B30132o538l4410J98510K7589H7020
$$ -158913 302257 -240376 -185460 -189356 -299775 230132 223594 189184 387694 415283 87020
15367B25732i7440D5781g818A00402K9624i7280D02628a3651D25451j69416A25450
$$ 225732 -97440 45781 -7818 100402 130026 -97280 402628 -13651 425451 256035 125450
15355E01872g1364C40659g5578j21647B83047A02322K10471a60270A03318a0755
$$ 501872 -71364 340659 -75578 -197225 283047 102322 312793 -160270 103318 -10755
15344E96396B82549a3401A10512J03655L64421k06810e2424A11837g9080C72770
$$ 596396 282549 -13401 110512 214167 578588 371778 -52424 111837 -79080 372770
15333A18041K26414h4417L4981K4525B71217D8274K1630L13616A44567J077O6333
$$ 118041 344455 -84417 -49436 -24911 271217 48274 69904 383520 144567 145644 211977
15322B11977E0079O4070J8098M7231b4443B23734m7608J83683b2527A10361K69233
$$ 211977 50079 114149 132247 179478 -24443 223734 176126 359809 -22527 110361 379594
15311C79594a89504A11429J11174e6663D96981H6097a69047L3413D6977A0514
$$ 379594 -189504 111429 222603 -56663 496981 86097 -169047 -135634 46977 10514
15300B74533A13663e3635E44733C2858K44992N8906e0359B08549f47A17817A1509
$$ 274533 113663 -53635 544733 32858 277850 336756 -50359 208549 -647 117817 11509
15288a9170A01963N4726P1454M229A02634K71536A38671F5436J91112A13853k767
$$ -19170 101963 156689 228143 232372 102634 374170 138671 65436 256548 113853 111086
15277A11086j787L7146a35498B9773M56b7475A4134d426j47916j21219C72719
$$ 111086 109299 146445 -135498 29773 30229 -27475 14134 -4426 -152342 -273561 372719
15265e1788A76872A9091a91965F7238K45003E8093f8948F1093J15893g4485C06082
$$ -51788 176872 19091 -191965 67238 312241 58093 -68948 61093 176986 -74485 306082
15253D44708h9170k12325e9339A78080a18400B55574b27913C36046D2992a17266
$$ 444708 -89170 -301495 -59339 178080 -118400 255574 -227913 336046 42992 -117266
15242F9622M848g9084A05085R5600e1981R560A47552F3356J70685b9907C07866
$$ 69622 74470 -79084 105085 200685 -51981 -42421 147552 63356 234041 -29907 307866
15230B66174q9117K60643R8769P40069K07246k42235J53395k98612D14181A85068
$$ 266174 177057 437700 536469 1276538 1483784 1241549 1394944 1096332 414181 185068
15219C38890p874P7497A40283A3646c2055I1373l1388N2969K7548K43170g4500
$$ 338890 331016 408513 140283 13646 -32055 91373 59985 112954 140502 383672 -74500
15207B09604o878n2670d7442A16205J37662i506A33640a83472C67008o8075a07722
$$ 209604 202726 150056 -47442 116205 253867 -9506 133640 -183472 367008 298933 -107722
15195A38445L3779a93455A01842J73186c8227a7877f819o5393D8051b8944A54030
$$ 138445 172224 -193455 101842 275028 -38227 -17877 -6819 -72212 48051 -28944 154030
15183e2409n7410B10865n4933R0531M995o6623e7738C64160C2414K20773E7934
$$ -52409 -109819 210865 155932 246463 251458 184835 -57738 364160 32414 253187 57934
15171F4123Q9432e6141A9510J70889K15014C9205K9025L4166a24987K3498C8915
$$ 64123 153555 -56141 19510 190399 405413 39205 68230 102396 -124987 -101489 38915
15159A26634b8310D2457O8930q806j1060h4481B99394b08057B10997b41355d5
$$ 126634 -28310 42457 111387 102581 91521 -84481 299394 -208057 210997 -241355 -45
15147b80983f0194H9544J12747a45605a3619A02243a74348A31443l4399a644B41509
$$ -280983 -60194 89544 202291 -145605 -13619 102243 -174348 131443 97044 -1644 241509
15135E0594b30317E4764J56391c33017A88302B2993J74956B6802D517L92081b3842
$$ 50594 -230317 54764 211155 -333017 188302 22993 197949 26802 4517 396598 -23842
15123A05925K43020A52263E1913J52458h978C72072I3843C6020b01004A17f2335
$$ 105925 348945 152263 51913 204371 -8978 372072 93843 36020 -201004 117 -62335
15111D4807K05720j18495J29142o1077R3822O2596j15253O2446A17291b7819D30970
$$ 44807 250527 132032 261174 200097 293919 356515 241262 303708 117291 -27819 430970
15099B05091q92b6378A31064J40508A32135b4617A80329J24218D8533L9176D3196
$$ 205091 204199 -26378 131064 271572 132135 -24617 180329 304547 48533 87709 43196
15087A84905J01710i1789C63297H3854l238a99369A16107K19280o5022E1378K6566
$$ 184905 286615 -91789 363297 83854 80616 -199369 116107 335387 270365 51378 77944
15076G7944a4089a799j98772B29932J7303n4184q169G6644B2062J32011b4221
$$ 77944 -14089 -1799 -200571 229932 247235 193051 184882 76644 22062 154073 -24221
15064A64797a29973A48957m2613e4215m6426A02631J70447h1578C37854J7400
$$ 164797 -129973 148957 106344 -54215 -100641 102631 273078 -81578 337854 355254
15054C55254E6904K8544R565K74463b0168k72120A42478R9527o9394K9022L12414
$$ 355254 56904 85448 95013 369476 -20168 -292288 142478 242005 172611 201633 514047
15043E14047j98436j48623J50662A22168B7088L43421D6738J12386a07113D32307
$$ 514047 315611 166988 317650 122168 27088 370509 46738 159124 -107113 432307
15032D42613j41530J09476n5737J24727J54347k82830j26052K47801H1485K60208
$$ 442613 301083 410559 354822 479549 633896 351066 225014 472815 81485 341693
15022C41693K81441B32432K02107j33707m3169L93387k24206J17267L21638l98250
$$ 341693 623134 232432 434539 300832 257663 651050 426844 544111 865749 467499
15012D67499j45157L23984o6256J07976m0552k19870J54247k9109j0395J73700
$$ 467499 322342 646326 580070 688046 647494 427624 581871 552762 542367 716067
15002G16067G0146K21321L57136j02664B18111E0964M20954k04384J39722r6067
$$ 716067 70146 291467 648603 545939 218111 50964 471918 267534 407256 311189
14992C11189M20087q9606B28427n2599M5800J68070D3005N86996B08728R7012
$$ 311189 731276 641670 228427 175828 221628 389698 43005 630001 208728 305740
14982C05740J09409A59400M19547k12360q97l8516K2510k6532K48287j28264L22171
$$ 305740 415149 159400 578947 366587 365690 327174 349684 323152 571439 443175 765346
14971G65346l24672K5796J26712k26094J36134L57533l2453J00232j32822j30412
$$ 765346 440674 466470 593182 367088 503222 860755 828302 928534 795712 665300
14961F65300C01538M34322l55051L47392l39138K93940B39845M67929l31054Q5165
$$ 665300 301538 735860 380809 728201 389063 683003 239845 707774 376720 461885
14951D61885N3187b3550D69393J92718j72579j7579B4603N53373k23078A18456
$$ 461885 515072 -23550 469393 662111 489532 471953 24603 577976 354898 118456
14940C66452d1052B79774J34386j47358J9323K95135B76795L4203R6809P646J8356
$$ 366452 -41052 279774 414160 266802 286125 581260 276795 310998 407807 415453 433809
14929D33809O4170R6157J17331J99872k76067J29239k08308j84141L18586k04504
$$ 433809 497979 594136 711467 911339 635272 764511 556203 372062 690648 486144
14919D86144J01687j39623M00317J53886J25215J90518k57863L49397J39737O0983
$$ 486144 587831 448208 848525 1002411 1127626 1318144 1060281 1409678 1549415 1610398
14909A610398o7245j15677K01626n7942m0332J20306L71506P4138L86710m27768
$$ 1610398 1543153 1427476 1629102 1571160 1530828 1651134 2022640 2096778 2483488 2055720
14899B055720r4395l30012k45192l2538m57904P2131k88989Q525j60541M38032
$$ 2055720 1961325 1631313 1386121 1353583 895679 967810 678821 687346 526805 964837
14889I64837k31186l06919j3582j1549j57939K36333j08360A69441J08997J32848
$$ 964837 733651 426732 413150 401601 243662 479995 371635 169441 278438 411286
14879D11286j11780L2627p7765L42228J35345k58202k30628N3644M35137k01708
$$ 411286 299506 332133 254368 596596 731941 473739 243111 296755 731892 530184
14869E30184o8950J50194L27237k70705r9747K99415K96118E80496O7146J43312
$$ 530184 461234 611428 938665 667960 568213 867628 1163746 580496 647642 790954
14859G90954k22377K3673j71035J4842J17504J9488j5468N6887j12433j38556
$$ 790954 568577 592250 421215 436057 553561 573049 557581 614468 502035 363479
14849C63479K83125j34162K16634j7009k72714A69504J50824M43762l79796R9370
$$ 363479 646604 512442 729076 712067 439353 169504 320328 764090 384294 483664
14839D83664k621o7040P6810L22434l37645J12204k83860J29207K09839J26352
$$ 483664 481043 414003 490813 813247 475602 587806 303946 433153 642992 769344
14829G69344K27031o9461o8323J50697r6281j41J64304J79012n84355J59617k78777
$$ 769344 996375 926914 858591 1009288 913007 912866 1077170 1256182 671827 831444 552667
14818E52667L70469l80825L7857n1285N8167Q2278k0554n1415k34455L69397j83828
$$ 552667 923136 542311 580168 528883 587050 669328 648774 597359 362904 732301 548473
14807E48473o2837N4254j34768J25678O2696J09777K67624J22909k54442L13324
$$ 548473 485636 539890 405122 530800 593496 703273 970897 1093806 839364 1152688
14797A152688E37382L05785p2470K39638m14862K48405L24271l05767J04609j7498
$$ 1152688 537382 843167 770697 1010335 595473 843878 1168149 862382 966991 949493
14787I49493j31019J87759m94037K00961k21827R0260n2234J87819P2360l10068
$$ 949493 818474 1006233 512196 713157 491330 581590 529356 717175 789535 479467
14777D79467A00087L83184Q3958P2058k03865M51586m21905K1819L05542p8723
$$ 479467 100087 483271 567229 639287 435422 887008 465103 486922 792464 713741
14767G13741n1943k30408K83673K19784l43757L30996l9966M2065j20287o4047
$$ 713741 661798 431390 715063 934847 591090 922086 882120 924185 803898 739851
14757G39851J41378q6626n5212k98594N78018j30365l78368K05183m8988k003
$$ 739851 881229 794603 739391 440797 1018815 888450 510082 715265 666277 664274
14747F64274J13849j49281J30743j37830N5692j15973o5804J64644j49440J29393
$$ 664274 778123 628842 759585 621755 677447 561474 495670 660314 510874 640267
14737F40267q8580J03709M5953l03856K38360o3190J16313k08138K15112Q9435
$$ 640267 551687 655396 701349 397493 635853 572663 688976 480838 695950 785385
14727G85385m5370k24597M26006k26786J38365L636j92582R2050N20304l96048
$$ 785385 740015 515418 941424 714638 853003 856639 664057 756107 1276411 880363
14717H80363j89220L99960j56111M5682M73498L96472m3854j65381j9676L8657
$$ 880363 691143 1091103 934992 980674 1454172 1850644 1806790 1641409 1621733 1660390
14707A660390l10938l01677j88004N9404k08877M37370k68375o7020J81356m26620
$$ 1660390 1349452 1047775 859771 919175 710298 1147668 879293 812273 993629 567009
14697E67009P48041m40295L05781l54408K07864J11058l41078O14832j77206K35732
$$ 567009 1315050 874755 1180536 826128 1033992 1145050 803972 1418804 1241598 1477330
14687A477330J4487J46261N8749R1666p069l05302n89211O19163n84590K52006
$$ 1477330 1491817 1638078 1696827 1788493 1781424 1476122 886911 1506074 921484 1173490
14677A173490j94806l31619J88893L8529O4496L2898J58427k83164J06638j5950
$$ 1173490 978684 647065 835958 874487 938983 971881 1130308 847144 953782 937832
14667I37832K79803m8789k41304J6147P2553o2208L5038j60558k3205K76310J17771
$$ 937832 1217635 1168846 927542 943689 1016242 954034 989072 828514 805309 1081619 1199390
14656A199390k92480K62844j91031R9266J06383n8525q8636o9672O9487q8071
$$ 1199390 906910 1169754 978723 1077989 1184372 1125847 1037211 967539 1037026 948955
14646I48955N7975J46010K05014n4501n35131J20141K96278J88568j38841K07875
$$ 948955 1006930 1152940 1357954 1303453 768322 888463 1184741 1373309 1234468 1442343
14636A442343J52342j98886k1339k25910O4397K33973l33852N8711n2929L0226
$$ 1442343 1594685 1395799 1374460 1148550 1212947 1446920 1113068 1171779 1118850 1149076
14626A149076k49508K49417R0242k1694L19132k66986J02637J2664l60149K20940
$$ 1149076 899568 1148985 1239227 1217533 1536665 1269679 1372316 1384980 1024831 1245771
14616A245771k3804L84471p18166L80716L14382J4743k74755J21729j15080Q5086
$$ 1245771 1221967 1606438 888272 1268988 1583370 1598113 1323358 1445087 1330007 1415093
14606A415093o0863M5229j12554K36884m6851j61606j02813L24122L4595O584
$$ 1415093 1354230 1399459 1286905 1523789 1476938 1315332 1212519 1536641 1571236 1577820
14596A577820j48864M13622l28387K97180l77108l6923J24533q5235O3224k8408
$$ 1577820 1428956 1842578 1514191 1811371 1434263 1397340 1521873 1436638 1499862 1471454
14586A471454K19356k25469L3847p6358L51445p1342k03192N6016K08470j15777
$$ 1471454 1690810 1465341 1499188 1422830 1774275 1702933 1499741 1555757 1764227 1648450
14576A648450q2452L19167J18248l74077L20343j84506j7502K71580o4050K3098
$$ 1648450 1565998 1885165 2003413 1629336 1949679 1765173 1747671 2019251 1955201 1978299
14566A978299j95366J93907p1145q0341K59171r7548J14936L5225K91321j83298
$$ 1978299 1782933 1976840 1905695 1825354 2084525 1986977 2101913 2137138 2428459 2245161
14556B245161k6289o9497j75737K80915J78923n0454M321J01021j70373O6321
$$ 2245161 2218872 2149375 1973638 2254553 2433476 2383022 2387343 2488364 2317991 2384312
14546B384312L89860K4632k2659J85948M27970K02402O1237R2518O75310Q48559
$$ 2384312 2774172 2798804 2776145 2962093 3390063 3592465 3653702 3746220 4421530 5270089
14536E270089P24098Q26966K659959L149669O752435R960598O320609j5029766
$$ 5270089 5994187 6821153 9481112 12630781 19383216 29343814 35664423 20634657
14528B0634657q744768m506647k457336q37931k32034M52984Q59622p28014j034603
$$ 20634657 11889889 7383242 4925906 4087975 3855941 4308925 5168547 4440533 3405930
14519C405930r91459q0879J08395J0585P7731m57556M34794k49186J01493j80284
$$ 3405930 2414471 2333592 2441987 2452572 2530303 2072747 2507541 2258355 2359848 2179564
14509B179564M51787l55907J62863K04424k20125k6220j69587K65339O3516J77405
$$ 2179564 2631351 2275444 2438307 2642731 2422606 2396386 2226799 2492138 2555654 2733059
14499B733059L0457k4789l33720N66163M9986l02552K3367K07589m6529R0533
$$ 2733059 2763516 2738727 2405007 2971170 3021156 2718604 2741971 2949560 2903031 2993564
14489B993564R3679r914j26110L99119l59032K33817J85096j52015J05657P5672
$$ 2993564 3087243 3077329 2951219 3350338 2991306 3225123 3410219 3258204 3363861 3439533
14479C439533m832j42872J32664J53520p2474J32473j60624J21061K18716j97044
$$ 3439533 3434701 3291829 3424493 3578013 3505539 3638012 3477388 3598449 3817165 3620121
14469C620121R985Q8971j7430J35716J73720J26243p0750l1682L61933k93515
$$ 3620121 3630106 3719077 3701647 3837363 4011083 4137326 4066576 4034894 4396827 4103312
14459D103312K41980K25516l96222L64833o9975n3791j3551Q6806Q602n239J41827
$$ 4103312 4345292 4570808 4174586 4539419 4469444 4415653 4402102 4488908 4497510 4492271 4634098
14448D634098k5898L64323j6392j71529K17607J5189K46257K9106l86863M61128
$$ 4634098 4608200 4972523 4956131 4784602 5002209 5017398 5263655 5292761 4905898 5367026
14438E367026k95884M04483J79758j87134n2303J51344o3856K67654n8402K19637
$$ 5367026 5071142 5475625 5655383 5468249 5415946 5567290 5503434 5771088 5712686 5932323
14428E932323n4881J6442K65228K06950m2932j91045M16984j2352J49420j3412
$$ 5932323 5877442 5893884 6159112 6366062 6323130 6132085 6549069 6536717 6686137 6672725
14418F672725L44137j59037M70193m89973K74557j80313N45214K03608R2929k59533
$$ 6672725 7016862 6857825 7328018 6838045 7112602 6932289 7477503 7681111 7774040 7514507
14408G514507M07883R4429o4923N74638J07182J76565j83085L29786k94229M56403
$$ 7514507 7922390 8016819 7951896 8526534 8633716 8810281 8627196 8956982 8662753 9119156
14398I119156j05047K73460J59511k73373M91157j47184N09662n6327J79902R9694
$$ 9119156 9014109 9287569 9447080 9173707 9664864 9517680 10027342 9971015 10150917 10250611
14388A0250611K47580L56052R6588J3494O4981o509L03931K19740M9583K01669
$$ 10250611 10498191 10854243 10950831 10964325 11029306 11022797 11326728 11546468 11596051 11797720
14378A1797720P6619M04649J95213k17363K92111N70917N73112n5456J64573K61600
$$ 11797720 11874339 12278988 12474201 12256838 12548949 13119866 13692978 13637522 13802095 14063695
14368A4063695M41118n5792N52553N45624K28395N78774l02612N41081q6077M92785
$$ 14063695 14504813 14449021 15001574 15547198 15775593 16354367 16051755 16592836 16506759 16999544
14358A6999544K71819N06797K9517M81639N90646J02138O03387P81427K94016
$$ 16999544 17271363 17778160 17807677 18289316 18879962 18982100 19585487 20366914 20660930
14349B0660930K12397N24943N70948K78286L28013N50974O38558R1744O32114
$$ 20660930 20873327 21398270 21969218 22247504 22575517 23126491 23765049 23856793 24488907
14340B4488907P42593O83697J94586P99966Q09861P93944K59323J273304N93812
$$ 24488907 25231500 25915197 26109783 26909749 27719610 28513554 28772877 30046181 30639993
14331C0639993P39338Q73288Q29431Q41454Q44069R44731J469603O87553R71944
$$ 30639993 31379331 32252619 33082050 33923504 34767573 35712304 37181907 37869460 38841404
14322C8841404J264043R83130J647381P15139J285895J591615J355040J481967
$$ 38841404 40105447 41088577 42735958 43451097 44736992 46328607 47683647 49165614
14314D9165614J392181K187452J534093J853562J823916K278530K004785J897576
$$ 49165614 50557795 52745247 54279340 56132902 57956818 60235348 62240133 64137709
14306F4137709K419394K645756K305291K495369K862283L448702L040894K753904
$$ 64137709 66557103 69202859 71508150 74003519 76865802 80314504 83355398 86109302
14298H6109302L684881L800391L582392M003533M473609M635959M915512N032446
$$ 86109302 89794183 93594574 97176966 101180499 105654108 110290067 115205579 120238025
14290A20238025N769023N821276N843798O750940P039786P835636P704395Q206406
$$ 120238025 126007048 131828324 137672122 144423062 151462848 159298484 167002879 175209285
14282A75209285Q850817R372134R674600J0571188J1067786J1622947J2368633
$$ 175209285 184060102 193432236 203106836 213678024 224745810 236368757 248737390
14275B48737390J2775518J3567875J4290407J3709585J4473942J4540271J4766592
$$ 248737390 261512908 275080783 289371190 303080775 317554717 332094988 346861580
14268C46861580J4312593J4317979J4072543J3655341J1631452J0854372R387256
$$ 346861580 361174173 375492152 389564695 403220036 414851488 425705860 435093116
14261D35093116Q166474Q095568P349118N133306K586181N72449J143871k31752
$$ 435093116 443259590 451355158 458704276 463837582 466423763 466996212 468140083 467908331
14253D67908331p958515n714925n475143j1278800j1509638j2525229j3396316
$$ 467908331 459949816 454234891 448759748 437480948 425971310 413446081 400049765
14246D00049765j3904585j4416987j3522325j3818336j4201194j4193014j3224581
$$ 400049765 386145180 371728193 358205868 344387532 330186338 315993324 302768743
14239C02768743j3358500j3271781j2214900j2313919j1245540j1094176j0697405
$$ 302768743 289410243 276138462 263923562 251609643 240364103 229269927 218572522
14232B18572522j0507309j0793574j0092909q926733q621642q640417p787058
$$ 218572522 208065213 197271639 187178730 178251997 169630355 160989938 153202880
14225A53202880p448381o666561o050510o263385n533500n186761n187249m663576
$$ 153202880 145754499 139087938 133037428 126774043 121240543 116053782 110866533 106202957
14217A06202957m275977m043766l863193l890747l567877l254125l114659l234434
$$ 106202957 101926980 97883214 94020021 90129274 86561397 83307272 80192613 76958179
14209G6958179k791132k600724k690809k309726k013801k312944k029228k309591
$$ 76958179 74167047 71566323 68875514 66565788 64551987 62239043 60209815 57900224
14201E7900224j602989j807665j792987j537471j456908j243046j622361j629850
$$ 57900224 56297235 54489570 52696583 51159112 49702204 48459158 46836797 45206947
14193D5206947j043730q08623j482149j043017j460577q32956j164947j295836
$$ 45206947 44163217 43354594 41872445 40829428 39368851 38535895 37370948 36075112
14185C6075112n09276r94532j058661o47925r62865o92867p68017n66326j035891
$$ 36075112 35565836 34571304 33512643 32864718 31901853 31208986 30440969 29874643 28838752
14176B8838752o34924m40264o73966r57404q652j165240o01937k79546o72621
$$ 28838752 28203828 27763564 27089598 26132194 26123542 24958302 24356365 24076819 23404198
14167B3404198n38918j14267o31978p68673o09663j06429l59560k89047l41717
$$ 23404198 22865280 22751013 22119035 21350362 20740699 20634270 20274710 19985663 19643946
14158A9643946o58320j82339m71380j09004m14124k64241m66090m97097K584l19723
$$ 19643946 18985626 18803287 18331907 18222903 17808779 17544538 17078448 16581351 16583935 16264212
14148A6264212n50791R223l12368n31295n47744r4893Q9503k42239l74348k24712
$$ 16264212 15713421 15722644 15410276 14878981 14331237 14236344 14325847 14083608 13709260 13484548
14138A3484548j51862k67575n2988l84871k92691J14736l40298j96050l25784
$$ 13484548 13332686 13065111 13012123 12627252 12334561 12449297 12108999 11912949 11587165
14129A1587165K48733l27015j50453n27394L93133m14116j73183l76467q3058
$$ 11587165 11835898 11508883 11358430 10831036 11224169 10810053 10636870 10260403 10177345
14120A0177345p5070k28551J93186m50521j08053k48679j29162k73989R6996J29366
$$ 10177345 10102275 9873724 10066910 9616389 9508336 9259657 9130495 8856506 8953502 9082868
14110I082868n32158L45900l26067n3249k09284j30382j64759k2590l69362J66663
$$ 9082868 8550710 8896610 8570543 8517294 8308010 8177628 8012869 7990279 7620917 7787580
14100G787580j51706R3440j35031k52320L14668p73601K84579j35242q5418l13372
$$ 7787580 7635874 7729314 7594283 7341963 7656631 6883030 7167609 7032367 6946949 6633577
14090F633577k521j48767k95426L80166l88267K96800j99899K17007o40217N0531
$$ 6633577 6631056 6482289 6186863 6567029 6178762 6475562 6275663 6492670 5852453 5902984
14080E902984L71777l02045k11974j62155M2217Q6058L3181m52439M6052L23545
$$ 5902984 6274761 5972716 5760742 5598587 5640804 5726862 5760043 5307604 5353656 5677201
14070E677201m73068K25277k22280K40570l65494J03460m16677J38700k10285
$$ 5677201 5204133 5429410 5207130 5447700 5082206 5185666 4768989 4907689 4697404
14061D697404K46508k73841M3643O9278j50317P8987k37161j3188J02487J1727
$$ 4697404 4943912 4670071 4713714 4782992 4632675 4711662 4474501 4461313 4563800 4575527
14051D575527N1570l15644J6101L19971j12937k42550K03577k82700K42905l88610
$$ 4575527 4627097 4311453 4327554 4647525 4534588 4292038 4495615 4212915 4455820 4067210
14041D067210K08870r2638k28271R5976m32933J74605k62895K32545n0266k44540
$$ 4067210 4276080 4183442 3955171 4051147 3618214 3792819 3529924 3762469 3712203 3467663
14031C467663J97813j82201K4154j44308J113j15222K46085J31182r9166k25343
$$ 3467663 3665476 3483275 3507429 3363121 3364234 3249012 3495097 3626279 3527113 3301770
14021C301770p9387K1638R2610J20175l06313L90931k61819R7472k90443Q6888
$$ 3301770 3222383 3244021 3336631 3456806 3150493 3541424 3279605 3377077 3086634 3173522
14011C173522j30555j1756J10230j39192P3579j83514J94310k85468m6598m2952
$$ 3173522 3042967 3031211 3141441 3002249 3075828 2892314 3086624 2801156 2754558 2711606
14001B711606r3793K83069k49721O0051k39961K43963k01774l05656M25621l35250
$$ 2711606 2617813 2900882 2651161 2711212 2471251 2715214 2513440 2207784 2633405 2298155
13991B298155J17569J90255k42394j45134L13581k26367J44309m6770k73302N54519
$$ 2298155 2415724 2605979 2363585 2218451 2532032 2305665 2449974 2403204 2129902 2684421
13981B684421l12609J24989L29245K46946M01591K56481M17697J631783L079672
$$ 2684421 2371812 2496801 2826046 3072992 3474583 3731064 4148761 5780544 8860216
13972H860216N374965J0063275J2057019j1097118r050225n465513k915483j656485
$$ 8860216 14235181 24298456 36355475 25258357 16208132 10742619 7827136 6170651
13964F170651j100079m74598l43796k78020o88845O365j34155k07109j5277j86489
$$ 6170651 5070572 4595974 4252178 3974158 3285313 3291678 3157523 2950414 2935137 2748648
13954B748648o3767K45216k96570j18909q7067j87296l28571L83722K48260n89383
$$ 2748648 2684881 2930097 2633527 2514618 2427551 2240255 1911684 2295406 2543666 1954283
13944A954283K06003N9931K54222m06486J34424N0198k69560k38095K74778J0971
$$ 1954283 2160286 2220217 2474439 2067953 2202377 2252575 1983015 1744920 2019698 2030669
13934B030669J29096r5069k51698K65295p8463j72238K97190k56046j67053K95934
$$ 2030669 2159765 2064696 1812998 2078293 1999830 1827592 2124782 1868736 1701683 1997617
13924A997617l05406L25912k52548L57808l82635J00026q0668k51784M74808l9844
$$ 1997617 1692211 2018123 1765575 2123383 1740748 1840774 1760106 1508322 1983130 1943286
13914A943286k88692N4932J28709p8127J92191L8967l90094K64894p6525k87745
$$ 1943286 1654594 1709526 1838235 1760108 1952299 1991266 1601172 1866066 1789541 1501796
13904A501796K44818J97240o41679M6735K67133j57644j61017j4274K54338R7056
$$ 1501796 1746614 1943854 1302175 1348910 1616043 1458399 1297382 1283108 1537446 1634502
13894A634502l02893K76516j92029K60908p8350k19448J3220J54364j11012n4642
$$ 1634502 1331609 1608125 1416096 1677004 1598654 1379206 1392426 1546790 1435778 1381136
13884A381136l5776K32766J8758l0845j08948n662J921k09221M1841K67887m35380
$$ 1381136 1345360 1578126 1596884 1566039 1457091 1451429 1453350 1244129 1285970 1553857 1118477
13873A118477J44287m7542K80471l75860M19070q1452r1927m05816M54644k55408
$$ 1118477 1262764 1215222 1495693 1119833 1538903 1457451 1365524 959708 1414352 1158944
13863A158944N1107L9996k91703N15205k31678k44901j51281L17208R4390J76915
$$ 1158944 1210051 1250047 958344 1473549 1241871 996970 845689 1162897 1257287 1434202
13853A434202j62416j46482N2967l3107O5029J0027r8546k4119l85731M11378
$$ 1434202 1271786 1125304 1178271 1145164 1210193 1220220 1121674 1097555 711824 1123202
13843A123202K91561k70034m5283J21666j56965M5353j65715L16600N8762j55651
$$ 1123202 1414763 1144729 1099446 1221112 1064147 1109500 943785 1260385 1319147 1163496
13833A163496j48194J1447J59951j68556J7927L2331r6026k82125Q9562M31566
$$ 1163496 1015302 1026749 1186700 1018144 1036071 1068402 972376 690251 779813 1211379
13823A211379j28165P7858j26678J50333j04537k0319J08054k30796K01322j88632
$$ 1211379 1083214 1161072 1034394 1184727 1080190 1059871 1167925 937129 1138451 949819
13813I49819J67413j40177n7522l12719M19088N2485k91767K63442N672q5303
$$ 949819 1117232 977055 919533 606814 1025902 1078387 786620 1050062 1055734 970431
13803I70431j08213J62151n0916J13291l35968K41073m03214M53433P8823l44817
$$ 970431 862218 1024369 973453 1086744 750776 991849 588635 1042068 1120891 776074
13793G76074L95128m81141J67334J02737l01073L01314k24911O4044k08810Q3603
$$ 776074 1171202 690061 857395 960132 659059 960373 735462 799506 590696 674299
13783F74299K14391j24618L34926j03875l27904L6921k44567L84349j11330l5721
$$ 674299 888690 764072 1098998 995123 667219 704140 459573 843922 732592 696871
13773F96871K65282O0207j50790k74516J34783l17718L53224K49983l45853J49693
$$ 696871 962153 1022360 871570 597054 731837 414119 767343 1017326 671473 821166
13763H21166j84176M02574C81140L69426J24941j02004q1768K99851l54174L59172
$$ 821166 636990 1039564 381140 750566 875507 773503 691735 991586 637412 996584
13753I96584k83897j62428K33396C27069K91783K01337j23791J39183p6339j01416
$$ 996584 712687 550259 783655 327069 618852 820189 696398 835581 759242 657826
13743F57826J43359k08809J22L54230k45728j59415k08512J91559N60836D74349
$$ 657826 801185 592376 592498 946728 701000 541585 333073 524632 1085468 474349
13732B44187L48399J33533j66075K51926C30176J98780L06983k10328J46378C60146
$$ 244187 592586 726119 560044 811970 330176 528956 835939 625611 771989 360146
13721E30816j31939M08479C61036K59826M3379j32817P5387K10314C99834J53660
$$ 530816 398877 807356 361036 620862 664241 531424 606811 817125 399834 553494
13711E53494J84j4058j12961J19663K3393Q96j53941N70377m31145N4725L1553
$$ 553494 553678 539620 426659 546322 569715 570611 416670 987047 555902 610627 642180
13700F42180J63359k74612q1487j81655K38551J65091A64628N73757r3720l6796
$$ 642180 805539 530927 449440 267785 506336 671427 164628 738385 644665 607869
13690F07869j01465j77307K38823k2963P4723l05052K95698M5980j3536j1589
$$ 607869 506404 329097 567920 544957 619680 314628 610326 656306 642770 631181
13680F31181j77101K2453k5053J47297Q2494A51724O15615k98897K37152k85123
$$ 631181 454080 476533 451480 598777 681271 151724 767339 468442 705594 420471
13670D20471M39858b5499C29245K15251J96186B42196J74471K55131l20729M9471
$$ 420471 860329 -25499 329245 544496 740682 242196 416667 671798 351069 400540
13660D00540N9218P4939r5626j76545L01565j56588J23524P4066R3512k29379
$$ 400540 459758 534697 439071 262526 564091 407503 531027 605093 698605 469226
13650D69226l2277N2082J89514k93845J36318L8563o5244J76279L2879C03468
$$ 469226 436949 489031 678545 384700 521018 559581 494337 670616 703495 303468
13639D76778j00421j10336M51682j51628K0535j81834r2498L17911k76083K82132
$$ 476778 376357 266021 717703 566075 586610 404776 312278 630189 354106 636238
13629F36238K8242A99511J73747p242J41703j39096J43964Q9063o5853B36792
$$ 636238 664480 199511 373258 366016 507719 368623 512587 601650 535797 236792
13618E00044J05929B63082K17459J2266j95338K66072j42562J78054r1999p9416
$$ 500044 605973 263082 480541 492807 297469 563541 420979 599033 507034 427618
13608D27618j09051r5659J78144l1874A81901N67646B03482K03410n9920J23359
$$ 427618 318567 222908 401052 369178 181901 749547 203482 406892 346972 470331
13598D70331j80412j36298M05065j8808B59884N01014l21805J03672o8384A04516
$$ 470331 289919 153621 558686 539878 259884 760898 439093 542765 474381 104516
13587A43378K66562q6694M78335C97229j24150K05691r4822r2429a4815C53845
$$ 143378 409940 323246 801581 397229 273079 478770 383948 291519 -14815 353845
13576E3909N64561k12623o3254M5943k8030j21714K10265A52764F3257L14326
$$ 53909 618470 405847 342593 388536 360506 238792 449057 152764 63257 377583
13566C77583M80030D06170l1576A41905J43182r2533J36676J24268j70311J41550
$$ 377583 857613 406170 374594 141905 285087 192554 329230 453498 283187 424737
13556D24737M1008n7481m4632j73113J75249o7438K93838K01179l06445o1877
$$ 424737 465745 408264 363632 190519 365768 298330 592168 793347 486902 425025
13546D25025K7292j308N9697M3443K9196B42231j09562K31837K32072j29422M7004
$$ 425025 452317 451009 510706 554149 583345 242231 132669 364506 596578 467156 514160
13535E14160j28921A25302J4410L35864A14223E3987M41797i9388C21694l1376
$$ 514160 385239 125302 139712 475576 114223 53987 495784 -99388 321694 290318
13525B90318J4630N317J60959k21777j20412J89595F1890L18157K50663j67068
$$ 290318 304948 310265 471224 249447 129035 318630 61890 380047 630710 463642
13515D63642o0641A03749J0490L60554a52771A26448K23582A53716J95443J64928
$$ 463642 403001 103749 114239 474793 -152771 126448 350030 153716 349159 514087
13505E14087B42001L7043d1583D29875A67434M70695A76294J87519p8936a22442
$$ 514087 242001 279044 -41583 429875 167434 638129 176294 363813 284877 -122442
13494C45226j39984K48353F4090K95345o5132N6159k0877Q7612K6712B11152O6266
$$ 345226 205242 453595 64090 359435 294303 350462 329585 417197 443909 211152 277418
13483B77418j5400K25616j89556N3464M8565J31729d9874B72477K31031K7850
$$ 277418 262018 487634 298078 351542 400107 531836 -49874 272477 503508 531358
13473E31358B3356J62259M41414F1971a78008C11672K26277j15052j60588F6369
$$ 531358 23356 185615 627029 61971 -178008 311672 537949 422897 262309 66369
13462H4712K35588d9137C02145A27715K50961J06754A57159L8403J58389n8975
$$ 84712 320300 -49137 302145 127715 378676 485430 157159 195562 353951 294976
13452B94976J73147j16846j02626o820a36910A59454R6468O5589j02558p9721
$$ 294976 468123 351277 248651 241831 -136910 159454 255922 321511 218953 139232
13442A39232L54507P2054A12726k0231L97601a02780B75900a57370B51168R0734
$$ 139232 493739 565793 112726 92495 490096 -102780 275900 -157370 251168 341902
13432C41902r9060F5964J95957K7302F8668O4985K22275p8810m0413N6611j02242
$$ 341902 242842 65964 261921 289223 68668 133653 355928 277118 236705 293316 191074
13421A91074J1106P2550c3851H6975M4607L5158L3578j9472J49430H4308c8092
$$ 191074 202180 274730 -33851 86975 131582 166740 200318 180846 330276 84308 -38092
13409A48128b5192H5149J48953m0554J76110A57923R1534I732J69178A8310f3098
$$ 148128 -25192 85149 234102 193548 369658 157923 249457 9732 178910 18310 -63098
13397B97362D7112K021J06895N2735j3603q4679L16379B00646K8108J38568A47717
$$ 297362 47112 49133 156028 208763 195160 110481 426860 200646 228754 367322 147717
13385B02934l7234L55183A87826q4950Q4790l1533p1744K27408A14981Q0000J75403
$$ 202934 165700 520883 187826 102876 187666 156133 84389 311797 114981 194981 370384
13374C70384j81045q077N50d7161B88054c647l6148A64933K08325A23545c4257
$$ 370384 189339 181262 181812 -47161 288054 -3647 -39795 164933 373258 123545 -34257
13362A80709K04253L7179d6543A73610F1242a54938B53436K39663G1582J42187
$$ 180709 384962 422141 -46543 173610 61242 -154938 253436 493099 71582 213769
13352B13769L18695F9344J16389O8856K5812J19420J64966A97802j4705J53459
$$ 213769 532464 69344 185733 254589 280401 399821 564787 197802 183097 336556
13342C36556c01252b776A18381L91754A04501A366M60862A29351K84427b16555
$$ 336556 -301252 -2776 118381 510135 104501 1366 462228 129351 413778 -216555
13331D41707I3500P6754k0233M59266k75822F2310L6619R6883M4944j895n174
$$ 441707 93500 170254 150021 609287 333465 62310 98929 195812 240756 238861 233687
13320B33687j16582K5168J16068m8767K6983r3034l596J99352A16456m0513K80919
$$ 233687 117105 142273 258341 209574 236557 143523 139927 339279 116456 75943 356862
13309C56862m5423f2021D8977d1353D05867A97535r1367N2814p2199L51842J28
$$ 356862 311439 -62021 48977 -41353 405867 197535 106168 158982 86783 438625 438753
13298D38753j72830J25683P0195k28020k9159C9821K14761C4673N2747Q8586K8806
$$ 438753 265923 391606 461801 233781 204622 39821 254582 34673 87420 176006 204812
13287B04812c6045E0387J57321G8387r273J76274K37703B21810P0791G4655J31727
$$ 204812 -36045 50387 207708 78387 69114 245388 483091 221810 292601 74655 206382
13276B06382J46422c847B08459D3510R0775a37680d312C59384a14018J9823E53008
$$ 206382 352804 -3847 208459 43510 134285 -137680 -4312 359384 -114018 -94195 553008
13264B5379K33729J5760E8013J16424R8107j11247a5195m7851C12011E9010K28477
$$ 25379 259108 274868 58013 174437 272544 161297 -15195 -63046 312011 59010 287487
13253B87487p3883h5138K8946D49310l2007j75312P4801I8172M33908A49425l768
$$ 287487 213604 -85138 -56192 449310 417303 241991 316792 98172 532080 149425 145657
13242A45657Q0546f4691A21846J66731a01789g638C45239E5054L08884C3459L74068
$$ 145657 226203 -64691 121846 288577 -101789 -7638 345239 55054 363938 33459 407527
13231D07527A72220m6483a58839A20687c8939A06767j9464j9159N4920A0400J13644
$$ 407527 172220 125737 -158839 120687 -38939 106767 87303 68144 123064 10400 124044
13220A24044K23503a00956M4a3899A91080F1498K09705a89673c7326A41349D8513
$$ 124044 347547 -100956 -100912 -13899 191080 61498 271203 -189673 -37326 141349 48513
13208A95138a6663B0828M87716F5100K51839L0778j66357q4794L00144A27017
$$ 195138 -16663 20828 508544 65100 316939 347717 181360 96566 396710 127017
13197i3325F1560J39716O6116A8712L64784a71746A63364B2139L30063M5032a78823
$$ -93325 61560 201276 267392 18712 383496 -171746 163364 22139 352202 397234 -178823
13185b41256A55378L2258H23K73152B6012J0946a67063m5275D75331k21333h3506
$$ -241256 155378 187636 823 273975 26012 36958 -167063 -212338 475331 253998 -83506
13173b0207j22844B08016a66187B14846c0638B15927b5700A64079c95555A1982
$$ -20207 -143051 208016 -166187 214846 -30638 215927 -25700 164079 -395555 11982
13162B09210J76432A04530L0228a84781N1300A07442K9361H001K93271a43744
$$ 209210 385642 104530 134758 -184781 -133481 107442 136803 8001 301272 -143744
13151B46362b65141A87695g4199p6484P5019D20024r9111Q3902E4693M7301J0540
$$ 246362 -265141 187695 -74199 -150683 -75664 420024 320913 404815 54693 101994 112534
13140A12534i9324c5789D040J4933a55967j11142J07305O2515C04430P2601A56149
$$ 112534 -99324 -35789 4040 18973 -155967 -267109 -159804 -97289 304430 377031 156149
13128B86654o0453b208B05824m2113K58024C6986J83843K7466a536q9121B73104
$$ 286654 226201 -2208 205824 163711 421735 36986 220829 248295 -1536 -90657 273104
13116c46484F9020P3393a142C09339e1818A45999j4967b74047H4977J41252M3184
$$ -346484 69020 142413 -1142 309339 -51818 145999 131032 -274047 84977 226229 269413
13105B69413l6051J799F1289j9824K08775E9551d7836C14715D8953L81309r2665
$$ 269413 233362 235161 61289 41465 250240 59551 -47836 314715 48953 430262 337597
13094C37597D0508K12782P0374A22963N8251q3874A2434a44123C29603a34211
$$ 337597 40508 253290 323664 122963 181214 97340 12434 -144123 329603 -134211
13083A2279J63167A6553J40720K47840g08m0122F9633J19054J22896b92002J45537
$$ 12279 175446 16553 157273 405113 -708 -40830 69633 188687 311583 -292002 -146465
13072a46465D22941j90994D5293f8532A69497a04238A34806K4227M4754m0845
$$ -146465 422941 231947 45293 -68532 169497 -104238 134806 159033 203787 162942
13062A62942N2469e0184A07480b8430j60283B44211B5478e1903H6802b61185I1879
$$ 162942 215411 -50184 107480 -28430 -188713 244211 25478 -51903 86802 -261185 91879
13050A70866A2443P9691L9292Q819J07361Q918a30687B70094o018K5420a04144
$$ 170866 12443 92134 131426 140245 247606 256524 -130687 270094 264076 289496 -104144
13038B23071G7641b43474F6643J88483a48364A50706o6744J40397q5935D7200
$$ 223071 77641 -243474 66643 255126 -148364 150706 83962 224359 138424 47200
13027b36030d1621A31177k9028B4080J67342L8555p3564a66392C2964L44848c83096
$$ -236030 -41621 131177 102149 24080 191422 229977 156413 -166392 32964 377812 -383096
13015I6430J61123O6641j55258f8931B089J89110d1012H496K37603q2331J29472
$$ 96430 257553 324194 168936 -68931 2089 191199 -41012 8496 246099 163768 293240
13004B93240g0411C8749a49861o1444E1100d7700o2046A77680D0349c4625A57517
$$ 293240 -70411 38749 -149861 -211305 51100 -47700 -109746 177680 40349 -34625 157517
12992A94107q6983p554J17973I011a41394e4456m4863C63440F055b7564A63794
$$ 194107 107124 99570 217543 9011 -141394 -54456 -99319 363440 6055 -27564 163794
12980C10141c94578B45889D8726J5735a69447B98482B6641D037b38840H8436i3016
$$ 310141 -394578 245889 48726 64461 -169447 298482 26641 4037 -238840 88436 -93016
12968a02412A5020K05271h3040B96018A4577c9826r666j85098B30211b53991B52606
$$ -102412 15020 220291 -83040 296018 14577 -39826 -49492 -234590 230211 -253991 252606
12956A79645A376J358a51619j64075A35664K0324L2328q6876J26530A0768J00420
$$ 179645 1376 2734 -151619 -315694 135664 155988 188316 101440 227970 10768 111188
12945A11188M4654G0206a68724A93835a9852k33885P8419G52b62569B01011C6096
$$ 111188 155842 70206 -168724 193835 -19852 -253737 -175318 752 -262569 201011 36096
12933a89811E368a91691F5303E54b77011B12993h6623C82029e5824E5804L42838
$$ -189811 5368 -191691 65303 554 -277011 212993 -86623 382029 -55824 55804 398642
12922C98642A46708K10295j72817J96240A408b74778A22649J24422b93030Q7654
$$ 398642 146708 357003 184186 380426 1408 -274778 122649 247071 -293030 -205376
12912b05376C1966K95441a20236j31257B0653b19966o2475g62C24229b8063H084
$$ -205376 31966 327407 -120236 -251493 20653 -219966 -282441 -762 324229 -28063 8084
12900A09383K02409A25236F026J48860E4524J56553a55956j40181F0564K6909
$$ 109383 311792 125236 6026 154886 54524 211077 -155956 -296137 60564 87473
12890H7473f3484m0405C20308a37447d3086K920O368B23966K89987k45832a03886
$$ 87473 -63484 -103889 320308 -137447 -43086 -40166 -33798 223966 513953 268121 -103886
12878D5263f864B76293j25354E67c97518J72480H5163B2866g0625J6850A11039
$$ 45263 -6864 276293 150939 567 -397518 -225038 85163 22866 -70625 -53775 111039
12866E8816N6397d4101A01563e3925B85487h3355H1317O1419d09819a35046B60342
$$ 58816 115213 -44101 101563 -53925 285487 -83355 81317 142736 -409819 -135046 260342
12854h4249n0412I495b840q3857b5373D439a16906B08293E961a09938M6191C37279
$$ -84249 -134661 9495 -2840 -86697 -25373 4439 -116906 208293 5961 -109938 -63747 337279
12841b33810A64874a2584F7264J22932e25C79725b57670A40357f2054B38723G4069
$$ -233810 164874 -12584 67264 190196 -525 379725 -257670 140357 -62054 238723 74069
12829a85873D4038a02036c9425l39976G9387J57791i7134H2064a31126b595k06446
$$ -185873 44038 -102036 -39425 -379401 79387 237178 -97134 82064 -131126 -2595 -209041
12818b09041A27422a60826n3688G7503P0260a82379m59652a71110A49484c36018
$$ -209041 127422 -160826 -214514 77503 147763 -182379 -642031 -171110 149484 -336018
12807A07483A3593J17358F2430J0612R3364F3527h908B50412B3667b39094H1312
$$ 107483 13593 130951 62430 73042 166406 63527 -8908 250412 23667 -239094 81312
12795A97932c1221A83007K28570A81128K2511q070a18210L5114B69742a72591
$$ 197932 -31221 183007 411577 181128 203639 195569 -118210 -83096 269742 -172591
12784a23945j44229H0826E176K7786c10508b3399A2916M8262A3746N870d14296
$$ -123945 -268174 80826 5176 32962 -310508 -23399 12916 61178 13746 19616 -414296
12772a65966F35b29549j08257B5142K05322g9596B3435J71845I3323a73151L0831
$$ -165966 635 -229549 -337806 25142 230464 -79596 23435 195280 93323 -173151 -142320
12761a42320A66295N4012j2792b46700A20601d1985I2575b21604a05078B83807
$$ -142320 166295 220307 207515 -246700 120601 -41985 92575 -221604 -105078 283807
12750d8892k2550k13476C59514C3360J36681g5909A12487d7830A18563R6645I9146
$$ -48892 -71442 -284918 359514 33360 170041 -75909 112487 -47830 118563 215208 99146
12738d8629j43565A7751J38134b4778J2316D2628j4872i0611C5866b12595a7651
$$ -48629 -192194 17751 155885 -24778 -12462 42628 27756 -90611 35866 -212595 -17651
12726A19164L4885C6538d295B3243R1870b67226B89388j03091a77209C13694a70426
$$ 119164 154049 36538 -4295 23243 115113 -267226 289388 186297 -177209 313694 -170426
12714d14877B36377l5182g0070b4438p7038B31314b85149f8332A86277A287h6808
$$ -414877 236377 201195 -70070 -24438 -101476 231314 -285149 -68332 186277 1287 -86808
12702g0856e469B17118n2631K1418b4916H6985C6449L15557F0607B9392O47237
$$ -70856 -5469 217118 164487 185905 -24916 86985 36449 352006 60607 29392 676629
12691F76629A8394J72835L26181A74760J64218b05658A21507l3941c9035k25271
$$ 676629 18394 191229 517410 174760 338978 -205658 121507 87566 -39035 -264306
12681b64306A09972b55190i9922A78437a1670E4817B2041J65469E783b65532F8166
$$ -264306 109972 -255190 -99922 178437 -11670 54817 22041 187510 5783 -265532 68166
12669B1442a0868B40348a27349A33589h9473r2486I7745l9753a52902A59594f4394
$$ 21442 -10868 240348 -127349 133589 -89473 -181959 97745 57992 -152902 159594 -64394
12657A83600K05148b4706E30513B06456f6646i386A03525d5769A70301b47122
$$ 183600 388748 -24706 530513 206456 -66646 -9386 103525 -45769 170301 -247122
12646i588k40743R2519F5269L3515j4095k7311N7075R3885a2097A62809Q3565
$$ -9588 -250331 -157812 65269 98784 84689 57378 114453 208338 -12097 162809 246374
12635B46374a23295b6136A96747a4554O597H743J44112m2230b2696A11862J34595
$$ 246374 -123295 -26136 196747 -14554 -7957 8743 152855 110625 -22696 111862 246457
12624B46457n4698f9831b6512i238A40722c33979h7293r123D5091J05466N0672
$$ 246457 191759 -69831 -26512 -9238 140722 -333979 -87293 -96416 45091 150557 201229
12613B01229b63260D21300j5799G0518K05142h6158C25335n0532Q2533f139A10632
$$ 201229 -263260 421300 405501 70518 275660 -86158 325335 274803 357336 -6139 110632
12601H5963c45207a25914A09112L8780b26267A42003o7464b48889h6902A27161
$$ 85963 -345207 -125914 109112 147892 -226267 142003 74539 -248889 -86902 127161
12590g874j07148A11603a62117e1133k28942K4073A32432c8417A10039Q0957A83
$$ -7874 -115022 111603 -162117 -51133 -280075 -256002 132432 -38417 110039 190996 183
12578A59644J43445b22014N6026p87j04007a20491n6003A5902a57120p1161R1731
$$ 159644 303089 -222014 -165988 -166775 -270782 -120491 -176494 15902 -157120 -228281 -136550
12567a36550k4924M5698A38974L0307k5467l1013R2399b16707B42098r2977a4773
$$ -136550 -161474 -115776 138974 169281 143814 112801 205200 -216707 242098 149121 -14773
12555B90285G9779J58203B8042J9514a41289A59740A5281Q1325a22627A3107a73550
$$ 290285 79779 237982 28042 47556 -141289 159740 15281 96606 -122627 13107 -173550
12543A55981d9253q6334A78239H4535a40686A00841O6140a03427A35239c0o9231
$$ 155981 -49253 -135587 178239 84535 -140686 100841 166981 -103427 135239 -30 -69261
12532f9261D1220K17181I143a59807B68170a08118A42869m0435m5984b5748B86597
$$ -69261 41220 258401 9143 -159807 268170 -108118 142869 102434 56450 -25748 286597
12520a63123A67738a65369j2735A57668a24278j28157B47539r5364a04357J7059
$$ -163123 167738 -165369 -178104 157668 -124278 -252435 247539 152175 -104357 -87298
12510h7298A73822k9638E2819b9715r6300l14647d054A94594e8331B67652b6949
$$ -87298 173822 144184 52819 -29715 -126015 -440662 -4054 194594 -58331 267652 -26949
12498I6237N400d1690A60202K65753a16952L0297o9812C07232d5983n2657B65706
$$ 96237 101637 -41690 160202 425955 -116952 -86655 -156467 307232 -45983 -98640 265706
12486h258B73197h0661k37437a49563f1267C04611a71245b1372l6133B1879Q0921
$$ -8258 273197 -80661 -318098 -149563 -61267 304611 -171245 -21372 -57505 21879 102800
12475A02800K7839I620K50614f4474K3732p7398d5984q1961n4957a0922k02617
$$ 102800 130639 9620 260234 -64474 -40742 -118140 -45984 -127945 -182902 -10922 -213539
12464b13539K5310D2029f0901m3268F28a62827L6101f2971H4196a7055o23095
$$ -213539 -188229 42029 -60901 -104169 628 -162827 -126726 -62971 84196 -17055 -640150
12453f40150F3145b11654A86396a06231B32Q6987J14505c4541A62247J4981f7
$$ -640150 63145 -211654 186396 -106231 232 87219 201724 -34541 162247 177228 -67
12441A99579D2036a47393C2659f0941B83522i669n6411o8240B4788K70678a29445
$$ 199579 42036 -147393 32659 -60941 283522 -9669 -66080 -134320 24788 295466 -129445
12429c7801j87050B58568q5398J11725a8107j03050G9231a04184B29690B9523
$$ -37801 -224851 258568 173170 284895 -18107 -121157 79231 -104184 229690 29523
12418c26801a6255B4860J09847g0601A57910a7509A48190m7202J36463f430A82186
$$ -326801 -16255 24860 134707 -70601 157910 -17509 148190 100988 237451 -6430 182186
12406a00375k4040N4637A45597a76575F2826a71615A79405a6855m17186i4817
$$ -100375 -124415 -69778 145597 -176575 62826 -171615 179405 -16855 -434041 -94817
12395A55351c235A30659a46962k98135B7614J13005o4966K14275b1548m28815
$$ 155351 -3235 130659 -146962 -445097 27614 140619 75653 289928 -21548 -450363
12385d50363C14372a1240G1559f3956B68056c5391k45589A97000b80850Q6544
$$ -450363 314372 -11240 71559 -63956 268056 -35391 -280980 197000 -280850 -194306
12375a94306f0179A53060c36071B1185d9713K2683B98128c03950G8471J17496
$$ -194306 -60179 153060 -336071 21185 -49713 -27030 298128 -303950 78471 195967
12365A95967k6270J247K32974a13915I843M50415b23703J09471O688D7811J3311
$$ 195967 169697 170944 403918 -113915 9843 460258 -223703 -114232 -107544 47811 61122
12354F1122N1633m0556r354A7924a1426A7919a37970o141L337f0759A41886j7706
$$ 61122 112755 72199 62845 17924 -11426 17919 -137970 -144111 -140774 -60759 141886 124180
12342A24180a96023B45020b81758e9874A44434L8290a3215B5280b38948c5932
$$ 124180 -196023 245020 -281758 -59874 144434 182724 -13215 25280 -238948 -35932
12331A25562d6399j52049I1978K39487g3650b7387B5055c91112b7199B14933O0559
$$ 125562 -46399 -198448 91978 331465 -73650 -27387 25055 -391112 -27199 214933 275492
12320B75492B9822n647a24884o8950E4933a82132B46683g9701E7832L46129G9241
$$ 275492 29822 24175 -124884 -193834 54933 -182132 246683 -79701 57832 403961 79241
12308G9090P2924R6107j2795k8411K1382J269D2455R8647J45615G8106g4556B84347
$$ 79090 152014 248121 235326 206915 228297 229566 42455 141102 286717 78106 -74556 284347
12295B14128b76500A60207a78271O4691o0682E3420K55520n3092E7308N8198a35211
$$ 214128 -276500 160207 -178271 -113580 -174262 53420 308940 255848 57308 115506 -135211
12283A53212N9540b25344B24329B5806K3141M07778a07221A66318K05705I0183
$$ 153212 212752 -225344 224329 25806 48947 456725 -107221 166318 372023 90183
12272d4389C95458j19296j00868n8883b16186R1796o2138A72205K75580A59203
$$ -44389 395458 276162 175294 116411 -216186 -124390 -186528 172205 447785 159203
12261I8841J44816k5750J14222d932B32988J65844j63624q1431j5964K94654q4582
$$ 98841 243657 217907 332129 -4932 232988 398832 235208 153777 137813 432467 347885
12250C47885j25303K54037D7470R9081J63565k5289j09950A9133N35068A30881
$$ 347885 222582 476619 47470 146551 310116 284827 174877 19133 554201 130881
12239A61072J10276J1178N7653j29775b16515B2395J06411P6305c6503j0820C22738
$$ 161072 271348 282526 340179 210404 -216515 22395 128806 205111 -36503 -47323 322738
12227B78195J93792A19906P39g661k85706a08378F2339K3819L79319G7885P8148
$$ 278195 471987 119906 120645 -7661 -293367 -108378 62339 86158 465477 77885 156033
12216A56033a16154e6382A59320K076J18488l1201o4943a13423C20630J08229
$$ 156033 -116154 -56382 159320 161396 279884 248683 183740 -113423 320630 428859
12206D28859a35156A21586L46805j57147F4504l1969K58716R7759a62706A31798
$$ 428859 -135156 121586 468391 311244 64504 32535 291251 389010 -162706 131798
12195a5917A48564J7975f0316B74650a7140B24025K75512d4612C55252l1597A39246
$$ -15917 148564 166539 -60316 274650 -17140 224025 499537 -44612 355252 323655 139246
12183B3272N707H534O1131a48377A83924L4152F1355J5973j7604K52488o0819
$$ 23272 28979 8534 69665 -148377 183924 218076 61355 77328 59724 312212 251393
12172B51393A17031K9898d6619j8361k5838D7840K53952E8007f4395G3647O9918
$$ 251393 117031 146929 -46619 -64980 -90818 47840 301792 58007 -64395 73647 143565
12161A43565K25743j55879e4073G6092K38K08546J6475e0330j50339B74337J59050
$$ 143565 369308 213429 -54073 76092 76330 284876 301351 -50330 -200669 274337 433387
12150D33387A63321o0753L72569f9974A72974N9216j07231J19285J10325j52491
$$ 433387 163321 102568 475137 -69974 172974 232190 124959 244244 354569 202078
12140B02078D6526M43467j56101j25331q0015B4711J78750a32719B13917g9099
$$ 202078 46526 489993 333892 208561 128546 24711 203461 -132719 213917 -79099
12129G0797B2671K89181f6421A52134n817G0967O4292j1877c3395C990P8749N9313
$$ 70797 22671 311852 -66421 152134 146317 70967 135259 123382 -33395 3990 82739 142052
12117A42052M6671J48662j23677c928k6276A07720L5122g1014c0678k4843D87298
$$ 142052 188723 337385 213708 -3928 -30204 107720 142842 -71014 -30678 -55521 487298
12105D20650D9948J90690k1232l5040h1796A50240J99480j69131r870g6697q0887
$$ 420650 49948 240638 219406 184366 -81796 150240 349720 180589 170719 -76697 -157584
12094a57584f9998D61319F0139e1973I7465J5942K21879g0872B71870N7206j53255
$$ -157584 -69998 461319 60139 -51973 97465 113407 335286 -70872 271870 329076 175821
12083A75821A0122N6555J96241b07743C37952a28259C44565d4644G4736a96497
$$ 175821 10122 66677 262918 -207743 337952 -128259 344565 -44644 74736 -196497
12072F4091N0085h9807d0051F9349d1757B27012a06093k5348A55476K00237j29127
$$ 64091 114176 -89807 -40051 69349 -41757 227012 -106093 -131441 155476 355713 226586
12061B26586E6401a59464G8183J28129q4012b46103a3353B67513d3047A86229
$$ 226586 56401 -159464 78183 206312 122300 -246103 -13353 267513 -43047 186229
12050A1180K47225p9949D6387K33542A9813d2379A81946L347K15823A42698b9190
$$ 11180 258405 178456 46387 279929 19813 -42379 181946 185293 401116 142698 -29190
12038d1669k5189A10424a33384A72205a14904c0730i032j02194j52709E5713e14297
$$ -41669 -66858 110424 -133384 172205 -114904 -30730 -9032 -111226 -263935 55713 -514297
12026B62984a28995A42001n0097L4389a06105F2026J04382N4724a39875G1275
$$ 262984 -128995 142001 91904 126293 -106105 62026 166408 221132 -139875 71275
12015c84577A87892q1555K10223b5056B65269f1061A19123b20436e9019E8817
$$ -384577 187892 106337 316560 -25056 265269 -61061 119123 -220436 -59019 58817
12004b02946B23293m3063h1383L983D9358d5069B61694P3368c6704G0012j508
$$ -202946 223293 180230 -81383 -77400 49358 -45069 261694 335062 -36704 70012 68504
11993F8504J06631G4039a73132B53783a159r0744A8429O9682g3830j32583B52340
$$ 68504 175135 74039 -173132 253783 -1159 -91903 18429 88111 -73830 -206413 252340
11981a15745j00190c4235D6052J34634a3755A60612G8596a06897d5252n2783A58900
$$ -115745 -215935 -34235 46052 180686 -13755 160612 78596 -106897 -45252 -98035 158900
11969A08585d4844r8389b8089j3191j30294N8062G7505C4304J34176d2773A27306
$$ 108585 -44844 -143233 -28089 -41280 -171574 -113512 77505 34304 168480 -42773 127306
11957E7919g9570l04003C65239B5318L5122A2186a48933B509g1784A32414a22003
$$ 57919 -79570 -383573 365239 25318 60440 12186 -148933 2509 -71784 132414 -122003
11945d71005C57320e8789C7622a02953j2027j19756A01954a52842A62829H216
$$ -471005 357320 -58789 37622 -102953 -114980 -234736 101954 -152842 162829 8216
11934B0841J2188J87576a73610L1018D0790A9529c05539A26464a08170N2228A68231
$$ 20841 33029 220605 -173610 -142592 40790 19529 -305539 126464 -108170 -55942 168231
11922D3797N6934J59555e6524J4305A23634Q5336e6917a6448B78239g8542K9269
$$ 43797 100731 260286 -56524 -42219 123634 208970 -56917 -16448 278239 -78542 -49273
11911d9273A16187D3981e8904a9324D8870R5022f5280A4866b01653C9609a95648
$$ -49273 116187 43981 -58904 -19324 48870 143892 -65280 14866 -201653 39609 -195648
11899H6296R6271a53747B59461d1310C43493a4704A26494a34077j19589j02794
$$ 86296 182567 -153747 259461 -41310 343493 -14704 126494 -134077 -253666 -356460
11889c56460M1684A8740b40775i7388I7651e9436p0337C3276c68117p6985A84024
$$ -356460 -314776 18740 -240775 -97388 97651 -59436 -129773 33276 -368117 -445102 184024
11877A7824i0365I2368O491e5447D89406A4142a84959A21121a16967A05714f1223
$$ 17824 -90365 92368 98859 -55447 489406 14142 -184959 121121 -116967 105714 -61223
11865F4370N3698a8846I320R6459a50862j38730R0323L6947A90716B049K6908
$$ 64370 118068 -18846 9320 105779 -150862 -289592 -199269 -162322 190716 2049 28957
11854B8957J84783G2841e1904j46154F7552K3826b72050a26499G752b79589B56563
$$ 28957 213740 72841 -51904 -198058 67552 91378 -272050 -126499 7752 -279589 256563
11842B60489d042l9565F4148b52199C5305b1703j40642L8126k9643j2024j5308
$$ 260489 -4042 -43607 64148 -252199 35305 -21703 -162345 -124219 -153862 -165886 -181194
11831a81194c8288C02818j18414H1443a2391l65267A02373a02838J1697k31785
$$ -181194 -38288 302818 184404 81443 -12391 -377658 102373 -102838 -91141 -322926
11821c22926J37664H5390B1901n113R992b17823b3280m72376c0708E3839i4823
$$ -322926 -185262 85390 21901 16788 26780 -217823 -23280 -495656 -30708 53839 -94823
11809a0240A8087a6359B75038c2002B29250a33842C8796d5886H2153k371a83192
$$ -10240 18087 -16359 275038 -32002 229250 -133842 38796 -45886 82153 79782 -183192
11797C362J35617m5315b11232B79878j07018a34764j94098K6485a01709H1930
$$ 3362 138979 93664 -211232 279878 172860 -134764 -328862 -302377 -101709 81930
11786b35030d5491j68844F7627a97077I18K73585d2251A84535M8872a73083A27599
$$ -235030 -45491 -214335 67627 -197077 918 274503 -42251 184535 233407 -173083 127599
11774a16601C8960a15605K5405D24468A36276a79306A68421A1346L67002B5316
$$ -116601 38960 -115605 -90200 424468 136276 -179306 168421 11346 378348 25316
11763d7702M739n4537A952c30173a49279a1063l1940A43962F6407i0011k43800
$$ -47702 -42963 -97500 1952 -330173 -149279 -11063 -43003 143962 66407 -90011 -333811
11752c33811a10439e430j03102A55921n3082h7259J7506a8869D0496a30052O2502
$$ -333811 -110439 -5430 -108532 155921 102839 -87259 -69753 -18869 40496 -130052 -67550
11741f7550j33712N8317d2614A93467N654a02370A28650c13567A4565J0412K83225
$$ -67550 -201262 -142945 -42614 193467 199121 -102370 128650 -313567 14565 24977 308202
11730C08202b86177G8202N3275J93688j14875Q2798f5605G2287b59897I6653k7655
$$ 308202 -286177 78202 131477 325165 210290 293088 -65605 72287 -259897 96653 68998
11719F8998b08236q5651g6624j32169b2154j19247f6502A68891c34664C04968
$$ 68998 -208236 -293887 -76624 -208793 -22154 -141401 -66502 168891 -334664 304968
11708e5374B38581l304b0801Q884A98057d4477B79802a43576p3486F208f5961
$$ -55374 238581 235277 -20801 -11917 198057 -44477 279802 -143576 -217062 6208 -65961
11696a97576B0582B613K22833M0425d12831A77116a00913L3231q9597F4325O9626
$$ -197576 20582 2613 225446 265871 -412831 177116 -100913 -67682 -157279 64325 133951
11685A33951d24477d1447n551A24661n8754J46828L3629b66948B0836L08478D1065
$$ 133951 -424477 -41447 -46998 124661 65907 212735 246364 -266948 20836 329314 41065
11673C859M9209J22267m4109A0510J80029k5276l0884a44585C34775j00407o4071
$$ 3859 53068 175335 131226 10510 190539 165263 134379 -144585 334775 234368 170297
11662A70297a12848l5619I0971N3531l8605J14510l1403K51921A94301m4440K2002
$$ 170297 -112848 -148467 90971 144502 105897 220407 189004 440925 194301 149861 171863
11651A71863b52314O8826A94075c18408i0046d3985j75590f5133f055D1485a69406
$$ 171863 -252314 -183488 194075 -318408 -90046 -43985 -219575 -65133 -6055 41485 -169406
11639A60078a9809H0453J4406K12531j4758B7840J55022B4920a29834D3156c71839
$$ 160078 -19809 80453 94859 307390 292632 27840 182862 24920 -129834 43156 -371839
11627I7097f5481j20099F3219O5421b94592a38966d2360A35364J18478q553G9694
$$ 97097 -65481 -185580 63219 128640 -294592 -138966 -42360 135364 253842 245289 79694
11615a82034A83985b22529A88282a41357D56315a83434j9296A8928e24k75394
$$ -182034 183985 -222529 188282 -141357 456315 -183434 -202730 18928 -524 -275918
11605b75918N5246P158J4153C10620b89922A2517J10898i5279A2220c83265o1775
$$ -275918 -220672 -213514 -199361 310620 -289922 12517 123415 -95279 12220 -383265 -445040
11594d45040a01145j58832R2508o6585B58108m0697a05940M3267E4536b2860k8390
$$ -445040 -101145 -259977 -167469 -234054 258108 217411 -105940 -62673 54536 -22860 -51250
11583e1250j11246A56728B5476a6555A96308K07722j11504a38021A4601N615L56130
$$ -51250 -162496 156728 25476 -16555 196308 404030 292526 -138021 14601 20216 376346
11572C76346c21680g0542A81631J66293A28010e7235A37938A3040K63841b03744
$$ 376346 -321680 -70542 181631 347924 128010 -57235 137938 13040 276881 -203744
11561B57884a06761B5157K82117j36544i8495j2118B95170E189K27547K3476r8908
$$ 257884 -106761 25157 307274 170730 -98495 -110613 295170 5189 232736 256212 157304
11550A57304a94232P6422d4505M267G6244a84470o580c4774D11194f8827B53687
$$ 157304 -194232 -117810 -44505 -40238 76244 -184470 -191050 -34774 411194 -68827 253687
11538D23096A04339j2017L362j6602a59573I6556b8616k6782k29820Q2138G5354
$$ 423096 104339 92322 95684 79082 -159573 96556 -28616 -55398 -285218 -203080 75354
11526a05213A77680C5341M8854l5570a17859k24984D243N33325a18162B35111
$$ -105213 177680 35341 84195 48625 -117859 -342843 4243 537568 -118162 235111
11515c9762B99015k7144I3911L102L9796g0209D6192h443B62941i5104A7961N4462
$$ -39762 299015 271871 93911 97013 136809 -70209 46192 -8443 262941 -95104 17961 72423
11503G2423K11038e7276J2754G3631F342J69216C5788J10105N2302J14774P7387
$$ 72423 283461 -57276 -44522 73631 6342 175558 35788 145893 198195 312969 390356
11492C90356j24669E8867A4367a1060B34699m7178k0868l9498B9715c7689E1664
$$ 390356 265687 58867 14367 -11060 234699 187521 166653 127155 29715 -37689 51664
11480a50603c2246A7507a30286A20823K60574j72161J54766i1113l03611A47434
$$ -150603 -32246 17507 -130286 120823 381397 209236 364002 -91113 -394724 147434
11469A43062n4122D113h183k19149J05772b0237C4074L25083c9362j38188B73014
$$ 143062 88940 4113 -8183 -227332 -121560 -20237 34074 359157 -39362 -177550 273014
11457h1112j32520C94890g9610D2440L06837n321a01374A22668J59654r7117a04379
$$ -81112 -213632 394890 -79610 42440 349277 343956 -101374 122668 282322 185205 -104379
11445B18419j07141a22168B57063A17321J09113g979p5515j41212A7078a30333
$$ 218419 111278 -122168 257063 117321 226434 -7979 -83494 -224706 17078 -130333
11434a1524k54055c213B93642a7561j94064d0753B41361a01368n2734B87420c518
$$ -11524 -265579 -3213 293642 -17561 -211625 -40753 241361 -101368 -154102 287420 -3518
11422a29825d1581B13843p3457e1624I8352P9703J9065n1298n6837J33413n0725
$$ -129825 -41581 213843 140386 -51624 98352 178055 197120 145822 88985 222398 171673
11411A71673i8117e609I4125a67512A5489K69909a31000c9892o5127Q334d682
$$ 171673 -98117 -5609 94125 -167512 15489 285398 -131000 -39892 -105019 -96685 -4682
11399C38665A40369o6650B8971a22963N1181C33032f3119J1837C6594f946r4778
$$ 338665 140369 73719 28971 -122963 -71782 333032 -63119 -51282 36594 -6946 -101724
11388a01724b9102B54095g1580E2375a54711A8974d2507e317m12585g1382A4286
$$ -101724 -29102 254095 -71580 52375 -154711 18974 -42507 -5317 -417902 -71382 14286
11376A56539k3766A4881a41547H5314c0562k69974a32996H3186a89332M9119j07470
$$ 156539 132773 14881 -141547 85314 -30562 -300536 -132996 83186 -189332 -140213 -247683
11365b47683A96514b73419A62762i5604E9933G728c17802J37575c5090H0880B1528
$$ -247683 196514 -273419 162762 -95604 59933 7728 -317802 -180227 -35090 80880 21528
11353A75989q5450b44589a00445D034a17347A48408a7354A09968q414b37525d2924
$$ 175989 90539 -244589 -100445 4034 -117347 148408 -17354 109968 101554 -237525 -42924
11341A27452f1393C4625j6367d23005c4354B97706J14868D7308J93620a59251
$$ 127452 -61393 34625 18258 -423005 -34354 297706 412574 47308 240928 -159251
11330A97794e2572k04093B15795a36359B27780h3750a1639E8836J92513h6449
$$ 197794 -52572 -256665 215795 -136359 227780 -83750 -11639 58836 251349 -86449
11319H1886M6903e6784b4543k4098A30621G122b68749m857j18478J46950a6754
$$ 81886 128789 -56784 -24543 -48641 130621 7122 -268749 -273606 -392084 -245134 -16754
11307B12912p0726a26897L3837E2455b2285o8430A91521i7785H2517k6607k2025
$$ 212912 142186 -126897 -93060 52455 -22285 -90715 191521 -97785 82517 55910 33885
11296C3885a36111j70710c1849F041i4230B00648m6098g7819L760k06230E7116
$$ 33885 -136111 -306821 -31849 6041 -94230 200648 154550 -77819 -74059 -280289 57116
11284A61573c1451k9890A82229c91094P7502J50416p3754E5759f0897G5228b6782
$$ 161573 -31451 -61341 182229 -391094 -313592 -163176 -236930 55759 -60897 75228 -26782
11272A66896L9663a6085j01148q557e0098j56732A91494a49986n1105f866m46290
$$ 166896 206559 -16085 -117233 -125790 -50098 -206830 191494 -149986 -201091 -6866 -453156
11261d53156D1562b31287d5569m4222A9259R8308B8281P9784D6278L6224a7851
$$ -453156 41562 -231287 -45569 -89791 19259 117567 28281 108065 46278 82502 -17851
11249i6936o5385e9328p2186B47815a6154D320J20114g2540A67761m063c26067
$$ -96936 -162321 -59328 -131514 247815 -16154 4320 124434 -72540 167761 163698 -326067
11237i0382q1260p1260R4022j02928J12948b3651k91163J33422I54O6359c2486
$$ -90382 -171642 -242902 -148880 -251808 -138860 -23651 -314814 -181392 954 67313 -32486
11225a31938m5441j35157i0247C69053H0525l458l1759b22712o9695b5588A06395
$$ -131938 -177379 -312536 -90247 369053 80525 77067 45308 -222712 -292407 -25588 106395
11213b77756a18525C40981p2804e3815j26151c8790A84339E4675a05427G961g0376
$$ -277756 -118525 340981 268177 -53815 -179966 -38790 184339 54675 -105427 7961 -70376
11201H629a75199e1567C82251a51723j28759A07106b1500l754F9615b07834D7555
$$ 8629 -175199 -51567 382251 -151723 -280482 107106 -21500 -25254 69615 -207834 47555
11189A41861J5574a6673A06484N312J8959a07567A18617J75362c42889c0533m0430
$$ 141861 157435 -16673 106484 111796 130755 -107567 118617 293979 -342889 -30533 -70963
11178g0963o9311A09980a74000P7505d7772D8059j9754qh5747j36517j09694D4777
$$ -70963 -140274 109980 -174000 -96495 -47772 48059 28305 28297 -85747 -222264 -331958 44777
11165e7978k2137I3033r089a82337c8734p0627j09962h5811j86336A04954a04551
$$ -57978 -80115 93033 83944 -182337 -38734 -109361 -219323 -85811 -272147 104954 -104551
11153I7787M6755a82435o2515f4598A66693l6620J13023B8166a10595a7977B15021
$$ 97787 144542 -182435 -244950 -64598 166693 130073 243096 28166 -110595 -17977 215021
11141I9084c20113F6720A7583a53390C15805c9108A54209B3861K2372Q5506a1274
$$ 99084 -320113 66720 17583 -153390 315805 -39108 154209 23861 46233 131739 -11274
11129a61515D5137d00032J95835b1991o2540B18548D029M4619c03846b3171B1852
$$ -161515 45137 -400032 -204197 -21991 -84531 218548 4029 48648 -303846 -23171 21852
11117c6565q1578k43975I3472L32771A44572e4462I7136d14939J38577a7571j09555
$$ -36565 -118143 -362118 93472 426243 144572 -54462 97136 -414939 -276362 -17571 -127126
11106a27126C47039f3880J8572C11631b66470D0794J62042G5921J60700e65393
$$ -127126 347039 -63880 -45308 311631 -266470 40794 202836 75921 236621 -565393
11095b73131b4100A55611d6730A41028J0481A7058g9554A15091d7710D46412a17075
$$ -273131 -24100 155611 -46730 141028 151509 17058 -79554 115091 -47710 446412 -117075
11083B1961K00423M2250J31714a03658A95673b41369R0774A19447A7104K9245
$$ 21961 222384 264634 396348 -103658 195673 -241369 -150595 119447 17104 46349
11073D6349K21948K80455b1910B71951I6826h4743D77440B03869j4482L8163K6858
$$ 46349 268297 548752 -21910 271951 96826 -84743 477440 203869 189387 227550 254408
11062B54408k9316Q4234A12411K21387J53173H3866J42153K23879A60119K28967
$$ 254408 225092 309326 112411 333798 486971 83866 226019 449898 160119 389086
11052C89086j44788K67677j40693b35287B86169J40215j24875N31J07939K4077
$$ 389086 244298 511975 371282 -235287 286169 426384 301509 302040 409979 434056
11042D34056L047O2583l9551j76675J05735J513K68736G6776O50730l57280o3162
$$ 434056 437103 499686 460135 283460 389195 390708 659444 76776 727506 370226 307064
11031C07064M07276j30483K699K5350l7342J2667k04858J60155j99404K48179
$$ 307064 714340 583857 586556 611906 574564 587231 382373 542528 343124 591303
11021E91303J292K7623L0501L6613B10196N21792A27694K87636L6558p6941N09726
$$ 591303 592595 620218 650719 687332 210196 731988 127694 415330 451888 374947 884673
11010H84673k28194l16179K54699J59430q4391j33702q6254k0592N1687R3617
$$ 884673 656479 340300 594999 754429 670038 536336 450082 429490 481177 574794
11000E74794K39085l48644k7679Q4548p0532q9371K41661k97554K09911J82101
$$ 574794 813879 465235 437556 522104 451572 362201 603862 306308 516219 698320
10990F98320n940j00480M7782k65692J06996p8262J39449L5480J08738J09404
$$ 698320 692380 591900 639682 373990 480986 402724 542173 577653 686391 795795
10980G95795C88836J6650j48755O1568L17767j15396p3437K81239J74079j40740
$$ 795795 388836 405486 256731 318299 636066 520670 447233 728472 902551 761811
10970G61811J97459j27600k73295K48367K27120n0024r4706K69534k35699K62148
$$ 761811 959270 831670 558375 806742 1033862 983838 889132 1158666 922967 1185115
10960A185115j13175J00676K00731J81618K68056q5490K17260K89701j62131L734
$$ 1185115 1071940 1172616 1373347 1554965 1823021 1737531 1954791 2244492 2082361 2086095
10950B086095L77153n73982K48879l96310j37425K71367n85418L46607j7318m37984
$$ 2086095 2463248 1889266 2138145 1741835 1604410 1875777 1290359 1636966 1619648 1181664
10940A181664P6292M33875P4193m26137K74199q0892O6633k95668K02624m11486
$$ 1181664 1257956 1691831 1766024 1339887 1614086 1533194 1599827 1304159 1506783 1095297
10930A095297m72767L7278N2024k38789q1060A78025L39877A46711R3900l9442
$$ 1095297 622530 659808 711832 473043 391983 178025 517902 146711 240611 201169
10920B01169J90041c66002I7208R860E1253a37583e7065B61115G3776C1877o949
$$ 201169 391210 -366002 97208 107068 51253 -137583 -57065 261115 73776 31877 24928
10909B4928K4504P0006d0021j01098E940a27133C83247A85866M5593f2530l9280
$$ 24928 49432 119438 -40021 -141119 5940 -127133 383247 185866 231459 -62530 -101810
10898a01810C1053Q8083c087k13836R7378p3199j2220A18728E3386J72511h4961
$$ -101810 31053 119136 -3087 -216923 -119545 -192744 -204964 118728 53386 225897 -84961
10886b3345k99B13934a33096B2443a32905f0562A48789b28715C0657K10708i004
$$ -23345 -23644 213934 -133096 22443 -132905 -60562 148789 -228715 30657 241365 -9004
10874E8452f1860A49665n0921l5747a75902A4013d3976B34351D8628i9349j46487
$$ 58452 -61860 149665 98744 62997 -175902 14013 -43976 234351 48628 -99349 -245836
10863b45836c4381j96015h4666B6144a55887b2461l34818a70298H0972B6185a66315
$$ -245836 -34381 -230396 -84666 26144 -155887 -22461 -357279 -170298 80972 26185 -166315
10851b17488Q0503B620c8958A92874A0177J56571K5678E8973h1544B83719c35664
$$ -217488 -136985 2620 -38958 192874 10177 166748 192426 58973 -81544 283719 -335664
10839B70876c3466k5318j38556B2141J92620F0541J56619B9629L05660A16768
$$ 270876 -33466 -58784 -197340 22141 214761 60541 217160 29629 335289 116768
10828a66164e2032l80211a3101l21368J66604n2675N0787j58913i3285I1791g9214
$$ -166164 -52032 -432243 -13101 -334469 -167865 -220540 -169753 -328666 -93285 91791 -79214
10816A68494a4412l9629A16299O8035q7469A6297a30406A19619a4777C78464G2288
$$ 168494 -14412 -54041 116299 184334 96865 16297 -130406 119619 -14777 378464 72288
10804A75599E7880R6444a30846a591n6475J7190a4961A0256a3419k03128J514
$$ 175599 57880 154324 -130846 -1591 -58066 -40876 -14961 10256 -13419 -216547 -215033
10793b15033a980r5439a5627j21745A87024e3157j65901F360L30379a48495b29
$$ -215033 -1980 -97419 -15627 -137372 187024 -53157 -219058 6360 336739 -148495 -229
10781I7297i6659E8622B0151J45797a03226o1736B21637c5259k3284b6121J1984
$$ 97297 -96659 58622 20151 165948 -103226 -164962 221637 -35259 -58543 -26121 -14137
10770a4137q9552D9162b09375R6844p5721a7653D2389b69018A76418G8346b29723
$$ -14137 -103689 49162 -209375 -112531 -188252 -17653 42389 -269018 176418 78346 -229723
10758C2304b19312A32462i7830j31981h1274k5460A26100c0235B3196N3559O4137
$$ 32304 -219312 132462 -97830 -229811 -81274 -106734 126100 -30235 23196 76755 140892
10747A40892C1798J71961a3266q6623k0122d5957k5837C03640i8930r549i222
$$ 140892 31798 203759 -13266 -99889 -120011 -45957 -71794 303640 -98930 -108479 -9222
10735a8216o2620A71654a57592a8344l4987r2657e4698A65982d39051G0661b17129
$$ -18216 -80836 171654 -157592 -18344 -53331 -145988 -54698 165982 -439051 70661 -217129
10723c8688j32263H5270b01604C3138a15002d9735n6582H638b2654A38409i2265
$$ -38688 -170951 85270 -201604 33138 -115002 -49735 -106317 8638 -22654 138409 -92265
10711d9794a3411j38280K9303A62496F1749P4946f8629o0162k5754n9581L1083
$$ -49794 -13411 -151691 -122388 162496 61749 136695 -68629 -128791 -154545 -214126 -183043
10700a83043B75962a83624f5820b6369j34785n9457k33506C0630a43836c5444
$$ -183043 275962 -183624 -65820 -26369 -161154 -220611 -454117 30630 -143836 -35444
10689A1260c75642b5829B5932a28561f3322J1987l97364A3211a58515d6106G7073
$$ 11260 -375642 -25829 25932 -128561 -63322 -51335 -448699 13211 -158515 -46106 77073
10677A87608a99204c4551a5569j82507A13733b8313k57657c4191k22925l6833
$$ 187608 -199204 -34551 -15569 -198076 113733 -28313 -285970 -34191 -257116 -293949
10667b93949Q3207J5508m3524D38872b06966d3693j80609A8713J87081b12663
$$ -293949 -210742 -195234 -238758 438872 -206966 -43693 -224302 18713 205794 -212663
10656F3634d4827G3004e2927C78439C634c3734k39584A3787h7884A9321b50704
$$ 63634 -44827 73004 -52927 378439 3634 -33734 -273318 13787 -87884 19321 -250704
10644B9876P7748O829B3979i5573r6361B5875a84783K4591j39765G8608b92537
$$ 29876 107624 114453 23979 -95573 -191934 25875 -184783 -160192 -299957 78608 -292537
10632B38368e5733k23417N6873n4646F4490a16848N4574B578L3852a53602P5588
$$ 238368 -55733 -279150 -222277 -276923 64490 -116848 -62274 2578 36430 -153602 -78014
10621g8014l54241d9803j33740a0558l15936H5650k5260a54280g2921b0771m74347
$$ -78014 -432255 -49803 -183543 -10558 -326494 85650 60390 -154280 -72921 -20771 -495118
10610d95118b3714C5296O237K5575b36605i1574E9984a02588G4379f0729k9717
$$ -495118 -23714 35296 41533 67108 -236605 -91574 59984 -102588 74379 -60729 -90446
10599i0446n4235j01619d184q5318j06826A36730j0022J88258a41759d0842j92055
$$ -90446 -144681 -246300 -4184 -89502 -196328 136730 126708 314966 -141759 -40842 -232897
10588b32897d4161D2784b75302a13449k16963d3020H899b78816e4013A21772N2720
$$ -232897 -44161 42784 -275302 -113449 -330412 -43020 8899 -278816 -54013 121772 174492
10577A74492D5560g6062B21778D9743L1395a11861k900A92715C8320b63602B7257
$$ 174492 45560 -76062 221778 49743 81138 -111861 -114761 192715 38320 -263602 27257
10565C39062a48643P3252k62266A09107b30977a11175a3128D7878L1994k2158
$$ 339062 -148643 -75391 -337657 109107 -230977 -111175 -13128 47878 79872 57714
10555E7714c19607B74807D2793K69362c7940A02487a15143j45386f0216j598l6244
$$ 57714 -319607 274807 42793 312155 -37940 102487 -115143 -260529 -60216 -61814 -98058
10544i8058j5371B10076J2426a45081O8970A31006n5737B9437Q7161K6014f4842
$$ -98058 -113429 210076 222502 -145081 -76111 131006 75269 29437 116598 142612 -64842
10532a98555O9422j25388A83887a81774O1878j55928O5500b058j53015C6387A7131
$$ -198555 -129133 -254521 183887 -181774 -119896 -275824 -210324 -2058 -155073 36387 17131
10520h6117c416j28646b9615p7239L5466A1614b41086A10293B463a95073N1931
$$ -86117 -3416 -132062 -29615 -106854 -71388 11614 -241086 110293 2463 -195073 -143142
10509a43142F394h4951K4724A92997d83094k60B25821A08114l2859K55393a9392
$$ -143142 6394 -84951 -60227 192997 -483094 -483354 225821 108114 75255 330648 -19392
10497a26044A44958a46764D0238i0471A33503B0604c37779n4375J35687E3035
$$ -126044 144958 -146764 40238 -90471 133503 20604 -337779 -392154 -256467 53035
10486A90181A1116M2022J12973i1669E8160d9009B62598L57F3760j1157J78750
$$ 190181 11116 53138 166111 -91669 58160 -49009 262598 262955 63760 52603 231353
10475B31353G8015a72982O2078o7163I9998c37135H9036J75002c80234a58794
$$ 231353 78015 -172982 -110904 -178067 99998 -337135 89036 264038 -380234 -158794
10464a24391H6250J62304A20958J27715K11541j98086Q2341K65777j29152F7245
$$ -124391 86250 248554 120958 248673 460214 262128 344469 610246 481094 67245
10453B92175j26101l3150c14074I272G12O3884J13338a06135d8209l21593H9763
$$ 292175 166074 132924 -314074 9272 712 64596 177934 -106135 -48209 -369802 89763
10441a01004j38856H4881c00605B16380D3153b79688G4647A7948Q0900B4184J00178
$$ -101004 -239860 84881 -300605 216380 43153 -279688 74647 17948 98848 24184 124362
10430A24362L2581a17246F3996J39510d2641m5623m0159m6661n8407A94291d36060
$$ 124362 156943 -117246 63996 203506 -42641 -88264 -128423 -175084 -233491 194291 -436060
10418c0554q8652b8102n3493J378R727m6503j0651H2795f2252l3965C96569b1963
$$ -30554 -119206 -28102 -81595 -80217 -70490 -116993 -127644 82795 -62252 -96217 396569 -21963
10405B11948P7286a70535f0791j6143M582k12654B76899A28457d1876o8440l90066
$$ 211948 289234 -170535 -60791 -76934 -72352 -285006 276899 128457 -41876 -110316 -500382
10394e00382B30594d4169J7429j81286c6174H7577K9664j6656e4054J6613m0700
$$ -500382 230594 -44169 -26740 -208026 -36174 87577 117241 100585 -54054 -37441 -78141
10383g8141j23506E47788A58650a36663C0789b10478H1400B782a33376J27A01586
$$ -78141 -201647 547788 158650 -136663 30789 -210478 81400 2782 -133376 -133249 101586
10371B5599K99172C9862J95579C3770b02727A49095c16553c8816A67502c05364
$$ 25599 324771 39862 235441 33770 -202727 149095 -316553 -38816 167502 -305364
10360A8366J64734J43742O6065A92179c4047B17834J21263j57800O6515p7929
$$ 18366 183100 326842 392907 192179 -34047 217834 339097 181297 247812 169883
10350A69883J51595k2287g9823C24523l6760B8655J55706a24561I9080B5086J95514
$$ 169883 321478 299191 -79823 324523 287763 28655 184361 -124561 99080 25086 220600
10339B20600b78215H9147a8298o1315C48253j3251k9084M97310B50598J2423k8233
$$ 220600 -278215 89147 -18298 -79613 348253 335002 305918 803228 250598 263021 234788
10328B34788K26420j96625K55612J11466B76666q4560d385E53335i0912H9848
$$ 234788 461208 264583 520195 631661 276666 192106 -4385 553335 -90912 89848
10317A14854N1190P4327b65008R9387B5385a15852c6608k6720j12588G9824L9929
$$ 114854 166044 240371 -265008 -165621 25385 -115852 -36608 -63328 -175916 79824 119753
10306A19753J75322j11945K6462F9215a77524B70516N5850a21536D3934N5628
$$ 119753 295075 183130 209592 69215 -177524 270516 326366 -121536 43934 99562
10296I9562K69104Q7565a76104m7784G6474g1298j33672o7506A71203a04013k43087
$$ 99562 368666 456231 -176104 -223888 76474 -71298 -204970 -272476 171203 -104013 -347100
10285c47100J15871L5187e8467B37643a73369D30871a14208E6377K2287L2826
$$ -347100 -231229 -196042 -58467 237643 -173369 430871 -114208 56377 78664 111490
10275A11490c0753A12349f9279A84206a70027n5666B06938C8717a38557O0526
$$ 111490 -30753 112349 -69279 184206 -170027 -225693 206938 38717 -138557 -78031
10265g8031L4383m5418j4334l11069a11510a8453j04624F615N7985q692a75905
$$ -78031 -43648 -89066 -103400 -414469 -111510 -18453 -123077 6615 64600 55908 -175905
10253H3957L4703m280r096b00772B41577a7840o7194r0842A99686J6255b53654
$$ 83957 118660 114380 105284 -200772 241577 -17840 -85034 -175876 199686 215941 -253654
10241D7623K97302j15486j3158m213j1953K24409j62402p5023B036K65583a88352
$$ 47623 344925 229439 216281 212068 200115 424524 262122 187099 2036 267619 -188352
10229a71419A3026b31708L9259c8821j08545F7755f001m6665I3191b90021J23766
$$ -171419 13026 -231708 -192449 -38821 -147366 67755 -6001 -52666 93191 -290021 -166255
10218a66255F8320L4202c5607n0150a1517A97842I5573a81927A22611C0357J83724
$$ -166255 68320 102522 -35607 -85757 -11517 197842 95573 -181927 122611 30357 214081
10207B14081j06871h9551n9224k3547J256A53199i5579j08375a3715j83632A36510
$$ 214081 107210 -89551 -148775 -172322 -171066 153199 -95579 -203954 -13715 -197347 136510
10195b92235A23156h0235B0576a76297A66046h2065G8491R649a58710F5840f2449
$$ -292235 123156 -80235 20576 -176297 166046 -82065 78491 88140 -158710 65840 -62449
10183a32628N0247q1482n9036A21545E1533d16509a5378k10544B5528a78661j02029
$$ -132628 -82381 -163863 -222899 121545 51533 -416509 -15378 -225922 25528 -178661 -280690
10172b80690o6553A94855D1248P7756a39300A55802b98470A69654a80044r9423
$$ -280690 -347243 194855 41248 119004 -139300 155802 -298470 169654 -180044 -279467
10162b79467O5461h9647M1889j33428h630l44849R1842h7621L2638J1139m07450
$$ -279467 -214006 -89647 -47758 -181186 -8630 -353479 -261637 -87621 -54983 -43844 -451294
10151d51294a31477J1033M716n1542A2076R9549N8489a42777j44184C7405b38532
$$ -451294 -131477 -120444 -115728 -167270 12076 111625 170114 -142777 -286961 37405 -238532
10139A533J26757a02727j15402a843j50467g3257k0819A77010j9812e50715K33321
$$ 1533 128290 -102727 -218129 -1843 -152310 -73257 -94076 177010 157198 -550715 -317394
10128c17394D0684d995l56826M1875a58084d8439j2392K6080A11334K3096a56118
$$ -317394 40684 -4995 -361821 -319946 -158084 -48439 -60831 -34751 111334 134430 -156118
10116A07188D0414a70291h0405j49260j37961c0352I0768d38828a67912E2716
$$ 107188 40414 -170291 -80405 -229665 -367626 -30352 90768 -438828 -167912 52716
10105E8940L5627a13392d7911b0924l85754B17512c30156A11286e18321B10307
$$ 58940 94567 -113392 -47911 -20924 -406678 217512 -330156 111286 -518321 210307
10094B37008e4280C1996J90841A06533b56145B3695i961B7319P7009b5080F2596
$$ 237008 -54280 31996 222837 106533 -256145 23695 -9961 27319 104328 -25080 62596
10082A60193A8545L07099n5441b33906D2804e21967b51910j51861A9392a50203
$$ 160193 18545 325644 270203 -233906 42804 -521967 -251910 -403771 19392 -150203
10071d10759M3985a30176O4865E2980g5906I9822N2309e201j10025m0370f6163
$$ -410759 -366774 -130176 -65311 52980 -75906 99822 152131 -5201 -115226 -155596 -66163
10059i431j24573F7621L2288O3766a48770C823O4199a25751c3093B78800C4482
$$ -9431 -134004 67621 99909 163675 -148770 3823 68022 -125751 -33093 278800 34482
10047A7321n42a71344B24019b34563R5612r6946p1061A90082c36464f9688j05394
$$ 17321 16779 -171344 224019 -234563 -138951 -235897 -306958 190082 -336464 -69688 -175082
10036a75082j519g9352B7555b35233i8419j84335a17990E8570c0084j41373O7896
$$ -175082 -176601 -79352 27555 -235233 -98419 -282754 -117990 58570 -30084 -171457 -103561
10025a03561B01621h0869j40384m1364a11168k62513i0429h347k7804r624k15845
$$ -103561 201621 -80869 -221253 -262617 -111168 -373681 -90429 -8347 -36151 -45775 -261620
10014b61620m2697B6908a26945j42661K0947N4395j19328a04862k39634d0552
$$ -261620 -304317 26908 -126945 -269606 -248659 -194264 -313592 -104862 -344496 -40552
10003D3143Q9032h4533j67708r7409J48999b8855F0351d32987A03229k7942K02441
$$ 43143 132175 -84533 -252241 -349650 -200651 -28855 60351 -432987 103229 75287 277728
9992B77728a50212G6323a09592A36951J12855G6769d1593j16976j54826a6642
$$ 277728 -150212 76323 -109592 136951 249806 76769 -41593 -158569 -313395 -16642
9981A53637c30649K2290A69673a39303f6980F1767M0823J44929k534a15144A85240
$$ 153637 -330649 -308359 169673 -139303 -66980 61767 102590 247519 244985 -115144 185240
9969B08107E0075O9788f1034q2769B80036i9078j87570a9091j69635A76678c6251
$$ 208107 50075 119863 -61034 -143803 280036 -99078 -286648 -19091 -188726 176678 -36251
9957d9618A3935a93056g0718C27612B8503Q4044a93383R0806k9804D1937J06530
$$ -49618 13935 -193056 -70718 327612 28503 112547 -193383 -102577 -132381 41937 148467
9946A48467a84121n561F243b20969A30864a86383b9359H3910c9369j83785e7142
$$ 148467 -184121 -189682 6243 -220969 130864 -186383 -29359 83910 -39369 -223154 -57142
9934e3574m37j6098E148K03368c3195a5746q4434m470c116l08377J18089q5818
$$ -53574 -54011 -70109 5148 208516 -33195 -15746 -100180 -104650 -3116 -311493 -193404 -279222
9922b79222D9767B975i9334a3728r0890H6799b65522j90412A6147b7948r952E9536
$$ -279222 49767 2975 -99334 -13728 -104618 86799 -265522 -455934 16147 -27948 -37900 59536
9909b15027g9779D9592J07619C2528J7940b14809c1030A34197c02974a8892A10995
$$ -215027 -79779 49592 157211 32528 50468 -214809 -31030 134197 -302974 -18892 110995
9897A35012a96938i6878H993b99083g84j45153j03040m350J25077A3260h1122
$$ 135012 -196938 -96878 8993 -299083 -784 -145937 -248977 -253327 -128250 13260 -81122
9885a99402P7082o2150R214e0334A34383g42714e1109I9231a35269A42741P4641
$$ -199402 -122320 -184470 -175256 -50334 134383 -742714 -51109 99231 -135269 142741 217382
9874B17382a97421j23320A12869a5341k13146L0352B8875O3929J9537C7794a87556
$$ 217382 -197421 -320741 112869 -15341 -228487 -198135 28875 92804 112341 37794 -187556
9862A6443J02660m5171b49877A14086N0732J19879b17064j00442a3977l38968
$$ 16443 119103 73932 -249877 114086 164818 284697 -217064 -317506 -13977 -352945
9852c52945C5400a49227A45227i0580j25413j41755r8883d6439A68950a74547
$$ -352945 35400 -149227 145227 -90580 -215993 -357748 -456631 -46439 168950 -174547
9841B8749b3042A58152d1300A27273c11493m2005A11719C6544q182a76040K0745
$$ 28749 -23042 158152 -41300 127273 -311493 -353498 111719 36544 28362 -176040 -155295
9830a55295A73176a34107b6798C7728d3338k64248A07827f9208K8436j59171K1510
$$ -155295 173176 -134107 -26798 37728 -43338 -307586 107827 -69208 -40772 -199943 -178433
9819a78433A6275J16166b09014c1308p2206j31680L8503A00362c70590h324C54246
$$ -178433 16275 132441 -209014 -31308 -103514 -235194 -196691 100362 -370590 -8324 354246
9807a26515D666c33397a54446j05345A39387a25633n470B1526a68035O5924D4156
$$ -126515 4666 -333397 -154446 -259791 139387 -125633 -131103 21526 -168035 -102111 44156
9795g8219H3734q937F954d33153H6045a81001P3648c9907A8369o651f5556G02
$$ -78219 83734 74797 6954 -433153 86045 -181001 -107353 -39907 18369 11718 -65556 702
9782h6486j4825A35712h9547j15967G4477b33154j3918R6080k13332h2901E473
$$ -86486 -101311 135712 -89547 -205514 74477 -233154 -247072 -150992 -364324 -82901 5473
9770b86221e4029A40395e8396k75048K5400b0413q6412k24307h1873r4604A64915
$$ -286221 -54029 140395 -58396 -333444 -308044 -20413 -106825 -331132 -81873 -176477 164915
9758a50031A32185b5112k6177A37849K6615R6166j09204A593b20233f7986j77458
$$ -150031 132185 -25112 -51289 137849 164464 260630 151426 1593 -220233 -67986 -245444
9747b45444Q9277n1290h6989D4275N648c26383O8959l6334f2046B38628r7614
$$ -245444 -156167 -207457 -86989 44275 49923 -326383 -257424 -293758 -62046 238628 141014
9736A41014g3914B43941a14917a9233D4019a82696B38429a35036a9981p1646C088
$$ 141014 -73914 243941 -114917 -19233 44019 -182696 238429 -135036 -19981 -91627 3088
9724A13774a8252A59277c93252A57058c51434a07885m3751g2213A15159e500j77621
$$ 113774 -18252 159277 -393252 157058 -351434 -107885 -151636 -72213 115159 -5500 -183121
9713a83121O3674B0426R0816L5716e3466I461b421j8367A50386c19835A2599f0272
$$ -183121 -119447 20426 111242 146958 -53466 9461 -2421 -20788 150386 -319835 12599 -60272
9700A51558G0286J06659H012b7049j06118j96390O7799k8082F8129a34431B42145
$$ 151558 70286 176945 8012 -27049 -133167 -329557 -261758 -289840 68129 -134431 242145
9688b55823J14227C12621i696l82440a01673E5958b84419n2168h7975E7144d6711
$$ -255823 -141596 312621 -9696 -392136 -101673 55958 -284419 -336587 -87975 57144 -46711
9676A20990K57547A25219d3771r0438c8614k26705f9617o1685J9400q8018L4758
$$ 120990 378537 125219 -43771 -134209 -38614 -265319 -69617 -131302 -111902 -199920 -165162
9665a65162j06307e8891m06638a07260l0450M2298n0749F1440J4814a81254p6985
$$ -165162 -271469 -58891 -465529 -107260 -137710 -95412 -146161 61440 76254 -181254 -258239
9654b58239p8g9516c8943k66376G5047i0927l5012l80735G8994b12597a00757
$$ -258239 -258317 -79516 -38943 -305319 75047 -90927 -125939 -506674 78994 -212597 -100757
9642a14773r8567F9694b16646G3072J69706j2382a93268A25161b74518A02671
$$ -114773 -213340 69694 -216646 73072 242778 230396 -193268 125161 -274518 102671
9631E8018j4520b70092p3326a39958A34061d207A23381b17923a01475B2455J14491
$$ 58018 43498 -270092 -343418 -139958 134061 -4207 123381 -217923 -101475 22455 136946
9620A36946a06995k01892c068A60875b15792R9923j72379g5064k44065c3650k12400
$$ 136946 -106995 -308887 -3068 160875 -215792 -115869 -288248 -75064 -319129 -33650 -246050
9609b46050A89177a79773G3K04415b76384a24441D8048a7069A12688k0380J07651
$$ -246050 189177 -179773 73 204488 -276384 -124441 48048 -17069 112688 92308 199959
9598A99959B2410N9518b09242A02080C1908e84800E1633c55102i9529B11179a12946
$$ 199959 22410 81928 -209242 102080 31908 -584800 51633 -355102 -99529 211179 -112946
9586F3084b06757d6722p6975D180a33172G7051Q139b09390A57924O1933F4517
$$ 63084 -206757 -46722 -123697 4180 -133172 77051 85190 -209390 157924 219857 64517
9574b43589H2552R9276F2511J55176H5375k3117a45348m7601a6171A80925a06579
$$ -243589 82552 181828 62511 217687 85375 62258 -145348 -192949 -16171 180925 -106579
9562c07772b0183k51917C2097h6369l5791b080A29088f7387A45638Q4348d9014
$$ -307772 -20183 -272100 32097 -86369 -122160 -2080 129088 -67387 145638 229986 -49014
9550a11496M1979A56504f5708b4671B51758h9088D1605b2598A43053F774P181
$$ -111496 -69517 156504 -65708 -24671 251758 -89088 41605 -22598 143053 6774 13955
9539A3955K62733a60724j27588K8880d012A30169b6816l73852i110l03003J49800
$$ 13955 276688 -160724 -288312 -259432 -4012 130169 -26816 -400668 -9110 -312113 -162313
9528a62313m0051A61494c796j97224N3174k70196A21707b15232Q3081L1801j33129
$$ -162313 -202364 161494 -3796 -201020 -147846 -418042 121707 -215232 -132151 -100350 -233479
9517b33479m1875I5083a217j35696j07214B32526o5309b19955A1786f2885E2919
$$ -233479 -275354 95083 -1217 -136913 -244127 232526 167217 -219955 11786 -62885 52919
9505E3690J4769J02302c18320A15532K8958B4472J97406a3351l9849H8122a80900
$$ 53690 68459 170761 -318320 115532 144490 24472 221878 -13351 -53200 88122 -180900
9493d7183e420n8434J2798j44246A99470c5921G6630d28545a62145q0160A8105
$$ -47183 -5420 -63854 -51056 -195302 199470 -35921 76630 -428545 -162145 -242305 18105
9481a00045G114a75916a6864B76379A3744J51623h5132A88258F1070a56249i499
$$ -100045 7114 -175916 -16864 276379 13744 165367 -85132 188258 61070 -156249 -9499
9469B47633j04930b34077a15506o2003B28047H8797a92734j35165g3576L3761
$$ 247633 142703 -234077 -115506 -177509 228047 88797 -192734 -327899 -73576 -39815
9459c9815A66306a2646C0966d5097k25736I4381d1476B90611d5095j73380b2606
$$ -39815 166306 -12646 30966 -45097 -270833 94381 -41476 290611 -45095 -218475 -22606
9447b68146j95305D4308m449a68729L40A03704e1080j48981I6425k7514a56621
$$ -268146 -463451 44308 39859 -168729 -168389 103704 -51080 -200061 96425 68911 -156621
9435d88766a32921B69134a33329G863a59992c3486A30877c06669A11228e82533
$$ -488766 -132921 269134 -133329 7863 -159992 -33486 130877 -306669 111228 -582533
9424b54885c3207k28748O9013K4865c2791k6928l7458A34290L1752C7203N2035
$$ -254885 -33207 -261955 -192942 -168077 -32791 -59719 -97177 134290 166042 37203 89238
9413H9238h5640B45749a46419b487k61050a7386I2477c96252K2416A57125b66103
$$ 89238 -85640 245749 -146419 -2487 -263537 -17386 92477 -396252 -373836 157125 -266103
9401f3791C32995a6635m9868A05855N020A9586a34552p8606h9202k92308a25261
$$ -63791 332995 -16635 -66503 105855 110875 19586 -134552 -213158 -89202 -381510 -125261
9389a8561j79873G0907H437h1226j40309A11696b29394e7778k52962H7775a59495
$$ -18561 -198434 70907 8437 -81226 -221535 111696 -229394 -57778 -310740 87775 -159495
9377f4695b8634l07561a60199g3744j98259j1713E1456Q0804o5673a44487N9624
$$ -64695 -28634 -336195 -160199 -73744 -272003 -283716 51456 132260 66587 -144487 -84863
9366h4863n15860h9816A31637D1406N8133j688a65191K8960O7466E1070a64798
$$ -84863 -600723 -89816 131637 41406 99539 97851 -165191 -136231 -68765 51070 -164798
9354h1308J436A31945d28518a11550A81024a86237D042f9024k23369a6338l87123
$$ -81308 -79872 131945 -428518 -111550 181024 -186237 4042 -69024 -292393 -16338 -403461
9343d03461a01328B15052A8370J2688i5754d2937p487j62535A93479c18119f6253
$$ -403461 -101328 215052 18370 31058 -95754 -42937 -50424 -212959 193479 -318119 -66253
9331B27269F1789E695c18581a15517B28374a67945A10471E2456B0331b1084A82796
$$ 227269 61789 5695 -318581 -115517 228374 -167945 110471 52456 20331 -21084 182796
9319A48102M1409f1282A0283c82995a71169A35627c1703A96375E3996i6754r3785
$$ 148102 189511 -61282 10283 -382995 -171169 135627 -31703 196375 53996 -96754 -190539
9308a90539Q6722L8911l883l8551J2508L4028A33089c70122B52107a23129j6431
$$ -190539 -103817 -64906 -68789 -107340 -94832 -60804 133089 -370122 252107 -123129 -139560
9297a39560l03E0250q074d59420G2131b41056f1210a3192G0007b23565l0850F533
$$ -139560 -139863 50250 42176 -459420 72131 -241056 -61210 -13192 70007 -223565 -254415 6533
9284A09450a27786d092j93527B51208E2161b33748f0395q7179D299g6830j35287
$$ 109450 -127786 -4092 -197619 251208 52161 -233748 -60395 -147574 4299 -76830 -212117
9273b12117Q4170J6940j50191M24A73988a46873D9115O0715a61229q5027E8914
$$ -212117 -127947 -111007 -261198 -260774 173988 -146873 49115 109830 -161229 -246256 58914
9261A33812a73473j08728B06549c64062A61919a99695e9170B52034C6902b72924
$$ 133812 -173473 -282201 206549 -364062 161919 -199695 -59170 252034 36902 -272924
9250g5513a0855L01j06967j58091C33660a36763A9610K35787a87165B46092g9087
$$ -75513 -10855 -10554 -117521 -275612 333660 -136763 19610 255397 -187165 246092 -79087
9238A55232L1061L0107b94614I8845b56590J10073b2201k55584E109a12714A83541
$$ 155232 186293 216400 -294614 98845 -256590 -146517 -22201 -277785 5109 -112714 183541
9226A71259b66118B43699D8902A5023d47749a50354o4494c9023B0760P431L8677
$$ 171259 -266118 243699 48902 15023 -447749 -150354 -214848 -39023 20760 28191 66868
9215F6868a21829M5913b5702d038A5116d0979B45682a85555d1812B10136B9996
$$ 66868 -121829 -75916 -25702 -4038 15116 -40979 245682 -185555 -41812 210136 29996
9203H4564e1256B67757b56062a06983F3212F527c38835J10597G4943a88562A79570
$$ 84564 -51256 267757 -256062 -106983 63212 6527 -338835 -228238 74943 -188562 179570
9191a45633O0642I6072C6432d3476j09623F366b0946l8420E5784J3923A7979g9266
$$ -145633 -84991 96072 36432 -43476 -153099 6366 -20946 -59366 55784 69707 17979 -79266
9178a67364O8396d0339f424G3894c55568A46342a61196O100l1463j65647A18732
$$ -167364 -98968 -40339 -6424 73894 -355568 146342 -161196 -155096 -186559 -352206 118732
9166i3249j97181a38545G6969J20596h9732l01537a12085k03157Q1465b2605k48831
$$ -93249 -290430 -138545 76969 197565 -89732 -391269 -112085 -315242 -233777 -22605 -271436
9155b71436B39299b26890A1377L24130c21362A23717N0814n3397c10447a01460
$$ -271436 239299 -226890 11377 335507 -321362 123717 174531 121134 -310447 -101460
9144f6394K1708A33781b47838L631O8376A60029g4300c4637n1788B20248E2610
$$ -66394 -44686 133781 -247838 -244207 -175831 160029 -74300 -34637 -86425 220248 52610
9132a42225p6162J04403G0475a81800L0447q3434j07280B06997a14325o1948l8902
$$ -142225 -218387 -113984 70475 -181800 -151353 -234787 -342067 206997 -114325 -176273 -215175
9121b15175C2679c63658D2498a29994b8039j40312B293a24379b8505C14151A01086
$$ -215175 32679 -363658 42498 -129994 -28039 -168351 2293 -124379 -28505 314151 101086
9109b20554O5057A70944M6421o2074i5477A02909J20643B4245J36813c14186J13018
$$ -220554 -155497 170944 217365 155291 -95477 102909 223552 24245 161058 -314186 -201168
9098b01168E7122J26a93429A44454J6695d06802g2959E0541N0731E0105b05889
$$ -201168 57122 57248 -193429 144454 161149 -406802 -72959 50541 101272 50105 -205889
9086c7763j1023j06809D5033a88496h2578G5896c5949E0061b13992f7176D7280
$$ -37763 -48786 -155595 45033 -188496 -82578 75896 -35949 50061 -213992 -67176 47280
9074B00448H2847b76786a37065j58133O3586N6280k4833L0356L5056c2514o574
$$ 200448 82847 -276786 -137065 -295198 -231612 -175332 -200165 -169809 -134753 -32514 -39088
9063c9088j15406B7431Q4733b66291A1913c12762d3963j30384C71091B0003R416
$$ -39088 -154494 27431 112164 -266291 11913 -312762 -43963 -174347 371091 20003 29419
9052B9419g0370B06329a36491d5698F0054d9319A33430B7550a00003p3834M6170
$$ 29419 -70370 206329 -136491 -45698 60054 -49319 133430 27550 -100003 -173837 -127667
9041a27667p6747j6420L6775a3995j04018A10905c75483B91377a63475a1139j8788
$$ -127667 -204414 -220834 -184059 -13995 -118013 110905 -375483 291377 -163475 -11139 -29927
9030b9927B1896d7558P672k83017A3619O2482a81911H634b2297k36664G6097a97087
$$ -29927 21896 -47558 -39886 -322903 13619 76101 -181911 8634 -22297 -258961 76097 -197087
9017B07016p8917c17262g0652A1752a76924O1665A80770a81047Q8851B21541a81766
$$ 207016 128099 -317262 -70652 11752 -176924 -115259 180770 -181047 -92196 221541 -181766
9005a00039j7254H832a34864K5872B4866J4221J79646B298K9327j0397c9556j32014
$$ -100039 -117293 8832 -134864 -108992 24866 39087 218733 2298 31625 21228 -39556 -171570
8993a71570e4048A32555c6788r8142j90633i8663J4644m0595J1576C4254a6974
$$ -171570 -54048 132555 -36788 -134930 -325563 -98663 -84019 -124614 -113038 34254 -16974
8981c13578A6966J66965C2044b98241A22011o0549a12727k64054d6783m7329j2780
$$ -313578 16966 183931 32044 -298241 122011 61462 -112727 -376781 -46783 -94112 -106892
8970a06892N1801j47228H3148g7329r476A62289b0684A5138c58462a75160m2301
$$ -106892 -55091 -202319 83148 -77329 -86805 162289 -20684 15138 -358462 -175160 -217461
8959b17461C86786A3255b80322N3406I8368Q2482m0524a47919B79807p3305r1006
$$ -217461 386786 13255 -280322 -226916 98368 180850 140326 -147919 279807 206502 115496
8948A15496a1237B21986c287C6214a01834j69117J29590g0352D9470g6074A50121
$$ 115496 -11237 221986 -3287 36214 -101834 -270951 -141361 -70352 49470 -76074 150121
8936f5875q1869j82652E9388i280l05336A13635l4397a84704j72370Q0480O8148
$$ -65875 -147744 -330396 59388 -9280 -314616 113635 79238 -184704 -357074 -276594 -208446
8925b08446P9967A73018L7176a32256b5337B60165M931M1919A10685a5049B16752
$$ -208446 -128479 173018 210194 -132256 -25337 260165 265096 307015 110685 -15049 216752
8913A49442K69698j98873o198J62049o566J01688Q644P65559K73802J507522L553612
$$ 149442 419140 220267 214069 376118 369552 471240 479884 1245443 1519245 3026767 6580379
8902F580379r14006B318490j055135k37139C34956o6582A22388a70559b9714C99163
$$ 6580379 5666373 2318490 1263355 1026216 334956 268374 122388 -170559 -29714 399163
8891A68299H311L61061j00637n5275n5974b89944A83736g8933l31249J82785q091
$$ 168299 8311 369372 268735 213460 157486 -289944 183736 -78933 -410182 -227397 -235488
8880b35488k3432p7423J31218M4260C568N1041g1652J0884d690A63256m9496c4955
$$ -235488 -258920 -336343 -205125 -160865 3568 54609 -71652 -60768 -4690 163256 113760 -34955
8867A60313a37603j197f8339j06755h1719A16190J99976b51232a2469j31724M8928
$$ 160313 -137603 -138800 -68339 -175094 -81719 116190 316166 -251232 -12469 -144193 -95265
8856i5265j17559b9202k55540A40399D087c75012A50210a58310j48162A51734
$$ -95265 -212824 -29202 -284742 140399 4087 -375012 150210 -158310 -306472 151734
$$ [...]
##END NTUPLES=NMR SPECTRUM
##END=
