
##TITLE=AC1168_Tolima-ibague-TPAAH12002_5898356_AT1AgFBPKt
##JCAMPDX= 6.0         $$ Bruker NMR JCAMP-DX V2.0
##DATA TYPE= NMR SPECTRUM
##DATA CLASS= NTUPLES
##ORIGIN= BRUKER
##OWNER= Administrator
$$ 1.72 TOPSPIN		Version 2.1
$$ 2012-04-03 16:56:50.453 -0500  Administrator@TOPSPIN
$$ Compression mode = diff/dup
##.OBSERVE FREQUENCY= 400.13188235
##.OBSERVE NUCLEUS= ^1H
##.ACQUISITION MODE= SIMULTANEOUS (DQD)
##.ACQUISITION SCHEME= undefined
##.AVERAGES= 64
##.DIGITISER RES= 22
##SPECTROMETER/DATA SYSTEM= spect
##.PULSE SEQUENCE= noesygpps1d.comp
##.SOLVENT NAME= COFFEE_meoh
##.SHIFT REFERENCE= INTERNAL, COFFEE_meoh, 1, 14.96863
##AUDIT TRAIL= $$ (NUMBER, WHEN, WHO, WHERE, PROCESS, VERSION, WHAT)
$$ ##TITLE= Audit trail, TOPSPIN		Version 2.1
$$ ##JCAMPDX= 5.01
$$ ##ORIGIN= Bruker BioSpin GmbH
$$ ##OWNER= Administrator
$$ $$ C:\Bruker\TOPSPIN/data/COFFEE/nmr/AC1168_Tolima-ibague-TPAAH12002_5898356_AT1AgFBPKt/12/pdata/1/auditp.txt
$$ ##AUDIT TRAIL=  $$ (NUMBER, WHEN, WHO, WHERE, PROCESS, VERSION, WHAT)
(   1,<2012-04-03 16:56:45.687 -0500>,<Administrator>,<TOPSPIN>,<go>,<TOPSPIN 2.1>,
      <created by zg
	started at 2012-04-03 16:45:14.078 -0500,
	POWCHK enabled, PULCHK disabled,
       configuration hash MD5:
       1A 1E CE 29 27 FD 77 03 67 4E F0 E3 C4 B2 CB 90
       data hash MD5: 64K
       B0 F3 80 FC 82 99 88 1C 4B 96 0E 5E AF C7 A8 73>)
(   2,<2012-04-03 16:56:48.546 -0500>,<Administrator>,<TOPSPIN>,<proc1d>,<TOPSPIN 2.1>,
      <Start of raw data processing
       efp LB = 0.3 FT_mod = 6 PKNL = 1 PHC0 = 0 PHC1 = 0 SI = 128K 
       data hash MD5: 128K
       79 7F 50 8B 96 C9 DB A2 E0 2F A7 F5 D1 2F FA 9D>)
(   3,<2012-04-03 16:56:49.718 -0500>,<Administrator>,<TOPSPIN>,<proc1d>,<TOPSPIN 2.1>,
      <pk PHC0 = 35.5957 PHC1 = 0 
       data hash MD5: 128K
       E9 D6 66 8F 6D B7 05 8B 86 56 08 D4 B2 CE E1 23>)
(   4,<2012-04-03 16:56:49.953 -0500>,<Administrator>,<TOPSPIN>,<proc1d>,<TOPSPIN 2.1>,
      <abs ABSG = 1 
       data hash MD5: 128K
       EB FD DF 15 31 15 52 A0 8C 4A 32 18 33 06 E5 51>)
(   5,<2012-04-03 16:56:50.031 -0500>,<Administrator>,<TOPSPIN>,<proc1d>,<TOPSPIN 2.1>,
      <abs ABSG = 2 
       data hash MD5: 128K
       C3 43 CB 45 9A C2 23 2D 6F 01 49 D7 B7 82 43 CF>)
(   6,<2012-04-03 16:56:50.250 -0500>,<Administrator>,<TOPSPIN>,<proc1d>,<TOPSPIN 2.1>,
      <abs ABSG = 3 
       data hash MD5: 128K
       3E 18 30 6B 89 58 96 98 04 D8 A8 FA FF C5 A9 39>)
(   7,<2012-04-03 16:56:50.312 -0500>,<Administrator>,<TOPSPIN>,<proc1d>,<TOPSPIN 2.1>,
      <abs ABSG = 4 
       data hash MD5: 128K
       7F 82 C0 0A 77 E4 B4 B0 41 70 6E D8 A8 17 17 0D>)
(   8,<2012-04-03 16:56:50.359 -0500>,<Administrator>,<TOPSPIN>,<proc1d>,<TOPSPIN 2.1>,
      <abs ABSG = 5 
       data hash MD5: 128K
       D1 1B 51 A8 CE 8B 5D C2 C3 76 09 83 C3 1D FA E5>)
$$ ##END=
$$ 
$$ $$ hash MD5
$$ $$ FD CF A3 84 F4 F9 E7 DA E4 B1 08 1E 06 F4 D4 18
##$RELAX= 
##$RELAX= 
##$RELAX= 
##$RELAX= 
##$RELAX= 
##$RELAX= 
##$RELAX= 
##$RELAX= 
$$ [...]
##$TP07= 0
##$TPNAME0= <>
##$TPNAME1= <>
##$TPNAME2= <>
##$TPNAME3= <>
##$TPNAME4= <>
##$TPNAME5= <>
##$TPNAME6= <>
##$TPNAME7= <>
##$TPOAL= (0..7)
0.5 0.5 0.5 0.5 0.5 0.5 0.5 0.5
##$TPOFFS= (0..7)
0 0 0 0 0 0 0 0
##$TUNHIN= 0
##$TUNHOUT= 0
##$TUNXOUT= 0
##$USERA1= <user>
##$USERA2= <user>
##$USERA3= <user>
##$USERA4= <user>
##$USERA5= <user>
##$V9= 5
##$VALIST= <valist>
##$VCLIST= <CCCCCCCCCCCCCCC>
##$VD= 0
##$VDLIST= <DDDDDDDDDDDDDDD>
##$VPLIST= <PPPPPPPPPPPPPPP>
##$VTLIST= <TTTTTTTTTTTTTTT>
##$WBST= 2048
##$WBSW= 25
##$XGAIN= (0..3)
0 0 0 0
##$XL= 0
##$YL= 0
##$YMAX_a= 13808077
##$YMIN_a= -6542541
##$ZGOPTNS= <>
##$ZL1= 120
##$ZL2= 120
##$ZL3= 120
##$ZL4= 120
##$ABSF1= 14.96863
##$ABSF2= -5.5839
##$ABSG= 5
##$ABSL= 3
##$ALPHA= 0
##$AQORDER= 0
##$ASSFAC= 0
##$ASSFACI= 0
##$ASSFACX= 0
##$ASSWID= 0
##$AUNMP= <proc_prof1d_extract.lims>
##$AXLEFT= 0
##$AXNAME= <>
##$AXNUC= <1H>
##$AXRIGHT= 0
##$AXTYPE= 0
##$AXUNIT= <>
##$AZFE= 0.1
##$AZFW= 0.1
##$BCFW= 0
##$BC_mod= 0
##$BYTORDP= 0
##$COROFFS= 0
##$CY= 15
##$DATMOD= 1
##$DC= 0
##$DFILT= <>
##$DTYPP= 0
##$F1P= 0
##$F2P= 0
##$FCOR= 0.5
##$FTSIZE= 131072
##$FT_mod= 6
##$GAMMA= 0
##$GB= 0
##$INTBC= 1
##$INTSCL= 1
##$ISEN= 128
##$LB= 0.3
##$LEV0= 0
##$LPBIN= 0
##$MAXI= 10000
##$MC2= 0
##$MEAN= 0
##$ME_mod= 0
##$MI= 0
##$NCOEF= 0
##$NC_proc= -3
##$NLEV= 6
##$NOISF1= 0
##$NOISF2= 0
##$NSP= 0
##$NTH_PI= 0
##$NZP= 0
##$OFFSET= 14.96863
##$PC= 1
##$PHC0= 35.5957
##$PHC1= 0
##$PH_mod= 1
##$PKNL= yes
##$PPARMOD= 0
##$PPDIAG= 0
##$PPIPTYP= 0
##$PPMPNUM= 2147483647
##$PPRESOL= 1
##$PSCAL= 4
##$PSIGN= 0
##$PYNMP= <proc.py>
##$REVERSE= no
##$SF= 400.130004795942
##$SI= 131072
##$SIGF1= 0
##$SIGF2= 0
##$SINO= 400
##$SIOLD= 131072
##$SPECTYP= <>
##$SREGLST= <1H.CDCl3>
##$SSB= 0
##$STSI= 131072
##$STSR= 0
##$SW_p= 8223.68421052632
##$SYMM= 0
##$S_DEV= 0
##$TDeff= 65536
##$TDoff= 0
##$TI= <>
##$TILT= no
##$TM1= 0
##$TM2= 0
##$TOPLEV= 0
##$USERP1= <user>
##$USERP2= <user>
##$USERP3= <user>
##$USERP4= <user>
##$USERP5= <user>
##$WDW= 1
##$XDIM= 131072
##$YMAX_p= 513529045
##$YMIN_p= -498004790
##$CURPLOT= <Network HP LaserJet P1505>
##$CURPRIN= <$Network HP LaserJet P1505>
##$DFORMAT= <normdp>
##$LAYOUT= <+/1D_H.xwp>
##$LFORMAT= <normlp>
##$PFORMAT= <normpl>
##$SURQMSG= 1
$$ End of Bruker specific parameters
$$ ---------------------------------
##NTUPLES= NMR SPECTRUM
##VAR_NAME=  FREQUENCY,     SPECTRUM/REAL,   SPECTRUM/IMAG
##SYMBOL=    X,             R,               I
##VAR_TYPE=  INDEPENDENT,   DEPENDENT,       DEPENDENT
##VAR_FORM=  AFFN,          ASDF,            ASDF
##VAR_DIM=   131072,        131072,          131072
##UNITS=     HZ,            ARBITRARY UNITS, ARBITRARY UNITS
##FACTOR=    0.0627417313425165, 1,          1
##FIRST=     8223.62146879498, -400,         -99728
##LAST=      0,             447,             -102516
##MIN=       0,             -498004790,      0
##MAX=       8223.62146879498, 513529045,    0
$$ Real data points
##PAGE= N=1
##DATA TABLE= (X++(R..R)), XYDATA
$$ [...]
60636A595470l791j757j271j892k132j127M73J404J125J5j373k944m960p412r659
60621A560169j0992j1614j2628j4741j7404j9591k0934k1542k1248j9848j7784
60610A371843j5723j3601j1002q344o707o314o173n489m523l717k908j968j400
60597A283974j502j557p19O31J230N65n51r62l13Q83J897K460K950L780M481L857
60581A301104J490j226k333j432J22J151K017L683O194Q638J0244J0881J0799
60568A351332J0484J0697J2028J4320J7057K0172K3762K7002K8368K7619K6635
60557A569476K7421K9722L1616L2130L2017L1959L1376K9581K7068K4682K2267
60546A889315J9011J4871J0748P289M108K45m911j1062j7030k1499k4116k5608
$$ plain form
60636 1595470 1591679 1589922 1588651 1586759 1584627 1583500 1583973 1585377 1586502 1586517 1585144 1582200 1577240 1569828 1560169
60621 1560169 1549177 1537563 1524935 1510194 1492790 1473199 1452265 1430723 1409475 1389627 1371843
60610 1371843 1356120 1342519 1331517 1323173 1316466 1310152 1303979 1298490 1293967 1290250 1287342 1285374 1283974
60597 1283974 1282472 1280915 1280196 1280827 1282057 1282622 1282071 1281109 1280796 1281679 1283576 1286036 1288986 1292766 1297247 1301104
60581 1301104 1302594 1301368 1299035 1297603 1297725 1298876 1300893 1304576 1310770 1319408 1329652 1340533 1351332
60568 1351332 1361816 1372513 1384541 1398861 1415918 1436090 1459852 1486854 1515222 1542841 1569476
60557 1569476 1596897 1626619 1658235 1690365 1722382 1754341 1785717 1815298 1842366 1867048 1889315
60546 1889315 1908326 1923197 1933945 1941234 1945342 1945587 1940676 1929614 1912584 1891085 1866969 1841361
60534A841361k6623k6902k6098k4825k4057k3716k2702k0346j7077j3630j0375
60523A605010p670o021n433n074m225l276l371n062p596r497r680q055n332k409
60509A522309L4J705K821M104O128Q472R938R947R345R392J0302J1348J2060J2567
60495A630472J2986J3182J3219J3313J3372J3254J3534J5177J8114K0926K2431
60484A799980K3089K4398K7261L1439L6277M1449M7027N3081N9100O3807O5940
60473B272848O5390O3031N9014N1903M0247K4861Q743n459j7281k7527l6101m1526
60461B458143m2557l9700l4704k8833k2136j4357n837K808J1316J9323K5690K9323
60449B358479L0850L2516L5842M0161M4113M7937N3184O0478O8802P7312Q6651
$$ plain form
60534 1841361 1814738 1787836 1761738 1736913 1712856 1689140 1666438 1646092 1629015 1615385 1605010
60523 1605010 1597340 1591319 1585886 1580812 1576587 1573311 1569940 1564878 1557282 1547785 1538105 1530050 1524718 1522309
60509 1522309 1522343 1524048 1526869 1530973 1537101 1545573 1555511 1565458 1574803 1584195 1594497 1605845 1617905 1630472
60495 1630472 1643458 1656640 1669859 1683172 1696544 1709798 1723332 1738509 1756623 1777549 1799980
60484 1799980 1823069 1847467 1874728 1906167 1942444 1983893 2030920 2084001 2143101 2206908 2272848
60473 2272848 2338238 2401269 2460283 2512186 2552433 2577294 2586037 2580578 2563297 2535770 2499669 2458143
60461 2458143 2415586 2375886 2341182 2312349 2290213 2275856 2270019 2272827 2284143 2303466 2329156 2358479
60449 2358479 2389329 2421845 2457687 2497848 2541961 2589898 2643082 2703560 2772362 2849674 2936325
60438B936325R7823J10699J24706J40448J59280J81232K04544K27713K51001K75362
60428D709133L00716L26319L52019L78081M04058M28982M52058M71336M81159
60419H303861M72462M36909L70912K76175J58259K5791j10176k38011l47771m32389
60409H916022m88482n17337n24403n16239m97575m71418m40740m08421l75813
60400D675594l42851l09802k77932k48469k21889j98293j77439j58487j40831
60391B599601j25292j13245j04246r5825q6203p6145o7507o0883n5489n0578m6055
60380A718133m2131l9173l7585l7183l6862l5421l2633k9255k6252k4107k2547
60369A354984k0719j8019j4999j3017j2777j3528j3827j2729j0317p687o314o613
$$ plain form
60438 2936325 3034148 3144847 3269553 3410001 3569281 3750513 3955057 4182770 4433771 4709133
60428 4709133 5009849 5336168 5688187 6066268 6470326 6899308 7351366 7822702 8303861
60419 8303861 8776323 9213232 9584144 9860319 10018578 10044369 9934193 9696182 9348411 8916022
60409 8916022 8427540 7910203 7385800 6869561 6371986 5900568 5459828 5051407 4675594
60400 4675594 4332743 4022941 3745009 3496540 3274651 3076358 2898919 2740432 2599601
60391 2599601 2474309 2361064 2256818 2160993 2074790 1998645 1931138 1870255 1814766 1764188 1718133
60380 1718133 1676002 1636829 1599244 1562061 1525199 1489778 1457145 1427890 1401638 1377531 1354984
60369 1354984 1334265 1316246 1301247 1288230 1275453 1261925 1248098 1235369 1225052 1217365 1211051 1204438
60357A204438p078n782k885n46k2j04Q79K734M094M434M231L836L386L350L963
60342A218928M536M450M365N295O777P400P000O904P810Q863R184R064Q974Q502
60328A318052P221N780N167N301N082L736J553n03j537j312n31l25j164k397l074
60313A341049k908k248j513j113j483k599l603l472k114l66J050K197L504N055
60299A331436O475P335P577P636Q171R503J1263J2729J3434J3357J2773J2265
60287A453954J2631J4211J6180J7055J6205J4481J3160J2686J2760J3151J3758
60276A610232J4125J3592J2062J0248R092R134J0278J1887J3305J4635J6742J9952
60264A765284K3103K4579K3985K1947J8564J3310O616J29n199j0150j5560k0540
$$ plain form
60357 1204438 1197360 1191578 1188693 1188147 1188125 1188021 1188900 1191634 1195728 1200162 1204393 1208229 1211615 1214965 1218928
60342 1218928 1223464 1227914 1232279 1237574 1244351 1251751 1258751 1265655 1273465 1282328 1291512 1300576 1309550 1318052
60328 1318052 1325273 1331053 1336220 1341521 1346603 1350339 1351892 1351389 1349852 1348540 1348009 1347684 1346520 1344123 1341049
60313 1341049 1338141 1335893 1334380 1333267 1331784 1329185 1325582 1322110 1319996 1319630 1320680 1322877 1326381 1331436
60299 1331436 1337911 1345246 1352823 1360459 1368630 1378133 1389396 1402125 1415559 1428916 1441689 1453954
60287 1453954 1466585 1480796 1496976 1514031 1530236 1544717 1557877 1570563 1583323 1596474 1610232
60276 1610232 1624357 1637949 1650011 1660259 1669351 1678485 1688763 1700650 1713955 1728590 1745332 1765284
60264 1765284 1788387 1812966 1836951 1858898 1877462 1890772 1897388 1897517 1892318 1882168 1866608 1846068
60252A846068k3436k3929k3185k2396k1973k1709k0910j8817j5777j3435j2844
60241A627657j2833j1375q191m859k645j453p94m00J80J365K679L187K989L180
60227A598687M168N198N840O694Q121R413R926J0044J0342J0673J0803J1159J2173
60214A713241J3490J4567J5483J6559J7716J8821K0214K2171K4258K5817K6932
60203A929269K8537L1670L6617M2386M7186N0193N2841N7275O3465O9179P3289
60192B481907P7619Q4490R3558J02495J10065J17228J25513J35455J46440J57225
60182C631995J66664J74626J81994J89267J95633J99927K01863K01533J98320
60173E341822J91299J80412J66386J49889J31601J12608R3626P4133N3355L2044
$$ plain form
60252 1846068 1822632 1798703 1775518 1753122 1731149 1709440 1688530 1669713 1653936 1640501 1627657
60241 1627657 1614824 1603449 1595258 1590399 1587754 1586301 1585507 1585107 1585287 1586652 1589331 1592518 1595507 1598687
60227 1598687 1602855 1608053 1613893 1620587 1628708 1638121 1648047 1658091 1668433 1679106 1689909 1701068 1713241
60214 1713241 1726731 1741298 1756781 1773340 1791056 1809877 1830091 1852262 1876520 1902337 1929269
60203 1929269 1957806 1989476 2026093 2068479 2115665 2165858 2218699 2275974 2339439 2408618 2481907
60192 2481907 2559526 2644016 2737574 2840069 2950134 3067362 3192875 3328330 3474770 3631995
60182 3631995 3798659 3973285 4155279 4344546 4540179 4740106 4941969 5143502 5341822
60173 5341822 5533121 5713533 5879919 6029808 6161409 6274017 6367643 6441776 6495131 6527175
60163F527175J2257m616j8699l0451l9598m5431m7577m6173m1743l4998k6436
60152F203710j6151m192R307K4613M2310O2085Q2197J00978J18419J35376J51665
60141F910317J65977J77360J85634J90357J90530J85542J75657J61467J43514
60132H486355J22501R9127P3739M6605J8456r751l7297o3213q5964j04512j19248
60121H426798j30670j37588j38164j32691j23618j12480r8306p9783n7652l4113
60111G381733j0797J1748L3333N3949P3807R2668J09213J21661J29027J31546
60101H127888J30007J24876J15987J03132Q7174P0276N4462M0119K6568J3894
60091H894383L363l929p664p449k425P673K1959L9444N9914Q3221J08516J35044
$$ plain form
60163 6527175 6539432 6534816 6516117 6485666 6446068 6400637 6353060 6306887 6265144 6230146 6203710
60152 6203710 6187559 6183367 6192674 6217287 6259597 6321682 6403879 6504857 6623276 6758652 6910317
60141 6910317 7076294 7253654 7439288 7629645 7820175 8005717 8181374 8342841 8486355
60132 8486355 8608856 8707983 8781722 8828327 8846783 8837032 8799735 8736522 8650558 8546046 8426798
60121 8426798 8296128 8158540 8020376 7887685 7764067 7651587 7553281 7473498 7415846 7381733
60111 7381733 7370936 7382684 7416017 7469966 7543773 7636441 7745654 7867315 7996342 8127888
60101 8127888 8257895 8382771 8498758 8601890 8689064 8759340 8813802 8853921 8880489 8894383
60091 8894383 8897746 8893817 8886153 8878704 8876279 8883952 8905911 8945355 9005269 9088490 9197006 9332050
60079I332050J63198J93930K27222K61785K96264L30444L65268M01838M40264
60070A2012263M79269N16846N51133N80595O03879O20041O28543O28409O17778
60061A7238756N95330N61905N19561M69179M10216L42984K69488J91482J09275
60052B0708176K3532o2934j46587k25523k99126l65860m22862m67594m98813n16073
60042A7726336n19471n10307m91022m63867m29802l88942l41934k90739k38061
60033A4052191j85950j35001q5125l7021P696M7629Q1982J09522J28135J36246
60023A4120304J34183J23522J05714Q2024N4167K3798q387m2098p6211j09024
60013A4407992j39702j68614j96114k21696k44446k63475k77916k87327k92404
$$ plain form
60079 9332050 9495248 9689178 9916400 10178185 10474449 10804893 11170161 11571999 12012263
60070 12012263 12491532 13008378 13559511 14140106 14743985 15364026 15992569 16620978 17238756
60061 17238756 17834086 18395991 18915552 19384731 19794947 20137931 20407419 20598901 20708176
60052 20708176 20731708 20668774 20522187 20296664 19997538 19631678 19208816 18741222 18242409 17726336
60042 17726336 17206865 16696558 16205536 15741669 15311867 14922925 14580991 14290252 14052191
60033 14052191 13866241 13731240 13646115 13609094 13616790 13664419 13746401 13855923 13984058 14120304
60023 14120304 14254487 14378009 14483723 14565747 14619914 14643712 14635325 14593227 14517016 14407992
60013 14407992 14268290 14099676 13903562 13681866 13437420 13173945 12896029 12608702 12316298
60004A2316298k94471k93815k89125k79026k63687k44543k22904j99405j74356
59995A0054966j47927j20037r0575n9851k8664K034L1458N9268Q5789J11609J36416
59984A0034486J58374J75137J85464J89357J86729J76954J60039J37396J10640
59975A1514576Q0168M5884R011k8021o3626r7876j30744j60549j85039k03387
59965A0780397k16317k24504k27688k25249k16966k03304j85439j64881j42644
59956H973405j18880r3628o7486m1041j4093J3842M2619P1766J01273J31135J60462
59945I159374J88040K13537K36960K57179K72188K80886K83193K78387K64998
59936A1434742K42856K13844J80009J42321J01894O0712J9966k0922o2162j01647
$$ plain form
60004 12316298 12021827 11728012 11438887 11159861 10896174 10651631 10428727 10229322 10054966
59995 10054966 9907039 9787002 9696427 9636576 9607912 9609946 9641404 9700672 9786461 9898070 10034486
59984 10034486 10192860 10367997 10553461 10742818 10929547 11106501 11266540 11403936 11514576
59975 11514576 11594744 11640628 11649639 11621618 11557992 11460116 11329372 11168823 10983784 10780397
59965 10780397 10564080 10339576 10111888 9886639 9669673 9466369 9280930 9116049 8973405
59956 8973405 8854525 8760897 8693411 8652370 8638277 8652119 8694738 8766504 8867777 8998912 9159374
59945 9159374 9347414 9560951 9797911 10055090 10327278 10608164 10891357 11169744 11434742
59936 11434742 11677598 11891442 12071451 12213772 12315666 12376378 12396344 12375422 12313260 12211613
59926A2211613j36654j66481j91548k10695k21564k23553k18432k07768j91608
59917A0443310j70249j45558j19456r2207o3255l2981k636K6905N5457Q2854J08752
59906A0090936J32734J53975J71011J82675J89246J92056J91876J88388J81398
59897A1674295J71753J60391J46937J30478J11840R4170Q0474P1246O5351O2724
59887A2769659O4886P2807Q5746J02835J24616J52118J85258K23245K65819L12865
59877A4359854L63126M14518M65502N14958N60823O00209O30980O51801O60060
59868A9221831O51296O21661N70158M97713M05301K94741J70844M0990q7934k11076
59858B2175525l24150m22007n00068n56766n93731o13731o18952o10863n90753
$$ plain form
59926 12211613 12074959 11908478 11716930 11506235 11284671 11061118 10842686 10634918 10443310
59917 10443310 10273061 10127503 10008047 9915840 9852585 9819604 9816968 9843873 9899330 9982184 10090936
59906 10090936 10223670 10377645 10548656 10731331 10920577 11112633 11304509 11492897 11674295
59897 11674295 11846048 12006439 12153376 12283854 12395694 12489864 12570338 12641584 12706935 12769659
59887 12769659 12834545 12907352 12993098 13095933 13220549 13372667 13557925 13781170 14046989 14359854
59877 14359854 14722980 15137498 15603000 16117958 16678781 17278990 17909970 18561771 19221831
59868 19221831 19873127 20494788 21064946 21562659 21967960 22262701 22433545 22474535 22386601 22175525
59858 22175525 21851375 21429368 20929300 20372534 19778803 19165072 18546120 17935257 17344504
59849A7344504n60080n20849m75700m27153l76444l23518k68436k12427j57297
59840A4022600j04080n2641k481M6254R2350J33947J69588J98736K20828K33853
59830A4958954K34819K22105J96361J58602J08610M6692k3830r7892j72192k45424
59820A5386805l14862l75184m22238m56391m80467m95528n00682m96289m84983
59811A1360181m69021m48495m23070l94319l65068l36861l08939k79798k49349
59802H085261k19501j92724j70039j50518j32903j17354j05164r6948r1805q8324
59792F719981q5664q3329q0547p6553p1228o4983n8158n1038m4369l9191l5895
59781F029026l3901l2770l3383l7349m4954n4190o2226o7667p1039p3319p4569
$$ plain form
59849 17344504 16784424 16263575 15787875 15360722 14984278 14660760 14392324 14179897 14022600
59840 14022600 13918520 13865879 13863398 13909652 14002002 14135949 14305537 14504273 14725101 14958954
59830 14958954 15193773 15415878 15612239 15770841 15879451 15926143 15902313 15804421 15632229 15386805
59820 15386805 15071943 14696759 14274521 13818130 13337663 12842135 12341453 11845164 11360181
59811 11360181 10891160 10442665 10019595 9625276 9260208 8923347 8614408 8334610 8085261
59802 8085261 7865760 7673036 7502997 7352479 7219576 7102222 6997058 6900110 6808305 6719981
59792 6719981 6634317 6550988 6470441 6393888 6322660 6257677 6199519 6148481 6104112 6064921 6029026
59781 6029026 5995125 5962355 5928972 5891623 5846669 5792479 5730253 5662586 5591547 5518228 5443659
59770E443659p4058p1110o5669n8387n0385m2435l4135k4180j1897J621J4190
59759E027214K4315L2256L9478M7209N5430O3288P0562P8298Q7493R7349J05669
59748E728561J10989J13320J12729J08485J00510R0540Q0551P0638N9855M8754
59738F624932L9535L3512K9972K8021K8186L1350L7260M5345N6219P0939Q9029
59727G114300J08597J28611J50006J74273K01997K33156K67704L05007L43645
59718I027296L82862M23557M66435N09442N48233N78717N97208N97797N72066
59709A3703613N13413M21508L02185J64993K2453j10415k20079k99943l51260
59700A4146468l78887l87477l81210l64190l39297l07741k70871k31372j91658
$$ plain form
59770 5443659 5369601 5298491 5232822 5174435 5124050 5081615 5047480 5023300 5011403 5013024 5027214
59759 5027214 5051529 5083785 5123263 5170472 5225902 5289190 5359752 5438050 5525543 5622892 5728561
59748 5728561 5839550 5952870 6065599 6174084 6274594 6365134 6445685 6516323 6576178 6624932
59738 6624932 6664467 6697979 6727951 6755972 6784158 6815508 6852768 6898113 6954332 7025271 7114300
59727 7114300 7222897 7351508 7501514 7675787 7877784 8110940 8378644 8683651 9027296
59718 9027296 9410158 9833715 10300150 10809592 11357825 11936542 12533750 13131547 13703613
59709 13703613 14217026 14638534 14940719 15105712 15128165 15017750 14797671 14497728 14146468
59700 14146468 13767581 13380104 12998894 12634704 12295407 11987666 11716795 11485423 11293765
59691A1293765j52052j11727p0820l0591P869M4173P8359J11164J44051J77973
59681A1492164K12434K46513K80506L15626L52511L90948M30927M73040N17736
59672A4712405N64839O13894O64641P17409P73200Q32708Q94652R55739J013249
59663B1742736J067048J117852J163835J200284J222811J229805J221639J198946
59655C1164956J163022J117558J068904J023894R87283R61218R46759R45071R56350
59646D0335015R77838J003886J028232J045649J051423J040595J008766R53118
59638D8444522Q72355P66687O39100M96249L47140K00706O4439n5948j56482k34049
59628E1384719k85226l07167l00347k68980k17347j46802n7642M7581J64912K92151
$$ plain form
59691 11293765 11141713 11029986 10959166 10928575 10936444 10980617 11058976 11170140 11314191 11492164
59681 11492164 11704598 11951111 12231617 12547243 12899754 13290702 13721629 14194669 14712405
59672 14712405 15277244 15891138 16555779 17273188 18046388 18879096 19773748 20729487 21742736
59663 21742736 22809784 23927636 25091471 26291755 27514566 28744371 29966010 31164956
59655 31164956 32327978 33445536 34514440 35538334 36525617 37486835 38433594 39378665 40335015
59646 40335015 41312853 42316739 43344971 44390620 45442043 46482638 47491404 48444522
59638 48444522 49316877 50083564 50722664 51218913 51566053 51766759 51831198 51775250 51618768 51384719
59628 51384719 51099493 50792326 50491979 50222999 50005652 49858850 49801208 49848789 50013701 50305852
59618E0305852M28623N72015P17867Q62328J002889J135692J253915J349423J414136
59609E9042740J439173J414752J332561J187616R78042P05820L79828J7210l59962
59600F6137780p29436j071007j367469j606821j784104j900204j959334j968285
59592E3751120j936658j875370j794296j702148j608417j524210j460559j425625
59584D0423837j422318j446731j488303j532685j566163j579392j568946j536525
59576B8282774j486438j423005j349778j270345j188438j106558j025392r45313
59568A8487507q67808p94766p27044o64523o06942n53765n03961m57090m14227
59559A2897381l76505l42960l11173k80236k51913k28405k09930j95077j82847
$$ plain form
59618 50305852 50734475 51306490 52024357 52886685 53889574 55025266 56279181 57628604 59042740
59609 59042740 60481913 61896665 63229226 64416842 65394884 66100704 66480532 66497742 66137780
59600 66137780 65408344 64337337 62969868 61363047 59578943 57678739 55719405 53751120
59592 53751120 51814462 49939092 48144796 46442648 44834231 43310021 41849462 40423837
59584 40423837 39001519 37554788 36066485 34533800 32967637 31388245 29819299 28282774
59576 28282774 26796336 25373331 24023553 22753208 21564770 20458212 19432820 18487507
59568 18487507 17619699 16824933 16097889 15433366 14826424 14272659 13768698 13311608 12897381
59559 12897381 12520876 12177916 11866743 11586507 11334594 11106189 10896259 10701182 10518335
59550A0518335j73584j68094j66430j67644j70571j74699j80027j86049j91238
59541H939999j93970j93713j90943j86216j79991j72982j65740j57701j47518
59532G351225j34804j20884j07310r4141q0400o5894n1803l9258k7977j6694m712
59521F607348P329J8061K6508L2693L7530M2236M7551N3197N8200O1949O4908
59510G057510O8268P3079P9852Q8620R8935J10003J21365J33638J48067J65063
59500H144400J83469K01555K18734K36160K55773K78787L04789L32028L58579
59491A0514274L83553M07425M31257M55417M78727M98709N12990N20777N22911
59482A4726040N20404N13164N00292M81322M56843M28183L96942L64526L31611
$$ plain form
59550 10518335 10344751 10176657 10010227 9842583 9672012 9497313 9317286 9131237 8939999
59541 8939999 8746029 8552316 8361373 8175157 7995166 7822184 7656444 7498743 7351225
59532 7351225 7216421 7095537 6988227 6894086 6813686 6747792 6695989 6656731 6628754 6612060 6607348
59521 6607348 6614677 6632738 6659246 6691939 6729469 6771705 6819256 6872453 6930653 6992602 7057510
59510 7057510 7125778 7198857 7278709 7367329 7466264 7576267 7697632 7831270 7979337 8144400
59500 8144400 8327869 8529424 8748158 8984318 9240091 9518878 9823667 10155695 10514274
59491 10514274 10897827 11305252 11736509 12191926 12670653 13169362 13682352 14203129 14726040
59482 14726040 15246444 15759608 16259900 16741222 17198065 17626248 18023190 18387716 18719327
59473A8719327K98026K63657K29510J97580J69693J46879J29842J19414J16179
59464B0390107J19644J27929J38304J48285J56233J60454J57808J44085J16539
59455B1659388P5493K2720m1055j15659j98690k84759l68245m45927n16428n78030
59445A9208808o28109o64602o87192o96872o94640o80979o56747o24400n87654
59436A3287613n49403n10215m69304m26692l83747l41919l01836k63690k27649
59427I813158j93608j61106j29804r9586p0150m0950j1728J7317M5920P4014J01684
59416I345161J29354J57772J87280K17165K46195K73583K99051L22354L43416
59407A1521331L62196L77357L85621L83724L70797L47591L13835K68224K10991
$$ plain form
59473 18719327 19017353 19281010 19510520 19708100 19877793 20024672 20154514 20273928 20390107
59464 20390107 20509751 20637680 20775984 20924269 21080502 21240956 21398764 21542849 21659388
59455 21659388 21734881 21757601 21716546 21600887 21402197 21117438 20749193 20303266 19786838 19208808
59445 19208808 18580699 17916097 17228905 16532033 15837393 15156414 14499667 13875267 13287613
59436 13287613 12738210 12227995 11758691 11331999 10948252 10606333 10304497 10040807 9813158
59427 9813158 9619550 9458444 9328640 9229054 9158904 9117954 9106226 9123543 9169463 9243477 9345161
59416 9345161 9474515 9632287 9819567 10036732 10282927 10556510 10855561 11177915 11521331
59407 11521331 11883527 12260884 12646505 13030229 13401026 13748617 14062452 14330676 14541667
59398A4541667J44637P1726o049q5863j62795k32482k93697l47027l91991m26787
59388A2811339m50360m63500m68076m65931m58250m45473m27991m07019l84167
59379H840572l60173l34983l09259k84474k61143k38367k15819j94689j75720
59370F465945j57822j39876j22637j07323r3386p9405o5402n2523m0866k9386
59360E577319j7738o695L316J2736K1841L0354L8125M5471N2860O1032P0738Q1225
59348E970584Q9393R2173Q9939Q6530Q5846Q9543R7727J10145J26011J44029J63493
59337G145413J84589K06894K28229K46022K59891K72659K88813L11806L42277
59328I486593L78517M18617M62007N08945N59254O12164O66914P22566P77363
$$ plain form
59398 14541667 14686304 14758030 14751981 14666118 14503323 14270841 13977144 13630117 13238126 12811339
59388 12811339 12360979 11897479 11429403 10963472 10505222 10059749 9631758 9224739 8840572
59379 8840572 8480399 8145416 7836157 7551683 7290540 7052173 6836354 6641665 6465945
59370 6465945 6308123 6168247 6045610 5938287 5844901 5765496 5700094 5647571 5606705 5577319
59360 5577319 5559581 5552886 5556202 5568938 5590779 5621133 5659258 5704729 5757589 5818621 5889359 5970584
59348 5970584 6059977 6152150 6242089 6328619 6414465 6504008 6601735 6711880 6837891 6981920 7145413
59337 7145413 7330002 7536896 7765125 8011147 8271038 8543697 8832510 9144316 9486593
59328 9486593 9865110 10283727 10745734 11254679 11813933 12426097 13093011 13815577 14592940
59319A4592940Q29074Q75995R16757R49033R69073R73139R59441R28885Q84293
59310B2878630Q28780P64623O93749O19109N44593M73041M04837L38992K74730
59301B7821084K11158J46382P8492P236o6442j42152k19779k97344l70740m36242
59291B6731653m92308n38528n74183n99021o14804o25090o33329o41528o50329
59282B1362533o59729o69578o79569o88860o95869o98718o96056o87434o73146
59273A5213574o53923o30592o03664n73316n39990n04877m69404m34446m00213
59264A0403149l66697l33869l01684k70408k40847k13825j89486j67247j46166
59255H172920j25301j04313q4146o6514n2023l9077k5227r434P311K3243L7212
$$ plain form
59319 14592940 15422014 16298009 17214766 18163799 19132872 20106011 21065452 21994337 22878630
59310 22878630 23707410 24472033 25165782 25784891 26329484 26802525 27207362 27546354 27821084
59301 27821084 28032242 28178624 28257116 28264352 28197910 28055758 27835979 27538635 27167895 26731653
59291 26731653 26239345 25700817 25126634 24527613 23912809 23287719 22654390 22012862 21362533
59282 21362533 20702804 20033226 19353657 18664797 17968928 17270210 16574154 15886720 15213574
59273 15213574 14559651 13929059 13325395 12752079 12212089 11707212 11237808 10803362 10403149
59264 10403149 10036452 9702583 9400899 9130491 8889644 8675819 8486333 8319086 8172920
59255 8172920 8047619 7943306 7859160 7792646 7740623 7701546 7676319 7666885 7674196 7697439 7734651
59244G734651M9415O1303P4332Q8318J01576J12939J22860J31962J39679J45342
59234H762377J49527J52913J54721J53798J50572J46191J40306J31902J22222
59225A0064529J14581J10787J09567J09205J09959J12938J18344J25927J35698
59216A1111535J46732J56346J62120J64185J64121J61931J55517J42943J23910
59207A2489340R8767O7320K9545j2943n6649r7409j31789j57899j75528j85721
59197A1867034j89784j88288j80941j67659j49609j28859j07046q4788o2322l9963
59187A0567775j7762M404K5896M5249O1775P6471R0408J02915J12554J19627J26403
59176A1315715J34875J45419J57774J72279J89727K10720K35517K63959K95408
$$ plain form
59244 7734651 7784066 7845369 7919701 8008019 8109595 8222534 8345394 8477356 8617035 8762377
59234 8762377 8911904 9064817 9219538 9373336 9523908 9670099 9810405 9942307 10064529
59225 10064529 10179110 10289897 10399464 10508669 10618628 10731566 10849910 10975837 11111535
59216 11111535 11258267 11414613 11576733 11740918 11905039 12066970 12222487 12365430 12489340
59207 12489340 12588107 12655427 12684972 12672029 12615380 12517971 12386182 12228283 12052755 11867034
59197 11867034 11677250 11488962 11308021 11140362 10990753 10861894 10754848 10670060 10607738 10567775
59187 10567775 10550013 10554417 10580313 10625562 10687337 10763808 10854216 10957131 11069685 11189312 11315715
59176 11315715 11450590 11596009 11753783 11926062 12115789 12326509 12562026 12825985 13121393
59167A3121393L29237L65253M02862M39806M72419M97204N11450N12480M97359
59158A7149463M63956M11614L40689K52238J48693L4272q5836k06674l23823m32947
59148A7751645n29504o09185o69153p09174p31265p37897p30773p11507o82779
59139A1640408o47912o09652n69857n29908m90543m51711m13529l77180l44103
59130G206013l14550k87723k62926k39828k18132j97964j80154j65099j51755
59121E187882j38819j26375j15218j05172r5521q6455p8456p0591o1452n1549
59111D258274m2820l5683k8594k0765j3224o635j90O529J2555J7431K2364K8378
59099D197620L4983M1794M9772N9266O8337P4822P9207Q3745Q9445R5610J01744
$$ plain form
59167 13121393 13450630 13815883 14218745 14658551 15130970 15628174 16139624 16652104 17149463
59158 17149463 17613419 18025033 18365722 18617960 18766653 18800925 18715089 18508415 18184592 17751645
59148 17751645 17222141 16612956 15943803 15234629 14503364 13765467 13034694 12323187 11640408
59139 11640408 10992496 10382844 9812987 9283079 8792536 8340825 7927296 7550116 7206013
59130 7206013 6891463 6603740 6340814 6100986 5882854 5684890 5504736 5339637 5187882
59121 5187882 5049063 4922688 4807470 4702298 4606777 4520322 4441866 4371275 4309823 4258274
59111 4258274 4215454 4179771 4151177 4130412 4117188 4110553 4110363 4116892 4129447 4146878 4169242 4197620
59099 4197620 4232603 4274397 4324169 4383435 4451772 4526594 4605801 4689546 4778991 4874601 4976345
59088D976345J08283J15468J22853J30050J36926J43096J48095J52115J55779
59079F189010J58969J60514J59272J55249J49414J42514J34206J23603J10801
59070G483552R7413Q5184P4520O5117N7376N2158M9342M8120M8657N2204N9410
59059H173053O9904Q3539J00493J19797J39488J58905J79269K01334K23950K45712
59049I695444K66334K85248L00483L10292L14473L12421L01181K77582K41778
59040A2305236J96826J45154Q7285K4301m0099j00800j53832j97410k31110k54844
59030A1780707k68891k74728k75062k72253k66957k59192k50398k43071k38269
59021I431886k34960k32145k30212k29719k30413k32185k35389k39259k41601
$$ plain form
59088 4976345 5084628 5200096 5322949 5452999 5589925 5733021 5881116 6033231 6189010
59079 6189010 6347979 6508493 6667765 6823014 6972428 7114942 7249148 7372751 7483552
59070 7483552 7580965 7666149 7740669 7805786 7863162 7915320 7964662 8012782 8061439 8113643 8173053
59059 8173053 8242957 8326496 8426989 8546786 8686274 8845179 9024448 9225782 9449732 9695444
59049 9695444 9961778 10247026 10547509 10857801 11172274 11484695 11785876 12063458 12305236
59040 12305236 12502062 12647216 12734501 12758802 12718703 12617903 12464071 12266661 12035551 11780707
59030 11780707 11511816 11237088 10962026 10689773 10422816 10163624 9913226 9670155 9431886
59021 9431886 9196926 8964781 8734569 8504850 8274437 8042252 7806863 7567604 7326003
59012G326003k41278k39523k37547k34363k28579k20994k13493k06243j97903
59003E306080j88008j77348j66457j55449j45039j36092j28290j20546j12619
58994C976232j04997r7636r0182q3330p8417p5598p3649p1657o9910o9028o9043
58983C092785o9376o9132o7617o5102o2515n9887n5992n0375m4604m0230l6621
58972B471334l2448k8275k5531k3538k0074j4918j0515q461p357n115j801R27
58960B294228K053J844J064M84O07J146J228O08J81Q07K086K930L076L422M786
58945B320550O772Q189Q632R151J0953J3714J5813J6274J5639J4903J4573J5037
58933B470200J6734J9312K1610K3043K4235K5660K6847K7610K8772L0680L2260
$$ plain form
59012 7326003 7084725 6845202 6607655 6373292 6144713 5923719 5710226 5503983 5306080
59003 5306080 5118072 4940724 4774267 4618818 4473779 4337687 4209397 4088851 3976232
58994 3976232 3871235 3773599 3683417 3600087 3521670 3446072 3372423 3300766 3230856 3161828 3092785
58983 3092785 3023409 2954277 2886660 2821558 2759043 2699156 2643164 2592789 2548185 2507955 2471334
58972 2471334 2438886 2410611 2385080 2361542 2341468 2326550 2316035 2307574 2300217 2295102 2293301 2294228
58960 2294228 2296281 2298125 2299189 2299673 2300280 2301426 2302654 2303262 2303443 2304250 2306336 2309266 2312342 2315764 2320550
58945 2320550 2327322 2335511 2344143 2353294 2364247 2377961 2393774 2410048 2425687 2440590 2455163 2470200
58933 2470200 2486934 2506246 2527856 2550899 2575134 2600794 2627641 2655251 2684023 2714703 2746963
58922B746963L2751L3188L4671L6392L7071L7385L9006M1844M4258M5592M6668
58911C175789M8043M9608N1826N5466N9994O3879O6605O8921P1162P2853P4112
58900C858258P5850P8459Q1743Q6074R1910R8016J02044J03419J04175J06575
58890D786523J11239J18013J26895J37413J48424J59373J70766J82910J95333
58881F136889K07912K21428K36434K52622K69814K88519L08925L30313L52068
58872H604924L74489L98249M23859M52019M83507N18295N55548N94727O36049
58863A3041666O79868P26615P77275Q32511Q91033R49995J007348J062667J115380
58854B1084358J163446J203931J233411J247214J239767J206713J145974J056366
$$ plain form
58922 2746963 2779714 2812902 2847573 2883965 2921036 2958421 2997427 3039271 3083529 3129121 3175789
58911 3175789 3223832 3273440 3325266 3380732 3440726 3504605 3571210 3640131 3711293 3784146 3858258
58900 3858258 3934108 4012567 4094310 4180384 4272294 4370310 4472354 4575773 4679948 4786523
58890 4786523 4897762 5015775 5142670 5280083 5428507 5587880 5758646 5941556 6136889
58881 6136889 6344801 6566229 6802663 7055285 7325099 7613618 7922543 8252856 8604924
58872 8604924 8979413 9377662 9801521 10253540 10737047 11255342 11810890 12405617 13041666
58863 13041666 13721534 14448149 15225424 16057935 16948968 17898963 18906311 19968978 21084358
58854 21084358 22247804 23451735 24685146 25932360 27172127 28378840 29524814 30581180
58846C0581180R36516P86210O08173M08090J93582k6570k43426m48912o35728
58837C2159115p96987r27897j028211j101315j150246j175994j180075j166488
58829B3631902j139596j101750j054606j001368r45734q89394q32451p75782p21218
58820A5170003o69694o20995n75495n34548m98661m66486m36349m08013l82235
58811A0577527l58963l36834l14587k92588k72311k54187k36569k17596j97704
58802H096188j79319j63983j50753j37701j24013j10151r6764q4199p2478o1126
58792F915701m9369l6916k4283j2028o3J2145K5128L9264N4347O9327Q3260R6745
58780G173258J11430J27778J44346J59923J75426J92680K11893K31413K49936
$$ plain form
58846 30581180 31517696 32303906 32912079 33320169 33513751 33487181 33243755 32794843 32159115
58837 32159115 31362128 30434231 29406020 28304705 27154459 25978465 24798390 23631902
58829 23631902 22492306 21390556 20335950 19334582 18388848 17499454 16667003 15891221 15170003
58820 15170003 14500309 13879314 13303819 12769271 12270610 11804124 11367775 10959762 10577527
58811 10577527 10218564 9881730 9567143 9274555 9002244 8748057 8511488 8293892 8096188
58802 8096188 7916869 7752886 7602133 7464432 7340419 7230268 7133504 7049305 6976827 6915701
58792 6915701 6866332 6829416 6805133 6793105 6793042 6805187 6830315 6869579 6923926 6993253 7076513 7173258
58780 7173258 7284688 7412466 7556812 7716735 7892161 8084841 8296734 8528147 8778083
58771H778083K68174K88039L10549L34770L59110L83546M09989M40025M72979
58762A2045264N07175N42646N81315O24550O71875P22261P75370Q31076Q88589
58753A8190121R46490J002878J055262J101167J138756J165749J177706J168704
58745B6946833J134019J070985R77577Q52438O97168N16835L17320J04053j15462
58736C2501766l30032n28310p03565q53629r77262j072604j139041j178637j195317
58727B4523369j193447j177034j149115j111593j066178j015263r61451r06661
58719A5942627q52362q00003p50291p02498o55690o10375n68051n29399m94034
58710I979924m61763m32854m06862l82366l58393l35444l14548k95739k77922
$$ plain form
58771 8778083 9046257 9334296 9644845 9979615 10338725 10722271 11132260 11572285 12045264
58762 12045264 12552439 13095085 13676400 14300950 14972825 15695086 16470456 17301532 18190121
58753 18190121 19136611 20139489 21194751 22295918 23434674 24600423 25778129 26946833
58745 26946833 28080852 29151837 30129414 30981852 31679020 32195855 32513175 32617228 32501766
58736 32501766 32171734 31643424 30939859 30086230 29108968 28036364 26897323 25718686 24523369
58727 24523369 23329922 22152888 21003773 19892180 18826002 17810739 16849288 15942627
58719 15942627 15090265 14290262 13539971 12837473 12181783 11571408 11003357 10473958 9979924
58710 9979924 9518161 9085307 8678445 8296079 7937686 7602242 7287694 6991955 6714033
58701F714033k60064k42095k24630k08086j92340j77244j63163j50579j39412
58692D956420j29066j19226j10135j02194r5703r0752q6814q2566p7071p1176
58682C991717o6803o4502o2603n9265n4673n0568m8065m6544m4659m2104m0240
58671C411691m0580m2548m3508m1883l9567l9854m3352m7415m9671n0414n1112
58660B921787n2161n2963n3096n2566n1696n1326n2242n3924n4743n3775n1401
58649B341894m8030m3619l8907l5579l4282l3738l2624l1109k9662k7745k4960
58638A961639k2320k1083k1063k1208k1103k0908k0623k0438k0974k2159k2625
58627A727135k1225j8450j5420j2394r311o835n622n190m796m712n542o942q261
$$ plain form
58701 6714033 6453969 6211874 5987244 5779158 5586818 5409574 5246411 5095832 4956420
58692 4956420 4827354 4708128 4597993 4495799 4400096 4309344 4222530 4139964 4062893 3991717
58682 3991717 3924914 3860412 3797809 3738544 3683871 3633303 3585238 3538694 3494035 3451931 3411691
58671 3411691 3371111 3328563 3285055 3243172 3203605 3163751 3120399 3072984 3023313 2972899 2921787
58660 2921787 2869626 2816663 2763567 2711001 2659305 2607979 2555737 2501813 2447070 2393295 2341894
58649 2341894 2293864 2250245 2211338 2175759 2141477 2107739 2075115 2044006 2014344 1986599 1961639
58638 1961639 1939319 1918236 1897173 1875965 1854862 1833954 1813331 1792893 1771919 1749760 1727135
58627 1727135 1705910 1687460 1672040 1659646 1650335 1643500 1637878 1632688 1627892 1623180 1617638 1610696 1602435
58614A602435r763j1806j3329j2681r838o593m626m359n343o714p328o444m408
58601A499203k114l4J713K917L646M486N688O607O830P278R118J2153J5318J8332
58587A591141K1708K5419K8713L1261L3562L6168L9196M2569M6130M9672N3318
58576A998857N7670O3002O8647P3750P8335Q3065Q8269R3835R9961J07451J17128
58565B929970J29090J42397J55795J69123J83715K00673K19152K37472K55664
58556D623051K75289K96572L17313L34987L48335L56332L57450L50684L35569
58547G595582L10175K71064K17061J51846Q1381R920o0157j26092j84574k33351
58537H032855k71512k98490l14240l20031l17982l10036k97952k83575k68150
$$ plain form
58614 1602435 1592672 1580866 1567537 1554856 1545018 1538425 1533799 1529440 1524097 1517383 1510055 1503611 1499203
58601 1499203 1497089 1497055 1498768 1501685 1505331 1509817 1515505 1522112 1528942 1536220 1545338 1557491 1572809 1591141
58587 1591141 1612849 1638268 1666981 1698242 1731804 1767972 1807168 1849737 1895867 1945539 1998857
58576 1998857 2056527 2119529 2188176 2261926 2340261 2423326 2511595 2605430 2705391 2812842 2929970
58565 2929970 3059060 3201457 3357252 3526375 3710090 3910763 4129915 4367387 4623051
58556 4623051 4898340 5194912 5512225 5847212 6195547 6551879 6909329 7260013 7595582
58547 7595582 7905757 8176821 8393882 8545728 8627109 8637029 8576872 8450780 8266206 8032855
58537 8032855 7761343 7462853 7148613 6828582 6510600 6200564 5902612 5619037 5350887
58528E350887k51908k34869k17393j99629j81636j64430j49398j36123j22572
58519C692929j08170r4878q4209p5382o7733o2610o0882o0533n9125n7031n6012
58508B906364n5982n5513n4338n3105n1760n0428n0624n3200n6145n6783n5229
58497B313257n3339n1492m9046m6963m6792m7495m6244m2387l8067l5032l3103
58486A823297l1715l0613k9077k6574k4093k2845k2113k0522j8797j8707j9710
58475A558531j9400j7155j4625j2587j0128p323n915o527p474p187n998m924m425
58462A434863m811o307q268r766j0965j2596j4295j5166j5537j6393j7443j7638
58450A285678j7179j6979j6657j5294j3598j2977j2865j1544r242p800p436o632
$$ plain form
58528 5350887 5098979 4864110 4646717 4447088 4265452 4101022 3951624 3815501 3692929
58519 3692929 3584759 3489881 3405672 3330290 3262557 3199947 3139065 3078532 3019407 2962376 2906364
58508 2906364 2850382 2794869 2740531 2687426 2635666 2585238 2534614 2481414 2425269 2368486 2313257
58497 2313257 2259918 2208426 2159380 2112417 2065625 2018130 1971886 1929499 1891432 1856400 1823297
58486 1823297 1791582 1760969 1731892 1705318 1681225 1658380 1636267 1615745 1596948 1578241 1558531
58475 1558531 1539131 1521976 1507351 1494764 1484636 1477313 1471398 1464871 1457397 1450210 1444212 1439288 1434863
58462 1434863 1430052 1423745 1415477 1405711 1394746 1382150 1367855 1352689 1337152 1320759 1303316 1285678
58450 1285678 1268499 1251520 1234863 1219569 1205971 1192994 1180129 1168585 1159343 1151543 1144107 1137475
58438A137475n116m285m576n072n598o522o724m715j795r48k506m048m584n382
58424A075604o319n365k630j175k480m327m644m113l580k080O80K701K613J750
58410A046635J691K043K170K599L196K462K97r80J8J823L035M519O874Q398P754
58395A092534O365N946N770M508K709J276n63l516o220p234p494q662j0470j1750
58381A063199j2612j3538j3640j1949r433p871p514p365o892o196n376m724m526
58368I51563m064k327k48j40k105l334k113j16P39J102K164L290L784M721O816
58353I59732Q533Q592Q395R553J0918J0694R713R872J0818J1031J0937J2009J3646
58340A094443J3887J2831J2603J3955J5135J4340J1516P724M134J635K14j126
$$ plain form
58438 1137475 1132359 1128074 1123498 1118426 1112828 1106306 1099582 1094867 1093072 1092124 1089618 1085570 1080986 1075604
58424 1075604 1069285 1063920 1061290 1060115 1057635 1053308 1048664 1044551 1040971 1038891 1039571 1042272 1044885 1046635
58410 1046635 1048326 1050369 1052539 1055138 1058334 1060796 1061093 1060113 1060131 1061954 1064989 1069508 1076382 1084780 1092534
58395 1092534 1098899 1104845 1110615 1115123 1117832 1119108 1118545 1115029 1108809 1101575 1094081 1085419 1074949 1063199
58381 1063199 1050587 1037049 1023409 1011460 1002027 994156 986642 979277 972385 966189 960813 956089 951563
58368 951563 947499 945172 944924 944784 942679 939345 937232 937116 937855 938957 941121 944411 948195 952916 959732
58353 959732 968265 976857 985252 994805 1005723 1016417 1026130 1036002 1046820 1057851 1068788 1080797 1094443
58340 1094443 1108330 1121161 1133764 1147719 1162854 1177194 1188710 1196434 1200568 1202203 1202417 1201291
58328A201291l013m691n127m385l280k482k581l946n758o261m675j889R96L373
58314A157572M407L604K501L451O089P518O759O219P579R245R474R133R304Q976
58300A251831P467O592P763R097Q185N812M219L378J812j34o35P83K882M490N062
58285A318604M406L221K806L278L598L954N844Q803R906Q066N961N990P194Q145
58271A399776R696J2419J4365J4223J3896J5101J6179J5260J3848J3968J4433
58260A553164J3472J2526J3669J5433J5201J3799J3833J5026J5259J4978J6556
58249A712916K0018K2923K4133K4629K5112K5354K5501K5855K6056K6011K6419
58238A984927K7137K6897K6020K6822K9866L2732L4141L5877L8675M0182L9518
$$ plain form
58328 1201291 1198278 1193587 1188460 1184075 1180795 1178313 1175732 1171786 1166028 1159767 1155092 1153203 1154199 1157572
58314 1157572 1161979 1165583 1168084 1171535 1177624 1185142 1191901 1198120 1205699 1214944 1224418 1233551 1242855 1251831
58300 1251831 1259298 1265890 1273653 1282750 1290935 1296747 1300966 1304344 1306156 1306022 1305387 1306170 1309052 1313542 1318604
58285 1318604 1323010 1326231 1329037 1332315 1335913 1339867 1345711 1354514 1364420 1372486 1378447 1384437 1391631 1399776
58271 1399776 1409472 1421891 1436256 1450479 1464375 1479476 1495655 1510915 1524763 1538731 1553164
58260 1553164 1566636 1579162 1592831 1608264 1623465 1637264 1651097 1666123 1681382 1696360 1712916
58249 1712916 1732934 1755857 1779990 1804619 1829731 1855085 1880586 1906441 1932497 1958508 1984927
58238 1984927 2012064 2038961 2064981 2091803 2121669 2154401 2188542 2224419 2263094 2303276 2342794
58227B342794L9599M1904M3344M1852M0582M2476M5250M6331M8248N3703N9490
58216B845573O1196O0389O1303O3747O5315O7265P1916P7036P9239Q0328Q4117
58205C617424Q9677R4075R8989J07703J18022J25191J30002J37126J47225J57311
58195D822745J67002J77740J87721J94360K00065K09059K20341K30234K39327
58186F648594K50372K62120K72307K83768L00138L18593L34597L50395L70581
58177I391465L92897M12574M32395M58780M91025N24269N59986O03271O52965
58168A3919627P05075P62612Q30610R04739R76656J047468J123806J204496J284452
58159B2759541J367827J463029J568332J677070J792595J921504K056574K185055
$$ plain form
58227 2342794 2382393 2424297 2467641 2509493 2550075 2592551 2637801 2684132 2732380 2786083 2845573
58216 2845573 2906769 2967158 3028461 3092208 3157523 3224788 3296704 3373740 3452979 3533307 3617424
58205 3617424 3707101 3801176 3900165 4007868 4125890 4251081 4381083 4518209 4665434 4822745
58195 4822745 4989747 5167487 5355208 5549568 5749633 5958692 6179033 6409267 6648594
58186 6648594 6898966 7161086 7433393 7717161 8017299 8335892 8670489 9020884 9391465
58177 9391465 9784362 10196936 10629331 11088111 11579136 12103405 12663391 13266662 13919627
58168 13919627 14624702 15387314 16217924 17122663 18099319 19146787 20270593 21475089 22759541
58159 22759541 24127368 25590397 27158729 28835799 30628394 32549898 34606472 36791527
58151C6791527K311042K451010K610663K786012K983338L216209L487173L797137
58143F0434111M169587M638958N217286N898778O692247P620048Q696180R946254
58135A13313449J1439454J3244562J5342277J7619683J9956491K2307378K4777984
58128B38001278K7697213L1425301L5652038L8666785L7687074L0584829J7714460
58121D57428978K068841j2469460k3195574k9378177l1713804l1427523k9710750
58114C01602531k7477967k5263704k3254423k1432623j9703027j7951986j6108014
58107A50410787j4203553j2353010j0658345r158783p856750o736995n751593
58100H3691758m835558l958676l135028k379443j689331j060532m61490K08936
$$ plain form
58151 36791527 39102569 41553579 44164242 46950254 49933592 53149801 56636974 60434111
58143 60434111 64603698 69242656 74459942 80358720 87050967 94671015 103367195 113313449
58135 113313449 124752903 137997465 153339742 170959425 190915916 213223294 238001278
58128 238001278 265698491 297123792 332775830 371442615 409129689 439714518 457428978
58121 457428978 459497819 447028359 423832785 394454608 362740804 331313281 301602531
58114 301602531 274124564 248860860 225606437 204173814 184470787 166518801 150410787
58107 150410787 136207234 123854224 113195879 104037096 96180346 89443351 83691758
58100 83691758 78856200 74897524 71762496 69383053 67693722 66633190 66171700 66380636
58092F6380636J038658J900562K385844K055532Q15859r63577k701924l965460
58084F6946130m627419m788738m625158m295582l917998l566108l267734l013804
58076C4843589k779974k547199k309361k070353j839718j629054j446655j293156
58068A8928119j163799j054368r62514q84793q16800p56425p03477o56256o12172
58059A1317515n71277n35055n01811m67738m32780m00971l74318l50541l27578
58050G355446l06251k87608k71479k58393k49103k41613k32509k21890k13347
58041E073253k08449k04932k00697j95795j89906j81890j72353j63064j53508
58032C402659j41871j29461j19721j12566j04424r4566q6469q1731p7640p2464
$$ plain form
58092 66380636 67419294 69319856 71705700 73761232 74577091 73613514 70911590 66946130
58084 66946130 62318711 57529973 52904815 48609233 44691235 41125127 37857393 34843589
58076 34843589 32063615 29516416 27207055 25136702 23296984 21667930 20221275 18928119
58068 18928119 17764320 16709952 15747438 14862645 14045845 13289420 12585943 11929687 11317515
58059 11317515 10746238 10211183 9709372 9241634 8808854 8407883 8033565 7683024 7355446
58050 7355446 7049195 6761587 6490108 6231715 5982612 5740999 5508490 5286600 5073253
58041 5073253 4864804 4659872 4459175 4263380 4073474 3891584 3719231 3556167 3402659
58032 3402659 3260788 3131327 3011606 2899040 2794616 2700050 2613581 2531850 2454210 2381746
58022B381746o8356o6812o5639o2923o0070n8317n5857n1244m6524m4212m3675
58011A758117m2876m1285l9044l5670l1755k9552k9829l0045k7660k3433j9809
58000A407159j7834j7063j6827j6268j4805j3407j3715j5287j5866j4858j4097
57989A237132j4573j5081j4880j4884j5176j4269j1952j0094r463q573o865n969
57977A095353o341n773l089m86j40j155j858k550l760m177k774j062j021k456
57963A058711m192o042p702p779n971m529n431p667r099r421r528r572r464r803
57949I52511j0586j0523r111p772p490p227o207n773p025q556q479o985n052k552
57935H49173M39K289J956P61J49l85j198o70J906L822K423n97j475M12K692M046
$$ plain form
58022 2381746 2313390 2246578 2180939 2118016 2057946 1999629 1943772 1892528 1846004 1801792 1758117
58011 1758117 1715241 1673956 1634912 1599242 1567487 1537935 1508106 1478061 1450401 1426968 1407159
58000 1407159 1389325 1372262 1355435 1339167 1324362 1310955 1297240 1281953 1266087 1251229 1237132
57989 1237132 1222559 1207478 1192598 1177714 1162538 1148269 1136317 1126223 1116760 1108187 1101322 1095353
57977 1095353 1089012 1083239 1080150 1079664 1079524 1078369 1076511 1073961 1070201 1066024 1063250 1062188 1061167 1058711
57963 1058711 1054519 1048477 1040775 1032996 1027025 1022496 1017065 1009398 1000299 990878 981350 971778 962314 952511
57949 952511 941925 931402 922291 914519 907029 899802 893595 887822 880797 872241 863762 856777 851725 849173
57935 849173 849612 851901 853857 854618 854767 854382 853184 852514 854420 858242 860665 860068 858593 859005 861697 865743
57919H65743M810M606K807Q66Q32J754O49k924o197p261p026o941p243p873q791
57904H27811r037p653n766n548o947p724p017o485p357q658r202r247r254q742
57890G19174p473o229n563m927l839k769k200j859j350o39L22J410J738N28j297
57875F85027j875r22Jj16o96j284k514m638o796q511j0285j1771j1147p806m193
57860F12474l092l977l870j446J541K998L032L231M459O143P204P181O509O083
57846F48470O369O857O574N375M470N239P401Q893P968N070K156L35r45k449l793
57831G07990m037l076k024k471n278r473j2457j2303r932p928p185o299m590l629
57817F17308m557n860n575m182l268k577p84J612K795K772L461N542P536Q457
$$ plain form
57919 865743 870553 875159 877966 878832 879664 881418 882067 879143 872946 865685 858659 851718 844475 836602 827811
57904 827811 818774 811121 805355 799807 792860 785136 778119 771634 764277 755619 746417 737170 727916 719174
57890 719174 711701 705472 699909 694982 691143 688374 686174 684315 682965 682326 682648 684058 685796 686324 685027
57875 685027 683152 682230 682231 682115 681419 680135 677621 672983 666187 657676 647391 635620 624473 616667 612474
57860 612474 609382 605405 601535 600089 601630 604628 607660 610891 615350 621493 628697 635878 642387 648470
57846 648470 654839 661696 668270 673645 678115 683354 690755 699648 707616 712686 714842 715177 714232 711783 707990
57831 707990 703953 700877 698853 696382 691104 681631 669174 656871 646939 639011 631826 625527 620937 617308
57817 617308 612751 606891 601316 597134 593866 591289 590505 592117 594912 597684 601145 606687 614223 622680
57803F22680R112J0157J0847J0653J0260J0025Q970O451L510J472L35n16j101
57790G02855j443k324m354o922r057j0636j1834j2152j1111r503q852r675j0991
57777E94001j1415j0400q557p121o873p355p498o959o309n907n531n344o187q333
57763D90212j0757j2255j2580j2041j0838r493r053r831j0542r687p492n600n083
57750C64960n514n835n411m280k991k225k132k052j153P00K850M341M431L126
57736C48815J547J312L063N801P990Q969Q937Q064O325M135K576K696M487O480
57722D21197O642M293J179q7J084K565K093p2j757j684r57j716m731q438j0271
57707D09340r071o128l635k390j603p27k95n75m77J184L935O040O509N971N680
$$ plain form
57803 622680 631792 641949 652796 663449 673709 683734 692704 699155 702665 704137 704472 703956 702855
57790 702855 701412 699088 694734 687812 678755 668119 656285 644133 633022 623519 614667 604992 594001
57777 594001 582586 572186 563629 556508 549635 542280 534782 527823 521514 515607 510076 504732 498545 490212
57763 490212 479455 467200 454620 442579 431741 422248 413195 403364 392822 383135 375643 370043 364960
57750 364960 359446 353611 348200 343920 340929 338704 336572 334520 333367 334067 336917 341258 345689 348815
57736 348815 350362 351674 354737 360538 368528 377497 386434 394498 400823 404958 407534 410230 414717 421197
57722 421197 427839 432132 433311 433224 434308 436873 438966 438894 437137 435453 434496 432780 428049 419611 409340
57707 409340 400269 394141 390506 388116 386513 385786 385491 384916 384439 385623 389558 395598 402107 408078 413758
57692D13758O214P199P897P979P820P980Q436Q669Q538Q568R117R709R555Q489
57678E29928P150O370O455O997P393P693Q536R975J1059J1286J1727J3506J5812
57665F53887J6992J7189J7999J9492J9930J8960J8823K1168K4727K7628L0147
57654H86942L3294L6309L7738L7972L8516L9517M0180M1098M3811M8161N2158
57643A335696N4777N7138O0616O5304P0710P6645Q3002Q9664R6753J04138J11029
57632B205472J17211J24236J33880J45776J58239J71187J86206K03677K21943
57623C667827K39684K56965K73191K86112K93990K96985K95066K85903K66409
57614F162132K35656J95478J49245J01005N4716J3070k2882n3069p8820j04148
$$ plain form
57692 413758 419972 427171 435068 443047 450867 458847 467283 475952 484490 493058 502175 511884 521439 529928
57678 529928 537078 543448 549903 556900 564293 571986 580522 590497 601556 612842 624569 638075 653887
57665 653887 670879 688068 706067 725559 745489 764449 783272 804440 829167 856795 886942
57654 886942 920236 956545 994283 1032255 1070771 1110288 1150468 1191566 1235377 1283538 1335696
57643 1335696 1390473 1447611 1508227 1573531 1644241 1720886 1803888 1893552 1990305 2094443 2205472
57632 2205472 2322683 2446919 2580799 2726575 2884814 3056001 3242207 3445884 3667827
57623 3667827 3907511 4164476 4437667 4723779 5017769 5314754 5609820 5895723 6162132
57614 6162132 6397788 6593266 6742511 6843516 6898232 6911302 6888420 6835351 6756531 6652383
57604F652383j34152j70222k07826k40353k64040k78133k82223k76247k62413
57595D536774k44621k25595k06070j86523j67813j50000j32298j14700r8351q3861
57585B926942p0547n7710m5616l4714k4828j5531o586K300J1423K0646K9768L9417
57573B774964N0475O2508P3956Q4349R5152J07794J21822J35794J49137J62257
57563C818208J75502J88898K02271K14557K23471K26847K24020K14937J98241
57554E686952J71614J34399Q8846L8443j4127o6733j16488j59916j94591k20066
57544E348333k37097k46494k49037k46108k39750k31760k22802k12628k01096
57535C261561j88581j75338j61156j46303j32407j21403j13374j06297r8402r0018
$$ plain form
57604 6652383 6518231 6348009 6140183 5899830 5635790 5357657 5075434 4799187 4536774
57595 4536774 4292153 4066558 3860488 3673965 3506152 3356152 3223854 3109154 3010803 2926942
57585 2926942 2856395 2798685 2753069 2718355 2693527 2677996 2671410 2673710 2685133 2705779 2735547 2774964
57573 2774964 2825439 2887947 2961903 3046252 3141404 3249198 3371020 3506814 3655951 3818208
57563 3818208 3993710 4182608 4384879 4599436 4822907 5049754 5273774 5488711 5686952
57554 5686952 5858566 5992965 6081811 6120254 6106127 6039394 5922906 5762990 5568399 5348333
57544 5348333 5111236 4864742 4615705 4369597 4129847 3898087 3675285 3462657 3261561
57535 3261561 3072980 2897642 2736486 2590183 2457776 2336373 2222999 2116702 2018300 1928282
57525A928282q2502p6154p0200o4350n9103n4538n0027m5364m1058l7172l3046
57514A314768k8748k5607k4332k3585k1602j8548j5919j4066j1821q554n176k673
57502A114137p70J366L846O020P235P492P724R449J3367J8255K2071K4179K5627
57489A259998K7147K8229K8718K9972L3303L8034M2351M5695M9277N4236O0321
57478A697281O6499P2226P7902Q4417R2440J01931J12329J23148J34125J44714
57468B707012J54034J61720J68307J74180J78465J79411J75500J65623J48653
57459D212905J23996R2670N7061J9351j9283n7725r3794j24725j48567j64820
57449C897069j73992j77078j75502j71017j65050j58037j49659j39785j29120
$$ plain form
57525 1928282 1845780 1769626 1699426 1635076 1575973 1521435 1471408 1426044 1384986 1347814 1314768
57514 1314768 1286020 1260413 1236081 1212496 1190894 1172346 1156427 1142361 1130540 1121986 1116810 1114137
57502 1114137 1113367 1114733 1118579 1124599 1131834 1139326 1147050 1156499 1169866 1188121 1210192 1234371 1259998
57489 1259998 1287145 1315374 1344092 1374064 1407367 1445401 1487752 1533447 1582724 1636960 1697281
57478 1697281 1763780 1836006 1913908 1998325 2090765 2192696 2305025 2428173 2562298 2707012
57468 2707012 2861046 3022766 3191073 3365253 3543718 3723129 3898629 4064252 4212905
57459 4212905 4336901 4429571 4486632 4505983 4486700 4428975 4335181 4210456 4061889 3897069
57449 3897069 3723077 3545999 3370497 3199480 3034430 2876393 2726734 2586949 2457829
57440B457829j18730j09135r9920r0191p9337o7692n6603m7609m1118l5943l0323
57429A681228k3465j6011r268m042J06M594J0390J6726K1865K5387K8856L3727
57417A770093L9660M5829N2798O1690P2133Q2717R3067J03748J14398J23933J32711
57406B692777J42290J52396J60098J62973J61328J56031J45743J28039J02318
57397D003993P0171L3543n933m6177q4600j18897j47263j68299j81680j88744
57387C166114j91531j91285j88202j82383j74400j65040j54730j43279j30549
57378A644715j17763j07516j01184r6751r0758q2421p3996o7100o0986n5033n0318
57367G40889m7364m4629m1017l7842l6341l5146l2568k9641k8198k7350k4927
$$ plain form
57440 2457829 2339099 2229964 2130044 2039853 1960516 1892824 1836221 1788612 1747494 1711551 1681228
57429 1681228 1657763 1641752 1632484 1628442 1628548 1633142 1643532 1660258 1682123 1707510 1736366 1770093
57417 1770093 1809753 1855582 1908380 1970070 2042203 2124920 2217987 2321735 2436133 2560066 2692777
57406 2692777 2835067 2987463 3147561 3310534 3471862 3627893 3773636 3901675 4003993
57397 4003993 4074164 4107707 4101774 4055597 3970997 3852100 3704837 3536538 3354858 3166114
57387 3166114 2974583 2783298 2595096 2412713 2238313 2073273 1918543 1775264 1644715
57378 1644715 1526952 1419436 1318252 1221501 1130743 1048322 974326 907226 846240 791207 740889
57367 740889 693525 648896 607879 570037 533696 498550 465982 436341 408143 380793 355866
57356C55866k1516j9810k0310k0724j9743j8546j8109j7697j6753j5918j5387
57345A51353j4355j2908j2421j3101j3089j1160q676p673q379r713j0943j1645
57333A7290F095c498q132q061r054r655q891p009n093m379n364p269q823r620
57319i4848j0080j0245r668q508p670p667q339r699j1791j3556j3379j1232q911
57306b25593p607o594n102l969m230n167n260m372l663l570l301k436j835k312
57292b85011l124k708q96M76j92k061k898k157j535k125k707j870l64L06M05J162
57276c05299K182J827M0j302j023J07J029J652K063K048J793J840K054J845J526
57261b87618K109L632M998N715O347P077P306O961O793P055P176P072P417Q352
$$ plain form
57356 355866 334350 314540 294230 273506 253763 235217 217108 199411 182658 166740 151353
57345 151353 136998 124090 111669 98568 85479 74319 65643 57970 49591 39878 28935 17290
57333 17290 6095 -3498 -11630 -19691 -28745 -38400 -47291 -54300 -59393 -63772 -69136 -76405 -85228 -94848
57319 -94848 -104928 -115173 -124841 -133349 -141019 -148686 -157025 -166724 -178515 -192071 -205450 -216682 -225593
57306 -225593 -233200 -239794 -244896 -248865 -253095 -258262 -263522 -267894 -271557 -275127 -278428 -280864 -282699 -285011
57292 -285011 -288135 -290843 -291739 -291263 -291455 -293516 -296414 -298571 -300106 -302231 -304938 -306808 -307172 -306866 -306461 -305299
57276 -305299 -303117 -301290 -301250 -302552 -303575 -303468 -302439 -300787 -298724 -296676 -294883 -293043 -290989 -289144 -287618
57261 -287618 -285509 -281877 -276879 -271164 -264817 -257740 -250434 -243473 -236680 -229625 -222449 -215377 -207960 -199608
57247a99608R188R595R833R801R221Q735R287J0443J0973J1016J1794J3254J4131
57234f2337J4441J5662a4259E480K0319K1180K3309K5671K7215K8300K9114K8741
57222B09329K7045K5552K5136K4566K2605J9879J7269J4069R157K750m235j1314
57210C81808j8047k3853k9112l5011m1356m6029m7585m6960m5760C749c8568l9510
57198g8078l5704l0983k6641k4014k2160j8959j4826j2609j3147j4016j3768j4133
57186c19038j6323j8308j7992j6365j5057j3375j0357p423o194n631m020k068
57174d52151j335j288n23N43Q82J309L027N027N542N100N664P615R736J1270J2042
57159c87540J1750J0954J1441J3741J5836J6250J6518J8368K0434K0536J9357
$$ plain form
57247 -199608 -190420 -180825 -170992 -161191 -151970 -143235 -133948 -123505 -112532 -101516 -89722 -76468 -62337
57234 -62337 -47896 -32234 -14259 5480 25799 46979 70288 95959 123174 151474 180588 209329
57222 209329 236374 261926 287062 311628 334233 354112 371381 385450 394607 397357 393122 381808
57210 381808 363761 339908 310796 275785 234429 188400 140815 93855 48095 3749 -38568 -78078
57198 -78078 -113782 -144765 -171406 -195420 -217580 -236539 -251365 -263974 -277121 -291137 -304905 -319038
57186 -319038 -335361 -353669 -371661 -388026 -403083 -416458 -426815 -434238 -440432 -446063 -450083 -452151
57174 -452151 -453486 -454774 -455297 -454754 -453872 -452563 -449536 -444509 -438967 -433867 -428203 -420588 -410852 -399582 -387540
57159 -387540 -375790 -364836 -353395 -339654 -323818 -307568 -291050 -272682 -252248 -231712 -212355
57148b12355J8915J8930J7930J6813J7977K1503K5098K7535a8091A3713L3978
57137D7691L5804L6962L6765L5583L5364L7036L8777L8686L7548L6904L6234L4455
57125D87809L2546L2086L2680L3122L3504L3797L2337K8339K3968K1178J8482
57114H09848J3796Q408N009L778L520M684P637R948R157O672N458N437M633L079
57100I01064K013R42r96k637l292n267j0043j4310j4285j1870j1970j5572k0122
57087G93655k4933l1505m0018n0059o3290q1102j01315j21259A38327b6232j87421
57076b13653k08655k31017k57178k84434l09682l35712l65977l97127m24218m49729
57066c477382m79241n11585n42025n72414o08989o52579p00249p54550q21514
$$ plain form
57148 -212355 -193440 -174510 -156580 -139767 -121790 -100287 -75189 -47654 -18091 13713 47691
57137 47691 83495 120457 157222 192805 228169 265205 303982 342668 380216 417120 453354 487809
57125 487809 520355 552441 585121 618243 651747 685544 717881 746220 770188 791366 809848
57114 809848 823644 832052 837061 840839 844359 849043 856680 866628 875785 882457 887915 893352 897985 901064
57100 901064 903077 904019 903023 900386 897094 891827 881784 867474 853189 841319 829349 813777 793655
57087 793655 768722 737217 697199 647140 583850 502748 401433 280174 138327 -26232 -213653
57076 -213653 -422308 -653325 -910503 -1194937 -1504619 -1840331 -2206308 -2603435 -3027653 -3477382
57066 -3477382 -3956623 -4468208 -5010233 -5582647 -6191636 -6844215 -7544464 -8299014 -9120528
57057i120528r01403r90938j092528j211335j345561j490112j647514j824370
57049a9624289k019912k229843k458333k713152k992384l290544l615140l981683
57041d2925280m395444m855457n374071n973990o668960p468806q401687r508070
57033i5571765j0812376j2320442j4032621j5918207j7872887j9743217k1414955
57026b07686470k2872621k4212373k5660581k7519124k9871731l2175602l3224771
57019d03223273l1757022k7268186k0295677j1987074l473558M430526J1208167
57012d82366097J6577614K0476586K3008138K4357532K4774046K4596969K4209194
57005c24366018K3904498K3783935K3760643K3642054K3231355K2415457K1204238
$$ plain form
57057 -9120528 -10021931 -11012869 -12105397 -13316732 -14662293 -16152405 -17799919 -19624289
57049 -19624289 -21644201 -23874044 -26332377 -29045529 -32037913 -35328457 -38943597 -42925280
57041 -42925280 -47320724 -52176181 -57550252 -63524242 -70193202 -77662008 -86063695 -95571765
57033 -95571765 -106384141 -118704583 -132737204 -148655411 -166528298 -186271515 -207686470
57026 -207686470 -230559091 -254771464 -280432045 -307951169 -337822900 -369998502 -403223273
57019 -403223273 -434980295 -462248481 -482544158 -494531232 -498004790 -493574264 -482366097
57012 -482366097 -465788483 -445311897 -422303759 -397946227 -373172181 -348575212 -324366018
57005 -324366018 -300461520 -276677585 -252916942 -229274888 -206043533 -183628076 -162423838
56998a62423838J9696441J8009624J6241111J4471197J2767271J1174239R715443
56991f0348512Q407284P261738O274923N427816M701827M084065L558415L105282
56983a7527162K713147K379802K099894J860955J653410J474664J320984J184627
56975b839679J061669h23423D0883P86530P17631O57468O04547N55068N08337
56966C870464M67165M31717L98686L67013L38043L09612K76895K40454K07027
56957F907076J80723J59287J40137J23758J09463R4035P7132O2738N2957M5094
56947G952400L6905L0107K6520K4983K4026K3631K2633J8543J2192R191J4211
56936H195342K4993L1610J9295k5435j04454k01837k92476l59215l99584m17730
$$ plain form
56998 -162423838 -142727397 -124717773 -108476662 -94005465 -81238194 -70063955 -60348512
56991 -60348512 -51941228 -44679490 -38404567 -32976751 -28274924 -24190859 -20632444 -17527162
56983 -17527162 -14814015 -12434213 -10334319 -8473364 -6819954 -5345290 -4024306 -2839679
56975 -2839679 -1778010 -823423 40883 827413 1545044 2202512 2807059 3362127 3870464
56966 3870464 4337629 4769346 5168032 5535045 5873088 6182700 6459595 6700049 6907076
56957 6907076 7087799 7247086 7387223 7510981 7620444 7714479 7791611 7854349 7907306 7952400
56947 7952400 7989305 8019412 8045932 8070915 8094941 8118572 8141205 8159748 8171940 8181131 8195342
56936 8195342 8220335 8251945 8271240 8245805 8141351 7939514 7647038 7287823 6888239 6470509
56926F470509m16740m00457l75910l49220l22201k95710k72633k54661k39406
56917C543571k23938k08796j95956j85173j74985j65238j56045j45928j33337
56908A954175j19046j05335r3630q4026p5834o7698n8363m8140l8661l0884k4600
56897A207958j9660j6161j3741j2546j4337k0119k7287l1941l3735l5266l7006
56886I46159l6648l3791l1217l0303k8877k5246k1085j8386j6346j3204q853l992
56874F78211J234O228R807J2376J6015K0881K3575K0584J1775l58j2846k2818
56862G64664k8395l0338l1111l1582l0814k9236k8865k9438k7803k2911j8144
56851D56027j6544j6723j5986j4723j4814j5802j5912j5305j5426j6090j5832
$$ plain form
56926 6470509 6053769 5653312 5277402 4928182 4605981 4310271 4037638 3782977 3543571
56917 3543571 3319633 3110837 2914881 2729708 2554723 2389485 2233440 2087512 1954175
56908 1954175 1835129 1729794 1636164 1552138 1476304 1408606 1350243 1302103 1263442 1232558 1207958
56897 1207958 1188298 1172137 1158396 1145850 1131513 1111394 1084107 1052166 1018431 983165 946159
56886 946159 909511 875720 844503 814200 785323 760077 738992 720606 704260 691056 682203 678211
56874 678211 679445 685673 695480 707856 723871 744752 768327 788911 800686 800328 787482 764664
56862 764664 736269 705931 674820 643238 612424 583188 554323 524885 497082 474171 456027
56851 456027 439483 422760 406774 392051 377237 361435 345523 330218 314792 298702 282870
56840B82870j4392j2754j1382j0303j0000j0452j0086p496l489J39L038O060R435
56827B11188J2822J6420K0488K4289K6745K7603K7020K4828K1295J7777J5481
56816D45956J4256J3372J2678J2274J2037J2200J3346J5257J6975J8453K0632
56805F07436K3361K5236K6321K8849L3896L9334M2552M3240M1765L6743K6664
56794I75397J2807j459j3460k1997k6600k7718k6694k4305k0352j5445j1295p929
56782G90950k900M907J2927J8573K3176K9471L7113M3768M9125N4321N8176N7480
56770A177087N0815L9172K3300L740j6415l2239m1356m5339m6349m4888m1319
56759A026209l6984l2637k7635k1630j5389r455l542K203P148J1781J7574K4531
$$ plain form
56840 282870 268478 255724 244342 234039 224039 213587 203501 196005 192516 192655 195693 201753 211188
56827 211188 224010 240430 260918 285207 311952 339555 366575 391403 412698 430475 445956
56816 445956 460212 473584 486262 498536 510573 522773 536119 551376 568351 586804 607436
56805 607436 630797 656033 682354 711203 745099 784433 826985 870225 911990 948733 975397
56794 975397 988204 986745 973285 951288 924688 896970 870276 845971 825619 810174 798879 790950
56782 790950 788050 792957 805884 824457 847633 877104 914217 957985 1007110 1061431 1119607 1177087
56770 1177087 1227902 1267074 1290374 1294114 1277699 1245460 1204104 1158765 1112416 1067528 1026209
56759 1026209 989225 956588 928953 907323 891934 882479 878937 881140 888288 900069 917643 942174
56747I42174L0672L4559L6430L5921L0720J9181L183j2967k5925l4742l9920m2340
56735I76946m2767m1631l9136l5635l1444k6436k0580j4793j0253o784l060J448
56723G05875N906R784J3675J7803K0829K1086J8286J3159O150k483j1452j8419
56711H00199k1812k2332k2172k2459k2062j9576j6007j3982j4122j3975j1597
56700F00103q455p155p688q064p683p594p895p492o504o472p682q497p968o993
56686D93961o145m554j971L2K67l41n34p20j697k824l119l176m290o309p804p983
56670D42793p380p023p655r154j0093q865n951l892m040m676l571j022J255K908
56656C73634M452N071L446M95j288j339j612l159m446m044k987k988l745l689
$$ plain form
56747 942174 972846 1007405 1043835 1079756 1110476 1129657 1132840 1119873 1093948 1059206 1019286 976946
56735 976946 934179 892548 853412 817777 786333 759897 739317 724524 714271 707487 704427 705875
56723 705875 711781 721565 735240 753043 773872 794958 813244 826403 832553 830070 818618 800199
56711 800199 778387 756055 733883 711424 689362 669786 653779 639797 625675 611700 600103
56700 600103 591648 584493 576805 568741 561058 553464 545569 538077 531573 525101 517419 508922 500954 493961
56686 493961 487816 483262 481291 481323 481590 481249 480715 479995 478298 475474 472355 469179 464889 458580 450776 442793
56670 442793 435413 428390 420735 411581 401488 392623 386672 382780 378740 374064 370493 369471 370726 373634
56656 373634 378086 383157 386603 387098 385810 384471 382859 379700 375254 371210 368223 365235 361490 357801
56642C57801k557j696k059l164m055m483m921n820o885p084n703l425j795j370
56628C02784j080J71J992L119L077K562K514L349M751N824N835N294N627P124
56614C52943Q001O568L737J922J733J473J35r17j75J669K846K979K869K593J406
56599C89782o20k383l276l611l349j775J072L736M769M074K451O51o53r85p91
56584C89092j185k328k965k395j728k039k291p36K152M028L884L149L186L326
56570C93150K333N76m31j40M92M39j24k87K62P31L55l13PJ287J855Q24k21N14
56552D01309J966J481j063k665j361J204K532K690L211M030L669J967N64N95J414
56537D21543J844J493N38p39j785j959j228k23M73P26O67P28J560L163M280L590
$$ plain form
56642 357801 355244 353548 351489 348325 344270 339787 334866 329046 322161 315077 309374 305949 304154 302784
56628 302784 301704 301875 303867 306986 310063 312625 315139 318488 323239 329063 334898 340192 345819 352943
56614 352943 360944 367512 371249 373171 374904 376377 376512 375595 375420 377089 379935 382914 385783 388376 389782
56599 389782 389162 386779 383503 379892 376543 374768 375840 379576 384345 388419 390870 391521 390868 389883 389092
56584 389092 387907 385579 382614 380219 378491 376452 374161 373425 375577 379605 383489 386638 389824 393150
56570 393150 395483 396059 395628 395488 395980 396419 396295 396008 396270 397001 397356 397043 397050 398337 400192 401016 400795 401309
56552 401309 403275 404756 403693 401028 399667 400871 403403 406093 409304 413334 417003 418970 419534 420129 421543
56537 421543 423387 424880 425418 424679 422894 420935 419707 419484 419957 420683 421350 422078 423638 426801 431081 434671
56521D34671J538j53p54j145j743j281J259M478N854M946L914M546O008O353N414
56506D73905M958O050P517P687O706O081O420O917P156P853R140R537P931N681
56492E73539N153O487P469O667N099M244L884K914J263k82j562l132m927n974
56478F00842n699m856m750n822p265p881p144n523l937l032k949l516m324m761
56464E29383m495l988m008m445m176k617q67o51k290m396n600n835n768n629n163
56449D69455m343l502k819k165j480q41m4J200K356K029l59l245m280l038j403
56434D47521j019j428j356p67o46j298k030k296k163j701q94o6M48J010K169L483
56418D38967L922L441L069L195L115K605K694M027N612O176N887N800O279O973
$$ plain form
56521 434671 436209 436056 435302 434157 432414 431133 432392 436870 442724 447670 451584 456130 462138 468491 473905
56506 473905 478863 484913 492430 500117 506823 512904 519324 526241 533397 541250 550390 559927 567858 573539
56492 573539 578692 585179 592648 599315 604414 608658 612542 615456 616719 616437 614875 611743 606816 600842
56478 600842 595143 590287 585537 579715 572450 564569 557425 551902 547965 544933 541984 538468 534144 529383
56464 529383 524888 520900 516892 512447 508271 505654 504787 504136 501846 497450 491850 486015 480247 474618 469455
56449 469455 465112 461610 458791 456626 455146 454305 454261 455461 457817 459846 459487 456242 451962 448924 447521
56434 447521 446502 445074 443718 442951 442305 441007 438977 436681 434518 432817 431923 431857 432305 433315 435484 438967
56418 438967 442889 446330 449399 452594 455709 458314 461008 465035 470647 476823 482710 488510 494789 501762
56404E01762P689Q234P997O812N779N982O751O523N245M524N154N950N561M331
56390E88294L547L630L844L454K406J135P8o07j080j395j177j44R51P15j164l191
56374E99296l757l069k702l381m182l987k933j975j676k017k919m233n340n562
56360E51563n068m724m966n438n851o322o526n567l435j647j459k132k195j707
56346D94526j776k341k257j497j242j518p85J342K953K508R88O2l15r59j497j240
56330D86952r01j528k301j424J108L433M354M291L789K832J817J638K341K891
56316E09292K656K230K471L554M957N691M773K446N72P41K311L519M019M745N626
56301E59603N443M112L163L369L582K769J778K025L499M929N288M493L211K419
$$ plain form
56404 501762 509451 517685 525682 532494 538273 544255 551006 557529 562774 567298 572452 578402 583963 588294
56390 588294 591841 595471 599315 602769 605175 606310 606388 605781 604701 603306 602129 601985 602936 603651 602487 599296
56374 599296 595539 592470 589768 586387 582205 578218 575285 573310 571634 569617 566698 562465 557125 551563
56360 551563 546495 541771 536805 531367 525516 519194 512668 507101 503666 502019 500560 498428 496233 494526
56346 494526 492750 490409 488152 486655 485413 483895 483110 484452 487405 489913 490901 490963 490648 489689 488192 486952
56330 486952 486051 484523 482222 480798 481906 485339 489693 493984 497773 500605 502422 504060 506401 509292
56316 509292 511948 514178 516649 520203 525160 530851 535624 538070 538642 539383 541694 545213 549232 553977 559603
56301 559603 565046 569158 572321 575690 579272 582041 583819 585844 589343 594272 599560 604053 607264 609683
56287F09683K650L505M388N389O574O959N681L915L878N698P107O597N198M498
56273F81720M682N297O381P764Q602Q657R007J0463J2216J2940J2428J1405J0603
56260H02165J0629J1897J4001J5858J6813J6943J6325J5110J4181J4220J4263
56249I62405J2867J0697R674R549Q016M869K933L536M102K371K88Q98L557N186
56235A040948M987M824N820P326Q888J0744J2513J3562J4575J6968K0873K5228
56223A187256K9430L3313L6081L7010L6832L6967L7852L9526M2955M8819N5635
56212A621676O1091O4920O8618P2869P7299Q2409Q9478R8484J08116J17851J28260
56201B591071J39226J49999J61143J74297J89510K04738K18673K32339K46953
$$ plain form
56287 609683 612333 615838 620226 625615 632189 639148 644829 648744 652622 658320 665427 672024 677222 681720
56273 681720 686402 691699 698080 705844 714446 723103 732110 742573 754789 767729 780157 791562 802165
56260 802165 812794 824691 838692 854550 871363 888306 904631 919741 933922 948142 962405
56249 962405 975272 985969 995643 1005192 1013208 1018077 1021010 1024546 1028648 1031019 1031307 1032205 1035762 1040948
56235 1040948 1045935 1050759 1056579 1063905 1072793 1083537 1096050 1109612 1124187 1141155 1162028 1187256
56223 1187256 1216686 1249999 1286080 1323090 1359922 1396889 1434741 1474267 1517222 1566041 1621676
56212 1621676 1682767 1747687 1816305 1889174 1966473 2048882 2138360 2236844 2344960 2462811 2591071
56201 2591071 2730297 2880296 3041439 3215736 3405246 3609984 3828657 4060996 4307949
56192D307949K61517K73597K81660K85903K87221K85741K80139K68517K50171
56183F782415K25998J96831J62504J23614Q3110M4513R218k3099n2258p7511r8993
56172G376342j17268j31821j41974j48958j55023j60589j64233j65595j66242
56163F024639j67490j69298j71650j75111j79356j82697j83890j83337j82229
56154D429581j81433j81162j80554j77732j71616j63556j55711j48202j39587
56145B930028j29912j21130j14258j08010j00809r2582q4158p6322o9799o4810
56135A968238o0337n5125m9519m4957m1737l8767l5446l2210k9154k5854k2611
56124A532521k0142j7962j4952j1568r524q987q031n495k412K8K179M750P420
$$ plain form
56192 4307949 4569466 4843063 5124723 5410626 5697847 5983588 6263727 6532244 6782415
56183 6782415 7008413 7205244 7367748 7491362 7574472 7618985 7628203 7605104 7552846 7475335 7376342
56172 7376342 7259074 7127253 6985279 6836321 6681298 6520709 6356476 6190881 6024639
56163 6024639 5857149 5687851 5516201 5341090 5161734 4979037 4795147 4611810 4429581
56154 4429581 4248148 4066986 3886432 3708700 3537084 3373528 3217817 3069615 2930028
56145 2930028 2800116 2678986 2564728 2456718 2355909 2263327 2179169 2102847 2033048 1968238
56135 1968238 1907901 1852776 1803257 1758300 1716563 1677796 1642350 1610140 1580986 1555132 1532521
56124 1532521 1512379 1494417 1479465 1467897 1458373 1449386 1441355 1435860 1433448 1433476 1435655 1440405 1447825
56111A447825R533J1061J2281J3401J4764J6373J7333J6968J6245J6660J7847
56100A610291J7994J6523J4610J3032J1399R677Q670Q679R199J0049J1375J2733
56088A754231J3846J5923K0276K5913L0563L3916L7700M2846M8928N6100O5133
56077B145375P5511Q6064R7243J10299J24424J37653J50227J63635J76218J83557
56067C450206J83900J79650J72771J62653J50014J38822J31763J26464J18314
56058D814557J04660Q4694N8206K6992m407l1648n3126o9013q0079q8710r8453
56047D663673j10833j24316j37284j49525j59771j64831j63073j56441j47550
56038C350049j37109j25622j14729j05031r5125q4672p5871p0009o5098n9027
$$ plain form
56111 1447825 1457358 1468419 1480700 1494101 1508865 1525238 1542571 1559539 1575784 1592444 1610291
56100 1610291 1628285 1644808 1659418 1672450 1683849 1693526 1702196 1710875 1720074 1730123 1741498 1754231
56088 1754231 1768077 1784000 1804276 1830189 1860752 1894668 1932368 1975214 2024142 2080242 2145375
56077 2145375 2220886 2306950 2404193 2514492 2638916 2776569 2926796 3090431 3266649 3450206
56067 3450206 3634106 3813756 3986527 4149180 4299194 4438016 4569779 4696243 4814557
56058 4814557 4919217 5003911 5062117 5089109 5084702 5053054 4999928 4930915 4850836 4762126 4663673
56047 4663673 4552840 4428524 4291240 4141715 3981944 3817113 3654040 3497599 3350049
56038 3350049 3212940 3087318 2972589 2867558 2772433 2687761 2611890 2541881 2476783 2417756
56028B417756n2628m7459m2946l8092l3782l1037k8828k5858k2756k0442j8092
56017B055836j4756j1240q472n631j754K436N880Q702J1030J2340J3303J6024
56005B083698K0779K4808K5990K5569K5536K5623K4813K3665K3245K3498K4210
55994B351434K5769K7919K9793L2041L6258M1465M4335M4015M3449M4564M5748
55983B766790M5693M5996M7900N0120N2083N5608O0985O5085O6123O6804O9911
55972C393098P3964P6326P7593P9919Q3508Q7480R1967R7227J02916J09635J18493
55961D392126J28285J36487J43670J52661J62768J70089J74656J81252J91395
55952E833389K00822K07225K13886K22748K30854K37385K47289K63422K81385
$$ plain form
56028 2417756 2365128 2317669 2274723 2236631 2202849 2171812 2142984 2117126 2094370 2073928 2055836
56017 2055836 2041080 2029840 2021368 2015737 2013983 2016419 2022299 2031001 2042031 2054371 2067674 2083698
56005 2083698 2104477 2129285 2155275 2180844 2206380 2232003 2256816 2280481 2303726 2327224 2351434
55994 2351434 2377203 2405122 2434915 2466956 2503214 2544679 2589014 2633029 2676478 2721042 2766790
55983 2766790 2812483 2858479 2906379 2956499 3008582 3064190 3125175 3190260 3256383 3323187 3393098
55972 3393098 3467062 3543388 3620981 3700900 3784408 3871888 3963855 4061082 4163998 4273633 4392126
55961 4392126 4520411 4656898 4800568 4953229 5115997 5286086 5460742 5641994 5833389
55952 5833389 6034211 6241436 6455322 6678070 6908924 7146309 7393598 7657020 7938405
55943G938405K96894L12038L29633L47637L64155L82073M03710M26704M49759
55934A1251008M76320N08178N42088N77132O18097O67052P19660P74628Q37776
55925A6971939R11151R87502J061855J138838J221960J306459J390569J482857
55917B6473130J589639J706031J827977J960731K105628K251791K393071K540992
55909D2848990K709448K899872L113426L362469L656757L995644M390088M874303
55901G1850997N477282O200352P040797Q017187R154144J0471802J2016838J3870818
55893A44100217J6089333J8656587K1530710K4698854K8158350L1893907L5859787
55886C20987745L9737246M2423037M1861910L5947242K4150644Q421221p676039
$$ plain form
55943 7938405 8235299 8547337 8876970 9224607 9588762 9970835 10374545 10801249 11251008
55934 11251008 11727328 12235506 12777594 13354726 13972823 14639875 15359535 16134163 16971939
55925 16971939 17883090 18870592 19932447 21071285 22293245 23599704 24990273 26473130
55917 26473130 28062769 29768800 31596777 33557508 35663136 37914927 40307998 42848990
55909 42848990 45558438 48458310 51571736 54934205 58590962 62586606 66976694 71850997
55901 71850997 77328279 83528631 90569428 98586615 107740759 118212561 130229399 144100217
55893 144100217 160189550 178846137 200376847 225075701 253234051 285127958 320987745
55886 320987745 360724991 403148028 445009938 480957180 505107824 513529045 505853006
55879E05853006k0909702k9767995l4438557l5946868l5408375l3722046l1502242
55872B84157221k9085258k6608738k4123761k1657453j9232088j6891507j4715878
55865A31842538j2785748j1134363r747449q592163p626971o801928o077848n441840
55857F3634228m889871m404615l965493l568190l216370k903244k617807k361139
55849C5707499k140304j952099j786839j642451j521407j418766j325491j239494
55841B2680648j162832j092629j024575r60690r04215q51648p98615p48416p05992
55832A4431036o68462o30311n92940n60576n31555n02138m74345m51717m31588
55823I587404m09525l87209l68233l50477l30444l10864k95994k83361k68141
$$ plain form
55879 505853006 484943304 455175309 420736752 384789884 349381509 315659463 284157221
55872 284157221 255071963 228463225 204339464 182682011 163449923 146558416 131842538
55865 131842538 119056790 107922427 98174978 89582815 81955844 75153916 69076068 63634228
55857 63634228 58744357 54339742 50374249 46806059 43589689 40686445 38068638 35707499
55849 35707499 33567195 31615096 29828257 28185806 26664399 25245633 23920142 22680648
55841 22680648 21517816 20425187 19400612 18439922 17535707 16684059 15885444 15137028 14431036
55832 14431036 13762574 13132263 12539323 11978747 11447192 10945054 10470709 10018992 9587404
55823 9587404 9177879 8790670 8422437 8071960 7741516 7430652 7134658 6851297 6583156
55814F583156k52073k40021k30903k19903k06976j95633j85708j74552j63247
55805D714140j54926j48886j42686j37699j36504j36973j35033j31019j27565
55796C462849j23582j16270j06812r8385r0793q2647p6254p4472p5027p3730p0950
55785B473927o9302o7531o2809n6720n2675m9516m4022l7724l4687l4202l2298
55774A932441k9238k8728l0505l0604k8767k9139l3034l6941l8389l8487l8011
55763A570598l6003l3167l1994l2600l2365l0380k8548k7902k7361k6356k5349
55752A238573k3763k0640j7190j5447j4861j3477j1742j1561j2223j1066p926
55741A078677n311m304l789l506m413o010o601o330p151r794j3235j6689j9603
$$ plain form
55814 6583156 6331083 6091062 5860159 5640256 5433280 5237647 5051939 4877387 4714140
55805 4714140 4559214 4410328 4267642 4129943 3993439 3856466 3721433 3590414 3462849
55796 3462849 3339267 3222997 3116185 3017800 2927007 2844360 2768106 2693634 2618607 2544877 2473927
55785 2473927 2404625 2337094 2274285 2217565 2164890 2115374 2071352 2033628 1998941 1964739 1932441
55774 1932441 1903203 1874475 1843970 1813366 1784599 1755460 1722426 1685485 1647096 1608609 1570598
55763 1570598 1534595 1501428 1469434 1436834 1404469 1374089 1345541 1317639 1290278 1263922 1238573
55752 1238573 1214810 1194170 1176980 1161533 1146672 1133195 1121453 1109892 1097669 1086603 1078677
55741 1078677 1073366 1069062 1065273 1061767 1057354 1051344 1044743 1038413 1031262 1021468 1008233 991544 971941
55728I71941k0594j9091j7155j6957j7559j6891j5472j4974j4622j2619r833q367
55716G87807p623n671l597m413q245j2386j5592j8450k0144j9037j6294j4948
55704F41407j5205j4421j1794r406q356p341n600m066l190k486k417l972o305
55691E46848p461p336p369p725p505p139p681q276p372n819n656o526o521n881
55677D48581o428p835q013o736n609m851l551k394k706l428k802k034l303n077
55663C83814m103j404j244m192o449o361o344p485p526n642m207m081k865J28
55649C22039J800M34j242n80J289K638M198O363P075N335L667M154N016M004K349
55634C68539K209K865K609K265L587N853P088P272P514P389N822L581K271J663
$$ plain form
55728 971941 951347 932256 915101 898144 880585 863694 848222 833248 818626 806007 796174 787807
55716 787807 780184 774513 770916 766503 758258 745872 730280 711830 691686 672649 656355 641407
55704 641407 626202 611781 599987 590581 582225 574884 569284 565218 562028 559542 557125 553153 546848
55691 546848 539387 532051 524682 516957 509452 502313 494632 486356 478984 473165 467509 460983 454462 448581
55677 448581 442153 434318 426305 419569 413960 409109 405558 403164 400458 397030 394228 392194 388891 383814
55663 383814 379711 378307 377063 372871 366422 360061 353717 346232 338706 333064 328857 324776 321911 322039
55649 322039 323839 324273 323031 322451 323740 326378 330576 336939 344014 349349 353016 357170 362186 366190 368539
55634 368539 370748 373613 376222 378487 382074 387927 395015 402287 409801 417190 423012 426593 428864 430527
55620D30527M02j319k049j530q52n36m25r93k900n249n951m207j481L45R60J378
55604D06120K195K795K431J675J807K745K899J759J076K201L741L741K758K509
55590D40452K638J544m12j617k539n070q656j0426r644q812r679j1150j1970j2481
55576C52178j2756j1838j0060r396j0431j1323j0762r464q026o165m841n913q501
55563B32702r003o387m149m975o748o344m393l243k771j485J9j0j279k045k083
55548A77806k461l074k764j389N0R55J220N37q71j649q80M66R95Q15P25N14l93
55531A70602j508j927j613q43P01L006M849N115M167K871J365q9l27J175L040
55516A90584L766L901M977P098R040J0167J0937J1852J2945J4042J4840J5244
$$ plain form
55620 430527 430929 429610 427561 426031 425179 424643 424218 423225 420325 415076 409125 404918 403437 403782 404742 406120
55604 406120 408315 411110 413541 415216 417023 419768 422667 424426 425502 427703 431444 435185 437943 440452
55590 440452 443090 444634 444222 442605 440066 434996 426340 415914 406270 397458 387779 376629 364659 352178
55576 352178 339422 327584 317524 308128 297697 286374 275612 266148 258122 251957 247116 241203 232702
55563 232702 223699 217312 213163 208188 201440 195096 190703 187460 184689 183204 183223 183213 181934 179889 177806
55548 177806 175345 172271 169507 168118 168168 169123 170343 170880 170009 168360 167480 167946 168941 169756 170481 170995 170602
55531 170602 169094 167167 165554 164711 165412 168418 173267 178382 182549 185420 186785 186696 186369 187544 190584
55516 190584 194350 198251 203228 210326 219366 229533 240470 252322 265267 279309 294149 309393
55504C09393J5864J7290J8661J8192J5500J1909Q137L445k177p109j0357j2886
55492C85862j5471j7192j7382j7136j7301j6850j4963j2898j1830j0536p560m167
55480B22576k717l088l118j913m76L82P48N94p9m34K38J111R10p1m05L91J636
55463B16285K649K932J934M6j104p93o39k223m416n131m783n447p134p601n970
55448A78605m011l295l343l523m606p066r246r019o718n000n660p517p831n405
55434I6365j773P23J333Q93K9j310k585k441m68J763K287Q26j298k630k496j208
55418H8010J76P20N75L44k11j623k875k039O84K439J240j504l089k704j313J45
55402G8975J056Q34k17p36k53j97j604l092k686p47O07K92j010k312l033k752
$$ plain form
55504 309393 325257 342547 361208 379400 394900 406809 414946 418391 416214 409105 398748 385862
55492 385862 370391 353199 335817 318681 301380 284530 269567 256669 244839 234303 226743 222576
55480 222576 219859 216771 213653 211740 211264 211646 212394 212988 212909 212475 212713 213824 214734 214663 214258 214649 216285
55463 216285 218934 221866 223800 223846 222742 221949 221310 219087 214671 209540 204757 199310 192176 184575 178605
55448 178605 174594 171299 167956 164433 159827 152761 143515 134496 127778 122778 117118 109601 101770 96365
55434 96365 94592 95315 96648 97541 97570 96260 93675 91234 90766 92529 94816 95642 94344 91714 89218 88010
55418 88010 88186 88906 89481 89825 89614 87991 85116 83077 83761 86200 87440 85936 82847 80143 78830 78975
55402 78975 80031 80865 80648 79912 79659 79462 77858 74766 72080 71333 71940 72232 71222 68910 65877 63125
55386F3125j606n95m94q70r09n50m8O47J215Q55k44n10O98J676P23j290k223j607
55368E7993o26L7O64J292J516J156J89j426l073l491k361q36K69J424K631K517
55352E7875O30j019n17J287K533L190M086M517L321J386N80Q43O63j32l45K59
55336G9157P72R93J461J925J667J084J080J310P37n28j664k712l920m274k805
55321G4283o67L06M70J409K746K548O94r14j501k142l180l486k784k243k242j762
55305F1535o61l15j200j882j380o72r02j593j624p24O54J881K117R46p17j538
55289E3925j666k303l298k986q30J496K301J742Q09k32j496k567k769j850j89
55274D0087J246J389K94n07J64J423J564M76n83j045j291j305p12J22O16J213
$$ plain form
55386 63125 61519 60924 60430 59560 58651 58101 58053 58700 59915 60770 60526 60016 60714 62390 63113 61823 59600 57993
55368 57993 57367 57404 58068 59360 60876 62032 62221 60795 57722 54231 51870 51034 51303 52727 55358 57875
55352 57875 58505 57486 56969 58256 60789 63979 68065 72582 75903 77289 77869 78712 79375 79243 78898 79157
55336 79157 79929 80922 82383 84308 85975 87059 88139 89449 90186 89658 87994 85282 81362 77088 74283
55321 74283 73616 73922 74392 75801 78547 81095 81789 80875 79374 77232 74052 70566 67782 65539 63297 61535
55305 61535 60874 60559 59359 57477 56097 55425 54523 52930 51306 50582 51236 53117 55234 56180 55463 53925
55289 53925 52259 49956 46658 43672 42842 44338 46639 48381 49190 48958 47462 44895 42126 40276 40087
55274 40087 41333 42722 43016 42509 42673 44096 45660 46136 45553 44508 43217 41912 41200 41322 41938 43151
55258D3151K400L069J875k69j247r35r48j445r02P28J487O46r8L78Q52Q4j211
55241D7615j939k251k406j739q6J294J410R31Q67J118J228J360J580J309L24o37
55225D9978q91n03L86J782L010K947J455m03j779k489k233r00M17M41k51j28N47
55208E1386J27j143r75J191K982K662J475J124J238Q46L88N72Q67O23K17Jm32
55191F3149r30n39M65L58j057j523J53J925J687M11N4L05j09o52j60N53%j113
55173F2977r34L15P79K07J05Q36J033J32o47l43M24P09L79l16j162j674j346m04
55155F1070M91J195J866K195J826J346J663K489K589J560K55o87j653k953l782
55140F9470k947m22K245L224K068L7j290j476j036l91K21L20j99l28Q66K409K431
$$ plain form
55258 43151 45551 48620 50495 50226 48979 48044 47096 45651 44749 45477 46964 47610 47512 47890 48742 48826 47615
55241 47615 45676 43425 41019 39280 39194 40488 41898 42829 43696 44814 46042 47402 48982 50291 50615 49978
55225 49978 49087 48584 48970 50752 53762 56709 58164 57761 55982 53493 51260 50360 50777 51218 50967 50839 51386
55208 51386 51513 50370 49395 50586 53568 56230 57705 58829 60067 60913 61301 61873 62740 63363 63580 63581 63149
55191 63149 62219 61680 62145 62503 61446 59923 60076 62001 63688 64099 64153 64458 64349 63697 63537 64090 64090 62977
55173 62977 62043 62358 63137 63344 63449 64285 65318 65450 64803 64460 64884 65593 65972 65656 64494 62820 61474 61070
55155 61070 61561 62756 64622 66817 68643 69989 71652 74141 76730 78290 78545 77858 76205 73252 69470
55140 69470 66523 66101 68346 71570 73638 73675 72385 70909 69873 69482 69703 70023 69824 69496 70362 72771 75202
55123G5202J016J77O40P51n09j567p99Q30J430J117J264J853J572J60j173j563
55107H0401j317r38n23j43L3Pj78o43j329j911k281k605k702k179j213l14O48
55090F2813J829K040O8k517k370P88L127J927o99j403m46j33m53M02K238K915
55074G0126J927R31Q29Q45P13J261K446K864J798J19j081j298j93J944L377K529
55058H9137M98M0J818L658L841L157K921K885K225J182M83J27k67o30p52p91q15
55041A08717m99J92N29p2j052j153J68K016K813J810r7j329j294n42N29K039L304
55024A16079K756J43k288k268k96J422J949K009K028J713J326J567K176K163J515
55009A31994J268J659J638N36r02j510q26Q09K458K942J944O08J66K58k79j342
$$ plain form
55123 75202 76218 76395 77035 77786 77277 75710 74911 75741 77171 78288 79552 81405 82977 83137 81964 80401
55107 80401 79084 78146 77623 77480 77513 77520 77342 76699 75370 73459 71178 68573 65871 63692 62479 62165 62813
55090 62813 64642 66682 66750 64233 61863 62651 65778 67705 67006 65603 65157 65024 64571 64973 67211 70126
55074 70126 72053 72984 73813 74658 75371 76632 79078 81942 83740 83859 82778 81480 81287 83231 86608 89137
55058 89137 89635 89675 91493 95151 98992 102149 105070 107955 110180 111362 111845 111972 111705 111075 110323 109532 108717
55041 108717 108218 108410 108939 108867 107815 106662 106830 108846 111659 113469 113372 112043 110749 110207 110736 112775 116079
55024 116079 118835 118978 116690 114422 114126 115548 117497 119506 121534 123247 124573 126140 128316 130479 131994
55009 131994 133262 134921 136559 137095 136193 134683 133857 134666 137124 140066 142010 142618 142784 143042 142763 141421
54993A41421j680r42j90k15n94o35j87N95J369J493O41n63j342j801k223j984
54977A33163n19J198J675J114J021J954L140L989M317L481J273p37q45m2o42k255
54961A51285k030N68K384J278p03p66L98L17j063j525q4J926K987K691J183j170
54945A57676l325m074l222j701o23n30j163j533q20M38Q75L42J96R28R74q61l111
54928A40466l465k087j186j627j911p69R27J495N85p94j598j458n46N61J150R91
54912A30734O85J080K306L610M207M103L833L543K837J701J007J529K917M220
54898A68312N243O527Q073Q999Q756P977P815Q812J0569J2142J2813J2994J4064
54885B93096J6577J8821J8405J5342J2219J0815R882P183K603k083n864r415j3384
$$ plain form
54993 141421 139741 138799 138609 138394 137800 137165 136978 137573 138942 140435 141076 140513 139171 137370 135147 133163
54977 133163 132644 133842 135517 136631 137652 139606 142746 146735 151052 154533 155806 155069 154224 154182 153540 151285
54961 151285 149255 149823 152207 153485 152782 152016 152414 152731 151668 150143 150059 151985 154972 157663 158846 157676
54945 157676 154351 150277 147055 145354 144731 144201 143038 141505 140685 141123 141998 142340 142536 143464 144438 143577 140466
54928 140466 137001 134914 133728 132101 130190 129421 130348 131843 132428 131634 130036 128578 128032 128593 129743 130734
54912 130734 131419 132499 134805 138415 142622 146725 150558 154101 156938 158639 159646 161175 164092 168312
54898 168312 173555 180082 188155 197154 205910 213887 221702 230514 241083 253225 266038 279032 293096
54885 293096 309673 328494 346899 362241 374460 385275 395157 402340 404943 402860 396996 387581 374197
54872C74197j7036j9165j9548j8890j7678j5758j3130j0631r267q997q762p839
54860B07496o659n954n677n208m172k467p4K483L980L860L292L910N672P142P731
54845B15355Q367R837J1690J3171J4154J4719J4655J3812J2249R804O316K336
54833C46465j250m466q073j1894j4478j4855j3689j2250j1209j0895j1568j2714
54821B19124j2965j1597r460p843p116o939o921o391m558j745K15j50k204m010
54807A37440m346l209j104J142K399K196J501J628K517K873K012O77j00k78n93
54792A44755j414k245k269j375l91k83j167k355l101l026k153j142j106k328l359
54777A17041k463j2J812J840J177J156J410J000K29Q8N35O40J25l59m29l30j60
$$ plain form
54872 374197 357161 337996 318448 299558 281880 266122 252992 242361 233094 224097 215335 207496
54860 207496 200837 194883 189206 183998 179826 177359 177285 179768 183748 187608 190900 194810 200482 207624 215355
54845 215355 223722 233559 245249 258420 272574 287293 301948 315760 328009 337813 344129 346465
54833 346465 345215 340749 332676 320782 306304 291449 277760 265510 254301 243406 231838 219124
54821 219124 206159 194562 185102 177259 170143 163204 156283 149892 145334 143589 143804 143654 141450 137440
54807 137440 133094 129885 128781 129923 132322 134518 136019 137647 140164 143037 145049 145726 145626 145348 144755
54792 144755 143341 141096 138827 137452 137061 136778 135611 133256 130155 127129 124976 123834 122728 120400 117041
54777 117041 114578 114566 116378 118218 119395 120551 121961 122961 123190 123278 123813 124453 124578 124219 123790 123460 123300
54760A23300M45J522K436K702K713L251M340N005M336K690J435J423K137K578
54746A60313K478K183J953K142L474N994Q081P914O035N064O652R826J2736J4678
54732B49523J5887J6552J6896J7258J7319J6102J3486J0806R136P712N036J039
54720C96752k785n097n967o534p779r396r917q520o545o167p572q733q240o879
54706B96621n770m505k341N4J379J476J181J139J713L360N944Q297R467R926J0693
54691C38634J1980J3565J5578J7921J9793K1035K2944K6186K8614K7093K1362
54680E64705J4461R206N633K185k035o755j1396j5707j9702k3159k5222k5053
54668D67161k3097k1037j9949j9246j8078j6675j5345j3338j0270p884q308j0810
$$ plain form
54760 123300 123745 125267 127703 130405 133118 136369 140709 145714 150050 152740 154175 155598 157735 160313
54746 160313 162791 164974 166927 169069 172543 178537 186618 194532 200567 205631 212283 222109 234845 249523
54732 249523 265410 281962 298858 316116 333435 349537 363023 373829 382965 390677 395713 396752
54720 396752 393967 388870 382903 376369 368590 359194 349277 340757 334212 328045 320473 311740 303500 296621
54706 296621 290851 286346 284005 284059 285438 286914 288095 289234 290947 294307 300251 308548 318015 327941 338634
54691 338634 350614 364179 379757 397678 417471 438506 461450 487636 516250 543343 564705
54680 564705 579166 588372 594005 596190 594155 587400 576004 560297 540595 517436 492214 467161
54668 467161 444064 423027 403078 383832 365754 349079 333734 320396 310126 302242 293934 283124
54656B83124j2146j0406o937m160l028l109l721m179l874k959k310k249j929o20
54642B21497J059J816J267L06n6K77N61K04o30j410j913k095j467M14K726L703
54626B26259K787J478J327K040K464K425K314J707J01j484j351M69K284L132L639
54611B49591M321M695M615N000O377P860Q339P911P341O882O415O241O879Q148
54597C40615R026Q575O901N263M992O058O968O460M996M020M153M848N514O027
54583D24416O310O384O969R028J2424J5736J7691J8286J8410J8947K0231K1853
54571E96685K2900K2806K1635J9142J4362P142m92o107r770j3649j8589k2888
54559F33177k4934k5322k5440k5364k4431k2848k1316j9634j6983j3459j0232
$$ plain form
54656 283124 270978 260572 253635 249475 246447 243338 239617 235438 231564 228605 226295 224046 222117 221497
54642 221497 222556 224372 225639 225945 225889 226166 226727 226931 226301 224891 222978 220883 219416 219830 222556 226259
54626 226259 229046 230524 231851 233891 236355 238780 241094 242801 242902 241418 240067 240536 242820 245952 249591
54611 249591 253912 258607 263222 268222 274599 282459 290798 298709 306050 312932 319347 325588 332467 340615
54597 340615 349641 358216 365117 370380 375372 381430 388398 394858 399854 403874 408027 412875 418389 424416
54583 424416 430726 437110 444079 453107 465531 481267 498958 517244 535654 554601 574832 596685
54571 596685 619585 642391 664026 683168 697530 704672 704180 698073 688303 674654 656065 633177
54559 633177 608243 582921 557481 532117 507686 484838 463522 443888 426905 413446 403214
54548D03214q222p297o776o160n348m579m168l988l452k352j491j854l204m063
54534C40260l464k410k948n684q738r696q302o476n719n592n155m702n036n870
54520B60468o230o075o234o816o921o111n003m153l339k366j770k219l735n676
54506A93820p102p128n607l488j886q08M51J797K308J779J271J618K297K268J316
54491A82906J16n05j26R77J853J715Q12J1m29r28j559j775j198K15K567N487P396
54474A97535O795M553L511N183Q231J0651J2027J2752J2585J1381J0203J0142
54462C05549J0617J0229Q854P562O643N008J788k393o086q440r730j0723j1627
54449C07251j1842j1037j0169j0493j1531j1213q647n624m410m885n126m232l239
$$ plain form
54548 403214 394992 387695 380919 374759 369411 364832 360664 356676 353224 350872 349381 347527 344323 340260
54534 340260 336796 334386 331438 325754 317016 307320 299018 292542 286823 281231 276076 271374 266338 260468
54520 260468 254238 248163 241929 235113 228192 222081 217078 212925 209586 207220 205450 203231 199496 193820
54506 193820 186718 179590 173983 170495 168609 167801 168252 170049 172357 174136 175407 177025 179322 181590 182906
54491 182906 183022 182517 182391 183368 185221 186936 187748 187759 187330 186402 184843 183068 181870 182085 184652 190139 197535
54474 197535 204330 208883 212394 217577 225808 236459 248486 261238 273823 285204 295407 305549
54462 305549 316166 326395 335249 342811 349454 354462 356250 353857 347771 339331 329601 318878 307251
54449 307251 295409 284372 274203 263710 252179 240966 232319 226695 222285 217400 212274 208042 204803
54436B04803l329m295n034m847l939l043k570k055o95J342K670K294R03m7l5M85
54420A82608J210K159K972L026K335J632J452J785K548L652M581M590L602K440
54406B20592K012K636M070N625O297N367L173Q71o65j426j792k015k323k931l682
54391B35809m037l766l333l244l241k567j040N14J006M4j874l835m930m597l103
54376A97806j658j414k154k555k053j626k170k859k292p86r2q80j882j851r51
54361A72583K88K002L965M868L965K614K625L594L519J943P41J329K688L055K426
54346B12205K141K585K732K011J338J795L146M477N721P423R190R558Q007O003
54332B78332N168N070M148K417J756L137M882M653K343J5p20l00k48j364l288
$$ plain form
54436 204803 201474 197179 192145 187298 183359 180316 177746 175691 174996 176338 179008 181302 182205 182158 182123 182608
54420 182608 183818 185977 188949 191975 194310 195942 197394 199179 201727 205379 209960 214550 218152 220592
54406 220592 222604 225240 229310 234935 241232 246599 249772 250643 249978 248552 246760 244745 242422 239491 235809
54391 235809 231772 228006 224673 221429 218188 215621 214581 215095 216101 216145 214271 210436 205506 200909 197806
54376 197806 196148 194734 192580 190025 187972 186346 184176 181317 179025 178239 178147 177267 175385 173534 172583
54361 172583 172871 174873 178838 183706 187671 190285 192910 196504 200023 201966 202707 204036 206724 209779 212205
54346 212205 214346 216931 219663 221674 223012 224807 227953 232430 238151 245574 254764 264322 272329 278332
54332 278332 283500 288570 292718 295135 296891 300028 304910 309563 311906 311921 311201 310901 310653 309289 306001
54317C06001n350p236q672q994p737n730m715n363o290n837m329l477l867m293
54303B24111l621k149q21j90m71j533k517k461j721j696k727l493l021j963j128
54288A94599j31J254J879J011L02J965N389P493O565M178K918L582N086O084O112
54273B48286N687N649O023N722L994J889J177J789J483j454n988r335r654p420
54259B47848m655l228l613m887n941o545o962o956n990m390l423l909n289o366
54245A75694o415n396l743k279j752k067k365k272k458l442m371l870j951k24
54231A33089j5r64j800j871j377n42O07J700K069J602R76P74P81N28L2m92j027
54214A34070j249k93K080M376M629K731M52q06j156j161q78m27k10L8J221L154
$$ plain form
54317 306001 300651 293415 284743 275749 268012 262282 257567 252204 245914 240077 235748 232271 228404 224111
54303 224111 220490 218341 217520 217330 216859 215326 212809 210348 208627 206931 204204 200711 197690 195727 194599
54288 194599 194468 195722 197601 198612 198914 200879 206268 213761 220326 224504 227422 231004 236090 242174 248286
54273 248286 253973 259622 265645 271367 275361 277250 278427 280216 281699 280245 274257 264922 255268 247848
54259 247848 243193 239965 236352 231465 225524 218979 212017 205061 199071 194681 191258 187349 182060 175694
54245 175694 169279 163883 160140 157861 156109 154042 151677 149405 146947 143505 139134 135264 133313 133089
54231 133089 133074 132110 130310 128439 127062 126520 127127 128827 130896 132498 133474 134248 135029 135557 135589 135097 134070
54214 134070 132821 132528 134608 138984 143613 146344 146796 145990 144834 143673 142795 142368 142158 142196 143417 146571
54198A46571L991K487j34j581j209j95L72M01K12O5K06N14K99p70j883j979j108
54181A46259k10J51P4k56n45j75J040K199K236J301K70o20j579k081j249N52J714
54164A49081J247l25j851k408j248J604M455M917K474p33k300j960j065m60K46
54149A51674J567L096L726K820J016l64q64j414k784m102l833j913J52J264J681
54134A51722J868J568N50o48j396j770k128k364k072j211k63P8m87j350j283J11
54118A40925J530J399p7j357j882k573l791m336l315j747j202j629j721r19Q8
54103A19393P57J502K831M317M785L563J483L32R34K043J837L96m45J70Q53J63
54087A44914j240j772j307r45r68o23R7J06r90k029j914j139q86j247j291n61
$$ plain form
54198 146571 150562 153049 152915 151334 150125 149930 150302 150703 150915 150980 151186 151700 151999 151229 149346 147367 146259
54181 146259 146049 146200 146274 146018 145473 145298 146338 148537 150773 152074 152344 151724 150145 148064 146815 147367 149081
54164 149081 150328 150003 148152 145744 144496 146100 150555 155472 157946 157213 154913 152953 151888 151428 151674
54149 151674 153241 156337 160063 162883 163899 163535 162671 161257 158473 154371 150538 148625 148777 150041 151722
54134 151722 153590 155158 155708 155060 153664 151894 149766 147402 145330 144119 143856 143934 143447 142097 140814 140925
54118 140925 142455 143854 143777 142420 140538 137965 134174 129838 126523 124776 123574 121945 120224 119305 119393
54103 119393 120150 121652 124483 128800 133585 137148 138631 138963 139897 141940 143777 144173 143728 143898 144751 144914
54087 144914 143674 141902 140595 139650 138682 138059 138156 138262 137272 135243 133329 132190 131304 130057 128766 128205
54071A28205L45O58K88l62r56j354j520j526j529j625j869k430l471m607m871
54056A03376l556j078J302K612K836K557K348K453K683K485J417k72j744k307
54042A15112j855p73K40M51k62j038r25q7N40O64Q24J182J237R02P50Q44O31M24
54024A18861J398L289L778J591j263k131j348j113j662j154Q64K468K321J423
54010A27322J109J126P87M36O12Q03J95r14j457r89j52J01m97j088m17J606L404
53993A31987L516K417J661J795K344L234M502N001L516J200P46K743M960N787
53979A75409N992O186N191K623Q53K136N228P141P165O890P058O827N979N627
53965B50305O349P325P771P994Q558R281R566R064P898O579N738N574N678N647
$$ plain form
54071 128205 128550 129208 129496 129134 128178 126824 125304 123778 122249 120624 118755 116325 112854 108247 103376
54056 103376 99820 98742 100044 102656 105492 108049 110397 112850 115533 118018 119435 119163 117419 115112
54042 115112 113257 112484 112724 113175 112913 111875 110950 110863 111403 112067 112891 114073 115310 116212 116962 117806 118437 118861
54024 118861 120259 123548 127326 128917 127654 125523 124175 123062 121400 120246 121110 123578 125899 127322
54010 127322 128431 129557 130344 130780 131392 132195 132390 131476 130019 129030 128878 128979 128482 127394 126977 128583 131987
53993 131987 135503 137920 139581 141376 143720 146954 151456 156457 159973 161173 161919 164662 169622 175409
53979 175409 181401 187587 192778 195401 196254 198390 203618 210759 217924 224814 231872 238699 244678 250305
53965 250305 256654 263979 271750 279744 288302 297583 307149 316213 324111 330690 336428 342002 347680 353327
53951C53327N400M720L175R75q67j766k140k280j821j102j676m010n864m812j757
53936C39502j7j081l186m183m052l922m104m106l811l683l970m245l914l067k576
53921B89585l044l836l913l540m060n641o630n812m087k820j939q16J48L94N04
53906B44493R37O42j053k269p79K292L676K672J793K509L354L240L542N303O655
53891B77007N331K277N63J496L614N041N240M703M268M707O009P082O831N483
53877C39652M332M386N627P236Q159P853O857O250O218N724L954J572Mo8Q56J682
53861D10294J509L27p44m60J037K316K430J919J778K307L383M909O414P061O791
53846D51271O641P268P878P582O984P279Q267Q458P022M657K498J034J79l17p77
$$ plain form
53951 353327 358727 363447 366622 367597 366730 364964 362824 360544 358723 357621 355945 351935 346071 341259 339502
53936 339502 339485 338404 335218 331035 326983 323061 318957 314851 311040 307357 303387 299142 295228 292161 289585
53921 289585 286541 282705 278792 275252 271192 265551 258921 253109 249022 246202 244263 243447 243595 243989 244493
53906 244493 245430 246072 245019 242750 241971 244263 247939 250611 252404 254913 258267 261507 265049 270352 277007
53891 277007 282338 284615 285178 286674 290288 295329 300569 305272 309540 314247 320256 327338 334169 339652
53877 339652 343984 348370 353997 361233 369392 377245 384102 390352 396570 402294 406248 407820 407824 407756 408612 410294
53861 410294 411803 412130 411386 410926 411963 414279 416709 418628 420406 422713 426096 431005 437419 444480 451271
53846 451271 457912 465180 473058 480640 487624 494903 503170 511628 518650 523307 525805 526839 527018 526701 525924
53831E25924j501k540l626m197l725k488k066m086p989j1051j1410j0261r970
53818D51014j0872j1339j0680j0154j0743j1444j0719q736p132p034q049r084
53806C35028r429q971p940o726n795n436n582n905o150o255o194n897n517n482
53792B43749n901o127n428m072l143l172l502l227k170p45N27J023L26r77j494
53777B05667p55j33j157l317m579l942k532j917k220k371j674n69P1J5j61M2L90
53760A80858N30R36K336M075M222K105k58m16J384K743K505K021K755M109M514
53745B14419L764L122L487M296M376L453K560K936M538N949O045N282M802M754
53731B73783M498M250N058O925Q315Q262P684P602P226N333K807J957L245M438
$$ plain form
53831 525924 524423 521883 518257 514060 510335 507847 505781 501695 493706 482655 471245 460984 451014
53818 451014 440142 428803 418123 407969 397226 385782 375063 366327 359195 352161 344112 335028
53806 335028 325599 316628 308688 301962 296167 290731 285149 279244 273094 266839 260645 254748 249231 243749
53792 243749 237848 231721 226293 222221 219078 215906 212404 209177 207007 206262 206789 207812 208138 207161 205667
53777 205667 204912 204779 203622 200305 195726 191784 189252 187335 185115 182744 181070 180501 180572 180587 180426 180468 180858
53760 180858 181388 182324 184660 188735 192957 195062 194804 194388 195772 198515 201020 203041 205796 209905 214419
53745 214419 218183 221305 224792 229088 233464 236917 239477 242413 246951 252900 258945 264227 269029 273783
53731 273783 278281 282531 287589 294514 302829 311091 318775 326377 333603 338936 341743 343700 346945 351383
53717C51383L496J031q39j080l52J79l30k161m606o007n208k975j253j026j681
53702C28571k482l600n177o290n860m278l141l371m323m925m961m821m605m070
53688B66667l246k515k144k070k165k262k016j180j71J07p57k148l072l041k126
53673B37861n74J116K100J897J136R46J448J599Q63J74O59J973K867L036L256
53658B60357L688L297J575k00l82Q77J871J531L78o49j305j639j393m54N72R49
53642B69073O94L96L27L20M24J015K069K858K715J887J258J408K213L151L742
53627B93550L688L076K435K358K855L403L585L451L104K466J718J490K036K569
53613C31784K103Q20j12p8M02P87J305K163K739K369J530J409K253K924K199J65
$$ plain form
53717 351383 354879 355910 355071 353991 353639 353818 353488 351327 346721 340714 335506 332531 331278 330252 328571
53702 328571 326089 322489 317312 311022 305162 300884 297743 294372 290049 285124 280163 275342 270737 266667
53688 266667 263421 260906 258762 256692 254527 252265 250249 249069 248898 249005 248248 246100 243028 239987 237861
53673 237861 237287 238403 240503 242400 243536 244482 245930 247529 248392 248566 249225 251198 254065 257101 260357
53658 260357 264045 267342 268917 268717 268335 269212 271083 272614 272992 272343 271038 269399 268006 267552 268124 269073
53642 269073 269767 270163 270490 270810 271234 272249 274318 277176 279891 281778 283036 284444 286657 289808 293550
53627 293550 297238 300314 302749 305107 307962 311365 314950 318401 321505 323971 325689 327179 329215 331784
53613 331784 333887 334707 334595 334517 334919 335706 337011 339174 341913 344282 345812 347221 349474 352398 354597 354762
53597C54762j859k664k307j898k191k586j973n39J82p58k484l600l917m037l939
53582C20192l106j682l20R21K361L456L055J202n08q01jR30J630K093K156J955
53566C33533K056K464K284J218N79J722L917M964L810J611K14M52J941L700M723
53551C69188M482L376K475K640L850N218N598M571L043K514L407M552M781M439
53537D24134M711N840O952P310O970O267N531N337N988O739O385M948L893M263
53523E05268N375N793M954L323J679Q57J509L250M462L874K188J326K068L225
53509E49151L183J617n42k135k441j357M79J989K491K219J945K166K866L715M248
53494E69594M031L130K337K570L896N407O184O146N798N429M890M152L665L916
$$ plain form
53597 354762 352903 350239 347932 346034 343843 341257 339284 338745 338927 338169 335685 332085 328168 324131 320192
53582 320192 317086 315404 315084 316005 318366 321822 324877 326079 325571 324770 324769 325699 327329 329422 331578 333533
53566 333533 335589 338053 340337 341555 342134 343856 347773 352737 356547 358158 358372 358824 360765 364465 369188
53551 369188 373670 377046 379521 382161 386011 391229 396827 401398 404441 406955 410362 414914 419695 424134
53537 424134 428845 434685 441637 448947 455917 462184 467715 473052 479040 485779 492164 497112 501005 505268
53523 505268 510643 516436 521390 524713 526392 527249 528758 532008 536470 540344 542532 543858 545926 549151
53509 549151 552334 553951 553409 551274 548833 547476 547955 549944 552435 554654 556599 558765 561631 565346 569594
53494 569594 573625 576755 579092 581662 585558 590965 597149 603295 609093 614522 619412 623564 627229 631145
53480F31145M714N230M915M247M310N617P555R133R954J0261J0270J0013R776
53467G27140J0101J1203J2697J4195J5633J6757J6715J4966J2496J1359J2617
53456H75879J5146J6928J7352J7750J9529K2196K3775K3203K1819K1992K4498
53445A100067K7777K9827L0133K9576K9171K9371L0234L1567L3049L4589L6336
53434A441697L8097L9197L9336L9139L9222L9211L8520L7642L7629L8384L8607
53423A866681L7614L6139L5031L4134L2986L1870L1511L2116L3242L4249L4544
53412B240117L3809L2249L0404K8608K6981K5858K5513K5467K4798K3249K1301
53401B538354J9104J6335J3222J0491P931M360l47m498o836q295j0327j2651j4106
$$ plain form
53480 631145 635859 641089 646004 650251 654561 660178 667733 676866 686820 697081 707351 717364 727140
53467 727140 737241 748444 761141 775336 790969 807726 824441 839407 851903 863262 875879
53456 875879 891025 907953 925305 943055 962584 984780 1008555 1031758 1053577 1075569 1100067
53445 1100067 1127844 1157671 1187804 1217380 1246551 1275922 1306156 1337723 1370772 1405361 1441697
53434 1441697 1479794 1518991 1558327 1597466 1636688 1675899 1714419 1752061 1789690 1828074 1866681
53423 1866681 1904295 1940434 1975465 2009599 2042585 2074455 2105966 2138082 2171324 2205573 2240117
53412 2240117 2273926 2306175 2336579 2365187 2392168 2418026 2443539 2469006 2493804 2517053 2538354
53401 2538354 2557458 2573793 2587015 2597506 2605437 2609797 2609450 2604952 2598116 2589821 2579494 2566843 2552737
53388B552737j4906j6309j8487k0406k1698k3036k4551k5369k5141k4854k5628
53377B312352k7427k9368l0614l0867l0414k9742k8755k6827k4222k2605k2965
53366B008546k3702k2382j8971j5703j3833j2452j0683q960p582n996m334l753
53354A860195m147l336l3L967O145O509O758P664R208J2291J7651K3510K6773
53341A973155K6793K5980K6469K8166L0325L2914L5638L7618L9061M1580M5658
53330B343357M9476N1604N3320N6414O0060O2068O2518O3629O6193O8555O9603
53319C006797P0417P1886P2735P1540O9278O7981O7705O6818O4896O3317O2699
53308C756069O1595N8498N3853M9192M5206M1510L7572L2915K6987J9770J2152
$$ plain form
53388 2552737 2537831 2521522 2503035 2482629 2460931 2437895 2413344 2387975 2362834 2337980 2312352
53377 2312352 2284925 2255557 2224943 2194076 2163662 2133920 2105165 2078338 2054116 2031511 2008546
53366 2008546 1984844 1962462 1943491 1927788 1913955 1901503 1890820 1881860 1874278 1868282 1863948 1860195
53354 1860195 1856048 1852712 1852679 1856646 1862791 1869300 1876058 1883722 1892930 1905221 1922872 1946382 1973155
53341 1973155 1999948 2025928 2052397 2080563 2110888 2143802 2179440 2217058 2256119 2297699 2343357
53330 2343357 2392833 2444437 2497757 2554171 2614231 2676299 2738817 2802446 2868639 2937194 3006797
53319 3006797 3077214 3149100 3221835 3293375 3362653 3430634 3498339 3565157 3630053 3693370 3756069
53308 3756069 3817664 3876162 3930015 3979207 4024413 4065923 4103495 4136410 4163397 4183167 4195319
53297D195319N032j621q023j3663j8108k2361k7897l4425l9946m3439m6149m9545
53285C895174n3147n5397n5879n5618n5581n5957n6684n7673n8481n8556n8004
53274C274197n7357n6498n4615n1645m9023m8193m8659m8383m6220m3311m1620
53263B728673m1541m1588m0325l7817l4988l2278k9626k7294k5757k4799k3608
53252B369052k1996k0870k1057k2245k3502k4279k4421k3697k1989j9766j7678
53241B127552j5795j3800j1753j0061q578o439l116O72L433M277L815L818N795
53228B079820R549J3242J5165J5544J6217J8568K2138K5367K7274K8174K8983
53217B300041L0194L1466L2142L2033L1629L1386L1006K9792K7667K5394K3625
$$ plain form
53297 4195319 4200351 4198730 4190707 4177044 4158936 4136575 4108678 4074253 4034307 3990868 3944719 3895174
53285 3895174 3842027 3786630 3730751 3675133 3619552 3563595 3506911 3449238 3390757 3332201 3274197
53274 3274197 3216840 3160342 3105727 3054082 3005059 2956866 2908207 2859824 2813604 2770293 2728673
53263 2728673 2687132 2645544 2605219 2567402 2532414 2500136 2470510 2443216 2417459 2392660 2369052
53252 2369052 2347056 2326186 2305129 2282884 2259382 2235103 2210682 2186985 2164996 2145230 2127552
53241 2127552 2111757 2097957 2086204 2076143 2067565 2061126 2058010 2058682 2062115 2066392 2070207 2074025 2079820
53228 2079820 2089369 2102611 2117776 2133320 2149537 2168105 2190243 2215610 2242884 2271058 2300041
53217 2300041 2330235 2361701 2393843 2425876 2457505 2488891 2519897 2549689 2577356 2602750 2626375
53206B626375K2102K0016J6888J2879Q542M541J419p61k522m553p188j0378j3878
53193B673482j7204j9745k1305k2468k3879k5264k5778k5477k5774k7870l1106
53182B407612l3465l3575l1755k9289k7356k6708k7544k9148l0104k9538k7976
53171B081154k6590k5744k4847k3531k2288k1681k1445k0821j9598j8341j7661
53160A838607j7547j7542j7394j7207j7012j6423j5048j3215j1894j1684j2143
53149A671498j2406j2285j2474j3747j6239j9412k2304k3945k3929k2750k1301
53138A470706k0116j9318j9057j9494k0404k1340k2088k2428k1677j9455j6892
53127A248437j5972j7258j9278k0635k1584k2741k3573k3494k3429k4449k5467
$$ plain form
53206 2626375 2648477 2668493 2685381 2698260 2706802 2711343 2712762 2712001 2709479 2704926 2697738 2687360 2673482
53193 2673482 2656278 2636533 2615228 2592760 2568881 2543617 2517839 2492362 2466588 2438718 2407612
53182 2407612 2374147 2340572 2308817 2279528 2252172 2225464 2197920 2168772 2138668 2109130 2081154
53171 2081154 2054564 2028820 2003973 1980442 1958154 1936473 1915028 1894207 1874609 1856268 1838607
53160 1838607 1821060 1803518 1786124 1768917 1751905 1735482 1720434 1707219 1695325 1683641 1671498
53149 1671498 1659092 1646807 1634333 1620586 1604347 1584935 1562631 1538686 1514757 1492007 1470706
53138 1470706 1450590 1431272 1412215 1392721 1372317 1350977 1328889 1306461 1284784 1265329 1248437
53127 1248437 1232465 1215207 1195929 1175294 1153710 1130969 1107396 1083902 1060473 1036024 1010557
53116A010557k4310k1185j8925j9210k0355k0009j8441j7683j8360j9061j8487
53105G94531j6738j4641j2957j2363j3005j3915j3819j2763j1993j2019j1936
53094F48382j1137j0563j1229j2336j2158j0486q874q377q271p581o801p111q429
53081E25029r293q645o920n182l941l165k869l086l517l817m123m853n877o362
53067D53379n686m243l036k557k270j359K39J621J847R20k68r12r00n08J25Q78
53051D37270J356J199O56M52R98K042L091L864M231L990K889Q11j987m690o245
53036D49927o208n254m420m084m103m686o163p927q658q061p372p577q019p600
53022C59795o455n432m600l657l269m332n925n822l500j194j212l462o317q588
$$ plain form
53116 1010557 986247 965062 946137 926927 906572 886563 868122 850439 832079 813018 794531
53105 794531 777793 763152 750195 737832 724827 710912 697093 684330 672337 660318 648382
53094 648382 637245 626682 615453 603117 590959 580473 571599 563222 554951 547370 540569 533458 525029
53081 525029 515736 507091 500171 494989 491048 487883 485014 481928 478411 474594 470471 465618 459741 453379
53067 453379 447693 443450 440414 437857 435587 434228 434467 436088 437935 438855 438587 437675 436775 436267 436392 437270
53051 437270 438626 439825 440481 440933 441931 443973 447064 450928 455159 459149 462038 462849 460862 456172 449927
53036 449927 443719 438465 434045 429961 425858 421172 415009 407082 398424 390363 382991 375414 367395 359795
53022 359795 353340 347908 343308 339651 336382 332050 326125 320303 316803 315609 314397 310935 304618 296030
53008B96030r529q239m791j292j19j158k282k365k226k435k022k67J650J979O27
52993B63561j057k118k601k676k334j857j691j742j512r67n29j27Q31K218K755
52978B50154J432j047k918l233k535j840j525j306q49j83L00J53o35j419j476
52963B33073q68m07n98r83q76l96k37n59p85n97m79r10j492j462p31R8N92P86
52945B23169P28L47j30k42R9N09P82J181J841K444K776L134L779M327M163L129
52929B52036J561o3j180j302o00K3N7J03Q65J810J837J076R04K005L397L798L149
52912B69476K270J734J761K588M126N497N740M950M270M637N935P358Q193Q247
52898C36782P844P509P568P903Q044P384N431K382n02j624p35N20K61j519l080
$$ plain form
53008 296030 286501 278262 273471 272179 272060 270902 268620 266255 264029 261594 259572 259305 260955 262934 263561
52993 263561 262504 260386 257785 255109 252775 250918 249227 247485 245973 245006 244477 244350 245181 247399 250154
52978 250154 251586 250539 247621 244388 241853 240013 238488 237182 236333 236150 236450 236603 235968 234549 233073
52963 233073 232205 231798 231200 230217 229341 228945 228708 228149 227364 226767 226288 225378 223886 222424 221693 221791 222383 223169
52945 223169 223897 224244 224114 223872 223971 224480 225262 226443 228284 230728 233504 236638 240417 244744 248907 252036
52929 252036 253597 253534 252354 251052 250452 250475 250532 250635 251500 253310 255147 256223 257127 259132 262529 266327 269476
52912 269476 271746 273480 275241 277829 281955 287452 293192 298142 302412 307049 312984 320342 328535 336782
52898 336782 344626 352135 359703 367606 375650 383034 388465 390847 390345 388721 387986 388506 388767 387248 384168
52883C84168l093k056j438j974l178m136m430m277m102m037l944l777l720l760
52869C36246l397k194n94L21J2r10j495j547j518j497q44Q81K892L514J867r85
52853C30752k859k574j002J23J14k92j57N88J434K123K803L509L871L512K507
52838C44452J405P17M68L41J35j32m60q67j029l84R72J993J778P74J96M01N93
52821C51353K33n5O27K270M068N142M860L105P38p52p44j57O5M53K014M157N027
52804C82404L887J909L39p45j396r07R03K637K843J991J576J814J679J079J283
52789D01296K851M657N572N943O425O569N694M384L797L991M208M498N595P180
52775D72660P714O396M135K049J90j502k152j147L29K74j749m277n840o216n898
$$ plain form
52883 384168 381075 379019 377581 375607 372429 368293 363863 359586 355484 351447 347503 343726 340006 336246
52869 336246 332849 330655 330061 330382 330394 329484 327989 326442 324924 323427 322583 323464 326356 329870 331737 330752
52853 330752 327893 325319 324317 324440 324554 324262 324105 324693 326127 328250 331053 334562 338433 341945 344452
52838 344452 345857 346574 347042 347383 347518 347386 346926 346059 345030 344646 345618 347611 349389 350163 350359 350760 351353
52821 351353 351586 351531 352158 354428 358496 363638 368498 371603 372341 371589 370845 370688 370753 371206 373220 377377 382404
52804 382404 386291 388200 388539 387794 386398 385491 386394 389031 391874 393865 395441 397255 398934 400013 401296
52789 401296 404147 408804 414376 420319 426744 433313 439007 443391 447188 451179 455387 459885 465480 472660
52775 472660 480374 486770 490905 492954 493144 491642 489490 488343 488672 488946 487197 482920 477080 470864 464966
52760D64966n414n327n880o391n973n144n540p423q678p349m339k309k439l625
52746C89135m563n021n013m197k783j853j940k254k126k328l898o180p181n858
52732C33940l156q82k20j204k842l702l200k308k345l097l037j545N1J51j203
52717C05401k689l445l646l724l689l287k405j319o58r88k108k962k491o78J292
52702B72604J875L78k301m229m273l235k779l265l599l207k899l317l710l204
52688B34839k335k177k659k985l143l585l831k981j583j325k521l391k574r60
52674A98789j93n00j074j706k625l262k594q04N62M23n90j071n01M12P37K12o59
52657A85556j114o69N13J551J350l21k164k389q00O78L34r78r27R51K440J649
$$ plain form
52760 464966 459552 454225 448345 441954 435981 430837 425297 417874 409196 401847 397508 395199 392760 389135
52746 389135 384572 379551 374538 370341 367558 365705 363765 361511 359385 357057 353159 346979 339798 333940
52732 333940 330784 329902 329682 328478 325636 321934 318734 316426 314081 310984 307947 306402 306453 306604 305401
52717 305401 302712 299267 295621 291897 288208 284921 282516 281197 280539 279551 277443 274481 271990 271312 272604
52702 272604 274479 274857 272556 268327 264054 260819 258040 254775 251176 247969 245070 241753 238043 234839
52688 234839 232504 230327 227668 224683 221540 217955 214124 211143 209560 208235 205714 202323 199749 198789
52674 198789 198596 198096 197022 195316 192691 189429 186835 186031 186593 187016 186426 185355 184854 185266 186003 186215 185556
52657 185556 184442 183773 184286 185837 187187 186866 184702 182313 181513 182191 182525 181547 180620 181571 184011 185660
52641A85660l92j162J99K306L638L909L486K691K102K519L980N304N305M228L375
52626B27148L415L578K798J096o19j797k558k800j994l67N75l30k248l457l736
52611B18704m284n226m988k832o29p73l236n845o918o427m999l131j465p68j316
52596A65867k623l806l860k134P31K746K370J42k222l891m969m955k877P33L454
52581A44706L480J565j72o33k17L39O74O61L71J55L91J183K417L827M837M783
52565A68367L650K211J192N07l70j549k539k670j597K53J625J254p84k935l647
52550A62968k819j536p70o36p04o40n52q19j467j846j266Q3J325J932J973J448
52534A56674K34j052j253k51N50J42n74j54J196K004J649Q44J60n04q86r9J938
$$ plain form
52641 185660 185268 184106 184305 186611 190249 194158 197644 200335 202437 204956 208936 214240 219545 223773 227148
52626 227148 230563 234141 236939 238035 237416 235619 233061 230261 228267 227900 228475 228145 225897 222440 218704
52611 218704 214420 209194 204206 201374 200745 199972 196736 190891 183973 177546 172547 169416 167951 167183 165867
52596 165867 163244 159438 155578 153444 154175 156921 159291 159433 157211 153320 148351 143396 140519 141252 144706
52581 144706 148186 149751 149579 148946 148729 149068 149742 150403 150774 150929 151320 152503 154920 158747 163584 168367
52565 168367 172017 174228 175420 175927 175557 174008 171469 168799 167202 167455 169080 170334 169550 166615 162968
52550 162968 160149 158613 157843 157207 156503 155863 155311 154492 153025 151179 149913 149996 151321 153253 155226 156674
52534 156674 156908 155856 154603 154352 154902 155044 154470 154316 155512 157516 159165 160009 160169 159665 158779 158680 160618
52517A60618L859M355L737L324L647L904L017Q56j484k454j371Q32K450K661K052
52502A90003J558J462J660K202L056L804M124M189M211L913L047K014J338Q96
52488B27477L52O8N98J463J482N53jN89J258O58o95r31P63L216M781M963M400
52471B50994L892L761L662K832R71j015j685p45N49J034J037J552K477K603J346
52456B73265l19r81k93R40J795J920J385M13n82r96m60O52J434J385J004J084
52440B81646J528J353J03j286j542p07l4l41j113j461j342j328j506j304m04O09
52424B72871Q90L54k76l89n6L70Q82J597K178K039J215M89L78M60M9q08j457j436
52406B79350o88O93K359L576L864L697L874M247L908K693J639J513J685J115j44
$$ plain form
52517 160618 164477 168832 172569 175893 179540 183444 186461 187317 185833 183379 182008 182840 185290 187951 190003
52502 190003 191561 193023 194683 196885 199941 203745 207869 212058 216269 220182 223229 225243 226581 227477
52488 227477 227829 227897 228495 229958 231440 231993 231992 232581 233839 234497 233802 232871 233634 236850 241631 246594 250994
52471 250994 254886 258647 262309 265141 266112 265097 263412 262667 263216 264250 265287 266839 269316 271919 273265
52456 273265 272946 271965 271672 272612 274407 276327 277712 278125 277543 276547 276087 276739 278173 279558 280562 281646
52440 281646 283174 284527 284630 283344 281802 281095 281061 280720 279607 278146 276804 275476 273970 272666 272262 272871
52424 272871 273761 274115 273839 273450 273394 273764 274646 276243 278421 280460 281675 282164 282542 283002 283051 282243 280786 279350
52406 279350 278662 279355 281714 285290 289154 292851 296725 300972 304880 307573 309212 310725 312410 313525 313381
52391C13381j187j595j711j801j743j574j507j229P6K544M933N692M535K565J076
52376C22455N94R03J432J549R25j46j020j394j461j376r95l63j8l18q11p06J03
52359C19353J060J768K238K405K066J479J310J703J960J521P36K87L21N48Q12
52344C39567J088J258J312J450J655J522R29L14j10p65j740k179j498n61n50j168
52328C40524j339j196j841l059l106j296O98J013r1j033j050m59M42J578K533
52313C32318K752K282J692J446J740K556L426L564K901K406K734L104K461J310
52299C66692J243K656M092M138L122K435K783L588L965L799L896N029O801P650
52285D21889O424L913K308K900M705N639M909L810M054N692P117P062O057N488
$$ plain form
52391 313381 312194 310599 308888 307087 305344 303770 302263 301034 301110 303654 308587 314279 318814 321379 322455
52376 322455 323049 323952 325384 326933 327858 327712 326692 325298 323837 322461 321466 321103 321085 320767 319956 319250 319353
52359 319353 320413 322181 324419 326824 328890 330369 331679 333382 335342 336863 337599 337886 338207 338755 339567
52344 339567 340655 341913 343225 344675 346330 347852 348781 349095 348985 348220 346480 344301 342803 342242 341692 340524
52328 340524 339185 337989 336148 333089 329983 328687 329385 330398 330307 329274 328224 327765 328207 329785 332318
52313 332318 335070 337352 339044 340490 342230 344786 348212 351776 354677 357083 359817 362921 365382 366692
52299 366692 367935 370591 374683 378821 381943 384378 387161 390749 394714 398513 402409 407438 414239 421889
52285 421889 428313 432226 434534 437434 442139 447778 452687 456497 460551 466243 473360 480422 486479 491967
52271D91967N708N837N253M400M005M363N601P621R344R144O903M757M657O006
52257E75566O911P155Q155J0149J1402J0883J0074J0937J3159J4777J4966J4850
52245G08984J5572J6841J7862J8787K0441K2861K4907K5509K4848K4026K3810
52234I44448K4150K4778K5705K6936K8228K9440L0659L1764L2276L2124L2008
52223A262516L2427L2875L2705L2319L2441L2536L1377K9229K7963K8376K8800
52212A603564K7411K4780K2743K1513J9595J6548J4054J3625J4462J4532J2971
52201A805798J0546Q230O327M777L413J924L45l62P68K961L859K302O9j58J836
52186A852635L737L971L649M716P267R667J0783J1139J1954J3767J6075J7867
$$ plain form
52271 491967 497675 503512 508765 513165 517170 521533 527134 534755 544099 553243 560146 564903 569560 575566
52257 575566 582477 589632 597787 607936 619338 630221 640295 651232 664391 679168 694134 708984
52245 708984 724556 741397 759259 778046 798487 821348 846255 871764 896612 920638 944448
52234 944448 968598 993376 1019081 1046017 1074245 1103685 1134344 1166108 1198384 1230508 1262516
52223 1262516 1294943 1327818 1360523 1392842 1425283 1457819 1489196 1518425 1546388 1574764 1603564
52212 1603564 1630975 1655755 1678498 1700011 1719606 1736154 1750208 1763833 1778295 1792827 1805798
52201 1805798 1816344 1824574 1830901 1835678 1839091 1841015 1841360 1840998 1841766 1844727 1848586 1850888 1850957 1850799 1852635
52186 1852635 1856372 1860343 1863992 1868708 1875975 1885642 1896425 1907564 1919518 1933285 1949360 1967227
52174A967227J8620J8906J9892K1876K3761K4348K3719K2756K1669J9950J7542
52163B200266J5083J2826J0293P357M904L773L524K840R59j701m180n895p003
52150B243046q252j0260j2860j5212j6785j7944j9342k0982k2235k2666k2488
52139B054020k2114k1648k0966k0092j9246j8502j7619j6381j5012j4133j4106
52128A854201j4455j4161j2619j0291q300p357p091o568n402m208l810m246m855
52115A750838n227n573o103o525o515o233o011n851n632n614o113o787o882o241
52101A665531n689o064p184q072q029p327o791o845p042o644n655m960n192n748
52087A574289n404l964k688k744l635l894l246l180m778o680o452l967j943k407
$$ plain form
52174 1967227 1985847 2004753 2024645 2046521 2070282 2094630 2118349 2141105 2162774 2182724 2200266
52163 2200266 2215349 2228175 2238468 2245825 2250729 2254502 2258026 2260866 2261825 2260124 2255944 2250049 2243046
52150 2243046 2234794 2224534 2211674 2196462 2179677 2161733 2142391 2121409 2099174 2076508 2054020
52139 2054020 2031906 2010258 1989292 1969200 1949954 1931452 1913833 1897452 1882440 1868307 1854201
52128 1854201 1839746 1825585 1812966 1802675 1794375 1787018 1779927 1773359 1767957 1763749 1759939 1755693 1750838
52115 1750838 1745611 1740038 1733935 1727410 1720895 1714662 1708651 1702800 1697168 1691554 1685441 1678654 1671772 1665531
52101 1665531 1659842 1653778 1646594 1638522 1630493 1623166 1616375 1609530 1602488 1595844 1590189 1585229 1580037 1574289
52087 1574289 1568885 1564921 1562233 1559489 1555854 1551960 1548714 1545534 1540756 1534076 1527624 1523657 1521714 1519307
52073A519307l912l763k042j438l168n227n442m329l632l573l216k665l026m403
52059A469471n538n506m600l473k526k064k119j920n15J962M425O212P562Q833
52045A470204J0102J1499J3043J4315J5248J6902K0176K3867K5719K5653K6309
52034A673037K9615L4361L8046L9822M0478M0643M0528M0676M1403M1834M0703
52023B101146L8259L6231L5769L6182L5863L3946L0885K7762K5223K2957K0259
52012B444482J6997J3627J0303O729L136N20p70j978m502p887j0270j0753j0490
51999B449144j1257j3522j6209j7951j8252j7540j6353j4755j2728j0741r297
51988B290539q095o396m340k949k493j863k08J742K857L322M070N124N775O060
$$ plain form
52073 1519307 1515395 1511632 1509590 1508152 1504984 1499757 1494315 1489986 1486354 1482781 1479565 1476900 1473874 1469471
52059 1469471 1463933 1458427 1453827 1450354 1447828 1445764 1443645 1441725 1441210 1443172 1447597 1453809 1461371 1470204
52045 1470204 1480306 1491805 1504848 1519163 1534411 1551313 1571489 1595356 1621075 1646728 1673037
52034 1673037 1702652 1737013 1775059 1814881 1855359 1896002 1936530 1977206 2018609 2060443 2101146
52023 2101146 2139405 2175636 2211405 2247587 2283450 2317396 2348281 2376043 2401266 2424223 2444482
52012 2444482 2461479 2475106 2485409 2492138 2495274 2495794 2495024 2493046 2488544 2480657 2470387 2459634 2449144
51999 2449144 2437887 2424365 2408156 2390205 2371953 2354413 2338060 2323305 2310577 2299836 2290539
51988 2290539 2282444 2276048 2271708 2268759 2266266 2264403 2264195 2265937 2268794 2272116 2276186 2281310 2287085 2293145
51974B293145O791Q099R088R196Q858Q595Q318P946P847Q055P676N721K368j037
51960B390666l166l765l749m390o218q623j0594j1831j2863j4267j6148j8425
51948B276627k1186k4520k8079l1046l2656l2942l3025l4283l6870l9385m0368
51937A922267l9930l9407l9648m0276m0651m0837m1287m1971m2293m1858m1095
51926A473014m0904m1600m2300m1750l9835l7872l6991l6767l5972l4294l2561
51915A052168l1357l0304k8799k6882k5056k3714k3041k3058k3439k3559k2973
51904G69986k1744k0207j8628j7170j5995j5252j4902j4600j3709j1847r604q319
51892E88009q564r225q807p485o905p867r143r115p755o249n408n325o133p811
$$ plain form
51974 2293145 2299936 2308035 2317123 2326319 2335177 2343772 2352090 2360036 2367883 2375938 2383614 2389335 2391703 2390666
51960 2390666 2387500 2383735 2379986 2375596 2369378 2360755 2350161 2338330 2325467 2311200 2295052 2276627
51948 2276627 2255441 2230921 2202842 2171796 2139140 2106198 2073173 2038890 2002020 1962635 1922267
51937 1922267 1882337 1842930 1803282 1763006 1722355 1681518 1640231 1598260 1555967 1514109 1473014
51926 1473014 1432110 1390510 1348210 1306460 1266625 1228753 1191762 1154995 1119023 1084729 1052168
51915 1052168 1020811 990507 961708 934826 909770 886056 863015 839957 816518 792959 769986
51904 769986 748242 728035 709407 692237 676242 660990 646088 631488 617779 605932 596328 588009
51892 588009 579445 570220 561413 553928 547023 539156 530013 520898 513143 506894 501486 496161 490028 482217
51878D82217r279q886o381l584k383k694l042k771k621l269m301m954n040m644
51864D18368l575j730L77K032K998L224K346K50k163l542l469k674k074k222l388
51849D04758n215o353n571l383j664j479k339l581n087o237n813l881k366k508
51835C49281k953j800L41J109l94k810m648n491n158l470j279k41q84j898j858
51820C17847p82M72J285J210j99k591m413m201k079N30K376L155L138K672K050
51805C20470J536J305J429J809K100J902J021l80j824k608k207q12P63J921K658
51790C29083L059K992K693K876L557L478J726n91j359Q2K486M441N397N202L940
51775C69062K466J870K149K323J942J444Q93l72k427m144m397l104q43J494K574
$$ plain form
51878 482217 472938 464052 457671 454087 451704 449010 445968 443197 440576 437307 433006 428052 423012 418368
51864 418368 414793 413063 413440 415472 418470 421694 424040 424290 422127 418585 415116 412442 410368 408146 404758
51849 404758 399543 393190 387619 384236 382572 381093 378754 375173 370086 363849 358036 354155 351789 349281
51835 349281 346328 344528 344869 345978 345584 342774 338126 332635 327477 324007 322728 322487 321603 319705 317847
51820 317847 317065 317537 318822 320032 319833 317242 312829 308628 306549 307079 309455 312610 315748 318420 320470
51805 320470 322006 323311 324740 326549 328649 330551 331572 331192 329368 326760 324553 323741 324504 326425 329083
51790 329083 332142 335134 337827 340703 344260 347738 349464 348873 347514 347596 350082 354523 359920 365122 369062
51775 369062 371528 373398 375547 377870 379812 381256 382149 381777 379350 375206 370809 367705 366862 368356 370930
51760C70930J439j013k535k079p80n8Jj89o47j090o42O42J260M68l44J92J166
51743C66721R48j17n49l70p82j604j363M4R99Q78J028K250L151K235K55q70o49
51726C72205k46o45j653k546k851k511j771r24Q7J475K882L308K251N45m18pJ313
51709C70494K595K951J986L65l67O47K265K419P44p13O6K572M571M936M559M382
51693D04472L972K812J787K034K903K771J766J854L731N387M951L482L334M805
51679D50061O265P095Q358J0363J1614J1065R857R681J0468J0966J0879J1189
51667E67861J2520J4423J6301J8012J9157J8676J5961J1981Q603O586M874K168
51655G17123j117l145k850j315o17j682l644n062n305m921n007o176p781q341
$$ plain form
51760 370930 372369 371356 368821 366742 365962 365904 365905 365716 365069 363979 363337 363979 365239 365707 365363 365555 366721
51743 366721 367669 367552 367003 366633 365851 364247 362884 362928 363927 364805 365833 368083 371234 373469 373724 372854 372205
51726 372205 371959 371314 369661 367115 364264 361753 359982 359058 359145 360620 363502 366810 369061 369606 369188 369181 370494
51709 370494 373089 376040 378026 378391 378024 378671 380936 383355 384099 383386 383452 386024 390595 395531 400090 404472
51693 404472 408444 411256 413043 415077 417980 420751 422517 424371 428102 433489 438440 441922 445256 450061
51679 450061 456326 463421 471779 482142 493756 504821 514678 524359 534827 545793 556672 567861
51667 567861 580381 594804 611105 629117 648274 666950 682911 694892 703495 710081 714955 717123
51655 717123 716006 712861 710011 708696 708079 706397 702753 697691 692386 687465 682458 676282 668501 660160
51641F60160p076m886l330k905k859k569k293k379k462j906o50O68J272P74m55
51626F29104j366j099Q9J132J572K099L405N128O357O710O203M525J372k559n768
51611F56904p349p638p217n983l765j321Q9J05m73r04j193j301m36J972M976O797
51595F33263O872O323O126N680L845P22k361m331n052m927m647n177o969r078
51581F20289r909r120q082q056q744r105q955q948r393r885j0015r827r483q964
51567D91803q175p025n459l774k801l260m766o032o162n446m632l901l019k195
51553D25156k058k695l210k621r60P30J440J025J38m55n08l90o18j215j694j673
51537D10392j298r26p03o45q58j262j407j006m36j17K70J219K232K374J984K633
$$ plain form
51641 660160 653084 648198 644868 641963 639104 636535 634242 631863 629401 627495 626845 627513 628785 629559 629104
51626 629104 627738 626639 626728 627860 629432 631531 634936 640064 646421 653131 659334 663859 665231 662672 656904
51611 656904 649555 641917 634700 628717 624952 623631 623720 623825 623352 622448 621255 619954 619518 621490 626466 633263
51595 633263 640135 646458 652584 658264 662109 662831 660470 656139 651087 646160 641513 636336 629367 620289
51581 620289 610380 601260 593178 585122 576378 567273 558318 549370 539977 530092 520077 510250 500767 491803
51567 491803 483628 476603 471144 467370 464569 461309 456543 450511 444349 438903 434271 430370 427351 425156
51553 425156 423098 420403 417193 414572 413612 414342 415782 416807 416945 416490 415982 415592 414974 413759 412065 410392
51537 410392 409094 408168 407465 406820 405962 404700 403293 402287 401851 401734 402004 403223 405455 407829 409813 412446
51521D12446M792O754O711N055L633L402L993N002O486Q240R751J0812J1379J0925
51507E09381Q959O091L500J412q15l084m309m071l346l060l004k734k556k879
51493D99485l399l660l683l473k661j334l66j86j6P95J590J630J699L027N130
51478D94578O313O277O625Q379J0306J0405Q252N237L070K513L182M014M050L044
51464E76245J408j79r82n76M83Q89J31o04j03Q43M36j273k254j435m6O42J248
51447E74873K626L776L133J195M2M51J076N40r07k062k007n90J248J552r63m954
51431E79029p404p034n671n594o723p502p359o857n973m051j538j89r52k692l669
51416E05821l469k723j723k85J301K292K542K815L789N329O895Q135Q745Q332
$$ plain form
51521 412446 417238 423992 430703 435758 439391 442793 446786 451788 458274 466514 476265 487077 498456 509381
51507 509381 518340 524431 527931 529343 528528 525444 521135 517064 513718 510658 507654 504920 502364 499485
51493 499485 496086 492426 488743 485270 482609 481275 480909 480723 480707 481502 483092 484722 486421 489448 494578
51478 494578 500891 507168 513793 522172 532478 542883 551135 556372 559442 561955 565137 569151 573201 576245
51464 576245 577653 577474 576492 575916 576399 577288 577419 576815 576712 577555 577991 576718 574464 573029 572983 573625 574873
51447 574873 577499 581275 584408 585603 585645 586096 587172 587712 586805 584743 582736 582146 583394 584946 583983 579029
51431 579029 571625 564591 558920 553326 546603 539101 531742 524885 518912 514861 513323 513134 512182 509490 505821
51416 505821 502352 499629 497906 497621 498922 501214 503756 506571 510360 515689 522584 530719 539464 547796
51402E47796P032N900O020P205Q189Q211P898Q355R794J1332J1902J1156R714
51389F60504Q668Q619Q995Q693P395N868M789L966L038K135J296O0j400j627J82
51374G21181K194J774p17k040n60J423J106r07j955j275m19k37K76J867L657M452
51358G29820M072K859R85j155k861m018n212o559p348p312p343q193r315r762
51344F68658r550r328r200q744p852o829n876m986m187l499k939k784l395m423
51330E85066m865m267l207k246j167P4O01k14j520j981j432n17O47K134K992J994
51314E72092m26k426l178l700m953o447p335p743q234q810r296r994j1161j2176
51300D76213j2096j0888r645r552j0784j2311j2698j1392r283p622o634n699m838
$$ plain form
51402 547796 554828 560728 566748 573953 582142 590353 598251 606606 616400 627732 639634 650790 660504
51389 660504 669172 677791 686786 695479 702874 708742 713531 717497 720535 722670 723966 724026 722626 720999 721181
51374 721181 723375 725149 724432 722392 721832 723255 724361 723454 721499 720224 719805 719568 719844 721711 725368 729820
51358 729820 733892 736751 737736 736581 733720 729702 724490 717931 710583 703271 695928 687735 678420 668658
51344 668658 659108 649780 640580 631836 623984 617155 611279 606293 602106 598607 595668 592884 589489 585066
51330 585066 580201 575934 572727 570481 569314 569388 569989 569775 568255 566274 564842 564325 564972 567106 570098 572092
51314 572092 571666 569240 566062 562362 557409 550962 543627 535884 527650 518840 509544 499550 488389 476213
51300 476213 464117 453229 443584 434032 423248 410937 398239 386847 377564 369942 363308 357609 352771
51287C52771m972o401p889p888o135l641j599p00r35j534j568r97p41j312j981
51272C04478j798q79m4L71O15P88P17M39K52K80M32O20P19N37J83J30N73J114
51254C09527J443J916K915M109M969N479N647M861K787O86O17L064O223P992P980
51239C70215P318P119P586Q092P734O050L585J528O55O38N26l80k052l923n375
51224D09316o190o557o703o663o407n883m915l613k953m028o280p507o575n190
51210C29852n572p150p349n458l595l486m254m334l849l736l749k978j660j015
51196B71667j543k586l366l552l102k388k144k479k413j211L32J022J108J728
51182B51073K872L401L067K930L489L847L279K349J929K043K217K090J235n53
$$ plain form
51287 352771 347799 341398 333509 325621 319486 315845 314246 313546 312611 311077 309509 308512 307771 306459 304478
51272 304478 302680 301801 301757 302128 302743 303531 304248 304687 304939 305219 305651 306271 306990 307527 307710 307840 308413 309527
51254 309527 310970 312886 315801 319910 324879 330358 336005 340866 343653 344339 344956 348020 354243 362235 370215
51239 370215 377533 384652 392238 400330 408064 414114 417699 419227 419882 420520 421046 420666 418614 414691 409316
51224 409316 403126 396569 389866 383203 376796 370913 365998 362385 359432 355404 349124 341617 335042 329852
51210 329852 324280 317130 309781 304323 300728 297242 292988 288654 284805 281069 277320 274342 272682 271667
51196 271667 270124 267538 264172 260620 257518 255130 252986 250507 248094 246883 247215 248237 249345 251073
51182 251073 253945 257346 260413 263343 266832 270679 273958 276307 278236 280279 282496 284586 285821 285268
51168B85268k366k714j587p43j163j623q62J80j06j225j335k40M12j07n54J17
51152B71352J194J519J093N93K53L3J28O21J098J155Q11J39q69j757j720p53J20
51135B75010L39O87J939L334L407J909L4j117j477j567j770k101k172j541m23
51120B74491J57n11j872k782k825k449k063j728j526j509j328n93M35J058R74
51105B57929M10l83j114j188k44J038J454O74m62j008n67Q33K649L589K606L59
51089B66575j230j232n74m09p48j280k308l851m710l713j500P9J88l44m97j79
51073B44267J77L16K00m3q5K41N06K43r4M77J862K611J817N55N56J789K531J885
51055B59811J075J646L200M057L692L299L724M177L632K449J564Q01o50k472l365
$$ plain form
51168 285268 282902 280188 278601 277858 276695 275072 274210 274390 274284 273059 271724 271484 271896 271789 271235 271352
51152 271352 272546 274065 275158 275751 276004 276037 276165 276786 277884 279039 279850 279989 279120 277363 275643 274890 275010
51135 275010 275349 276036 277975 281309 284716 286625 286659 285542 284065 282498 280728 278627 276455 274914 274491
51120 274491 274648 274137 272265 269483 266658 264209 262146 260418 258892 257383 256055 255462 255897 256955 257929
51105 257929 258339 257956 256842 255654 255410 256448 257902 258576 258114 257106 256539 257372 260021 263610 266216 266575
51089 266575 265345 264113 263539 263130 262382 261102 258794 254943 250233 246520 245020 245099 245287 244943 244446 244267
51073 244267 244444 244760 244960 244917 244832 245073 245579 245822 245728 246205 248067 250678 252495 253050 253606 255395 257926 259811
51055 259811 260886 262532 265732 269789 273481 276780 280504 284681 288313 290762 292326 293127 292477 290005 286640
51040B86640l082k854l291l234j531J058K783K998K349J454N40J9K27O49M19k55
51024B84889k21R69K322K741K252J508P87P0m05l85j25q4j59J59Q36J085L82p04
51006B95917j109n35L90J109J653J967J535K53q63p91o1J3m76P5K183L951L392
50989C08603J062q60j512j800k230j900q7K330L705L303J810P03J335L909O940
50974C25311Q287P179M955L580L839N044N976N825M662L284K418J984J566J385
50960C85295K102L565M649M580L655K321N13j533k694k110l23J543L134M550N348
50945D14595N025M191M043M698N171N059N093N778O657P421Q712J0994J3320J4169
50931E14926J3278J2023J2030J3800J6482J8690J9768K0406K1693K3505K4538
$$ plain form
51040 286640 283558 280704 277413 274179 272648 273706 276489 279487 281836 283290 283830 283849 284076 284725 285144 284889
51024 284889 284668 285637 287959 290700 292952 294460 295247 295317 294912 294527 294402 294318 294159 294318 295154 296239 296621 295917
51006 295917 294808 294273 294663 295772 297425 299392 300927 301180 300317 299526 299465 299478 299002 299077 301260 305211 308603
50989 308603 309665 308805 307293 305493 303263 301363 301276 303606 307311 310614 312424 313127 314462 318371 325311
50974 325311 333598 340777 345732 349312 353151 358195 364171 369996 374658 377942 380360 382344 383910 385295
50960 385295 387397 390962 395611 400191 403846 406167 406680 405147 402453 400343 400020 401563 404697 409247 414595
50945 414595 419620 423811 427854 432552 437723 442782 447875 453653 460310 467731 476443 487437 500757 514926
50931 514926 528204 540227 552257 566057 582539 601229 620997 641403 663096 686601 711139
50920G11139K4334K4444K6628L0435L3739L5557L7163M0096M4164M8120N1571
50909A107390N5324O0044O5423P0839P6208Q1860Q7762R3377R8326J02921J07592
50898B007066J11967J14992J16221J16334J15874J13949J09206J01856R3614Q5316
50888C086395P5824O4145N1622M0656L1574K2285J1321L0r012j4923j8930k2239
50876C318748k4696k5713k5720k5954k7108k8841l0570l2263l4275l6998m1034
50865B985576m7169n5266o3478o9547p3178p6263q0380q4847q7900q9010q9079
50854B169459q8700q7358q4365p9881p4763o9987o6142o3001n9487n4582m8378
50843A392815m1895l6052l1164k7216k3923k0770j7602j5008j3376j1884r445
$$ plain form
50920 711139 735473 759917 786545 816980 850719 886276 923439 963535 1007699 1055819 1107390
50909 1107390 1162714 1222758 1288181 1359020 1435228 1517088 1604850 1698227 1796553 1899474 2007066
50898 2007066 2119033 2234025 2350246 2466580 2582454 2696403 2805609 2907465 3001079 3086395
50888 3086395 3162219 3226364 3277986 3318642 3350216 3372501 3383822 3383852 3374840 3359917 3340987 3318748
50876 3318748 3294052 3268339 3242619 3216665 3189557 3160716 3130146 3097883 3063608 3026610 2985576
50865 2985576 2938407 2883141 2819663 2750116 2676938 2600675 2520295 2435448 2347548 2258538 2169459
50854 2169459 2080759 1993401 1909036 1829155 1754392 1684405 1618263 1555262 1495775 1441193 1392815
50843 1392815 1350920 1314868 1283704 1256488 1232565 1211795 1194193 1179185 1165809 1153925 1144480
50832A144480o427m137k669p61J895L763L697K779K843M228O040P768R419J0720
50818A183638J1480J2339J4012J6110J7701J8723J9815K1183K2730K4889K7980
50807A390600L1007L2587L3231L5211L9728M5387N0121N3562N6890O1174O6609
50796A896107P2923P9846Q7524R6711J08023J20737J32975J43628J53674J65056
50786C057204J78580J93280K07560K20450K31853K41943K50418K56395K59073
50777E096756K58216K53612K44454K30012K10674J87540J61096J31395R9678O8492
50767F941925L9577J2764j2211l3924n0487o1814o9195p2981p2290o7265o0265
50756F493834n4110n0072m8294m9385n4442o3595p5559q9026j03916j20523j37932
$$ plain form
50832 1144480 1138053 1133916 1131247 1130486 1132381 1136144 1139841 1142620 1145463 1149691 1155731 1163499 1172918 1183638
50818 1183638 1195118 1207457 1221469 1237579 1255280 1274003 1293818 1315001 1337731 1362620 1390600
50807 1390600 1421607 1454194 1487425 1522636 1562364 1607751 1657872 1711434 1768324 1829498 1896107
50796 1896107 1969030 2048876 2136400 2233111 2341134 2461871 2594846 2738474 2892148 3057204
50786 3057204 3235784 3429064 3636624 3857074 4088927 4330870 4581288 4837683 5096756
50777 5096756 5354972 5608584 5853038 6083050 6293724 6481264 6642360 6773755 6873433 6941925
50767 6941925 6981502 6994266 6982055 6948131 6897644 6835830 6766635 6693654 6621364 6554099 6493834
50756 6493834 6439724 6389652 6341358 6291973 6237531 6173936 6098377 6009351 5905435 5784912 5646980
50745E646980j54198j68300j81063j93424k04332k11355k13277k11117k06456
50736C903458j99818j91203j81281j71072j60798j49849j37865j25205j12484
50727B473883j00221q8988p9313p1245o4157n7140m9584m1633l4281k8733k5348
50716A833240k3284k1379j9115j6580j3910j1302r259q153p640p075o429o246
50704A682868o672p067o759n821m937m706n009m841l095N1K888L992M023M820
50690A649735O891R036J0627J2804J6623K1327K5577K9492L4034L8980M3190M6741
50678A945057N1093N6906O3208O9391P6522Q5528R5246J03615J10400J17365J25907
50667B900238J35545J44699J52034J56966J59619J60452J59321J55000J46320
$$ plain form
50745 5646980 5492782 5324482 5143419 4949995 4745663 4534308 4321031 4109914 3903458
50736 3903458 3703640 3512437 3331156 3160084 2999286 2849437 2711572 2586367 2473883
50727 2473883 2373662 2284674 2205361 2134116 2069959 2012819 1963235 1921602 1887321 1858588 1833240
50716 1833240 1809956 1788577 1769462 1752882 1738972 1727670 1718411 1710258 1702618 1695543 1689114 1682868
50704 1682868 1676196 1669129 1662370 1656549 1651612 1646906 1641897 1637056 1633961 1634012 1636900 1640892 1644915 1649735
50690 1649735 1656626 1665662 1676289 1689093 1705716 1727043 1752620 1782112 1816146 1855126 1898316 1945057
50678 1945057 1996150 2053056 2116264 2185655 2262177 2347705 2442951 2546566 2656966 2774331 2900238
50667 2900238 3035783 3180482 3332516 3489482 3649101 3809553 3968874 4123874 4270194
50658D270194J33699J18657J01937Q3113O2185M0317J8465l459k5196m4900o0400
50647D694612p1189p8060q1303q0475p5875o9075o1817n5123m9594m5636m3157
50636C983308m1836m2000m4647n0189n7829o6631p6675q8503j01636j14209j23999
50625C175154j29542j30506j27708j22926j18059j13783j09113j02715r4674q6398
50615B039730p8757p1073o2495n3688m6208m0477l5474l0414k5526k0987j6295
50604A558336j1289o629k603J529O103R971J2061J3188J5022J7805K0456K2490
50592A656440K4470K6773K9342L2489L6502M0469M2962M4075M5479M8166N1387
50581B078554N4185N6757N9922O4187O9611P5482Q0087Q2116Q2528Q3618Q5933
$$ plain form
50658 4270194 4403893 4522550 4624487 4707600 4769785 4810102 4828567 4825108 4799912 4755012 4694612
50647 4694612 4623423 4545363 4464060 4383585 4307710 4238635 4176818 4121695 4072101 4026465 3983308
50636 3983308 3941472 3899472 3854825 3804636 3746807 3680176 3603501 3514998 3413362 3299153 3175154
50625 3175154 3045612 2915106 2787398 2664472 2546413 2432630 2323517 2220802 2126128 2039730
50615 2039730 1960973 1889900 1827405 1773717 1727509 1687032 1651558 1621144 1595618 1574631 1558336
50604 1558336 1547047 1540418 1537815 1539344 1545447 1555418 1567479 1580667 1595689 1613494 1633950 1656440
50592 1656440 1680910 1707683 1737025 1769514 1806016 1846485 1889447 1933522 1979001 2027167 2078554
50581 2078554 2132739 2189496 2249418 2313605 2383216 2458698 2538785 2620901 2703429 2787047 2872980
50570B872980Q7572Q6933Q4391Q0721P5798O9913O4487N9981N4658M7044L8231
50559C622709L0056K2363J4163O417J176j560l785o397q301q564p466n157j430
50546C654224K619M753M310L070K375R79k968r190j6118k3541l2608m3317n3708
50533C490880o2050o8804p5687q3305r0425r5542r8512j00157j00615r9014r5051
50522B521718r0009q5424q1306p6722p1668o7089o3005n8105n1776m5416m0747
50511A790451l7555l4117k9510k4548k0312j6553j2098o555j028L181O239R439
50499A627034J3218J6449J8267J9645K2071K5322K8035L0054L2587L5881L8585
50488A907148M0042M1501M3932M6099M6337M5269M4985M6049M7016M6846M6162
$$ plain form
50570 2872980 2960552 3047485 3131876 3212597 3288395 3358308 3422795 3482776 3537434 3584478 3622709
50559 3622709 3652765 3675128 3689291 3695708 3696884 3695324 3691539 3685142 3676841 3668277 3660811 3655654 3654224
50546 3654224 3656843 3661596 3665906 3668976 3671351 3672330 3669362 3660172 3644054 3620513 3587905 3544588 3490880
50533 3490880 3428830 3360026 3284339 3201034 3110609 3015067 2916555 2816398 2715783 2616769 2521718
50522 2521718 2431709 2346285 2264979 2188257 2116589 2049500 1986495 1928390 1876614 1831198 1790451
50511 1790451 1752896 1718779 1689269 1664721 1644409 1627856 1615758 1609203 1608175 1611356 1617595 1627034
50499 1627034 1640252 1656701 1674968 1694613 1716684 1742006 1770041 1800095 1832682 1868563 1907148
50488 1907148 1947190 1988691 2032623 2078722 2125059 2170328 2215313 2261362 2308378 2355224 2401386
50477B401386M5855M5944M6485M8373N2265N7324O2013O5905P0089P5790Q3076
50466C054505R0943R8471J05793J13871J23278J33184J41865J48185J52397J55417
50456D317909J57687J58787J57827J53995J47043J37432J25805J12081R5376P5131
50446E639073N2036K7595L018k1022m3736o4144q1758r6827j09436j18745j23462
50435E062592j23101j18353j10298r9533q6195p0677n4034l7614k2376q700L145
50424D334856J2526J8550K0501J7978J0741j147j6961l5385n5031p4690r3040
50413D138898j08628j20561j29011j34842j38827j41312j42170j40844j36849
50404B945854j30572j23273j15761j07567r7953q7523p7921o9936o2674n4916
$$ plain form
50477 2401386 2447241 2493185 2539670 2588043 2640308 2697632 2759645 2825550 2895639 2971429 3054505
50466 3054505 3145448 3243919 3349712 3463583 3586861 3720045 3861910 4010095 4162492 4317909
50456 4317909 4475596 4634383 4792210 4946205 5093248 5230680 5356485 5468566 5563942 5639073
50446 5639073 5691109 5718704 5721722 5700700 5656964 5592820 5511062 5414235 5304799 5186054 5062592
50435 5062592 4939491 4821138 4710840 4611307 4525112 4454435 4400401 4362787 4340411 4331711 4334856
50424 4334856 4347382 4365932 4386433 4404411 4415152 4414005 4397044 4361659 4306628 4231938 4138898
50413 4138898 4030270 3909709 3780698 3645856 3507029 3365717 3223547 3082703 2945854
50404 2945854 2815282 2692009 2576248 2468681 2370728 2283205 2205284 2135348 2072674 2017758
50394B017758m6734l9352l3736k9515k5276j9787j3067o242l70M392Q457J2185
50382A828713J5953K0166K4627K8392L1006L3392L6570L9867M1679M1765M1603
50371B183733M2335M3536M4264M4164M3254M1708M0152L9095L7894L5343L1616
50360B627094K8217K5656K2753J8938J5591J3969J3409J2929J3135J4800J6755
50349B823246J7451J7978K1243K8102L6128M2510M6521M8772M9684M9600M9325
50338C230560M9421M9304M7605M3380L6858K9101K0860J1709N59j2709k6766m0267
50326C439615n2962o4761p4600q1362q5306q7621q8894q8994q7810q4930p9148
50315B563227o9797n8375m7469l8125k9435k0494j1382k419N919J2173J4591J3094
$$ plain form
50394 2017758 1971024 1931672 1897936 1868421 1843145 1823358 1810291 1804049 1803679 1808071 1816528 1828713
50382 1828713 1844666 1864832 1889459 1917851 1948857 1982249 2018819 2058686 2100365 2142130 2183733
50371 2183733 2226068 2269604 2313868 2358032 2401286 2442994 2483146 2522241 2560135 2595478 2627094
50360 2627094 2655311 2680967 2703720 2722658 2738249 2752218 2765627 2778556 2791691 2806491 2823246
50349 2823246 2840697 2858675 2879918 2908020 2944148 2986658 3033179 3081951 3131635 3181235 3230560
50338 3230560 3279981 3329285 3376890 3420270 3457128 3486229 3507089 3518798 3519357 3506648 3479882 3439615
50326 3439615 3386653 3321892 3247292 3165930 3080624 2993003 2904109 2815115 2727305 2642375 2563227
50315 2563227 2493430 2435055 2387586 2349461 2320026 2299532 2288150 2285731 2291650 2303823 2318414 2331508
50303B331508R369M645j413r241j8061k6600l4125m0309m4875m7878m9697n0573
50291B022750n0735n0847n1255n1001m8833m5222m1958l9601l6928l3285k9862
50280A543223k7805k6461k4445k1442j8102j4963j2258r964p487m138l42K572
50268A378388M225N709P841J0155J2199J4535J7524K0331K2145K3329K4371K4821
50256A565573K4320K3686K3835K4503K5159K6288K8347L0249L0339K8449K5795
50245A856543K3238K0891J9067J8133J7432J5562J1976P664M054J803N27p65k959
50232A993166o112r479j2343j4423j5564j5851j6166j7510j9404k0193j9602j9634
50220A806885k1825k4858k6295k5677k4413k3335k2136k0898k0492k1322k2725
$$ plain form
50303 2331508 2340877 2345522 2344109 2334868 2316807 2290207 2256082 2215773 2170898 2123020 2073323 2022750
50291 2022750 1972015 1921168 1869913 1818912 1770079 1724857 1682899 1643298 1606370 1573085 1543223
50280 1543223 1515418 1488957 1464512 1443070 1424968 1410005 1397747 1387783 1380296 1376158 1375816 1378388
50268 1378388 1382613 1388322 1396163 1406318 1418517 1433052 1450576 1470907 1493052 1516381 1540752 1565573
50256 1565573 1589893 1613579 1637414 1661917 1687076 1713364 1741711 1771960 1802299 1830748 1856543
50245 1856543 1879781 1900672 1919739 1937872 1955304 1970866 1982842 1990506 1994560 1996363 1996890 1996125 1993166
50232 1993166 1987054 1977575 1965232 1950809 1935245 1919394 1903228 1885718 1866314 1846121 1826519 1806885
50220 1806885 1785060 1760202 1733907 1708230 1683817 1660482 1638346 1617448 1596956 1575634 1552909
50209A552909k3751k3718k2315k0044j8282j7924j8215j7787j6343j4402j2028
50198A348100r080o284m580l568j993L07K276L440M444N597O138N510M306L471
50184A358084L220L117K735K073J554J573J713Q85j253l562m819n199n468n588
50170A349065n260n272o648q784r958r636q866q351p553n995m153k812k385k868
50156A260524l519k867l09K591L849L743M047M927M852L769L795N784P552O987
50142A305725N031L886L745L272K159J186K19j850n069p893r048r005r160j0223
50128A272975j1641j2274j1547r974q506p478o675o240o674p816q802r292r860
50115A156196j0720j1181j0877j0535j0606j0214q525o393n378n647n932n308
$$ plain form
50209 1552909 1529158 1505440 1483125 1463081 1444799 1426875 1408660 1390873 1374530 1360128 1348100
50198 1348100 1339020 1332736 1328156 1324588 1322595 1322902 1325178 1328618 1333062 1338659 1344797 1350307 1354613 1358084
50184 1358084 1361304 1364421 1367156 1369229 1370783 1372356 1374069 1374954 1373701 1370139 1365320 1360121 1354653 1349065
50170 1349065 1343805 1338533 1331885 1323101 1313143 1303507 1294641 1286290 1278737 1272742 1268589 1265777 1263392 1260524
50156 1260524 1257005 1254138 1253829 1256420 1260269 1264012 1268059 1272986 1277838 1281607 1285402 1291186 1298738 1305725
50142 1305725 1310756 1314642 1318387 1321659 1323818 1325004 1325223 1323373 1318304 1310411 1301363 1292358 1283198 1272975
50128 1272975 1261334 1249060 1237513 1227539 1219033 1211555 1204880 1198640 1191966 1184150 1175348 1166056 1156196
50115 1156196 1145476 1134295 1123418 1112883 1102277 1092063 1083538 1077145 1071767 1066120 1060188 1054880
50103A054880l932k343j137j220l198o356r061j0445j1011j1499j1896j1840j1459
50090I59483j1343j1811j2475j2534j1526r817q188p029o221n712n576n462m685
50077H47104l257k119j952k365k820l524m510m607k630O32K850K885K019K220
50063H29926L994O377Q333R518J0040J0115R997R835R598R303R214R677J0666
50050I46593J1672J2084J1717J0941J0370J0453J1257J2417J3187J2838J1366
50039A074895R685Q820Q897R203R088Q448P376N944M453L577L872N340P397R132
50025A176127R698Q992P903P467P805Q371R112J0548J2558J4002J4112J3642J4031
50012A314368J5728J7852J9317J9893K0231K1037K2157K2692K2295K2042K3207
$$ plain form
50103 1054880 1050948 1048605 1047468 1046248 1043050 1036694 1027633 1017188 1006177 994678 982782 970942 959483
50090 959483 948140 936329 923854 911320 899794 889977 881789 874760 868539 862827 857251 851789 847104
50077 847104 843847 841728 839776 837411 834591 831067 826557 821950 819320 819952 822802 825687 827706 829926
50063 829926 833920 840297 848630 858148 868188 878303 888300 898135 907733 917036 926250 935927 946593
50050 946593 958265 970349 982066 993007 1003377 1013830 1025087 1037504 1050691 1063529 1074895
50039 1074895 1084580 1093400 1102297 1111500 1120588 1129036 1136412 1142356 1146809 1150386 1154258 1159598 1166995 1176127
50025 1176127 1185825 1194817 1202720 1210187 1217992 1226363 1235475 1246023 1258581 1272583 1286695 1300337 1314368
50012 1314368 1330096 1347948 1367265 1387158 1407389 1428426 1450583 1473275 1495570 1517612 1540819
50001A540819K5295K6419K5820K4746K4332K3865K2268K0245J9502K0193K0603
49990A794107J9395J7043J4769J2907J0834Q028M842K382J485J572P22k557p661
49977A877868j2390j5036j5592j5089j4500j4385j5075j6688j8963k1220k2565
49966A696365k2443k1178j9760j8781j7823j6142j3791j1658j0479j0119r837
49955A524354q956p414n769m579l725k703j644j427k324l155k513n98Q68N67j163
49940A479819l010m131m783n821p562r162r416q478q223j0234j3745j6339j6552
49927A362363j5067j3428j2494j2343j2771j3281j3118j2000j0534r469q711p510
49915A221637n511l201j295o2O90J256J926K983M456N816O200N216L469K099J764
$$ plain form
50001 1540819 1566114 1592533 1618353 1643099 1667431 1691296 1713564 1733809 1753311 1773504 1794107
49990 1794107 1813502 1830545 1845314 1858221 1869055 1877083 1881925 1884307 1885792 1887364 1888086 1885529 1877868
49977 1877868 1865478 1850442 1834850 1819761 1805261 1790876 1775801 1759113 1740150 1718930 1696365
49966 1696365 1673922 1652744 1632984 1614203 1596380 1580238 1566447 1554789 1544310 1534191 1524354
49955 1524354 1515398 1507984 1502215 1497636 1493911 1491208 1489564 1488137 1485813 1482658 1480145 1479547 1480415 1480982 1479819
49940 1479819 1476809 1472678 1467895 1462074 1454512 1445350 1435934 1427456 1419233 1408999 1395254 1378915 1362363
49927 1362363 1347296 1333868 1321374 1309031 1296260 1282979 1269861 1257861 1247327 1237858 1229147 1221637
49915 1221637 1216126 1212925 1211630 1211568 1212258 1213514 1215440 1218423 1222879 1228695 1234895 1240111 1243580 1245679 1247443
49900A247443K138K276J413m08k334l575m491o421j0002j4032j6767j8051j9253
49887A157936k1176k3172k4540k5573k6540k6737k5606k3970k3010k2525k1406
$$ plain form
49900 1247443 1249581 1251857 1253270 1252862 1250528 1246953 1242462 1236041 1226039 1212007 1195240 1177189 1157936
49887 1157936 1136760 1113588 1089048 1063475 1036935 1010198 984592 960622 937612 915087 893681
$$ [...]
##END NTUPLES=NMR SPECTRUM
##END=
