
##TITLE=AC1168_Tolima-ibague-TPAAH12002_7165251_EIQV43ZHFW
##JCAMPDX= 6.0         $$ Bruker NMR JCAMP-DX V2.0
##DATA TYPE= NMR SPECTRUM
##DATA CLASS= NTUPLES
##ORIGIN= BRUKER
##OWNER= Administrator
$$ 1.72 TOPSPIN		Version 2.1
$$ 2012-12-01 18:03:42.719 -0500  Administrator@X
$$ Compression mode = diff/dup
##.OBSERVE FREQUENCY= 400.02188249412
##.OBSERVE NUCLEUS= ^1H
##.ACQUISITION MODE= SIMULTANEOUS (DQD)
##.ACQUISITION SCHEME= undefined
##.AVERAGES= 8
##.DIGITISER RES= 22
##SPECTROMETER/DATA SYSTEM= spect
##.PULSE SEQUENCE= zg30
##.SOLVENT NAME= COFFEE_meoh
##.SHIFT REFERENCE= INTERNAL, COFFEE_meoh, 1, 14.98509
##AUDIT TRAIL= $$ (NUMBER, WHEN, WHO, WHERE, PROCESS, VERSION, WHAT)
$$ ##TITLE= Audit trail, TOPSPIN		Version 2.1
$$ ##JCAMPDX= 5.01
$$ ##ORIGIN= Bruker BioSpin GmbH
$$ ##OWNER= Administrator
$$ $$ E:\/data/COFFEE/nmr/AC1168_Tolima-ibague-TPAAH12002_7165251_EIQV43ZHFW/10/pdata/1/auditp.txt
$$ ##AUDIT TRAIL=  $$ (NUMBER, WHEN, WHO, WHERE, PROCESS, VERSION, WHAT)
(   1,<2012-12-01 18:03:35.279 -0500>,<Administrator>,<X>,<go>,<TOPSPIN 2.1>,
      <created by zg
	started at 2012-12-01 18:02:18.236 -0500,
	POWCHK enabled, PULCHK disabled,
       configuration hash MD5:
       86 BA 57 50 F2 9D 5C 9B 26 00 A9 28 5F 66 2E 89
       data hash MD5: 64K
       45 9C 9C 07 77 C1 46 F8 5C D3 5A 2F 8E 56 3C 47>)
(   2,<2012-12-01 18:03:38.077 -0500>,<Administrator>,<X>,<proc1d>,<TOPSPIN 2.1>,
      <Start of raw data processing
       efp LB = 0 FT_mod = 6 PKNL = 1 PHC0 = 0 PHC1 = 0 SI = 32K 
       data hash MD5: 32K
       27 7B A3 50 B7 54 4F 85 60 AA 76 6A 5A 4C 44 A2>)
(   3,<2012-12-01 18:03:38.501 -0500>,<Administrator>,<X>,<proc1d>,<TOPSPIN 2.1>,
      <pk PHC0 = 96.4325 PHC1 = 0 
       data hash MD5: 32K
       5D E2 DB 63 C0 40 EB DE 34 AF 32 6E F5 68 AB 69>)
(   4,<2012-12-01 18:03:38.727 -0500>,<Administrator>,<X>,<proc1d>,<TOPSPIN 2.1>,
      <abs ABSG = 1 
       data hash MD5: 32K
       8D 5A B0 54 7F A9 F7 C2 7F F8 E7 17 A6 81 D5 0C>)
(   5,<2012-12-01 18:03:38.854 -0500>,<Administrator>,<X>,<proc1d>,<TOPSPIN 2.1>,
      <abs ABSG = 2 
       data hash MD5: 32K
       A2 CB E7 29 BA 8F 94 80 AC 2E ED A6 3B 02 1F 1B>)
(   6,<2012-12-01 18:03:38.995 -0500>,<Administrator>,<X>,<proc1d>,<TOPSPIN 2.1>,
      <abs ABSG = 3 
       data hash MD5: 32K
       C5 0D 68 91 98 D8 82 FD 37 73 6B BF 27 26 36 EC>)
(   7,<2012-12-01 18:03:39.137 -0500>,<Administrator>,<X>,<proc1d>,<TOPSPIN 2.1>,
      <abs ABSG = 4 
       data hash MD5: 32K
       2B 01 AC 6B 6F 7B 31 0B C6 0B 2C FC E4 CF 4C 9C>)
(   8,<2012-12-01 18:03:39.278 -0500>,<Administrator>,<X>,<proc1d>,<TOPSPIN 2.1>,
      <abs ABSG = 5 
       data hash MD5: 32K
       B7 0A 37 98 D0 7C 77 13 2B C9 94 CB B4 19 C0 3C>)
$$ ##END=
$$ 
$$ $$ hash MD5
$$ $$ 34 C7 04 E0 37 96 1B C5 AE D7 94 99 9D CF 11 70
##$RELAX= 
##$RELAX= 
##$RELAX= 
##$RELAX= 
##$RELAX= 
##$RELAX= 
##$RELAX= 
$$ Bruker specific parameters
$$ --------------------------
##$DU= <E:\>
##$EXPNO= 10
$$ [...]
##$TP= (0..7)
150 150 150 150 150 150 150 150
##$TP07= 0
##$TPNAME0= <>
##$TPNAME1= <>
##$TPNAME2= <>
##$TPNAME3= <>
##$TPNAME4= <>
##$TPNAME5= <>
##$TPNAME6= <>
##$TPNAME7= <>
##$TPOAL= (0..7)
0.5 0.5 0.5 0.5 0.5 0.5 0.5 0.5
##$TPOFFS= (0..7)
0 0 0 0 0 0 0 0
##$TUNHIN= 0
##$TUNHOUT= 0
##$TUNXOUT= 0
##$USERA1= <user>
##$USERA2= <user>
##$USERA3= <user>
##$USERA4= <user>
##$USERA5= <user>
##$V9= 5
##$VALIST= <valist>
##$VCLIST= <CCCCCCCCCCCCCCC>
##$VD= 0
##$VDLIST= <DDDDDDDDDDDDDDD>
##$VPLIST= <PPPPPPPPPPPPPPP>
##$VTLIST= <TTTTTTTTTTTTTTT>
##$WBST= 1024
##$WBSW= 4
##$XGAIN= (0..3)
0 0 0 0
##$XL= 0
##$YL= 0
##$YMAX_a= 669714
##$YMIN_a= -568499
##$ZGOPTNS= <>
##$ZL1= 120
##$ZL2= 120
##$ZL3= 120
##$ZL4= 120
##$ABSF1= 14.98509
##$ABSF2= -5.573092
##$ABSG= 5
##$ABSL= 3
##$ALPHA= 0
##$AQORDER= 0
##$ASSFAC= 0
##$ASSFACI= 0
##$ASSFACX= 0
##$ASSWID= 0
##$AUNMP= <proc_prof1d_extract_pilot.lims>
##$AXLEFT= 0
##$AXNAME= <>
##$AXNUC= <1H>
##$AXRIGHT= 0
##$AXTYPE= 0
##$AXUNIT= <>
##$AZFE= 0.1
##$AZFW= 0.1
##$BCFW= 0
##$BC_mod= 0
##$BYTORDP= 0
##$COROFFS= 0
##$CY= 15
##$DATMOD= 1
##$DC= 0
##$DFILT= <>
##$DTYPP= 0
##$F1P= 0
##$F2P= 0
##$FCOR= 0.5
##$FTSIZE= 32768
##$FT_mod= 6
##$GAMMA= 0
##$GB= 0
##$INTBC= 1
##$INTSCL= 1
##$ISEN= 128
##$LB= 0
##$LEV0= 0
##$LPBIN= 0
##$MAXI= 10000
##$MC2= 0
##$MEAN= 0
##$ME_mod= 0
##$MI= 0
##$NCOEF= 0
##$NC_proc= -8
##$NLEV= 6
##$NOISF1= 0
##$NOISF2= 0
##$NSP= 0
##$NTH_PI= 0
##$NZP= 0
##$OFFSET= 14.98509
##$PC= 1
##$PHC0= 96.4325
##$PHC1= 0
##$PH_mod= 1
##$PKNL= yes
##$PPARMOD= 0
##$PPDIAG= 0
##$PPIPTYP= 0
##$PPMPNUM= 2147483647
##$PPRESOL= 1
##$PSCAL= 4
##$PSIGN= 0
##$PYNMP= <proc.py>
##$REVERSE= no
##$SF= 400.02
##$SI= 32768
##$SIGF1= 0
##$SIGF2= 0
##$SINO= 400
##$SIOLD= 32768
##$SPECTYP= <>
##$SREGLST= <1H.CDCl3>
##$SSB= 0
##$STSI= 32768
##$STSR= 0
##$SW_p= 8223.68421052631
##$SYMM= 0
##$S_DEV= 0
##$TDeff= 65536
##$TDoff= 0
##$TI= <>
##$TILT= no
##$TM1= 0
##$TM2= 0
##$TOPLEV= 0
##$USERP1= <user>
##$USERP2= <user>
##$USERP3= <user>
##$USERP4= <user>
##$USERP5= <user>
##$WDW= 1
##$XDIM= 32768
##$YMAX_p= 472843624
##$YMIN_p= -705510
##$CURPLOT= <Network HP LaserJet P1505>
##$CURPRIN= <$Network HP LaserJet P1505>
##$DFORMAT= <normdp>
##$LAYOUT= <+/1D_H.xwp>
##$LFORMAT= <normlp>
##$PFORMAT= <normpl>
##$SURQMSG= 1
$$ End of Bruker specific parameters
$$ ---------------------------------
##NTUPLES= NMR SPECTRUM
##VAR_NAME=  FREQUENCY,     SPECTRUM/REAL,   SPECTRUM/IMAG
##SYMBOL=    X,             R,               I
##VAR_TYPE=  INDEPENDENT,   DEPENDENT,       DEPENDENT
##VAR_FORM=  AFFN,          ASDF,            ASDF
##VAR_DIM=   32768,         32768,           32768
##UNITS=     HZ,            ARBITRARY UNITS, ARBITRARY UNITS
##FACTOR=    0.250966925370066, 1,           1
##FIRST=     8223.43324360094, -86847,       -111402
##LAST=      0,             -124502,         -3924
##MIN=       0,             -705510,         0
##MAX=       8223.43324360094, 472843624,    0
$$ Real data points
##PAGE= N=1
##DATA TABLE= (X++(R..R)), XYDATA
$$ [...]
19539b11718a6649C2624K57095F2389a07560j77985a1438B15215g155f56m39304
19528d39960J30456B6445J06484l6757k7100c43026d6612k2652c1583A19920b2160
19516a35145k4729C07223I3267b60840J01271A02770K86942A51204C8289K8559
19506F6848H917c27300f4340A79474K8530c29181B39424a61801b3659k82454H2324
19494c03097N9114M1164c7339m5808L2284E349b51462i2408M3748l94818g1688
19482a88223A15337a89036I4404B7120b86615c0580j47898A98783C0881a20825
19471b50379F33750C01528o4625A2531b36175M9637A75407b90980I5898b6817
19460F8064c01413J08959P5180d8474j5314l85106e6986A85251p7067c3212B17433
$$ plain form
19539 -211718 -16649 32624 289719 62389 -107560 -285545 -11438 215215 -7155 -656 -439960
19528 -439960 -309504 26445 132929 96172 69072 -343026 -46612 -69264 -31583 119920 -22160
19516 -135145 -159874 307223 93267 -260840 -159569 102770 389712 151204 38289 66848
19506 66848 8917 -327300 -64340 179474 208004 -329181 239424 -161801 -23659 -306113 82324
19494 -303097 -243983 -202819 -37339 -83147 -50863 5349 -251462 -92408 -48660 -443478 -71688
19482 -188223 115337 -189036 94404 27120 -286615 -30580 -178478 198783 30881 -120825
19471 -250379 633750 301528 236903 12531 -236175 -186538 175407 -290980 95898 -26817
19460 68064 -301413 -192454 -117274 -48474 -63788 -448894 -56986 185251 108184 -33212 217433
19448a87822B38921D4053a01925k81173D7082K19497P0062j11917a72535c7357
19437h7954l8817j1985H5073a4639n3135B8977a2848e679j90140Q4437A68845
19425a43657A08317a33954r9939i5025B34651i4225C063f8703m9741c4171H5806
19413b86734a31394p811r3405a03734A04554C5600P0878b03542Q5143a6505A8216
19401g5207j9152m3805C46685F6792c11802I2746a26542l30219a98208A18645
19390d12884d7400D08770j56843c51952j19409a50989q4114A8921J4232R5413
19380A28566O8926G7124a96868F2659L9100a25291j0903B8435A0933P320a67257
19368a41806B27039a41217j31920j17117g9181B15798n4727b21712l708j09488
$$ plain form
19448 -187822 238921 44053 -101925 -383098 47082 266579 336641 224724 -172535 -37357
19437 -87954 -126771 -138756 85073 -14639 -67774 28977 -12848 -5679 -195819 -111382 168845
19425 -143657 108317 -133954 -233893 -95025 234651 -94225 3063 -68703 -118444 -34171 85806
19413 -286734 -131394 -139205 -232610 -103734 104554 35600 106478 -203542 -118399 -16505 18216
19401 -75207 -94359 -138164 346685 66792 -311802 92746 -126542 -456761 -198208 118645
19390 -412884 -47400 408770 251927 -351952 -471361 -150989 -235103 18921 33153 128566
19380 128566 197492 77124 -196868 62659 101759 -125291 -136194 28435 10933 18253 -167257
19368 -141806 227039 -141217 -273137 -390254 -79181 215798 161071 -221712 -225420 -334908
19358c34908D2369K8350c3521C0020N0179h6552k85931a2484j18936m08897c5291
19346A40923b97219j68505K07957I0783a33195k9685J8549l43768g2844j52157
19336b25001A33919m9452i1096j63909C84002b63114H846e0110B6779J68787K40174
19325D35740d0096j39080I588b49727E075c27118J24013A8215b95598O6700a5751
19313E6086d074q602j50370f9300a8572p3517C529c69889a81203K7207A84984
19301a56245E0430a6721k58523q7454j0753B9202K31670b14703B3016Q3382b00360
19289b10428A25275a36278m43065f8834B1213c3290A86988b25723D1365b46716
19278A97478K16820D2611d89565b31844e0750G2327n621O1621a82537o419O6638
$$ plain form
19358 -334908 42369 70719 -33521 30020 80199 -86552 -372483 -12484 -131420 -540317 -35291
19346 140923 -297219 -465724 -257767 90783 -133195 -162880 -144331 -488099 -72844 -225001
19336 -225001 133919 84467 -91096 -255005 384002 -263114 8846 -50110 26779 195566 435740
19325 435740 -40096 -179176 9588 -249727 5075 -327118 -203105 18215 -295598 -228898 -15751
19313 56086 -4074 -12676 -163046 -69300 -18572 -92089 3529 -369889 -181203 -153996 184984
19301 -156245 50430 -16721 -275244 -362698 -373451 29202 260872 -214703 23016 106398 -200360
19289 -210428 125275 -136278 -579343 -68834 21213 -33290 186988 -225723 41365 -246716
19278 197478 414298 42611 -489565 -231844 -50750 72327 66706 128327 -182537 -188956 -122318
19267a22318J0135G8735K11581c68432i0523k25637F0496a14475m7235q368j45964
19256c16042I2054M8240a29189h760l43732I859N2701b875k79377J32624b4846
19244i2896A3228c97757a07315M1993C1803a97437A9663c81134A60624g3338k8349
19233a01687A27124a15035l1309A59726g0923j08574i348B04833A3103J32041
19223A45144M6712a10871I9358K03791c18149A73317e974B63570a96561P1219
19213a25342A69272d504B88507B4093d7974k322j07006J5966m9451k35748a17402
19201B9766c11395A75835A0918J52996a43424M9285C0181j799K1798b48097B14612
19189c03239C1918a55872C3321f8182G4435a57650a6244j52039D744P0270a39660
$$ plain form
19267 -122318 -112183 78735 290316 -368432 -90523 -316160 60496 -114475 -161710 -170078 -316042
19256 -316042 92054 140294 -129189 -8760 -352492 9859 62560 -2875 -282252 -149628 -24846
19244 -92896 13228 -397757 -107315 -65322 31803 -197437 19663 -381134 160624 -73338 -101687
19233 -101687 127124 -115035 -146344 159726 -70923 -179497 -9348 204833 13103 145144
19223 145144 191856 -110871 99358 303149 -318149 173317 -5974 263570 -196561 -125342
19213 -125342 169272 -4504 288507 24093 -47974 -50296 -157302 -141336 -190787 -426535 -117402
19201 29766 -311395 175835 10918 163914 -143424 -94139 30181 28382 50180 -248097 214612
19189 -303239 31918 -155872 33321 -68182 74435 -157650 -16244 -168283 4744 75014 -139660
19177A3764M977b08112M052K5978j93266J53095c7565j36668l8132L1035D8079
19165a10170d5292C5694i4100L6381j19879A66151f5774B04810g3638l01851h3133
19153B0288e1904p9790A13072B2730n958h3277k14038g1354j96476A2682b081
19141G2501e4663p9843c8599n4735p6267l93643a52559C8612a37282b058n3887
19130e5945B7039a45402o2927B29847a48615j13777f5726k6307d363j96921L0820
19119a70464A56513F5517g8018L6430a6209A55179C8463a44324j14768d7103D713
19107G3609d2475A49937a22171A53392M8036d3727E1772b5776E2956b58393i6596
19095H1516l4176Q7909n0138a15124g161A11898g9707K8225b0413k3257A91285
$$ plain form
19177 13764 18741 -208112 -204060 -178082 -371348 -218253 -37565 -174233 -212365 -181330 48079
19165 -110170 -45292 35694 -94100 -57719 -177598 166151 -65774 204810 -73638 -375489 -83133
19153 20288 -51904 -131694 113072 22730 16772 -83277 -297315 -71354 -267830 12682 -2081
19141 72501 -54663 -134506 -38599 -93334 -169601 -563244 -152559 38612 -137282 -2058 -55945
19130 -55945 27039 -145402 -208329 229847 -148615 -262392 -65726 -92033 -4363 -201284 -170464
19119 -170464 156513 65517 -78018 -41588 -16209 155179 38463 -144324 -259092 -47103 4713
19107 73609 -42475 149937 -122171 153392 201428 -43727 51772 -25776 52956 -258393 -96596
19095 81516 47340 135249 85111 -115124 -7161 111898 -79707 -51482 -20413 -43670 191285
19083d7573j05906k152g2939k19342G5809a14205F1991R6066a44392A36606b68418
19071E5999d5315F9527J9570a20558B82591b6634A87619b475k72628a36153q1360
19060b17513g4022B7331J5939J15010a40161C2043b31906K1438A7113d7924B70827
19048A4135N7279a13907j60921J2922G0854a00218j37881c2691r2399m7016q1592
19037b53698f2570r6395m8651j9202B8278a03283A45399N7544a71347d4285F1657
19025c07848e0469k35225f0883E3141N4252l5158K31621a37195A03519b85675
19014c00619a4567j63354M6522j24464f2354a7908m8718A37534J02518m6971a52266
19002c33665d2679H8953R3564B2421b16590R0120K4756M486l28159g9584A10197
$$ plain form
19083 -47573 -153479 -155631 -72939 -292281 75809 -114205 61991 158057 -144392 136606 -268418
19071 55999 -45315 69527 89097 -120558 282591 -26634 187619 -2475 -275103 -136153 -217513
19060 -217513 -74022 27331 43270 158280 -140161 32043 -231906 -210468 17113 -47924 270827
19048 14135 71414 -113907 -274828 -261906 70854 -100218 -238099 -32691 -125090 -172106 -253698
19037 -253698 -62570 -158965 -207616 -226818 28278 -103283 145399 202943 -171347 -44285 61657
19025 -307848 -50469 -285694 -60883 53141 107393 72235 303856 -137195 103519 -285675
19014 -300619 -14567 -177921 -131399 -255863 -62354 -17908 -66626 137534 240052 193081 -152266
19002 -333665 -42679 88953 182517 22421 -216590 -126470 -101714 -97228 -425387 -79584 110197
18990f8403l5697d0345j85538a02811c678B12687p3906b69095M6108Q6906j39944
18979b76025d0300m8370o1600c0433p2138J5542A04034b43058A75549C8024L1810
18968F9834b2985n6478l8492K4370B56596d3953j4486A61988J5809i4480F6580
18956h4131A62211k173k6906b93538A4561b88818a43049K1424j15558A38060d1071
18944B0235B742d2066A65385a04933H437J61519p8409B5732a44255F1526c780
18932g8212k78686A09669c06772B17234b23711B21199b74268a1137j13399j5680
18922a40216A91938e5242k9903B25280a24357E1207N7327l5510A9583a01704C83828
18910h0023l6187l4237A64435b27069J5121e9253j11645A63581b55372F2496k7722
$$ plain form
18990 -68403 -104100 -40345 -225883 -102811 -3678 212687 138781 -269095 -222987 -136081 -276025
18979 -276025 -40300 -88670 -150270 -30433 -102571 -87029 104034 -243058 175549 38024 69834
18968 69834 -22985 -79463 -117955 -93585 256596 -43953 -58439 161988 177797 -94480 66580
18956 -84131 162211 160038 133132 -293538 14561 -288818 -143049 -121625 -237183 138060 -41071
18944 20235 2742 -42066 165385 -104933 8437 169956 91547 25732 -144255 61526 -3780
18932 -78212 -356898 109669 -306772 217234 -223711 221199 -274268 -11137 -124536 -140216
18922 -140216 191938 -55242 -85145 225280 -124357 51207 108534 73024 19583 -101704 383828
18910 -80023 -116210 -150447 164435 -227069 -211948 -59253 -170898 163581 -255372 62496 34774
18899C4774h6022A6196e0104B39437n469E2644g3727C6536f3752n027B02855c5820
18886G3820c6251q5246j7990a2167m79011a61055A12909R0585a51518j398g1630
18874a06028b4846o5330A02587a92536P097k16055a1070A0998N3850B1656a39802
18862f2123B66601D4477m317b67278j1718h7904A6032a66914B94676B4487M50767
18851D75254B25140A00339J28055a7658o3002B6160b65347J00561A80135o3258
18841A16877h3122l20893d6774I1386k1728a41205A63152h9604o4517k80450F2795
18829b67474C67361b43509g9873a9275C78574G8907h5478F0784L7968a66188B49104
18817c9311k02622A71454b31750B81416b08057D1298e4538B02799C8891R9104
$$ plain form
18899 34774 -86022 16196 -50104 239437 233968 52644 -73727 36536 -63752 -68779 202855 -35820
18886 73820 -36251 -121497 -139487 -12167 -491178 -161055 112909 203494 -151518 -152916 -71630
18874 -106028 -24846 -90176 102587 -192536 -185439 -401494 -11070 10998 64848 21656 -139802
18862 -62123 266601 44477 40160 -267278 -278996 -87904 16032 -166914 294676 24487 475254
18851 475254 225140 100339 228394 -17658 -80660 26160 -265347 -164786 180135 116877
18841 116877 -83122 -404015 -46774 91386 69658 -141205 163152 -89604 -154121 -434571 62795
18829 -267474 367361 -243509 -79873 -19275 378574 78907 -85478 60784 98752 -166188 249104
18817 -39311 -241933 171454 -231750 281416 -208057 41298 -54538 202799 38891 137995
18807A37995P5402D2769J1316M1956Q4162B3882g0808j12371E3087c65498d2977
18795c40987D1436K8041N786k2769i3851k3339B8932c5668m9928p8454b1376A46785
18782H2669M8742a80981B3509a33305B04303b42482i4321M453L5443k27556a4603
18770a10767L5117J7600B4741a65994J3074j67296F2032J28553H5555a84139A9867
18758b08504C8382a64418p5887R9556G4102a18477M8677F4204Q9044O2324I692
18746A15133b56276g848k54495Q6141A46921k6744c4083q0067n0535B95460c5469
18734B48613a41111B6650a62332E4470c1772j75775A19900e0136F4905b62961
18723C54938c48738A17309e7904l42582a74855f9579k3356m7759j24297f392A9085
$$ plain form
18807 137995 213397 42769 54085 96041 180203 23882 -70808 -183179 53087 -365498 -42977
18795 -340987 41436 69477 75263 52494 -93851 -117190 28932 -35668 -85596 -164050 -21376 146785
18782 82669 131411 -180981 23509 -133305 204303 -242482 -94321 -89868 -54425 -281981 -14603
18770 -110767 -75650 -58050 24741 -165994 -152920 -320216 62032 190585 85555 -184139 19867
18758 -208504 38382 -164418 -240305 -140749 74102 -118477 -69800 64204 153248 215572 9692
18746 115133 -256276 -7848 -262343 -176202 146921 120177 -34083 -114150 -164685 295460 -35469
18734 248613 -141111 26650 -162332 54470 -31772 -207547 119900 -50136 64905 -262961
18723 354938 -348738 117309 -57904 -400486 -174855 -69579 -92935 -140694 -264991 -6392 19085
18711a40933q128E5081P8807b42956c2866Ff478A13762c4244j04045C0348M6190
18699G6538a29811N7164r448F6469b25819H0202c49331d6941o9339D6587j6220
18688C0367b03467b0972k00845R4211B03754b98897a38328A54435a62972A09950
18677a75287A82529g417k66959a35042r0280J06536k83588A93193b09531N7473
18667a52058M3443A16527a03821E3186c0224D8989c2427r2842j93645R0207g4213
18655a1575k14656L2367N7591o2510P8842N0834k6230k44514B16429b39096D6163
18643H1193b71073Q6010G7412B059d0326D2648M0394b18469B7811N7864c62341
18631c23096B44628a50043O7834n3420C07305E0997a63923J874C94656b32418
$$ plain form
18711 -140933 -149061 55081 133888 -242956 -32866 6 -6478 113762 -34244 -138289 30348 76538
18699 76538 -129811 -72647 -82095 66469 -225819 80202 -349331 -46941 -116280 46587 30367
18688 30367 -203467 -20972 -221817 -127606 203754 -298897 -138328 154435 -162972 109950
18677 -175287 182529 -7417 -274376 -135042 -225322 -118786 -402374 193193 -209531 -152058
18667 -152058 -108615 116527 -103821 53186 -30224 48989 -32427 -125269 -318914 -228707 -74213
18655 -11575 -226231 -193864 -136273 -198783 -119941 -69107 -95337 -339851 216429 -239096 46163
18643 81193 -271073 -185063 77412 2059 -40326 42648 83042 -218469 27811 85675 -362341
18631 -323096 244628 -150043 -82209 -135629 307305 50997 -163923 -162049 394656 -232418
18620c4506i703n1314J3409B9751J00533b68716A12770g094q1186A6048c14994
18608B15996A8074b17067A55464c06266i0921B00875a25096d0879k00802i8624
18597a73455r8893D28958h7664C70184I7757d4484G0390K09027m4487k934B6613
18585a10504A00151a92029e3378r8587B9565L1608J64071m4815B5266O425P209
18574C8900J5704J6309e166B59376j15727E5890g3179D3833E863j788b64459a20726
18561G0048e5174l57865e0089A13067a85984k61553G2077b17654a3402A25224
18550a25255j22818e0227F3907Q6554B1504c24802J34072d3715l1436D3457P735
18539E1192c43854a7636C36039Q3638e0455G2539g320j35217C676b15198h7903
$$ plain form
18620 -34506 -9703 -61017 -47608 29751 130284 -268716 112770 -7094 -88280 16048 -314994
18608 215996 18074 -217067 155464 -306266 -90921 200875 -125096 -40879 -241681 -98624
18597 -173455 -272348 428958 -87664 370184 97757 -44484 70390 279417 234930 231996 26613
18585 -110504 100151 -192029 -53378 -151965 29565 61173 225244 180429 25266 31691 38900
18574 38900 54604 70913 -5166 259376 143649 55890 -73179 43833 5863 4075 -264459 -120726
18561 70048 -55174 -413039 -50089 113067 -185984 -447537 72077 -217654 -13402 125224
18550 -125255 -248073 -50227 63907 150461 21504 -324802 -190730 -43715 -75151 43457 51192
18539 51192 -343854 -17636 336039 419677 -50455 72539 -7320 -142537 3676 -215198 -87903
18527c05568F5375f3627B11831f9229B75957d1462f382C28116c58261b5999j00446
18516a26445e7827A70023e011A3111c6466l24770k551A16119a7345j74962g9494
18504A93296a12533C5229a02955k32049J38403B01007B2094h6068b6937A28429
18493A09986b79653A84898B468d4605A17209f8645E5349b83872A38471E525c21053
18481a02830n2904I567J67795G0646g0083k6333B53076b34642e4708m7647H5475
18469A12375a24795p6548l35134b25814J409G8631a51622C55882i6207k72309
18459c68516a07259L9129j10385a1422j24940r51A9792c07221J37463k23814A18858
18447a52692P3550j88701A53067c8094n4382A51681a50721p1484e8391b3765q6243
$$ plain form
18527 -305568 65375 -63627 211831 -69229 275957 -41462 -6382 328116 -358261 -25999 -126445
18516 -126445 -57827 170023 -5011 13111 -36466 -361236 -363787 116119 -17345 -192307 -79494
18504 193296 -112533 35229 -102955 -335004 -196601 201007 22094 -86068 -26937 128429
18493 109986 -279653 184898 2468 -44605 117209 -68645 55349 -283872 138471 5525 -321053
18481 -102830 -155734 9567 177362 70646 -70083 -96416 253076 -234642 -54708 -102355 85475
18469 112375 -124795 -201343 -536477 -225814 -224405 78631 -151622 355882 -96207 -368516
18459 -368516 -107259 -68130 -178515 -11422 -136362 -137313 19792 -307221 -169758 -393572 118858
18447 -152692 -79142 -267843 153067 -38094 -92476 151681 -150721 -222205 -58391 -23765 -110008
18436a10008A37939b47265N5893Q3366N302A05212a83277B34689a87557A7582
18425b72156a27742C15053h8565B18366K03251f3195q9349A62936e3601C0434
18414B3517f8277k67834B9675J38465c5822A45625D3003i0896j40318C22256a52153
18402E2780B3228b70931L8377j80281H918d0064A51248Q5984a70334E9764a13753
18390a75572A98523a11950j4552m5244o5787J04788B1851c28072F4954J5780j9168
18379F1566b50441L0423k6767M7080J4971A4507a07715B79119E0375A7175L7099
18368E4274c05862E4833J84075A11013L7152a24459c797F8634K53996c5927j6667
18357e2594F6353g4539j23445b0644p2558b1826A36212k3239a75160A16778Q0344
$$ plain form
18436 -110008 137939 -247265 -191372 -108006 -102704 105212 -183277 234689 -187557 17582
18425 -272156 -127742 315053 -88565 218366 421617 -63195 -152544 162936 -53601 30434
18414 23517 -68277 -336111 29675 168140 -35822 145625 43003 -90896 -231214 322256 -152153
18402 52780 23228 -270931 -232554 -412835 8918 -40064 151248 237232 -170334 59764 -113753
18390 -175572 198523 -111950 -126502 -171746 -237533 -132745 21851 -328072 64954 80734 61566
18379 61566 -250441 -220018 -246785 -199705 -184734 14507 -107715 279119 50375 17175 54274
18368 54274 -305862 54833 238908 111013 148165 -124459 -3797 68634 322630 -35927 -52594
18357 -52594 66353 -74539 -197984 -20644 -93202 -21826 136212 112973 -175160 116778 197122
18346A97122K50323I1003a66463A81501f5550D5595f6277B12186a43617A38125
18335C8884a93762j39008J51310g6308A31147a95711M1677j40899a24741j32320
18325b57061m4592E7608i8590q8276A33492b02053k0570r2611J05717I3457a90172
18313c1463A4586R2537c21359i5181l15D8272A6075L3392a03985j31045A31969
18301a44443j11218F8118a0452k16247j53698a16717o5863D3391J41979j538J20475
18290C04307E507e619q3257j73375G186O7427B9039c239j10105B57697b27285
18278c4442r8068F1365J7491a75470A3348c4848k6742l74809J97745R6079k6005
18267a68580f5159k6969k5971l19683A27711E3860N4503k9469J20844k3411A2689
$$ plain form
18346 197122 447445 91003 -166463 181501 -65550 45595 -66277 212186 -143617 138125
18335 38884 -193762 -332770 -181460 -76308 131147 -195711 -154034 -294933 -124741 -257061
18325 -257061 -301653 57608 -98590 -186866 133492 -202053 -222623 -315234 -209517 93457 -190172
18313 -31463 14586 107123 -321359 -95181 -95496 48272 16075 49467 -103985 -235030 131969
18301 -144443 -255661 68118 -10452 -226699 -380397 -116717 -182580 43391 185370 183832 304307
18290 304307 5507 -5619 -88876 -262251 7186 74613 29039 -3239 -113344 257697 -227285
18278 -34442 -132510 61365 78856 -175470 13348 -34848 -61590 -436399 -238654 -142575 -168580
18267 -168580 -65159 -92128 -118099 -437782 127711 53860 108363 78894 199738 176327 12689
18255b44230j9865C9408c87822b1684A19528a70201E7534h2846o6543j0020K3532
18244a35877j31739D0138a98210J645n0182B00328h7795H3577p284J27375a68326
18232b3689k100r026j2822m1295j045K0124B85370A27518K19927D9172a84516
18220H9518K9787m6529b00357j08774F7566c1823j16789J7938a7347o0826q9903
18209a68076B45868a19810b6056k43477J04436C50312j17956a48940B15537r8151
18199A17386J1881K9885m6790J04886q2252J48304A08620a07451E1180c0524A4367
18187d9402O584A2916K33207c910m29641g2362C5492f1973j50379f8464C5369
18175f0726j42461k78557g6456B8548d06977E1131J69395J5165j4447r7289a82367
$$ plain form
18255 -244230 -264095 39408 -387822 -21684 119528 -170201 57534 -82846 -149389 -159409 -135877
18244 -135877 -267616 40138 -198210 -196565 -246747 200328 -87795 83577 76293 203668 -168326
18232 -23689 -25789 -34815 -47637 -88932 -89977 -69853 285370 127518 347445 49172 -184516
18220 89518 119305 72776 -200357 -309131 67566 -31823 -148612 -130674 -17347 -78173 -168076
18209 -168076 245868 -119810 -26056 -269533 -165097 350312 232356 -148940 215537 117386
18199 117386 129267 159152 112362 217248 134996 283300 108620 -107451 51180 -30524 14367
18187 -49402 -42818 12916 246123 -3910 -433551 -72362 35492 -61973 -212352 -68464 35369
18175 -60726 -203187 -481744 -76456 28548 -406977 51131 220526 235691 221244 123955 -182367
18163e34795a50352e73E4789a70540C28686A35885P068c38035A04068a59195N5795
18152a03400m5880C58486D4623e544B28954b80325B54860i5997q9802j20799A9479
18140f4915A91873a68088c5798r6261p4189A56567e7148p4402M9252a2316A70043
18128b13588A47187F7426B6408J0294a43853C21139q2701j00600a86209N7985
18118a28224E560J39371K2431a33140L0552A2542a88882J5551f5881H4485A3705
18106b88379d2618k5466k18826N3715o1831D8307a48246b7123j82835A05800f8196
18094E5593a66382g8199n884r6126j4081C35272F0291b26127O5570o2483i3817
18082G6795J698f6767A80297a26397m6610K8406F9348c44330j97858F7903b96066
$$ plain form
18163 -534795 -150352 -573 54789 -170540 328686 135885 142953 -338035 104068 -159195 -103400
18152 -103400 -149280 358486 44623 -5544 228954 -280325 254860 -95997 -185799 -306598 19479
18140 -64915 191873 -168088 -35798 -132059 -206248 156567 -57148 -131550 -82298 -12316 170043
18128 -213588 147187 67426 26408 36702 -143853 321139 238438 137838 -186209 -128224
18118 -128224 5560 144931 167362 -133140 -102588 12542 -188882 -173331 -65881 84485 13705
18106 -288379 -42618 -68084 -286910 -233195 -295026 48307 -148246 -27123 -209958 105800 -68196
18094 55593 -166382 -78199 -84083 -180209 -194290 335272 60291 -226127 -160557 -223040 -93817
18082 76795 78493 -66767 180297 -126397 -173007 -144601 69348 -344330 -542188 67903 -296066
18070b2780k28738l153l0277A00775a77306R037j8562D5507a74254e9974j01136
18059a61110j3935d3573K0548k1596j79828b0413r8466j75348i0286B7966a07526
18047b04630p013h8513a2239F9999c34534J54178c3743J398A54704q840o834d7266
18034a98475b851j02611d9433l5599B7661K66825c2270j79877O6683o3636A80293
18022b24810i4724A22805a96566A56544c03144R4909E19372a99665c598j28345
18012a31943m2135N2523C0308a12412d6267H7156h1495A01878a43976A18992E359
18000d6698B25803a97936c5973K681p2452D44407A3878a99376F1198d2025l79926
17989d21951d9644n1643d7765n4596F1579b85388A04692b86574a26579B80117
$$ plain form
18070 -22780 -251518 -254671 -284948 100775 -177306 -168269 -186831 45507 -174254 -59974 -161110
18059 -161110 -175045 -43573 -23025 -44621 -224449 -20413 -118879 -294227 -90286 27966 -107526
18047 -204630 -211643 -88513 -12239 69999 -334534 -180356 -33743 -32345 154704 145864 139030 -47266
18034 -198475 -2851 -105462 -49433 -85032 27661 294486 -32270 -212147 -145464 -209100 180293
18022 -224810 -94724 122805 -196566 156544 -303144 -208235 519372 -199665 -3598 -131943
18012 -131943 -174078 -121555 30308 -112412 -46267 87156 -81495 101878 -143976 118992 5359
18000 -46698 225803 -197936 -35973 -33292 -105744 444407 13878 -199376 61198 -42025 -421951
17989 -421951 -49644 -101287 -47765 -102361 61579 -285388 104692 -286574 -126579 280117
17978a2037B03413B6000f2612k81336F8364a07955H7213b32526O1978A29560a60394
17966c35001A43686c41144a66645M3124K0621I4428a49602f5425j75629F4802
17955B99686a20135A46741c13752a5592j83333P8770d4033E1128b97984F4340
17944f8282A46293a83467n854A66273F1886j1550h5872B08324r3368a2318A46751
17932D3355R0550l1564c3362j93711D88J90426o3800a13519F8839K6871a11163
17920c67548A61625f2385k6853E02179c728j55932p5756k44742B91547h9280B48095
17908d5164A04428j5662A8067i673j16313A28738c23024C2511c36151d5802l86660
17897d32462E1387f658k22138A42898R4433j15276N451a84918I858c32107L2701
$$ plain form
17978 -12037 203413 26000 -62612 -343948 68364 -107955 87213 -232526 -170548 129560 -160394
17966 -335001 143686 -341144 -166645 -123521 -102900 94428 -149602 -65425 -241054 64802
17955 299686 -120135 146741 -313752 -15592 -198925 -120155 -44033 51128 -297984 64340
17944 -68282 146293 -183467 -189321 166273 61886 50336 -85872 208324 114956 -12318 146751
17932 43355 133905 102341 -33362 -227073 488 190914 127114 -113519 68839 95710 -111163
17920 -367548 161625 -62385 -89238 502179 -3728 -159660 -235416 -480158 291547 -89280 248095
17908 -45164 104428 88766 18067 -9673 -125986 128738 -323024 32511 -336151 -45802 -432462
17897 -432462 51387 -6658 -228796 142898 237331 122055 127506 -184918 9858 -332107 -299406
17886b99406P7357A02995J9961g7412D17265A77405R5950E8289f9300J3004I2883
17874D9345b8480A19320f5569j3546k1034A63128a09401B80935a83907A67482
17863A27487b18674I5336a4923b275k41315A22810a6955h101j30292A53453b25329
17851b2987A30177g3912j19150j00407g4579l1534I1147K3778K49361I3658d4213
17839i8769M6965l6207A24134b48988a12299P167A48690a3189o1925A82474L3044
17828B15518d00095F4453A9257Q548L9448L5889b42998B59326b27557M6244l6350
17817b17663f6560M091G0179a55690n8837A31680G376a9404r7283a9774p5213
17806i4987G9762e2050n3188B4873Q2160g7876F3942h7201k24941e5659B6718
$$ plain form
17886 -299406 -222049 102995 122956 -77412 417265 177405 273355 58289 -69300 -56296 92883
17874 49345 -28480 119320 -65569 -79115 -100149 163128 -109401 280935 -183907 167482
17863 127487 -218674 95336 -14923 -2275 -243590 122810 -16955 -8101 -138393 153453 -225329
17851 -22987 130177 -73912 -193062 -293469 -74579 -106113 91147 114925 364286 93658 -44213
17839 -98769 -51804 -88011 124134 -248988 -112299 -105132 148690 -13189 -75114 182474 215518
17828 215518 -400095 64453 19257 27805 67253 103142 -242998 259326 -227557 -181313 -217663
17817 -217663 -66560 -62469 70179 -155690 -214527 131680 7376 -19404 -116687 -19774 -94987
17806 -94987 79762 -52050 -105238 24873 107033 -77876 63942 -87201 -312142 -55659 26718
17794B5543M8459b583p9190l28751A25341a59717G4928b4718C21838h686G6587
17782e4605F0481A0972a11308k11414a11965M7138k79864c2861r2580e269r8567
17771a03836E82926a88914D28126A64698b0743B27068F6052O9920A3417K7462
17761D0879J5104L35333a08232e1771B24225n9316A7199k080K60460F0119f4863
17749d721A30454i5966c6768A52493b0376j6691A14279J39704b09085B20278H9570
17737B2492M14256b423o0222r5977A88510a60217B43460H3340f4394E8124a14693
17725I6818L0327a84556o5650C5283f149E2502P6976O0961E8159h5508n3650b8441
17712F2509J34525r5254M1141f4525H0006b00264B28250E3371Q620a92810l46289
$$ plain form
17794 25543 74002 -2583 -81773 -410524 125341 -159717 74928 -24718 321838 -8686 76587
17782 -54605 60481 10972 -111308 -322722 -111965 -64827 -344691 -32861 -125441 -5269 -103836
17771 -103836 582926 -188914 428126 164698 -20743 227068 66052 135972 13417 40879
17761 40879 55983 391316 -108232 -51771 224225 164909 17199 15119 275579 60119 -64863
17749 -4721 130454 -95966 -36768 152493 -20376 -37067 114279 253983 -209085 220278 89570
17737 22492 436748 -2423 -62645 -158622 188510 -160217 243460 83340 -64394 58124 -114693
17725 96818 127145 -184556 -250206 35283 -6149 52502 129478 190439 58159 -85508 -139158 -28441
17712 62509 197034 101780 142921 -64525 80006 -200264 228250 53371 61991 -192810 -539099
17701e39099C47285H1578K7249Q2689K24521A75562b02426d3699a3605o8003A71956
17689C2535a20701B20278a47070M13A19144B0732K53012g9136l83363B439b05434
17677c76823h0949A28372b59221A53779J10899c55039a64156D19724E266j25a63890
17665B89523B8890b228E9724j1412M1604g3200B22520A4615J03075J33040M9784
17654C00514h0911B27661i1629A58054l7680b3459A67382J20187f7814j44893
17644b12707B05860c62326a21705D7316c8665A29203c66813B49682a03559M2638
17634f0921B27867A5768a47987D1917b30069A04078C1074R5766a5827k11613L9496
17623a87944i552j54475n7239g726G5346c44245A94161l6987F0190d8494J9130
$$ plain form
17701 -539099 347285 81578 108827 191516 416037 175562 -202426 -43699 -13605 -81608 171956
17689 32535 -120701 220278 -147070 -146657 119144 20732 273744 -79136 -462499 2439 -205434
17677 -376823 -80949 128372 -259221 153779 264678 -355039 -164156 419724 5266 5141 -163890
17665 289523 28890 -2228 59724 48312 89916 -73200 222520 14615 117690 250730 300514
17654 300514 -80911 227661 -91629 158054 120374 -23459 167382 287569 -67814 -212707
17644 -212707 205860 -362326 -121705 47316 -38665 129203 -366813 249682 -103559 -60921
17634 -60921 227867 15768 -147987 41917 -230069 104078 31074 126840 -15827 -227440 -187944
17623 -187944 -9552 -164027 -221266 -7726 75346 -344245 194161 157174 60190 -48494 -29364
17612b9364m4543A74281i8276m1102J8029A19113C8563a83238O7448A69151e1486
17600A54232d08210g0402I5881J43425A14526L1875o8369K72410C3048J42669
17590A75717a46032M4216j08896c4751r736A60629J4524f0182D2074K53405a01744
17578b28540C06600D6486i7158j77567B00941a56612F6670h8699j95990F11003
17567C36019j20699b70798f3248D39694g0457B51a93624A511J38647M2840k3197
17556A59801a66733A8362M1826L45461d5360l8047b0747l6363A33649P8769k8333
17545A84085J79366A4225a11258B71988l2225p4996a76352d7446j66719C2145
17534e4567B31223l3428G1501c2918i204o3447F3812K31693q1578l1659E7173
$$ plain form
17612 -29364 -73907 174281 -98276 -139378 -121349 119113 38563 -183238 -115790 169151 -51486
17600 154232 -408210 -70402 95881 239306 114526 146401 78032 350442 33048 175717
17590 175717 -146032 -101816 -210712 -34751 -44487 160629 175153 -60182 42074 295479 -101744
17578 -228540 306600 46486 -97158 -274725 200941 -156612 66670 -88699 -284689 611003
17567 336019 215320 -270798 -63248 439694 -70457 251 -193624 1511 140158 182998 159801
17556 159801 -166733 18362 60188 405649 -45360 -83407 -20747 -57110 133649 212418 184085
17545 184085 363451 14225 -111258 271988 239763 164767 -176352 -47446 -214165 32145
17534 -54567 231223 197795 71501 -32918 -9204 -72651 63812 295505 213927 182268 57173
17522a78143B91412f4767I0031l4818L22170p4484b04600k8541B27617m2963h6469
17510B87806q1958n4427B1341J35613a35117B72559G5981J7916Q3856A4151Q9050
17499A03201K89218A62910F1526J17911L1790b75293E691K88478d9991k1693I0968
17487A73864q3492Q9637A6076R2388K3575g4153j27721H086J27446h8038A6073
17475A29089K20286j63593L0790A00798M17574B38531b9470G6123a43292a9272
17464a77345C13274d4042H2378a37950C7711J80386n530a22810j746A52862A566
17452A5173J01804k9651J01681K88069j02716K33752O9219A30488J45948g7630
17441B49249D7381K15904j0934N7091J11325H9366J9893J62431j14267J88673
$$ plain form
17522 -178143 291412 -64767 90031 55213 377383 302899 -204600 -233141 227617 184654 -86469
17510 287806 205848 151421 21341 156954 -135117 272559 75981 93897 177753 14151 103201
17499 103201 392419 162910 61526 179437 211227 -275293 5691 294169 -49991 -71684 90968
17487 173864 90372 180009 16076 108464 132039 -74153 -201874 8086 135532 -88038 16073
17475 129089 349375 185782 216572 100798 518372 238531 -29470 76123 -143292 -19272
17464 -177345 313274 -44042 82378 -137950 37711 218097 212567 -122810 -124556 152862 1566
17452 15173 116977 87326 189007 477076 374360 608112 677331 130488 276436 -77630
17441 249249 47381 263285 252351 309442 420767 89366 109259 271690 157423 346096
17431C46096r1255a25340A74066K37291A26967J55285E7116g4430A29066b4015
17420D93455I4798B1091J64179K59304j85437n7292g2531A99085k5301J788R0599
17409B66171J33967D9206L54875D7046g0556l653E27803A43440F8934J06743B4168
17397C51783J17295p4826A82914L2129E4779Q796J4868J79029l8710J47039A00595
17385B88658J12427j39919c83692C26362L1814H3299k2631Q333G524N7829h0670
17373E41033B21220r2167K83722j6210q888a8132e381C62827o3339j36903p64
17362A61821C6046L7407J40362Q7364i7327B41398p0228a96732g4164A07949J06265
17351B14214m2696J14270I5767N5657a9757D99111a17253C43248m7452C4052O5642
$$ plain form
17431 346096 254841 -125340 174066 411357 126967 282252 57116 -74430 129066 -24015
17420 493455 94798 21091 185270 444574 259137 201845 -72531 199085 173784 175572 266171
17409 266171 400138 49206 404081 47046 -70556 -74209 527803 143440 68934 175677 24168
17397 351783 469078 394252 182914 215043 54779 63575 78443 257472 218762 365801 100595
17385 288658 401085 261166 -383692 326362 358176 83299 60668 69001 7524 65353 -80670
17373 541033 221220 129053 412775 396565 387677 -18132 -5381 362827 299488 162585 161821
17362 161821 36046 73453 213815 301179 -97327 241398 171170 -196732 -74164 107949 214214
17351 214214 171518 285788 95767 151424 -19757 499111 -117253 343248 295796 34052 99694
17340I9694Q6866n296m5647J9756e4222o621L71f921B66727j09461d4670C73803
17327I9912k4374M1803J03982J05683D2693e0359A19159J86582C4318K43266A20753
17315B92188j41378J51104E7831J58401e7636D34391m4769O9520A49012n1358
17305I7654c1365o6292B79361q6244d866A92273i1582c0314E5840J37539C8720
17293B9970L39038e5106B78407K15036b10005D22235A52093P3555i1694B28610
17282e9592n5386A255J468L13954q2664F1497J72048L0030K29429I6811L1736
17271A28547e8633G2112f362E07933k34415B4878L47322A33368l5440Q4165J97303
17260C79396A27457K3090b0603k14520A55039a67661O3072C70292j44219k9072
$$ plain form
17340 99694 186560 181264 135617 155373 -54222 -60843 -60472 -6921 266727 157266 -44670 373803
17327 99912 75538 117341 221323 327006 42693 -50359 119159 305741 34318 277584 120753
17315 292188 150810 301914 57831 216232 -57636 434391 389622 459142 149012 97654
17305 97654 -31365 -97657 279361 193117 -4866 192273 -91582 -30314 55840 193379 38720
17293 29970 369008 -55106 278407 493443 -210005 422235 152093 225648 -91694 228610
17282 -59592 -114978 1255 2723 316677 234013 61497 233545 263575 493004 96811 128547
17271 128547 -58633 72112 -6362 507933 273518 24878 372200 133368 97928 182093 379396
17260 379396 127457 150547 -20603 -235123 155039 -167661 -104589 370292 226073 197001
17250A97001D5426J08891l8421c0337o8575b2510B03073J09269j49067n1334J98514
17239C10455E9546O2530q94n6992Q3071M12186k75095q8742K1406j07286l7260
17228G2470b8975B54125L3928m3736A22152m9758M07793E7786G763J65279f106
17216C78539J76532A68284N2726j7422K2394j00102K47476K0722A50963c3678
17205B90394C1608M99605j38156D3085K43582K5132j01798K46107k15132J54913
17195C95889b11734C84100L96021H4469K23345J62908j81535J45927A03638K07774
17185C11412M1182K31202A95872J54959J17476B15011J18672J86914k06754j19694
17175A94149K9474K69428j05699r0307p3922L65386B54781J48691o4472A69064
$$ plain form
17250 197001 45426 154317 115896 -30337 -98912 -22510 203073 312342 163275 111941 310455
17239 310455 59546 122076 121182 64190 147261 559447 284352 195610 217016 109730 72470
17228 72470 -28975 254125 288053 244317 122152 72394 480187 57786 7763 173042 -6106
17216 378539 555071 168284 221010 203588 225982 125880 373356 394078 150963 -33678
17205 290394 31608 531213 393057 43085 286667 311799 210001 456108 240976 395889
17195 395889 -211734 384100 780121 84469 307814 470722 289187 435114 103638 311412
17185 311412 352594 583796 195872 350831 468307 215011 333683 520597 313843 194149
17175 194149 223623 493051 387352 297045 223123 588509 254781 403472 339000 169064
17164D70851k11940j26275J85578N6197Q5626H2935J75785k4888J05502Q9542
17154D28876q4888j56495h2097D29011j63424K26052M0724B62421J56613G3471
17143C75514r8701J5153q6321L48338M0914j75672j55334p2205p4925m5944M5403
17132A16220M74232j57883j16669K04107A20838K32561M5429A38340J92395P1694
17122D02429q7055N6159N8645J30644B38146J11492M97414B75576p242o4647K17558
17111D21245m627n5564R3947J89218j31910A13340L45849k20711R3085L11364
17101F42927A47919L49177J57488j5282B89217K6243O0443q3885j42552l2600
17091A16866L33901p7418j04109L53068k56929m6750K00802j38665P8384L70306
$$ plain form
17164 470851 258911 132636 318214 374411 460037 82935 258720 233832 339334 428876
17154 428876 343988 187493 -82097 429011 265587 491639 532363 262421 419034 73471
17143 375514 276813 291966 205645 553983 594897 419225 263891 191686 116761 70817 116220
17132 116220 590452 432569 315900 520007 120838 353399 398828 138340 330735 402429
17122 402429 315374 371533 430178 560822 238146 349638 847052 275576 268334 203687 421245
17111 421245 416618 361054 455001 644219 512309 113340 459189 238478 331563 642927
17101 642927 147919 497096 654584 639302 289217 315460 375903 292018 149466 116866
17091 116866 450767 373349 269240 622308 365379 318629 519431 380766 459150 829456
17081H29456M7220l21711k12039O1818j53770M71009K3294C08422L34093j38785
17071E03730J18723k61053L18758j95036A43372K17824A23876L95856A36057M85260
17061F21317J8440j41493J94239j44655J52060J81771k20142k24467K40143j75301
17051E01912O5034B36363M72586j36368J20722J41971l67939J52263k35911K27338
17041F11025K36779j15293l28750K37336j37156J97430n4188J69820l15514k28527
17031B72962L15233B53206N0425K07248n8999j47656L39190L38112k7176C01187
17020H18856Q8614l06374j49120J39099M57309o6166l19770m334M3565M1812j67550
17009E75941M6000K75534j2194l83808M34265k72132J77051J24832j21514m09941
$$ plain form
17081 829456 876676 554965 342926 404744 250974 721983 745277 308422 642515 503730
17071 503730 622453 361400 680158 485122 143372 361196 123876 519732 136057 621317
17061 621317 639757 498264 692503 547848 699908 881679 661537 437070 677213 501912
17051 501912 566946 236363 708949 572581 693303 835274 467335 619598 383687 611025
17041 611025 847804 732511 403761 641097 503941 701371 647183 817003 501489 272962
17031 272962 588195 253206 303631 510879 451880 304224 643414 981526 954350 301187
17020 818856 907470 601096 451976 591075 1048384 982218 662448 658114 701679 743491 575941
17009 575941 621941 897475 885281 501473 935738 663606 840657 965489 843975 434034
16999D34034N21715k85158K45989K18761k56650j95006M17822D54413J99891J00189
16989G54493N4141J00445J56878k97133j3977l09418M84402j54163K2918j79028
16979F19558K25720J09495K28555l97282K73983L68150o03592L19122l28244N08532
16969A323997n3829l08053K55257l85388J36086o5121o156K87620j71738q6763
16959I25912M18929n43793K28406k66011L28425J06326K18047j51498l6628l5579
16949A192536J7867k19694j09756L62032o2359j35564K84987N1818p0870j28302
16939A182695j18699J98371J78102M5686L0892J45012l65617J52193N3231l08812
16929A193054R4401K85621r8296J09707k93128M31947m61181P967N7970K21878
$$ plain form
16999 434034 955749 670591 916580 1135341 878691 683685 1101507 454413 654304 754493
16989 754493 808634 909079 1065957 768824 754847 445429 929831 775668 798586 619558
16979 619558 845278 954773 1183328 786046 1060029 1428179 824587 1143709 815465 1323997
16969 1323997 1270168 962115 1217372 831984 968070 902949 896793 1184413 1012675 925912
16959 925912 1344841 801048 1029454 763443 1091868 1198194 1416241 1264743 1228115 1192536
16949 1192536 1210403 990709 880953 1242985 1180626 1045062 1330049 1381867 1310997 1182695
16939 1182695 1063996 1262367 1440469 1486155 1517047 1662059 1296442 1448635 1501866 1193054
16929 1193054 1287455 1573076 1474780 1584487 1291359 1723306 1262125 1270092 1328062 1549940
16919A549940j73009K22471o8421K50762J24052l28534J22181O2038j2529k20012
16909A528939M65270j37211m4159j19119J44590O4654N9421k10400p8087K79484
16899A953382O3016Q9117k6787m8151J96151k03428K33831j20658l13859K22354
16889B044968M18450k64090j75045R1974Q9447K3979r4169K76454Q466k77720
16879B142714M46049j34181N3675l331k192K94333k53048j42673K29699K86760
16869B917805q0641k41661J59867L26890j02348K39033J0378k59320L04467j96667
16859C077803R3856L20170k61175p7151K50189j64205J0237J41693M14386J67105
16849C972908p43460M94849K542N76545o01833N69953l79077K50317m5640K94296
$$ plain form
16919 1549940 1376931 1599402 1530981 1781743 1905795 1577261 1699442 1761480 1748951 1528939
16909 1528939 1994209 1856998 1812839 1693720 1838310 1902964 1962385 1751985 1673898 1953382
16899 1953382 2016398 2105515 2078728 2030577 2226728 2023300 2257131 2136473 1822614 2044968
16889 2044968 2463418 2199328 2024283 2116257 2205704 2229683 2135514 2411968 2420434 2142714
16879 2142714 2588763 2454582 2508257 2504926 2502734 2797067 2544019 2401346 2631045 2917805
16869 2917805 2837164 2595503 2755370 3082260 2979912 3218945 3229323 2970003 3274470 3077803
16859 3077803 3171659 3491829 3230654 3153503 3403692 3239487 3249724 3391417 3805803 3972908
16849 3972908 3229448 3724297 3726839 4303384 3701551 4271504 3892427 4142744 4097104 4391400
16839D391400j57649o2016L03211J63977J21220r206l42368P11839l12572K81663
16829E089499J53638R2381k04007l88m1253K20592k5640K24674M82133j39743
16819E851886K28931o3130K57545J12030K03993J60003J5503O1390J33658L88244
16809G350053J19292N0293M30474M6898J17233m09087O32799L53930J31541M58148
16799I281574o0229M95263K66803L75714j45458M74905p2915O56367k78910O04328
16789A1597442L17509K99831K63068M84429L90548L2962O12915L27339N89282
16780A4915325N72191J70220Q77614K58933N86518Q34744L34972N09979R67316
16771B0027812M25832R34928P08985P7455J156855P15027J022824R16750J086760
$$ plain form
16839 4391400 4233751 4171735 4474946 4638923 4760143 4750937 4408569 5120408 4807836 5089499
16829 5089499 5243137 5335518 5131511 5131123 5089870 5310462 5284822 5509496 5991629 5851886
16819 5851886 6080817 6017687 6275232 6387262 6591255 6751258 6766761 6828151 6961809 7350053
16809 7350053 7469345 7519638 7950112 7997010 8114243 7705156 8337955 8691885 8823426 9281574
16799 9281574 9221345 9716608 9983411 10359125 10213667 10688572 10615657 11272024 10993114 11597442
16789 11597442 11914951 12214782 12477850 12962279 13352827 13385789 13998704 14326043 14915325
16780 14915325 15487516 15657736 16535350 16794283 17380801 18215545 18550517 19060496 20027812
16771 20027812 20453644 21388572 22097557 22175012 23331867 24046894 25069718 25986468 27073228
16762B7073228O88048J090057J327911J159799J238733R65585J904532J465969
16754C6913862J270520J962666J832545J721634K201760J634595K540109K825381
16746E2903072K406178K765494K842994L121947L316953L846311L316831M180013
16738G8699793L973127M120001M668425M846227N310793N071748N564100N818148
16730A18072362N727723O252362N797852O064527N755489N485854N759088M413354
16722A63328611M670867L793144K723381K361852J021343O70663o20936j187084
16714A76761841k496618l225792l874176m540197n221744n230885n713832o036785
16706A40421812o139481o146561o091119n481326n955188n787630n318877n097206
$$ plain form
16762 27073228 27761276 28851333 30179244 31339043 32577776 33543361 35447893 36913862
16754 36913862 38184382 40147048 41979593 43701227 45902987 47537582 50077691 52903072
16746 52903072 55309250 58074744 60917738 64039685 67356638 71202949 74519780 78699793
16738 78699793 82672920 86792921 91461346 96307573 101618366 106690114 112254214 118072362
16730 118072362 123800085 130052447 135850299 141914826 147670315 153156169 158915257 163328611
16722 163328611 167999478 171792622 174516003 176877855 177899198 178569861 177948925 176761841
16714 176761841 174265223 171039431 167165255 162625058 157403314 152172429 146458597 140421812
16706 140421812 134282331 128135770 122044651 116563325 110608137 104820507 99501630 94404424
16698I4404424m777451m600034m553263l934500l729933l985345k839307l701732
16690F2282859l081110k831569k436895k789830k330420k362307k272341j861998
16682D2316389j807985j808377j807654r97619j715669j516081j210539j266662
16674C0185803j027280j078260j459575j139648p19388n91730j098191o07438
16666B2464293r70118p56929k76911j172571l56977o13105n63495o09514p34065
16657A6410608j15713m93923o75388l93278k07204o18855n29969l75805k03787
16648A2796686p2450p12623n13641K2268l77954l99865l21798j69036l31304N1801
16638I972084k49630N275n95863l43m30271K827o16694L39689o76572K21610l67375
$$ plain form
16698 94404424 89626973 85026939 80473676 76539176 72809243 68823898 65984591 62282859
16690 62282859 59201749 56370180 53933285 51143455 48813035 46450728 44178387 42316389
16682 42316389 40508404 38700027 36892373 35894754 34179085 32663004 31452465 30185803
16674 30185803 29158523 28080263 26620688 25481040 24761652 24169922 23071731 22464293
16666 22464293 21494175 20737246 20460335 19287764 18930787 18317682 17754187 17144673 16410608
16657 16410608 16294895 15800972 15125584 14732306 14525102 13906247 13376278 13000473 12796686
16648 12796686 12724236 12011613 11497972 11520240 11142286 10742421 10420623 10251587 9920283 9972084
16638 9972084 9722454 9727729 9131866 9131523 8701252 8704079 8087385 8427074 7750502 7972112 7604737
16627G604737q7524l00828M1689k12013m57848K71577j29309k33691O3786l88045
16617F172531m95928K61232j60764K21372m25816J69934l90713j80619Q298J78688
16607E358215n05047K06153j87514m36313M26571n3343l95968k8387k0961L8849
16597D402255l38209J10051o78124M23276P1753m0710k13646J12551l9751n3443
16587C756003n4581k61202j81063K51276k96722O0283p6472q1250N9819n60541
16577B615550L85120k64431K97568j6852j09786j51902J02320R4449j28206l45876
16567B477954L57823l03996K00221j31223j52823j94982K85125l62782L92140
16558B567457k07813l33315K29602j26541P3390J30323m65762j20585M23627M39
$$ plain form
16627 7604737 7517213 7216385 7258074 7046061 6588213 6859790 6730481 6496790 6560576 6172531
16617 6172531 5676603 5937835 5777071 5998443 5572627 5742561 5351848 5171229 5179527 5358215
16607 5358215 4853168 5059321 4871807 4435494 4862065 4808722 4412754 4384367 4363406 4402255
16597 4402255 4064046 4174097 3495973 3919249 3991002 3950292 3736646 3849197 3809446 3756003
16587 3756003 3701422 3440220 3259157 3510433 3213711 3273994 3197522 3116272 3176091 2615550
16577 2615550 3000670 2736239 3033807 3016955 2907169 2755267 2857587 2952036 2823830 2477954
16567 2477954 2835777 2531781 2732002 2600779 2447956 2252974 2538099 2175317 2567457
16558 2567457 2359644 2026329 2255931 2129390 2202780 2333103 1867341 1746756 2170383 2170822
16548B170822J98743m43183J3991J97781l83531k12834K66366o5425j40597L59596
16538A961729n42858J55429L27716j3400L8379k29504k54426J66614k8015J84094
16528A765758j54951j4577J25994k63731j03903j78492K76570k75133M68353j45086
16518A500802k10152J85747q5071j54399N2143J63779k06984J05960l25809J78006
16508A204022J98456m4698j37093L69100o33595r4432N3697O38642n52632L65704
16498A367171j20211q7669j89501J50873K27360Q6869n14623K35837r4654J68967
16488A230419p5015m0201n3435j8371Q8858J0273j24939j74103N68314l33204
16478A078596k03632K24966j19997j09801O5877m8320J20228k21500J32979j3378
$$ plain form
16548 2170822 2369565 1926382 1940373 2138154 1754623 1541789 1808155 1742730 1602133 1961729
16538 1961729 1418871 1574300 1902016 1888616 1926995 1697491 1443065 1609679 1581664 1765758
16528 1765758 1610807 1596230 1722224 1458493 1354590 1176098 1452668 1177535 1645888 1500802
16518 1500802 1290650 1476397 1391326 1236927 1289070 1452849 1245865 1351825 1026016 1204022
16508 1204022 1402478 1357780 1220687 1589787 956192 861760 915457 1554099 1001467 1367171
16498 1367171 1246960 1159291 969790 1120663 1348023 1434892 920269 1156106 1061452 1230419
16488 1230419 1155404 1115203 1061768 1043397 1132255 1142528 1017589 843486 1411800 1078596
16478 1078596 874964 1099930 979933 870132 936009 887689 1007917 786417 919396 906018
16468I06018l45711N59911k99668R4369k28294M32336l03598K11049j28641J52040
16458A049811J13518j84660J52306k89418K61830n06124L58196l60264j17425
16449D77770J57371K51946L812m10350J72671K31377j59033j69501R7574l0894
16439F22743k35543M48554k9937R5713l0624k69072P7250p6402K63864k88504
16429E78042K34704K07992C33005K36391M27653j70778K41682m06180k70403Q1136
16419D72506P2278j16425M5493J10192A99987O45365j23845o6283l13618J7888
16409C59494L77165K56882m82294J62591k88173L46212l00104M0631J91847B69095
16398F78646p5480q1882J48330k81909J03279J91430k3711k52867J85804p4846
$$ plain form
16468 906018 560307 1120218 820550 914919 686625 1118961 815363 1026412 897771 1049811
16458 1049811 1163329 978669 1130975 841557 1103387 597263 955459 595195 477770
16449 477770 635141 887087 890899 480549 653220 884597 725564 556063 653637 622743
16439 622743 387200 835754 805817 901530 870906 601834 679084 602682 866546 578042
16429 578042 812746 1020738 333005 569396 997049 826271 1067953 661773 391370 472506
16419 472506 544784 428359 473852 584044 199987 845352 721507 655224 341606 359494
16409 359494 736659 993541 511247 673838 385665 731877 431773 472404 664251 269095
16398 678646 603166 521284 669614 387705 490984 682414 658703 405836 591640 516794
16388E16794n2952K2211j89425J02024J45191K79243B20704L58405L03016m34349
16378D47776J37672R9009A93417J61182K02825P7177j28998j1822J2576O8050
16368E74407A4213L78237k8488p7135K34129B10538K03354j72098R4838J80697
16358E17329B45146q33K8660K73103r8842a0300G58776B41751J41751A20282M19106
16347E39388H2517M12609E9092J19689J97099r9647j7955R0127f115B96266j31912
16336A64354M67127B19221K2489J95613j27146j347B0348M42027k30447O9564
16326C01492K66J49969K8747A01475e3898B89623J06391A75024m1395K25719L7917
16315C97265H3801M01848j35532l0178j07370I148J06827K24287p7224o2771J04552
$$ plain form
16388 516794 463842 486053 296628 398652 543843 823086 220704 579109 882125 447776
16378 447776 585448 684457 193417 354599 557424 634601 505603 493781 506357 574407
16368 574407 14213 392450 363962 286827 520956 210538 413892 241794 336632 517329
16358 517329 245146 244313 272973 546076 447234 -10300 758776 241751 383502 120282 539388
16347 539388 82517 495126 59092 178781 375880 276233 258278 348405 -6115 296266 164354
16336 164354 631481 219221 241710 437323 310177 308830 20348 462375 231928 301492
16326 301492 301758 451727 480474 101475 -53898 289623 396014 175024 133629 359348 397265
16315 397265 83801 485649 350117 319939 212569 9148 115975 340262 263038 200267 304819
16304C04819K5824E7896K87499j68496A4916C791e5132C50202j56226J66203O631
16293C66810q6805q6846J79754B8631J36149J42969J25225A67369J34068h4005
16282A30465R1573q5403J7965O8968P4082K85020a53333C68066j61450K6103J75720
16271D08439a98476C33632j65146K45750j41748q3232b41944B11346J62607r2340
16261B81613a0826B39096O0737B8729K73395M9002j15192N3901a24479B60670
16250D20296A32696J23498J38474j6619i0115D69710A53430J64334D9750f7332
16239D12237j94931D5895d4403C19952C2287P9070R2783D8160P267A1432M95007
16228E06439k51391J42065b26958B47298r1774F8374K09344q5770k409k9126M9428
$$ plain form
16304 304819 330643 57896 345395 176899 14916 3791 -55132 350202 193976 360179 366810
16293 366810 280005 193159 372913 28631 164780 307749 432974 167369 301437 -84005
16282 130465 222038 136635 154600 223568 297650 582670 -153333 368066 206616 232719 408439
16271 408439 -198476 333632 168486 414236 272488 189256 -241944 211346 373953 281613
16261 281613 -10826 239096 299833 28729 302124 351126 235934 289835 -124479 260670
16250 420296 132696 256194 394668 378049 -90115 469710 153430 317764 49750 -67332
16239 412237 217306 45895 -44403 319952 32287 111357 204140 48160 55427 11432 506439
16228 506439 255048 397113 -226958 247298 155524 68374 277718 191948 189539 160413 209841
16217B09841N7464l5657J25113F9160L59777D7395L39964F9804J01607q5383M96
16206H6524b19700f3880q1593f5677A18153M3998a7547C5104K56045D0279J16567
16195A56846P3983C6535L70745b53877B17858b8083E4210K0734a40834E3786k0513
16184C3273J11612D214K54389a9217A58693o2197b29805D23880e4578K6399j59081
16173a87260F8862K52673r7683b14212A7196L47811A14442f5316F0075N6245J26716
16162B43036n0601A9547b29973g054D07893A14399L29341j92900F1461L36950
16152C98411A02941a1585E0550K59873C3513K41476g3064F3755K05877A02465
16141c1759R424l7943B46081q7484P091J00476c1065q114B426J14240J30910a93712
$$ plain form
16217 209841 267305 231648 356761 69160 428937 47395 387359 69804 171411 86028 86524
16206 86524 -219700 -63880 -145473 -65677 118153 162151 -17547 35104 291149 40279 156846
16195 156846 230829 36535 407280 -253877 217858 -28083 54210 74944 -140834 53786 33273
16184 33273 144885 4214 258603 -19217 158693 96496 -229805 423880 -54578 -28179 -187260
16173 -187260 68862 321535 223852 -214212 17196 365007 114442 -65316 60075 116320 243036
16162 243036 192435 19547 -229973 -7054 407893 114399 443740 250840 61461 398411
16152 398411 102941 -11585 50550 310423 33513 274989 -73064 63755 269632 102465
16141 -31759 -22335 -60278 246081 158597 165688 266164 -31065 -39179 2426 116666 247576 -193712
16128a4832B59152A09970q111l6941L41797h9594A62773a46668I5038o813J18343
16117B06568I0340g2576A63588O3711D2162P9605d0501H4162O4608J28984b79240
16105d2737M23A09303c7276B28166B3014L04878A32269J8248O992f3053B03525
16093I1366d8397j74655f4521o0888E7078a80507N6353A58647a79977e2076n8774
16082a10850l3195R227l1220B84852B1264K56060G1649L6664J13148A05312K10460
16071C15772l1670F4148c69399F0991O0855D3244h6299j90139f3040j11680A35182
16059h5415b4051j68317K3123L2386K4182I356L7111g3430l8383C729a25012D2019
16046a07126n2952H0694d0543H7288b35144D3239b45432c235H9562m3847L02761
$$ plain form
16128 -14832 259152 109970 101859 64918 406715 -89594 162773 -146668 95038 88225 206568
16117 206568 90340 -72576 163588 227299 42162 121767 -40501 84162 148770 277754 -279240
16105 -42737 -42314 109303 -37276 228166 23014 327892 132269 150517 157509 -63053 203525
16093 91366 -48397 -223052 -64521 -125409 57078 -180507 -124154 158647 -179977 -52076 -110850
16082 -110850 -144045 -134818 -166038 284852 21264 277324 71649 108313 221461 105312 315772
16071 315772 284102 64148 -369399 60991 121846 43244 -86299 -276438 -63040 -174720 135182
16059 -85415 -24051 -192368 -169245 -136859 -112677 9356 46467 -73430 -111813 3729 -125012 42019
16046 -107126 -160078 80694 -40543 87288 -235144 43239 -245432 -3235 89562 45715 348476
16035C48476I5967J18100o6570b46917b3533j67622E2951b36690A78464c43132
16024a53602B1570h2811m0003B47305A2891O4625M041b05812A77603R6190E6013
16012C6346O3271a91296O4316j1839a7872B82765c75570H4648C2466g5111B81532
16000I7238A9050M5097a51418B7428J63994a4532e703A94947d498G2780f0740
15988C95160b31351i4948b6009B25855m5275L1132O9207p7414J04516d8664E5371
15976b05703H8908l7398Q6715L3781e91A18495j0845G326J22921b94096A26301
15964a27159A47888o3949R202K62549a99120B76571I8348d2319C93536a85057
15953b07545R5252l8908P3899A44731a90105B94550j45356a11045m8139j4199
$$ plain form
16035 348476 95967 214067 147497 -246917 -23533 -191155 52951 -236690 178464 -343132
16024 -153602 21570 -82811 -122814 247305 12891 77516 81557 -205812 177603 273793 56013
16012 36346 99617 -191296 -126980 -138819 -17872 282765 -375570 84648 32466 -75111 281532
16000 97238 19050 64147 -151418 27428 191422 -14532 -5703 194947 -4498 72780 -60740
15988 395160 -231351 -94948 -26009 225855 180580 211712 280919 203505 308021 -48664 55371
15976 -205703 88908 51510 138225 172006 -591 118495 107650 7326 130247 -294096 126301
15964 -127159 147888 83939 93141 355690 -199120 276571 98348 -42319 393536 -185057
15953 -207545 -112293 -151201 -77302 144731 -190105 294550 149194 -111045 -159184 -173383
15943a73383Q6430l77633B78212j0327a79076e2868j89080H5689h5539B2967a0171
15931a78239A91536b1780j11459q5667m0821B3164a81070C6564M347b8971m1781
15920g0752k414J0482j19971B86688a15494A6216h6278j52767I2577d07700a08106
15908A51414g7942F4108R6006a38168b1457n6615J6009H1792C9026j7570b76587
15896b32303K1981B29026G2251J4946c95904a83166D59424j08211q1648c02095
15885b10425R047n7742C49890f087H9154B6147d06769J00094A06237A5365L2336
15874D7701Q5896b80932O8805j809N5966Q85N1254A63273N5646a7487m7481j22652
15862a87620k39245A41285e70515a2340B68686k8649g6743l4309A57386l4007
$$ plain form
15943 -173383 -86953 -464586 278212 267885 -179076 -52868 -241948 85689 -85539 22967 -10171
15931 -178239 191536 -21780 -133239 -218906 -259727 23164 -181070 36564 40911 -28971 -70752
15920 -70752 -73166 -62684 -182655 286688 -115494 16216 -86278 -239045 92577 -407700 -108106
15908 151414 -77942 64108 160114 -138168 -21457 -78072 -62063 81792 39026 21456 -276587
15896 -232303 -210322 229026 72251 87197 -395904 -183166 459424 351213 269565 -302095
15885 -210425 -201378 -259120 349890 -6087 89154 26147 -406769 -306675 106237 15365 47701
15874 47701 133597 -280932 -212127 -213936 -157970 -157085 -105831 163273 218919 -17487 -64968 -187620
15862 -187620 -426865 141285 -570515 -12340 268686 240037 -76743 -111052 157386 123379
15852A23379J47681A4280g655B85847A03847J2127j7673a78151c0174J4573p1445
15841h7046B3882N2097f1116j16658C18138A47165e0854l9502F436L33453b93904
15829F9290b42979f8884j89638A52302b63029J13496J6835I4689m0114A2214a30040
15817C08142d11E4901a67897b5022B40145L7842i5538o4100f4134J8470l6339
15806h2003K9055A29777d7232B2329J10744J04255m7575r1925c92770a82463j24015
15795c06478c4178k47192A24214P0905H6636b76243A23953a35422j0198B25461
15784i403A00482b83279A4064f1869A66752B1133i183k20102J07741n1914B11658
15772h9266c5198h604l09988D4454L18455d7153j54110E7634a12738j37930C28556
$$ plain form
15852 123379 271060 14280 -7655 285847 103847 115974 98301 -178151 -30174 -15601 -87046
15841 -87046 23882 75979 -61116 -177774 318138 147165 -50854 -90356 6436 339889 -293904
15829 69290 -242979 -68884 -258522 152302 -263029 -149533 -132698 94689 54575 12214 -130040
15817 308142 -411 54901 -167897 -25022 240145 277987 -95538 -159638 -64134 -45664 -82003
15806 -82003 -52948 129777 -47232 22329 133073 237328 189753 97828 -392770 -182463 -306478
15795 -306478 -34178 -281370 124214 195119 86636 -276243 123953 -135422 -145620 225461
15784 -9403 100482 -283279 14064 -61869 166752 21133 -9183 -229285 -121544 -173458 211658
15772 -89266 -35198 -8604 -318592 44454 362909 -47153 -201263 57634 -112738 -250668 328556
15760B04999c51176e5315A17186h9006A39461i4783F2932B4804J97230F5287d186
15748a63321m8863e059B74653b14657D9558K06404d42369K17547A31340f1154
15737d3310D060b72016A23822E2610J91676C7578f654j47135c9839R511j40308
15726a70636l8086O5211f0807k90645F4535J97135h7810j98503a40223G0634A2312
15714g9267l2240D1393K8422J91273d794H6173C9023c65717A14716a40998B9174
15702c29908j44371a52823L3080A17709a15613k28907P0515l585A7905K5493a8151
15690c8535C6854b06565K6864g7202p0881A1458J23457a13415F8718a26778d1469
15678B74209h6852j64676j02121P5911D58298b77711H9912J31687a68361g6295
$$ plain form
15760 204999 -351176 -55315 117186 -89006 139461 -94783 62932 24804 222034 65287 -4186
15748 -163321 -212184 -5059 274653 -214657 49558 255962 -442369 -224822 131340 -61154
15737 -43310 4060 -272016 123822 52610 244286 37578 -6654 -153789 -39839 -30328 -170636
15726 -170636 -208722 -143511 -60807 -351452 64535 261670 -87810 -286313 -140223 70634 12312
15714 -79267 -111507 41393 69815 261088 -4794 86173 39023 -365717 114716 -140998 29174
15702 -329908 -474279 -152823 -119743 117709 -115613 -344520 -274005 -277590 17905 43398 -18151
15690 -38535 36854 -206565 -179701 -77202 -148083 11458 134915 -113415 68718 -126778 -41469
15678 274209 -86852 -251528 -353649 -277738 458298 -277711 89912 221599 -168361 -76295
15667a73682l3542A4838L7231b68226J33044D33308A71393O533C4575g899n00046
15656e07945B53759f3828q3367d6751j85988h32o0952A94987a29051n6432j22034
15645c07517A85869E360L0918h1528c5834j00420M3962A6167n542a1175n54n3890
15633f5619A54520J55839b44716E8924a63321j56030B05922B2682J94030r9840
15623A16872d8680l67123G1125B1636A0417L83415A17623a12698j48855a17258
15612e9723A13132c32506i154F5291B8435d6336B1657c63136i8048j56410j31961
15601c86419c1725B12817c3078A52612d09769B93182F9772A106K5885J51099b38231
15589a84559a5708E1800J49866a37146A12634E0260J28457E4726Q1013b93528
$$ plain form
15667 -173682 -207224 14838 52069 -268226 -135182 433308 171393 177926 34575 -7899 -507945
15656 -507945 253759 -63828 -147195 -46751 -232739 -832 -61784 194987 -129051 -185483 -307517
15645 -307517 185869 5360 36278 -81528 -35834 -136254 -92292 16167 10625 -11175 -11729 -65619
15633 -65619 154520 310359 -244716 58924 -163321 -319351 205922 22682 216712 116872
15623 116872 -48680 -415803 71125 21636 10417 393832 117623 -112698 -261553 -117258
15612 -59723 113132 -332506 -9154 65291 28435 -46336 21657 -363136 -98048 -254458 -386419
15601 -386419 -31725 212817 -33078 152612 -409769 293182 69772 1106 26991 178090 -238231
15589 -184559 -15708 51800 201666 -137146 112634 50260 178717 54726 135739 -293528
15578c79351b1905C0728g9657m9825M2749A50356a02279o5180d9938p1469r6474
15567b17881A2340J14384b44799i4236d5360j57817J3419G658g5357A06493c5238
15555b9246m6330l3634d9108A26642J66814b35140A78911a37192F1956H250K22088
15544B30338r2912D6232a3442l5012F1218b33702d4395A53070g4254A1009L8367
15533D9376N7219J20763d3047j48747A49115b25963B56417m0718d09050B37304
15522B10062d7695A83916p1382L9115a55419A94122n7121B3176i1623E2322J50387
15511B02709B4764J06619f3781j3283D97534d7303a0828k96110J42890M6663M5375
15500g2010j31224F1599J37121b6082F8829Q1396b81604m9552I0040a88799n7138
$$ plain form
15578 -379351 -21905 30728 -79657 -129482 -86733 150356 -102279 -167459 -49938 -121407 -217881
15567 -217881 12340 126724 -244799 -94236 -45360 -203177 -189758 7658 -75357 106493 -35238
15555 -29246 -75576 -109210 -49108 126642 293456 -235140 178911 -137192 61956 8250 230338
15544 230338 137426 46232 -13442 -48454 61218 -233702 -44395 153070 -74254 11009 49376
15533 49376 106595 227358 -43047 -191794 149115 -225963 256417 215699 -409050 237304
15522 210062 -47695 183916 112534 151649 -155419 194122 137001 23176 -91623 52322 202709
15511 202709 24764 131383 -63781 -77064 497534 -47303 -10828 -306938 -164048 -117385 -72010
15500 -72010 -203234 61599 198720 -26082 68829 150225 -281604 -331156 90040 -188799 -245937
15489b45937j17054G7205d3969j49509h0116D4356K216b03544j32331d880j39675
15478a44555M234j1087O4885K2398m1017B19317c038j88628a3808C27794a84016
15466A50815F6167j4671a24156I2291e2149j48666l2579j5929g8872B3238J84653
15455B07891O340d8505g905k37867B35915j11271J1782C2426L6460f1862J6923
15444d4939n3178R411k00952D212R1559a84608h6151l7450B04142d2621j56752
15433a99373f2749B78359A02689h4675q0251f6214r1656B852K46227a68799A4033
15421f1368j52259J04407A57342f1835B72000j17905F6933a72298m209A2618J30551
15410A43169h8615A50780l3279D5439J9424J18747e4461k37105A474Q5486c23774
$$ plain form
15489 -245937 -362991 77205 -43969 -193478 -80116 44356 46572 -203544 -335875 -4880 -144555
15478 -144555 -140321 -151408 -86523 -64125 -105142 219317 -3038 -191666 -13808 327794 -184016
15466 150815 66167 51496 -124156 92291 -52149 -200815 -233394 -249323 -78872 23238 207891
15455 207891 214231 -48505 -7905 -245772 235915 124644 136426 32426 68886 -61862 -44939
15444 -44939 -98117 -88706 -289658 4212 95771 -184608 -86151 -123601 204142 -42621 -199373
15433 -199373 -62749 278359 102689 -84675 -164926 -66214 -157870 2852 249079 -168799 14033
15421 -61368 -213627 -109220 157342 -61835 272000 154095 66933 -172298 -176507 12618 143169
15410 143169 -88615 150780 117501 45439 64863 183610 -54461 -291566 1474 86960 -323774
15398F9560g2920F1771A303b12008r4349G9336f6966j20378j3598B0240P9072
15387I9312B2409j0375K06450E647e3574F333J38156A218c3911d909n5233H6225
15374g9148B02351J07139E2229b3528I7474h4243D7249a54m7953l7197C32675
15362a52736A24224f8508H9852c9106D4231b24890P8112P0680A76829A5321J11618
15351A26939a21822C51191H3629K26256h0772A40110K3111C6083R6318a2800r882
15340b2682B39678I5765b88520A61787g0587A84390a40804E2216k280K73628E3394
15328A65908n9734l6268j7755b59849R2985l3825g4628l187A17997K0103a65670
15316b51508B18759B3638O8276J50778r4307a181j19161l202j15330e6H3189l7357
$$ plain form
15398 69560 -72920 61771 1303 -212008 -306357 79336 -66966 -187344 -200942 20240 99312
15387 99312 22409 12034 218484 5647 -53574 6333 144489 1218 -33911 -4909 -60142 86225
15374 -79148 202351 309490 52229 -23528 97474 -84243 47249 -154 -48107 -85304 332675
15362 -152736 124224 -68508 89852 -39106 44231 -224890 -146778 -76098 176829 15321 126939
15351 126939 -121822 351191 83629 309885 -80772 140110 163221 36083 132401 -12800 -22682
15340 -22682 239678 95765 -288520 161787 -70587 184390 -140804 52216 49936 323564 53394
15328 165908 106174 69906 52151 -259849 -166864 -200689 -74628 -77815 117997 138100 -165670
15316 -251508 218759 23638 91914 242692 148385 -1181 -120342 -123544 -238874 -56 83189 45832
15304D5832P5206k8533J93946c9609D5741a58524E8358J22467L8862E7770b11322
15292b27544h3079j32092C2539Q7306m3095a67916A22017K46990g9651l0888D4410
15280A71291J5012D2495L13958i3304a048A42562d19C52731B7570K98890q4942
15269B41518P5981H0333N4418a15314D2861J92870O5717A2034K3141K66240A902
15257A42972m8310a99773g073I6253a87699E06271M6329L23476J98990j5988K44749
15246A303827l65464C25106O7898a92464a3542m3094J1108C0305N5363J65587
15236B51255M4650a56188C8016N0954d0630G9137N6708b93759A40374J3555F3966
15224B56614c5749o8659o15B41964A0480L97678a0955j5115j33742C02080A36517
$$ plain form
15304 45832 121038 92505 286451 -39609 45741 -158524 58358 180825 219687 57770 -211322
15292 -227544 -83079 -215171 32539 119845 76750 -167916 122017 369007 -79651 -110539 44410
15280 171291 186303 42495 356453 -93304 -1048 142562 -419 352731 27570 326460 241518
15269 241518 317499 80333 134751 -115314 42861 235731 301448 12034 35175 301415 1902
15257 142972 94662 -199773 -7073 96253 -187699 506271 552600 876076 1075066 1059078 1303827
15246 1303827 938363 325106 393004 -192464 -13542 -56636 -45528 30305 85668 251255
15236 251255 295905 -156188 38016 88970 -40630 79137 135845 -293759 140374 153929 63966
15224 256614 -35749 -104408 -105023 241964 10480 408158 -10955 -26070 -159812 302080 136517
15212A20220Q2755a54189A92319D4563K97557i3363A44330b62952A85025e9471
15201b17508A49283Q7377p2161c8559Q955A76702p5362N9826l3338a53250d7848
15189b65904B16778G3628i1527j20253H2525K45707b86462h1476B82703j22024
15179A60679J91753J60760g7980B709K47328c28720H9824R3246J70217j36415
15169B16872i7543M4264A17291h8563I1062j4886J42988N7093C1181h7081D4083
15157B89771k5522Q6966A63374m0343g0339k5139L7452C29376r7468r016k3663
15146A99229L3006j2709b8332A40088a30121C38886A4307J65977J00480G6758
15135b3596D2074K00571a820A40993K21333j09747k9023C683O9951J9076N7113
$$ plain form
15212 120220 202975 -154189 192319 44563 342120 -93363 144330 -262952 185025 -59471
15201 -217508 149283 236660 164499 -38559 -29604 176702 101340 161166 127828 -153250 -47848
15189 -265904 216778 73628 -91527 -211780 82525 328232 -286462 -81476 282703 160679
15179 160679 352432 513192 -77980 2709 250037 -328720 89824 183070 353287 216872
15169 216872 -97543 -53279 117291 -88563 91062 76176 219164 276257 31181 -87081 44083
15157 289771 264249 351215 163374 123031 -70339 -95478 -58026 329376 231908 222892 199229
15146 199229 232235 219526 -28332 140088 -130121 338886 14307 180284 280764 76758
15135 -23596 42074 242645 -1820 140993 362326 252579 223556 3683 73634 92710 149823
15124A49823m0897c7343k2046D8443e8071I0580b76760A51903C9821N1439j1561
15113G9699K81080j48519A9296Q87K90972r6201m8799a7054C13898a87928A13508
15101g415B58877p7772a40892f0488A84025P2878J33484g517C9433K94264A2322
15089B32048E6581A8232a70478B15352M933j4268M8783C5159O9910j4671K94353
15078C84751o4792b51555B92269C4184d851A35428J18513J58115A99610K61464
15068D61074a06965G8779i6535B61198O717N1075j03564d3460D55307a6824F15328
15056D4517J54314K11695j93501c2444B32258k9531P5061i3352A07959M4588A2217
15044A034L59284E8365e2278l2062A92326C1872a81310B53858a54167D69269H5557
$$ plain form
15124 149823 108926 -37343 -59389 48443 -58071 90580 -276760 151903 39821 91260 79699
15113 79699 360779 212260 19296 20183 311155 214954 166155 -17054 313898 -187928 113508
15101 -7415 258877 181105 -140892 -60488 184025 256903 390387 -7517 39433 333697 12322
15089 232048 56581 18232 -170478 215352 220285 206017 254800 35159 105069 90398 384751
15078 384751 319959 -251555 292269 34184 -4851 135428 253941 412056 199610 461074
15068 461074 -106965 78779 -96535 261198 267915 318990 215426 -43460 455307 -16824 615328
15056 44517 198831 410526 217025 -32444 232258 202727 277788 -93352 107959 152547 12217
15044 1034 360318 58365 -52278 -84340 192326 31872 -181310 253858 -154167 469269 85557
15032A10678J45355J37438H3332K07269F4563K5407J05750K45636B7698K98994
15022C26692A3047M72449D0140N5769K9916J95892j4918J06822G537M629L80737
15011C92903A125M86354k05693m8760j0962L4105Q602j17003R2003K45997c1639
14999A10185R9364B9422O8306L87772a0910m938C1591J97278m2263O1627F5168
14987A66908K80058p4281h7996n2242P514B83498l472q0491j1725d0926A45625
14975A11084K3695E6665M56967e6020C53969j71696q4170J79238o2408O6189n0300
14964B30822a08385C20699q736K23016A03330C362M06636J08498h3084C68621
14953B82653L11446k95708G5543K31030J5335r6558J15754M0658p9728n2178r6070
$$ plain form
15032 110678 256033 393471 83332 290601 64563 89970 195720 441356 27698 326692
15022 326692 13047 485496 40140 95909 125825 321717 306799 413621 7537 12166 392903
15011 392903 1125 487479 281786 233026 222064 256169 264771 147768 239771 485768 -31639
14999 110185 209549 29422 97728 485500 -10910 -15848 31591 228869 186606 248233 65168
14987 166908 446966 372685 -87996 -140238 -132724 283498 280026 199535 187810 -40926 145625
14975 111084 134779 56665 513632 -56020 353969 182273 98103 277341 214933 281122 230822
14964 230822 -108385 320699 311963 534979 103330 3362 409998 518496 -83084 368621
14953 282653 594099 298391 75543 306573 321908 225350 341104 381762 302034 249856 153786
14942A53786L33408I9688C8612K00183l2480n8977M7262J40903I8539c0244A67178
14930C66701J5091A90752J01585G3328J9362K5852J3712K18086o7743o6866K7834
14919B43565j15911E9494L22790r8802A10751A543M13471j074j48578E1232L75590
14908D26822j26055j46871M63406k20025l6420O1832e8494J3278E15623r058k02588
14897C03977j39153L95453I5937P7221o8321Q4197K77501N1563k06530N2027m2076
14886C21519K53011J64990A60122J19515M3439I8966L03011A97018L71529a8280
14875C08897L5154J52126A41419L40374j23030j3757K01797k22868p3264F5228
14864E26777B10481L04960k4091m701M03107C28583O6322k870j43373J94633L6493
$$ plain form
14942 153786 487194 99688 38612 238795 206315 147338 194600 335503 98539 -30244 167178
14930 366701 381792 190752 292337 73328 92690 118542 132254 350340 282597 215731 243565
14919 243565 127654 59494 382284 283482 110751 1543 415014 413940 265362 51232 426822
14908 426822 300767 153896 617302 397277 360857 422689 -58494 -45216 515623 506565 303977
14897 303977 164824 560277 95937 173158 104837 189034 466535 518098 311568 363595 321519
14886 321519 574530 739520 160122 279637 323076 98966 401977 197018 568547 -18280
14875 308897 344051 496177 141419 481793 358763 345006 546803 323935 250671 65228
14864 526777 210481 515441 491350 486649 889756 328583 394905 392035 248662 443295 479788
14853D79788K27909C53335J7570K445P8244K74861r6659B29166M7369K65910j00310
14842D42135A38223N63503l27798j5608P0846j6693K77353k60601K37245l20338
14832C46132j52359K64667j81759O29L20973k85081J34443j81156J76826n0162
14822C93153J1155J91777j17529Q5023p5980M6159r2743j23945K17077k49335
14812B84812J1906M93283C31467R9446J91688J66121j33111n032B70996K40851
14802E11847J38238j46973kJ3973L6854J11131j27126k24283L38293j23296K45547
14791G74203k942n2548q4220l15970J60520J88337r0217r2400k27552J15040L80781
14780G53032k53273B27231L66716K15506j76149k20970J43245J43739R5324O1876
$$ plain form
14853 479788 707697 353335 370905 373350 451594 726455 629796 229166 276535 542445 442135
14842 442135 138223 701726 373928 358320 429166 412473 689826 429225 666470 346132
14832 346132 193773 458440 276681 277310 598283 313202 447645 266489 443315 393153
14822 393153 404308 596085 478556 563579 487599 533758 441015 317070 534147 284812
14812 284812 296718 790001 331467 430913 622601 788722 655611 650579 270996 511847
14802 511847 650085 503112 503110 517083 553937 665068 537942 313659 651952 528656 774203
14791 774203 771261 718713 634493 318523 479043 667380 577163 484763 257211 372251 753032
14780 753032 499759 227231 593947 809453 633304 412334 555579 699318 794642 856518
14770H56518l15636j09751M57801l38860M9889j5087j52475M61559p6164j53606
14760F64188o770J4752k54001J08382P3922J55251k0729K28083D13529J26421
14750E39950P0257J19700O5401j22773O4767j5800j55544M11270l77203L49053
14740I49078l87075K07522k4118L16684k47715Q2374k07163j1788j4051J90151
14730H53899j05587J64537k50884J85061J35957J15828m53756J69507j66505l0660
14720F17397J84580J33812l04164M2415R6862j34965J65576J12452R8905j1828
14710A001042o8334o7883K99317l63141j505L05361l97009K12518j42342q0179
14700F97845k3429N0331n9689M70530j57024j49582M0324k28400L30808O5338
$$ plain form
14770 856518 540882 431131 888932 550072 599961 584874 432399 893958 817794 664188
14760 664188 657418 672170 418169 526551 600473 755724 734995 963078 413529 539950
14750 539950 610207 729907 795308 672535 737302 721502 565958 977228 600025 949078
14740 949078 562003 769525 745407 1062091 814376 896750 689587 677799 663748 853899
14730 853899 748312 912849 661965 847026 982983 1098811 645055 814562 648057 617397
14720 617397 801977 935789 631625 674040 770902 635937 801513 913965 1012870 1001042
14710 1001042 932708 864825 1164142 801001 799496 1104857 707848 920366 778024 697845
14700 697845 674416 724747 665058 1135588 978564 828982 869306 640906 971714 1037052
14690A037052l09535L6904k9687k5757L98293l59485M36249j10729P9711k23952
14680I29064K33282n29234K99345J87206j07192Q965j72770L39140k11859K90915
14670A266862n3389j17795Q115m15808K71878r1853L44669k72822N1314K87141
14660A278312p8870K0448j94658j40562J65925P7686K02855l88317L41865J29888
14650A414572n3865l4006K57414k37740l77131M51104l88903K29531k30091J76950
14640A207835J05256k09646L91836k28783j32994K28293k5112J94231m0128J30474
14630A621262m56818J40631J83406k55563L63112m9908r6168k19890M15952n9251
14620A586765J5066m28668K57698l91011O66606L6530j54826K91567j30289k65266
$$ plain form
14690 1037052 727517 764421 734734 708977 1107270 747785 1184034 1073305 1153016 929064
14680 929064 1162346 633112 932457 1119663 1012471 1021436 848666 1187806 975947 1266862
14670 1266862 1213473 1095678 1103793 687985 959863 868010 1212679 939857 991171 1278312
14660 1278312 1199442 1219890 1025232 884670 1050595 1128281 1331136 942819 1284684 1414572
14650 1414572 1360707 1326701 1584115 1346375 969244 1420348 1031445 1260976 1030885 1207835
14640 1207835 1313091 1103445 1495281 1266498 1133504 1361797 1336685 1530916 1490788 1621262
14630 1621262 1164444 1305075 1488481 1232918 1596030 1546122 1449954 1230064 1646016 1586765
14620 1586765 1601831 1173163 1430861 1039850 1706456 1742986 1588160 1879727 1749438 1484172
14610A484172L22392j71508M8286k57197K60029k30578Q7697l0151J510K00755
14600A715407k29948K74005J3046n9703j90002J36335L33012m97620K62903n7674
14590A699761K77466k11153J35556p6853k39690M95815j58693J90232l7512l053
14580B071876l15724M18988k47285P3874J47447j8131J19693k84437K3723L49202
14570B339226j47295J85798j19814J68293j62190l7469K04542L10046j10436m7238
14560B583463L04530l3538l2351K19116L9434L94198O5755K30087N87495L38410
14550D696599J090575J912549L578347R014092J9521222R259361B3963988I855635
14541E239350j867598o98359l25460L1820l58270r89K10469l52682K77703P3862
$$ plain form
14610 1484172 1806564 1635056 1683342 1426145 1686174 1455596 1543293 1513142 1514652 1715407
14600 1715407 1485459 1759464 1772510 1712807 1522805 1659140 1992152 1494532 1757435 1699761
14590 1699761 1977227 1766074 1901630 1824777 1585087 2080902 1922209 2112441 2074929 2071876
14580 2071876 1756152 2175140 1927855 2001729 2149176 2131045 2250738 1966301 1990024 2339226
14570 2339226 2191931 2377729 2257915 2426208 2264018 2226549 2431091 2741137 2630701 2583463
14560 2583463 2887993 2854455 2822104 3041220 3080654 3474852 3540607 3770694 4358189 4696599
14550 4696599 5787174 7699723 11278070 20292162 39813384 49072745 23963988 9855635
14541 5239350 3371752 2673393 2347933 2379753 2021483 2020494 2230963 1878281 2155984 2229846
14531B229846r3489r5693M30774l35727J46313J01463K42344k27427L1791K30402
14521B660597J62591m49782M08236j51271L09716k48840L1335J97139n4226N6462
14511B921957P1049J05550l6791k95515J95372K56981r8077J27432n061l66934
14501B875963L06359k5269J15830J2284J70178K15129l0928n10232K96578J92517
14491C618409O8212J99467m10049P1252M43328j90102L16516l36629L108K91034
14481D074546l67090L97422p4028n9659K30719J33569P4804q236j54218L0623
14471D278452J68260J84620K2480J39044j66103P3700M31830j72171J76445P4219
14461E210776m6312M03676n90080J07358q441K71712k8047M12831k55798l20963
$$ plain form
14531 2229846 2136357 2040664 2471438 2135711 2282024 2383487 2625831 2398404 2430195 2660597
14521 2660597 2823188 2373406 2781642 2630371 2940087 2691247 2722582 2919721 2865495 2921957
14511 2921957 2993006 3098556 3061765 2766250 2961622 3218603 3120526 3247958 3242897 2875963
14501 2875963 3182322 3157053 3272883 3285167 3455345 3670474 3639546 3129314 3425892 3618409
14491 3618409 3686621 3886088 3476039 3547291 3990619 3800517 4117033 3780404 3783512 4074546
14481 4074546 3707456 4104878 4030850 3971191 4201910 4335479 4410283 4402047 4247829 4278452
14471 4278452 4446712 4631332 4653812 4792856 4626753 4700453 5132283 4960112 5136557 5210776
14461 5210776 5164464 5568140 4978060 5085418 5076977 5348689 5320642 5733473 5477675 5156712
14451E156712O64138j32789n3036M64356j22063k49150N14528l13884L90006R8228
14441F417046k62981j24616O85528J11684K64563p8023q8250j6357P2076K06456
14431G187126M437J59836L58815k12156q9006k69868M48823J30379K30093l6818
14421G911661N5690K60820K51843K26400k5393J61615M08083k43472L33377l71143
14411H969481M15004j97271N90080L0220J62964o3422L56658K9902P66212l68403
14401A0691425L02814j00713K28237J91796K92327K35107J03211O4271K85650
14392A2294125O1466L43304L27201K64134J97166J16549K35637R3802K48654N26997
14382A4709035L78687L15510L49513l71211N07241L12908L82939N64320K36566
$$ plain form
14451 5156712 5820850 5688061 5635025 6099381 5977318 5728168 6242696 5928812 6318818 6417046
14441 6417046 6154065 6029449 6714977 6826661 7091224 7013201 6924951 6908594 6980670 7187126
14431 7187126 7191563 7351399 7710214 7498058 7409052 7139184 7588007 7718386 7948479 7911661
14421 7911661 7967351 8228171 8480014 8706414 8681021 8842636 9250719 9007247 9340624 8969481
14411 8969481 9384485 9187214 9777294 9807514 9970478 9907056 10263714 10293616 11059828 10691425
14401 10691425 10994239 10893526 11121763 11313559 11605886 11840993 11944204 12008475 12294125
14392 12294125 12355591 12698895 13026096 13290230 13487396 13603945 13839582 13933384 14182038 14709035
14382 14709035 15087722 15403232 15752745 15381534 15888775 16201683 16584622 17148942 17385508
14373A7385508L62498L53048J87932K07500L22398L91402N40951N92999L42528
14364B0686764J61008M50228M76122N16475N72432N55388M80053Q61062J28179
14355B4887711O51393N02900N76433Q82768N92808J025472K23812P90949R84983
14346C1119229N18840J143143Q13923M02340J671317Q32433N39038J472184J212395
14337C9724842Q11627R20700J493031J034036J738515J202969J355602J761047
14329E0042369J405447J547472J879390J586900J769048K122035J996888K505432
14321F4854981J975601K329891K429169K980428K325078L357605K687084L523069
14313H6462906L345258L370797L821772L996261M459314M350568M942283M682115
$$ plain form
14373 17385508 17748006 18101054 18288986 18496486 18818884 19210286 19751237 20344236 20686764
14364 20686764 20847772 21298000 21774122 22290597 22863029 23418417 23898470 24759532 24887711
14355 24887711 25539104 26042004 26618437 27501205 28094013 29119485 29343297 30134246 31119229
14346 31119229 31638069 32781212 33595135 33997475 35668792 36501225 37040263 38512447 39724842
14337 39724842 40536469 41457169 42950200 43984236 45722751 46925720 48281322 50042369
14329 50042369 51447816 52995288 54874678 56461578 58230626 60352661 62349549 64854981
14321 64854981 66830582 69160473 71589642 74570070 76895148 80252753 82939837 86462906
14313 86462906 89808164 93178961 97000733 100996994 105456308 109806876 114749159 119431274
14305A19431274N310284N512743O347814O066353O535246P067122P498137Q033545
14297A71802518Q416858Q567601R737414R792876J0372564J1414112J1590546
14290B41694489J1854851J3305149J3373427J3524407J4204637J4671636J4961404
14283C37590000J5245937J5042484J5396052J4625756J4387134J3620432J2796826
14276D38704621J0974564R702317O773164M762587J926371m93423k109911k938854
14268D67301436l500807m739421p005253r039558j0852141j2391679j4058269
14261D05714308j4580307j5257775j5688855j6032776j5626666j4574665j4848980
14254B99104284j4577878j3632076j3184743j2742755j1819347j1603915j0519668
$$ plain form
14305 119431274 124741558 130254301 136602115 142668468 149203714 156270836 163768973 171802518
14297 171802518 180219376 188786977 198524391 208317267 218689831 230103943 241694489
14290 241694489 253549340 266854489 280227916 293752323 307956960 322628596 337590000
14283 337590000 352835937 367878421 383274473 397900229 412287363 425907795 438704621
14276 438704621 449679185 459381502 466154666 470917253 472843624 472350201 470240290 467301436
14268 467301436 463800629 459061208 452055955 443016397 432164256 419772577 405714308
14261 405714308 391134001 375876226 360187371 344154595 328527929 313953264 299104284
14254 299104284 284526406 270894330 257709587 244966832 233147485 221543570 211023902
14247B11023902j0827479r356314q839345q299493p900625q085648p103789o839716
14239A43771493o560280n415189o026486n528477m855474m916748m325713m423963
14231A01719163l702900l711651l641067l712203l178403l253881k768460l098425
14223G4652173k704216k479331j987238k573907j892073k022071k415476j839439
14215E6738422j717855j276060j335022j726293k000019j649721j014071j221042
14207D4798339p94744j172567j260029j586634j081686j053369p00149n43290
14199C6605871j223628j053712r99062r07839m83159l56651j134580q54955j071004
14190B8521281n8179j044096m44119n78790m77163n95754o20007o11293r82757
$$ plain form
14247 211023902 200196423 190840109 182000764 173701271 165800646 157714998 150611209 143771493
14239 143771493 137211213 131796024 125769538 120241061 115385587 110468839 106143126 101719163
14231 101719163 98016263 94304612 90663545 86951342 83772939 80519058 77750598 74652173
14223 74652173 71947957 69468626 67481388 64907481 63015408 60993337 58577861 56738422
14215 56738422 55020567 53744507 52409485 50683192 48683173 47033452 46019381 44798339
14207 44798339 44003595 42831028 41570999 39984365 38902679 37849310 37149161 36605871
14199 36605871 35382243 34328531 33329469 32421630 31938471 31581820 30447240 29592285 28521281
14190 28521281 28463102 27419006 26974887 26396097 25918934 25323180 24703173 24091880 23109123
14181B3109123L43295q71905m60664j87398p63553m02953j89906o41049m09298
14172A9525692l92211m50076k57224k36605m19785m44244o0924m51953j90039
14163A6622631l12646l82075j38757n04726q5818n27313j60596n25997n5402O5782
14153A3995083l76807l44943l34867o4893k09840j13571m91894j77708j92072
14144A1688488K31633n52943M1792j55741q3133m99969L86679m25706n28130K7977
14134A0130947L6588j72037m89357j8671k4955J12888m24677q6946p638j51372
14124H904770o52315N98171j55833r9275l56664J34630m01016q9377J75100o10785
14114G447406M99932l35307k81749q9113m7497m5034l49046j85264L09505k24852
$$ plain form
14181 23109123 23452418 22580513 22119849 21932451 21168898 20765945 20576039 19934990 19525692
14172 19525692 19133481 18683405 18426181 18189576 17769791 17325547 17264623 16812670 16622631
14163 16622631 16309985 15927910 15789153 15284427 15198609 14671296 14510700 13984703 13929301 13995083
14153 13995083 13618276 13273333 12938466 12873573 12663733 12550162 12058268 11880560 11688488
14144 11688488 11920121 11367178 11408970 11253229 11170096 10670127 11056806 10631100 10102970 10130947
14134 10130947 10167535 9995498 9506141 9487470 9462515 9575403 9150726 9063780 9056142 8904770
14124 8904770 8252455 8850626 8694793 8595518 8238854 8373484 7972468 7883091 8058191 7447406
14114 7447406 7947338 7612031 7330282 7241169 7193672 7148638 6799592 6614328 6923833 6698981
14104F698981Q9708l19055K63796l16371J5408r3818o7129p9140N2947k80594
14094E964733J202J94044l47934q0152r9769M3471k87946J48980J17562o54943
14084D999248K05044j98725K09694J05350l86776p9946K88315j08912k37547k40222
14074D555523k7082j0441R9294j28482J68719k79926K46022j80562K17230p6923
14064D583372n00294J32906M8957L3358m12734L01848q8953L04566m78709J82987
14054D107304M2124j40291J50227j58165j31538L2104k37712L0586J27843l44503
14044C477979J69589l30445J89409J00666q9765j11375J80823K8328l62198j11887
14034C141124J68156n3938K01407j0265k41752L4586k65198M77205p23553P7924
$$ plain form
14104 6698981 6788689 6469634 6733430 6417059 6432467 6338649 6271520 6192380 6245327 5964733
14094 5964733 5965935 6159979 5812045 5731893 5632124 5675595 5387649 5536629 5654191 4999248
14084 4999248 5204292 5005567 5215261 5320611 4933835 4853889 5142204 5033292 4795745 4555523
14074 4555523 4528441 4518000 4617294 4488812 4657531 4377605 4623627 4443065 4660295 4583372
14064 4583372 4083078 4215984 4264941 4298299 3885565 4187413 4098460 4403026 3924317 4107304
14054 4107304 4149428 4009137 4159364 4001199 3869661 3901765 3664053 3694639 3822482 3477979
14044 3477979 3647568 3317123 3506532 3607198 3517433 3406058 3586881 3615209 3253011 3141124
14034 3141124 3309280 3255342 3456749 3446484 3204732 3239318 2974120 3451325 2727772 2805696
14024B805696L07144m93265L32741l25634L29563l3853J48083l53671Q6899J75737
14014B979440m06336k3469N54633m21539j10860k42909L3800L01620j28704M7388
14004B583064N9425k8598J7471l23980K19993k19635M2234j62725J35042J25115
13994B447406m85425K87959J17096j73207Q51486O50774K311402O308448J7247147
13985B9563086J9242362j8034519j5290898o111080k441536k034312o15175l60635
13977C917293k78311l32417l39681M13181o37795j82091M00844l07309l08131
13968B345583P19044o11771J4984J45490j18378j7188q8536n9407l19355l9144
13958A971322J24011Q2127j01993R2923J77638l29422J59568p4142j90686K73447
$$ plain form
14024 2805696 3112840 2619575 2952316 2626682 2956245 2922392 3070475 2716804 2803703 2979440
14014 2979440 2573104 2549635 3104268 2682729 2571869 2328960 2362760 2664380 2535676 2583064
14004 2583064 2642489 2613891 2631362 2307382 2527375 2307740 2349974 2187249 2322291 2447406
13994 2447406 1961981 2249940 2367036 2193829 3045315 3696089 6007491 12315939 29563086
13985 29563086 48805448 30770929 15480031 9368951 6927415 4893103 4277928 3917293
13977 3917293 3638982 3306565 2966884 3380065 2742270 2560179 2961023 2653714 2345583
13968 2345583 3064627 2452856 2467840 2613330 2494952 2477764 2389228 2329821 2010466 1971322
13958 1971322 2095333 2177460 2075467 2168390 2346028 2016606 2176174 2102032 1911346 2184793
13948B184793j48206J66106j74783j34371j31577N55159k22870n69501J86553
13939A711303J38486K3016q1415K5971M14738o20345J57307J12509o7509j68934
13929A645127n098K86527j71256o6690j93137J76765m8977N6103l58222N38788
13919A859930k24681l7214J53317m0439j44928l91031M05954k0260k51767M71218
13909A780099m08089J19429n2895k15592K01572M9767M5292j79103l2393M02246
13899A710333n672n31389L42075R777k7694k8218j49030K043J89092j90268j42302
13888A178747M22437o55433M0444L13952l7361r8743J13885Q872J07201k28779
13878A165222J65885O6974J40242k82424k11874M66446r076J26985n52454J12164
$$ plain form
13948 2184793 2036587 2202693 2027910 1893539 1761962 2317121 2094251 1524750 1711303
13939 1711303 1849789 1872805 1791390 1817361 2232099 1611754 1769061 1881570 1814061 1645127
13929 1645127 1640029 1926556 1755300 1688610 1495473 1672238 1623261 1679364 1321142 1859930
13919 1859930 1635249 1598035 1751352 1710913 1565985 1174954 1580908 1560648 1308881 1780099
13909 1780099 1372010 1491439 1438544 1222952 1424524 1474291 1519583 1340480 1308087 1710333
13899 1710333 1704661 1173272 1515347 1525124 1497430 1469212 1320182 1322225 1511317 1321049 1178747
13888 1178747 1601184 945751 986195 1300147 1262786 1164043 1277928 1286800 1394001 1165222
13878 1165222 1331107 1398081 1538323 1255899 1044025 1510471 1501395 1628380 1075926 1188090
13868A188090k4422L97263O0445l75765J42131j89658j19712k11427M70386K4119
13858A361450j36048K16974l85740L39276m91099J53029J17154q2992K7671Q0211
13848A199886J77180j80955l31748J93105J5436J86138n2295j62056q6721n9182
13838H98788L42134l19032j77069M29003k47462L10070l76378L7866J82348p8182
13828A002086l11471K80085K30133m10923L25742k18997J94569k62461J4414N01893
13818A345070m64426K6545j49215M04213l32464j35713J33622m9403L1257K48094
13808A057580k05828J98258k93228J29779J23980k67194P7201Q9650N8441M3939
13798A012578j21492k29592J94337J23422K90422j02420l17490k00076L52171
$$ plain form
13868 1188090 1163668 1560931 1621376 1245611 1387742 1198084 1078372 866945 1337331 1361450
13858 1361450 1225402 1442376 1056636 1395912 904813 1057842 1174996 1092004 1119675 1199886
13848 1199886 1377066 1196111 864363 1057468 1072904 1259042 1206747 1044691 957970 898788
13838 898788 1240922 921890 744821 1173824 926362 1236432 860054 897920 1080268 1002086
13828 1002086 690615 970700 1200833 789910 1115652 896655 1091224 828763 843177 1345070
13818 1345070 880644 907189 757974 1162187 829723 694010 827632 778229 809486 1057580
13808 1057580 851752 1050010 756782 886561 1010541 743347 820548 910198 968639 1012578
13798 1012578 891086 661494 855831 979253 1269675 1167255 849765 649689 1001860
13789A001860J43825l56899q5408m9964Q0441L93605E59140K01877l7325j16204
13779F07488K83667k61393K46647o8977k49031j1136K43515J10735j80925J29188
13769H49778j54452R4024L08655j85981K6241l03172M50310j20136l22327K14162
13759H57102p2574N1895j91684N3431K01997J49477k55704J28954k43887m7474
13749F31533A41481M84067J71057J03176l06452L8887k30670O57907D38713J89118
13739F27831k33510J50241J67121J06521j91879j17719P8192O063n6355p7575
13729D58931J60322Q631k99314J88527L05970l70923M42026j95093K6243l36407
13719C88913N3550B06442L36938L33250k82771j63103K99557j82149R1629k4072
$$ plain form
13789 1001860 1145685 788786 703378 653414 733855 1127460 559140 761017 723692 607488
13779 607488 891155 629762 876409 807432 558401 547265 790780 901515 720590 849778
13769 849778 695326 789350 1098005 912024 938265 635093 1085403 965267 642940 857102
13759 857102 784528 836423 644739 698170 900167 1049644 793940 922894 679007 631533
13749 631533 141481 625548 796605 899781 593329 632216 401546 1059453 438713 627831
13739 627831 394321 544562 711683 818204 626325 508606 586798 592861 536506 458931
13729 458931 619253 627884 328570 517097 823067 452144 894170 699077 725320 388913
13719 388913 442463 206442 543380 876630 593859 430756 730313 548164 639793 615721
13709F15721k77637L67975m6488N6783k90696j03824j1689O33066k41935j52640
13699E48636j69157J2340L04625B77764O36874D23005L2800P3976K92789j07090
13689G15480j81264L99310B08401K06536O2771K09330l2548j34442O6285q3884
13679E02449R6851N0131j22649j1545M6498M6077k21151J92275j79120j8030M44638
13668H26424l51974j32958H7894N05646k39825M53226o6218J9472l19459k5671
13658D15065Q9001J45873j48173M2759K18080r3240j6173j36949j4597k11405
13648B90241M2832m2002K42636J65158l20741J82528B19249M91699o9041j71064
13638D70843Q2676A28171J78632J61587J48180j48888E6828N45302j0797B89245
$$ plain form
13709 615721 338084 706059 659571 716354 425658 321834 310145 943211 701276 548636
13699 548636 379479 391819 696444 277764 914638 423005 455805 529781 822570 715480
13689 715480 534216 933526 208401 414937 477708 687038 654490 520048 586333 502449
13679 502449 599300 649431 526782 515237 561735 607812 386661 578936 399816 381786 826424
13668 826424 474450 341492 87894 593540 353715 806941 740723 760195 440736 415065
13658 415065 504066 649939 501766 544525 762605 669365 653192 516243 501646 290241
13648 290241 333073 291071 533707 698865 378124 560652 219249 710948 641907 470843
13638 470843 553519 128171 306803 468390 616570 467682 56828 602130 591333 289245
13627E46859o8729n1723k8720K5566A93575L12617k42874M22571B30504K00963
13617D31467K50315k12154R4311l4191B49060J83842M3339p663B01782K20486
13607D22268j55428K97550p4640j85495L41435j57481n850k39925L70857k54575
13597C58716L02335k72580J52564O5615n2218A22161K48756M0547l9556K26895
13587E98803j73879L5937j22333A31520K71470M5855j69160A27101N06149A01463
13576A8726K75210L02007o6004q5171K14351B50516K96256j92343K67820c452
13565F27568B12867M36352B39392j9756N01081B82945J22839A75726J59054q7802
13555B46978J86339J12338B44453J27022R4079H9571L04313q411J41462B21107
$$ plain form
13627 546859 478130 426407 397687 423253 193575 506192 263318 685889 230504 431467
13617 431467 681782 469628 563939 529748 249060 432902 476241 468578 201782 422268
13607 422268 266840 564390 489750 304255 645690 488209 482359 242434 613291 358716
13597 358716 661051 388471 541035 606650 554432 122161 370917 411464 371908 598803
13587 598803 424924 460861 338528 131520 402990 448845 279685 127101 633250 101463
13576 18726 293936 595943 529939 444768 659119 250516 546772 354429 622249 -3452
13565 627568 212867 649219 239392 219636 720717 282945 405784 175726 334780 246978
13555 246978 433317 545655 244453 371475 465554 89571 393884 385473 526935 221107
13544C93266m9688n3843G3865L2587J20798r5804K88033K37498K9353k94276J86521
13533E78575j17744j04239J17370j14246l7207J18960I7577M1335L5504K62527
13523D36943m9951A52780Q7584K70190J46927k38428j44091I4498K58793I2182
13512D26945M0469j96045A13882L78373o1935r2275f1797B26395l2131H6438L35780
13501D22218A68327K16022j55442m119n0058n2985Q0829R2042K18538j22315j50952
13490B39887K4120J46501E4805M82021A86710A9324L05296j5147l7005R9545K4223
13479C96236A77470p5286L37572q2632L2110A93970i1844A20526E8739K41259
13469B99998J64529I8799L15566O7474j60272A12016L48554M2850A87884P3786
$$ plain form
13544 393266 343578 289735 73865 106452 227250 131446 419479 656977 686330 392054 578575
13533 578575 460831 356592 473962 359716 322509 441469 97577 138912 174416 436943
13523 436943 386992 152780 240364 510554 657481 419053 274962 94498 353291 92182
13512 426945 467414 271369 113882 492255 430320 338045 -61797 226395 194264 86438 422218
13501 422218 168327 384349 228907 224788 174730 121745 202574 294616 513154 390839 239887
13490 239887 264007 410508 54805 536826 186710 19324 324620 309473 272468 372013 396236
13479 396236 177470 102184 439756 357124 389234 193970 -91844 120526 58739 299998
13469 299998 464527 98799 414365 481839 321567 112016 460570 503420 187884 261670
13459B61670j4013R549J40643G9316K25632o3280K59658A42272r984K81936b1306
13447A97362K23222j37573a31304C25548q1726I4608K58704A0669K98611A24686
13436B48844P2138n7289M652j22642J30311J45644A56264L03432b7782A33667
13425G5448J91113e0254E19147j75002a10244A37172M6834k6974K2164M2936J47621
13414C69753j42971C2266K72594D2824K73217a59001D28328j72195j18466O2079
13404A99746J76847j46468H5088h8496B71545D8135K57468K3287p9790L11612
13394E60712B07444E2456K89721j33090l9442k7022J52146J03274j17933I563
13383C18810j21947C4190K11886J28208k8640q9694K17795A00858K87105J21116
$$ plain form
13459 261670 247657 257206 397849 79316 304948 241668 501326 142272 132288 414224 -21306
13447 197362 420584 283011 -131304 325548 243822 94608 353312 10669 309280 124686
13436 248844 320982 263693 268345 145703 276014 421658 156264 459696 -27782 133667
13425 75448 266561 -50254 519147 344145 -110244 137172 184006 157032 179196 222132 369753
13414 369753 226782 32266 304860 42824 316041 -159001 428328 256133 137667 199746
13404 199746 376593 230125 85088 -88496 271545 48135 305603 328890 249100 560712
13394 560712 207444 52456 342177 209087 169645 142623 294769 398043 280110 9563
13383 318810 196863 34190 246076 374284 345644 255950 473745 100858 387963 509079
13373E09079k6415A10722O1758M21103B92816j18472J53703q5420l8277a67589
13362A61903J02598B2665A0051L24000F3079J96929K45198G9129K53577j65404
13352A67302J67826N3061A56998F3797L29549j92634J33989A0135M22916N4709
13342D87760k32722c59922C05610J97012D0124a01592D53477A01273c42775A8450
13331B62960j9393N1964p4061q2971k6523R3031q3574E6559K00153M8858r9942
13320B05628a7173C09880J16383J64376k54906o2640m3919M0794q4794m4397M088
13309A44865N8828p5881K82648o4377A13104J72303m334k555j9685H9709M85730
13298E75439A73997N1130o3306C8319L18311n6358F3355L36892A11141a31316
$$ plain form
13373 509079 482664 110722 172480 593583 292816 174344 328047 242627 204350 -167589
13362 161903 264501 22665 10051 334051 63079 260008 505206 79129 332706 167302
13352 167302 335128 388189 156998 63797 393346 200712 334701 10135 433051 487760
13342 487760 255038 -359922 305610 502622 40124 -101592 453477 101273 -342775 18450
13331 262960 243567 295531 221470 138499 111976 205007 121433 56559 256712 305570 205628
13320 205628 -17173 309880 426263 590639 335733 273093 229174 269968 185174 140777 144865
13309 144865 203693 127812 410460 346083 113104 285407 281073 278518 258833 89709 575439
13298 575439 173997 225127 161821 38319 356630 300272 63355 400247 111141 -131316
13287C38043J9887b61834a04870A83404C1091J01057a00387C61532j63823J59412
13277C57121g7937A53852n1616K21231j9350q0069J09630C9237L54184Q9093b28594
13265C27756b661j3880C07458j8009A25961j173K42048j42953H5068C8610J95865
13254B34475g3141B84968j26809O7843o7745L29195B33602f8430b8568B9628N40556
13243E70184A53077A6221k502L59173D6787c223A10783J85631R1163R0095B11537
13231b3598A39103A6232J87857r2370P5380o4084g2884B30798H4290J38730n8761
13220A64259J51008F8070L32225A73353Q9801J15196k3854q4903K20553C8833
13209E1122J27516R7021C5501J09555F6683O3788J58443B424R4527K24039j04972
$$ plain form
13287 338043 357930 -261834 -104870 183404 31091 132148 -100387 361532 197709 357121
13277 357121 -77937 153852 102236 323467 304117 224048 333678 39237 393421 482514 -228594
13265 327756 -2661 -16541 307458 289449 125961 124788 366836 223883 85068 38610 234475
13254 234475 -73141 284968 158159 226002 158257 487452 233602 -68430 -28568 29628 570184
13243 570184 153077 16221 13719 372892 46787 -3223 110783 296414 387577 477672 211537
13231 -23598 139103 16232 204089 111719 187099 123015 -72884 230798 84290 223020 164259
13220 164259 315267 68070 400295 173353 263154 378350 354496 269593 490146 38833
13209 51122 178638 275659 35501 145056 66683 130471 288914 2424 96951 320990 216018
13198B16018D5716K40159j22622a00111C54351j06747D8972d0787B62394a095
13187b26836f8132m5766B30081d8401B10425a32708j42169J14538D6678J5232
13177F1910B1162d873j95260A78204A5008B08M1661d2707C3450L059c3518H8384
13164B68136c5317E3086A5219L29562b80277c1612B32666I8014m4932N0849a66892
13152C5045R4652e8409B8497L19945j70522C4286L44279a783m3559A29417d4039
13140a56918b7442A03184K25765q3894B4460L10127H4205g940B4976a42788A33032
13128C36866N0997A31392J21014a07327C6622L49803a94875C12797h5740A48065
13117B42648q5560L1364L780H2417P024j1477L8228f5968A6299c10944B39658
$$ plain form
13198 216018 45716 285875 163253 -100111 354351 247604 48972 -40787 262394 -1095
13187 -226836 -68132 -113898 230081 -48401 210425 -132708 -274877 -160339 46678 61910
13177 61910 21162 -4873 -200133 178204 15008 208 41869 -42707 33450 36509 -33518 88384
13164 268136 -35317 53086 15219 344781 -280277 -31612 232666 98014 53082 103931 -166892
13152 35045 129697 -58409 28497 348442 177920 34286 378565 -1783 -45342 129417 -44039
13140 -156918 -27442 103184 328949 245055 24460 334587 84205 -7940 24976 -142788 133032
13128 336866 387863 131392 252406 -107327 36622 386425 -194875 312797 -85740 148065
13117 242648 157088 188452 192232 82417 89441 77964 116192 -65968 16299 -310944 239658
13105A35315K51793E6054b06095d7783o3956A32159l9108c52186A6990c72109
13094A09140b18635A13229K96719A9452a85719A08869d0088j09228A32708J64206
13084B96914a69619N6419D14195A60072G765K20539m3440K8206o5878O1504j0975
13073A97721K27087B05669D7012M1961L5524n1689N7884G880a27039A77794J82450
13062C60244n8316C9016J36755l8540J8742b44405B23953K63613i3456A24582
13051D2770M9569b08845H2873J07987K14207e5648B11789H2754c4930j00119A73259
13039h5741C8231K6436P8625L47710j09666e2427E9641J44611F5163R1310d5554
13027A1690A116a82003F1942c942B03920b0888F5890L60269J1124a59761F4513
$$ plain form
13105 135315 387108 56054 -206095 -47783 -111739 132159 93051 -352186 16990 -372109
13094 109140 -218635 113229 409948 19452 -185719 108869 -40088 -149316 132708 296914
13084 296914 -169619 -113200 414195 160072 7765 228304 184864 213070 147192 208696 197721
13073 197721 424808 205669 47012 88973 124497 72808 130692 7880 -127039 177794 360244
13062 360244 301928 39016 175771 137231 155973 -244405 223953 487566 -93456 124582
13051 42770 92339 -208845 82873 190860 405067 -55648 211789 82754 -34930 -135049 173259
13039 -85741 38231 64667 143292 491002 381336 -52427 59641 204252 65163 156473 -45554
13027 11690 1116 -182003 61942 -3942 203920 -20888 65890 426159 437283 -159761 64513
13015B39184K32700B8987J93747J81381c9943C11615A39342h3767A18852L3814
13005A52666a15073G8099Q3869f173A38626M6168K5086B3941K80267e1691A22079
12993A31036f2803A08877a50116A19499O4803H9182b47182B3256K07483G0697
12982a21578C71472G9864b8365k14869I6276b60176A83116J26986a47331B0613
12971H3226P7947l4498J63143q7268b9999A10752a855A98491q0322a08557H8444
12959h3947A05969a1439H9521h6038G2900a28697B48476a91219B0590O5258b2954
12947C9060J97615f2116D133f8608C8644J43655B4877a01237A22174f2239B8366
12935B24228F1696J9406c20004A77454f163G5413M34710a43592N9424I3063P2065
$$ plain form
13015 239184 471884 28987 222734 404115 -39943 311615 139342 -83767 118852 152666
13005 152666 -115073 78099 161968 -6173 138626 184794 209880 23941 304208 -51691 122079
12993 131036 -62803 108877 -150116 119499 184302 89182 -247182 23256 230739 70697
12982 -121578 371472 79864 -28365 -243234 96276 -260176 183116 310102 -147331 20613
12971 83226 161173 126675 289818 202550 -29999 110752 -1855 198491 118169 -108557 88444
12959 -83947 105969 -11439 89521 -86038 72900 -128697 248476 -191219 20590 85848 -22954
12947 39060 236675 -62116 4133 -68608 38644 182299 24877 -101237 122174 -62239 28366
12935 224228 61696 81102 -320004 177454 -6163 75413 510123 -143592 -84168 93063 165128
12924A65128G8652c71215J42932A72442a05817L8104E2117Q8253k3592i9491A32113
12912a41933A77821p568G3273L07928A49704J24594F3186f0952q7893C47564A53159
12900B7877J2405M9863L46359j69076a39376A05654k9741c5045C88102A00315
12889c48566Q1187D64314h9174j16747O9391A62570c49274J44168m1782b9538
12878D58714A23008b09987f1653B8859K92348c2421B76806b16368B76566a18806
12867A23740F0983m198a2125B27381C599f2991K5067B58249L0322E5352d7928
12855a058B85275c6011p7650B89198j28583a23471A42342a56180A10233e5402
12844a02113B28221G2930J18609J2825j2207a09968H0629g852j90880A17441J0822
$$ plain form
12924 165128 78652 -371215 -228283 172442 -105817 -67713 52117 140370 116778 -99491 132113
12912 -141933 177821 170253 73273 381201 149704 274298 63186 -60952 -148845 347564 153159
12900 27877 40282 90145 436504 267428 -139376 105654 75913 -35045 388102 100315
12889 -348566 -267379 464314 -89174 -205921 -136530 162570 -349274 -205106 -246888 -29538
12878 458714 123008 -209987 -61653 28859 321207 -32421 276806 -216368 276566 -118806
12867 123740 60983 56785 -12125 227381 3599 -62991 -37924 258249 288571 55352 -47928
12855 -1058 285275 -36011 -113661 289198 160615 -123471 142342 -156180 110233 -55402
12844 -102113 228221 72930 191539 204364 192157 -109968 80629 -7852 -198732 117441 128263
12833A28263f0038j69343B63102B239K71796b5045A32178B7782c17570C12782
12822A97605G5476b28952A14020a19410A41678A2937b7566j92252f5063j6337
12812h1400k37393b0175D62142b8201j75541a069j72699l38146A48913m4566a68503
12800b5772E9231J93933J9809G5762i5493A6477J71342a0494n4120B35480j02160
12789A33320g6l46058B1364h7574k70382a29467B4796K87702o4407h1596j4567
12778i6163A70962l9062a90476j8688d0173j72293D4607P2805J08304h9709L9094
12767e0615C76810A49806a2147G1240a74738A23111b42336D9514Q2303C4933A0852
12755H2718g6156G691a07159C27969j63285a23967B97374n4755i1797M2325A71450
$$ plain form
12833 128263 -60038 -229381 263102 2239 274035 -25045 132178 27782 -317570 312782
12822 197605 75476 -228952 114020 -119410 141678 12937 -27566 -219818 -65063 -81400
12812 -81400 -318793 -20175 462142 -28201 -203742 -1069 -173768 -511914 148913 104347 -168503
12800 -25772 59231 253164 272973 75762 -95493 16477 187819 -10494 -64614 235480 133320
12789 133320 -76 -346134 21364 -87574 -357956 -129467 24796 312498 248091 -81596 -96163
12778 -96163 170962 131900 -190476 -209164 -40173 -212466 44607 117412 225716 -89709 -50615
12767 -50615 376810 149806 -12147 71240 -174738 123111 -242336 49514 131817 34933 10852
12755 82718 -76156 7691 -107159 327969 164684 -123967 297374 242619 -91797 -49472 171450
12743F8720J40940o1160h2868K2921E6227J35727I3222P8324J57120E9087b610
12731G4897M8098P6230A5398a75675j52103P3132B39595k2562B5646c46649C5539
12719B8853J09323m8356b12490R0378a6203A87211l2844b17731A28770a75160
12708C10361J35848A36426L0187O921M01038b54940F579K55719F8727J0169K38978
12697C17874a68752A05060B5005L00211f8998A57658a30447A12018a22194C6212
12686B31717a6886B87757r1073F0173b92412C44141J07528G334K47318a72017
12675b4603B08885a4086B03710L9501j953E2536f9918A8511d4214o7233j57789
12664b69236B6793h01A39960a43934G4252K56072P950L909A13510a46681B00491
$$ plain form
12743 68720 209660 148500 -82868 -59947 56227 191954 93222 171546 328666 59087 -2610
12731 74897 122995 199225 15398 -175675 -327778 -254646 239595 217033 25646 -346649 35539
12719 28853 138176 89820 -212490 -122112 -16203 187211 154367 -217731 128770 -175160
12708 310361 446209 136426 166613 173534 574572 -254940 6579 262298 68727 78896 317874
12697 317874 -168752 105060 25005 325216 -68998 157658 -130447 112018 -122194 36212
12686 231717 -16886 287757 196684 60173 -292412 344141 451669 7334 254652 -172017
12675 -24603 208885 -14086 203710 243211 241258 52536 -69918 18511 -44214 -111447 -269236
12664 -269236 26793 -801 139960 -143934 74252 330324 338274 342183 113510 -146681 200491
12652a14203C6978J67252K04852b62549q6974B64594i9887M9058A64141G7343
12641C0311K77927q2044I640a48331A56441a45469A74332p9312d204D09688A34671
12629B38108A13334O3546j1850j9228L142b7635L213I9232q179a80082c2402O75
12617c1727A35288i882B44538L40000c69099h9221F1363O9408J27735b1879k18288
12606b40167B42752g8227J0136E7581a5387G9618K79897j20944h3751B49960D4668
12594H3572M6398O5346p8106j8649Q0102f8415C37671a04530H9376J74809a55498
12582a7827l7183l63848h0404F2784K98373E4424O0345J42649f4964A82036l6868
12571A45168c28449a22428n044N7444A9003J87568J25420j06752h6451B08637
$$ plain form
12652 -114203 36978 204230 409082 -262549 -349523 264594 -99887 -50829 164141 77343
12641 30311 308238 226194 9640 -148331 156441 -145469 174332 95020 -4204 409688 134671
12629 238108 113334 176880 165030 145802 148944 -27635 -24422 99232 91053 -180082 -32402 -31727
12617 -31727 135288 -9882 244538 584538 -369099 -89221 61363 130771 258506 -21879 -240167
12606 -240167 242752 -78227 -68091 57581 -15387 79618 359515 238571 -83751 249960 44668
12594 83572 129970 195316 117210 98561 178663 -68415 337671 -104530 89376 264185 -155498
12582 -17827 -55010 -418858 -80404 62784 361157 54424 114769 257418 -64964 182036 145168
12571 145168 -328449 -122428 -127472 -70028 19003 206571 331991 225239 -86451 208637
12560C28940o2263f734A77924C0687R1798J06867f4178a0647m25714D03537c37727
12548f4156A72555I027R6280J51577b73862c2320E6229a52604j32548O2791C7700
12536I6004O307d04101D2295c00090d7200B30553c0177k06056m693a05698k20488
12525c26186R0530j8003a05262M2971A18330k29g5469j66187b1832k23085H7961
12513B4474A0916a23281d2863E3551N201J05592J58186a2721B22599h928E0024
12501A80840B8713K44127a56357C25649B9180a50219C2883b99776f7693m4372
12491a12065M027A38461d1625A12072e7764A92633K0389b48027J20314F8534J01952
12480A70486a19693A74359b1605k03030R9927j71421a24894j33247P4183h4366
$$ plain form
12560 328940 266677 -6734 177924 30687 122485 229352 -64178 -10647 -436361 403537 -337727
12548 -64156 172555 9027 105307 256884 -273862 -32320 56229 -152604 -285152 -222361 37700
12536 96004 102311 -404101 42295 -300090 -47200 230553 -30177 -236233 -240926 -105698 -326186
12525 -326186 -235656 -253659 -105262 -62291 118330 118101 -75469 -241656 -21832 -244917 87961
12513 24474 10916 -123281 -42863 53551 58752 164344 322530 -12721 222599 -8928 50024
12501 180840 28713 272840 -156357 325649 29180 -150219 32883 -299776 -67693 -112065
12491 -112065 -108038 138461 -41625 112072 -57764 192633 213022 -248027 -127713 68534 170486
12480 170486 -119693 174359 -21605 -224635 -124708 -296129 -124894 -258141 -183958 -84366
12469b16421H3592c30774C81547b8333j6758l9206K1662A33851N5110m9510h8359
12457e9044j38806B46101b9611A3279e733D9603L06807R785J04846F5080b5262
12445a21378A53984a21323F3795b7991G6617g4679j93068H9556h2759c0626E6653
12433c46248h4491l48562A19788a03676o6030b9067l59670h3375B80097o121j13069
12422A60907a12103B15039b9263H5543i1209F6269k9989a65920B2221O2948J1380
12411I6549k3712J92125I4952f1179A50215J31589E8236a65556j26470h1636A89348
12399A61221d7344A87413g1238j09105j8445c4100l8404C92639a0566j98519l7236
12388b46321A27819k639J13433o1867C424J4730b34219I5251C2938M9773a38436
$$ plain form
12469 -216421 83592 -330774 381547 -28333 -45091 -84297 -62635 133851 188961 139451 -88359
12457 -59044 -197850 246101 -29611 13279 -5733 49603 356410 366195 471041 65080 -25262
12445 -121378 153984 -121323 63795 -27991 76617 -74679 -267747 89556 -82759 -30626 56653
12433 -346248 -84491 -433053 119788 -103676 -169706 -29067 -388737 -83375 280097 273976 160907
12422 160907 -112103 215039 -29263 85543 -91209 66269 36280 -165920 22221 85169 96549
12411 96549 72837 264962 94952 -61179 150215 281804 58236 -165556 -292026 -81636 189348
12399 161221 -47344 187413 -71238 -180343 -198788 -34100 -72504 392639 -10566 -209085 -246321
12388 -246321 127819 125180 238613 176746 3424 18154 -234219 95251 32938 82711 -138436
12376a93500A15508g1366A29028d6531A65902C2849m894K37900c43870B61703
12365B0872m20d58726L449f2918B4980L0761P8659E6619b08189B0698J42201D706
12352A31757b2786B6895b20275A94763a45634I7055J18245a16297A95262a89287
12341B22614R4777D4227Q6262a17730A08644J53742k2493a85568A94004a20982
12330a14184A24062a76584d5838j40498E4263b42469A28376a13527B17676c11
12319B45194a7243p1547j09238g4689k07199C25282d8543C178a14439B72180a41639
12307A65319h234j79366A39683C6632a61665B5637d6534k30005N95a29512j66882
12296b96394f8543G8759d31492i0632A44594J27516p3848r4501j1746a84915A31223
$$ plain form
12376 -193500 115508 -71366 129028 -46531 165902 32849 27955 265855 -343870 261703
12365 20872 20452 -458726 -455277 -62918 24980 55741 134400 56619 -208189 20698 162899 4706
12352 131757 -22786 26895 -220275 194763 -145634 97055 215300 -116297 195262 -189287
12341 222614 317391 44227 130489 -117730 108644 262386 239893 -185568 194004 -120982
12330 -114184 124062 -176584 -45838 -186336 54263 -242469 128376 -113527 217676 -311
12319 245194 -17243 -88790 -198028 -74689 -281888 325282 -48543 3178 -114439 272180 -141639
12307 165319 -8234 -187600 139683 36632 -161665 25637 -46534 -276539 -275944 -129512 -296394
12296 -296394 -68543 78759 -431492 -90632 144594 272110 198262 103761 92015 -184915 131223
12284A96991p1685c16303E3221R4338A2961a25980c5812c578B57447R744B488
12272B51018J98846j47245d7646B94037j42949e8542B73266G0412J62580a92446
12261G0379i0390j30041A43458N8535b38207C01789G418b28827F56802C12898
12250i5109A23010m9073a24832A4926a64141g0412D1945a24198N5134G3085j1778
12239F1307a11976E5859k2601O2281K2667g9565A77184m2280K1322a87007B91287
12227d9778E00260B21337D3850J19308j409P8208J35397E4816J92963J63377o4697
12216C46459B8436c1508E2172R7251m916R155b11335A59767o183P6391O8470a30143
12203D9467a40090A48800l7311J90353q4780A7013L50094o1205a40283M1031K4668
$$ plain form
12284 196991 125306 -316303 53221 147559 12961 -125980 -35812 -3578 257447 267191 2488
12272 251018 449864 302619 -47646 294037 151088 -58542 273266 70412 232992 -192446
12261 70379 -90390 -220431 143458 201993 -238207 301789 7418 -228827 656802 312898
12250 -95109 123010 73937 -124832 14926 -164141 -70412 41945 -124198 -69064 73085 61307
12239 61307 -111976 55859 33258 95539 118206 -79565 177184 134904 156226 -187007 291287
12227 -49778 500260 221337 43850 163158 161749 239957 375354 54816 247779 411156 346459
12216 346459 28436 -31508 52172 149423 144507 153662 -211335 159767 153584 229975 298445 -130143
12203 49467 -140090 148800 111489 301842 217062 17013 367107 305902 -140283 -99252 -74584
12192g4584C3705L69366C8713r149K27731P519n5157D7202a00398d3324C12462
12180A06477f4730k07792f937H9562d2519B08385q6766f4709A15189K58394F5297
12168C01179r0570b05347a8878j79766A14797a81807I0038K99015j51499a3625
12157H8629g6739D9546A0262N5585j4782c8647A07720B9547a54252E00332A584
12145A0720c8425C0675a77434P3624c3308B29768Q0397D739a79218B00135F5487
12133h2554A04654b20781h366A5177J96064h2708j89820J14527B4564c446G4148
12121a40921J5123d4426A57622G1088b15617F8308a42145A1049m092L22524B1382
12109a7024m440j78140q1076H1951O9597K5008b1784A17744J06702a05169q3936
$$ plain form
12192 -74584 33705 403071 38713 29564 257295 264814 209657 47202 -100398 -43324 312462
12180 106477 -64730 -272522 -6937 89562 -42519 208385 121619 -64709 115189 373583 65297
12168 301179 210609 -205347 -18878 -198644 114797 -181807 90038 389053 237554 -13625
12157 88629 -76739 49546 10262 65847 51065 -38647 107720 29547 -154252 500332 1584
12145 10720 -38425 30675 -177434 -103810 -33308 229768 310165 4739 -179218 200135 65487
12133 -82554 104654 -220781 -8366 15177 211241 -82708 -272528 -158001 24564 -3446 74148
12121 -140921 -125798 -44426 157622 71088 -215617 68308 -142145 11049 6957 329481 21382
12109 -17024 -21464 -199604 -280680 81951 151548 176556 -21784 117744 224446 -105169 -189105
12098a89105i718j04995l5899D4954N4151J24385q9748b15934F8117a4025A70820
12086C0972c7537C49138B8981J03126A1990b90647g6540B6218L25698o1282L10747
12075F01381J021184J11227F43058k09289F2246b2228j37516F2045J10369Q5482
12065B57896a62771I0140N2051L370N5145j0958a49193A61819J78958j61611b68802
12053i0983B19686B4685L35421r3303K2142E9754K7683a64727O0960H3884b13990
12041i1772q3093D5783K005B0688K0168O7955A619a72443H0664a43076A74323
12029i7659j26703A52285D7941R6902e1617j16895k44526F9123M3023f5175E22214
12017B06069h931D5411L3928O0194J38640j33629e43295d8583a1365l01035b3500
$$ plain form
12098 -189105 -9718 -114713 -150612 44954 99105 223490 133742 -215934 68117 -14025 170820
12086 30972 -37537 349138 28981 132107 11990 -290647 -76540 26218 351916 290634 601381
12075 601381 1622565 1733792 643058 433769 62246 -22228 -159744 62045 172414 257896
12065 257896 -162771 90140 142191 145561 200706 189748 -149193 161819 340777 179166 -268802
12053 -90983 219686 24685 360106 266803 288945 59754 87437 -164727 -103767 83884 -213990
12041 -91772 -174865 45783 47788 20688 40856 108811 1619 -172443 80664 -143076 174323
12029 -97659 -224362 152285 47941 144843 -51617 -168512 -413038 69123 112146 -65175 522214
12017 206069 -8931 45411 79339 139533 278173 144544 -543295 -48583 -11365 -312400 -23500
12005a20472B11340k6099o1765d6092J1924j39878A56628b6662l4933C37734j32399
11994B05335m1370b89720A29775A0993d8640a9840A4759f0651q4129B99271b69050
11982A29096B5264d0217j88929a1606C871h5167j09463E362h3122e651j04280
11971a09931A73651h0520C73053f6064A71057a7080j3585A084a79816A26735c72267
11959a42530G4246a80550H4386f1888A88077b75388J04188k79342a24802B9940
11948a56122e6379a7341D04513E0907i4635H3036c02008n1646G0424P1235a01900
11936b45812O5351h3410A86354J23445a9762j94647A9403J51564a12994b3063
11925D13277A63893o520Q0772j11939J4624l2991A103a01172b3887j21534b4787
$$ plain form
12005 -120472 211340 185241 123476 -46092 -34168 -174046 156628 -26662 -61595 337734 205335
11994 205335 163965 -289720 129775 10993 -48640 -19840 14759 -60651 -144780 299271 -269050
11982 129096 25264 -40217 -229146 -11606 3871 -85167 -194630 5362 -83122 -5651 -109931
11971 -109931 173651 -80520 373053 -66064 171057 -17080 -30665 1084 -179816 126735 -372267
11959 -142530 74246 -180550 84386 -61888 188077 -275388 -171200 -450542 -124802 29940
11948 -156122 -56379 -17341 404513 50907 -94635 83036 -302008 -353654 70424 141659 -101900
11936 -245812 -180461 -83410 186354 309799 -19762 -214409 19403 170967 -112994 -23063
11925 413277 163893 157373 238145 126206 140830 107839 1103 -101172 -23887 -145421 -24787
11913E8204Q3826l3843J29090i288I0386Q0208b31924A27516b11750D6525a428
11901A86779B0339L609K04573a00206k9343j9090A65477c5927B82028a18141B57051
11889B820N82491E0679b3084k43688C2726f221E2903a1770r1859G2584J09482
11878A82066c67420R3983j494D0200d17913J89778a0719p9192F7359b16948b3943
11866a66138k49836A51900i8043K163j8427E701J28930a87419j21920J48572C6194
11854F1262a69828K7742N4096C5731K01538g0770k69863A57556n7138c07191J23858
11843a83333o3230j15071c37A03119a97825l917J1893n7405J1461N8094A21305
11831a99789A26669c8552B4236b26194B33837D0027J27569a64211c1770B922a93794
$$ plain form
11913 58204 142030 108187 237277 -9288 90386 170594 -231924 127516 -211750 46525 -1428
11901 186779 20339 23948 228521 -100206 -129549 -148639 165477 -35927 282028 -118141 257051
11889 2820 585311 50679 -23084 -266772 32726 -6221 52903 -11770 -103629 72584 182066
11878 182066 -367420 -273437 -274931 40200 -417913 -228135 -10719 -89911 67359 -216948 -23943
11866 -166138 -415974 151900 -98043 -95880 -114307 5701 134631 -187419 -309339 -160767 36194
11854 61262 -169828 -142086 -87990 35731 237269 -70770 -340633 157556 100418 -307191 -183333
11843 -183333 -246563 -361634 -337 103119 -197825 -201742 -189849 -247254 -235793 -177699 121305
11831 -199789 126669 -38552 24236 -226194 233837 40027 167596 -164211 -31770 2922 -193794
11819H0819d31516A6329a17835j45618A7174G150J0467A504M6156a31016b744
11807h6739A5817J57291c15320A0782a00014j36315B10403G9557O3334m9756B619
11795A37879O3304a34916J1427J0268j12967h6686B37770e1939A94009a6266k21098
11784b37364M6180l5445a12244G1096o693c07387a49344P1192n6602K260n8129
11773a90623G0912B0784L034K9878f331k40401A82575a9850A69900a35333j32624
11762b67957C073L15412B6232e9168k52460a21017C60774i8549B33560a97074
11751h2203B69312b33465B13691I9312c92713C7867h0904B32711a03896G6651
11740A58797o7646h6590k0627A16158i3635E4681c3688k2535B8457c85599D2768
$$ plain form
11819 80819 -431516 16329 -117835 -263453 17174 7150 17617 1504 47660 -131016 -2744
11807 -86739 15817 173108 -315320 10782 -100014 -236329 210403 79557 142891 93135 2619
11795 137879 201183 -134916 -123489 -113221 -226188 -86686 237770 -51939 194009 -16266 -237364
11784 -237364 -191184 -226629 -112244 71096 64403 -307387 -149344 -78152 -134754 -132494 -190623
11773 -190623 70912 20784 23818 53696 -6331 -246732 182575 -19850 169900 -135333 -267957
11762 -267957 3073 318485 26232 -59168 -311628 -121017 360774 -98549 233560 -197074
11751 -82203 269312 -233465 213691 99312 -392713 37867 -80904 232711 -103896 76651
11740 158797 91151 -86590 -107217 116158 -93635 54681 -33688 -56223 28457 -385599 42768
11728A01661K7639d4393J9512C4705c86866B6352N2726L49912H8801J43820r4090
11717A38531b5682A46974l6193j9583a65872d1131C62270c6520a7632F4326b20586
11705B19463o5370G0444j9854P7850m9585J18947a65325g7889l6785D4624a1289
11693e5430B6507g0154r4338B45760D9462a48266A94663J44566E52N0693K51J10072
11681A61568K0663a33404B62528F7729L1906O4885n5134R6957l5234n7241b24710
11669g3861A1185Q8917i2164B6171K89189j05312a68783A2733J4674J98119a0709
11657a83982d2330j31280d2667A94784G8805J8487e6584e622E00579A15047K3521
11646A38568K90002i4366m5643A35566r921a28946B18495A02960B9700g3852A37648
$$ plain form
11728 101661 129300 -44393 -24881 34705 -386866 26352 79078 428990 88801 232621 138531
11717 138531 -25682 146974 110781 91198 -165872 -41131 362270 -36520 -17632 64326 -220586
11705 219463 154093 70444 50590 128440 78855 197802 -165325 -77889 -114674 44624 -11289
11693 -55430 26507 -70154 -164492 245760 49462 -148266 194663 339229 552 51245 51496 161568
11681 161568 182231 -133404 262528 67729 99635 164520 109386 206343 171109 113868 -224710
11669 -73861 11185 100102 -92164 26171 315360 210048 -168783 12733 27407 225526 -10709
11657 -183982 -42330 -173610 -42667 194784 78805 97292 -56584 -5622 500579 115047 138568
11646 138568 428570 -94366 -140009 135566 125645 -128946 218495 102960 29700 -73852 137648
11634A16909n3937i1250A60720Q6222a5722l13885A89682b3001B74352c3087A22318
11622a81081O4953D7220J86736a346k3453C9036a91991B3878K02979I8298a57325
11610b66793B28919d6514a3145j23637q8975a1529k6285j38244A32805K74017
11600D06822B7969c2106A99778D0937Q9917a5628I6120h2284M295r6613h6295
11588E7690E907J2652K95125d1729L167A87305c9526l42302a14516A18945O4517
11577A83462G486a46860f5465H1577Q2528J30369A30707A4700i2910A55052R8144
11566B53196j05703j2133n5123L39414f2670c210A38390K5744N2109a47659g1275
11554e8081j25842O4265A93866b98141a12204j94155F678J07603f3215H6380b02757
$$ plain form
11634 116909 62972 -91250 160720 246942 -15722 -329607 189682 -23001 274352 -33087 122318
11622 -181081 -116128 47220 233956 -1346 -24799 39036 -191991 23878 226857 98298 -157325
11610 -266793 228919 -46514 -13145 -136782 -225757 -11529 -37814 -176058 132805 406822
11600 406822 27969 -32106 199778 40937 130854 -15628 96120 -82284 -77989 -174602 -86295
11588 57690 5907 18559 313684 -41729 -38562 187305 -39526 -381828 -114516 118945 183462
11577 183462 7486 -146860 -65465 81577 164105 294474 130707 14700 -92910 155052 253196
11566 253196 147493 135360 80237 419651 -62670 -3210 138390 164134 216243 -147659 -71275
11554 -58081 -183923 -119658 193866 -298141 -112204 -306359 6678 114281 -63215 86380 -202757
11542h1422o2138g1586C56262a1709A1215J18644a94557C72218j74473C8621J78326
11531B16947D0382K3271J36972j3893R6023d8548C31780e1863C3495i406n896
11520a5302o0556E3877e9570B69959G0626L13869A41651J8601D4966d7061k2948
11509g0009q672E073K34744Q6738A55393J63306a1698A1637R8747B1183K25436
11498B46619c0843E2003g3140B95982J39271c8868C36965J23437k22571P2965
11488C10796o9163q3997b29970G2812L9798j6783J22337J95593a6294B00921a0748
11476B74255K97168A49278g4264C07681P7127f4260C68142A52007n0014J41970
11466B43963R5266j32224q1450D4158J47488I0740K4341L17401e2480A04401L97337
$$ plain form
11542 -81422 -143560 -71586 356262 -11709 11215 129859 -194557 372218 197745 38621 216947
11531 216947 40382 63653 200625 186732 282755 -48548 331780 -51863 33495 -9406 -15302
11520 -15302 -75858 53877 -59570 269959 70626 384495 141651 160252 44966 -47061 -70009
11509 -70009 -78681 5073 239817 326555 155393 318699 -11698 11637 110384 21183 246619
11498 246619 -30843 52003 -73140 295982 435253 -38868 336965 460402 237831 310796
11488 310796 241633 157636 -229970 72812 112610 95827 218164 413757 -16294 200921 -10748
11476 274255 571423 149278 -74264 307681 384808 -64260 368142 152007 101993 243963
11466 243963 339229 207005 125555 44158 191646 90740 115081 432482 -52480 104401 501738
11455E01738B49810d6076E0443K1235g6717A27082K11335A08005K71721A18508
11444a5206B1915J775J21408a04560B05812D5814a46431E6758A6137J22283d9095
11432A29676a07139E8006R2182b26200B74115j00630F1800K7598d6411E2072L4942
11421H7014M4931J96596h5646L4610d893E141a67505A71757c1309l52852B68734
11409i7828l07396A82706c08044I2672d07960E3854f2739I5895C0408K22665E0314
11397b02576M443I0763b3317a0417j51909A14092b47286m3679J35683L3942c6345
11385I5589J43335E8654b96892q4205i7172J9217j553B19947r7741j0538J62788
11374B74456k7225a1057E2053f996A30035M4408R3273a41320A96002H9354J59293
$$ plain form
11455 501738 249810 -46076 50443 71678 -76717 127082 338417 108005 379726 118508
11444 -15206 21915 23690 145098 -104560 205812 45814 -146431 56758 16137 138420 -49095
11432 129676 -107139 58006 150188 -226200 274115 173485 61800 89398 -46411 52072 87014
11421 87014 131945 328541 -85646 -51036 -4893 5141 -167505 171757 -31309 -384161 268734
11409 -97828 -405224 182706 -308044 92672 -407960 53854 -62739 95895 30408 253073 50314
11397 -202576 -198133 90763 -23317 -10417 -162326 114092 -247286 -290965 -155282 -121340 -36345
11385 95589 238924 58654 -296892 -381097 -97172 -77955 -79508 219947 122206 111668 274456
11374 274456 247231 -11057 52053 -6996 130035 174443 267716 -141320 196002 89354 248647
11363B48647c92140J88862A04200g2370l0223C20776b17798c3956C1177h2075
11352b56789i4749C0498L59321a26346F9739K93128p7418d3773L888A87557a2393
11340B72932F6480c7412m651l6972A88453e5453j63712n3733F3014J20006a15926
11328a1306A04283L46A9371b4810q20C10973l2240O7744l2923b11048g8076j03652
11316a81728c309l59403A79990b37132d997k14136b097A12124l9133b27517a9778
11304a55307j9748g9541r2534N9611L2337c3471G522K71721b16310j14548A78870
11292A37080b910A15917i074B34500o1097J2199F4327J86102a23400l6311C0876
11280A19178e696B9344N2940N7424b34355A5524L1605a51641K6460N6797A19829
$$ plain form
11363 248647 -392140 -203278 104200 -72370 -102593 320776 -217798 -33956 31177 -82075
11352 -256789 -94749 30498 389819 -126346 69739 362867 285449 -43773 -39885 187557 -12393
11340 272932 66480 -37412 -42063 -79035 188453 -55453 -219165 -272898 63014 183020 -115926
11328 -11306 104283 104629 19371 -24810 -25630 310973 278733 346477 313554 -211048 -78076 -181728
11316 -181728 -3309 -362712 179990 -237132 -4997 -219133 -2097 112124 72991 -227517 -19778
11304 -155307 -175055 -79541 -172075 -112464 -80127 -33471 7522 279243 -216310 -330858 178870
11292 137080 -2910 115917 -9074 234500 173403 185602 64327 250429 -123400 -159711 30876
11280 119178 -5696 29344 82284 139708 -234355 15524 47129 -151641 -125181 -68384 119829
11268i2834o0864c5938j94628J06476N8972l38140a59316P1021B95309b68514
11257A04720n1787a00437O497M0312C64809e1121m64285I4046b04796f8082F3954
11245H6422C4347h9308A14598d3444A96409b8911A49081b85208L2900D3762K19958
11234B63720a1895j67183A7588L535b50742A87932b68097A2180b22469R2339L6444
11223i3686j2512b6698j48850r9092a03993B3245R9383m3808A5224a69224L0296
11212a38928b710C88725a2826n869o2082j22789A2475e5037r7909l2155F4400
11200a00166q5704A62024J8422i8848n7744J1362I8245c01052J04093L2331e1141
11188A07485a3486A04169J35215A00312a1038A45927b73865A94045a25117B5502
$$ plain form
11268 -92834 -153698 -35938 -230566 -124090 -65118 -403258 -159316 -88295 295309 -268514
11257 104720 52933 -100437 -93940 -53628 364809 -51121 -515406 94046 -204796 -68082 63954
11245 86422 34347 -89308 114598 -43444 196409 -28911 149081 -285208 -252308 43762 263720
11234 263720 -11895 -179078 17588 21123 -250742 187932 -268097 12180 -222469 -130130 -93686
11223 -93686 -106198 -26698 -175548 -274640 -103993 23245 122628 78820 15224 -169224 -138928
11212 -138928 -2710 388725 -12826 -18695 -80777 -203566 12475 -55037 -152946 -185101 64400
11200 -100166 -185870 162024 180446 -98848 -156592 -145230 98245 -301052 -196959 -164628 -51141
11188 107485 -13486 104169 239384 100312 -11038 145927 -273865 194045 -125117 25502
11177I1862b7955k46403J16820d3968C21501c83897c5498q3234D4387J15368d00124
11165B0555f05B76942h2882B29286G4065J01980b7187j75298g3789l1368A83700
11153b59649c7120A2703b797o0329j68420A22357c09036G9792b9573k26711J27117
11142a29167E9154f1701A9692J11369b02351O2732d3598e790j11965C31176F0836
11130c16051I6781b56355j33552h719A33866K15350b32670A10473M5176b02284
11119i108I485e5664n9103C21427b1618k46891B70473G88i7724A10271h9527A96751
11106A37479K08158Q4006j38892D6071K0844f7719m9420D38494p4579N1758A23271
11094A49639l0012K2069P5282J56396G5608M8682m2728b2211B22146H1787J64461
$$ plain form
11177 91862 -27955 -274358 -157538 -43968 321501 -383897 -35498 -118732 44387 159755 -400124
11165 20555 -605 276942 -82882 229286 74065 176045 -27187 -202485 -73789 -105157 183700
11153 -259649 -37120 12703 -2797 -63126 -231546 122357 -309036 79792 -29573 -256284 -129167
11142 -129167 59154 -61701 19692 131061 -202351 -139619 -43598 -5790 -117755 331176 60836
11130 -316051 96781 -256355 -389907 -8719 133866 349216 -232670 110473 155649 -202284
11119 -9108 9485 -55664 -114767 321427 -21618 -268509 270473 788 -97724 110271 -89527 196751
11106 137479 345637 429643 290751 46071 66915 -67719 -117139 438494 363915 415673 123271
11094 149639 119627 141696 216978 373374 75608 124290 81562 -22211 222146 81787 246248
11083B46248H4757a2955E16276A48980k2392E7771f5394B91330K3885j09766n0091
11072A55358L27567A90667O723J24371M59226C47087C6126J33931J85960n6600
11062B99417K07746k3724L24272k84749N2409Q8932k01703L53748B68063m5941
11052B22122L07586j79516N79496m31039l530K7517L07991k09585o280N111J56645
11041G76518k14001J73769K8601l32860J26813J00449J6131P0569l5952k7179
11031F82858k11884K14105j88372N03327m89829m2235O88716D86482J86462k53198
11021D19746L25384k6417q3363B74639J56450K45397j2716F0716L98766L20293
11011G79775l85682K28021j93767M16023l04479O2768K9515O2332o724j54834
$$ plain form
11083 246248 84757 -12955 516276 148980 126588 57771 -65394 291330 315215 205449 155358
11072 155358 482925 190667 197390 321761 780987 347087 36126 170057 356017 299417
11062 299417 507163 483439 807711 522962 575371 664303 462600 816348 268063 222122
11052 222122 529708 350192 929688 498649 495119 522636 830627 621042 614762 619873 776518
11041 776518 562517 736286 764887 432027 558840 659289 675420 745989 710037 682858
11031 682858 470974 685079 496707 1000034 510205 467970 1156686 486482 672944 419746
11021 419746 745130 718713 635350 274639 431089 676486 663770 60716 459482 779775
11011 779775 394093 622114 428347 844370 539891 602659 632174 694506 687782 532948
11001E32948k40988L42877O0285k45109K54693K06622D16565O4592Q8983j18014
10991D52126M9538K55758k50634o2744L71819j92356M67674k01467L08115k71007
10981I26822j1826J61124K10102L27350j33120M23340Q6586N1582J87630J18320
10971B347910K52242k29223j99042Q6989l45197j08338P6166q0056j06671k13630
10961A481150J61241Q5104N1266k7177j30604J39253j9480l652j85467j70036
10951A381598m35975L51790l35258m53160K40423B47675M23289n8947B55508p8706
10941A76802J7561n6999A9707Q7034J55061j21838b77683B2697i5839D946g8333
10929d201k71318H1076J28883J02572d310A72309q5097b92379c4931I3675L0590
$$ plain form
11001 532948 291960 634837 695122 450013 704706 911328 416565 481157 570140 452126
10991 452126 501664 757422 506788 444044 815863 623507 1091181 889714 1197829 926822
10981 926822 914996 1076120 1286222 1613572 1480452 1903792 1990378 2041960 2229590 2347910
10971 2347910 2600152 2370929 2171887 2258876 1913679 1805341 1881507 1801451 1694780 1481150
10961 1481150 1642391 1727495 1778761 1751584 1620980 1760233 1740753 1737101 1551634 1381598
10951 1381598 945623 1297413 962155 508995 749418 247675 670964 612017 255508 176802
10941 176802 194363 137364 19707 106741 261802 139964 -277683 22697 -95839 4946 -78333
10929 -4201 -275519 81076 209959 312531 -4310 172309 87212 -292379 -34931 93675 124265
10918A24265E4850J49081f8123p8630L3890J8838A43863a52048A45675q303b25037
10906d4219C0445K85191R0300B010b79296B7547K11608a60172A74841G7398L7773
10895A15171a69382N3069M5298Q778K2854r5160d8611k42448a21505A61327m5173
10884A16154A2576R4731f8674k00240f2201j6867D76884a97667k5806B73467c91654
10872B26528p0478J7820d9273j2370k5676H6493b38108A26927E8841C222a1758
10860e0446j02645B6512h3918A93683r1229J20457E3374J53249l9417C8054K6661
10849F4715B0266c5847A51720J94507b83106J11863E0075c56282B36319a88406
10838a02445p4361B01348J41030a07815a1441B47125e1206m665E1971K13471m3687
$$ plain form
10918 124265 54850 203931 -68123 -146753 -112863 -94025 143863 -152048 145675 137372 -225037
10906 -44219 30445 315636 405936 2010 -279296 27547 239155 -160172 174841 77398 115171
10895 115171 -169382 -116313 -71015 -62237 -39383 -134543 -48611 -291059 -121505 161327 116154
10884 116154 12576 107307 -68674 -268914 -62201 -79068 476884 -197667 -223473 273467 -391654
10872 226528 156050 173870 -49273 -61643 -87319 86493 -238108 126927 58841 3222 -11758
10860 -50446 -153091 26512 -83918 193683 102454 222911 53374 206623 167206 38054 64715
10849 64715 20266 -35847 151720 346227 -283106 -171243 50075 -356282 236319 -188406
10838 -102445 -176806 201348 342378 -107815 -11441 247125 -51206 -55871 51971 265442 221755
10827B21755e6889J9769A93373a016l3003G6368a08477D7905b6714B39086j14216
10816A24870b08319A60347a94613j98019a28091A99709H9228O7655C7058d08019
10805a06888A2952b02258f994k43354i2613j6798J0629j8003J0427K2645j07102
10794a90815K4054O8971l58388J91409a18643k30096A30810J0344a32353A3539
10783c73965E1418a17165J0147F8687c2486A46644a62107j80163C5176J30915
10773A66091i1476G5837f6162l36391A6763a89456K1968k08289B68143a34792
10762C3978j5547d35634a8496A4616E741J83812l0989a50250C0011M619J08922
10751A43552c12984f2497j67548h0540A69265B7459K6428N3361O6627L6668A4360
$$ plain form
10827 221755 -56889 -37120 193373 -1016 -34019 76368 -108477 47905 -26714 239086 124870
10816 124870 -208319 160347 -194613 -392632 -128091 199709 89228 156883 37058 -408019
10805 -106888 12952 -202258 -6994 -250348 -92613 -109411 -98782 -116785 -106358 -83713 -190815
10794 -190815 -166761 -97790 -456178 -264769 -118643 -348739 130810 141154 -132353 13539
10783 -373965 51418 -117165 -107018 68687 -32486 146644 -162107 -342270 35176 166091
10773 166091 -91476 75837 -66162 -402553 16763 -189456 -167488 -375777 268143 -134792
10762 33978 18431 -435634 -18496 14616 5741 189553 158564 -150250 30011 34630 143552
10751 143552 -312984 -62497 -230045 -80540 169265 27459 53887 107248 173875 210543 14360
10739a423B26272b3091k06037d0741M577A3663c85444a36594c5479l07977a39543
10727a62587A29402J80928A54078b6961C46413A49744a68206C0912c41560G3468
10716F5510a32829k68469e9559j52961H6915a20120L2097A3888J13112B7455a07556
10704A0768d961A06466J21670G7016b77762O2162A79274c55621B60416i3773j11280
10693b05053o6446A0897J29769M0761D2739a83046g4850j8026r381A34029g5164
10681B81092h9328A00511d2776k31955J00393p2675r52H62J05854D41J17707m4830
10669G3318b3678A58265g3290j22083D7093P5612J13013j14222h7500n2767e6146
10657b33013i2899m668P691k2444k31671g7046F6663a02273B24718d7902B8260
$$ plain form
10739 -1423 226272 -23091 -229128 -40741 -36164 13663 -385444 -136594 -35479 -343456 -139543
10727 -162587 129402 310330 154078 -26961 346413 149744 -168206 30912 -341560 73468
10716 65510 -132829 -401298 -59559 -212520 86915 -120120 -88023 13888 127000 27455 -107556
10704 10768 -4961 106466 228136 77016 -277762 -215600 179274 -355621 260416 -93773 -205053
10693 -205053 -271499 10897 140666 181427 42739 -183046 -74850 -92876 -102257 134029 -75164
10681 281092 -89328 100511 -42776 -274731 -174338 -247013 -247965 862 106716 441 118148 73318
10669 73318 -23678 158265 -73290 -195373 47093 122705 235718 121496 -87500 -140267 -56146
10657 -233013 -92899 -97567 -89876 -112320 -343991 -77046 66663 -102273 224718 -47902 28260
10645c62703a57695a0451A63951f5491j11864E7191J65997b6599K240k23654A19010
10633I3303a14192j26137A2285c04726A56463i0066d438k42403h3638a3989I2492
10621A53332a13170c9223n0431B29175k5715c26293i7335j90165C3659a82967
10610a40492k21264J18333d622j40029A96255d3750r359k27738I8550e7021j24725
10599a81746j079B84167A22597k6793B0686J05897a29090b524j668A49345c48428
10587A06085L27614b05040N1395e2403r6597g1824B15685G6858a26467j91129
10577c17596a19864l21128a4419A08765b1443l3901n6391B8815J49365j8477h0501
10565f1334A02577b8016I4668P4877n8024P5647i4873A68013a92110O4381A69372
$$ plain form
10645 -362703 -157695 -10451 163951 -65491 -177355 57191 223188 -26599 -24359 -248013 119010
10633 93303 -114192 -240329 12285 -304726 156463 -90066 -4438 -246841 -83638 -13989 92492
10621 153332 -113170 -39223 -89654 229175 203460 -326293 -97335 -287500 33659 -182967
10610 -140492 -361756 -243423 -4622 -144651 196255 -43750 -53109 -280847 98550 -57021 -181746
10599 -181746 -182825 284167 122597 95804 20686 126583 -129090 -2524 -4192 149345 -348428
10587 106085 433699 -205040 -153645 -52403 -149000 -71824 215685 76858 -126467 -317596
10577 -317596 -119864 -440992 -14419 108765 -21443 -55344 -111735 28815 178180 159703 -80501
10565 -61334 102577 -28016 94668 169545 111521 187168 -94873 168013 -192110 -127729 169372
10553B14619A3346b77192j4469Q6215H3490b56433d1700B98662a83415R1143k05976
10542b98248A75765c1246a09A4297J39067c799j03556n4480C3011b01691L0629
10531a71062a211A29285C376a94836m4696E7371a22820j11703f1723k32063d5686
10519c8118F4654a76120M9734b5360n1871p2907K0438B55029a8862l7425E1647
10507i8352B67235i5178M2993J6032k58022H5365a15303J8809j08098R8641A77667
10495c1895j61161g8118A25617l3761l6780K27639H3688J26697b67598g0406A28705
10483B55362J5236K14807J07018B02881P8537j3177a61833C9762Q5688J4333d8667
10471B19571a42243j9673H890K7935R1650k8202b88355F4273P4814D3458a00319
$$ plain form
10553 214619 13346 -277192 -291661 -205446 83490 -256433 -41700 298662 -183415 -92272 -298248
10542 -298248 175765 -31246 -109 14297 153364 -3799 -107355 -161835 33011 -201691 -171062
10531 -171062 -1211 129285 3376 -194836 -239532 57371 -122820 -234523 -61723 -293786 -45686
10519 -38118 64654 -176120 -126386 -25360 -77231 -150138 -129700 255029 -18862 -56287 51647
10507 -98352 267235 -95178 -52185 -36153 -294175 85365 -115303 -96494 -204592 -105951 177667
10495 -31895 -193056 -78118 125617 91856 55076 282715 83688 210385 -267598 -70406 128705
10483 255362 270598 485405 592423 202881 281418 268241 -161833 39762 125450 139783 -48667
10471 219571 -142243 -161916 8890 36825 128475 100273 -288355 64273 139087 43458 -100319
10459A97112K5706b44296E0859d4682m7532B17245A5638a15743B35235a66237
10448I8832a45608a7182j57351m052E2935f9958B10968a32685N1776a828B14827
10436A78026J8386l4385b08298D9775a7223A48135K47J136a8047k05322c2675
10424a85953B24715e8159C54097b57908g0855I24a392j63203J7669B7810c67150
10412C5026J61299c3491B65718E8454a83789A91640i7313c4312A59624J66566
10402C26190b62462C5939d3082A22580J13342e9009o6266j12014c4115B0560a10297
10390c83144A31835a3357n7648F2634k0734b526A73388C9145J72584m2947D0833
10378B23265L19166j58587A18876K13210H0554J17515J23651j19974H7441J09613
$$ plain form
10459 197112 222818 -244296 50859 -44682 -92214 217245 15638 -115743 235235 -166237
10448 98832 -145608 -17182 -174533 -178585 52935 -69958 210968 -132685 -80909 -1828 214827
10436 178026 196412 162027 -208298 49775 -17223 148135 148382 149518 -18047 -223369 -32675
10424 -185953 224715 -58159 354097 -257908 -70855 924 -1392 -164595 -146926 27810 -367150
10412 35026 196325 -33491 265718 58454 -183789 191640 -97313 -34312 159624 326190
10402 326190 -262462 35939 -43082 122580 235922 -59009 -125275 -237289 -34115 20560 -110297
10390 -383144 131835 -13357 -71005 62634 41900 -2526 173388 39145 211729 168782 40833
10378 223265 542431 383844 118876 332086 80554 198069 321720 201746 87441 197054
10368A97054N12I5543K01760J99423a48367D41095B03480K18387K4964k16192
10358B30639J97487E4246c6136C0179J91246K29221D9730Q2171J43624K2445L27097
10347F25067A44837F8630Q0846L71534j20815F8510L3557K18890M5021j5333B8080
10335A79037j4126f6401l33806C61767m8246E4206K70485b44715F3747K6426J55214
10324B45387b89942F32504k82383n5440o7337J65061I439L803R0098h0723C0129
10312A85938a23280F5214a74586A14804K43948a19480A39264d87340B2258c54851
10301h7619A55142G350a56733E1341M9970J40062o3698f549a90A29575m9361a21246
10288B9222f377A13149E0436K83064B7371J638J86755a10026c4784c799C8819
$$ plain form
10368 197054 197566 95543 297303 496726 -148367 441095 203480 421867 446831 230639
10358 230639 428126 54246 -36136 30179 221425 450646 49730 131901 275525 297970 625067
10347 625067 144837 68630 149476 521010 400195 68510 102067 320957 365978 350645 28080
10335 179037 164911 -66401 -400207 361767 313521 54206 324691 -244715 63747 90173 245387
10324 245387 -289942 632504 350121 294681 227344 392405 9439 13242 103340 -80723 30129
10312 185938 -123280 65214 -174586 114804 358752 -119480 139264 -487340 22258 -354851
10301 -87619 155142 7350 -156733 51341 101311 241373 177675 -6549 -190 129575 80214 -121246
10288 29222 -6377 113149 50436 333500 27371 29009 215764 -110026 -34784 -3799 38819
10276a68457A02857c6614j48475A92496b44279k97010G257L0079b47595F7066
10265a17797A50206F5043J34830a40847C82027j68667J28292m0371F9580A3517
10254C18864A2458P5751a39839j12453A07057a8718k5882k57552G5868P1534J27380
10243B74782e9351E201L5673a91710i3604k08190J11323A37120l5397a3822j15054
10232a28876D6927J28342a4207E6915a55601O3285j1502D82732c4977p5228K8762
10221h1443A71202b50260D7301q300J766g922j64612B15612f4939k10174L2987
10210b42126J01209q209f5275C1692J3283d59109e4555A03557J10956d8434E2364
10198e9243A27612d4478j91892J4922C25997a81704j78028A16869b37683i6720
$$ plain form
10276 -168457 102857 -36614 -185089 192496 -244279 -541289 7257 37336 -247595 67066
10265 -117797 150206 65043 199873 -140847 382027 213360 341652 301281 69580 13517
10254 318864 12458 88209 -139839 -252292 107057 -18718 -44600 -302152 75868 147402 274782
10243 274782 -59351 5201 40874 -191710 -93604 -301794 -190471 137120 101723 -13822 -128876
10232 -128876 46927 175269 -14207 56915 -155601 -92316 -103818 482732 -34977 -110205 -81443
10221 -81443 171202 -250260 47301 39001 40767 -7922 -172534 215612 -64939 -275113 -242126
10210 -242126 -140917 -149126 -65275 31692 44975 -459109 -54555 103557 214513 -48434 52364
10198 -59243 127612 -44478 -236370 -221448 325997 -181704 -359732 116869 -237683 -96720
10187a00175B62181O9619j12247d42291e3225C66441a78586K9195j16897C00729
10176b81448l6016h2390j08920j09873o6754e5216A06860Q3647F5056A8643J02696
10165A21339c0203j5026A91011h4646k0364j84757K6077L4968Q8781e4015o5871
10154a19886M1973q7988e4731a0255l58772A90138b95519J12921O9110l6799G1199
10142b13496B91689h5443j3115j83074N0050A43390a40248j82579d5913M735q9846
10131a31024o9647k0131r1418j24597F8035a12970d0460j89404G4145a52400o6716
10120b19116A03233J1450E5732b37835A310L5595b95074e6492k58627r208A25196
10108A21071J2139J58305b20628r2046B32585B7361K52156a25029A71375C9513
$$ plain form
10187 -100175 262181 331800 219553 -442291 -53225 366441 -178586 -149391 -266288 300729
10176 -281448 -317464 -82390 -191310 -301183 -367937 -55216 106860 190507 65056 18643 121339
10165 121339 -30203 -45229 191011 -84646 -105010 -289767 -263690 -228722 -139941 -54015 -119886
10154 -119886 -77913 -165901 -54731 -10255 -369027 190138 -295519 -182598 -113488 -150287 71199
10142 -213496 291689 -85443 -98558 -281632 -231582 143390 -140248 -322827 -45913 -41178 -131024
10131 -131024 -200671 -220802 -312220 -436817 68035 -112970 -40460 -229864 74145 -152400 -219116
10120 -219116 103233 114683 55732 -237835 1310 36905 -295074 -56492 -315119 -324327 125196
10108 121071 133210 291515 -220628 -312674 232585 27361 279517 -125029 171375 39513
10097A43425a10172A15059a62651e0065m5372M6302j28057I4363l6243a42364
10086A29062b90897D7172h4013B7175e0366K3667k41716A7028a77189O9723j5589
10075a23055A72573e41725g9751B88024e8227d803l61754f1698j41556i0398A95953
10063B312Q1115G931a70518B07928o8137g0194A0906h5540F3358O6398a15424
10051d8137k76633J44752j17967f0764j72158j38486B6634f02955a76385C5950
10040e5414j4443m4980c2466j62132B31934a93962k72368A46550K04095j10133
10030B40512e21532K57642D7208g1784k66446A74623c41470d0048l6034n1156
10020a27238b5195J2030B1245J77122b35634P8544A5909c41308a24116A09189
$$ plain form
10097 143425 -110172 115059 -162651 -50065 -95437 -49135 -177192 94363 58120 -142364
10086 129062 -290897 47172 -84013 27175 -50366 -26699 -268415 17028 -177189 -107466 -123055
10075 -123055 172573 -541725 -79751 288024 -58227 -4803 -366557 -61698 -203254 -90398 195953
10063 2312 83427 7931 -170518 207928 139791 -70194 10906 -85540 63358 129756 -115424
10051 -48137 -324770 -180018 -297985 -60764 -232922 -371408 26634 -602955 -176385 35950
10040 -55414 -69857 -114837 -32466 -194598 231934 -193962 -466330 146550 350645 240512
10030 240512 -521532 -263890 47208 -71784 -338230 174623 -341470 -40048 -76082 -127238
10020 -127238 -25195 -13165 21245 198367 -235634 -157090 15909 -341308 -124116 109189
10009B48788h3652r3541k14678a15750A2773f8980K5983j88021Q0434F5426c9565
9997c11826g8298m145l63453A99741I0161a33399j63159c7114j04799B10021k0191
9986A89830r0534i8641G3897A3378b25949C7003a10689A60256A2070a57991A78613
9974a7511m02829I8576J26939a37484A00095d09239A88219a68921j25803A85811
9963A26905i6364G8147c11053J17475P4574j05115B82667c83651B1483c8903A95429
9951E1800d4360I1413k080A4101J08833c2394r3379F6311d49347d1026j88897
9940b29923L7202g5422j5699A76890q2225C7577A1277a65099N6828A65552a92262
9928D23727a28491j20536I5079h6853A63869e8121C7389K45736G1411M4164K58906
$$ plain form
10009 248788 -83652 -177193 -391871 -115750 12773 -68980 -42997 -231018 -150584 65426 -39565
9997 -311826 -78298 -82443 -445896 199741 90161 -133399 -296558 -37114 -141913 210021 189830
9986 189830 99296 -98641 73897 13378 -225949 37003 -110689 160256 12070 -157991 178613
9974 -17511 -420340 98576 225515 -137484 100095 -409239 188219 -168921 -294724 185811
9963 126905 -96364 78147 -311053 -193578 -119004 -224119 282667 -383651 21483 -38903 195429
9951 51800 -44360 91413 89333 14101 122934 -32394 -125773 66311 -449347 -41026 -229923
9940 -229923 -192721 -75422 -91121 176890 94665 37577 11277 -165099 -108271 165552 -192262
9928 423727 -128491 -249027 95079 -86853 163869 -58121 37389 283125 71411 115575 374481
9917C74481C4286b9300D8325b93033K7495d2979l1020A82616M5152a6415j02357
9906a18772L8365B1430b64660A2404b00041A1628a92538M5202j56326f487D4740
9894b67706a13867Q627j64421k5861i4164G4871a98870j60834d9460j77199d2812
9882b35379d2745A49616l6621B9638J29558C5807b2142O150k0207k49840j27043
9871d13082a08139q5033L8951O6269E502a54435A6966d9710k78663J42662B5299
9859a71306j6993L7643K7794j35477b6390l2892j53340B31514A06536a25377A49771
9847f8872q8052m6285o0468G5998J5774l0104g5461j42759j53330h6714n0169
9836a36883q7772G1268J57679P0802a75137Q2644o1493o961e1373k39058A29681
$$ plain form
9917 374481 34286 -29300 48325 -293033 -265538 -42979 -73999 182616 227768 -16415 -118772
9906 -118772 -80407 21430 -264660 12404 -200041 11628 -192538 -147336 -303662 -6487 44740
9894 -267706 -113867 -105240 -269661 -295522 -94164 74871 -198870 -359704 -49460 -226659 -42812
9882 -235379 -42745 149616 112995 29638 159196 35807 -22142 -15992 -36199 -286039 -413082
9871 -413082 -108139 -193172 -154221 -87952 5502 -154435 16966 -49710 -328373 -185711 25299
9859 -171306 -188299 -150656 -122862 -258339 -26390 -59282 -212622 231514 106536 -125377 149771
9847 -68872 -156924 -203209 -263677 75998 91772 61668 -75461 -218220 -371550 -86714 -136883
9836 -136883 -224655 71268 228947 299749 -175137 -92493 -153986 -160947 -51373 -290431 129681
9824a70252B851c3136r3448A44113a51302b3772C29026F0646c83550b3554j34942
9813a58496P2178B71617a66450L7874j53910A85448a16507r6198l1169A21936
9802a14574L5542j07797k43630N5119A09679k5473a1181j08381k77331C7068a06295
9790e8386p0900H8223a55217d7274o59j47925f3797G6540h3838D1012a38645j90525
9778c29170i894j97454j31549m1820a51386n5530B50415a43440r0307K7026e2873
9766B11033b46117O2436A02304a55978B48692b42442A75386d35348B2259Q4460
9756A06719B8924b93472a23898F7115J7569K9873D7709b16021m449L2714K9095
9745a58661A53129b62972Q7538c1887C28353d35461K01774A26361c5661j48709
$$ plain form
9824 -170252 2851 -33136 -126584 144113 -151302 -23772 329026 60646 -383550 -23554 -158496
9813 -158496 -86318 271617 -166450 -128576 -282486 185448 -116507 -212705 -243874 121936
9802 -114574 -79032 -186829 -430459 -375340 109679 84206 -11181 -119562 -396893 37068 -106295
9790 -58386 -129286 88223 -155217 -47274 -47933 -195858 -63797 76540 -83838 41012 -138645 -329170
9778 -329170 -9894 -207348 -338897 -380717 -151386 -206916 250415 -143440 -233747 -206721 -52873
9766 211033 -246117 -183681 102304 -155978 248692 -242442 175386 -435348 22259 106719
9756 106719 28924 -293472 -123898 67115 84684 114557 47709 -216021 -220470 -187756 -158661
9745 -158661 153129 -262972 -175434 -31887 328353 -435461 -233687 126361 -35661 -184370
9735a84370f1822m03683a43513N2853j65335k4259f6886A88062b58523F0158b63522
9723E8822c38141D7629b6490l4989k03590B01473b53201r8282A48327b8251r9364
9712a27615j462M0579n2071J4600j1090N3237n8148A2716b19676G3739L1496i3339
9699a55219B6568c9529a0123E8187i1289E9085i0604k3105k7951b5453B97784
9687b15269B37771A206K35716Q4582H4238l1610J18860b03547i3317b1101N23
9676b0578A5473P4434K9959E9608O4790b0717j84164K8690b8929Q807I9485a11944
9663a32893B36546c83821A11522a24421j45949D3305a36476j64003j1430i6673
9652c26645A37160b105j03411l19569E0689a11188L6524B50009I0991e3988l0322
$$ plain form
9735 -184370 -61822 -465505 -143513 -90660 -255995 -280254 -66886 188062 -258523 60158 -263522
9723 58822 -338141 47629 -26490 -61479 -265069 201473 -253201 -351483 148327 -28251 -127615
9712 -127615 -129077 -88498 -140569 -125969 -137059 -83822 -141970 12716 -219676 73739 105235 -93339
9699 -155219 26568 -39529 -10123 58187 -91289 59085 -90604 -113709 -141660 -25453 297784
9687 -215269 237771 1206 236922 321504 84238 52628 171488 -203547 -93317 -21101 -20578
9676 -20578 15473 89907 119866 59608 124398 -20717 -204881 -176191 -28929 -20122 99485 -111944
9663 -132893 236546 -383821 111522 -124421 -270370 43305 -136476 -300479 -311909 -96673
9652 -326645 137160 -2105 -105516 -425085 50689 -111188 -74664 250009 90991 -53988 -84310
9641h4310A48298b9694J1833D7803b8583m58603B72622E6017a18345B88877d8364
9629f8826k0294C40426A02894N1215a91849A64395n8740J57878h2057q9220G1752
9617a37458r9127P7677n9927r7134e165j26308l3560d716B5749a94189G1000a83340
9604A9462a72216O7021D7232h4835m8866D0921a9822j79509a2990k02333i326
9592G0449i040j64543B26311d60950A03728A9896J11031m9063g8327c5551k46683
9581b82234B03694a13266j51785A10826K2983b12584b740l11994F686i6546k45185
9570c41731d3609B07450n7214a27459N6460c4183j28936q300j8793p174B897o47
9558B250J3626d86902e9550B29904a05662A25272K4195G1132f1615q3404O6437
$$ plain form
9641 -84310 148298 -29694 -17861 47803 -28583 -487186 272622 56017 -118345 288877 -48364
9629 -68826 -89120 340426 102894 154109 -191849 164395 105655 263533 -82057 -171277 71752
9617 -137458 -236585 -158908 -218835 -315969 -5165 -131473 -165033 -4716 25749 -194189 71000 -183340
9604 19462 -172216 -105195 47232 -84835 -133701 40921 -19822 -199331 -12990 -215323 -9326
9592 70449 -9040 -173583 226311 -460950 103728 19896 130927 81864 -78327 -35551 -282234
9581 -282234 203694 -113266 -265051 110826 133809 -212584 -2740 -314734 6686 -96546 -341731
9570 -341731 -43609 207450 150236 -127459 -70999 -34183 -163119 -171419 -190212 -197386 2897 2250
9558 2250 15876 -486902 -59550 229904 -105662 125272 149467 71132 -61615 -145019 -78582
9547g8582A99768b35907B9202P1141j1693J11636b73370n7112B24629n701c33116
9535E5682a40877O2540k1762A88360A7422b03754d4426A2831a8113l62740A44121
9523a67294i515o7885k177A81462a51011a1349j4964j70028l54661a71750L923
9512a67827A41894i9508k03867B33940F4243g0656E3044a27054O2371f775A55886
9500B38143O8896C315c48528j5523D55914h9307A62561a09361J4829A21502e6816
9488D7498L11022b43959l4789b8892n16656D10579a65176D03J20210c23254k83765
9477f07019K64462j33059a49498G4742a74803m5803j44790A8820d85157C8691
9466h2708j65854f1201C8255M699K08310g3902F4113a49816a2864r2076A33516
$$ plain form
9547 -78582 199768 -235907 29202 100343 88650 200286 -273370 -330482 224629 218928 -333116
9535 55682 -140877 -78337 -100099 188360 17422 -203754 -44426 12831 -18113 -380853 144121
9523 -167294 -9515 -77400 -79577 181462 -151011 -11349 -26313 -196341 -551002 -171750 -167827
9512 -167827 141894 -99508 -303375 233940 64243 -70656 53044 -127054 -64683 -6775 155886
9500 238143 307039 3315 -348528 -364051 455914 -89307 162561 -109361 -94532 121502 -56816
9488 47498 358520 -243959 -278748 -28892 -545548 410579 -165176 403 120613 -323254 -607019
9477 -607019 -342557 -475616 -149498 74742 -174803 -220606 -365396 18820 -485157 38691
9466 -82708 -248562 -61201 38255 42954 251264 -73902 64113 -149816 -12864 -104940 133516
9454A27317c48223B8440A0479c09919C29648b97251g1487j44935m3484f981j59334
9443a66315N8685A26278d76396c6660j15058A56731a75453e3072A66217d20765
9432h1980j542A24967L7715h9107j41339E06479j34432a13158B08770k4205c1562
9420A08339J1061b60390l6071B0030i6472d7784j43873c2152A36667h263o079
9409a4342I4612d87097a52323k7320M6368N6404r0436A63588c32817a14480A21012
9397a8629l70673a18636F0931f3894J558A32555i6431D5836B2825a08924j64513
9386b73437e1575B2822a01766c753j56528k02815A16999N963d71734A43206E3459
9374B3954e1500B15274E5638B3250L07932c84958N9868a33212n3227F0871A9905
$$ plain form
9454 127317 -348223 28440 10479 -309919 329648 -297251 -71487 -216422 -259906 -6981 -166315
9443 -166315 -107630 126278 -476396 -36660 -151718 156731 -175453 -53072 166217 -420765
9432 -81980 -83522 124967 162682 -89107 -230446 506479 372047 -113158 208770 184565 -31562
9420 108339 119400 -260390 -296461 20030 -96472 -47784 -191657 -32152 136667 -8263 -14342
9409 -14342 94612 -487097 -152323 -179643 -133275 -76871 -167307 163588 -332817 -114480 121012
9397 -18629 -389302 -118636 60931 -63894 -62336 132555 -96431 45836 22825 -108924 -273437
9386 -273437 -51575 22822 -101766 -3753 -160281 -363096 116999 122962 -471734 143206 53459
9374 23954 -51500 215274 55638 23250 331182 -384958 -325090 -133212 -186439 60871 19905
9362c41963B8426a21306I2793c18991H0121a302k32021B77341i1138j24340l5367
9351b50845R0494h828C8422b05437D6320a66715H020a29752c3324C2497c19966
9339a72926F5089c26369J26522f3944l9985r3806h5801C058d6621B36693F8863
9327B04994J14607b32736j32625G3628c70575A64037h1876F3397d0543D8546a57892
9315a43003J0137j28110B8414d9691k18347J04112j9825A03094O5121c28795A815
9303a55613P1680b7078B3887c9210g239k40577d1696G0557h3371j92933B21393
9291a5340k80895p0332a213q7522k05133B89985A2634K68362j36611b27584E25
9279A31605A5692f4236k4490k22014P0175A45137a98332a8374q7156a148A51110
$$ plain form
9362 -341963 28426 -121306 92793 -318991 80121 -1302 -233323 277341 -91138 -215478 -250845
9351 -250845 -160351 -8828 38422 -205437 46320 -166715 8020 -129752 -33324 32497 -319966
9339 -172926 65089 -326369 -199847 -63944 -103929 -197735 -85801 3058 -46621 236693 68863
9327 204994 319601 -232736 -365361 73628 -370575 164037 -81876 63397 -40543 48546 -157892
9315 -143003 -132866 -260976 28414 -49691 -268038 -163926 -183751 103094 168215 -328795 1815
9303 -155613 -83933 -27078 23887 -39210 -7239 -247816 -41696 70557 -83371 -276304 221393
9291 -15340 -296235 -366567 -1213 -88735 -293868 289985 12634 280996 144385 -227584 525
9279 131605 15692 -64236 -88726 -310740 -240565 145137 -198332 -18374 -105530 -1148 151110
9267a48959A27514b73562d0432F3698M3840L7614j5170b61180B80947d7653o9282
9256a16935B2732J65121a20136A83312Q8151a01933j81701D6989i3170k2245B4664
9244F7143e3245j29407p6849l2340b6690p0265L7686A04982b2767a0241l58183
9233c68424h9469A69425j3093o5330b38767B19645c09527l79231C7263i0507r9814
9222a90321A32403J09985m4268c7069n278D1280O3666f8475G9656M265A5219c05489
9209H4260b75219B31118F2516g0460r4151O7896A5417c46182J60767a0904A85863
9197H5560L8178b87325K1053A0207b0829A04233f4824j07524A3572i8613E0587
9185a54359K5836j18549I8060A2846J81850b32689g36A13028b34209B81166l7218
$$ plain form
9267 -148959 127514 -273562 -40432 63698 107538 145152 129982 -261180 280947 -47653 -116935
9256 -116935 22732 187853 -120136 183312 271463 -101933 -283634 46989 -93170 -115415 24664
9244 67143 -53245 -182652 -259501 -291841 -26690 -96955 -59269 104982 -22767 -10241 -368424
9233 -368424 -89469 169425 156332 91002 -238767 219645 -309527 -688758 37263 -90507 -190321
9222 -190321 132403 242388 198120 -37069 -42347 41280 104946 -68475 79656 83921 15219 -305489
9209 84260 -275219 231118 62516 -70460 -164611 -96715 15417 -346182 -185415 -10904 185863
9197 85560 123738 -287325 -266272 10207 -20829 104233 -64824 -172348 13572 -98613 50587
9185 -154359 -128523 -247072 98060 12846 194696 -232689 -736 113028 -234209 281166 243948
9174B43948d01886a33199c4669j53722g7317k28138B95859b64377J05810N8744
9164i9823l5235J8506A99458c20981K8283e3753j4305K2632M222p0665M428k75164
9152c82605J83605j02703D2501b70878A59912h1133E0028a75922F7510K03874
9142B71384b6235o5529L2434j41033m6656C4411b56907B08934r5671a41526r5208
9131b36734d4284j44325M6974e3044A70384a70740R980A60301a37944j9238q4343
9120b41525f3746k83862p7448K06347h904j99134E153e5866k01713g0479m23109
9109d93588B90679q5260H169g6347k46458N6923h4226B26319h0306F9531a15304
9097C5371C85J1562a13554j9051A05817k5356b52063J1898m8544F0338J53258
$$ plain form
9174 243948 -401886 -133199 -34669 -188391 -77317 -305455 295859 -264377 -158567 -99823
9164 -99823 -135058 -116552 199458 -320981 -292698 -53753 -68058 -45426 -41204 -111869 -107441 -382605
9152 -382605 -199000 -301703 42501 -270878 159912 -81133 50028 -175922 67510 271384
9142 271384 -26235 -91764 -59330 -200363 -247019 34411 -256907 208934 113263 -141526 -236734
9131 -236734 -44284 -188609 -141635 -53044 170384 -170740 -160760 160301 -137944 -157182 -241525
9120 -241525 -63746 -347608 -425056 -218709 -8904 -208038 5153 -55866 -257579 -70479 -493588
9109 -493588 290679 205419 8169 -76347 -322805 -265882 -84226 226319 -80306 69531 -115304
9097 35371 385 11947 -113554 -132605 105817 80461 -252063 -240165 -288709 60338 213596
9086B13596g12l18290g9773c2410C5100k867l384d19654j8517a36722l00735C99058
9073H7060f3610C14973I527a00387j4991j44525q0574g8014f381B47648a99291
9061a12149E2327a25345F4812i1445J9314r4537h09p1967A93666b3152N353A10369
9048g5049A79341F43b9314k37765l38425b07878r2929g1873A20068h5119k1000
9037a06119k8552L4649l2389K6197L5588B25848g8571k13607p8990R1439A84900
9025c2226j65256h6435A47037Q0084I3929f8488a2503j4882G3229a73745F1242
9013A48072b72045m0763a17890I5582a39476k8313O0417q4354A55355a38751A10595
9001A14688b00342A32290d28193a31038D7560J76224p0649b2227H5467d6111K3004
$$ plain form
9086 213596 -712 -319002 -79773 -32410 35100 32233 28849 -419654 -438171 -136722 -437457 399058
9073 87060 -63610 314973 9527 -100387 -115378 -259903 -340477 -78014 -6381 247648 -199291
9061 -112149 52327 -125345 64812 -91445 -72131 -166668 -809 -72776 193666 -23152 -17799 110369
9048 -75049 179341 643 -29314 -267079 -605504 -207878 -300807 -71873 120068 -85119 -106119
9037 -106119 -134671 -100022 -132411 -106214 -70626 225848 -78571 -292178 -371168 -279729 184900
9025 -32226 -197482 -86435 147037 227121 93929 -68488 -12503 -27385 73229 -173745 61242
9013 148072 -272045 -312808 -117890 95582 -139476 -167789 -107372 -191726 155355 -138751 110595
9001 114688 -200342 132290 -428193 -131038 47560 223784 153135 -22227 85467 -46111 -23107
8990b3107l8679A66802J0500b09763A80616a64479H4844d25035A92733K07076
8980C99809d3941A8805c11017g4630D1296h4736c8762j15107J9614j2221l4107
8969a80583A57512a62292O9754A3595L507c3307r3603F43772a57491A22086C2084
8957b04450a0559B56895b29575P1217a5891l01503c9366k32864I237K21321i5196
8945a15643d8954r1529j91500J03456J4455h9242M2566A68411I563L17242p8485
8934B48320B1560O8023b80853n6021e0423C1155e6435D46a01253D08243P3402
8923D81645J389374L792080O936333C759337A128717C00673A30374M45516B81742
8913I1806J45699c1097j35241A20969d4179A53585F2974a8761j696p739L392l82951
$$ plain form
8990 -23107 -61786 166802 177302 -209763 180616 -164479 84844 -425035 192733 399809
8980 399809 -43941 18805 -311017 -74630 41296 -84736 -38762 -153869 -134255 -146476 -180583
8969 -180583 157512 -162292 -92538 13595 17102 -33307 -126910 643772 -157491 122086 32084
8957 -204450 -10559 256895 -229575 -158358 -15891 -317394 -39366 -272230 9237 230558 -95196
8945 -115643 -48954 -140483 -331983 -228527 -214072 -89242 -46676 168411 9563 326805 248320
8934 248320 21560 89583 -280853 -336874 -50423 31155 -56435 446 -101253 408243 481645
8923 481645 1871019 5663099 12599432 3759337 1128717 300673 130374 575890 281742
8913 91806 237505 -31097 -166338 120969 -44179 153585 62974 -18761 -20457 -28196 -24804 -407755
8901d07755J85870O8893A04543c554j15870J0806j8796A55313b4370B40317e7330
8889c6324E3277m918R808J55532a17082C12472c2726o1445F545B649g5159A31770
8876a67983c9839B0635M1089A287a48656H1356A4829a6055r9938B8479b28707
8864a27688B34139a89814i3374A14647J7195a25859G8041k8393h228j18881A09720
$$ plain form
8901 -407755 -221885 -152992 104543 -3554 -119424 -108618 -127414 155313 -24370 240317 -57330
8889 -36324 53277 48359 58167 213699 -117082 312472 -32726 -94171 6545 2649 -75159 131770
8876 -167983 -39839 20635 61724 1287 -148656 81356 14829 -16055 -115993 28479 -228707
8864 -127688 234139 -189814 -93374 114647 131842 -125859 78041 49648 -8228 -127109 109720
$$ [...]
##END NTUPLES=NMR SPECTRUM
##END=
