
##TITLE=AC1169_Tolima-ibage-TGAAH12004_5890996_8qJEQRyVzN
##JCAMPDX= 6.0         $$ Bruker NMR JCAMP-DX V2.0
##DATA TYPE= NMR SPECTRUM
##DATA CLASS= NTUPLES
##ORIGIN= BRUKER
##OWNER= Administrator
$$ 1.72 TOPSPIN		Version 2.1
$$ 2012-04-02 19:44:37.546 -0500  Administrator@TOPSPIN
$$ Compression mode = diff/dup
##.OBSERVE FREQUENCY= 400.13188235
##.OBSERVE NUCLEUS= ^1H
##.ACQUISITION MODE= SIMULTANEOUS (DQD)
##.ACQUISITION SCHEME= undefined
##.AVERAGES= 64
##.DIGITISER RES= 22
##SPECTROMETER/DATA SYSTEM= spect
##.PULSE SEQUENCE= noesygpps1d.comp
##.SOLVENT NAME= COFFEE_meoh
##.SHIFT REFERENCE= INTERNAL, COFFEE_meoh, 1, 14.96865
##AUDIT TRAIL= $$ (NUMBER, WHEN, WHO, WHERE, PROCESS, VERSION, WHAT)
$$ ##TITLE= Audit trail, TOPSPIN		Version 2.1
$$ ##JCAMPDX= 5.01
$$ ##ORIGIN= Bruker BioSpin GmbH
$$ ##OWNER= Administrator
$$ $$ C:\Bruker\TOPSPIN/data/COFFEE/nmr/AC1169_Tolima-ibage-TGAAH12004_5890996_8qJEQRyVzN/12/pdata/1/auditp.txt
$$ ##AUDIT TRAIL=  $$ (NUMBER, WHEN, WHO, WHERE, PROCESS, VERSION, WHAT)
(   1,<2012-04-02 19:44:31.875 -0500>,<Administrator>,<TOPSPIN>,<go>,<TOPSPIN 2.1>,
      <created by zg
	started at 2012-04-02 19:32:59.781 -0500,
	POWCHK enabled, PULCHK disabled,
       configuration hash MD5:
       1A 1E CE 29 27 FD 77 03 67 4E F0 E3 C4 B2 CB 90
       data hash MD5: 64K
       D4 2C 9D 15 E1 33 17 48 B3 BC 60 6E 53 62 AB 8A>)
(   2,<2012-04-02 19:44:35.031 -0500>,<Administrator>,<TOPSPIN>,<proc1d>,<TOPSPIN 2.1>,
      <Start of raw data processing
       efp LB = 0.3 FT_mod = 6 PKNL = 1 PHC0 = 0 PHC1 = 0 SI = 128K 
       data hash MD5: 128K
       46 44 47 63 7E D9 99 35 36 2D 5D E7 49 32 20 20>)
(   3,<2012-04-02 19:44:36.484 -0500>,<Administrator>,<TOPSPIN>,<proc1d>,<TOPSPIN 2.1>,
      <pk PHC0 = 35.16724 PHC1 = 0 
       data hash MD5: 128K
       53 36 A5 9C 09 26 37 F1 F3 C9 CC 3B 01 CE 63 12>)
(   4,<2012-04-02 19:44:37.140 -0500>,<Administrator>,<TOPSPIN>,<proc1d>,<TOPSPIN 2.1>,
      <abs ABSG = 1 
       data hash MD5: 128K
       56 1B EE 3F BB F5 F3 1E 25 12 7F 8F 28 6F 96 A3>)
(   5,<2012-04-02 19:44:37.234 -0500>,<Administrator>,<TOPSPIN>,<proc1d>,<TOPSPIN 2.1>,
      <abs ABSG = 2 
       data hash MD5: 128K
       A0 8E 41 DC 41 90 4A F4 90 12 AE 77 36 12 73 EA>)
(   6,<2012-04-02 19:44:37.312 -0500>,<Administrator>,<TOPSPIN>,<proc1d>,<TOPSPIN 2.1>,
      <abs ABSG = 3 
       data hash MD5: 128K
       05 AC 66 71 F7 1A 02 F5 2E A4 27 42 18 5E A9 D5>)
(   7,<2012-04-02 19:44:37.375 -0500>,<Administrator>,<TOPSPIN>,<proc1d>,<TOPSPIN 2.1>,
      <abs ABSG = 4 
       data hash MD5: 128K
       D0 3A 98 4D A0 49 30 AD 24 A8 74 4D 6E 4B C4 C4>)
(   8,<2012-04-02 19:44:37.437 -0500>,<Administrator>,<TOPSPIN>,<proc1d>,<TOPSPIN 2.1>,
      <abs ABSG = 5 
       data hash MD5: 128K
       93 2F 1A 3F ED 42 97 C5 B8 38 21 21 A5 6C 38 3D>)
$$ ##END=
$$ 
$$ $$ hash MD5
$$ $$ F1 27 64 64 E0 09 D3 35 EF 67 BE D6 02 52 C0 C1
##$RELAX= 
##$RELAX= 
##$RELAX= 
##$RELAX= 
##$RELAX= 
##$RELAX= 
##$RELAX= 
##$RELAX= 
$$ [...]
##$TP07= 0
##$TPNAME0= <>
##$TPNAME1= <>
##$TPNAME2= <>
##$TPNAME3= <>
##$TPNAME4= <>
##$TPNAME5= <>
##$TPNAME6= <>
##$TPNAME7= <>
##$TPOAL= (0..7)
0.5 0.5 0.5 0.5 0.5 0.5 0.5 0.5
##$TPOFFS= (0..7)
0 0 0 0 0 0 0 0
##$TUNHIN= 0
##$TUNHOUT= 0
##$TUNXOUT= 0
##$USERA1= <user>
##$USERA2= <user>
##$USERA3= <user>
##$USERA4= <user>
##$USERA5= <user>
##$V9= 5
##$VALIST= <valist>
##$VCLIST= <CCCCCCCCCCCCCCC>
##$VD= 0
##$VDLIST= <DDDDDDDDDDDDDDD>
##$VPLIST= <PPPPPPPPPPPPPPP>
##$VTLIST= <TTTTTTTTTTTTTTT>
##$WBST= 2048
##$WBSW= 25
##$XGAIN= (0..3)
0 0 0 0
##$XL= 0
##$YL= 0
##$YMAX_a= 11121430
##$YMIN_a= -10786864
##$ZGOPTNS= <>
##$ZL1= 120
##$ZL2= 120
##$ZL3= 120
##$ZL4= 120
##$ABSF1= 14.96865
##$ABSF2= -5.58388
##$ABSG= 5
##$ABSL= 3
##$ALPHA= 0
##$AQORDER= 0
##$ASSFAC= 0
##$ASSFACI= 0
##$ASSFACX= 0
##$ASSWID= 0
##$AUNMP= <proc_prof1d_extract.lims>
##$AXLEFT= 0
##$AXNAME= <>
##$AXNUC= <1H>
##$AXRIGHT= 0
##$AXTYPE= 0
##$AXUNIT= <>
##$AZFE= 0.1
##$AZFW= 0.1
##$BCFW= 0
##$BC_mod= 0
##$BYTORDP= 0
##$COROFFS= 0
##$CY= 15
##$DATMOD= 1
##$DC= 0
##$DFILT= <>
##$DTYPP= 0
##$F1P= 0
##$F2P= 0
##$FCOR= 0.5
##$FTSIZE= 131072
##$FT_mod= 6
##$GAMMA= 0
##$GB= 0
##$INTBC= 1
##$INTSCL= 1
##$ISEN= 128
##$LB= 0.3
##$LEV0= 0
##$LPBIN= 0
##$MAXI= 10000
##$MC2= 0
##$MEAN= 0
##$ME_mod= 0
##$MI= 0
##$NCOEF= 0
##$NC_proc= -1
##$NLEV= 6
##$NOISF1= 0
##$NOISF2= 0
##$NSP= 0
##$NTH_PI= 0
##$NZP= 0
##$OFFSET= 14.96865
##$PC= 1
##$PHC0= 35.16724
##$PHC1= 0
##$PH_mod= 1
##$PKNL= yes
##$PPARMOD= 0
##$PPDIAG= 0
##$PPIPTYP= 0
##$PPMPNUM= 2147483647
##$PPRESOL= 1
##$PSCAL= 4
##$PSIGN= 0
##$PYNMP= <proc.py>
##$REVERSE= no
##$SF= 400.130004787119
##$SI= 131072
##$SIGF1= 0
##$SIGF2= 0
##$SINO= 400
##$SIOLD= 131072
##$SPECTYP= <>
##$SREGLST= <1H.CDCl3>
##$SSB= 0
##$STSI= 131072
##$STSR= 0
##$SW_p= 8223.68421052632
##$SYMM= 0
##$S_DEV= 0
##$TDeff= 65536
##$TDoff= 0
##$TI= <>
##$TILT= no
##$TM1= 0
##$TM2= 0
##$TOPLEV= 0
##$USERP1= <user>
##$USERP2= <user>
##$USERP3= <user>
##$USERP4= <user>
##$USERP5= <user>
##$WDW= 1
##$XDIM= 131072
##$YMAX_p= 122828841
##$YMIN_p= -443605150
##$CURPLOT= <Network HP LaserJet P1505>
##$CURPRIN= <$Network HP LaserJet P1505>
##$DFORMAT= <normdp>
##$LAYOUT= <+/1D_H.xwp>
##$LFORMAT= <normlp>
##$PFORMAT= <normpl>
##$SURQMSG= 1
$$ End of Bruker specific parameters
$$ ---------------------------------
##NTUPLES= NMR SPECTRUM
##VAR_NAME=  FREQUENCY,     SPECTRUM/REAL,   SPECTRUM/IMAG
##SYMBOL=    X,             R,               I
##VAR_TYPE=  INDEPENDENT,   DEPENDENT,       DEPENDENT
##VAR_FORM=  AFFN,          ASDF,            ASDF
##VAR_DIM=   131072,        131072,          131072
##UNITS=     HZ,            ARBITRARY UNITS, ARBITRARY UNITS
##FACTOR=    0.0627417313425165, 1,          1
##FIRST=     8223.62146879498, 602,          -17529
##LAST=      0,             845,             -17413
##MIN=       0,             -443605150,      0
##MAX=       8223.62146879498, 122828841,    0
$$ Real data points
##PAGE= N=1
##DATA TABLE= (X++(R..R)), XYDATA
$$ [...]
66340 39263 39204 39061 38614 37885 37204 36959 37231 37663 37721 37191 36363 35720 35485 35557 35745 35918 35986 35921 35825 35819 35883 35882 35745
66317 35745 35498 35171 34814 34556 34497 34525 34455 34325 34365 34635 34891 34925 34834 34780 34620 34014 32927 31860 31408 31649 32112
66296 32112 32388 32608 33145 33921 34343 34024 33257 32574 32119 31744 31517 31713 32308 32908 33242 33375 33369 33072 32443 31791
66276 31791 31476 31516 31722 32009 32395 32797 33077 33216 33256 33138 32816 32477 32456 32831 33239 33181 32451 31283 30107 29245
66256 29245 28796 28730 28964 29320 29577 29662 29740 29938 30110 30049 29881 29952 30306 30575 30498 30251 30093 29944 29567 29025 28619
66235 28619 28445 28278 27909 27416 27059 27031 27329 27752 28024 28033 27917 27847 27793 27637 27452 27489 27883 28474 28951 29038 28618
66214 28618 27794 26919 26399 26367 26569 26617 26352 25976 25858 26182 26750 27169 27270 27260 27429 27784 28119 28299 28290 27966 27191
66193 27191 26128 25254 24893 24884 24887 24879 25152 25840 26657 27179 27296 27251 27305 27457 27518 27359 27001 26530 26076 25854 26071 26664
66171 26664 27239 27404 27131 26671 26175 25581 24887 24311 24065 24085 24130 24072 23988 23998 24143 24416 24772 25096 25246 25221 25190
66150 25190 25325 25602 25868 26047 26198 26433 26851 27504 28254 28656 28250 27110 25964 25557 25969 26719 27405 27923
66132 27923 28128 27724 26718 25693 25320 25703 26405 26981 27297 27422 27522 27818 28402 29057 29456 29573 29661 29840 29933
66113 29933 29801 29604 29563 29637 29604 29357 28988 28637 28396 28287 28224 28078 27855 27732 27799 27849 27545 26789 25836 25079 24798
66092 24798 25056 25670 26293 26647 26725 26734 26831 26979 27029 26820 26259 25393 24468 23800 23521 23428 23117 22299 21073 19915
66072 19915 19343 19487 20013 20504 20816 21034 21240 21499 21960 22732 23637 24305 24573 24647 24765 24905 24907 24724 24424 24061
66052 24061 23722 23605 23855 24321 24622 24519 24126 23747 23582 23600 23622 23508 23265 23031 22928 22961 23031 23034 22916 22702 22487
66031 22487 22348 22209 21887 21298 20590 20039 19862 20152 20828 21569 21946 21790 21404 21233 21361 21474 21316 20983 20738
66012 20738 20659 20557 20184 19485 18713 18290 18475 19166 20048 20890 21614 22137 22346 22219 21854 21333 20674 19994 19570
65993 19570 19657 20283 21222 22086 22508 22420 22185 22253 22630 22844 22526 21863 21333 21165 21237 21400 21653 22006 22358 22560
65973 22560 22577 22568 22830 23534 24460 25104 25180 24956 24969 25461 26217 26891 27329 27600 27851 28173 28542 28882 29199 29566 29898
65952 29898 29923 29491 28785 28049 27248 26238 25232 24738 24972 25547 25888 25749 25253 24614 24015 23629 23559 23734 23974
65933 23974 24184 24413 24723 25052 25214 25061 24635 24174 23911 23882 23951 23967 23837 23518 23079 22758 22789 23135 23470 23479 23100
65912 23100 22515 22001 21826 22094 22601 22930 22807 22311 21740 21320 21121 21129 21308 21610 21980 22367 22744 23144 23644 24243
65892 24243 24789 25126 25305 25502 25710 25702 25352 24845 24464 24306 24337 24605 25200 26017 26730 27061 27007 26800 26693 26779 26955
65871 26955 27045 26970 26801 26645 26537 26473 26469 26560 26734 26954 27192 27426 27602 27643 27488 27102 26512 25820 25177 24701 24466
65850 24466 24503 24765 25093 25351 25559 25807 26036 26058 25826 25520 25327 25260 25289 25458 25757 26000 25992 25766 25512 25333 25200
65829 25200 25068 24881 24520 23919 23244 22781 22635 22647 22634 22578 22563 22638 22834 23178 23628 24049 24363 24655 25068 25569 25875
65808 25875 25651 24797 23583 22489 21885 21809 22031 22294 22490 22628 22715 22686 22488 22208 22053 22144 22356 22441 22347 22273 22397
65787 22397 22669 22961 23277 23648 23917 23853 23490 23114 22896 22708 22457 22362 22692 23322 23833 24015 24065 24246 24553 24813
65767 24813 24938 24936 24815 24642 24586 24720 24848 24760 24615 24835 25606 26699 27814 28813 29548 29782 29527 29228 29345 29874
65747 29874 30486 31004 31476 31891 32153 32314 32530 32763 32793 32554 32223 31927 31627 31332 31212 31375 31742 32179 32592
65728 32592 32841 32813 32676 32821 33433 34270 34942 35235 35136 34770 34399 34212 34017 33420 32439 31628 31416 31580 31592 31209
65708 31209 30514 29676 28961 28717 28964 29151 28687 27608 26456 25620 25101 24770 24505 24175 23776 23531 23588 23735 23712
65689 23712 23627 23706 23820 23689 23441 23438 23563 23278 22452 21602 21125 20818 20416 20138 20334 20897 21403 21644 21701 21664 21542
65668 21542 21365 21156 20929 20800 20941 21294 21564 21614 21633 21765 21842 21725 21609 21719 21946 22114 22383 22993 23753 24198
65648 24198 24190 24000 23845 23696 23565 23607 23835 24037 24075 24022 23928 23691 23254 22722 22181 21594 20992 20545 20329 20198 20028
65627 20028 19940 20105 20487 20928 21375 21815 22075 21928 21429 20981 20998 21574 22469 23320 23845 23973 23851 23695 23594 23465
65607 23465 23207 22835 22420 21981 21526 21124 20857 20729 20699 20824 21236 21976 22910 23856 24676 25198 25199 24650 23892 23402
65587 23402 23361 23594 23896 24276 24825 25476 26029 26311 26265 25962 25581 25303 25162 25042 24869 24728 24739 24877 24975 24873
65567 24873 24518 24019 23602 23425 23376 23173 22725 22296 22174 22312 22429 22385 22225 21961 21487 20810 20149 19714 19516 19468
65547 19468 19549 19774 20077 20342 20479 20422 20116 19689 19532 20024 21091 22182 22791 22867 22640 22204 21534 20815 20462
65528 20462 20666 21112 21337 21226 20981 20712 20301 19689 19068 18708 18710 19001 19452 19971 20512 21064 21548 21764 21542 20998
65508 20998 20520 20436 20722 21061 21149 20950 20733 20794 21085 21197 20866 20379 20272 20636 21002 20960 20594 20219 19983 19893 19974
65487 19974 20163 20283 20353 20715 21552 22457 22828 22617 22302 22165 22005 21621 21194 20988 20974 20967 20953 21038 21195 21271 21208 21127
65465 21127 21200 21530 22086 22676 23059 23201 23344 23689 24088 24220 24062 23964 24213 24679 25016 25125 25216 25438 25642 25602
65445 25602 25367 25233 25389 25725 26035 26302 26685 27237 27770 28011 27869 27500 27142 26886 26693 26599 26795 27380 28128
65426 28128 28668 28932 29216 29713 30195 30354 30282 30357 30713 31076 31141 30865 30379 29805 29291 28999 28925 28895 28845 28942 29262
65405 29262 29505 29346 28973 28933 29363 29680 29272 28299 27511 27285 27160 26422 24962 23353 22201 21575 21103 20466
65387 20466 19709 19125 18921 19011 19157 19262 19432 19672 19670 19084 18021 17061 16706 16937 17370 17697 17834 17805 17717 17784 18147
65366 18147 18594 18682 18244 17675 17546 17989 18612 19013 19196 19403 19703 19941 20127 20599 21620 22914 23820 23950 23523
65347 23523 23017 22665 22400 22133 21897 21777 21893 22392 23299 24323 25044 25334 25515 25998 26857 27812 28548 28937 29064
65328 29064 29145 29419 29983 30686 31257 31559 31656 31688 31763 31992 32493 33244 34061 34855 35844 37321 39216 41056 42454
65309 42454 43509 44631 46085 47822 49678 51592 53645 55957 58554 61279 63878 66181 68081 69367
65295 69367 69778 69386 68697 68116 67460 66269 64471 62417 60284 57866 55036 52076 49395 47151 45303 43776
65279 43776 42435 41131 39942 39138 38713 38179 37044 35348 33518 31870 30484 29406 28640 28036 27403 26737
65263 26737 26151 25659 25205 24836 24613 24442 24164 23769 23303 22686 21837 20936 20281 19911 19612 19261 18934 18683 18481
65244 18481 18422 18706 19317 19898 20087 19840 19426 19203 19378 19842 20191 20089 19637 19230 19062 18958 18713 18380 18152
65225 18152 18122 18269 18562 18960 19366 19638 19666 19492 19402 19734 20443 20979 20842 20176 19582 19398 19457 19523 19588 19660 19651 19663
65203 19663 20082 21118 22428 23414 23786 23685 23398 23144 23072 23253 23647 24084 24296 24026 23303 22614 22525 23045 23570
65184 23570 23604 23275 22984 22781 22370 21621 20760 20063 19610 19370 19310 19339 19249 18869 18224 17533 17001 16675 16525 16633
65164 16633 17137 17877 18313 18065 17453 17180 17432 17686 17485 17085 17056 17535 18145 18504 18488 18144 17644 17313 17389 17719
65144 17719 17898 17734 17404 17135 16987 16971 17172 17598 18030 18209 18132 18015 17981 17886 17577 17210 17159 17560 18086 18289 18072
65123 18072 17712 17482 17464 17672 18148 18844 19564 20098 20363 20408 20415 20628 21119 21638 21900 21947 21988 21935 21493 20739 20245
65102 20245 20354 20665 20486 19626 18499 17640 17326 17556 18146 18883 19658 20380 20830 20845 20686 20865 21474 22046 22204
65083 22204 22062 21775 21189 20306 19625 19538 19730 19720 19663 20002 20550 20676 20320 20118 20439 20963 21362 21790 22440 23113
65063 23113 23603 24100 24901 25941 26854 27279 27019 26191 25346 25135 25632 26221 26339 26079 25957 26337 27252 28508
65045 28508 29747 30624 31118 31501 31951 32438 33053 34050 35449 36947 38484 40457 43085 45891 48193 49910
65029 49910 51459 53098 54755 56364 57938 59355 60444 61281 62113 62999 63799 64441 64905 64995 64398 63038 61123
65012 61123 58839 56280 53666 51367 49562 48029 46307 44027 41158 38092 35460 33630 32427 31450 30576
64997 30576 29924 29448 28880 28086 27197 26326 25482 24789 24499 24621 24773 24577 24059 23508 23118 22892 22766 22668 22531
64978 22531 22379 22299 22244 21987 21399 20702 20262 20195 20288 20305 20270 20398 20805 21313 21556 21330 20809 20350 20116 19983 19825
64957 19825 19693 19667 19688 19690 19768 20062 20473 20700 20604 20400 20444 20873 21501 22040 22329 22371 22209 21837 21269 20634 20126 19883
64935 19883 19917 20169 20557 20966 21236 21199 20761 20018 19336 19166 19634 20330 20649 20392 19933 19738 19904 20211 20440 20546
64915 20546 20582 20651 20883 21295 21700 21841 21647 21248 20767 20220 19614 19045 18601 18254 17877 17418 17013 16925 17284 17874
64895 17874 18238 18114 17720 17536 17807 18369 18906 19266 19499 19735 20059 20400 20513 20201 19586 19047 18800 18710 18599
64876 18599 18578 18875 19434 19949 20252 20443 20593 20555 20217 19792 19658 19951 20396 20565 20258 19697 19375 19656 20435 21200
64856 21200 21461 21130 20503 19926 19493 19050 18465 17855 17495 17460 17480 17290 16998 16903 16970 16839 16404 16052 16123 16427 16583
64835 16583 16604 16785 17142 17405 17511 17664 17835 17657 17038 16503 16605 17209 17730 17917 18057 18450 19016 19463 19585
64816 19585 19310 18693 18002 17635 17791 18282 18784 19199 19671 20301 21013 21675 22200 22495 22415 21895 21086 20281 19721
64797 19721 19537 19803 20504 21393 22051 22194 21879 21341 20720 20064 19508 19247 19299 19497 19722 20020 20414 20738 20759 20412
64777 20412 19818 19168 18626 18325 18360 18797 19622 20626 21421 21712 21593 21394 21237 20950 20448 19941 19597 19276 18826
64758 18826 18461 18546 19089 19762 20333 20780 21049 21061 20973 21079 21326 21283 20797 20344 20447 20960 21271 21063 20504 19790
64738 19790 18906 17939 17242 17095 17359 17660 17766 17659 17423 17256 17475 18223 19171 19772 19857 19794 19956 20235 20264 19974
64718 19974 19698 19746 20090 20515 20875 21125 21213 21118 20936 20766 20543 20105 19485 19005 19021 19554 20245 20690 20806 20824 20957
64697 20957 21148 21192 21032 20840 20781 20805 20748 20537 20273 20151 20313 20739 21196 21416 21400 21491 22004 22834 23540 23799 23634
64676 23634 23235 22748 22321 22151 22317 22655 22937 23167 23526 24060 24509 24520 23940 22914 21786 20948 20679 20998 21703
64657 21703 22550 23376 24041 24379 24310 23991 23707 23616 23684 23832 24016 24103 23845 23137 22237 21578 21370 21469 21658 21918 22385
64636 22385 23099 23896 24529 24882 25057 25254 25554 25856 26071 26284 26634 27047 27220 26932 26263 25479 24805 24356 24189
64617 24189 24293 24590 25000 25490 26011 26447 26675 26653 26404 25957 25396 24868 24481 24199 23915 23611 23400 23403 23645 24015
64597 24015 24297 24319 24140 24024 24143 24361 24426 24342 24415 24896 25696 26466 26875 26800 26354 25810 25444 25365 25446 25425 25111 24555
64575 24555 24081 24085 24637 25344 25706 25666 25667 26113 26884 27498 27693 27687 27846 28207 28458 28304 27789 27164 26555 25875 25076
64554 25076 24316 23783 23460 23234 23180 23540 24384 25410 26212 26638 26838 27005 27195 27340 27331 27064 26508 25793 25217 25071
64534 25071 25391 25877 26111 25945 25642 25587 25896 26344 26684 26888 27056 27195 27220 27112 26978 26943 27061 27299 27513 27493
64514 27493 27135 26622 26303 26344 26582 26797 27027 27468 28082 28542 28607 28427 28297 28222 27939 27355 26750 26444 26426 26494 26606
64493 26606 26878 27215 27244 26732 25953 25458 25523 25942 26336 26500 26443 26258 26051 25924 25870 25737 25406 24983 24704 24623 24562
64472 24562 24413 24325 24480 24830 25214 25630 26159 26658 26796 26490 26091 25989 26152 26231 26022 25689 25543 25706 25981 26018
64452 26018 25689 25332 25525 26479 27740 28613 28784 28458 27984 27541 27131 26684 26177 25737 25608 25844 26125 26074 25706
64433 25706 25350 25150 24931 24612 24425 24550 24805 24898 24828 24760 24698 24542 24392 24479 24778 24963 24882 24795 25018 25479 25855
64412 25855 26033 26228 26663 27324 28072 28788 29317 29427 29021 28355 27859 27707 27724 27721 27768 28002 28354 28653 28886 29183
64392 29183 29547 29830 29957 29964 29775 29176 28161 27136 26605 26704 27148 27551 27682 27510 27167 26847 26653 26543 26506 26647
64372 26647 26979 27238 27157 26922 27113 28088 29562 30927 31827 32307 32507 32448 32127 31672 31266 30960 30639 30194 29707
64353 29707 29443 29630 30243 31042 31793 32395 32774 32766 32274 31478 30743 30258 29905 29528 29189 29023 28957 28806 28632 28763
64333 28763 29367 30146 30632 30688 30592 30656 30940 31319 31686 32017 32296 32467 32443 32171 31718 31258 30953 30856 30954 31255 31751
64312 31751 32340 32886 33315 33611 33740 33704 33630 33655 33719 33591 33150 32539 31976 31587 31462 31743 32463 33353 33976 34121
64292 34121 34009 34049 34404 34829 34971 34813 34709 34952 35438 35850 36112 36440 36960 37464 37638 37356 36707 35853 34985
64273 34985 34332 34059 34177 34568 35062 35501 35840 36263 37023 38134 39312 40294 41033 41555 41812 41860 41949 42223 42465
64254 42465 42395 42116 41983 42079 42110 41854 41478 41274 41334 41534 41759 41974 42203 42506 42966 43656 44603 45704 46627 46945
64234 46945 46613 46206 46439 47425 48624 49545 50203 50807 51384 51881 52408 53050 53650 54053 54474 55316 56648 58145
64216 58145 59546 60909 62317 63597 64491 64985 65294 65590 65851 65955 65803 65348 64598 63632 62588 61604 60730
64199 60730 59951 59232 58563 57911 57216 56485 55842 55430 55258 55237 55343 55604 55911 56024 55865 55640 55584 55681 55827 56109
64179 56109 56698 57514 58284 58946 59760 60938 62393 63947 65596 67367 69110 70603 71816 72866 73814 74670
64163 74670 75570 76664 77820 78571 78525 77733 76607 75541 74643 73785 72806 71701 70609 69656 68823 68051 67390
64146 67390 66966 66811 66856 67072 67513 68162 68902 69713 70768 72173 73700 74931 75683 76151 76640 77263 77917 78434
64128 78434 78671 78562 78181 77716 77339 77094 76939 76876 76959 77211 77610 78164 78936 79941 81077 82218 83340 84516
64110 84516 85773 87053 88320 89603 90910 92215 93647 95568 98307 101811 105688 109592 113403 117071
64096 117071 120564 124055 127953 132502 137469 142385 147007 151323 155225 158445 160884 162756 164228 165108
64082 165108 164995 163694 161382 158412 155068 151522 147919 144428 141147 138013 134889 131785 128891 126322
64068 126322 123940 121556 119195 116969 114785 112460 110175 108485 107676 107335 106800 105944 105280 105263 105717 106031
64052 106031 105791 105138 104541 104327 104485 104910 105688 107075 109165 111730 114402 116962 119443 122016 124827 127884
64036 127884 131041 134155 137270 140597 144329 148524 153137 158047 163027 167808 172240 176305 180005 183297
64022 183297 186132 188418 189997 190801 191037 190956 190455 189151 186965 184356 181808 179353 176807 174242 171947
64007 171947 170052 168483 167171 166084 165132 164320 163884 164009 164482 164968 165573 166767 168715 171032 173320 175647
63991 175647 178322 181453 184935 188699 192764 197152 201931 207271 213299 219929 226895 233951 241001 248151
63977 248151 255664 263777 272457 281380 290144 298471 306238 313467 320284 326708 332500 337382 341466 345208
63963 345208 348854 352124 354573 356077 356810 356939 356590 356021 355543 355260 355068 354939 355102 355859 357310 359305 361697
63946 361697 364631 368552 373839 380446 387982 396200 405209 415234 426339 438497 451751 466122 481509
63933 481509 497874 515442 534491 555032 576885 600092 625027 652049 681204 712322 745288
63922 745288 780128 816962 856016 897631 942108 989531 1039829 1093096 1149825 1210708 1276183
63911 1276183 1346310 1421244 1501739 1589027 1684281 1788438 1902582 2028172 2166751 2319727
63901 2319727 2488688 2675753 2883270 3113212 3367001 3645692 3949845 4279051 4631810
63892 4631810 5005888 5398586 5806576 6225737 6651258 7077627 7498173 7904671 8287644
63883 8287644 8637404 8945234 9204131 9408947 9556030 9642780 9667418 9629024 9527588 9364107
63873 9364107 9140992 8862697 8536008 8169516 7772499 7353848 6921529 6482598 6043475
63864 6043475 5610125 5188013 4781975 4396139 4033806 3697197 3387291 3104031 2846726
63855 2846726 2614235 2404959 2217014 2048595 1898119 1763984 1644344 1537220 1440778 1353530
63845 1353530 1274409 1202661 1137549 1078158 1023618 973484 927583 885423 846101 808969 774084
63834 774084 741672 711362 682346 654192 627078 601203 576359 552204 528649 505795 483715
63823 483715 462467 442194 422996 404837 387675 371569 356509 342273 328602 315476 303068
63812 303068 291524 280883 271105 262014 253336 245005 237347 230739 225063 219789 214596 209656 205184 201013
63798 201013 196840 192760 189235 186588 184728 183395 182440 181780 181265 180734 180183 179764 179622 179754 179990 180057 179745
63781 179745 179038 178086 176979 175542 173416 170336 166344 161751 156950 152208 147570 142935 138288 133811 129726
63766 129726 125955 122120 117985 113807 110067 106863 103826 100676 97630 95024 92725 90287 87638 85253
63752 85253 83516 82187 80756 79092 77523 76358 75608 75101 74612 73894 72838 71657 70718 70122 69606 68901
63736 68901 67988 66959 65867 64852 64170 63925 63854 63558 62872 61944 61034 60371 60017 59757 59248 58423 57619 57096
63718 57096 56633 55855 54800 53850 53178 52618 52081 51694 51445 51058 50426 49853 49640 49674 49710 49808 50177 50695 50968 50864
63698 50864 50715 50884 51362 51917 52437 52951 53395 53517 53103 52244 51340 50811 50766 50968 51076 50903 50501 50110 50076 50637
63678 50637 51696 52865 53855 54741 55750 56897 57980 58908 59879 61201 63023 65219 67430 69282 70675
63663 70675 71821 72900 73784 74275 74530 74948 75645 76298 76563 76422 75997 75304 74399 73552 73062 72928 72887 72670 72117
63644 72117 71174 69946 68677 67498 66288 64942 63669 62789 62320 61982 61584 61150 60704 60199 59713 59471 59567
63627 59567 59831 60069 60224 60256 60081 59787 59696 60047 60778 61790 63233 65254 67550 69511 70876 72008 73408
63610 73408 75095 76622 77604 78089 78381 78642 78740 78474 77832 76978 76058 75174 74461 74022 73702 73135 72141 70986
63592 70986 70093 69576 69229 68889 68629 68565 68694 68969 69449 70221 71238 72290 73159 73843 74610 75792 77496 79548
63574 79548 81751 84105 86694 89468 92272 95062 97953 101048 104341 107820 111567 115706 120320 125410
63560 125410 130918 136786 143043 149787 157051 164737 172733 180979 189307 197326 204681 211337 217369 222548
63546 222548 226417 228828 230119 230684 230601 229868 228753 227648 226677 225646 224341 222721 220816 218577 215861
63531 215861 212531 208596 204253 199721 195061 190266 185513 181088 176990 172835 168335 163704 159375 155519
63517 155519 152062 149034 146576 144625 142930 141424 140336 139826 139749 139915 140377 141331 142849 144902 147555 150960
63501 150960 155114 159755 164608 169669 175219 181505 188428 195605 202740 209847 217109 224590 232169 239595
63487 239595 246463 252203 256340 258837 260092 260561 260532 260212 259830 259494 259086 258401 257297 255648 253291 250192
63471 250192 246522 242344 237315 230965 223306 214934 206463 198048 189650 181489 173933 167019 160387 153802
63457 153802 147420 141449 135813 130381 125368 121160 117825 115063 112590 110333 108212 106100 104071 102409
63443 102409 101183 100081 98859 97708 96927 96443 95989 95606 95600 96047 96705 97435 98381 99645 101084 102570 104181
63426 104181 105959 107697 109135 110234 111108 111828 112470 113219 114234 115423 116497 117201 117455 117342 117057 116776
63410 116776 116468 115908 114995 113942 113066 112468 112068 111838 111815 111941 112073 112156 112259 112467 112834 113421 114220 115077 115867
63391 115867 116728 117912 119416 120956 122348 123736 125392 127502 130238 133807 138195 143044 148000 153103
63377 153103 158637 164664 170949 177276 183624 190060 196705 203873 211964 221063 230788 240637 250383 260060
63363 260060 269767 279619 289733 300017 310043 319288 327395 334066 338885 341548 342253 341583 339986 337628
63349 337628 334719 331631 328500 325039 320968 316441 311745 306733 300896 293977 286231 278005 269328 260084
63335 260084 250448 240938 232035 223841 216195 209044 202639 197267 192888 189155 185827 182996 180862 179408
63321 179408 178437 177834 177659 178017 178976 180593 182892 185858 189505 193928 199174 205122 211580 218455 225711
63306 225711 233253 240991 249006 257460 266376 275591 284916 294143 302902 310696 317163 322205 325808 327885
63292 327885 328361 327389 325393 322932 320438 318034 315587 312955 310102 306891 302972 298046 292188 285672 278603
63277 278603 270985 263072 255285 247689 239928 231813 223730 216203 209289 202632 196000 189524 183459 177966
63263 177966 173095 168859 165284 162415 160234 158542 157026 155541 154228 153271 152634 152136 151708 151446 151442 151623
63247 151623 151742 151535 150967 150297 149766 149238 148354 147110 145977 145326 144951 144391 143533 142624 141875 141331 141088 141275
63229 141275 141754 142126 142136 141935 141836 141946 142151 142364 142677 143262 144171 145235 146198 146980 147746 148693 149816 150986
63211 150986 152162 153461 154994 156695 158291 159475 160176 160691 161442 162605 164071 165751 167697 169853 171975
63196 171975 173966 176061 178517 181267 184126 187091 190199 193293 196307 199629 203767 208692 213873 219003
63182 219003 224266 229847 235594 241383 247525 254568 262825 272230 282460 293124 304023 315364 327526
63169 327526 340492 353716 366695 379427 392131 404746 416944 428506 439399 449578 458971 467673
63157 467673 475949 484020 491941 499637 506927 513504 519069 523508 526874 529138 530030 529127 526106 520909 513678
63142 513678 504547 493586 481043 467559 453925 440587 427595 415066 403475 393312 384606 377008
63130 377008 370245 364373 359648 356326 354495 353976 354428 355714 358061 361732 366575 372079 377818 383706 389821
63115 389821 396189 402761 409420 415964 422217 428210 434164 440226 446296 452116 457423 461974 465498 467759
63101 467759 468679 468379 467049 464699 460981 455399 447822 438794 429219 419728 410390 400949 391196 381122
63087 381122 370931 361006 351737 343288 335570 328497 322160 316683 311965 307736 303844 300383 297466 294955
63073 294955 292538 290102 287922 286367 285412 284629 283738 283022 283035 283917 285179 286204 286807 287252 287877 288866 290312
63056 290312 292275 294693 297296 299743 301906 304019 306471 309423 312615 315620 318258 320696 323163 325689
63042 325689 328164 330557 332941 335318 337541 339445 340969 342129 342937 343473 344011 344898 346199 347540 348447
63027 348447 348875 349316 350341 352099 354285 356530 358760 361226 364223 367769 371569 375345 379180 383438 388364
63012 388364 393892 399903 406474 413698 421419 429358 437465 445995 455223 465281 476229 488101 500807
62999 500807 514198 528294 543285 559295 576282 594281 613509 634074 655714 678057 701021
62988 701021 724736 749120 773812 798534 823286 848056 872561 896507 919926 943017 965644
62977 965644 987317 1007786 1027473 1047089 1066900 1086541 1105441 1123195 1139469 1153871 1166071
62966 1166071 1175812 1182594 1185496 1183636 1176806 1165467 1150210 1131485 1109814 1085829 1059971 1032456
62954 1032456 1003753 974829 946671 919762 894304 870759 849786 831680 816220 803145 792501
62943 792501 784438 778877 775539 774170 774670 777049 781292 787169 794196 801947 810365 819561 829293 838896
62929 838896 847866 856315 864687 873148 881360 888710 894629 898805 901258 902114 901176 897832 891540 882328 870649
62914 870649 856794 840590 821698 800067 776207 751106 725786 700723 675747 650677 625963
62903 625963 602469 580643 560214 540761 522304 505214 489785 476084 464048 453439 443799 434702
62891 434702 426078 418169 411148 404916 399246 393941 388810 383663 378466 373414 368714 364299 359864 355223
62877 355223 350547 346179 342267 338676 335208 331807 328469 325092 321546 317868 314272 310965 308026 305429
62863 305429 303091 300886 298728 296668 294799 293052 291215 289209 287215 285447 283856 282224 280488 278886
62849 278886 277730 277073 276621 275940 274830 273529 272561 272295 272631 273143 273489 273657 273831 274058 274124 273753 272908 271837
62831 271837 270792 269777 268625 267255 265762 264296 262979 261890 260987 260053 258908 257694 256736 256091 255446
62816 255446 254610 253849 253513 253501 253370 252910 252338 251927 251700 251505 251162 250484 249397 248146 247180 246666 246244 245431
62798 245431 244188 242938 242058 241517 240980 240145 238942 237535 236223 235274 234735 234416 234089 233743 233582 233750 234111
62781 234111 234350 234280 234016 233879 234170 234945 235940 236751 237228 237628 238258 239012 239488 239601 239779 240421 241419 242437 243404
62762 243404 244441 245456 246214 246795 247607 248886 250456 252058 253657 255256 256701 257859 258884 260107 261778
62747 261778 264023 266919 270426 274342 278435 282599 286801 291041 295469 300408 306079 312360 318998 325991
62733 325991 333542 341722 350399 359548 369362 379967 391280 403311 416448 431169 447523 465106
62721 465106 483595 503131 524149 546962 571658 598269 626813 657180 689119 722438 757062
62710 757062 792809 829185 865507 901138 935527 968043 997929 1024369 1046508 1063450 1074465
62699 1074465 1079292 1078127 1071258 1058825 1041027 1018366 991529 961098 927542 891483 853752 815190
62687 815190 776491 738328 701421 666298 633035 601396 571262 542801 516217 491508 468600
62676 468600 447582 428599 411511 395870 381291 367744 355448 344587 335202 327163 320122 313611
62664 313611 307369 301516 296283 291706 287736 284536 282383 281261 280802 280674 280838 281387 282365 283875 286151
62649 286151 289341 293327 297930 303211 309368 316388 324022 332155 341063 351179 362663 375280 388735
62636 388735 403029 418446 435234 453375 472671 492962 514155 536081 558403 580695 602569
62625 602569 623738 643939 662786 679654 693805 704644 711812 715020 714000 708739 699636 687230
62613 687230 671838 653653 633096 610844 587501 563427 538887 514179 489643 465723 442977
62602 442977 421805 402132 383584 365982 349463 334109 319808 306541 294505 283747 273880 264404
62590 264404 255200 246574 238927 232444 226962 222031 217217 212423 207805 203405 199127 195024 191255 187670
62576 187670 183866 179876 176398 174001 172397 170888 169284 167936 166970 165973 164471 162461 160412 158952 158492
62561 158492 158844 159325 159446 159486 160110 161522 163323 165148 167089 169397 172123 175144 178335 181612 184994 188653
62545 188653 192728 197087 201531 206153 211279 217039 223356 230376 238483 247767 257852 268485 280021
62532 280021 292983 307385 322764 338813 355661 373567 392495 412012 431417 450035 467510
62521 467510 483817 498887 512297 523398 531708 537088 539578 539168 535745 529219 519737 507802 494130
62508 494130 479332 463763 447633 431157 414556 398026 381775 366026 350927 336557 323022
62497 323022 310465 298903 288195 278223 269042 260704 253038 245739 238665 231927 225677 219906 214469
62484 214469 209307 204525 200218 196254 192414 188788 185818 183785 182373 181008 179568 178460 177979 177920 177953
62469 177953 178108 178656 179675 180974 182381 183894 185614 187702 190396 193895 198160 202909 207888 213114 218858
62454 218858 225391 232740 240708 249180 258361 268595 279934 292020 304422 316988 329752 342638
62442 342638 355351 367496 378704 388705 397368 404655 410414 414251 415687 414482 410797 405081 397802
62429 397802 389241 379507 368760 357341 345643 333899 322228 310912 300384 290883 282222 274006
62417 274006 266028 258442 251655 246077 241834 238661 236150 234107 232545 231320 230067 228639 227419 226968
62403 226968 227423 228410 229501 230593 231893 233649 235865 238237 240409 242414 244709 247661 251133 254750 258394
62388 258394 262156 265837 268882 270943 272236 273184 273894 274184 273942 273191 271782 269325 265563 260696 255215
62373 255215 249475 243577 237617 231829 226418 221375 216572 211987 207728 203925 200678 198077 196108 194610
62359 194610 193440 192645 192322 192402 192772 193608 195269 197784 200666 203409 205996 208751 211821 214985 217935 220612
62343 220612 223267 226225 229551 232923 235923 238424 240559 242330 243521 244043 244112 243919 243322 242104 240374
62328 240374 238508 236789 235328 234198 233440 232953 232624 232559 233027 234171 235948 238335 241428 245313 249958 255231
62312 255231 261017 267396 274761 283624 294131 305902 318524 332089 347031 363524 381270 399879
62300 399879 419149 438953 459034 478968 498182 516007 531912 545686 557286 566503 572958 576453
62288 576453 577159 575474 571808 566442 559395 550458 539558 527039 513411 498886 483540 467863 452721
62275 452721 438617 425321 412450 400057 388376 377298 366517 356074 346363 337597 329580 322067
62263 322067 315081 308763 303109 297987 293307 289053 285217 281773 278722 276123 274057 272569 271593 270912 270190
62248 270190 269086 267399 265179 262686 260172 257656 254951 251927 248728 245729 243286 241493 240092 238677
62234 238677 237054 235419 234133 233365 233102 233402 234406 236046 237967 239872 241818 244069 246771 249905 253395
62219 253395 257134 261026 265125 269678 274833 280425 286198 292172 298561 305374 312365 319394 326668 334539
62205 334539 343230 352816 363280 374516 386402 398982 412450 426880 442089 457820 473910 490126
62193 490126 505980 520860 534241 545620 554408 560178 562998 563271 561228 556854 550314 542088 532489
62180 532489 521363 508541 494415 479751 465042 450399 436034 422425 409887 398338 387674
62169 387674 378113 369934 363039 357064 351789 347170 343057 339211 335644 332698 330629 329282 328251 327225
62155 327225 326065 324657 322923 321009 319301 318145 317535 317172 316828 316576 316609 316953 317527 318453 320018 322281
62139 322281 324926 327728 330908 334732 338930 342940 346726 350937 356111 362085 368417 375052 382188 389634
62125 389634 396748 403102 408920 414784 421066 427693 434316 440592 446503 452478 459126 466747 475172 484122
62111 484122 493579 503723 514608 526097 538056 550442 563182 576051 588728 600874 612161 622337
62099 622337 631306 639078 645583 650619 654029 655864 656322 655584 653807 651209 648072 644616 640926 636963 632675
62084 632675 628165 623765 619861 616581 613733 611113 608763 606846 605413 604428 603900 603797 603898 604014 604322 605238
62068 605238 606922 609180 611898 615310 619687 624929 630662 636578 642567 648685 655160 662314 670332 679159
62054 679159 688711 698993 709937 721288 732870 744804 757279 770239 783466 796880 810545 824517
62042 824517 838914 853974 869794 886096 902585 919420 937014 955399 974165 993068 1012316
62031 1012316 1032158 1052553 1073380 1094576 1115810 1136318 1155482 1173484 1191107 1208964 1227187
62020 1227187 1245790 1264950 1284717 1304609 1323782 1341638 1358256 1374215 1390105 1406291 1423057
62009 1423057 1440737 1459539 1479385 1500093 1521658 1544141 1567293 1590540 1613383 1635622 1657093
61998 1657093 1677442 1696313 1713642 1729602 1744342 1757910 1770326 1781554 1791433 1799796 1806670 1812257
61986 1812257 1816753 1820266 1822950 1825101 1827063 1828999 1830741 1831865 1832017 1831219 1829842 1828278 1826631 1824713
61972 1824713 1822267 1819223 1815794 1812320 1808935 1805402 1801376 1796803 1791954 1787073 1782175 1777244 1772429 1767917
61958 1767917 1763723 1759774 1756107 1752855 1750057 1747614 1745426 1743493 1741863 1740588 1739683 1739113 1738806 1738725 1738891
61943 1738891 1739317 1739960 1740794 1741873 1743254 1744839 1746351 1747476 1748005 1747827 1746770 1744516 1740743 1735404 1728773
61928 1728773 1721179 1712754 1703518 1693562 1682935 1671458 1658899 1645389 1631382 1617141 1602483 1587194
61916 1587194 1571505 1555936 1540762 1525864 1511020 1496144 1481259 1466452 1451946 1438053 1424890
61905 1424890 1412184 1399483 1386654 1374101 1362374 1351612 1341453 1331546 1321946 1312898 1304400 1296247
61893 1296247 1288477 1281468 1275515 1270491 1266057 1262060 1258594 1255767 1253552 1251816 1250487 1249769 1250170 1252140
61879 1252140 1255628 1260087 1265009 1270325 1276301 1283244 1291416 1301076 1312375 1325299 1339792 1355896 1373753
61866 1373753 1393593 1415782 1440717 1468548 1499186 1532693 1569511 1610147 1654843 1703812 1757703
61855 1757703 1817562 1884362 1958736 2041201 2132482 2233637 2345979 2470849 2609320 2762100
61845 2762100 2929749 3112901 3312073 3527236 3757503 4000967 4254444 4513095 4770088
61836 4770088 5016348 5240593 5430159 5572814 5658935 5683013 5644115 5545641 5394593 5200371
61826 5200371 4973309 4723486 4460118 4191371 3924220 3664223 3415296 3179808 2959094
61817 2959094 2754013 2565008 2391826 2233572 2089277 1958229 1839645 1732332 1634954 1546494
61807 1546494 1466172 1393096 1326369 1265484 1210265 1160383 1115195 1074053 1036508 1002177 970683
61796 970683 941820 915538 891699 870029 850320 832505 816519 802273 789760 778932 769449 760850
61784 760850 753019 746180 740359 735200 730514 726675 724177 722981 722558 722469 722649 723261 724508 726512 729159
61769 729159 732091 735033 738071 741486 745408 749844 754936 760955 768045 776226 785610 796390 808575 821940
61755 821940 836309 851703 868157 885667 904406 924805 947203 971601 997915 1026317 1057064
61744 1057064 1090107 1125146 1162111 1201333 1243210 1287985 1335986 1387818 1444044 1504702 1569414
61733 1569414 1637942 1710562 1787907 1870672 1959551 2055307 2158773 2270796 2392260 2524189
61723 2524189 2667824 2824608 2996034 3183497 3388428 3612616 3858243 4127387 4421489
61714 4421489 4741453 5088074 5461941 5862707 6288465 6735607 7198544 7668769 8133864
61705 8133864 8577352 8979516 9318931 9574716 9729604 9772987 9702648 9524609 9251547 8900557
61695 8900557 8490722 8040858 7567892 7086136 6607265 6140613 5693373 5270601 4875254
61686 4875254 4508573 4170717 3861174 3578850 3322162 3089364 2878729 2688397 2516232
61677 2516232 2360108 2218292 2089456 1972418 1866042 1769263 1681066 1600496 1526869 1459820
61667 1459820 1398930 1343379 1292233 1244968 1201449 1161436 1124457 1090206 1058685 1029798 1003042
61656 1003042 977820 953880 931267 910001 890001 871235 853710 837308 821746 806724 792063
61645 792063 777751 763921 750730 738157 725949 713809 701645 689599 677872 666570 655665
61634 655665 645050 634656 624568 615016 606204 598073 590290 582497 574630 566945 559743 553153 547218
61621 547218 542054 537721 533965 530303 526432 522394 518305 514196 510214 506736 504013 501825 499730 497583
61607 497583 495593 493946 492569 491192 489444 486949 483602 479791 476148 473031 470360 467860 465266 462342
61593 462342 459001 455482 452223 449461 447148 445237 443862 443116 442829 442670 442370 441838 441148 440473 439947 439587
61577 439587 439410 439563 440176 441156 442308 443619 445191 446928 448559 450054 451737 453869 456283 458568 460479
61562 460479 462094 463670 465377 467063 468222 468373 467523 466176 464839 463647 462447 461063 459387 457381 455078
61547 455078 452523 449693 446583 443323 440114 437063 434235 431731 429530 427321 424821 422238 420074 418474
61533 418474 417127 415885 415072 414988 415496 416393 417871 420258 423478 427121 430957 435109 439812 445231 451472
61518 451472 458545 466293 474543 483263 492497 502212 512400 523244 534979 547615 560906 574602 588594
61505 588594 602812 617118 631346 645399 659233 672734 685656 697753 709040 719766 730071
61494 730071 739742 748480 756268 763246 769333 774281 778092 781023 783151 784268 784295 783510 782161 780170 777403
61479 777403 774023 770374 766720 763241 760056 757093 754188 751507 749675 749311 750582 753336 757386 762472
61465 762472 768302 774954 783016 793044 805041 818773 834412 852495 873406 897237 924060 954028
61453 954028 987249 1023881 1064326 1109079 1158421 1212486 1271546 1335985 1406023 1481664 1562799
61442 1562799 1649088 1739827 1834145 1931182 2029710 2127524 2221476 2308090 2384105 2446703 2493781
61431 2493781 2524156 2537417 2533703 2513922 2480011 2434509 2379765 2317799 2250821 2181359 2111701
61420 2111701 2043506 1978018 1916278 1858941 1806202 1758147 1715066 1677310 1645100 1618562 1597722
61409 1597722 1582270 1571593 1565268 1563363 1566035 1572927 1583175 1596002 1611133 1628639 1648444 1670032
61397 1670032 1692609 1715559 1738682 1761952 1785141 1807800 1829564 1850319 1870149 1889282 1908083
61386 1908083 1926868 1945721 1964640 1983824 2003531 2023633 2043581 2062887 2081397 2098972 2115140
61375 2115140 2129254 2140858 2149811 2156197 2160244 2162169 2161900 2159085 2153464 2145213 2134829 2122846 2109784
61362 2109784 2096177 2082406 2068558 2054643 2040977 2028182 2016785 2006961 1998711 1992133 1987388 1984416
61350 1984416 1982838 1982165 1982099 1982543 1983401 1984422 1985290 1985721 1985451 1984282 1982276 1979869 1977669 1976181 1975795 1976934
61334 1976934 1980072 1985681 1994373 2007080 2024840 2048359 2077902 2113661 2156081 2205725 2262929 2327693
61322 2327693 2399815 2479028 2564988 2657117 2754450 2855627 2959008 3062670 3164153 3260285
61312 3260285 3347461 3422237 3481795 3524161 3548295 3554082 3542126 3513469 3469501 3411909 3342417
61301 3342417 3262537 3173706 3077643 2976399 2871990 2766096 2660087 2555160 2452394 2352790
61291 2352790 2257305 2166735 2081539 2001875 1927806 1859391 1796660 1739687 1688692 1643866 1605075
61280 1605075 1571873 1543870 1520945 1503118 1490325 1482301 1478505 1478208 1480878 1486487 1495239 1506967 1521021
61267 1521021 1536780 1553957 1572336 1591485 1610901 1630245 1649220 1667432 1684607 1700779 1716002
61256 1716002 1730009 1742407 1753188 1762731 1771314 1778832 1785088 1790117 1793995 1796446 1796868 1794804 1790273
61243 1790273 1783589 1774986 1764514 1752171 1737929 1721669 1703310 1683074 1661441 1638781 1615215 1590948
61231 1590948 1566497 1542411 1518929 1496147 1474321 1453776 1434655 1417088 1401470 1388165 1376974
61220 1376974 1367250 1358594 1351085 1344726 1339045 1333448 1327683 1321763 1315659 1309288 1302649 1295799 1288854 1282180
61206 1282180 1276379 1271877 1268630 1266457 1265557 1266464 1269543 1274750 1281989 1291547 1304062 1320083 1339739 1362912
61192 1362912 1389646 1420213 1454655 1492468 1532913 1575480 1619735 1664667 1708481 1749111 1784715
61181 1784715 1813615 1834034 1844188 1842653 1828712 1802624 1765711 1720020 1667716 1610720 1550772
61170 1550772 1489479 1428120 1367603 1308747 1252461 1199498 1150151 1104380 1062194 1023757 989165
61159 989165 958191 930280 904875 881823 861414 843862 828804 815517 803602 793215 784615 777809
61147 777809 772727 769410 767799 767563 768368 770166 773018 776801 781257 786221 791572 797030 802144 806417 809337
61132 809337 810434 809534 806909 803047 798249 792526 785796 778083 769582 760561 751203 741521 731511 721333
61118 721333 711166 700942 690439 679676 668951 658471 648197 638118 628337 618698 608635 597678
61106 597678 585929 573850 561785 549910 538401 527342 516537 505709 494863 484274 474194
61095 474194 464702 455709 446950 438079 428995 419967 411289 402905 394568 386245 378164 370552 363500 357015
61081 357015 350987 345160 339367 333818 329021 325395 322993 321506 320475 319628 319139 319406 320517 322132 324010
61066 324010 326335 329281 332539 335638 338578 341774 345441 349375 353295 357075 360659 364089 367647 371677
61052 371677 376187 380847 385393 389775 393914 397618 400862 403851 406655 408954 410333 410650 410002 408511 406368
61037 406368 403947 401610 399356 396870 393962 390812 387637 384296 380421 375944 371242 366667 362140 357410
61023 357410 352550 347925 343715 339780 336023 332583 329578 326937 324596 322614 320991 319589 318387 317552
61009 317552 317115 316811 316438 316136 316108 316285 316510 316836 317329 317752 317753 317310 316775 316504 316660 317224 317999 318728 319454 320628
60989 320628 322593 325070 327441 329441 331320 333440 336060 339444 343738 348693 353846 359127 365017 371977
60975 371977 379907 388304 396775 405228 413697 422201 430793 439615 448817 458408 468274 478355 488771 499659
60961 499659 510998 522730 535004 548117 562253 577485 593956 611766 630650 650173 670342
60950 670342 691707 714786 739733 766705 796071 828010 862327 898916 938065 980000 1024579
60939 1024579 1071766 1122030 1175816 1233052 1293659 1358271 1427917 1503271 1584731 1672934 1768648
60928 1768648 1872358 1984557 2106387 2239719 2386957 2551259 2736470 2946165 3183125
60919 3183125 3450478 3752898 4095870 4484358 4923250 5418582 5977041 6604975 7308864
60910 7308864 8092343 8942457 9811364 10615338 11264700 11707614 11952472 12052867 12074633 12074221
60900 12074221 12093438 12152868 12235511 12278506 12194461 11915775 11428774 10772793 10011881 9206245
60890 9206245 8400057 7621998 6888792 6208496 5584459 5018540 4511535 4062132 3667024
60881 3667024 3322049 3022548 2762984 2537266 2339782 2165933 2011914 1874551 1751347
60872 1751347 1640290 1539542 1447520 1363106 1285501 1213984 1148008 1087388 1032086 981797 935832
60861 935832 893244 853032 814522 777701 742949 710362 679639 650682 623800 599076 576033
60850 576033 554312 534232 516177 499776 484199 469132 454946 442038 430415 419887 410277 401436
60838 401436 393288 385845 379044 372743 367020 362196 358352 355146 352393 350456 349612 349354 348896 348171 347757
60823 347757 347918 348292 348578 348966 349685 350564 351247 351558 351459 350866 349736 348237 346707 345400 344227 342738 340502
60806 340502 337589 334525 331667 328828 325714 322463 319506 317067 315103 313572 312437 311537 310795 310457 310797
60791 310797 311681 312763 314101 316179 319291 323218 327613 332408 337723 343543 349647 355798 361943 368233
60777 368233 374742 381182 387062 392195 396828 401170 405091 408502 411692 414969 418225 421214 423993 426674
60763 426674 428969 430496 431425 432322 433407 434430 435238 435936 436433 436348 435531 434269 432802 430995 428665 425902
60747 425902 422852 419470 415653 411457 407034 402524 398088 393845 389718 385544 381384 377498 373993 370734
60733 370734 367641 364865 362599 360985 360217 360435 361423 362709 364089 365828 368257 371456 375404 380091 385298
60718 385298 390575 395728 401116 407224 414055 421154 428092 434755 441247 447747 454360 460955 467165 472663
60704 472663 477370 481341 484551 486998 488949 490874 493016 495049 496332 496612 496477 496922 498300 499886 500626
60689 500626 500251 499409 498848 498789 499079 499568 500105 500404 500116 499038 497212 494971 492809 491005 489343 487377 484991
60672 484991 482431 479795 476833 473398 469764 466258 462825 459256 455718 452784 450913 450067 449821 449749 449683 449691
60656 449691 449856 450101 450329 450634 451198 451934 452419 452231 451240 449501 447028 443826 440076 436201 432765 430200
60640 430200 428442 426873 424875 422534 420569 419483 419022 418611 418024 417391 416740 415881 414658 413031 410882 407974
60624 407974 404195 399720 394865 389875 384829 379662 374248 368579 362896 357615 353064 349292 346083 343165
60610 343165 340397 337821 335565 333737 332401 331585 331244 331259 331511 331921 332359 332640 332706 332730 332879 333030 332933 332619
60592 332619 332402 332433 332544 332676 333198 334567 336728 339105 341157 342803 344264 345712 347166 348655 350298 352170
60576 352170 354169 356169 358286 360864 364112 367871 371874 376147 380976 386505 392509 398627 404666 410686
60562 410686 416899 423542 430747 438448 446415 454359 462019 469236 476045 482583 488793 494311 498756 502088
60548 502088 504484 505986 506474 505953 504642 502766 500434 497714 494588 490828 486128 480463 474172 467633 460991
60533 460991 454236 447390 440616 434238 428679 424187 420607 417583 414964 412872 411395 410401 409669 408974 408034
60518 408034 406634 404887 403207 401945 401176 400800 400652 400523 400352 400431 401151 402486 403998 405445 407106 409405
60502 409405 412450 416045 419866 423475 426492 428974 431384 433963 436371 438107 439090 439622 440028 440622 441768
60487 441768 443624 445922 448332 451007 454498 459160 464941 471687 479388 488047 497527 507670 518486 530130
60473 530130 542676 555824 568771 580484 590232 597788 603033 605536 604786 600869 594730 587714 580888
60460 580888 574741 569382 564905 561597 559823 559822 561676 565355 570679 577257 584690 592844 601760 611318 621262
60445 621262 631583 642615 654680 667925 682638 699400 718651 740400 764657 791941 823068
60434 823068 858583 898737 943860 994379 1050491 1112196 1179690 1253471 1333988 1421483 1516192
60423 1516192 1618495 1728734 1846905 1972207 2102172 2231792 2353654 2459391 2541371 2593591
60413 2593591 2611840 2594031 2540892 2456323 2346744 2219673 2082328 1940867 1800178 1663873
60403 1663873 1534336 1412985 1300706 1198100 1105378 1022208 947862 881532 822522 770241
60393 770241 724134 683597 647882 616157 587732 562201 539296 518609 499608 481926 465569
60382 465569 450808 437782 426220 415556 405414 395868 387153 379188 371577 364075 356831 350109 343996
60369 343996 338461 333495 329061 325065 321505 318474 315921 313611 311467 309747 308642 307894 307069 306123 305443
60354 305443 305372 305896 306765 307709 308532 309178 309729 310262 310761 311295 312148 313540 315256 316806 317971 319042 320452
60337 320452 322313 324392 326427 328399 330554 333133 336036 338796 340988 342584 343840 344872 345556 345825 345870
60322 345870 345960 346148 346257 346101 345647 344935 343947 342627 341033 339395 337940 336793 336106 336161 337061 338386 339438
60305 339438 339925 340149 340457 340821 341103 341437 342082 343076 344321 345862 347800 350025 352297 354562 356938 359466
60289 359466 362126 365063 368535 372584 376915 381137 385018 388518 391765 394998 398357 401681 404571 406690
60275 406690 407962 408577 408866 409091 409278 409308 409255 409495 410384 411981 414166 416795 419555 421922 423535 424493 425042
60258 425042 425110 424480 423234 421670 419844 417638 415224 413056 411282 409556 407577 405553 403899 402748 401911
60243 401911 401176 400479 399916 399718 400088 400960 402056 403277 404892 407223 410223 413508 416769 420020 423429 426948
60227 426948 430200 432820 434893 436884 439081 441261 443073 444569 446103 447852 449749 451848 454384 457418
60213 457418 460701 464028 467489 471277 475489 480263 485893 492632 500467 509187 518599 528615 539266 550737
60199 550737 563306 577175 592421 609123 627388 647214 668496 691300 715962 742809 771843
60188 771843 802813 835615 870567 908286 949253 993405 1040183 1089037 1139787 1192341 1246135
60177 1246135 1300062 1353033 1404385 1453678 1500289 1543361 1582098 1615967 1644658 1667946 1685608
60166 1685608 1697551 1704026 1705634 1703021 1696653 1687026 1675005 1661748 1648265 1635243 1623274 1613035
60154 1613035 1605199 1600353 1599060 1601875 1609222 1621361 1638497 1660735 1687940 1719796 1756037 1796412
60142 1796412 1840378 1887041 1935459 1984799 2034092 2082084 2127491 2169280 2206605 2238631 2264613
60131 2264613 2284013 2296390 2301278 2298344 2287712 2270083 2246570 2218452 2186922 2153009 2117752 2082414
60119 2082414 2048368 2016746 1988368 1964004 1944422 1930106 1921172 1917779 1920386 1929365 1944543 1965369
60107 1965369 1991322 2021808 2055781 2091854 2128833 2165828 2201779 2235326 2265365 2291471 2313490
60096 2313490 2330967 2343408 2351056 2355025 2356550 2356375 2354999 2353247 2352379 2353767 2358706 2368404 2383833 2405562
60082 2405562 2433918 2469298 2512139 2562586 2620513 2685980 2759500 2841719 2933026 3033571 3143471
60071 3143471 3262734 3391031 3527650 3671577 3821543 3976065 4133446 4291584 4447747
60062 4447747 4598818 4742001 4875132 4996196 5102839 5192647 5263781 5315106 5345844 5355394
60052 5355394 5343440 5310033 5255692 5181670 5090066 4983472 4864663 4736788 4603530 4468621
60042 4468621 4335209 4205952 4083421 3969935 3867035 3775635 3696712 3631385 3580233 3543003
60032 3543003 3519114 3508060 3509137 3521138 3542484 3571364 3605570 3642543 3679834 3715362 3747156
60021 3747156 3773185 3791704 3801584 3802157 3792972 3773895 3745259 3707701 3661922 3608665 3548725 3482836
60009 3482836 3411715 3336307 3257862 3177734 3097273 3017885 2940878 2867143 2797260 2731996 2672421
59998 2672421 2619382 2573182 2533937 2501968 2477666 2461234 2452777 2452413 2460062 2475327 2497731 2526880
59986 2526880 2562149 2602456 2646471 2692845 2740060 2786371 2830168 2870211 2905257 2933734 2954111
59975 2954111 2965484 2967533 2960123 2943296 2917492 2883357 2841410 2792291 2737408 2679008 2619419 2560352
59963 2560352 2502900 2447942 2396391 2349153 2307020 2270626 2240486 2217040 2200601 2191261 2188986 2193876
59951 2193876 2206247 2226451 2254661 2290809 2334600 2385529 2443021 2506498 2575128 2647533 2721948
59940 2721948 2796645 2869900 2939603 3003365 3059252 3106184 3143498 3170504 3186694 3192005 3186550 3170368
59928 3170368 3143874 3108332 3065515 3016996 2964117 2908537 2852356 2797584 2745693 2697710 2654549
59917 2654549 2617230 2586887 2564496 2550513 2544853 2547261 2557502 2575113 2599270 2629181 2664414 2704552
59905 2704552 2748670 2795460 2843693 2892294 2940115 2986062 3029485 3070147 3107806 3142011 3172305
59894 3172305 3198436 3220437 3238771 3254384 3268426 3281890 3295704 3311080 3329535 3352548 3381408
59883 3381408 3417442 3462160 3517030 3583123 3660984 3750861 3853064 3968068 4096141 4236815
59873 4236815 4388784 4550177 4718586 4890779 5062669 5229684 5386899 5528818 5649649
59864 5649649 5744343 5809266 5841910 5840619 5805271 5737991 5642688 5523916 5386399 5235157 5075272
59853 5075272 4911366 4747532 4587588 4434848 4291679 4159698 4040329 3934732 3843342 3766074
59843 3766074 3703088 3654877 3621572 3602650 3597446 3605474 3626080 3658137 3700224 3750727 3807604 3868370
59831 3868370 3930440 3991139 4047322 4095401 4131961 4154136 4159372 4145439 4111097 4056588 3983246
59820 3983246 3892883 3787722 3670585 3544690 3413216 3279095 3144942 3012884 2884542 2761299
59810 2761299 2644482 2535178 2434028 2341320 2257138 2181336 2113528 2053263 2000076 1953337 1912255
59799 1912255 1876101 1844210 1815671 1789315 1764230 1740121 1717024 1694848 1673392 1652654 1632861
59788 1632861 1614298 1597255 1582067 1568995 1558050 1548937 1541084 1533639 1525654 1516400 1505522 1492845
59776 1492845 1478261 1461917 1444310 1425995 1407272 1388411 1370078 1353287 1338841 1326931 1317347
59765 1317347 1310012 1305219 1303379 1304657 1308970 1316276 1326675 1340130 1356233 1374424 1394343 1415859
59753 1415859 1438894 1463461 1489756 1517884 1547457 1577637 1607537 1636320 1663033 1686765 1707157
59742 1707157 1724499 1739206 1751471 1761573 1770200 1778183 1786090 1794337 1803608 1814922 1829303 1847522
59730 1847522 1870101 1897446 1929988 1968319 2013223 2065562 2126138 2195615 2274456 2362931 2461321
59719 2461321 2570065 2689551 2819661 2959543 3107634 3261475 3417182 3569057 3709691
59710 3709691 3830634 3923690 3982810 4005710 3994083 3952332 3886149 3801836 3705947 3604525 3502315
59699 3502315 3402747 3308567 3222254 3145820 3080370 3026034 2982407 2949172 2926366 2914095 2912088
59688 2912088 2919715 2936413 2961920 2996100 3038795 3089962 3149776 3218463 3296193 3383272 3480277
59677 3480277 3587844 3706342 3835912 3976785 4129506 4294891 4473781 4666766 4874143
59668 4874143 5096162 5333230 5585563 5852632 6133141 6425504 6727950 7037990 7352033
59659 7352033 7665862 7975394 8277044 8567912 8846307 9112247 9367301 9613907 9854929
59650 9854929 10093516 10332831 10575622 10823996 11079315 11341732 11609518 11878938 12144935
59641 12144935 12401856 12643621 12863755 13055961 13215093 13337764 13422384 13469163 13480338 13460203
59631 13460203 13414580 13350109 13273898 13193366 13115763 13047517 12994110 12960534 12951581 12971508 13023589
59620 13023589 13110151 13232855 13392784 13590343 13825131 14095683 14399028 14730519 15083958
59611 15083958 15451371 15822213 16182969 16517974 16810730 17044709 17204064 17275377 17250003 17125409
59601 17125409 16904925 16596906 16213876 15771181 15285131 14771569 14245307 13719594 13205151
59592 13205151 12709525 12237389 11790980 11369774 10969851 10584255 10204626 9823237 9434595
59583 9434595 9036348 8629499 8217875 7806973 7402539 7009421 6631233 6270712 5930066
59574 5930066 5610845 5313671 5038424 4784662 4551698 4338459 4143635 3966033 3804572
59565 3804572 3658076 3525326 3405272 3296864 3198755 3109567 3028492 2955242 2889396 2830167
59555 2830167 2776752 2728435 2684203 2642714 2602826 2563821 2524996 2485513 2444833 2402883 2359589
59544 2359589 2314645 2267991 2220188 2172069 2124360 2077819 2033246 1991033 1951092 1913559 1879159
59533 1879159 1848482 1821289 1797038 1775818 1758212 1744449 1734150 1726880 1722485 1720950 1722266 1726401
59521 1726401 1733121 1741883 1752164 1763804 1776852 1791208 1806694 1823270 1840937 1859574 1879215 1900357
59509 1900357 1923636 1949338 1977475 2008255 2042141 2079532 2120706 2166014 2215890 2270715 2330865
59498 2330865 2396717 2468405 2545744 2628712 2717842 2813793 2916726 3026432 3142804 3265622
59488 3265622 3393905 3526017 3660515 3796480 3932986 4068676 4202040 4331725 4456387
59479 4456387 4574598 4685232 4787813 4882314 4968698 5046779 5116432 5177790 5231361 5278083 5319290
59468 5319290 5356524 5391304 5424956 5458560 5492943 5528549 5565050 5601001 5634039 5661464 5680543
59457 5680543 5688315 5681587 5657504 5614077 5550112 5465008 5359000 5233461 5090614 4932976 4763313
59446 4763313 4584969 4401779 4217479 4035221 3857499 3686268 3523106 3369398 3226343
59437 3226343 3094664 2974447 2865412 2767284 2679824 2602711 2535580 2478067 2429662 2389790 2358162
59426 2358162 2334779 2319322 2310924 2308921 2313570 2325539 2344885 2371054 2403798 2443478 2490409 2544399
59414 2544399 2605124 2672558 2746811 2827728 2914798 3007199 3103720 3202735 3302284 3400138 3493850
59403 3493850 3580847 3658439 3723658 3773375 3804944 3816819 3808487 3779987 3731851 3665398 3582771
59392 3582771 3486574 3379545 3264375 3143562 3019425 2894362 2770863 2650984 2535938 2426428
59382 2426428 2323168 2226726 2137098 2053922 1977095 1906822 1843106 1785633 1734069 1688094 1647158
59371 1647158 1610684 1578566 1551094 1528321 1509824 1495095 1483841 1475872 1471024 1469247 1470416 1474029
59359 1474029 1479434 1486430 1495379 1506690 1520450 1536455 1554333 1573742 1594778 1618018 1643701 1670944
59347 1670944 1698332 1725271 1752316 1780283 1809767 1841660 1877356 1918042 1964269 2016467 2075309
59336 2075309 2141045 2212850 2289391 2370077 2455631 2547766 2648524 2759640 2882159 3016681
59326 3016681 3163956 3324918 3500036 3689023 3891353 4106657 4334222 4572268 4817891
59317 4817891 5067420 5316657 5561184 5796924 6020458 6228893 6419847 6591856 6744452
59308 6744452 6877547 6991022 7085125 7160828 7219244 7260786 7285190 7292081 7281079 7251505 7202490
59297 7202490 7133582 7045126 6938319 6815259 6678918 6532717 6379905 6223300 6065235 5907317
59287 5907317 5750171 5593681 5437440 5280818 5122807 4962345 4799047 4633468 4466576
59278 4466576 4299185 4132042 3966270 3803488 3645413 3493453 3348681 3212042 3084387
59269 3084387 2966155 2857200 2757118 2665733 2583108 2509147 2443429 2385441 2334714 2290652 2252490
59258 2252490 2219683 2192165 2170060 2153183 2141023 2133130 2129325 2129515 2133464 2140878 2151670 2166055
59246 2166055 2184239 2206024 2230807 2258033 2287425 2318668 2351075 2383878 2416689 2449317 2481200
59235 2481200 2511417 2539358 2565046 2588697 2610296 2629773 2647344 2663481 2678757 2693936 2710023
59224 2710023 2728008 2748565 2772053 2798692 2828705 2862371 2899964 2941490 2986468 3034085 3083470
59213 3083470 3133599 3183015 3230031 3273231 3311500 3343603 3368155 3384086 3390726 3387379 3373378 3349007
59201 3349007 3316091 3277262 3234798 3190368 3145615 3102461 3062691 3027418 2996989 2971347 2950482
59190 2950482 2934610 2923900 2918146 2916844 2919475 2925472 2933982 2944121 2955557 2968592 2983590 3000710
59178 3000710 3020337 3043434 3071161 3104377 3143665 3189638 3243048 3304811 3376059 3457879 3550751
59167 3550751 3654299 3767592 3889315 4017474 4149120 4280515 4407343 4524767 4627775
59158 4627775 4711792 4772852 4807329 4812125 4785590 4727954 4640665 4525717 4386000 4225818 4050416
59147 4050416 3864949 3674121 3482370 3293683 3111035 2936304 2770719 2615239 2470553
59138 2470553 2337009 2214596 2102921 2001312 1909084 1825626 1750228 1682041 1620337 1564546
59128 1564546 1513963 1467732 1425343 1386805 1352091 1320684 1291974 1265772 1242145 1221010 1202242
59117 1202242 1185915 1172042 1160251 1150119 1141657 1135158 1130698 1128144 1127490 1128854 1132224 1137545 1144914
59104 1144914 1154410 1165847 1178988 1193851 1210541 1228971 1249066 1271021 1294962 1320571 1347483
59093 1347483 1375926 1406487 1439301 1473917 1509958 1547393 1586134 1625792 1666026 1706740 1747722
59082 1747722 1788268 1827362 1864151 1898168 1929207 1957042 1981243 2001341 2017249 2029415 2038458
59071 2038458 2044798 2048777 2050960 2052152 2053263 2055340 2059482 2066482 2076684 2090407 2108337 2131233 2159439
59058 2159439 2192964 2231899 2276452 2326764 2382962 2445267 2513695 2587762 2666684 2749700 2835882
59047 2835882 2923804 3011732 3097921 3180320 3256154 3322263 3375926 3415123 3438294 3444435 3433566
59036 3433566 3406790 3365880 3313033 3250771 3181551 3107302 3029520 2949617 2868756 2787433 2705660
59025 2705660 2623596 2541627 2459914 2378374 2297176 2216860 2137841 2060169 1983871 1909170 1836296
59014 1836296 1765382 1696692 1630673 1567635 1507590 1450448 1396179 1344804 1296507 1251716 1210764
59003 1210764 1173428 1139071 1107263 1077970 1051187 1026749 1004572 984651 966689 950026 934148
58992 934148 919018 904755 891141 877566 863330 847991 831559 814399 796820 778846 760522
58981 760522 742271 724649 707893 692037 677329 664121 652372 641712 632005 623437 616027 609542
58969 609542 603984 599697 596750 594645 592871 591426 590537 590184 590186 590526 591264 592229 593058 593501 593576 593531 593742 594502
58951 594502 595798 597385 599126 601127 603497 606190 609199 612715 616911 621672 626675 631692 636744 641974
58937 641974 647417 652928 658370 663844 669586 675627 681732 687827 694235 701263 708749 716301 723837 731577
58923 731577 739647 748030 756841 766248 776126 786123 796174 806623 817820 829882 842897 857049 872432
58910 872432 888938 906424 924823 944079 964205 985392 1007867 1031603 1056340 1081840 1107922
58899 1107922 1134300 1160673 1187003 1213516 1240475 1268105 1296663 1326342 1357160 1389183 1422751
58888 1422751 1458237 1495731 1535316 1577553 1623280 1672932 1726386 1783509 1844535 1909884 1979940
58877 1979940 2055052 2135500 2221459 2313214 2411345 2516472 2628889 2748808 2876898 3014250
58867 3014250 3161824 3320221 3489957 3671590 3865600 4072440 4292691 4526896 4775260
58858 4775260 5037684 5313875 5603002 5903334 6212422 6527316 6844100 7157368 7460637
58849 7460637 7747030 8009151 8238730 8427504 8568745 8657672 8690885 8666577 8585695 8452170
58839 8452170 8271721 8050791 7796497 7516538 7218451 6909146 6595045 6281869 5973937
58830 5973937 5674256 5385575 5110742 4851735 4608958 4381961 4170440 3974256 3793036
58821 3793036 3626128 3472580 3330861 3199110 3076011 2961006 2853431 2752078 2656034 2565376
58811 2565376 2480487 2401135 2326730 2257095 2192439 2132806 2078030 2028018 1982621 1941449 1904191
58800 1904191 1870917 1841742 1816407 1794498 1775862 1760509 1748374 1739475 1734029 1732111 1733431 1737693
58788 1737693 1744960 1755478 1769464 1787295 1809453 1835942 1866130 1899553 1936508 1977522 2022574
58777 2022574 2071319 2123774 2180333 2241334 2307025 2377781 2453956 2535707 2623278 2717272 2818335
58766 2818335 2926806 3043028 3167733 3301793 3445818 3600400 3766447 3944898 4136274
58757 4136274 4340923 4559462 4792508 5040058 5301454 5575696 5861274 6155652 6455196
58748 6455196 6755488 7051366 7336684 7604309 7846415 8054858 8221775 8340503 8406260 8416309
58738 8416309 8370025 8269188 8117865 7921623 7686858 7420771 7131196 6825722 6510957 6192729
58728 6192729 5876426 5566528 5266018 4976728 4700159 4437570 4189554 3956106 3737118
58719 3737118 3532445 3341597 3163753 2998091 2843845 2700204 2566436 2442001 2326178
58710 2326178 2217795 2115703 2019469 1929229 1844967 1766254 1692635 1623863 1559747 1500029 1444482
58699 1444482 1392944 1345251 1301234 1260710 1223383 1188872 1156940 1127509 1100442 1075497 1052554
58688 1052554 1031550 1012109 993645 975975 959429 944149 929738 915838 902588 890120 878104
58677 878104 866186 854479 843174 832028 820752 809562 798812 788298 777478 766198 754713
58666 754713 743149 731376 719288 706781 693653 679881 665847 651857 637695 623038 608144
58655 608144 593641 579811 566514 553672 541373 529617 518340 507627 497567 488039 478971 470603
58643 470603 463164 456457 450140 444183 438690 433490 428332 423329 418808 414854 411305 407972 404597 400890
58629 400890 396996 393565 390953 388695 386233 383775 381825 380193 378177 375554 372731 370054 367552 365309
58615 365309 363496 362078 360942 360232 360085 360213 360199 360109 360283 360733 361272 362103 363642 365854 368327 370896 373643
58598 373643 376390 378793 380955 383349 386147 389124 392187 395498 399135 403180 408124 414558 422462 431271
58584 431271 440653 450750 461688 473382 485871 499325 513694 528817 544887 562357 581354 601707
58572 601707 623538 647366 673539 701998 732664 765645 801102 839298 880812 926304 976079
58561 976079 1030170 1088767 1152192 1220589 1294005 1372562 1456078 1543661 1634096 1726326 1819025
58550 1819025 1909883 1995888 2074113 2141663 2195228 2231636 2249085 2247365 2227107 2189528 2136830
58539 2136830 2071986 1997893 1917159 1832555 1746862 1662082 1579376 1499828 1424634 1354474 1289288
58528 1289288 1228884 1173293 1122459 1076104 1033986 995868 961244 929581 900762 874806 851248
58517 851248 829374 808944 790073 772482 755519 738899 722765 707081 691637 676553 662024
58506 662024 647579 632444 616670 601178 586602 572838 559761 547479 535709 523753 511452
58495 511452 499456 488275 477756 467740 458521 450304 442827 435860 429513 423758 418205 412655 407411
58482 407411 402764 398633 394907 391674 388940 386529 384349 382342 380180 377584 374938 372972 371808 370905
58468 370905 369923 368908 367591 365373 362183 358624 355016 350988 346200 340805 334989 328760 322402 316449
58454 316449 310939 305389 299719 294538 290269 286627 283241 280134 277364 274826 272633 271107 270163 269301 268330
58439 268330 267463 266600 265328 263774 262673 262345 262321 262178 261941 261474 260372 258793 257583 257189 257191 257177 257293 257592
58421 257592 257728 257713 258171 259352 260607 261297 261551 261745 261958 262360 263424 265247 267254 268942 270366 271670
58405 271670 272833 274126 275990 278166 279751 280436 280863 281388 281437 280486 278783 276593 273640 269862 265885 262170
58389 262170 258440 254479 250660 247144 243401 239152 235028 231625 228680 225777 223156 221141 219490 217915
58375 217915 216610 215680 214722 213543 212601 212217 212034 211791 211833 212368 213015 213670 214976 217286 219963 222352 224622
58358 224622 227011 229128 230757 232566 235155 238166 241115 244380 248516 253257 258001 262703 267484 271959
58344 271959 275730 279011 282125 284873 286999 288640 289816 290152 289653 288983 288452 287529 285942 284315 283084
58329 283084 281795 280227 279187 279248 279659 279533 279275 279817 281137 282536 283703 284588 284904 284687 284715 285489 286428
58312 286428 286869 287140 287840 288831 289793 290999 292684 294411 295899 297683 300110 302525 304304 305815 307495
58297 307495 308943 309857 310868 312409 313743 314203 314437 315282 316377 317062 317683 318779 319877 320345 320602 321270
58281 321270 322015 322444 323245 325153 327697 330278 333485 337925 342721 346706 350304 354693 359869 365022 370074
58266 370074 375337 380359 384636 388787 393603 398622 403036 407231 411950 416748 420799 424450 428480 432602
58252 432602 436259 440066 444831 449964 454496 458833 463890 469285 474112 478707 483916 489421 494571 500031
58238 500031 506816 514485 522063 529907 538843 548349 557504 566827 577201 587902 597785 607490 618369
58225 618369 630121 641699 653644 667118 681471 695213 708710 723483 739474 755462 771587
58214 771587 789055 807871 827276 847789 870422 894509 918735 943630 970603 999309 1028581
58203 1028581 1059148 1092671 1128848 1166305 1205617 1248472 1294461 1341727 1390218 1441314 1494823
58192 1494823 1549418 1605475 1664465 1726091 1789138 1854457 1923983 1997568 2073985 2154138 2239842
58181 2239842 2330450 2424423 2523258 2629971 2744689 2865837 2994647 3133965 3283390 3440259
58171 3440259 3604762 3779360 3963881 4156265 4357628 4571528 4798757 5038142 5291889
58162 5291889 5564450 5856559 6166210 6495108 6848071 7226530 7629031 8057810 8518174
58153 8518174 9011832 9537956 10100385 10706286 11358365 12056812 12808582 13626226 14518639
58144 14518639 15493370 16567992 17768845 19119244 20640773 22365450 24333481 26580894
58136 26580894 29146174 32088073 35475054 39351575 43730988 48621906 54048464 60073102
58128 60073102 66856079 74657002 83592763 93198758 102211562 108950292 112115731 111377938
58120 111377938 107337615 101043576 93526616 85582523 77734798 70264603 63283602 56829530
58112 56829530 50926538 45589612 40814668 36584682 32875949 29652130 26863741 24461856
58104 24461856 22407044 20663007 19191249 17958134 16941416 16124729 15489703 15017276
58096 15017276 14692396 14503011 14439700 14507177 14738398 15180537 15836710 16599656 17249637 17548315
58086 17548315 17365395 16732487 15789198 14688889 13544930 12427385 11372828 10391008 9478178
58077 9478178 8633572 7862013 7164724 6537015 5975194 5478055 5040848 4654636 4312731
58068 4312731 4012020 3747392 3510775 3296787 3104109 2930375 2770626 2621754 2483732
58059 2483732 2355453 2233875 2118222 2010671 1911712 1818814 1730649 1648659 1573396 1503105
58049 1503105 1436976 1376090 1319948 1265596 1211418 1158616 1107898 1057999 1008594 961473 917532
58038 917532 875491 834784 796887 762558 730486 699821 671476 645770 621299 597324 574927
58027 574927 554711 535631 517092 499938 484379 469151 453733 439268 426313 413777 401014
58016 401014 388882 377821 366931 355870 345671 336708 327861 318585 309887 302332 295012 287416 280412
58003 280412 274434 268552 262345 256832 252560 248498 243834 239223 235253 231334 227097 223262 220144 216859
57989 216859 213003 209615 207493 206024 204569 203508 202990 202169 200705 199587 199530 199893 200102 200682 201930 202981
57973 202981 203261 203542 204519 205604 206150 206658 207676 208665 208983 208930 208900 208501 207444 206247 205241 203886 201867
57956 201867 199816 198154 196342 194088 192108 190865 189660 187865 185875 184003 181597 178316 175150 173024
57942 173024 171394 169291 166851 164748 162951 161129 159533 158441 157347 155632 153423 151001 148172 144967
57928 144967 142252 140720 140019 139639 139875 141075 142706 144075 145329 146901 148596 150010 151255 152498 153436
57913 153436 153854 154068 154204 153754 152523 151164 150138 148963 147240 145545 144436 143425 141772 139601 137337
57898 137337 134862 132130 129861 128608 127781 126519 124908 123451 121998 120200 118426 117201 116265 115183 114382
57883 114382 114558 115463 116242 116634 116967 117299 117409 117315 117057 116342 115114 113990 113399 112753 111258 109040 106652
57866 106652 104027 100902 97776 95397 93654 91940 90347 89453 89173 88840 88389 88533 89767 91897 94490
57851 94490 97127 99324 100882 102222 103878 105785 107636 109548 111814 114256 116507 118598 120656 122310
57837 122310 123115 123284 123324 123202 122554 121389 119892 117850 115094 112206 109962 108233 106286 103981 101833 100020
57821 100020 98169 96148 94223 92416 90411 88251 86494 85551 85352 85689 86394 87209 87944 88788 90064 91746
57805 91746 93602 95566 97581 99346 100741 102233 104251 106398 107894 108620 109038 109299 109143 108604 108054 107524
57789 107524 106629 105232 103615 101919 99940 97543 94826 91855 88654 85482 82692 80323 78140 75972
57775 75972 73742 71327 68795 66526 64718 63052 61252 59580 58211 56555 53966 50857 48257 46380
57761 46380 44498 42202 39919 38021 36216 34117 31793 29474 27236 25188 23567 22391 21380 20356
57747 20356 19444 18791 18372 18108 17920 17710 17559 17833 18718 19829 20714 21622 23243 25763 28710 31732 34913
57730 34913 38202 41042 42878 43728 44096 44483 45030 45462 45364 44657 43715 42880 42092 41163 40103 38900 37329
57713 37329 35398 33628 32384 31242 29599 27646 26107 25199 24505 23774 23199 22938 22937 23231 23883 24660 25305
57696 25305 26016 27160 28604 29905 31090 32589 34489 36453 38356 40324 42190 43619 44812 46375 48359
57681 48359 50141 51435 52780 54762 57337 60124 62839 65286 67463 69845 72985 76674 80094 82981
57667 82981 86010 89772 94055 98507 103380 109094 115523 122296 129421 137114 145221 153313 161268 169386
57653 169386 177988 187142 196717 206545 216573 226982 238079 250095 263134 277274 292477 308485
57641 308485 325124 342700 361813 382840 405879 431127 458883 489196 521922 557153 595236
57630 595236 636392 680805 729010 781661 838813 899958 964809 1033423 1105359 1179286 1253659
57619 1253659 1327125 1397897 1463274 1520389 1567275 1602972 1627056 1639647 1641778 1635372 1622762 1606124
57607 1606124 1586833 1564722 1537949 1503899 1460578 1407588 1346322 1279443 1209842 1139745 1070727
57596 1070727 1004308 942077 885064 833420 786932 745639 709717 679034 653119 631462 613710
57585 613710 599674 589205 581983 577414 574944 574485 576318 580639 587467 596959 609449 625068 643588
57572 643588 664747 688529 715156 745043 778681 816255 857376 901532 948680 999034 1052315
57561 1052315 1107582 1163649 1219091 1271857 1319484 1359854 1391269 1411862 1419721 1413963 1395251 1365026
57549 1365026 1324707 1275795 1220184 1159905 1096856 1032926 969883 908784 849816 793045 738993
57538 738993 688308 641241 597710 557520 520321 485711 453613 424226 397477 372913 350258
57527 350258 329580 310745 293281 277034 262397 249535 237945 227158 217330 208686 200922 193645
57515 193645 186968 181106 175824 170808 166222 162394 159300 156909 155599 155573 156153 156379 156102 155874 155943 156115
57499 156115 156524 157767 160160 163413 167213 171648 176921 183023 189835 197240 205083 213299 222149 232036
57485 232036 243101 255189 268210 282249 297395 313742 331586 351342 373268 397434 423894
57474 423894 452681 483710 516923 552479 590571 631112 673749 718015 763176 808024 851043
57463 851043 890766 925825 954799 976280 989026 992009 984642 967299 941454 908960 871258 829409
57451 829409 784648 738487 692341 647309 604161 563271 524677 488451 454969 424614 397450
57440 397450 373345 352161 333557 316938 301959 288849 277889 268865 261421 255638 251732 249460
57428 249460 248383 248541 250273 253518 257911 263493 270712 279710 290226 302260 316231 332363 350470
57415 350470 370500 392783 417554 444677 474039 505765 539823 575832 613425 652409 692306
57404 692306 732011 770081 804992 834998 858190 873031 878618 874381 859976 835752 802978 763283
57392 763283 718149 669130 618070 566612 515658 465693 417424 371710 328978 289132 252018
57381 252018 217653 185949 156578 129263 104047 81132 60516 41864 24684 8574 -6647 -21029
57369 -21029 -34559 -47216 -58995 -70000 -80443 -90451 -99905 -108637 -116711 -124372 -131741 -138765 -145424
57356 -145424 -151779 -157811 -163449 -168788 -174068 -179348 -184469 -189365 -194219 -199176 -204104 -208763 -213076 -217148
57342 -217148 -221163 -225340 -229797 -234351 -238594 -242217 -245208 -247700 -249882 -252123 -254893 -258326 -261994 -265290
57328 -265290 -267983 -270287 -272518 -274813 -277124 -279324 -281357 -283310 -285313 -287307 -289050 -290419 -291625 -293081
57314 -293081 -295083 -297635 -300426 -302992 -305028 -306621 -308089 -309596 -311088 -312605 -314353 -316374 -318366 -320004
57300 -320004 -321319 -322604 -324120 -325982 -328220 -330739 -333296 -335669 -337773 -339555 -340940 -342001 -342995 -344082
57286 -344082 -345099 -345804 -346188 -346343 -346179 -345564 -344711 -344091 -343860 -343593 -342685 -340895 -338417 -335603 -332772 -330165 -327877
57269 -327877 -325817 -323826 -321875 -320120 -318752 -317786 -316957 -315856 -314254 -312388 -310844 -310044 -309833 -309645 -309060 -308114
57253 -308114 -307111 -306307 -305854 -305829 -306125 -306382 -306281 -305886 -305484 -305100 -304411 -303257 -301920 -300740 -299622 -298161 -296131
57236 -296131 -293605 -290697 -287434 -283881 -280178 -276402 -272560 -268659 -264632 -260285 -255516 -250606 -246035 -242036
57222 -242036 -238569 -235751 -233986 -233573 -234435 -236400 -239502 -243868 -249526 -256562 -265227 -275615 -287319 -299725
57208 -299725 -312587 -326085 -340274 -354747 -368957 -382704 -396160 -409465 -422454 -434784 -446321
57197 -446321 -457325 -468249 -479404 -490811 -502316 -513669 -524511 -534485 -543523 -551932 -560052 -567926
57185 -567926 -575441 -582692 -589993 -597504 -605030 -612242 -618978 -625279 -631268 -637023 -642436 -647200 -651089 -654391
57171 -654391 -657884 -662249 -667574 -673519 -679799 -686348 -693123 -700109 -707492 -715544 -724179 -732854 -741136 -749224
57157 -749224 -757696 -766760 -776004 -784905 -793399 -801762 -810053 -817871 -824733 -830535 -835496 -839658 -842678 -844231
57143 -844231 -844509 -844110 -843478 -842657 -841652 -840819 -840717 -841671 -843588 -846142 -849087 -852491 -856764 -862406 -869595 -878061
57127 -878061 -887398 -897382 -907931 -918910 -930160 -941695 -953724 -966486 -980121 -994665 -1010101 -1026481
57115 -1026481 -1043990 -1062794 -1082768 -1103558 -1124921 -1146880 -1169508 -1192870 -1217331 -1243653 -1272531
57104 -1272531 -1304224 -1338795 -1376435 -1417309 -1461384 -1508854 -1560515 -1617327 -1679634 -1747110 -1819344
57093 -1819344 -1896162 -1977559 -2063775 -2155398 -2253037 -2356921 -2467140 -2584132 -2708488 -2840345
57083 -2840345 -2979392 -3125490 -3278891 -3439911 -3608830 -3786162 -3972632 -4168893 -4375656
57074 -4375656 -4594097 -4825746 -5072002 -5334175 -5613976 -5913600 -6235412 -6582037 -6956698
57065 -6956698 -7362963 -7804218 -8283799 -8805616 -9374184 -9994252 -10671099 -11411258 -12222432
57056 -12222432 -13112729 -14090475 -15164660 -16345033 -17642027 -19067389 -20635127 -22361767
57048 -22361767 -24266469 -26371967 -28705361 -31297650 -34183561 -37403536 -41006256 -45049243
57040 -45049243 -49598846 -54732487 -60542055 -67135460 -74636727 -83186032 -92936882 -104047366
57032 -104047366 -116668695 -130935279 -146953329 -164784636 -184432607 -205839301 -228889341
57025 -228889341 -253412446 -279184964 -305916949 -333175756 -360220300 -385843870 -408423868
57018 -408423868 -426278136 -438164901 -443605150 -442840418 -436529253 -425437051 -410281925
57011 -410281925 -391722728 -370395521 -346935812 -321976432 -296133901 -269996752 -244119978
57004 -244119978 -219016771 -195137293 -172839514 -152369056 -133857169 -117331864 -102735824
56997 -102735824 -89950011 -78819852 -69176117 -60846820 -53664549 -47473163 -42132314 -37518171
56989 -37518171 -33522724 -30053475 -27032124 -24391750 -22074851 -20033161 -18226998 -16623172
56981 -16623172 -15193404 -13914091 -12765701 -11731322 -10796174 -9948369 -9178758 -8479337 -7842358
56972 -7842358 -7260961 -6729437 -6242430 -5794761 -5382359 -5002485 -4652638 -4329971 -4031935
56963 -4031935 -3756549 -3501716 -3265093 -3044948 -2840331 -2650102 -2472607 -2306646 -2151948
56954 -2151948 -2008330 -1875078 -1751486 -1637283 -1532169 -1435579 -1347186 -1267021 -1194877 -1130281
56944 -1130281 -1073275 -1024507 -984257 -951988 -927051 -909159 -897944 -892853 -893630 -899940 -910071 -920825
56932 -920825 -929336 -934534 -936605 -935848 -932580 -927419 -920950 -913429 -905183 -896804 -888617 -880504 -872563 -865323
56918 -865323 -858938 -852825 -846510 -840128 -833595 -826013 -816625 -805783 -794228 -781819 -767699 -751453 -733482
56905 -733482 -714411 -694718 -674791 -654841 -634809 -614643 -594486 -574351 -553962 -533284 -512928
56894 -512928 -493639 -475646 -458809 -443069 -428391 -414578 -401528 -389399 -378212 -367597 -357279
56883 -357279 -347473 -338427 -329936 -321670 -313622 -305791 -297803 -289351 -280688 -272159 -263527 -254310 -244583 -234896
56869 -234896 -225625 -216999 -209655 -204425 -201418 -199792 -198583 -197457 -196612 -196286 -196509 -197079 -197651 -197978 -198079 -198085 -197992
56852 -197992 -197661 -196980 -195931 -194633 -193379 -192406 -191532 -190268 -188410 -186204 -183820 -181065 -177855 -174536 -171328
56837 -171328 -167781 -163233 -157602 -151249 -144229 -136152 -126728 -116080 -104548 -92398 -79657 -65941 -50667
56824 -50667 -33802 -16350 209 14954 27747 38725 47941 55494 61632 66649 70832 74485 77791
56811 77791 80743 83327 85726 88188 90872 93987 97894 102814 108564 114835 121613 129126 137460 146314
56797 146314 154915 162064 166591 168125 167260 164795 161081 156306 151016 145882 141179 136932 133380 130880
56783 130880 129503 129169 130103 132703 137027 142795 149886 158449 168542 180013 192648 206028 219191
56770 219191 230728 239384 244406 245538 243055 237766 230604 222134 212690 202897 193696 185800 179427 174584
56756 174584 171319 169654 169594 171260 174792 180007 186383 193489 201367 210413 220876 232295 243280 251993
56742 251993 257120 258388 256158 250847 242996 233551 223583 213778 204500 196226 189447 184166 179949 176575
56728 176575 174270 173230 173207 173745 174610 175898 177879 180791 184626 189023 193370 196966 199034 198844 196128
56713 196128 191344 185325 178711 171835 164974 158421 152374 146979 142363 138441 134841 131309 128081 125551
56699 125551 123685 122083 120500 118996 117635 116407 115388 114622 113839 112667 111178 109949 109467 109683 110169
56684 110169 110532 110634 110583 110574 110691 110894 111212 111742 112347 112656 112523 112231 112008 111684 111143 110792 111100 111906 112647 113079
56664 113079 113302 113251 112707 111781 110889 110279 109950 109956 110301 110681 110813 110997 111832 113371 115064 116495 117727 118908
56646 118908 120060 121280 122622 123760 124250 124181 124104 124287 124548 124812 125233 125664 125625 124998 124194 123446 122468 121070
56628 121070 119543 118149 116742 115225 113939 113211 112846 112434 111876 111326 110882 110603 110581 110777 110924 110803 110401
56611 110401 109769 108933 108033 107250 106563 105893 105439 105472 105786 105834 105459 104998 104574 103895 102948 102267 102191 102398 102509 102660
56591 102660 103078 103520 103639 103548 103620 103961 104441 105048 105860 106857 107982 109204 110371 111261 111919 112617 113343 113762
56573 113762 113819 113910 114210 114323 113917 113226 112547 111692 110376 108787 107306 106012 104875 104131 103963 104068 103963 103569
56555 103569 103134 102849 102848 103326 104274 105307 106089 106697 107286 107721 107896 108099 108637 109350 109862 110088 110134 110023 109898
56536 109898 110161 110966 111859 112368 112656 113142 113755 114121 114242 114412 114631 114661 114571 114719 115220 115897 116663 117518 118275
56517 118275 118727 119042 119581 120402 121316 122290 123369 124331 124905 125279 125946 127054 128335 129587 130832 132042 133157
56500 133157 134376 136041 138166 140404 142490 144411 146214 147901 149497 150934 151989 152638 153308 154403 155699
56485 155699 156566 156712 156394 155967 155590 155276 154881 154150 153066 152034 151396 150962 150381 149701 149118 148373 147030 145220
56467 145220 143595 142514 141778 141098 140388 139594 138723 138031 137785 137821 137729 137373 136863 136147 135128 134083 133432 133117
56449 133117 132736 132208 131782 131411 130738 129769 128969 128604 128474 128358 128239 127962 127252 126198 125260 124667 124252 123964
56431 123964 123984 124199 124112 123563 123059 123146 123813 124717 125589 126238 126570 126845 127540 128708 129822 130452 130782 131289 132206
56412 132206 133499 135008 136406 137328 137793 138292 139251 140655 142249 143845 145302 146491 147448 148322 149118 149759
56396 149759 150381 151252 152354 153418 154426 155630 156980 157985 158334 158238 157985 157545 156875 156277 156153 156623 157551
56379 157551 158703 159691 160071 159732 159045 158480 158208 158119 158019 157734 157213 156603 156024 155321 154257 152904 151544 150271
56361 150271 149006 147802 146761 145755 144682 143870 143692 143836 143560 142726 141935 141572 141373 141118 141066 141403 141829
56344 141829 142038 142117 142196 142171 142082 142272 142832 143285 143218 142863 142771 143199 144051 145056 145794 145929 145642 145481 145641 145840
56324 145840 146052 146739 148077 149488 150359 150761 151070 151376 151667 152170 153039 154052 155046 156267 157868 159418 160403
56307 160403 160926 161456 162131 162757 163267 163771 164312 164897 165624 166452 167078 167311 167351 167431 167498 167480 167583 167961 168447 168893
56287 168893 169511 170494 171609 172574 173556 174897 176542 178160 179646 181171 182868 184782 187029 189704 192705
56272 192705 195816 198858 201709 204406 207253 210534 214094 217588 221156 225298 230007 234615 238743 242729
56258 242729 246827 250652 253893 256925 260182 263414 266144 268436 270617 272641 274285 275648 276893 277806
56244 277806 278178 278351 278887 279919 281281 282943 284880 286844 288769 291087 294159 297754 301577 305919 311206
56229 311206 317207 323389 329762 336736 344326 352170 360213 368819 378294 388735 400268 412921 426439
56216 426439 440661 455911 472596 490646 509831 530376 552765 577113 603221 631075 660852
56205 660852 692648 726704 763689 804241 848433 896110 947509 1003009 1062517 1125628 1192182
56194 1192182 1262073 1334623 1408673 1483148 1557117 1629470 1699026 1764769 1825538 1879692 1925544
56183 1925544 1962020 1988567 2004811 2010826 2007438 1995779 1976763 1951342 1920790 1886138 1847746 1806055
56171 1806055 1762339 1718012 1673489 1628416 1582655 1536327 1489243 1441162 1392431 1343605 1294595
56160 1294595 1244940 1194798 1144918 1095768 1047354 999826 953581 908875 865906 825075 786621
56149 786621 750213 715523 682862 652639 624614 598412 574363 552929 533648 515624 498790
56138 498790 483719 470359 457983 446264 435468 425666 416696 408838 402509 397345 392509 387899 384108
56125 384108 381248 378827 376763 375533 375228 375424 376074 377569 379821 382204 384541 387283 390616 394310 398470
56110 398470 403489 409161 414733 419940 425033 429779 433486 436181 438695 441382 443786 445721 447631 449592
56096 449592 451073 452071 453446 455722 458521 461587 465452 470589 476791 483858 492115 501817 512792 525084
56082 525084 539233 555519 573669 593624 615893 640777 668026 697577 729909 765251 803020
56071 803020 842272 882031 921011 957824 991852 1023333 1052486 1079254 1103939 1127061 1148202
56060 1148202 1165775 1178278 1185193 1186613 1182855 1174705 1163193 1148823 1131579 1111649 1089267 1063890
56048 1063890 1034598 1001543 966113 929620 892760 856422 821820 789607 759805 732739 708961
56037 708961 688187 669484 652665 638293 626185 615252 605005 595871 587779 579903 572200 565725
56025 565725 560900 556846 552928 549553 546902 544351 541822 540306 540260 540771 541085 541704 543235 545369 547725
56010 547725 550515 553653 556443 558823 561718 565508 569444 573219 577734 583545 589895 596095 602553 609614
55996 609614 616707 623545 630889 639225 647883 656278 664823 673917 683320 693247 704611 717408 730278
55983 730278 742486 754896 768234 781995 795941 811078 828078 846214 864817 884292 904855
55972 904855 925879 947397 970554 995674 1021690 1048393 1077266 1109012 1142310 1176260 1212022
55961 1212022 1250686 1291558 1334046 1379193 1427744 1478578 1530555 1584065 1639340 1695341 1751880
55950 1751880 1810730 1873021 1937670 2003977 2073510 2147687 2225851 2307526 2394221 2487056 2585056
55939 2585056 2687693 2796690 2913366 3036914 3167339 3307187 3458023 3618111 3785974
55930 3785974 3963174 4151018 4347882 4552770 4768411 4997712 5240460 5496654 5769670
55921 5769670 6062583 6374760 6705730 7058927 7437925 7842731 8273791 8735772 9233191
55912 9233191 9766447 10336620 10949824 11612301 12326269 13095944 13932723 14849295 15855053
55903 15855053 16964200 18202699 19600713 21184918 22985052 25039222 27384197 30051135
55895 30051135 33083112 36547640 40520156 45067769 50264081 56204877 62991692 70717101
55887 70717101 79464054 89209016 99549454 109457550 117428632 122089024 122828841 119957187
55879 119957187 114346243 106960685 98604758 89883042 81222370 72896952 65074914 57867261
55871 57867261 51342188 45519236 40378889 35882056 31975436 28590506 25655371 23109338
55863 23109338 20901216 18980702 17301360 15828163 14533793 13390613 12372878 11462908
55855 11462908 10647948 9913689 9246764 8640335 8090940 7592034 7135688 6717752 6335896
55846 6335896 5984841 5658561 5355139 5074712 4814599 4570852 4342576 4130238 3931430
55837 3931430 3742478 3562699 3393098 3232417 3078329 2931189 2792790 2662589 2538640
55828 2538640 2421075 2311250 2208492 2110896 2018358 1931807 1850445 1772662 1698715 1629675 1564722
55817 1564722 1502172 1442211 1385894 1332458 1280290 1229681 1182027 1137201 1094204 1053422 1015702
55806 1015702 980055 944835 910385 878042 847349 816813 786718 758683 733007 708892 686722
55795 686722 667675 651460 636745 623432 612296 602749 593143 582994 572875 562490 550994 538892
55783 538892 527574 517176 506794 496509 487249 478900 470482 461975 454069 446349 437640 427968 418365
55770 418365 408878 398653 387852 377648 368325 359119 349929 341438 333525 325255 316567 308385 300966
55757 300966 293686 286483 279994 274181 268308 262438 257538 254007 251400 249630 249028 249188 249158 248935 249428 250792
55741 250792 252078 252679 252882 252825 252123 250744 249156 247431 245191 242520 239866 237044 233379 228900 224368
55726 224368 220080 215670 211087 206769 202845 199110 195723 192998 190654 188271 186281 185364 185075 184213 182443
55711 182443 180327 177898 174542 170324 166144 162431 158870 155454 152606 150150 147398 144458 142199 140684
55697 140684 138832 135954 132531 129164 125731 122003 118138 114206 110040 105816 102021 98699 95546 92760
55683 92760 90887 89749 88542 87126 86199 85966 85697 84911 84039 83579 83430 83406 83620 84026 84344 84577 84877 84806
55665 84806 83667 81715 80092 79330 78859 78220 77754 77685 77517 76921 76396 76473 76917 77220 77344 77525 77795 78116 78576
55646 78576 79208 79965 81007 82597 84644 86848 89244 92008 94813 97073 98847 100736 102839 104598 105786
55631 105786 106875 108216 109587 110653 111288 111352 110841 110271 110145 110044 109132 107539 106293 105829 105571 105172 105049
55614 105049 105339 105442 105088 104903 105337 105906 106081 106177 106759 107819 109064 110387 111518 111847 111194 110262 109843 109990
55596 109990 110286 110420 110175 109438 108600 108377 108831 109158 108787 108046 107367 106517 105137 103473 101901 100203 97892
55579 97892 94966 91812 88660 85536 82513 79627 76812 74126 71787 69772 67731 65506 63342 61445
55565 61445 59747 58283 57304 56769 56169 55156 53949 52908 52082 51370 50746 50157 49555 49120 49050 49138 49005 48719
55547 48719 48596 48452 47785 46714 45946 45692 45455 45054 44959 45269 45314 44730 44141 44221 44766 45229 45500 45661 45575 45309
55527 45309 45357 45896 46338 46145 45553 44991 44363 43449 42522 41923 41477 40903 40402 40291 40392 40369 40313 40510 40937 41434
55507 41434 42064 42871 43625 44248 45149 46708 48709 50622 52133 53094 53350 52981 52386 51829 51249 50681 50347 50095
55489 50095 49373 48114 47053 46748 46848 46788 46560 46323 45903 45297 45080 45623 46413 46794 46943 47463 48478 49792
55471 49792 51476 53551 55479 56775 57778 59037 60213 60447 59705 58910 58748 59021 59213 59075 58563 57716 56757
55454 56757 55938 55229 54345 53048 51269 49137 47069 45522 44408 43114 41349 39526 38012 36523 34769
55439 34769 33147 32183 31681 31084 30381 30024 30109 30271 30202 29755 28778 27371 26129 25567 25456 25222 24768 24389 24127
55420 24127 23792 23464 23386 23426 23195 22674 22254 22210 22462 22769 22855 22531 21974 21626 21539 21200 20344 19453 18974 18553 17703
55399 17703 16789 16570 17083 17714 18158 18556 18888 18987 19020 19294 19643 19694 19579 19724 20014 19907 19313 18684 18246 17844
55379 17844 17514 17483 17593 17401 16906 16555 16430 16120 15530 15197 15552 16390 17247 17904 18349 18616 18769 18785 18475 17793
55359 17793 17118 16824 16778 16673 16615 16848 17151 17202 17356 18247 19700 20789 21041 20860 20709 20629 20688 21123 21770 22003
55339 22003 21538 20764 20088 19542 19231 19499 20321 21039 21086 20567 19885 19209 18607 18259 18224 18297 18304 18258 18148 17914 17744
55318 17744 17978 18570 19079 19285 19369 19370 18968 18041 16978 16212 15833 15810 16131 16518 16486 15957 15418 15220 15143 14923 14774
55297 14774 15046 15700 16451 17132 17600 17613 17162 16711 16756 17264 17765 17846 17407 16615 15829 15407 15444 15774 16213 16607
55277 16607 16709 16376 15927 15936 16540 17251 17584 17513 17225 16821 16436 16286 16351 16298 15905 15319 14753 14207 13671 13306 13223
55256 13223 13351 13645 14171 14838 15362 15620 15792 15996 16133 16198 16410 16825 17139 17094 16773 16327 15740 15113 14854 15278
55236 15278 16174 17044 17594 17794 17671 17300 16878 16582 16442 16445 16646 17022 17372 17485 17349 17130 17045 17236 17664 18107
55216 18107 18432 18719 18999 19014 18563 17920 17518 17339 17078 16814 16956 17459 17715 17376 16784 16417 16355 16544 17060 17801
55196 17801 18338 18418 18316 18404 18641 18753 18621 18293 17865 17556 17621 17987 18262 18257 18145 18008 17645 17070 16739 16976 17550
55175 17550 18093 18557 18972 19129 18912 18628 18605 18712 18637 18359 18011 17522 16807 16135 15890 16107 16502 16846 17020 16934
55155 16934 16692 16664 17066 17621 17931 18005 18123 18382 18699 19110 19704 20324 20670 20658 20410 19987 19390 18761 18332 18192
55135 18192 18280 18542 18919 19294 19638 20086 20689 21223 21482 21613 21917 22413 22846 23067 23177 23299 23417 23482 23515 23580
55115 23580 23633 23478 22910 22013 21200 20769 20520 20069 19478 19188 19329 19521 19464 19348 19450 19720 19992 20267 20531 20528
55095 20528 20035 19191 18369 17899 17977 18573 19272 19523 19238 18848 18633 18379 17890 17404 17154 16903 16358 15763 15650
55076 15650 16151 16925 17646 18255 18826 19442 20091 20568 20644 20467 20498 20939 21506 21950 22430 23124 23879 24552 25301 26210
55056 26210 26995 27466 27905 28544 29049 29031 28741 28704 28894 28863 28558 28407 28648 29082 29495 29876 30157 30163 29865 29447 29066
55035 29066 28798 28720 28818 28916 28890 28831 28833 28840 28931 29383 30143 30610 30413 30087 30436 31459 32486 33175 33761 34393 34865 35050
55013 35050 35088 35048 34864 34661 34745 35171 35683 36079 36326 36375 36232 36167 36413 36711 36570 35998 35553 35633 36106 36645 37035
54992 37035 37150 37002 36885 37072 37391 37440 37172 36879 36655 36350 36015 35894 35929 35782 35401 35067 34819 34396 33879 33840
54972 33840 34565 35603 36397 36923 37411 37795 37825 37506 37098 36837 36826 37031 37243 37235 37110 37233 37702 38154 38265 38154
54952 38154 38121 38198 38211 38051 37694 37116 36408 35834 35607 35686 35914 36200 36472 36594 36519 36405 36480 36827 37362 37896 38193
54931 38193 38089 37657 37182 36917 36932 37093 37109 36676 35818 35044 34915 35438 36101 36476 36556 36513 36415 36310 36349 36700 37370
54910 37370 38164 38793 39168 39658 40820 42679 44538 45792 46680 47820 49292 50773 52391 54722 57822 60981
54894 60981 63675 66254 69365 73161 77370 81769 86226 90585 94839 99185 103633 107753 111053 113391
54880 113391 114798 115178 114424 112647 110018 106561 102328 97632 92853 88141 83488 78982 74794 71010 67669
54865 67669 64822 62431 60314 58375 56780 55720 55111 54663 54227 53936 54067 54799 56091 57738 59629 61852
54849 61852 64449 67188 69829 72571 75883 79836 83956 87828 91529 95271 98885 101890 103923 104903 104921
54834 104921 104118 102566 100175 96836 92736 88344 84031 79843 75736 71786 68064 64514 61067 57773
54820 57773 54723 52028 49855 48308 47206 46201 45187 44364 43836 43394 42777 41901 40800 39643 38834 38748
54804 38748 39187 39453 39116 38434 37837 37359 36779 36050 35294 34621 34149 33961 33874 33510 32867 32472 32692 33214 33498
54785 33498 33510 33567 33718 33729 33560 33407 33294 33038 32675 32515 32679 32877 32827 32655 32729 33183 33776 34171 34247 34110 33872
54764 33872 33537 33189 33153 33781 35053 36565 37929 38991 39714 40102 40347 40777 41527 42456 43476 44707 46159
54747 46159 47538 48625 49614 50823 52247 53683 55191 57127 59741 62972 66630 70607 74848 79267 83761
54732 83761 88306 93036 98152 103612 108937 113463 116787 118853 119687 119363 118158 116393 114065 110989 107391
54717 107391 103957 101094 98491 95676 92663 89781 87212 85049 83540 82839 82638 82480 82311 82417 82889 83546
54701 83546 84351 85570 87436 89893 92713 95704 98796 102108 105920 110448 115634 121243 127166 133489 140319
54686 140319 147598 155025 162107 168386 173624 177651 180037 180198 177962 173799 168366 162028 155007 147683
54672 147683 140425 133258 125985 118608 111437 104816 98886 93578 88721 84218 80165 76670 73576 70603
54658 70603 67808 65590 64129 63106 62161 61291 60578 59843 58920 57997 57382 57090 56945 56868 56771 56390 55582 54656
54640 54656 54072 53916 53962 54107 54467 55127 56055 57142 58088 58455 58125 57567 57359 57588 57972 58308 58493 58332 57804
54621 57804 57374 57618 58563 59761 60897 61937 62825 63458 63976 64655 65520 66416 67443 68914 70891 73090 75270
54604 75270 77399 79433 81302 83110 85057 87122 89167 91279 93640 96065 98086 99606 101075 102906
54590 102906 105020 107151 109298 111711 114564 117781 121112 124393 127837 131936 136891 142331 147833 153555
54576 153555 159908 166806 173712 180367 186913 193217 198589 202311 204020 203460 200358 194877 187819 180075
54562 180075 172067 163890 155715 147776 140194 133097 126763 121413 116897 112744 108520 104180 100164 97074
54548 97074 95063 93598 92073 90562 89612 89348 89245 88865 88338 87894 87356 86423 85167 83915 82755 81454
54532 81454 79770 77680 75381 73164 71210 69395 67461 65421 63601 62237 61225 60399 59782 59397 59037
54517 59037 58444 57587 56569 55365 53844 52013 50126 48513 47344 46534 45857 45200 44634 44218 43871 43585 43577
54500 43577 43987 44561 44949 45243 45827 46721 47487 47827 47906 47968 48013 48021 48125 48390 48661 48867 49236 50000 51089 52272
54480 52272 53439 54599 55797 57153 58808 60779 63007 65586 68646 72006 75292 78478 81929 85768
54466 85768 89570 92925 95923 98848 101656 104073 105901 106942 106865 105535 103282 100567 97494 93960 90105
54451 90105 86285 82672 79141 75548 71901 68314 64958 62003 59494 57372 55694 54636 54146 53843 53395
54436 53395 52793 52103 51228 50201 49403 49153 49238 49213 49011 48934 49162 49625 50274 51111 51979 52669 53254 54022 55042
54417 55042 56088 57045 58070 59243 60325 61020 61342 61574 61960 62518 63084 63465 63609 63638 63691 63697 63426 62740 61773
54398 61773 60863 60270 59948 59585 58931 58095 57408 56983 56573 55911 55016 54090 53241 52450 51694 50993 50396 49977 49714
54379 49714 49328 48435 47003 45524 44604 44452 44849 45419 45815 45792 45363 44825 44505 44516 44765 45091 45351 45527 45784
54360 45784 46226 46560 46356 45748 45543 46356 47887 49326 50238 50750 51089 51364 51742 52441 53489 54676 55757
54343 55757 56573 57090 57504 58182 59292 60549 61576 62370 63231 64357 65802 67672 69984 72358 74155 75005
54327 75005 75000 74415 73500 72537 71800 71338 70942 70345 69381 68051 66568 65278 64330 63522 62623 61674 60721 59473
54309 59473 57666 55637 54119 53420 53172 52941 52666 52401 52048 51572 51192 51119 51239 51210 50761 49836 48652 47679
54291 47679 47337 47617 48197 48924 49915 51074 51913 52072 51796 51628 51831 52365 53223 54487 56133 58046 60180
54274 60180 62456 64575 66197 67291 68085 68642 68748 68280 67433 66437 65238 63664 61804 59979 58375 56872
54258 56872 55283 53575 51813 50031 48302 46829 45754 44932 44048 42994 41946 41079 40316 39475 38531 37632
54242 37632 36924 36464 36246 36222 36283 36247 35901 35173 34331 33855 33907 34041 33704 32971 32438 32354 32290 31858 31382 31509 32421
54221 32421 33705 34819 35418 35422 35144 35148 35621 36036 35831 35272 35149 35686 36314 36616 36926 37727 38873 39776 40129
54202 40129 40099 39942 39731 39429 39025 38596 38371 38668 39607 40881 41900 42198 41727 40821 39930 39344 39089 39068 39173
54183 39173 39238 39050 38600 38241 38358 38868 39234 39043 38359 37528 36844 36465 36444 36695 37077 37586 38379 39478 40573
54164 40573 41242 41283 40775 39954 39141 38671 38724 39184 39732 40065 40032 39649 39075 38549 38266 38263 38398 38450 38270 37913 37607
54143 37607 37581 37933 38626 39535 40428 41031 41189 40943 40420 39763 39207 39013 39180 39390 39422 39434 39646 39892 39804 39324
54123 39324 38717 38115 37401 36526 35655 34965 34575 34668 35347 36282 36828 36605 35773 34705 33703 33052 32942 33164 33220
54104 33220 32941 32710 32851 33133 33156 32945 32812 32872 33053 33404 33968 34462 34493 34116 33778 33687 33574 33156 32501 31796
54084 31796 31055 30317 29897 30100 30761 31350 31584 31718 32161 32927 33651 34053 34186 34200 34075 33722 33230 32853 32737
54065 32737 32800 32865 32797 32536 32119 31675 31269 30769 30022 29170 28605 28542 28829 29252 29778 30388 30848 30895 30571 30202 30066
54044 30066 30208 30519 30817 30902 30695 30331 29999 29701 29306 28805 28393 28270 28475 28937 29522 29991 30062 29702 29274 29233
54024 29233 29682 30296 30721 30888 30912 30803 30464 29937 29450 29182 29124 29215 29455 29765 29904 29755 29592 29858 30639 31567
54004 31567 32240 32551 32589 32433 32198 32089 32209 32409 32446 32280 32107 32163 32565 33297 34215 35079 35729 36278 37047 38232
53984 38232 39712 41208 42558 43751 44790 45689 46613 47788 49162 50315 50924 51227 51818 53022 54684 56556
53968 56556 58527 60416 61917 63010 64191 65980 68317 70700 72782 74558 76110 77496 78854 80336
53954 80336 81860 83193 84257 85172 85978 86583 86990 87312 87538 87502 87176 86754 86370 85980 85583 85351 85356 85362 85075 84518
53934 84518 84000 83731 83546 83055 82050 80772 79688 78966 78320 77443 76369 75259 74038 72597 71143 69992
53918 69992 69042 67878 66407 65011 64015 63419 63201 63439 63949 64227 64039 63730 63677 63739 63570 63221 63056 63184 63349
53899 63349 63313 63102 62886 62811 62966 63347 63850 64361 64831 65296 65925 67008 68665 70563 72183 73488 74990 77027
53881 77027 79242 81030 82243 83160 84040 85046 86488 88690 91558 94519 96996 98808 100101 101024 101526
53866 101526 101436 100737 99748 98928 98501 98390 98457 98634 98801 98809 98757 98986 99694 100766 102081 103711 105638 107575 109297
53847 109297 110932 112738 114755 116868 119002 121074 122951 124637 126246 127645 128455 128613 128574 128627 128417 127545
53831 127545 126310 125311 124599 123804 122929 122340 121963 121119 119351 116945 114475 112203 110068 107919 105545 102762
53815 102762 99648 96518 93586 90888 88531 86742 85509 84456 83200 81696 80138 78696 77450 76352
53801 76352 75205 73820 72243 70665 69104 67425 65679 64207 63264 62722 62233 61515 60460 59154 57866
53786 57866 56849 56078 55315 54463 53681 53111 52694 52317 51971 51688 51463 51288 51151 50976 50701 50422 50285 50249 50103
53767 50103 49777 49438 49247 49199 49248 49374 49499 49488 49319 49103 48905 48686 48448 48271 48188 48198 48400 48908 49589 50112 50372
53746 50372 50671 51383 52565 53980 55346 56496 57422 58256 59133 60067 61028 62086 63310 64592 65809 67109
53730 67109 68790 70836 72931 74949 77108 79439 81446 82590 82956 83159 83651 84359 84951 85262 85420 85694
53714 85694 86267 87091 87915 88438 88462 87953 87040 85921 84664 83189 81499 79868 78620 77793 77163 76589 76103
53697 76103 75711 75305 74807 74221 73526 72692 71787 70912 70062 69259 68751 68771 69060 68980 68225 67194 66534 66512 66915 67345
53677 67345 67487 67245 66761 66230 65697 65187 64913 65049 65326 65258 64836 64578 64738 64906 64686 64340 64390 64869 65375 65687
53657 65687 65880 65960 65812 65528 65422 65618 65910 66069 66091 66040 65850 65389 64685 64012 63729 64035 64801 65688 66421 66887
53637 66887 67064 67005 66927 67071 67396 67595 67531 67471 67769 68527 69658 71048 72409 73281 73477 73427 73704 74312 74758 74832
53617 74832 74955 75644 76903 78297 79481 80493 81551 82718 83770 84416 84612 84599 84665 84915 85326 85902 86691
53600 86691 87679 88743 89655 90135 90011 89376 88500 87581 86681 85886 85338 85040 84835 84634 84483 84348 84094 83721 83365
53581 83365 82932 82074 80759 79570 79097 79276 79635 79998 80544 81328 82172 83003 83874 84626 84925 84761 84596 84881
53563 84881 85637 86602 87553 88378 89022 89540 90079 90739 91513 92435 93595 94983 96384 97524 98277 98743 99240 100169
53545 100169 101696 103501 104982 105792 106124 106473 107239 108572 110419 112588 114851 117052 119132 121040 122701
53530 122701 124108 125353 126569 127865 129323 130955 132653 134210 135455 136345 136943 137305 137469 137520 137686 138213
53514 138213 139098 140041 140812 141568 142583 143723 144545 144942 145306 145889 146411 146588 146692 147163 147909 148491 148876 149479
53496 149479 150480 151578 152517 153422 154433 155412 156245 157126 158270 159566 160767 161874 163095 164510 165987
53481 165987 167377 168626 169746 170822 172011 173445 175150 177134 179446 182030 184600 186791 188515 190064
53467 190064 191869 194168 196926 199997 203300 206778 210279 213634 216908 220381 224203 228190 232145 236206
53453 236206 240632 245357 250082 254840 260108 266189 272748 279182 285287 291366 297801 304772 312353 320613
53439 320613 329477 338637 347747 356713 365706 374870 384094 393168 402099 411154 420577 430389 440507 450884
53425 450884 461379 471650 481375 490547 499418 508240 517149 526211 535322 544166 552484 560391 568201 576005
53411 576005 583649 591078 598435 605773 612972 619993 626951 633816 640269 645996 650925 655074 658386 660871
53397 660871 662745 664230 665307 665795 665530 664371 662157 658879 654791 650244 645453 640477 635300 629864 624115
53382 624115 618135 612080 605894 599290 592149 584770 577506 570303 562804 554888 546860 539134 531881 525008
53368 525008 518346 511861 505747 500278 495517 491270 487424 484167 481693 479803 478052 476286 474790 473877
53354 473877 473556 473662 474146 475097 476574 478568 481096 484234 488019 492332 496947 501784 507095 513264 520360
53339 520360 527987 535725 543635 552168 561636 571940 582810 594112 605835 617972 630522 643555
53327 643555 657156 671332 686030 701205 716838 732908 749399 766317 783679 801491 819734
53316 819734 838298 856920 875220 892862 909686 925685 940944 955649 970095 984489 998673
53305 998673 1012106 1024274 1035096 1044826 1053556 1060979 1066701 1070644 1072957 1073659 1072619 1069884 1065778 1060579
53291 1060579 1054256 1046637 1037644 1027269 1015514 1002586 989024 975328 961481 947083 931984 916612
53279 916612 901532 886929 872616 858414 844345 830525 817050 803952 791127 778305 765277
53268 765277 752181 739409 727177 715352 703802 692751 682555 673204 664317 655701 647646 640516
53256 640516 634207 628240 622322 616555 611109 605910 600736 595469 590156 584899 579788 574854 570020 565165
53242 565165 560302 555652 551466 547833 544690 541988 539782 538259 537695 538258 539730 541483 542917 543985 545197
53227 545197 547144 550063 553837 558254 563197 568655 574636 581101 587943 595033 602234 609417 616523 623676
53213 623676 631146 639058 647136 654836 661752 667814 673124 677735 681668 684988 687731 689816 691171 691931
53199 691931 692321 692304 691482 689451 686209 682140 677652 672928 667933 662536 656584 649955 642627 634705 626379
53184 626379 617899 609545 601520 593834 586331 578872 571467 564230 557249 550521 543955 537465 531043 524745
53170 524745 518535 512213 505627 498962 492665 487010 481871 476947 472072 467252 462563 458143 454173 450655
53156 450655 447305 443773 439973 436082 432294 428715 425422 422389 419344 415887 411828 407321 402632 397844
53142 397844 392816 387392 381626 375803 370181 364723 359180 353492 347911 342602 337348 331847 326148 320513
53128 320513 314959 309287 303494 297804 292218 286390 280075 273445 266831 260456 254493 249067 243992 238793
53114 238793 233238 227662 222473 217533 212384 206969 201767 197215 193315 189874 186810 184061 181394 178509
53100 178509 175309 171949 168631 165452 162424 159559 156875 154318 151744 149045 146266 143530 140891 138332
53086 138332 135938 133859 132097 130445 128786 127336 126393 125901 125375 124331 122698 120825 119141 117818 116697
53071 116697 115518 114254 113197 112714 112887 113433 113968 114297 114464 114562 114577 114447 114228 114084 114115 114295 114637 115284 116307
53052 116307 117481 118420 118905 118967 118709 118206 117549 116818 115971 114901 113552 111912 109946 107712 105490 103581
53036 103581 101972 100422 98842 97349 95954 94504 92968 91496 90108 88608 86894 85088 83277 81445
53022 81445 79750 78492 77629 76704 75504 74446 74001 74068 74243 74376 74473 74316 73672 72741 71955 71398 70822 70135
53004 70135 69462 68838 68219 67759 67623 67591 67263 66700 66364 66417 66516 66402 66200 65987 65561 64878 64303 64120 64122 64005 63831
52983 63831 63783 63739 63493 63196 63164 63307 63159 62490 61617 61032 60922 61097 61241 61153 60863 60529 60248 59985 59705 59464
52963 59464 59326 59315 59503 59946 60443 60555 60116 59512 59240 59268 59192 58946 59005 59708 60666 61103 60683 59827 59197 59071
52943 59071 59224 59340 59414 59729 60490 61528 62418 62862 62936 62970 63196 63540 63748 63698 63514 63369 63299 63294 63495 64080 64942
52922 64942 65673 66003 66154 66574 67400 68352 69162 69901 70792 71848 72865 73748 74649 75758 77090 78593 80284
52905 80284 82112 83779 84992 85901 86970 88287 89291 89455 89035 88802 89119 89587 89634 89145 88449 87905 87628
52888 87628 87440 86998 86120 85063 84307 84003 83795 83286 82530 81911 81692 81801 81973 81935 81541 80849 80093 79513 79250
52869 79250 79302 79484 79455 79013 78426 78229 78560 78941 78890 78561 78505 78939 79551 79976 80190 80382 80672 81070 81576 82224
52849 82224 83012 83809 84344 84409 84114 83794 83575 83217 82569 82014 82120 82906 83779 84259 84461 84775 85326 85946 86453
52830 86453 86739 86724 86442 86115 85969 85999 86074 86160 86319 86531 86733 87032 87658 88642 89685 90466 90969 91401 91896 92436
52810 92436 92970 93457 93800 93917 93920 94106 94681 95519 96276 96712 96879 97048 97443 98040 98622 99070 99549 100270 101104 101645
52790 101645 101758 101879 102590 104010 105754 107415 108861 110156 111414 112766 114280 115832 117195 118250 118976
52775 118976 119300 119164 118744 118338 117960 117290 116149 114802 113585 112453 111126 109563 108011 106679 105556 104538
52759 104538 103524 102379 100977 99350 97715 96335 95386 94835 94356 93472 91990 90275 88939 88251 87979 87760
52743 87760 87442 87036 86519 85811 84887 83847 82893 82181 81631 80963 80028 79061 78430 78144 77831 77233 76524 76017 75723
52724 75723 75365 74764 74024 73361 72859 72403 71822 71051 70190 69409 68812 68358 67912 67348 66631 65836 65063 64323 63564
52705 63564 62820 62256 61979 61867 61665 61239 60612 59852 59057 58372 57851 57298 56454 55368 54354 53562 52764 51684
52687 51684 50350 49037 47986 47323 47063 47077 47150 47187 47261 47361 47282 46901 46356 45780 45028 43944 42787 42054 41892
52668 41892 41974 41966 41883 41934 42240 42761 43316 43620 43521 43250 43171 43283 43195 42695 42060 41664 41576 41702 42041 42551 42991 43249
52646 43249 43622 44460 45635 46710 47539 48342 49222 49975 50450 50756 51024 51263 51529 51975 52584 53082 53274 53272 53272 53292
52626 53292 53252 53112 52832 52383 51931 51764 51860 51797 51255 50404 49579 48808 47977 47215 46737 46411 45908 45224 44660 44300
52606 44300 43878 43266 42694 42330 41943 41219 40211 39234 38480 37937 37569 37353 37203 37020 36842 36790 36869 36938 36868 36688
52586 36688 36529 36458 36388 36171 35795 35433 35286 35419 35785 36328 36938 37374 37407 37091 36793 36900 37521 38450 39350 40019
52566 40019 40563 41238 42033 42533 42370 41685 40920 40229 39403 38347 37281 36374 35552 34798 34376 34506 35019 35522
52548 35522 35772 35698 35300 34751 34419 34518 34822 34974 34978 35123 35460 35657 35458 35085 35098 35897 37364 38883 39781 39883
52528 39883 39650 39660 40025 40421 40665 40966 41569 42322 42785 42737 42426 42295 42532 42978 43442 43945 44585 45305 45987 46675
52508 46675 47472 48201 48508 48365 48214 48464 49066 49763 50485 51260 51989 52594 53266 54188 55153 55798 56176 56740 57706
52489 57706 58762 59536 60010 60366 60635 60735 60745 60925 61469 62302 63136 63698 63945 64070 64323 64863 65724 66772 67629
52470 67629 67938 67830 67914 68554 69371 69773 69779 69872 70144 70149 69658 69055 68735 68542 68136 67624 67444 67749 68228 68484 68385
52449 68385 68058 67742 67630 67727 67911 68123 68462 68990 69563 69915 69867 69476 69045 68961 69325 69771 69867 69683 69646 69842 69861
52428 69861 69460 68952 68663 68437 68055 67775 68000 68611 69146 69501 69934 70461 70788 70849 70936 71178 71385 71546 71976 72726
52408 72726 73311 73342 73119 73243 73898 74827 75788 76657 77275 77573 77797 78246 78869 79387 79716 79923 79891 79471 78953 78908
52388 78908 79456 80116 80550 81047 81976 83153 84129 84856 85574 86201 86340 85925 85454 85415 85769 86150 86332 86305 86072
52369 86072 85626 85071 84625 84498 84754 85234 85602 85630 85486 85584 86040 86487 86577 86467 86559 86892 87094 86896 86432 85953
52349 85953 85570 85307 85188 85034 84437 83169 81586 80413 80085 80435 81009 81505 81875 82137 82231 82061 81643 81165
52331 81165 80852 80738 80635 80405 80203 80364 81003 81848 82527 82932 83239 83657 84279 85092 85970 86649 86898 86759 86520
52312 86520 86367 86226 86017 85926 86200 86823 87560 88303 89133 90068 90948 91631 92128 92559 93124 94121 95699 97538 99029
52293 99029 99932 100626 101558 102688 103707 104560 105463 106548 107863 109603 111927 114517 116727 118270 119459 120644
52277 120644 121789 122819 124008 125678 127629 129316 130555 131724 133167 134714 136003 137049 138219 139678
52263 139678 141164 142379 143384 144442 145622 146850 148246 150104 152465 155004 157528 160326 163797 167856
52249 167856 172018 175956 179731 183467 187137 190724 194365 198228 202398 206906 211717 216678 221671 226861
52235 226861 232553 238719 244935 250944 257063 263841 271436 279484 287504 295238 302754 310389 318522 327241
52221 327241 336226 345090 353727 362247 370647 378751 386452 393837 401062 408213 415293 422219 428831 434990
52207 434990 440656 445820 450402 454362 457860 461141 464208 466777 468626 469898 470940 471922 472726 473175 473238
52192 473238 472959 472345 471466 470589 470031 469827 469722 469573 469609 470110 470999 472006 473166 474850 477258 480169 483300
52175 483300 486679 490473 494631 498892 503067 507150 511252 515587 520419 525804 531425 536809 541699 546106
52161 546106 550041 553418 556195 558455 560256 561544 562225 562290 561800 560796 559243 557037 554154 550739 547006
52146 547006 542962 538362 533028 527155 521131 515130 509026 502681 496188 489803 483738 478006 472457 466986
52132 466986 461760 457148 453314 449974 446676 443256 439866 436608 433446 430431 427778 425581 423617 421599
52118 421599 419527 417650 416143 414885 413555 411883 409893 407919 406324 405127 403992 402611 401030 399551
52104 399551 398338 397209 395790 393838 391469 389072 387016 385371 383959 382610 381292 379933 378320 376351
52090 376351 374348 372868 372119 371686 370986 369895 368768 367869 367033 365953 364646 363405 362400 361535 360671 359807
52074 359807 358980 358172 357372 356591 355766 354766 353602 352482 351552 350703 349726 348570 347320 346027 344700 343361
52058 343361 342007 340629 339399 338688 338692 339130 339533 339760 340020 340516 341358 342765 344959 347793 350812 353834 357181
52041 357181 361179 365722 370537 375623 381134 387046 393314 400225 408190 417129 426345 435210 443765 452564
52027 452564 462042 472204 482768 493496 504339 515364 526538 537564 547961 557348 565664 573158
52015 573158 580231 587180 593912 599888 604576 608027 610869 613539 615727 616807 616679 615831 614574 612658 609871
52000 609871 606618 603495 600457 596912 592620 588025 583585 579220 574732 570405 566776 563935 561440 558911
51986 558911 556387 554082 552145 550699 549852 549476 549209 548839 548544 548618 549120 549969 551212 552964 555139 557475
51970 557475 559847 562360 565113 567981 570722 573159 575242 576968 578337 579354 580049 580494 580744 580723 580152 578731
51954 578731 576454 573691 570922 568318 565587 562164 557634 552017 545722 539156 532371 525121 517221 508741
51940 508741 499819 490436 480533 470247 459861 449481 438955 428138 417082 405924 394730 383598
51928 383598 372770 362400 352263 341903 331141 320287 309793 299814 290175 280663 271241 262015
51916 262015 253106 244566 236396 228651 221501 215088 209292 203748 198178 192641 187373 182456 177766 173229
51902 173229 168963 165124 161645 158240 154659 150949 147415 144316 141601 139000 136366 133827 131553 129487
51888 129487 127424 125325 123381 121738 120282 118797 117280 115958 114989 114228 113369 112267 111048 109899 108840
51873 108840 107758 106565 105286 104025 102934 102143 101685 101499 101577 101970 102555 102957 102905 102570 102278 101972 101250 99993
51855 99993 98613 97562 96904 96502 96306 96181 95752 94744 93371 92059 90904 89690 88390 87291 86631 86368
51839 86368 86334 86366 86229 85672 84681 83527 82494 81673 81037 80551 80176 79879 79669 79487 79108 78375 77540 77127 77309
51820 77309 77644 77581 77089 76610 76463 76500 76340 75821 75144 74629 74412 74420 74564 74841 75200 75502 75707 75951 76264 76378
51800 76378 76081 75666 75678 76235 76859 77125 77168 77418 78072 79007 80017 80931 81635 82190 82864 83874 85141 86433
51782 86433 87632 88700 89485 89788 89677 89519 89599 89824 89910 89805 89766 90011 90416 90636 90473 90001 89357 88621 87947
51763 87947 87587 87637 87837 87802 87369 86588 85540 84389 83502 83212 83429 83734 83879 83942 84025 84111 84274 84707 85369 85895
51743 85895 86050 86082 86426 87208 88179 88994 89378 89209 88640 88025 87584 87217 86759 86248 85811 85471 85254 85324 85758 86323
51723 86323 86702 86856 86932 86931 86723 86370 86156 86254 86533 86776 86942 87163 87563 88101 88570 88789 88840 88981 89282 89517 89554
51702 89554 89612 89926 90352 90616 90827 91363 92287 93278 94173 95216 96631 98249 99757 101079 102319 103553 104842
51685 104842 106286 107808 109079 109925 110700 111981 113898 116064 118186 120465 123219 126334 129341 131997 134566
51670 134566 137486 140905 144628 148370 151954 155314 158456 161415 164111 166255 167542 167973 167891 167621 167217
51655 167217 166624 165940 165366 164933 164461 163785 162926 162049 161310 160769 160335 159817 159076 158134 157118 156127 155221 154421
51637 154421 153650 152725 151597 150541 149925 149791 149828 149799 149812 150062 150449 150621 150363 149833 149387 149273 149541 150175 151206
51618 151206 152638 154240 155534 156082 155841 155179 154549 154182 154059 154090 154209 154336 154359 154245 154168 154424 155138 156073 156874
51599 156874 157483 158223 159390 160887 162367 163663 164884 166114 167204 167945 168302 168349 168054 167261 165888 164050
51583 164050 161913 159553 157009 154415 151919 149477 146848 143884 140768 137881 135475 133526 131874 130355
51569 130355 128848 127279 125641 123938 122143 120268 118458 116877 115535 114340 113306 112523 111895 111084 109841
51554 109841 108326 106980 106158 105887 105861 105612 104817 103543 102139 100886 99843 99042 98646 98745 99132 99408 99328 98945
51536 98945 98547 98486 98951 99769 100521 100933 101110 101347 101840 102658 103813 105227 106706 108111 109447 110735 111943
51519 111943 113192 114772 116766 118787 120387 121649 123108 125167 127769 130615 133422 135971 138119 139841
51505 139841 141165 142056 142492 142525 142162 141282 139920 138484 137415 136651 135766 134597 133416 132428 131506 130559 129822
51488 129822 129515 129478 129437 129479 129957 130979 132266 133563 134958 136713 138891 141281 143599 145704 147601 149343
51472 149343 150992 152635 154337 156057 157641 158948 159875 160267 159975 159115 158151 157536 157292 157069 156585 155834 154970
51455 154970 154184 153723 153842 154581 155682 156777 157640 158277 158835 159403 159841 159871 159385 158573 157620 156432 154853 153060
51437 153060 151433 150078 148753 147310 145929 144753 143571 142049 140163 138210 136486 135066 133909 133022
51423 133022 132433 132046 131577 130763 129656 128607 127896 127505 127357 127564 128259 129296 130407 131554 132862 134262
51407 134262 135583 136960 138738 140899 142970 144701 146505 148922 151909 154970 157862 160825 164124 167609
51393 167609 170871 173717 176416 179394 182693 185826 188275 190104 191847 193861 196029 198105 200021 201668
51379 201668 202700 202840 202273 201511 200900 200451 200077 199806 199765 200050 200599 201175 201504 201520 201401 201377 201588 202107 202907
51360 202907 203714 204095 203818 203021 201937 200564 198718 196296 193419 190408 187634 185217 182850 180101 177007
51345 177007 174139 171957 170334 168874 167468 166268 165286 164345 163340 162308 161290 160308 159457 158851 158484 158281
51329 158281 158222 158272 158257 158024 157633 157273 157045 156999 157282 157983 158848 159374 159262 158646 157846 157001 155934 154299 151883
51310 151883 148842 145586 142370 139067 135476 131690 127981 124456 121085 117974 115310 113024 110783 108396
51296 108396 106008 103793 101701 99636 97681 95966 94459 93080 91899 91016 90274 89350 88150 86933 85970
51281 85970 85250 84637 84163 83976 84035 84058 83839 83439 83024 82652 82307 82012 81807 81687 81664 81737 81736 81394 80757 80341 80589
51260 80589 81338 82101 82749 83570 84688 85907 87121 88474 89942 91185 92017 92708 93610 94808 96336 98384
51244 98384 100943 103495 105465 106858 108144 109653 111338 113030 114575 115770 116486 116845 117076 117177 116891 115965
51228 115965 114336 112150 109722 107368 105102 102661 99936 97212 94795 92642 90615 88803 87292 85805
51214 85805 84019 82143 80716 79894 79297 78559 77618 76493 75164 73807 72745 72017 71297 70371 69435 68738 68219
51197 68219 67662 67017 66353 65657 64881 64136 63683 63725 64246 65001 65662 66067 66324 66583 66792 66792 66616 66477 66482 66536 66561
51176 66561 66610 66748 66940 67130 67307 67474 67645 67891 68256 68709 69197 69701 70122 70254 70006 69542 69040 68500 67985
51157 67985 67828 68220 68772 68855 68325 67608 67131 67085 67585 68593 69665 70278 70505 70871 71479 71807 71531 71017 70664
51138 70664 70300 69623 68819 68315 68150 68062 67981 68039 68216 68365 68476 68620 68723 68729 68850 69326 69984 70344 70190 69795 69604
51117 69604 69837 70361 70722 70453 69522 68435 67672 67183 66686 66246 66171 66385 66403 65992 65461 65111 64796 64304 63884
51098 63884 64031 64831 65808 66420 66511 66280 65978 65711 65436 65061 64538 63883 63103 62156 61080 60131 59658 59803 60348
51079 60348 60946 61406 61702 61804 61655 61317 60976 60766 60709 60809 61042 61231 61176 61025 61227 61931 62668 62949 62967 63326
51059 63326 64205 65215 66064 66871 67727 68388 68674 68792 69016 69307 69521 69762 70218 70765 71065 71003 70819 70838 71173
51040 71173 71654 71901 71591 70813 70108 69966 70360 70852 71084 71008 70765 70514 70400 70515 70864 71417 72169 73093 74073
51021 74073 74933 75475 75505 74993 74236 73659 73392 73189 72858 72521 72329 72183 71946 71749 71806 72072 72316 72469 72614 72723
51001 72723 72695 72637 72867 73529 74381 75019 75176 74846 74248 73744 73631 73957 74546 75208 75899 76680 77598 78561 79330 79736
50981 79736 79907 80151 80567 80975 81325 81939 83136 84795 86520 88105 89552 90758 91528 91963 92492 93404 94508
50964 94508 95353 95714 95748 95786 96020 96390 96734 97061 97546 98243 98931 99392 99757 100379 101421 102676 103803 104603 105105
50945 105105 105558 106305 107566 109301 111333 113563 115957 118458 120975 123435 125765 127946 130218 133055 136738
50930 136738 141045 145522 150017 154702 159685 164829 169982 175231 180868 187218 194420 202260 210326 218500
50916 218500 227194 236929 247806 259626 272376 286265 301323 317352 334332 352531 372139 393064
50904 393064 415241 438859 464086 490747 518484 547080 576442 606333 636268 665672 694033
50893 694033 720951 746017 768710 788523 805345 819591 831699 841517 848391 851866 852082 849442 844279
50880 844279 836998 828255 818689 808547 797800 786592 775359 764517 754133 743942 733567 722703
50868 722703 711190 698952 685914 671977 657073 641175 624274 606367 587478 567659 547007
50857 547007 525770 504357 483158 462374 442066 422367 403560 385953 369763 354981 341344
50846 341344 328551 316690 306278 297682 290574 284237 278369 273279 269291 266237 263674 261329 259232
50833 259232 257549 256441 255950 255909 256066 256332 256800 257542 258568 259986 261941 264316 266746 269101 271751 275209
50817 275209 279647 284872 290623 296720 303093 309827 317073 324820 332902 341354 350565 360876 372144 383982
50803 383982 396334 409597 424168 440066 457076 475097 494353 515386 538885 565391 595018
50792 595018 627457 662302 699450 739248 782272 828939 879304 933155 990193 1050032 1112153
50781 1112153 1176014 1241152 1307001 1372636 1436841 1498392 1556070 1608471 1654195 1692406 1722935
50770 1722935 1745713 1760363 1766633 1764990 1756498 1742180 1722840 1699492 1673578 1646629 1619762 1593621
50758 1593621 1568676 1545394 1524051 1504363 1485403 1465990 1445239 1422685 1397948 1370482 1339740
50747 1339740 1305443 1267593 1226353 1182057 1135263 1086639 1036849 986585 936585 887485 839733
50736 839733 793756 750093 709217 671309 636311 604117 574614 547688 523344 501708 482732
50725 482732 465993 451008 437642 425979 415857 406820 398542 391045 384406 378508 373202 368555 364740
50712 364740 361761 359362 357211 355111 353107 351380 350015 348901 347949 347302 347185 347539 348042 348569 349432 351067
50696 351067 353563 356636 359960 363402 367051 371147 375940 381507 387706 394447 401991 410846 421326 433317
50682 433317 446498 460706 476000 492480 510189 529210 549749 572054 596307 622612 651066
50671 651066 681754 714688 749772 786803 825462 865303 905830 946559 986981 1026447 1064205
50660 1064205 1099560 1131921 1160662 1185071 1204580 1218953 1228083 1231624 1229025 1220090 1205451 1186437
50648 1186437 1164492 1140799 1116267 1091665 1067644 1044744 1023445 1004082 986642 970697 955678
50637 955678 941188 926973 912684 897821 881860 864256 844384 821783 796580 769494 741276
50626 741276 712302 682791 653154 623872 595189 567266 540581 515918 493830 474298 456887
50615 456887 441123 426714 413653 402206 392639 384897 378588 373290 368826 365262 362773 361456 361160
50602 361160 361495 362151 363149 364688 366863 369759 373639 378711 384720 391098 397599 404482 412083 420513 429882
50587 429882 440371 451884 463944 476233 489048 502955 518201 534695 552389 571377 591652
50576 591652 613033 635305 658276 681779 705749 730199 754966 779572 803464 826272 847665
50565 847665 867175 884407 899367 912321 923356 932286 938970 943499 946047 946737 945769 943596 940929
50552 940929 938537 936932 936125 935772 935626 935771 936307 936972 937255 936799 935542 933513 930652 926716 921246 913684
50536 913684 903736 891520 877222 860697 841635 820085 796625 772056 747041 721966 696920 671865
50524 671865 647000 622886 600022 578420 557832 538296 520110 503336 487732 473243 460184
50513 460184 448787 438849 430041 422306 415740 410332 406083 403223 401986 402243 403585 405738 408668 412285
50499 412285 416358 420864 426178 432681 440248 448362 456704 465453 474886 484935 495311 505920 516914
50486 516914 528349 540057 551859 563693 575480 587162 598966 611369 624554 638083 651372
50475 651372 664373 677607 691649 706827 723264 740947 759728 779538 800596 823297 847905
50464 847905 874520 903290 934428 967989 1003741 1041246 1079937 1119205 1158619 1197992 1237033
50453 1237033 1274935 1310482 1342549 1370335 1393235 1410762 1422689 1429033 1429829 1425020 1414622 1398872
50441 1398872 1378296 1353767 1326446 1297421 1267389 1236852 1206601 1177790 1151571 1128858 1110327
50430 1110327 1096277 1086430 1080114 1076820 1076356 1078418 1082303 1087109 1091950 1095793 1097357 1095458 1089369 1078725
50416 1078725 1063216 1042592 1016991 987154 954305 919728 884277 848245 811823 775663 740822
50405 740822 708114 677684 649274 622689 597952 575231 554742 536573 520509 506193 493561
50394 493561 482943 474612 468381 463744 460278 457820 456406 456193 457348 459835 463419 467899 473239 479399
50380 479399 486222 493594 501616 510523 520480 531493 543347 555583 567731 579668 591609 603703
50368 603703 615797 627652 639140 650113 660313 669607 678167 686248 693871 700837 706907 711864 715636
50355 715636 718553 721305 724429 727915 731445 734899 738510 742685 747859 754334 762066 770718 780065 790206
50341 790206 801185 812589 823788 834401 844291 853211 860773 866708 870899 873162 873188 870655 865224 856551
50327 856551 844563 829656 812395 793077 771865 749264 726128 703201 680953 659865 640498
50316 640498 623187 607959 594935 584489 576866 571843 568979 567990 568695 570742 573657 577028 580461 583381
50302 583381 585100 585098 583077 578837 572290 563656 553447 542118 529855 516797 503361 490132 477464
50289 477464 465313 453531 442169 431411 421328 411875 403080 395087 387978 381658 375926 370592 365563
50276 365563 360953 357095 354331 352721 352055 352095 352671 353605 354813 356524 359154 362812 367131 371684 376364
50261 376364 381201 386085 390955 396104 401936 408464 415327 422310 429570 437318 445482 453798 462046 470059
50247 470059 477603 484457 490653 496495 502201 507510 511805 514779 516875 518793 520601 521602 521156 519326
50233 519326 516557 513093 509011 504580 500139 495664 490821 485444 479648 473477 466769 459470 451875 444394
50219 444394 437270 430577 424315 418361 412421 406149 399379 392272 385273 378827 373010 367456 361782 355995
50205 355995 350356 344968 339740 334724 330186 326239 322635 319051 315521 312504 310509 309647 309473 309321 308901
50190 308901 308512 308626 309326 310317 311343 312372 313436 314495 315509 316464 317315 318031 318610 318945 318818 318208 317482
50173 317482 316991 316570 315783 314607 313436 312417 311181 309402 307225 304983 302833 300887 299385 298370 297445
50158 297445 296183 294687 293490 292986 293166 293819 294765 295917 297276 298824 300320 301371 301877 302297 303205 304646
50142 304646 306163 307378 308276 308899 309087 308691 307876 306980 306122 305081 303606 301749 299806 297937 295969 293638
50126 293638 290968 288285 285828 283521 281192 278853 276629 274501 272281 269871 267384 264979 262613 260073
50112 260073 257268 254416 251911 249984 248569 247494 246675 246068 245540 244961 244340 243739 243099 242320 241459 240632 239737
50095 239737 238504 236840 234919 232910 230855 228854 227089 225542 223948 222200 220550 219232 218109 216895
50081 216895 215590 214413 213448 212608 211893 211418 211202 211153 211268 211670 212418 213420 214566 215846 217316 218990 220769
50064 220769 222444 223904 225399 227412 230139 233209 236099 238756 241604 244987 248817 252755 256538 260081
50050 260081 263425 266673 269903 273137 276403 279738 283051 286045 288470 290392 292077 293657 295044 296162
50036 296162 297055 297734 298062 297909 297343 296654 296172 296035 296082 296091 296169 296788 298259 300340 302535 304702 307067 309729
50018 309729 312458 315071 317705 320597 323790 327214 330869 334779 338908 343235 347830 352703 357679 362519
50004 362519 367124 371597 376151 380991 386128 391279 396093 400551 405004 409682 414356 418591 422221 425365
49990 425365 428120 430481 432534 434515 436592 438676 440475 441682 442170 442129 441932 441735 441229 439930 437686 434768
49974 434768 431457 427752 423549 418965 414345 410000 405983 402079 397965 393484 388831 384384 380353 376638
49960 376638 373089 369749 366744 364049 361519 359098 356859 354832 352937 351100 349325 347655 346171 345065
49946 345065 344567 344716 345232 345691 345800 345526 345056 344658 344483 344444 344332 344059 343679 343165 342359 341229 340019 338960
49928 338960 337965 336836 335686 334888 334585 334493 334268 333852 333378 332924 332506 332166 331905 331601 331164 330673 330246 329834
49910 329834 329254 328423 327463 326620 326139 326131 326414 326545 326120 324997 323154 320457 316774 312230 307152 301725 295914
49893 295914 289727 283302 276684 269779 262689 255877 249764 244241 238843 233345 227968 222985 218396 214082
49879 214082 210091 206590 203599 200967 198537 196221 193937 191615 189305 187151 185239 183572 182216 181338
49865 181338 181013 181071 181268 181528 181863 182118 181968 181274 180302 179493 179074 178961 178975 179046 179201 179473 179870 180396 181078 181949
49845 181949 182967 183938 184546 184538 183903 182885 181803 180934 180471 180492 180878 181339 181637 181793 182020 182432 182953 183531 184324
49826 184324 185520 187038 188596 190055 191545 193196 194958 196760 198644 200625 202620 204679 207102 210090
49812 210090 213429 216822 220438 224781 230010 235752 241638 247719 254181 260957 267762 274324 280416 285896
49798 285896 290885 295728 300584 305284 309757 314355 319428 324771 329826 334290 338197 341442 343650 344583
49784 344583 344395 343392 341725 339382 336255 332169 327041 321084 314679 308037 301119 293929 286642 279390
49770 279390 272130 264841 257687 250887 244529 238622 233176 228163 223503 219192 215334 211958 208896 205888
49756 205888 202757 199500 196345 193702 191839 190508 189113 187374 185641 184425 183795 183430 183083 182735 182413
49741 182413 182116 181938 182026 182341 182609 182557 182175 181730 181531 181645 181793 181633 181162 180669 180246 179578 178399 176969 175808
49722 175808 175107 174704 174522 174620 174831 174773 174355 173886 173516 172944 171969 170992 170588 170770 171068 171250 171547 172168 173013
49703 173013 173961 175122 176602 178240 179791 181208 182621 184141 185828 187748 189925 192345 195077 198276
49689 198276 201912 205683 209356 213101 217264 221910 226821 231878 237168 242714 248320 253774 259002 263964
49675 263964 268570 272808 276806 280656 284335 287848 291304 294759 298126 301355 304530 307606 310175 311709
49661 311709 311994 311209 309611 307319 304374 300839 296791 292327 287575 282637 277537 272287 266983 261757 256708
49646 256708 251945 247635 243928 240839 238298 236220 234475 232875 231331 229940 228821 227989 227489 227504 228080
49631 228080 228874 229462 229852 230408 231238 232006 232397 232516 232682 233028 233488 233995 234528 235053 235564 236107 236658 237100 237407
49612 237407 237775 238427 239371 240392 241250 241846 242255 242635 243067 243433 243590 243620 243756 244034 244258 244362 244604 245216 246049
49593 246049 246776 247306 247802 248340 248775 248954 248887 248700 248536 248501 248617 248809 248968 249045 249073 249150 249377 249727 250020 250168
49573 250168 250410 251093 252182 253263 254070 254719 255282 255525 255349 255178 255514 256300 257100 257747 258397 259071 259655 260343
49555 260343 261592 263509 265731 268006 270500 273349 276339 279277 282296 285536 288834 292066 295525 299576
49541 299576 304135 308821 313477 318176 322912 327635 332504 337718 343172 348664 354414 360915 368236 375877
49527 375877 383497 391353 399823 408829 418072 427578 437638 448337 459482 470993 483054 495836 509287
49514 509287 523269 537744 552757 568389 584748 601876 619529 637234 654724 672324 690727
49503 690727 710329 730846 751657 772473 793537 815181 837307 859429 881129 902323 923069
49492 923069 943331 963001 982016 1000272 1017476 1033211 1047200 1059418 1069967 1078899 1086184 1091796
49480 1091796 1095744 1098052 1098689 1097569 1094670 1090185 1084523 1078113 1071244 1064127 1057033 1050236 1043848 1037825
49466 1037825 1032170 1027091 1022947 1020059 1018535 1018226 1018930 1020734 1024061 1029178 1035706 1042857 1050207 1058063
49452 1058063 1066944 1076910 1087511 1098212 1108645 1118585 1127976 1137014 1145985 1154894 1163364 1170877 1177033
49439 1177033 1181593 1184387 1185262 1184016 1180400 1174276 1165794 1155295 1143032 1129074 1113458 1096252 1077419
49426 1077419 1056804 1034385 1010465 985537 960059 934406 908893 883680 858742 834082 809944
49415 809944 786655 764297 742708 721785 701626 682298 663672 645605 628196 611759 596524
49404 596524 582434 569224 556644 544637 533318 522772 512879 503410 494320 485821 478102 471054 464408
49391 464408 458109 452382 447435 443172 439278 435463 431587 427662 423872 420511 417773 415605 413821 412339
49377 412339 411173 410261 409495 408972 409033 409932 411555 413564 415764 418222 421084 424383 428039 431982 436274 441109
49361 441109 446649 452900 459910 468038 477684 488470 498840 506920 511883 514316 515293 515408 514812 513780
49347 513780 512845 512454 512816 514053 516244 519247 522731 526526 530786 535701 541152 546857 552743 558938 565319
49332 565319 571338 576496 580930 585285 589971 594751 599158 603137 607040 611149 615445 619882 624611 629804
49318 629804 635372 641009 646488 651856 657382 663346 669873 676884 684245 691940 700039 708549 717396 726599
49304 726599 736319 746672 757584 768895 780548 792612 805208 818452 832408 847000 862050 877465
49292 877465 893357 909879 927025 944665 962757 981430 1000888 1021268 1042598 1064858 1088104
49281 1088104 1112475 1138028 1164591 1191914 1219960 1248819 1278319 1308030 1337802 1368050 1399227
49270 1399227 1431187 1463427 1495803 1528607 1561911 1595319 1628516 1661717 1695255 1728969 1762296
49259 1762296 1794874 1826712 1857799 1887831 1916396 1943198 1967976 1990377 2010077 2026974 2041156
49248 2041156 2052684 2061521 2067665 2071254 2072520 2071672 2068882 2064319 2058188 2050779 2042522 2033865 2025025 2015869
49234 2015869 2006227 1996354 1986967 1978781 1972083 1966774 1962677 1959691 1957752 1956880 1957240 1959016 1962185 1966528
49220 1966528 1971920 1978468 1986333 1995500 2005772 2016866 2028397 2039843 2050673 2060570 2069469 2077326 2083919
49207 2083919 2088915 2092115 2093479 2092902 2090049 2084546 2076274 2065369 2051939 2035924 2017314 1996321 1973310
49194 1973310 1948631 1922601 1895507 1867485 1838507 1808621 1778172 1747651 1717391 1687542 1658273
49183 1658273 1629816 1602316 1575833 1550477 1526387 1503533 1481697 1460729 1440632 1421400 1402951
49172 1402951 1385307 1368675 1353200 1338737 1325002 1311866 1299362 1287495 1276180 1265349 1255017
49161 1255017 1245241 1236086 1227608 1219857 1212874 1206676 1201132 1195907 1190674 1185429 1180430 1175737 1171034 1166058
49147 1166058 1161018 1156284 1151817 1147216 1142337 1137533 1133185 1129263 1125510 1121859 1118479 1115563 1113262 1111699
49133 1111699 1110862 1110531 1110499 1110851 1111846 1113510 1115545 1117681 1119932 1122426 1125139 1127967 1130967 1134347 1138200
49118 1138200 1142402 1146819 1151493 1156555 1162063 1168038 1174590 1181847 1189753 1198076 1206675 1215626 1225006 1234702
49104 1234702 1244586 1254794 1265607 1277061 1288959 1301308 1314501 1328889 1344356 1360554 1377410
49093 1377410 1395092 1413559 1432455 1451488 1470592 1489654 1508409 1526830 1545373 1564554 1584398
49082 1584398 1604512 1624515 1644138 1663038 1680893 1697724 1713830 1729349 1744090 1757862 1770722
49071 1770722 1782805 1794149 1804844 1815164 1825362 1835389 1844960 1853820 1861887 1869236 1876069 1882620
49059 1882620 1888951 1894895 1900253 1905019 1909355 1913482 1917622 1921910 1926217 1930242 1933883 1937441 1941247 1945227
49045 1945227 1949029 1952512 1955863 1959216 1962452 1965421 1968230 1971179 1974534 1978387 1982623 1986940 1991073 1995083
49031 1995083 1999334 2004068 2009081 2013972 2018644 2023435 2028729 2034586 2040762 2046955 2052897 2058325 2063124 2067570
49017 2067570 2072232 2077476 2083107 2088661 2093945 2099103 2104176 2108884 2112920 2116281 2119181 2121759 2124000 2125827
49003 2125827 2127192 2128134 2128749 2128970 2128409 2126647 2123772 2120328 2116600 2112237 2106782 2100285 2093041 2085003 2075901
48988 2075901 2065882 2055515 2045137 2034539 2023405 2011740 1999744 1987550 1975244 1962959 1950774
48977 1950774 1938665 1926648 1914842 1903377 1892364 1882006 1872554 1864117 1856642 1850027 1844093 1838457
48965 1838457 1832784 1827214 1822271 1818287 1815188 1812887 1811493 1810962 1810840 1810650 1810313 1810005 1809802 1809691 1809733 1809952
48949 1809952 1810200 1810362 1810537 1810854 1811217 1811434 1811433 1811121 1810248 1808636 1806414 1803739 1800433 1796202 1791092 1785397 1779208
48932 1779208 1772391 1764976 1757180 1749014 1740234 1730758 1720810 1710532 1699766 1688398 1676665 1664859 1652877
48919 1652877 1640293 1626849 1612677 1598089 1583274 1568215 1552795 1536946 1520716 1504199 1487437
48908 1487437 1470435 1453310 1436353 1419908 1404156 1389014 1374229 1359664 1345574 1332495 1320796
48897 1320796 1310371 1300848 1292027 1283993 1276876 1270705 1265456 1261108 1257586 1254806 1252788 1251629 1251395 1252123
48883 1252123 1253900 1256770 1260576 1265036 1269999 1275479 1281434 1287717 1294289 1301309 1308936 1317177 1325984 1335313
48869 1335313 1345051 1355061 1365413 1376342 1387856 1399543 1411006 1422334 1433952 1446051 1458434
48858 1458434 1470874 1483370 1495991 1508733 1521714 1535319 1549917 1565459 1581538 1597876 1614596
48847 1614596 1631929 1649786 1667823 1685899 1704260 1723183 1742611 1762326 1782306 1802712 1823478
48836 1823478 1844214 1864615 1884809 1905124 1925577 1945765 1965266 1984039 2002372 2020501 2038310
48825 2038310 2055415 2071482 2086425 2100296 2113077 2124646 2134863 2143538 2150332 2154897 2157272 2157999
48813 2157999 2157694 2156509 2154127 2150219 2144754 2137832 2129403 2119299 2107547 2094493 2080585 2066026 2050674
48800 2050674 2034277 2016764 1998337 1979347 1960132 1940929 1921827 1902770 1883696 1864726 1846168
48789 1846168 1828261 1810881 1793595 1776071 1758437 1741218 1724941 1709822 1695794 1682763 1670722
48778 1670722 1659663 1649460 1639913 1630931 1622618 1615176 1608732 1603223 1598424 1594079 1590044 1586336 1583088
48765 1583088 1580458 1578583 1577558 1577415 1578083 1579368 1581031 1582945 1585246 1588254 1592168 1596831 1601889 1607193
48751 1607193 1612948 1619454 1626744 1634568 1642658 1650951 1659590 1668794 1678689 1689220 1700221 1711550 1723140
48738 1723140 1734904 1746738 1758607 1770580 1782692 1794831 1806844 1818688 1830426 1842129 1853833
48727 1853833 1865490 1876886 1887706 1897837 1907547 1917230 1927015 1936730 1946190 1955333 1964066 1972188 1979537
48714 1979537 1986167 1992268 1997981 2003262 2007913 2011734 2014700 2016955 2018606 2019554 2019570 2018470 2016120 2012379 2007189
48699 2007189 2000671 1993034 1984386 1974740 1964100 1952364 1939273 1924744 1909263 1893639 1878235 1862648
48687 1862648 1846284 1829065 1811431 1793816 1776324 1758871 1741418 1724089 1707117 1690698 1674875
48676 1674875 1659630 1645141 1631801 1619933 1609579 1600635 1593080 1586971 1582338 1579225 1577719 1577853 1579513
48663 1579513 1582578 1587062 1592940 1599916 1607551 1615615 1624152 1633229 1642769 1652681 1662975 1673659 1684658
48650 1684658 1695918 1707531 1719585 1731930 1744172 1755986 1767361 1778525 1789606 1800411 1810571
48639 1810571 1819886 1828534 1836979 1845683 1854864 1864429 1874117 1883757 1893442 1903430 1913920 1924996 1936722
48626 1936722 1949220 1962609 1976980 1992424 2008979 2026546 2045028 2064640 2085902 2109173 2134265
48615 2134265 2160670 2188064 2216431 2245762 2275835 2306301 2336875 2367410 2397897 2428293 2458229
48604 2458229 2486943 2513725 2538415 2561198 2581853 2599507 2613239 2622679 2627856 2628742 2625260 2617584
48592 2617584 2606020 2590641 2571367 2548419 2522341 2493492 2461867 2427652 2391652 2354840 2317661
48581 2317661 2280108 2242317 2204739 2167734 2131331 2095465 2060154 2025406 1991235 1957874 1925714
48570 1925714 1894867 1865033 1835975 1807878 1781056 1755485 1730905 1707237 1684584 1662931 1642115
48559 1642115 1622086 1602936 1584636 1566988 1549833 1533114 1516752 1500670 1484994 1469967 1455636
48548 1455636 1441786 1428226 1414937 1401891 1388970 1376200 1363849 1352157 1341089 1330454 1320105
48537 1320105 1309945 1299905 1290065 1280622 1271605 1262746 1253799 1244893 1236408 1228558 1221229 1214179 1207266
48524 1207266 1200512 1194064 1188047 1182432 1177111 1172159 1167876 1164495 1161932 1159918 1158292 1157044 1156170 1155623
48510 1155623 1155381 1155472 1155977 1157044 1158839 1161417 1164708 1168638 1173133 1177947 1182721 1187275 1191686 1195936 1199719
48495 1199719 1202837 1205566 1208352 1211269 1214087 1216809 1219791 1223312 1227329 1231740 1236570 1241803 1247248 1252720
48481 1252720 1258203 1263678 1268970 1273953 1278807 1283881 1289295 1294781 1299949 1304634 1308976 1313257 1317696 1322378
48467 1322378 1327268 1332232 1337085 1341740 1346338 1351162 1356374 1361941 1367843 1374166 1380912 1387880 1394938 1402274
48453 1402274 1410166 1418577 1427220 1435967 1444941 1454208 1463685 1473432 1483787 1495053 1507213 1520100 1533682
48440 1533682 1548044 1563183 1578990 1595389 1612438 1630344 1649370 1669621 1690846 1712581 1734586
48429 1734586 1757044 1780239 1804122 1828293 1852336 1876043 1899409 1922541 1945512 1968148 1989896
48418 1989896 2009997 2027872 2043355 2056608 2067828 2077016 2083996 2088662 2091181 2091837 2090723 2087716 2082806
48405 2082806 2076274 2068452 2059462 2049382 2038500 2027111 2015086 2001928 1987353 1971594 1954991 1937495
48393 1937495 1918826 1899019 1878504 1857571 1835978 1813225 1789109 1763882 1737973 1711729 1685395
48382 1685395 1659162 1633115 1607281 1581795 1556957 1533032 1510033 1487807 1466291 1445646 1426114
48371 1426114 1407826 1390743 1374770 1359911 1346318 1334185 1323574 1314383 1306470 1299770 1294259 1289898
48359 1289898 1286597 1284141 1282140 1280260 1278578 1277578 1277608 1278473 1279746 1281371 1283648 1286655 1290032 1293472 1297141
48344 1297141 1301380 1306149 1311099 1316138 1321647 1328009 1335089 1342332 1349315 1356050 1362803 1369784 1377101 1384824
48330 1384824 1392895 1401004 1408756 1416064 1423166 1430200 1436897 1442875 1448110 1452924 1457619 1462307 1467018 1471656
48316 1471656 1475812 1478955 1481003 1482514 1484138 1485981 1487703 1489103 1490401 1491919 1493740 1495769 1498032 1500750
48302 1500750 1504092 1507936 1511950 1515905 1519839 1523917 1528196 1532643 1537304 1542298 1547641 1553159 1558688 1564248
48288 1564248 1570011 1576126 1582615 1589415 1596511 1604062 1612328 1621369 1630815 1640115 1648993 1657538 1665835 1673735
48274 1673735 1681108 1688124 1695082 1702004 1708620 1714702 1720256 1725404 1730253 1734893 1739344 1743433 1746858 1749534
48260 1749534 1751790 1754060 1756411 1758486 1759970 1760906 1761477 1761602 1761015 1759740 1758264 1757069 1756155 1755128 1753708
48245 1753708 1751937 1749961 1747814 1745482 1743051 1740730 1738757 1737285 1736289 1735601 1735118 1734943 1735254 1736114 1737520
48230 1737520 1739581 1742458 1746166 1750617 1755830 1761835 1768382 1775022 1781619 1788478 1795784 1803137 1809882 1815779
48216 1815779 1821083 1826044 1830553 1834207 1836485 1836859 1834991 1830890 1824815 1816980 1807467 1796369 1783805 1769737
48202 1769737 1753945 1736327 1717132 1696814 1675684 1653826 1631327 1608462 1585523 1562522 1539207
48191 1539207 1515504 1491853 1468964 1447208 1426406 1406211 1386461 1367071 1347802 1328448 1309171
48180 1309171 1290414 1272483 1255373 1238986 1223271 1208107 1193239 1178478 1163868 1149607 1135872
48169 1135872 1122803 1110509 1098943 1087838 1076890 1066013 1055365 1045128 1035315 1025742 1016130 1006238
48157 1006238 996028 985717 975597 965766 956071 946357 936692 927276 918137 909019 899629 889914 880055
48144 880055 870199 860266 850045 839461 828707 818138 807955 797989 787860 777415 766934 756814
48132 756814 747127 737640 728229 719042 710207 701587 692973 684442 676312 668766 661647 654661 647737 641156
48118 641156 635301 630256 625713 621327 617175 613704 611197 609490 608295 607605 607568 608053 608671 609237 610021 611426
48102 611426 613560 616206 619082 622016 624907 627681 630325 632878 635411 638043 641010 644595 648895 653678
48088 653678 658578 663459 668465 673680 678904 683922 688856 694037 699535 705068 710384 715520 720625 725736
48074 725736 730814 735762 740282 744036 747191 750570 754912 760047 765109 769481 773245 776784 780358 784125
48060 784125 788198 792459 796591 800511 804568 809130 814119 819206 824274 829443 834671 839678 844307 848752
48046 848752 853372 858392 863880 869830 876088 882313 888191 893707 899114 904629 910252 915897 921612 927578
48032 927578 933939 940652 947490 954183 960649 967166 974216 982083 990600 999362 1008109 1016825 1025536 1034213
48018 1034213 1042908 1051801 1061026 1070527 1080102 1089488 1098397 1106687 1114572 1122518 1130803 1139256 1147555 1155569
48004 1155569 1163283 1170565 1177332 1183842 1190544 1197525 1204353 1210517 1215914 1220813 1225499 1230075 1234527 1238815
47990 1238815 1242864 1246536 1249700 1252365 1254742 1257116 1259693 1262615 1266082 1270294 1275223 1280627 1286371 1292649
47976 1292649 1299831 1308236 1318031 1328881 1339282 1346467 1347565 1341186 1327912 1309461 1287705 1264279
47964 1264279 1240404 1216645 1193016 1169521 1146430 1123941 1101872 1079984 1058402 1037449 1017202
47953 1017202 997539 978503 960277 942785 925635 908554 891660 875178 859124 843424 828193
47942 828193 813643 799750 786192 772718 759447 746766 734979 724135 714109 704725 695829 687343
47930 687343 679283 671639 664244 656919 649788 643250 637508 632270 627141 622143 617604 613575 609728 605873
47916 605873 602254 599156 596452 593801 591076 588413 585913 583586 581497 579716 578127 576468 574617 572659
47902 572659 570624 568345 565679 562704 559596 556407 553131 549876 546790 543779 540467 536543 532052 527247
47888 527247 522245 516997 511580 506326 501519 497012 492313 487057 481337 475571 470123 465057 460220 455469
47874 455469 450837 446462 442408 438629 435147 432182 429975 428535 427674 427261 427312 427818 428633 429633 430889 432551
47858 432551 434652 437118 439962 443326 447293 451692 456176 460480 464593 468682 472893 477242 481655 486005
47844 486005 490118 493840 497141 500060 502509 504276 505330 505981 506575 507087 507184 506648 505518 503837 501536 498690
47828 498690 495705 493038 490779 488644 486349 483864 481315 478757 476148 473535 471180 469410 468292 467515
47814 467515 466700 465765 464926 464401 464221 464331 464701 465289 466028 466921 468088 469681 471734 474098 476473 478564 480310
47797 480310 481985 483922 486173 488492 490637 492561 494297 495824 497085 498032 498613 498818 498715 498338 497518 496033
47781 496033 493911 491422 488719 485674 482130 478113 473716 468946 463891 458885 454289 450090 445867 441200
47767 441200 436126 431166 426902 423468 420497 417578 414641 411784 408879 405685 402305 399216 396778 394953
47753 394953 393592 392702 392300 392250 392416 392770 393231 393648 394080 394812 395930 397140 398210 399223 400168 400605 400217
47736 400217 399425 399019 399282 399912 400688 401714 403038 404492 406020 407782 409841 412076 414515 417372 420666
47721 420666 424147 427780 431947 436914 442412 448042 453863 460259 467285 474522 481590 488619 496102 504395
47707 504395 513389 522611 531661 540521 549428 558466 567402 575930 583902 591249 597845 603625 608733 613356
47693 613356 617388 620420 622108 622506 622006 621000 619626 617761 615194 611745 607325 601999 596066 589965 583970
47678 583970 577969 571666 564997 558269 551849 545788 539791 533581 527282 521429 516540 512652 509399 506516
47664 506516 504095 502217 500615 498955 497348 496256 495910 496152 496856 498191 500337 503270 507026 511913 518153
47649 518153 525437 533108 540758 548425 556269 564251 572216 580092 587915 595737 603540 611195 618451 625025
47635 625025 630703 635342 638791 640930 641745 641301 639594 636552 632225 626932 621094 614950 608520 601817 595006
47620 595006 588306 581842 575645 569763 564309 559430 555271 551869 548995 546274 543617 541476 540453 540662
47606 540662 541673 543096 544967 547473 550591 554150 558065 562353 567097 572516 578842 585946 593298 600534
47592 600534 607786 615193 622378 628838 634640 640250 645699 650485 654344 657603 660600 663182 665065 666350
47578 666350 667342 668088 668352 667938 666830 665131 663062 660881 658709 656498 654235 652029 649917 647798 645652
47563 645652 643541 641319 638639 635493 632415 629819 627315 624062 619764 614962 610367 606199 602171 597833
47549 597833 592817 586990 580543 573834 567085 560268 553285 546136 538892 531616 524340 517081 509851 502706
47535 502706 495731 488921 482143 475323 468618 462296 456478 451043 445722 440203 434177 427516 420397 413196
47521 413196 406194 399404 392670 385876 379085 372499 366309 360534 355038 349672 344358 339074 333911 329146
47507 329146 325062 321657 318687 316102 314209 313262 313070 313206 313475 313921 314492 315024 315555 316405 317821 319744
47491 319744 321993 324544 327492 330764 333975 336643 338607 340191 341817 343442 344526 344689 344198 343618 343080
47476 343080 342171 340476 337989 335018 331866 328672 325361 321691 317477 312808 307981 303240 298654 294203
47462 294203 289825 285418 280935 276493 272247 268200 264284 260577 257268 254382 251722 249104 246542 244149
47448 244149 241984 240000 238075 236148 234382 233081 232304 231714 231001 230325 230031 230054 229958 229594 229340 229627 230551
47431 230551 232010 233913 236108 238406 240789 243329 245807 247798 249281 250783 252647 254479 255661 256131
47417 256131 256281 256320 256202 256018 255954 255852 255238 253864 251960 249854 247669 245459 243381 241607 240207 239178
47401 239178 238411 237627 236588 235435 234615 234365 234483 234640 234758 234966 235437 236358 237845 239738 241628 243276 244848
47384 244848 246563 248280 249686 250756 251788 252979 254213 255331 256418 257704 259324 261252 263427 265859
47370 265859 268591 271560 274517 277195 279583 281978 284656 287623 290795 294335 298548 303451 308685 313956
47356 313956 319332 324993 330913 337016 343498 350649 358362 366099 373447 380454 387267 393691 399415 404557
47342 404557 409635 414896 419975 424320 427757 430432 432402 433548 433866 433537 432651 431087 428765 425845 422535
47327 422535 418863 414804 410492 406107 401602 396743 391462 386000 380729 375952 371846 368357 365104 361616
47313 361616 357829 354213 351257 348955 346952 345065 343430 342160 341100 340018 338889 337906 337270 337055 337250
47298 337250 337895 339099 340864 342916 344810 346332 347666 349072 350522 351824 353014 354321 355736 356896
47284 356896 357498 357567 357169 356102 354121 351340 348154 344763 341036 336857 332390 327905 323449 318829 313868
47269 313868 308611 303280 298093 293189 288678 284648 281014 277445 273597 269470 265401 261672 258255 255020
47255 255020 252008 249366 247109 245126 243367 241864 240607 239519 238572 237787 237143 236605 236195 235939 235785 235697
47239 235697 235785 236155 236697 237224 237777 238552 239469 240128 240348 240482 240970 241714 242178 242044 241517 240999 240706 240678 240906
47220 240906 241274 241526 241510 241428 241655 242292 243091 243869 244817 246234 248065 249973 251818 253814 256130 258586 260911
47203 260911 263098 265328 267672 270087 272592 275219 277860 280412 283080 286231 289939 293908 297912 302032
47189 302032 306382 310807 315051 318990 322595 325858 328915 332059 335372 338479 340866 342372 343196 343601 343786
47174 343786 343926 344006 343685 342635 341044 339472 338179 336894 335363 333749 332315 330942 329312 327436 325684
47159 325684 324306 323186 322106 321039 320099 319332 318659 317965 317211 316566 316405 317021 318258 319587 320668 321736
47143 321736 323318 325641 328487 331558 334741 337990 341166 344142 346983 349881 352985 356343 359927 363588
47129 363588 367059 370114 372708 374847 376405 377218 377357 377112 376677 376005 375035 373875 372655 371344 369887 368441
47113 368441 367266 366399 365623 364797 364070 363730 363912 364582 365702 367301 369368 371782 374394 377176 380291 383969
47097 383969 388317 393204 398389 403787 409568 415931 422811 429883 436840 443577 450117 456543 463055 469868
47083 469868 476852 483388 488848 493175 496763 499797 502087 503632 504918 506315 507478 507763 507121 506129 505156
47068 505156 503961 502247 500208 498219 496265 494026 491414 488766 486484 484675 483187 481845 480636 479711
47054 479711 479187 478939 478650 478139 477550 477129 476918 476814 476867 477371 478583 480476 482767 485139 487425 489599 491647
47037 491647 493474 494989 496228 497257 497980 498204 497926 497332 496386 494678 491895 488246 484160 479741 474835
47022 474835 469525 464133 458705 452915 446634 440218 434014 427893 421578 415232 409337 404111 399367 394932
47008 394932 390850 387141 383703 380627 378294 376937 376235 375639 375024 374743 375023 375583 376033 376482 377484 379378
46992 379378 381881 384433 386814 389262 392052 395147 398300 401363 404358 407338 410302 413229 416078 418772
46978 418772 421287 423771 426452 429364 432222 434678 436594 438050 439198 440237 441458 443138 445352 448010
46964 448010 451046 454445 458118 461920 465819 469845 473826 477440 480672 484001 487876 492122 496148 499717
46950 499717 503214 507109 511396 515685 519659 523358 527106 531300 536096 541220 546151 550595 554704 558791
46936 558791 563012 567408 572065 576992 581892 586259 589751 592358 594263 595688 596823 597725 598222 598060 597220
46921 597220 595973 594598 593151 591590 590014 588644 587607 586844 586239 585738 585343 585045 584836 584754 584899 585423 586499
46904 586499 588242 590585 593273 596014 598696 601417 604346 607608 611270 615329 619653 624032 628385 632815
46890 632815 637440 642234 647160 652287 657599 662762 667327 671210 674799 678519 682453 686371 689944 692876
46876 692876 695022 696506 697608 698462 699011 699291 699530 699825 699926 699557 698799 697959 697196 696496 695951 695761 695920 696116
46858 696116 696028 695664 695386 695658 696694 698257 699870 701340 703006 705324 708337 711725 715289 719101 723188
46843 723188 727372 731524 735764 740272 745066 750064 755274 760755 766432 772024 777187 781707 785569 788821
46829 788821 791365 792975 793562 793323 792490 791073 789020 786538 784029 781703 779480 777250 775027 772834 770720
46814 770720 768995 768199 768652 770213 772630 775916 780162 785103 790209 795224 800394 806044 812080 818015 823438
$$ [...]
##END NTUPLES=NMR SPECTRUM
##END=
