
##TITLE=AC1169_Tolima-ibage-TGAAH12004_6672652_X3OlbKJwfa
##JCAMPDX= 6.0         $$ Bruker NMR JCAMP-DX V2.0
##DATA TYPE= NMR SPECTRUM
##DATA CLASS= NTUPLES
##ORIGIN= BRUKER
##OWNER= Administrator
$$ 1.72 TOPSPIN		Version 2.1
$$ 2012-08-14 19:17:57.359 -0500  Administrator@TOPSPIN
$$ Compression mode = diff/dup
##.OBSERVE FREQUENCY= 400.02188249412
##.OBSERVE NUCLEUS= ^1H
##.ACQUISITION MODE= SIMULTANEOUS (DQD)
##.ACQUISITION SCHEME= undefined
##.AVERAGES= 8
##.DIGITISER RES= 22
##SPECTROMETER/DATA SYSTEM= spect
##.PULSE SEQUENCE= zg30
##.SOLVENT NAME= COFFEE_meoh
##.SHIFT REFERENCE= INTERNAL, COFFEE_meoh, 1, 14.98509
##AUDIT TRAIL= $$ (NUMBER, WHEN, WHO, WHERE, PROCESS, VERSION, WHAT)
$$ ##TITLE= Audit trail, TOPSPIN		Version 2.1
$$ ##JCAMPDX= 5.01
$$ ##ORIGIN= Bruker BioSpin GmbH
$$ ##OWNER= Administrator
$$ $$ C:\Bruker\TOPSPIN/data/COFFEE/nmr/AC1169_Tolima-ibage-TGAAH12004_6672652_X3OlbKJwfa/10/pdata/1/auditp.txt
$$ ##AUDIT TRAIL=  $$ (NUMBER, WHEN, WHO, WHERE, PROCESS, VERSION, WHAT)
(   1,<2012-08-14 19:17:50.406 -0500>,<Administrator>,<TOPSPIN>,<go>,<TOPSPIN 2.1>,
      <created by zg
	started at 2012-08-14 19:16:43.703 -0500,
	POWCHK enabled, PULCHK disabled,
       configuration hash MD5:
       6B 1B 68 BB D9 2E 58 E2 7F 35 AD 54 07 DF 0E 41
       data hash MD5: 64K
       E3 5D DE 31 36 DB F9 B7 A0 4E 55 07 F9 46 AC 02>)
(   2,<2012-08-14 19:17:53.296 -0500>,<Administrator>,<TOPSPIN>,<proc1d>,<TOPSPIN 2.1>,
      <Start of raw data processing
       efp LB = 0 FT_mod = 6 PKNL = 1 PHC0 = 0 PHC1 = 0 SI = 32K 
       data hash MD5: 32K
       79 9D 8A BC 05 6D 89 AE 86 DC 5A AF A0 A0 97 66>)
(   3,<2012-08-14 19:17:53.625 -0500>,<Administrator>,<TOPSPIN>,<proc1d>,<TOPSPIN 2.1>,
      <pk PHC0 = 178.0774 PHC1 = 0 
       data hash MD5: 32K
       4C 10 CB 0A 54 C3 CD D0 9A B3 F3 3D E3 03 6E D5>)
(   4,<2012-08-14 19:17:53.671 -0500>,<Administrator>,<TOPSPIN>,<proc1d>,<TOPSPIN 2.1>,
      <abs ABSG = 1 
       data hash MD5: 32K
       CC CC 92 0A 3A 88 E4 E2 EF 84 78 41 3B 52 2C BE>)
(   5,<2012-08-14 19:17:53.703 -0500>,<Administrator>,<TOPSPIN>,<proc1d>,<TOPSPIN 2.1>,
      <abs ABSG = 2 
       data hash MD5: 32K
       1B 81 10 57 46 9E 1B 7D 23 13 23 E9 E6 67 C0 EC>)
(   6,<2012-08-14 19:17:53.734 -0500>,<Administrator>,<TOPSPIN>,<proc1d>,<TOPSPIN 2.1>,
      <abs ABSG = 3 
       data hash MD5: 32K
       33 A9 B9 24 F9 3E 0E 30 1F 9A 00 DE 35 2B BC 92>)
(   7,<2012-08-14 19:17:53.765 -0500>,<Administrator>,<TOPSPIN>,<proc1d>,<TOPSPIN 2.1>,
      <abs ABSG = 4 
       data hash MD5: 32K
       B9 8D 0D 7A 5E 4D 6D 87 F6 0C B3 D5 2F C1 BA 04>)
(   8,<2012-08-14 19:17:53.796 -0500>,<Administrator>,<TOPSPIN>,<proc1d>,<TOPSPIN 2.1>,
      <abs ABSG = 5 
       data hash MD5: 32K
       A7 04 08 81 E0 7D D9 CC A9 3A C9 39 04 1C 00 E5>)
$$ ##END=
$$ 
$$ $$ hash MD5
$$ $$ 28 92 E9 F8 86 32 60 AF 68 39 2E 45 21 F5 00 A1
##$RELAX= 
##$RELAX= 
##$RELAX= 
##$RELAX= 
##$RELAX= 
##$RELAX= 
##$RELAX= 
$$ Bruker specific parameters
$$ [...]
150 150 150 150 150 150 150 150
##$TP07= 0
##$TPNAME0= <>
##$TPNAME1= <>
##$TPNAME2= <>
##$TPNAME3= <>
##$TPNAME4= <>
##$TPNAME5= <>
##$TPNAME6= <>
##$TPNAME7= <>
##$TPOAL= (0..7)
0.5 0.5 0.5 0.5 0.5 0.5 0.5 0.5
##$TPOFFS= (0..7)
0 0 0 0 0 0 0 0
##$TUNHIN= 0
##$TUNHOUT= 0
##$TUNXOUT= 0
##$USERA1= <user>
##$USERA2= <user>
##$USERA3= <user>
##$USERA4= <user>
##$USERA5= <user>
##$V9= 5
##$VALIST= <valist>
##$VCLIST= <CCCCCCCCCCCCCCC>
##$VD= 0
##$VDLIST= <DDDDDDDDDDDDDDD>
##$VPLIST= <PPPPPPPPPPPPPPP>
##$VTLIST= <TTTTTTTTTTTTTTT>
##$WBST= 1024
##$WBSW= 4
##$XGAIN= (0..3)
0 0 0 0
##$XL= 0
##$YL= 0
##$YMAX_a= 513322
##$YMIN_a= -658054
##$ZGOPTNS= <>
##$ZL1= 120
##$ZL2= 120
##$ZL3= 120
##$ZL4= 120
##$ABSF1= 14.98509
##$ABSF2= -5.573092
##$ABSG= 5
##$ABSL= 3
##$ALPHA= 0
##$AQORDER= 0
##$ASSFAC= 0
##$ASSFACI= 0
##$ASSFACX= 0
##$ASSWID= 0
##$AUNMP= <proc_prof1d_extract_pilot.lims>
##$AXLEFT= 0
##$AXNAME= <>
##$AXNUC= <1H>
##$AXRIGHT= 0
##$AXTYPE= 0
##$AXUNIT= <>
##$AZFE= 0.1
##$AZFW= 0.1
##$BCFW= 0
##$BC_mod= 0
##$BYTORDP= 0
##$COROFFS= 0
##$CY= 15
##$DATMOD= 1
##$DC= 0
##$DFILT= <>
##$DTYPP= 0
##$F1P= 0
##$F2P= 0
##$FCOR= 0.5
##$FTSIZE= 32768
##$FT_mod= 6
##$GAMMA= 0
##$GB= 0
##$INTBC= 1
##$INTSCL= 1
##$ISEN= 128
##$LB= 0
##$LEV0= 0
##$LPBIN= 0
##$MAXI= 10000
##$MC2= 0
##$MEAN= 0
##$ME_mod= 0
##$MI= 0
##$NCOEF= 0
##$NC_proc= -8
##$NLEV= 6
##$NOISF1= 0
##$NOISF2= 0
##$NSP= 0
##$NTH_PI= 0
##$NZP= 0
##$OFFSET= 14.98509
##$PC= 1
##$PHC0= 178.0774
##$PHC1= 0
##$PH_mod= 1
##$PKNL= yes
##$PPARMOD= 0
##$PPDIAG= 0
##$PPIPTYP= 0
##$PPMPNUM= 2147483647
##$PPRESOL= 1
##$PSCAL= 4
##$PSIGN= 0
##$PYNMP= <proc.py>
##$REVERSE= no
##$SF= 400.02
##$SI= 32768
##$SIGF1= 0
##$SIGF2= 0
##$SINO= 400
##$SIOLD= 32768
##$SPECTYP= <>
##$SREGLST= <1H.CDCl3>
##$SSB= 0
##$STSI= 32768
##$STSR= 0
##$SW_p= 8223.68421052631
##$SYMM= 0
##$S_DEV= 0
##$TDeff= 65536
##$TDoff= 0
##$TI= <>
##$TILT= no
##$TM1= 0
##$TM2= 0
##$TOPLEV= 0
##$USERP1= <user>
##$USERP2= <user>
##$USERP3= <user>
##$USERP4= <user>
##$USERP5= <user>
##$WDW= 1
##$XDIM= 32768
##$YMAX_p= 473631867
##$YMIN_p= -725915
##$CURPLOT= <Network HP LaserJet P1505>
##$CURPRIN= <$Network HP LaserJet P1505>
##$DFORMAT= <normdp>
##$LAYOUT= <+/1D_H.xwp>
##$LFORMAT= <normlp>
##$PFORMAT= <normpl>
##$SURQMSG= 1
$$ End of Bruker specific parameters
$$ ---------------------------------
##NTUPLES= NMR SPECTRUM
##VAR_NAME=  FREQUENCY,     SPECTRUM/REAL,   SPECTRUM/IMAG
##SYMBOL=    X,             R,               I
##VAR_TYPE=  INDEPENDENT,   DEPENDENT,       DEPENDENT
##VAR_FORM=  AFFN,          ASDF,            ASDF
##VAR_DIM=   32768,         32768,           32768
##UNITS=     HZ,            ARBITRARY UNITS, ARBITRARY UNITS
##FACTOR=    0.250966925370066, 1,           1
##FIRST=     8223.43324360094, 144912,       -125150
##LAST=      0,             144797,          -21876
##MIN=       0,             -725915,         0
##MAX=       8223.43324360094, 473631867,    0
$$ Real data points
##PAGE= N=1
##DATA TABLE= (X++(R..R)), XYDATA
$$ [...]
19563b76083A18279j0645a57755M5838F1558i7542l439E5088a39925l2410h3916
19551A02597a62624k08695a23837A72325a43228E7869k6030b87085a0595A71035
19540i6044o7557j61834E2296i9437a4804j02830k8440j53145f7336A88884e1306
19528b49376g3093G2288J04716d47853K5796a19206Q010D1345Q7447C0017a80441
19516B42131A6092K38424E0231K24002a7958o2857H4808J02674f2212K5473l5904
19505g2643o108k17270a08978p1173d19j71908j47918A72191c9577J6552j89087
19494b12112K8248A87999D5677b23906r0825H1764c16013h8920k76990J42889
19484b23021e8466A39979b28540A38965A7102a25574r834j19829g6590A41525
$$ y = [-276083, 118279, 107634, -157755, -111917, 61558, -97542, -100981, 55088, -139925, -172335, -83916, 102597, -162624, -371319, -123837, 172325, -143228, 57869, 31839, -287085, -10595, 171035, -96044, -163601, -325435, 52296, -99437, -14804, -117634, -146074, -299219, -67336, 188884, -51306, -249376, -73093, 72288, 177004, -447853, -422057, -119206, -111196, 41345, 128792, 30017, -180441, 242131, 16092, 254516, 50231, 274233, -17958, -80815, 84808, 187482, -62212, -36739, -72643, -78751, -296021, -108978, -180151, -419, -172327, -320245, 172191, -39577, -23025, -212112, -183864, 187999, 45677, -223906, -314731, 81764, -316013, -88920, -365910, -223021, -58466, 139979, -228540, 138965, 17102, -125574, -135408, -255237, -76590, 141525]
19473b97918j2386a6435A45191j9379B4442a69208I1590a88352c5109k26926D7731
19461a37656D4702M0277c7372J13j95054B04314d30501J38872J1782h8152k00090
19450b88242C9397J69820a19596j53781j50154J52120B05431d2019A23919c1113
19439a88529B12105F2727K9211C7343L9513J1018f1359H1733J9598J4972a35728
19427a24615q3783o6866b9123H5855A2651b76570A83120m9358J40376n0041b48248
19415c03075J42740g5905j04400E5325i0499j32167B9978f7081m07302a13366
19404H5648c7473m5382B36858D3218a54955N3571c6785m57163G6511J5706b89376
19392c18918f6214k6743d5766j20487k48754E8778J33955c0262k48319a36759
$$ y = [-297918, -310304, -16435, 145191, 125812, 24442, -169208, 91590, -188352, -35109, -262035, 47731, -137656, 44702, 84979, -37372, -37259, -232313, 204314, -430501, -291629, -279847, -88152, -288242, 39397, 209217, -119596, -273377, -423531, -271411, 205431, -42019, 123919, -31113, -188529, 212105, 62727, 91938, 37343, 76856, 87874, -61359, 81733, 101331, 116303, -135728, -124615, -208398, -275264, -29123, 85855, 12651, -276570, 183120, 133762, 274138, 224097, -248248, -303075, -160335, -75905, -180305, 55325, -90499, -222666, 29978, -67081, -474383, -113366, 85648, -37473, -82855, 236858, 43218, -154955, -101384, -36785, -493948, 76511, 92217, -289376, -318918, -66214, -92957, -45766, -166253, -415007, 58778, 192733, -30262, -278581, -136759]
19381a45851p8450p8774B10253K8215j17807O301H931b70229n8412J16776b5531
19369f1318r5196A19703a77938r6018G6552K06465H6307g3315j03950I9971b88015
19357g1496B96938A11318g6347D3772a85864d8949j07244h73B72804c40574A27823
19345D1464K0780B2521L9409a44952e6930q37A56849e1291H2664K00891a54579
19333b67012R5364E5574K46679h4136q708h200m9094A62808J33277h7592k24414
19322c12006A18337J37314e7129o8744A64777C9807A4330a05692b4342j00056
19312a24398k45152A4410K7894c23882A152a61020B1626a94285j43813b8717A27434
19300i9449B11294b21779B08053c0500C9174b16177M4344E56572g3281M854m3611
$$ y = [-145851, -224301, -303075, 210253, 238468, 120661, 126962, 8931, -270229, -328641, -211865, -25531, -61318, -156514, 119703, -177938, -273956, 76552, 283017, 86307, -73315, -177265, 99971, -288015, -71496, 296938, 111318, -76347, 43772, -185864, -48949, -156193, -873, 272804, -340574, 127823, 41464, 62244, 22521, 61930, -144952, -56930, -57767, 156849, -51291, 82664, 283555, -154579, -267012, -171648, 55574, 302253, -84136, -92844, -8200, -57294, 162808, 296085, -87592, -312006, 118337, 255651, -57129, -125873, 164777, 39807, 14330, -105692, -24342, -124398, -369550, 14410, 42304, -323882, 1152, -161020, 21626, -194285, -338098, -28717, 127434, -99449, 211294, -221779, 208053, -30500, 39174, -216177, -171833, 556572, -73281, -68427, -112038]
19289a12038b445m75685i5322k6349G6632g0235r7747F9246j5861A9109b95963
19277D6386M2945a45151A42437c26925A18894j8501a86669n4848k17215B28588
19266c00967A35242b65947a16964I2792K7068n7633K6445c69229a14461A35324
19255C3829a73397A63155a24592A37673a92207b1505j04807p975A23890a27358
19244d54404D00061a04427m2765k8352A8604a6652l182E0111E825d6254B54224
19232c08096A3864h1839k0896B27149n8798m2720J33192f0033b1494j83601A00199
19220E37923c39263e5309m8513c7171D699b63279A28276J10399C1720g8778K0727
19209e8051k09695a31576d393p4880B8544d33377A6442b39746j22507R1179f714
$$ y = [-112038, -2445, -478130, -95322, -121671, 76632, -70235, -167982, 69246, 53385, 19109, -295963, 46386, 89331, -145151, 142437, -326925, 118894, 100393, -186669, -241517, -458732, 228588, -300967, 135242, -265947, -116964, 92792, 119860, 62227, 88672, -369229, -114461, 135324, 33829, -173397, 163155, -124592, 137673, -192207, -21505, -126312, -134287, 123890, -127358, -454404, 400061, -104427, -147192, -175544, 18604, -16652, -19834, 50111, 5825, -46254, 254224, -308096, 13864, -81839, -102735, 227149, 168351, 125631, 258823, -60033, -21494, -205095, 100199, 537923, -339263, -55309, -103822, -37171, 4699, -263279, 128276, 238675, 31720, -78778, -58051, -267746, -131576, -4393, -79273, 28544, -433377, 16442, -239746, -362253, -271074, -6714]
19197c84533F9697a57447e8243k71966E0831c00557E7972c58242a37058J3325
19187a23733r7118g1038i447A74735D4661c33386a29973A13968b26063A10269
19176B29984F3289f23061b32876K6196k78736A63086n0315b52783c3088B46362
19165a48035b3119j01533j74042F8097b54868P6157g9226k77145A11004D7646
19154e6857B755i5484d771B41061c460l25862A21783f9454H380d3956G6205a12741
19141c42671A91050d16291J3785G4601i7623l0036j03857B02861a53469j7828
19131a71297a8387G1770b1239j64979d1752k28111H192b72185k3097A05705a17933
19119A3457h6300j01807c5938A37321E1052a05022l0517c424k61797A3834E29
$$ y = [-384533, 69697, -157447, -58243, -330209, 50831, -300557, 57972, -358242, -137058, -123733, -220851, -71038, -9447, 174735, 44661, -333386, -129973, 113968, -226063, 110269, 229984, 63289, -623061, -232876, -206680, -485416, 163086, 112771, -252783, -33088, 246362, -148035, -23119, -124652, -298694, 68097, -254868, -178711, -79226, -356371, 111004, 47646, -56857, 2755, -95484, -4771, 241061, -3460, -329322, 121783, -69454, 8380, -43956, 76205, -112741, -342671, 191050, -416291, -402506, 74601, -97623, -127659, -231516, 202861, -153469, -171297, -18387, 71770, -21239, -186218, -41752, -269863, 8192, -272185, -295282, 105705, -117933, 13457, -86300, -188107, -35938, 137321, 51052, -105022, -135539, -3424, -265221, 13834, 529]
19107a88262k77733b21108I2625c4552F3970c99575c9354A47095c22493A33687
19096a23836C58697a67520A28325I810a44849A35210B6206K81287b922j73549
19086a76471n08n575h6338E7430b28450E2785a32088M5291C27034A9849a20889
19074C24006b10024j65136G3307a22979C00747c66373A48056c8342A4929a95265
19063b61869a26485b4146j30734m8011e5855A12561b1902j5305A42440d2751p8094
19052a20845B03953G9804i0005m2903k8003B4760J58615a60247B04007k8711G5026
19040B36043b7145j55968B8652b46656B26834h6412J5150k61428f3345M511B54001
19028b73201A68758H2194q180K2442J66618a85173m9996p0165A25890F2429d6504
$$ y = [-188262, -465995, -221108, 92625, -34552, 63970, -399575, -39354, 147095, -322493, 133687, -123836, 358697, -167520, 128325, 9810, -144849, 135210, 26206, 307493, -2922, -176471, -176979, -182554, -86338, 57430, -228450, 52785, -132088, -86797, 327034, 19849, -120889, 324006, -210024, -375160, 73307, -122979, 300747, -366373, 148056, -38342, 14929, -195265, -261869, -126485, -24146, -154880, -202891, -55855, 112561, -21902, -37207, 142440, -42751, -120845, 203953, 79804, -90005, -132908, -160911, 24760, 183375, -160247, 204007, 175296, 75026, 236043, -27145, -183113, 28652, -246656, 226834, -86412, -71262, -332690, -63345, -58834, 254001, -273201, 168758, 82194, 74014, 96456, 263074, -185173, -235169, -305334, 125890, 62429, -46504]
19016e0334C8509a23852A60302K49769b20836A67021E5226a60844C18761d2845
19005g9582j2027E9099a89189A12087b31495I3514h7240A12591c81699g9091O374
18994g2717b2627j26510J6017k20737A70097c81476D3298O6445c8412m3932G4360
18982A68099d6024q6632f1724j27775f1715b1538m39679B8738J05056D9458Q1578
18971A31036b7110j91368f0578A35912h5087N871A22070b91900a42467A26753
18960c23379C1940J1831N7126C5442Q6710J478C8075a27061N9627A62557m5032
18949A17525m7600J07720a65863j4073A63267b4025E3000J20385b32427A6577
18938a50003J1472E6886b93898h1570k99906O7609a39813o5090o6458B51110H0909
$$ y = [-50334, 38509, -123852, 160302, 410071, -220836, 167021, 55226, -160844, 318761, -42845, -79582, -91609, 59099, -189189, 112087, -231495, 93514, -87240, 112591, -381699, -79091, -72717, -22627, -149137, -133120, -353857, 170097, -381476, 43298, 109743, -38412, -82344, 74360, 168099, -46024, -132656, -61724, -189499, -61715, -21538, -461217, 28738, 133794, 49458, 131036, -27110, -218478, -60578, 135912, -85087, -79216, 122070, -291900, -142467, 126753, -323379, 31940, 43771, 100897, 35442, 122152, 123630, 38075, -127061, -67434, 162557, 117525, 69925, 177645, -165863, -179936, 163267, -24025, 53000, 173385, -232427, 16577, -150003, -138531, 56886, -293898, -81570, -381476, -313867, -139813, -204903, -271361, 251110, 80909]
18926a30465B9896b61450j34726J06140d6189A20409a0457D61454I3729a80509
18915c44023C5412a17923E9782a22838k05386J45127d3624B18645a16918j96639
18905c13557I5496C0985i6690E5438b45049e8128l12533J53930c4285E61406a07149
18893B1082i2093q7021g8194K8340A31211E2084K2094b18663a0938k30815d4749
18881a91177q8759B2774a55670A06702c66411a371o7764l1565j41158d5242j38921
18870a84163A80374h348A99280a23725r4416M4429L1673B9399a38154M4602B0729
18858a05701k39362j6821J03746B00299a62453N6997F5737d50932D86100b16879
18847A18848B6911a75862n1331A92882c7797J1938B3759M4017b5378k40286I9473
$$ y = [-130465, 29896, -261450, -396176, -290036, -46189, 120409, -10457, 461454, 93729, -180509, -344023, 35412, -117923, 59782, -122838, -328224, -183097, -43624, 218645, -116918, -313557, 95496, 30985, -96690, 55438, -245049, -58128, -370661, -216731, -34285, 561406, -107149, 21082, -92093, -179114, -78194, -49854, 131211, 52084, 74178, -218663, -10938, -241753, -44749, -191177, -279936, 22774, -155670, 106702, -366411, -1371, -69135, -100700, -241858, -45242, -184163, 180374, -8348, 199280, -123725, -218141, -173712, -142039, 29399, -138154, -93552, 20729, -105701, -345063, -361884, -258138, 200299, -162453, -105456, 65737, -450932, 486100, -216879, 118848, 26911, -175862, -227193, 192882, -37797, -25859, 23759, 67776, -25378, -265664, 99473]
18835E70J59268R3530a36869n9248B04952E6385b59328K4681A05914b28143G9731
18823E8063O8392N9825J33157j33901P8817c32122G5302c06651l75A43523E6496
18811F16345k80192j21505B6012F518c17313a40147c9708l21163a12383d9233
18800b13286j66849A38515D4746e4546F1596a66223C23505b6143k35560I3830
18789A48814a16135A13908J15867A787f53803A50783e59709A62347a19744A26191
18778f443D6603H269L6128c3537k04431H1952k340E42e6876j12547D30402a76028
18765b58086o0646j5094c386C8163J7124d02133A19420b14631l2689l55261a94199
18753b11902F1681B6943M7702a33215d7839A2786J23373G39L7779a98623e2418
$$ y = [570, 159838, 253368, -136869, -196117, 204952, 56385, -259328, -234647, 105914, -228143, 79731, 58063, 126455, 186280, 319437, 185536, 264353, -332122, 75302, -306651, -307026, 143523, 56496, 616345, 336153, 214648, 26012, 6518, -317313, -140147, -39708, -360871, -112383, -49233, -213286, -380135, 138515, 44746, -54546, 61596, -166223, 323505, -26143, -261703, 93830, 148814, -116135, 113908, 229775, 1787, -653803, 150783, -559709, 162347, -119744, 126191, -6443, 46603, 8269, 44397, -33537, -237968, 81952, 79612, 542, -56876, -169423, 430402, -176028, -258086, -318732, -333826, -3386, 38163, 55287, -402133, 119420, -214631, -247320, -602581, -194199, -211902, 61681, 26943, 74645, -133215, -47839, 12786, 136159, 739, 38518, -198623, -52418]
18741A19763o122b7398A98833i4378R076k85203Q1448d5694j48923A439J33724
18730A35163c99760i0302d032I674e827A94514b54077B1740a64916N6120a1273
18718b09313B01439C1491E124g6p8129k44200a56085A26425a568j42014B7570
18706B28987A5144h4218j6170c0120F5620a62819B73851a24310j28717A14240
18695g2860B2647L3526a46509J3414M1738j08896D8373b19628A9108R1305C726
18683a42660n6398L3259m1258k31492I9602a09763A42220m3410e7756n763D7935
18671A70091a15212p4661B18183k8649e0528A45540a04857k077q5052L5271p3308
18660b30023d9119j76344M7497A12900a25073d1314k96658H280a01639B58184
$$ y = [119763, 113641, -27398, 198833, -94378, -85302, -370505, -289057, -45694, -194617, 1439, 135163, -399760, -90302, -4032, 9674, -5827, 194514, -254077, 21740, -164916, -108796, -11273, -209313, 201439, 31491, 5124, -76, -78205, -322405, -156085, 126425, -1568, -143582, 27570, 228987, 15144, -84218, -100388, -30120, 65620, -162819, 273851, -124310, -253027, 114240, -72860, 22647, 56173, -146509, -133095, -91357, -200253, 48373, -219628, 19108, 110413, 3726, -142660, -199058, -165799, -207057, -438549, 99602, -109763, 142220, 98810, -57756, -63519, 47935, 170091, -115212, -189873, 218183, 189534, -50528, 145540, -104857, -106934, -191986, -156715, -230023, -49119, -225463, -177966, 112900, -125073, -41314, -337972, 8280, -101639, 258184]
18649i660B71970a15038F2361a93062B40751F8170a59042k0255J1656g9920A64697
18637A03253a40466B8779Q7758a22066N9417B8182K0362b19233B02025e31694
18626A9879c36060a04974K4576c1279C0414a62432A40054c91324A01027a53021
18615I4442f3072m27102A18900c9917a9781l2122j3170B1851a42287k7745j80769
18604c50801J66214g8116b9651j17272M6477k51910B14203F443P2222h6294B01399
18592a22270G3324i645A4606c7684r9107L2066H9524d23062a34063f4492B78489
18580B1906J36561a212A23728K03633a34596A60310C7771j0190K4409b00540l3225
18569b33765J6272d6842B40784b02504L9150D6030Q8213a42989j8161f7689j50361
$$ y = [-9660, 271970, -115038, 62361, -193062, 240751, 68170, -159042, -179297, -167641, -79920, 164697, 103253, -140466, 28779, 116537, -122066, -62649, 28182, 48544, -219233, 202025, -531694, 19879, -336060, -104974, -80398, -31279, 30414, -162432, 140054, -391324, 101027, -153021, 94442, -63072, -490174, 118900, -39917, -19781, -51903, -65073, 21851, -142287, -170032, -350801, -184587, -78116, -29651, -146923, -100446, -352356, 214203, 6443, 78665, -86294, 201399, -122270, 73324, -9645, 14606, -37684, -136791, -104725, 89524, -423062, -134063, -64492, 278489, 21906, 158467, -1212, 123728, 327361, -134596, 160310, 37771, 27581, 51990, -200540, -233765, -217493, -46842, 240784, -202504, -163354, 46030, 134243, -142989, -161150, -67689, -218050]
18558b18050L7669L1734O0065L5680j78672h0205K070A05116a31019C1114b69192
18546E7965b14971D5719e5403B6912a30412B15996A2781M8586K26721a71165n0826
18535b21991i9742M8412G5258J41533B6835f4129k00687B07948D3742j2885i3534
18523b15637F2104K61958a80202h0026A73751b16734C35244b96066B3791a53974
18512b18190h6095j03217A4251K44769A20760K71819a3222l94952a66886g5910
18501b19476A14486c39479L1972A34747b5530B68953c80965A64932r641b00214
18490D14169d9796j2884r5458N3932B6253a29606d1721A64198a94656P6525j81884
18479c00015i5584O16o0588B9680j72b16263Q9726A69328a57220r0967B70502
$$ y = [-218050, -180381, -148647, -88582, -52902, -231574, -80205, -78135, 105116, -131019, 31114, -269192, 57965, -214971, 45719, -55403, 26912, -130412, 215996, 12781, 61367, 288088, -171165, -221991, -99742, -51330, 75258, 216791, 26835, -64129, -264816, 207948, 43742, 30857, -93534, -215637, 62104, 324062, -180202, -80026, 173751, -216734, 335244, -296066, 23791, -153974, -218190, -86095, -189312, 14251, 259020, 120760, 392579, -13222, -408174, -166886, -75910, -219476, 114486, -339479, -307507, 134747, -25530, 268953, -380965, 164932, 155291, -200214, 414169, -49796, -62680, -158138, -104206, 26253, -129606, -41721, 164198, -194656, -118131, -300015, -95584, -94968, -155556, 29680, 29508, -216263, -126537, 169328, -157220, -248187, 270502]
18467G2179a49747G7834f5903m81343A07748a17354M769C3678J50020j9116d7986
18455D2261a51025J4549B52832A07349a40938H4258A7396K7853a64755g8747k51579
18444c30326A87906E4883a20214m5441j5164f3197K2156r5043G2008K3548a80966
18432a92699A01379c20224F627i5085p9552a7273j94771M5374Q1914A52906E7289
18420G9881b0922j12767A62956C0047J05187O2904a47271j51696a150H3029h9336
18408C0707g2817k12860G8354N8155d04916F6235J29828Q3162j14474P1908b02658
18396a21145A37486e7891A25694d8327j39997j3528M9424B45974j16905c42495
18385F3305d6692p1017j26982g7816A53120a63148a771B5611K89765A5053b29128
$$ y = [72179, -149747, 77834, -65903, -547246, 107748, -117354, -112585, 33678, 183698, 164582, -47986, 42261, -151025, -136476, 252832, 107349, -140938, 84258, 17396, 45249, -164755, -78747, -330326, 187906, 54883, -120214, -165655, -180819, -63197, -41041, -136084, 72008, 95556, -180966, -192699, 101379, -320224, 6627, -95085, -174637, -17273, -212044, -166670, -84756, 152906, 57289, 79881, -20922, -133689, 162956, 30047, 135234, 198138, -147271, -298967, -1150, 83029, -89336, 30707, -72817, -285677, 78354, 136509, -404916, 66235, 196063, 279225, 164751, 236659, -202658, -121145, 137486, -57891, 125694, -48327, -188324, -201852, -152428, 245974, 129069, -342495, 63305, -46692, -117709, -244691, -77816, 153120, -163148, -1771, 25611, 315376, 15053, -229128]
18373a07033H6787b9449C8502q739J10712b06346G935a72199D7140j1866J403
18362C6677a20772B03826L4972a35381D7386N472K0927O7890F0735j0589B0896
18350a07694n7063O4441C2166b68281A01542Q7768a44672I4003b03159k0426J09423
18339a14162j17442a1176m8066E9343B3445a21934j4109j39442A1690b1925P053
18328a4872A4267h068A28882o0159a43865e8808k3472j2407j6084j95240h541
18316A51964F8326b6407A81121b80110A12072a24258I0907a26748k15827B03080
18305B01436D003c56473R8811M6216K9624k65541e3846k19425J03083d9179B90548
18293e5823k37235j07725d6657r0835A03375A5511c62646i3274B5445a20819A1261
$$ y = [-107033, 86787, -29449, 38502, 29763, 140475, -206346, 7935, -172199, 47140, 35274, 36677, -120772, 203826, 238798, -135381, 47386, 52858, 73785, 141675, 60735, 50146, 20896, -107694, -164757, -100316, 32166, -268281, 101542, 189310, -144672, 94003, -203159, -223585, -114162, -231604, -11176, -59242, 59343, 23445, -121934, -136043, -275485, 11690, -21925, -14872, 14267, -8068, 128882, 68723, -143865, -58808, -82280, -94687, -110771, -306011, -8541, 151964, 68326, -26407, 181121, -280110, 112072, -124258, 90907, -126748, -342575, 203080, 201436, 4003, -356473, -257662, -211446, -181822, -447363, -53846, -273271, -170188, -49179, 290548, -55823, -293058, -400783, -46657, -137492, 103375, 15511, -362646, -93274, 25445, -120819, 11261]
18281a87015A9106e7276A45794h115E10093a25051I3880d82892c5344B15312K6489
18270B41801a39497B09220c3452B90314b58741D2119c8500q5227e1882p5221B6172
18258i096k25961Q6056D2586R0749b27481f8185B05805a80721Q2959B5924N7040
18247H2964K77302f898o8713l0115j65070e3800a1751m5206A05253b94433f7783
18235E133a65202j26349d7186a7486C7406M6849O65K24256a2305m39262J40358
18224c11209j78675J03556A4376a68722f5577L0226A83944a76263P5711j73300
18214b73852O6249K5797f8226k33980a12704A49765f7716l07031g8044j75812
18204b53856d706A79207f4455C1224A2192P9994b89945A88398p4232n1596a23126
$$ y = [-187015, 19106, -57276, 145794, -8115, 510093, -125051, 93880, -482892, -35344, 215312, 241801, -139497, 209220, -33452, 290314, -258741, 42119, -38500, -123727, -51882, -127103, 26172, -9096, -235057, -149001, 42586, 133335, -227481, -68185, 205805, -180721, -97762, 25924, 82964, 360266, -6898, -75611, -105726, -270796, -53800, -11751, -56957, 105253, -294433, -67783, 5133, -165202, -291551, -47186, -17486, 37406, 84255, 84920, 309176, -12305, -451567, -311209, -489884, -386328, 14376, -168722, -65577, -35351, 183944, -176263, -100552, -273852, -207603, -181806, -68226, -302206, -112704, 149765, -67716, -374747, -78044, -253856, -4706, 179207, -64455, 31224, 12192, 92186, -289945, 188398, 114166, 62570, -123126]
18192A3661J68944i3754J5704A08904d4216E5313L8610L48579k05403h7303i082
18180b34519B02489D7596d8849k32824j03151A19323a93828a190B8199e7252D7845
18168b27426a3709r2387H6734h4175L7997m7865c977j52136j7409j39859R1558
18157b21823A23274b0586k41308b0960G9821a10736C83907p0390g892C777a29377
18145b8845k31767A02057c04139A72140R5484a3150p7337N155j94018O6988H147
18133c44775B46786a78284B02191a70609C27875A20638j499l5037g2426C5183
18122A11993D7022O7619d9532b0531D4547L12426a00499J1850B1135a56983a5245
18110A82831e7323A34841h9961l7517k34257A61655n3988K29985a23963O0070
$$ y = [13661, 182605, -93754, -78050, 108904, -44216, 55313, 93923, 442502, 237099, -87303, -9082, -234519, 202489, 47596, -48849, -281673, -384824, 119323, -193828, -1190, 28199, -57252, 47845, -227426, -13709, -106096, 86734, -84175, -46178, -94043, -3977, -156113, -173522, -313381, -221823, 123274, -20586, -261894, -20960, 79821, -110736, 383907, 313517, -7892, 3777, -129377, -28845, -260612, 102057, -304139, 172140, 267624, -13150, -90487, -85332, -279350, -212362, 8147, -344775, 246786, -178284, 202191, -170609, 327875, 120638, 119139, 84102, -72426, 35183, 111993, 47022, 114641, -49532, -20531, 44547, 356973, -100499, -88649, 21135, -156983, -15245, 182831, -57323, 134841, -89961, -127478, -361735, 161655, 107667, 337652, -123963, -63893]
18100f3893J7475n4222m5351J5576A40374d6216A39513h3408F0724K68919i4567
18088I9840a59212J8911M1977K5295H2208d03826H8434B036d1284B879a47108
18076b31145O5665k43462A7080i9907c7391k28859D0412h9769d2194E1163K38694
18065B89857b47366P2904B9792a42001B3193a01879B47648Q7670a00793L6486
18055f4307B27540o2778E9019B6987b7124B28208q029f505p5883J6265A72504
18043b6187G2883L5035m6259g4344L1817j29160d9895j74289K7607F2974a39284
18031h9926A16574g4788m8385A49228e2727C47146b56630P431H6675g8311p1070
18020a49381j72577B96562b89396G9640b82159J19267H4740b17641A4967c77934
$$ y = [-63893, -46418, -100640, -145991, -130415, 140374, -46216, 139513, -83408, 60724, 329643, -94567, 99840, -159212, -140301, -98324, -73029, 82208, -403826, 88434, 2036, -41284, 2879, -147108, -231145, -165480, -408942, 17080, -99907, -37391, -266250, 40412, -89769, -42194, 51163, 289857, -247366, -174462, 29792, -142001, 23193, -101879, 247648, 335318, -100793, -64307, 227540, 164762, 59019, 26987, -27124, 228208, 220179, -6505, -82388, -66123, 172504, -26187, 72883, 107918, 61659, -74344, -42527, -171687, -49895, -224184, -196577, 62974, -139284, -89926, 116574, -74788, -123173, 149228, -52727, 347146, -256630, -249199, 86675, -78311, -149381, -321958, 296562, -289396, 79640, -282159, -162892, 84740, -217641, 14967, -377934]
18009a46164B81153b91419H366i796B17244i9547A69791B3041b0911m02379D2060
17997a69907d8255B64487A4840N1132h3987e607m34497A3882b20683B67181b24060
17985c55496A11657b81204R6722A42641k9013l913b9005k04457C4082J2153I085
17973a34199A50834J064J772d09873a44623k82079J70637C5765J8768c4696C64505
17961a00322L7936a6304j41674N6051B82072e3854A94820C5974Q9874a26505J7760
17950a08745B5134K15168G8432a32618o4678e7945A64318R4096f641j89866D3410
17938b49059G0958d5074a6135D4457N5536a18683B26234G6292a51919N3823j5160
17927a13256G4078A9170b54148g8876j96149h4302L4983A45149c3192j2783B08450
$$ y = [-146164, 281153, -291419, 8366, -9796, 217244, -99547, 169791, 23041, -20911, -423290, 42060, -169907, -48255, 264487, 14840, 65972, -83987, -5607, -440104, 13882, -220683, 267181, -224060, -355496, 111657, -281204, -184482, 142641, 113628, 109715, -29005, -233462, 34082, 46235, 9085, -134199, 150834, 151898, 153670, -409873, -144623, -426702, -256065, 35765, 54533, -34696, 364505, -100322, -62386, -16304, -157978, -101927, 282072, -53854, 194820, 35974, 125848, -126505, -108745, 25134, 240302, 78432, -132618, -197296, -57945, 164318, 258414, -6641, -196507, 43410, -249059, 70958, -45074, -16135, 44457, 99993, -118683, 226234, 76292, -151919, -98096, -113256, 74078, 19170, -254148, -78876, -275025, -84302, -49319, 145149, -33192, -45975, 208450]
17915A12468h9518h920J758A23358L61917a7695m2255j84900D2398R3244c16056
17903B6486b13671B12370D3569a79557g8748I6629f9962p427A70344P9537a62034
17891h0872O579k99994a25285A11026l5379a48927L187i688A82013D1382a05320
17879a28811e2095F9478d27824D258R3107b0285c303q0002n0724A07332b25741
17867f3045E4946c5544B20726a58204G3095a64231I8440M1447f1085A62504G552
17855b21596B11955c2107A77706c2131p2499B32797p0828l3564a63285A41163
17844I7691a24520j89983A43787J58159m8953c1652j94145b7137A68024G2346
17833b3404n2747A04192a92565A23920i3533d4516n0394J7078j33416b0023H2944
$$ y = [112468, -89518, -8920, -7162, 123358, 485275, -17695, -59950, -244850, 42398, 135642, -316056, 26486, -213671, 212370, 43569, -179557, -78748, 96629, -69962, -77389, 170344, 249881, -162034, -80872, -74293, -374287, -125285, 111026, 75647, -148927, -145740, -9688, 182013, 41382, -105320, -128811, -52095, 69478, -427824, 4258, 97365, -20285, -3303, -83305, -134029, 107332, -225741, -63045, 54946, -35544, 220726, -158204, 73095, -164231, 98440, 139887, -61085, 162504, 7552, -221596, 211955, -32107, 177706, -32131, -104630, 232797, 161969, 128405, -163285, 141163, 97691, -124520, -314503, 143787, 301946, 252993, -31652, -225797, -27137, 168024, 72346, -23404, -76151, 104192, -192565, 123920, -93533, -44516, -94910, -77832, -211248, -20023, 82944]
17821F9684j0735i0233b115C08337c42738g8291L8728k59704f9956B38026c7141
17809A34406a19995L8606m282C39074A58963l9155f8627m7584m7967j41802k5805
17798c31785A89513a07184A98505b79894A17855c625k37473B51664r0475B3436
17787h5271A25421n3385C2185a76838B22001a49531k8333D48115A3459L8071a37201
17775b49786A93724J30178a57728d2228n6555A71520M1300F850K31215Q5787a12060
17763B101a47129G2693c13042A53454e4036b903C6898A6571N818c8405D9613B914
17750A07861J29599A15590O4761b16058A4342J27389a27036j56543O2897f6411
17739d3347p6436L0147b9973j75803A65949J42515c675k99134J04478R5956A25425
$$ y = [69684, 58949, -90233, -2115, 308337, -342738, -78291, -39563, -299267, -69956, 238026, -37141, 134406, -119995, -81389, -85671, 339074, 158963, 119808, -68627, -116211, -164178, -305980, -331785, 189513, -107184, 198505, -279894, 117855, -3625, -241098, 251664, 161189, 23436, -85271, 125421, 72036, 32185, -176838, 222001, -149531, -177864, 448115, 13459, 51530, -137201, -249786, 193724, 323902, -157728, -42228, -98783, 171520, 212820, 6850, 238065, 323852, -112060, 2101, -147129, 72693, -313042, 153454, -54036, -2903, 36898, 16571, 22389, -38405, 49613, 2914, 107861, 237460, 115590, 180351, -216058, 14342, 141731, -127036, -283579, -220682, -66411, -43347, -119783, -89636, -29973, -205776, 165949, 308464, -3675, -302809, -198331, -102375, 125425]
17727E4215k351G100a77376C07915d93057e8555B80697b90299B81823N7095a32955
17715H643a36660B12049h0302m4641j4023j53174J5624o8525E27199B46814i1474
17703I1868J79894a11426k69455A51122h7462l3720H3836H873K56349a12019j9982
17692a32001j50285a30166F3951b2749k10866F3364K32390F9427A077J12629a64484
17680a42123M1676a1979p515l18314B96035a94643a4482C47059E0076O4005a53792
17668a36359a8402F8934O3633a05732A63432o2614J22875A01412M6164a13366
17657F3510c0006C53954c59640G3637J00888f069k81448D8249J45993b09980A8139
17645b6949A43118f7759I856K86382b70790H9706C9243K5710j8194e2191J8564
$$ y = [54215, 51864, 7100, -177376, 307915, -493057, -58555, 280697, -290299, 281823, 338918, -132955, 8643, -136660, 212049, -80302, -124943, -138966, -292140, -276516, -345041, 527199, 246814, -91474, 91868, 271762, -111426, -380881, 151122, -87462, -121182, 83836, 8873, 265222, -112019, -132001, -282286, -130166, 63951, -22749, -233615, 63364, 295754, 69427, 1077, 113706, -164484, -142123, -100447, -11979, -19494, -337808, 296035, -194643, -14482, 347059, 50076, 114081, -153792, -136359, -18402, 68934, 132567, -105732, 163432, 100818, 223693, 101412, 147576, -113366, 63510, -30006, 353954, -359640, 73637, 174525, -6069, -287517, 48249, 194242, -209980, 18139, -26949, 143118, -67759, 9856, 296238, -270790, 89706, 39243, 64953, 46759, -52191, -33627]
17634c3627r8681G0484b66501g9749a4667A11456m8196J96488b40625M827O6658
17623a69140I5360c82857f6848o3083q7251A16651J00098C318K42292a7136A94899
17611A03284b76986a2002r6209F8864C4292L82466d7595m25127a17945K6701C27646
17599a4823C18440A19633C7347J68738m7036g7665A4767g628C622a70114I2037
17587A20528G319b0212A72628b8781C73524A65724h380D5595L24830F0669f2658
17575A33378M09787I3746a68095e5650l14589J63094B7651c01622e7178A58740
17564C33901L2655A50858j341K4633a32314d2545E7287J15052j1774K6347h9842
17552D4087K27884j22118a72144D2731A1580K6944J44600E5574K5844Q603f1372
$$ y = [-33627, -132308, 70484, -266501, -79749, -14667, 111456, 63260, 259748, -240625, -235798, -169140, 95360, -382857, -66848, -129931, -217182, 116651, 216749, 3318, 245610, -17136, 194899, 103284, -276986, -12002, -108211, 68864, 34292, 416758, -47595, -472722, -117945, -91244, 327646, -14823, 318440, 119633, 37347, 206085, 159049, -77665, 14767, -7628, 3622, -170114, 92037, 120528, 7319, -20212, 172628, -28781, 373524, 165724, -8380, 45595, 370425, 60669, -62658, 133378, 543165, 93746, -168095, -55650, -370239, -207145, 27651, -301622, -57178, 158740, 333901, 366556, 150858, 149517, 174150, -132314, -42545, 57287, 172339, 160565, 186912, -89842, 44087, 271971, 149853, -172144, 42731, 11580, 38524, 183124, 55574, 81418, 90021, -61372]
17540a70419A12903L56388B12458B9589f9517B23626a8213k0289B8114O6124a16564
17528A53863a91607i2891A18306n1520L5646k6556K00093a40010B09902C7230
17517c0342k6846D08524A88208a57498g8325j53740A17725B3661M2656a86253
17506C9302K21617J27177E8265P5059K6665a29883n6696A73029a833B41116j19454
17495A21662m4591N2639K26835a89709A09351K0856d3385C76109f0168D17717
17484C60102A18610a02314I3052f5444k6513I35J71803o4571N5347m1453J09629
17473B31690q2772O6744J86534K8052j05317M3266a29843A7634O109R3774k5089
17462I2428b5391A48953P4237G769J11792l0120a23127A80663G2262J73661A09329
$$ y = [-170419, 112903, 469291, 212458, 29589, -69517, 223626, -18213, -38502, 28114, 94238, -116564, 153863, -191607, -92891, 118306, 66786, 102432, 75876, 275969, -140010, 209902, 37230, -30342, -57188, 408524, 188208, -157498, -78325, -232065, 117725, 23661, 66317, -186253, 39302, 260919, 388096, 58265, 133324, 159989, -129883, -186579, 173029, -1833, 241116, 121662, 77071, 129710, 356545, -189709, 109351, 130207, -43385, 376109, -60168, 417717, 360102, 118610, -102314, 93052, -65444, -91957, 935, 172738, 108167, 163514, 122061, 231690, 148918, 215662, 402196, 430248, 324931, 368197, -129843, 17634, 23743, 117517, 92428, -25391, 148953, 223190, 7769, 119561, 89441, -123127, 180663, 72262, 245923, 109329]
17450A0786k520K39478K61086k15834I9957L16377b46751F1338J3252K17308M2821
17439C34719a4375j42635C65191j62468l655G9782J98744F1631J36415K94134
17429D92180j71608j37359m9419M67454I3002g4665B73883K4895K34114k30846
17419C02046j20400J69855P5298B12488P8516K00792D0690L76161I6221a3396
17408A0882M16228p3618G2439J6069b38778a0124B00756L5798J2257L6529b2010
17396A16397K36837A10638P6124K0685L55459B11092R4767H4354L1008K7244f5966
17384C98355C0738e1980B04307R8012A44611e3582A36177Q790k3857c70935C48491
17372a92516A74939J15919I1463L12644r6116H4597K46397A42408a95438B36306
$$ y = [10786, 8266, 247744, 508830, 292996, 99957, 416334, -246751, 61338, 74590, 291898, 334719, -14375, -157010, 365191, 202723, 199068, 79782, 278526, 61631, 198046, 492180, 320572, 183213, 133794, 601248, 93002, -74665, 273883, 298778, 532892, 302046, 181646, 351501, 426799, 212488, 291004, 491796, 40690, 416851, 96221, -13396, 10882, 427110, 353492, 72439, 88508, -238778, -10124, 200756, 236554, 248811, 285340, -22010, 116397, 353234, 110638, 186762, 207447, 562906, 211092, 305859, 84354, 115362, 142606, -65966, 398355, 30738, -51980, 204307, 302319, 144611, -53582, 136177, 144967, 121110, -370935, 348491, -192516, 174939, 290858, 91463, 404107, 307991, 84597, 330994, 142408, -195438, 236306]
17361B56098A21017C4282O7617b5445B06115I0608j6872N0316c07304A88946A6860
17349a83781B97963j8549I4125J20150m9494p2240g7552B24809b8701A54534j2507
17338A42027N1448K06813j88287B7237i79j36656B95975M2710J9134r7415H0517
17326a9675j2755A36792f0248B73950e0869k7055E3288d2000A86480p6330k7041
17315H3109P368M16515A70072l6861J98356j20321H5131k7924J1894J57411e0132
17303B07062J00507d18A79270n0307J57270K59309B10185e758I5287J84921C0760
17291C14311G1154J64619p521B2646J10546f9095B87906N2852j54166J0639N62006
17280G59237A93246J70524h5045j18067A44290n9720J63086B1020N5838h645B31325
$$ y = [256098, 121017, 34282, 101899, -25445, 206115, 90608, 73736, 124052, -307304, 188946, 16860, -183781, 297963, 279414, 94125, 214275, 164781, 92541, -77552, 224809, -28701, 154534, 142027, 193475, 400288, 212001, 27237, -979, -137635, 295975, 338685, 357819, 260404, 80517, -19675, -32430, 136792, -60248, 273950, -50869, -77924, 53288, -42000, 186480, 110150, 83109, 90477, 506992, 170072, 133211, 331567, 211246, 85131, 57207, 69101, 226512, -50132, 207062, 307569, -418, 179270, 128963, 286233, 545542, 210185, -5758, 95287, 280208, 30760, 314311, 71154, 235773, 228252, 22646, 133192, -69095, 287906, 340758, 186592, 197231, 759237, 193246, 363770, -85045, -203112, 144290, 84570, 247656, 21020, 76858, -8645, 231325]
17268C74468j23728O2569l4926j08298d4736B29781B2919K20498J48760G2581
17257I0814c6271C4039K71592A02831J81747k2951J67354A96314O2415A217a21895
17245E688J55553K105J32408M3217J6474k3018b6244A56033L3812M6590j12077
17234A24358K44507M5011j76702J0602k9444O0293B8606M99169e2685B09364I8342
17222C53606j66678J17801I3190A7882K63016J24645j24084F1294K63948a06550
17211a33522C57910A23124K72438n5594A69257A2596J34138O689k2410J00301
17201B31314J68135J04863j20405q2309j07053q6269d6018B66905m0404K97021
17191E23522n3894A41810n7304L18176A96848n6181K60152L6247J99429C03999
$$ y = [374468, 250740, 313309, 278383, 170085, -44736, 229781, 22919, 243417, 392177, 72581, 90814, -36271, 34039, 305631, 102831, 284578, 261627, 428981, 196314, 258729, 1217, -121895, 5688, 161241, 163346, 295754, 338971, 355445, 332427, -26244, 156033, 189845, 236435, 124358, 368865, 413876, 237174, 247776, 218332, 278625, 28606, 527775, -52685, 209364, 98342, 353606, 186928, 304729, 93190, 17882, 280898, 405543, 281459, 61294, 325242, -106550, -133522, 357910, 123124, 395562, 339968, 169257, 12596, 146734, 153423, 131013, 231314, 399449, 504312, 383907, 301598, 194545, 108276, -46018, 266905, 226501, 523522, 469628, 141810, 84506, 402682, 196848, 140667, 400819, 437066, 636495, 303999]
17180B89503j01909L11495j63532j37386q6332J60352J23610j36436O252K31078
17170D96695F2436J67801p9240r14L86153A71703a13300B49097E6939L89732j25565
17159C21106J48254A75972P0160K09669K04451k55671L03783A65482P571L93870
17149E66923F1494M30015j79571c0751A00201L82101J44934k73315n9355I7566
17138C57852k2880K77510B81065r3526L2770K43687q7640M7074m5148l8692J16283
17127D55873q6858J01845J37469Q7000k24673J74084j65851A41492J92971E8304
17116D62377n942j03070Q4346A18854K10820L25957A03075L12690K30988j68601
17106D78152A79927M38703B17230o6125K17123P8240J89845N4563k48740l6023
$$ y = [289503, 187594, 499089, 335557, 198171, 111839, 272191, 395801, 259365, 265617, 496695, 62436, 230237, 150997, 150083, 536236, 171703, -113300, 249097, 56939, 446671, 321106, 469360, 175972, 246132, 455801, 660252, 404581, 708364, 165482, 173053, 566923, 61494, 491509, 311938, -30751, 100201, 482302, 627236, 353921, 294566, 97566, 357852, 334972, 612482, 281065, 187539, 220309, 463996, 376356, 423430, 378282, 339590, 455873, 369015, 470860, 608329, 695329, 470656, 644740, 478889, 141492, 334463, 58304, 462377, 456435, 353365, 437711, 118854, 329674, 655631, 103075, 415765, 646753, 478152, 179927, 618630, 217230, 151105, 368228, 446468, 636313, 690876, 442136, 406113]
17096D06113A07676K82682K41500k63632A39551A8011O83112C50457p8632L09832
17086E81657O2403r6088J8194M4254r6192R3480o1013l4749A94012J27804L80011
17075G01827r3306l03054q0090M81371B45312L5579N24038L2245q5372k24422
17065E27380j92188K46036k5425k22467J93087q0551I4228M40028k1277K23859
17055G36838j68632N5876J11237j20725r6566j43837L34550k89330L21603J70662
17045I11676D32553J68285R6278J77196k48274K66561k52186J18793l62951K84865
17035F81120r0966j01001K9918L27605j21645m5716j8922M1066j89603J72490
17025F84346K28153j92207k54760P2540J60512k29405M45793l2342D12242M62792
$$ y = [406113, 107676, 390358, 631858, 368226, 139551, 18011, 701123, 350457, 271825, 581657, 644060, 547972, 566166, 610420, 514228, 607708, 546695, 511946, 194012, 321816, 701827, 608521, 305467, 225377, 706748, 245312, 280891, 804929, 837174, 751802, 527380, 335192, 581228, 555803, 333336, 526423, 445872, 94228, 534256, 512979, 736838, 568206, 624082, 735319, 614594, 518028, 374191, 708741, 419411, 741014, 911676, 432553, 600838, 697116, 874312, 626038, 892599, 640413, 759206, 396255, 681120, 590154, 489153, 519071, 846676, 725031, 679315, 660393, 701459, 511856, 684346, 912499, 720292, 465532, 538072, 698584, 469179, 914972, 882630, 412242, 875034]
17015H75034j00451j77658J4821K13669O608M85j82467M50704j39098l73922J88694
17004G76419J26665p5624j35444L17465k66470J50710P2697k60104J36392J3466
16994H56172J00055l63084K10214K35816K6049J20774l07207j45871k4794L07721
16984A015845o8028j57125r8671k588j40519J45825Q8444K90496l23960R9789
16974H49508L12001l72617J53465K88j99237M70764n15245R62853m16772k44725
16964A000283k57335j5772J90243K54851J86204m4191k54621j07090L92244k93141
16954A051675K44426J1388j016l75136K45738J87969p8495J59435j54324j5069
16944A276591J7792k1982J26262Q7034k3436l79562n4668M57002K767J40899k37191
$$ y = [875034, 774583, 596925, 611746, 825415, 832023, 832508, 650041, 1100745, 961647, 587725, 776419, 903084, 827460, 692016, 1009481, 743011, 893721, 966418, 706314, 842706, 856172, 956227, 593143, 803357, 1039173, 1065222, 1185996, 878789, 732918, 708124, 1015845, 947817, 790692, 692021, 689433, 548914, 694739, 783183, 1073679, 749719, 849508, 1161509, 788892, 942357, 942645, 743408, 1214172, 698927, 1661780, 1245008, 1000283, 742948, 727176, 917419, 1172270, 1358474, 1314283, 1059662, 952572, 1344816, 1051675, 1296101, 1307489, 1306473, 931337, 1177075, 1365044, 1286549, 1445984, 1291660, 1276591, 1294383, 1272401, 1398663, 1485697, 1462261, 1082699, 1028031, 1485033, 1487800, 1628699, 1391508]
16933A391508j4612j82995K61745N07O3729R5041k93953J35909j75915K29150
16923A510114j26801J61143j83796K95261M1689L93218k89496l08471R8098K59429
16913A850388j80926o3320J76700O1874j70878m2934R2843M05557j46850O5369
16903B047823m24333M66014m18689J48623P7983P0635K68392k30225j35363L98455
16893B269315K19206j03623L1673l77949O6538K01482j98457J45549L79996j24384
16883B509346l79935J88788M35346j71533l1074M8847j04283j33974J93802j38410
16873B416920L86127k57144K19364J13990Q8489j16791K73795m14528M63619n3649
16863C120192J30394m0440j35359J44273P3594l0454J86948Q773j82805N2463
$$ y = [1391508, 1376896, 1193901, 1455646, 1456153, 1519882, 1614923, 1320970, 1456879, 1280964, 1510114, 1383313, 1544456, 1360660, 1655921, 1697610, 2090828, 1801332, 1492861, 1590959, 1850388, 1669462, 1606142, 1782842, 1844716, 1673838, 1630904, 1723747, 2129304, 1982454, 2047823, 1623490, 2089504, 1670815, 1819438, 1897421, 1968056, 2236448, 2006223, 1870860, 2269315, 2488521, 2384898, 2416571, 2038622, 2105160, 2306642, 2108185, 2253734, 2633730, 2509346, 2129411, 2318199, 2753545, 2582012, 2550938, 2599785, 2495502, 2361528, 2555330, 2416920, 2803047, 2545903, 2765267, 2879257, 2967746, 2850955, 3124750, 2710222, 3173841, 3120192, 3250586, 3210146, 3074787, 3219060, 3292654, 3262200, 3449148, 3457921, 3275116, 3327579]
16853C327579J02820M34397l04352q0308P03800k76017l88151K16988l7220N23977
16843D223513l07730K47161J02447k95494N30219J25251o8250K1543L63393k51186
16833D690867L98422k28956K20585J10221k85635K03970N38428k10775J39078
16824E576205K5542J52936N4948Q92K36441J17877P25671o03068K98412J68730
16814F754586k7610R8525N80823j17305J78374j35414N93208N2522J01229M05287
16804H484225J08383k64667N36538L10361J61017J48947M09173Q8662L15745l37669
16794I960715P92281Q4551N88917r8666L97342J57713R44862j89772O49522K74689
16784A3562154N31932L26195J69887L33331M97602O46867N14821K38970N75407
$$ y = [3327579, 3430399, 3864796, 3560444, 3480136, 4183936, 3907919, 3519768, 3736756, 3699536, 4223513, 3915783, 4162944, 4265391, 3969897, 4500116, 4625367, 4557117, 4578660, 4942053, 4690867, 5089289, 4860333, 5080918, 5191139, 4905504, 5109474, 5647902, 5437127, 5576205, 5601747, 5754683, 5809631, 5810523, 6046964, 6164841, 6890512, 6287444, 6585856, 6754586, 6726976, 6825501, 7406324, 7289019, 7467393, 7331979, 7925187, 7977709, 8078938, 8484225, 8592608, 8327941, 8864479, 9174840, 9335857, 9484804, 9893977, 9982639, 10298384, 9960715, 10752996, 10837547, 11426464, 11327798, 11725140, 11882853, 12827715, 12637943, 13287465, 13562154, 14094086, 14420281, 14590168, 14923499, 15421101, 16067968, 16582789, 16821759, 17397166]
16775A7397166M27745Q55178o2012J393788L00801Q03304M83482R04089Q87341
16766B3390882N21987J221656Q60805R89408M79917J277105R13813J593600J285135
16757C2534308J539917J105522J516334J880815J258387J926044K420607J471733
16749D5653667K246239K171576K489661K479729L002399K758913L178861L352731
16741F7333776L080197L866312L947826M429614M473914M818397M905641N154641
16733A02010318N796190N844321O090146O072267O564125O711914O622144O473155
16725A52184580O183960O160244N982189N427467M556882L127038L000495J548689
16717A88171544J178885k1185j747479k435627l423514m213864n005351n823672
$$ y = [17397166, 17824911, 18680089, 18618077, 20011865, 20312666, 21115970, 21599452, 22503541, 23390882, 23912869, 25134525, 25995330, 26984738, 27464655, 28741760, 29655573, 31249173, 32534308, 34074225, 35179747, 36696081, 38576896, 39835283, 41761327, 44181934, 45653667, 47899906, 50071482, 52561143, 55040872, 58043271, 60802184, 63981045, 67333776, 70413973, 74280285, 78228111, 82657725, 87131639, 91950036, 96855677, 102010318, 107806508, 113650829, 119740975, 125813242, 132377367, 139089281, 145711425, 152184580, 158368540, 164528784, 170510973, 175938440, 180495322, 183622360, 186622855, 188171544, 189350429, 189329244, 187581765, 185146138, 181722624, 177508760, 172503409, 166679737]
16709A66679737o420653o381121o542226p078806o567175p235158o299283o257983
16701A13897332o331703n810843n378267n075418n291707m754103m212960m183986
16693G2858345l927934l809469l203416l507082k657286k767737k424924k656872
16685D7903625k374984j850322k018060j947339j915408j540517j879598j456472
16677C2920925r98779j500930j298667j024720j281314j108222r82586q98979
16669B3826728r90488p61348p62736r89700l85951p69052o02042n99014q31342
16660A7135055k03718o63111q82858j94434n49425m22193k48578n48484m40837
16651A2981417k62075m67415m42037J11866n53813j92631m85900k32182l56863
$$ y = [166679737, 160259084, 153877963, 147335737, 140256931, 133689756, 126454598, 120155315, 113897332, 107565629, 101754786, 96376519, 91301101, 86009394, 81255291, 77042331, 72858345, 68930411, 65120942, 61917526, 58410444, 55753158, 52985421, 50560497, 47903625, 45528641, 43678319, 41660259, 39712920, 37797512, 36256995, 34377397, 32920925, 31922146, 30421216, 29122549, 28097829, 26816515, 25708293, 24725707, 23826728, 22836240, 22074892, 21312156, 20322456, 19936505, 19167453, 18565411, 17966397, 17135055, 16931337, 16268226, 15385368, 15190934, 14641509, 14219316, 13970738, 13422254, 12981417, 12719342, 12251927, 11809890, 11921756, 11367943, 11175312, 10689412, 10457230, 10100367]
16642A0100367l26477k78689P5075j95836n97896J8585p71978J88121k29822K22219
16632H203669k97244l40444j97173n24987O7975K71040m73171k71945N1722k21016
16622F268426P969m44472j62857Q4333j6375k63390R7798k91724N3201j40747
16612E192162l69817L35985l58629j19746K3536J96328l59598j6920j48912l18020
16602D056369O0311J21463j89403m64936q886K40275l1103l74103j07407N08696
16592C811276l38693J4081J18194k86485M7084l70953Q7136J78641n35187N26324
16582C251418n35226Q9176o1217K91164p838n53302o0739J45524L072J23735k74498
16571B411269J05228J0649j21041K43017K90117o28430R2958q2251J33469k20560
$$ y = [10100367, 9773890, 9495201, 9570276, 9374440, 8776544, 8795129, 8023151, 8211272, 7981450, 8203669, 7906425, 7565981, 7368808, 6843821, 6911796, 7182836, 6709665, 6437720, 6489442, 6268426, 6276395, 5831923, 5669066, 5753399, 5737024, 5473634, 5571432, 5279708, 5332909, 5192162, 4822345, 5158330, 4799701, 4679955, 4703491, 4899819, 4540221, 4523301, 4374389, 4056369, 4116680, 4238143, 4048740, 3583804, 3574918, 3815193, 3784090, 3409987, 3302580, 3811276, 3472583, 3486664, 3604858, 3318373, 3365457, 2994504, 3081640, 3260281, 2725094, 3251418, 2716192, 2805368, 2744151, 3035315, 3027477, 2474175, 2413436, 2558960, 2562032, 2685767, 2411269, 2516497, 2527146, 2406105, 2649122, 2939239, 2310809, 2403767, 2321516, 2454985, 2234425]
16561B234425j07161M950J6097n9741p3390L42215r0356l4652k99028j34750K96438
16550B095047O1212m27970J72027Q738r6999j90094L43205l20355J96106j10369
16540A730548K01751n03035M46708k75552k36335J70667K03377O360n9661j24546
16530A560282k98273M25594l01438K20450l00356N72239p37180N52737j91361
16521A502694j09109k76373K97225k55238r2074K72511n9059m201j7209l35490
16511I23677L62461M0487l58023L30157J07693m55176R7623J34454j75839L67013
16501A374527l82193K66790m69426K39021J97509J75246n65087J41319j8504j54512
16491H04690M38345j04509k15469p6806N09307k62898J58523l86792K20884k17696
$$ y = [2234425, 2127264, 2132214, 2148311, 2088570, 2015180, 2357395, 2267039, 2232387, 1933359, 1798609, 2095047, 2156259, 1728289, 1900316, 1909054, 1812055, 1621961, 1965166, 1644811, 1840917, 1730548, 1932299, 1429264, 1875972, 1600420, 1364085, 1534752, 1738129, 1744489, 1684828, 1560282, 1262009, 1687603, 1386165, 1606615, 1306259, 1878498, 1141318, 1694055, 1502694, 1393585, 1117212, 1414437, 1159199, 1067125, 1339636, 1280577, 1276376, 1259167, 923677, 1286138, 1326625, 968602, 1298759, 1406452, 951276, 1048899, 1183353, 1007514, 1374527, 992334, 1259124, 789698, 1028719, 1226228, 1401474, 836387, 977706, 959202, 804690, 1243035, 1138526, 923057, 846251, 1355558, 1092660, 1251183, 864391, 1085275, 867579]
16481H67579k63556M30828K3108k42062K54562l06447R8547j7768J8317k04052
16471F59056K22036k57084N2182J3870K75039k73915J60462J45818J05682m17023
16461F86123L7210K94964k41771J7157L06007m75014o6440J26416k19921P0877
16451E35608L68202k06736j37626o7827Q8148Q7259n4431J05657K96727B59658
16440H82228k16846M607O3605k01184N1691P9921k3723j01023Q1180J28996k72020
16429D77432M6045j9809J26133k38092J51259J18673j63692J61044B81380M49255
16419G30635B94855j07907K14661R7607J24830k51484Q8235J27042k04265L4971
16409D18545r6107J95103j26249R496M0504o1481L47675k18715j57356J60841
$$ y = [867579, 604023, 1034851, 1057959, 815897, 1070459, 764012, 862559, 844791, 863108, 659056, 881092, 624008, 676190, 690060, 965099, 691184, 851646, 997464, 1103146, 686123, 723333, 1018297, 776526, 793683, 1099690, 624676, 558236, 684652, 464731, 535608, 903810, 697074, 559448, 491621, 579769, 667028, 612597, 718254, 1014981, 259658, 882228, 665382, 669989, 733594, 532410, 584101, 664022, 640299, 539276, 620456, 749452, 477432, 523477, 503668, 629801, 391709, 542968, 661641, 497949, 658993, 281380, 730635, 294855, 186948, 401609, 499216, 624046, 372562, 460797, 587839, 383574, 418545, 322438, 517541, 391292, 400788, 441292, 379811, 727486, 508771, 351415, 512256]
16399E12256k12988K87111j92172q4157L79536C01124J25559I8859N27488A75856
16388C63043J99781R4802k26599q0581K80887A60606J19308K85007j77339A60780
16377E18116J01182j06224A20339R6322J13866m2537k7515L00748I6132L91227
16367D87359k1276n0738l1386A50135M39246k06611N0678j57413J25522m5362
16357C56195K04705c17227B74111G1201M49811A4675b7075B70319L1494l0139
16347B71674k5529J27106j25420J23863L52255A7622M92471r943H6238e4909B76314
16335C25582a49274E93700B20967M5961p4780P1134k3812j14064J39121C5959
16324F70565A72157n4062M26941a36410B40932l2572J41271j00767C6547J86971
$$ y = [512256, 299268, 586379, 394207, 310050, 689586, 301124, 426683, 98859, 626347, 175856, 363043, 562824, 657626, 431027, 350446, 631333, 160606, 279914, 564921, 387582, 160780, 518116, 619298, 513074, 120339, 216661, 330527, 287990, 260475, 561223, 96132, 487359, 466083, 415345, 383959, 150135, 589381, 382770, 433448, 276035, 401557, 356195, 560900, -317227, 274111, 71201, 521012, 14675, -27075, 270319, 301813, 271674, 246145, 373251, 247831, 371694, 723949, 17622, 510093, 500150, 86238, -54909, 276314, 325582, -149274, 593700, 220967, 266928, 192148, 263282, 239470, 125406, 264527, 35959, 670565, 172157, 118095, 545036, -136410, 240932, 208360, 349631, 248864, 36547, 223518]
16314B23518P2145R4424j47951F8054K91146A03057J37520E406N00995A57002
16303C49717K49090A17426J44967m808n9027P8260h1754D94918P7100k37081j61273
16292A73664d5362F4988P2195K48788o5131J8124r7594p1988K10247a4141A54971
16280A55196J67432J19086I316M80665k17224j35454m1818Q3376J19876j29132
16270A69605J25923H5951B1227R5553l3869b22424a01828B23629j00024h7898
16259B78080i9597A12040m3642A4978b1654j00958B74602A3627K13773p2250h504
16247A02953J148P0467J21980A40787K69192A96377r7292J90790B2154P9847K37348
16236C39349a06627E348e4719j54358A12349k0633L30760A91737H4416K23472
$$ y = [223518, 295663, 390087, 242136, 68054, 359200, 103057, 240577, 5406, 506401, 157002, 349717, 598807, 117426, 262393, 257585, 198558, 276818, -81754, 494918, 572018, 334937, 173664, -45362, 64988, 137183, 385971, 320840, 338964, 241370, 169382, 379629, -14141, 154971, 155196, 322628, 441714, 9316, 489981, 272757, 137303, 95485, 178861, 298737, 169605, 295528, 85951, 21227, 116780, 82911, -222424, -101828, 223629, 123605, -87898, 278080, -99597, 112040, 68398, 14978, -21654, -122612, 274602, 13627, 227400, 155150, -8504, 102953, 104101, 174568, 296548, 140787, 409979, 196377, 99085, 289875, 22154, 102001, 339349, -106627, 5348, -54719, -209077, 112349, 91716, 422476, 191737, 84416, 307888]
16226C07888J49860G8877e5849C50977c5993A5601J26104g2629n5672B98571a12481
16214I6107d9829C34877j5252j55441J69569A29691d3048B81078n6615N5039r0477
16203A89025G1131P5616M8776C2164J38983o6551M6073c5205B52110n9984D9666
16191B93506g0178A22029C3099h7301C65958k8750b12965A23013J208J0616g7958
16179D1879N2610N669B8241o688e9979K4321k2518i421G7493k1549K5134a93520
16166A6572N2343A4737J4443c4712b578q3586C7634a79656h126o8458h977F1916
16153F0366K5433a29153F5661A4151b30538g3336q0841M6149A94003j4105B4363
16141A14714m6103K21120a70683M6875K706e1024B98251b17627B74751A701a52040
$$ y = [307888, 457748, 78877, -55849, 350977, -35993, 15601, 141705, -72629, -128301, 298571, -112481, 96107, -49829, 334877, 319625, 164184, 333753, 129691, -43048, 281078, 224463, 279502, 189025, 71131, 146747, 195523, 32164, 171147, 104596, 150669, -35205, 252110, 192126, 49666, 293506, -70178, 122029, 33099, -87301, 365958, 337208, -212965, 123013, 124221, 134837, -77958, 41879, 94489, 100158, 28241, 21553, -59979, -35658, -58176, -9421, 77493, 55944, 81078, -193520, 16572, 68915, 14737, 29180, -34712, -2578, -86164, 37634, -179656, -8126, -76584, -8977, 61916, 60366, 85799, -129153, 65661, 14151, -230538, -73336, -154177, -108028, 194003, 179898, 24363, 114714, 68611, 289731, -170683, -123808, -121102, -51024, 298251, -217627, 274751, 1701, -152040]
16129f5287C30725I4668m6214J17981G9850E286M6189d9812C7574L36521F8839
16117A60341D3178a954o9817J8601A98810g4012A6342M0881K43656Q759A23919
16105D6339a98568B3236a47284G1221b67700B11287I7336P9859C667L3698i4042
16093B71777a99833m9824B52578b21346g6214p6241A98710a36043d8854n8074
16083a06928A78355c63194A49615a30546e2684B73529d742j90109G840J01129
16073A08969k3733a04595C2752a14159A24653L9538o2928K14177b1471j3958H1023
16061b27457h2476r4615B98475b07020D946e5949k10830R9884D8517K53182b4054
16049f1992H2390g2206A12800B6646R652K2314b29574g9847j19783A55965B4693
$$ y = [-65287, 330725, 94668, 48454, 166435, 79850, 5286, 51475, -49812, 37574, 374095, 68839, 160341, 43178, -1954, -71771, -53170, 198810, -74012, 16342, 57223, 300879, 309638, 123919, 46339, -198568, 23236, -147284, 71221, -267700, 211287, 97336, 177195, 3667, 37365, -94042, 271777, -199833, -249657, 252578, -221346, -76214, -152455, 198710, -136043, -48854, -106928, 178355, -363194, 149615, -130546, -52684, 273529, -4742, -194851, 7840, 108969, 85236, -104595, 32752, -114159, 124653, 164191, 101263, 315440, -21471, -35429, 81023, -227457, -82476, -177091, 298475, -207020, 4946, -55949, -266779, -166895, 48517, 301699, -24054, -61992, 82390, -72206, 112800, 26646, 36298, 58612, -229574, -79847, -199630, 155965, 24693]
16037c88105C29240j29740d25965J70132h1973b0121j05065A69214a66755A15033
16026A9534f1209A46989Q2589D5740c216A51069C6838a0318q8524a29n67244a14864
16013b68928A57236b40966D8843Q1843d729A18701a33111f6095N885b5828l39351
16002c65179A25123K4477n9219b6837j7366C4285e1562I6486D1110b01163E5979
15990e7564J3469j65011A66423J69567H7377P7508f5003C58388A11988K88691
15980D00679l0606j37296K03368j36897a86126P805C18068a80348j31116a1112
15969D42531B07601E2196Q93b2466I8855J42304a25697R119C07519a07120J9100
15958h8020B91584H0684b37116A261a65920C6172a30499j7479j50379P2445G777
$$ y = [-388105, 329240, 199500, -425965, -255833, -81973, -20121, -125186, 169214, -166755, 115033, 19534, -61209, 146989, 229578, 45740, -3216, 151069, 36838, -10318, -98842, -129, -567373, -114864, -268928, 157236, -240966, 48843, 130686, -4729, 118701, -133111, -66095, -60210, -25828, -365179, 125123, 149600, 90381, -26837, -44203, 34285, -51562, 96486, 41110, -201163, 55979, -57564, -44095, -209106, 166423, 335990, 87377, 164885, -65003, 358388, 111988, 400679, 370073, 232777, 436145, 299248, -186126, -178321, 318068, -180348, -311464, -11112, 442531, 207601, 52196, 53089, -22466, 98855, 241159, -125697, -116578, 307519, -107120, -88020, 291584, 80684, -237116, 1261, -165920, 36172, -130499, -147978, -298357, -225912, 7777]
15946a93354H121K57227c7603a7085k44598a14653n2440D7162R9000c56079A16643
15934a43812g1048B2082c67605F2422b09632B1958P6172J23006A07660b57737
15923E6796f2109A95297a14250D8873K4835K49428a90286B73934C3698L7014a08674
15911a87217f0943n8717I661N6503f6219G9009L84715a74959b3606D9867a4799
15899a04934K1910C11145E2459f9105A35556k3636j3469a63997d7086k54476N8603
15888b42959O0008m2244R0096j70096B08134b5633n7323E2687n598L27238b54578
15876D6223K6976N58b49667b0475D8631d43865B11878I0134g1566j81063A25549
15864a93266N8822c2881l46260a21479A1805N818J18924b33247h5691r1672A85395
$$ y = [-193354, 8121, 265348, -37603, -17085, -261683, -114653, -167093, 47162, 146162, -356079, 116643, -143812, -71048, 22082, -367605, 62422, -209632, 21958, 98130, 221136, 107660, -257737, 56796, -62109, 195297, -114250, 48873, 73708, 323136, -190286, 273934, 33698, 70712, -108674, -187217, -60943, -119660, 9661, 66164, -66219, 79009, 463724, -174959, -23606, 49867, -14799, -104934, -83024, 311145, 52459, -69105, 135556, 111920, 98451, -163997, -47086, -301562, -242959, -182951, -225195, -135099, -305195, 208134, -25633, -82956, 52687, 47089, 374327, -254578, 46223, 73199, 73757, -249667, -20475, 48631, -443865, 211878, 90134, -71566, -252629, 125549, -193266, -134444, -32881, -379141, -121479, 11805, 17623, 136547, -233247, -85691, -177363, 185395]
15852c49770B08432j03852K9406b21420J09883j034j6945M4859j86948f6389E7373
15840B93743I9806j6947b9584m46413J85943b8705j33657F1996e3789j09941J7981
15829a45749j03007A65195o3788e49346C46101j12401b8381E18K89739c27559
15818C67642A5700a07734G2298J24562A347c3606k08130d7237q3851o5023i3511
15806a11501j31394a9179j67089N7038A30760f9621B42344a06560c6011m28096
15796d64107D4264a1552A29169b89915G0143L8936J18902I343b03119g0900b1200
15784g1833j62037m4842F1750a34858L9639A06192L8488h1978k01264a35786F884
15772c72320b2032I0451c2324J0019m24248D7374L74389b44642g4920A00304K0214
$$ y = [-349770, 208432, 104580, 133986, -221420, -111537, -112571, -129516, -84657, -271605, -66389, 57373, 293743, 99806, 82859, -29584, -475997, -290054, -28705, -162362, 61996, -53789, -163730, -145749, -248756, 165195, 101407, -549346, 346101, 233700, -28381, 518, 290257, -327559, 367642, 15700, -107734, 72298, 196860, 1347, -33606, -241736, -47237, -131088, -196111, -93511, -111501, -242895, -19179, -186268, -129230, 130760, -69621, 242344, -106560, -36011, -464107, 44264, -11552, 129169, -289915, 70143, 109079, 227981, 9343, -203119, -70900, -21200, -71833, -233870, -278712, 61750, -134858, -95219, 106192, 144680, -81978, -283242, -135786, 6884, -372320, -22032, 90451, -32324, -22305, -446553, 47374, 421763, -244642, -74920, 100304, 120518]
15761A20518N386l7373d21639A76070J55895j43582K6018g4306c0365A34208C7322
15749A8904b81238A85501K00348D2512J17488J86662f0881j17342J1249k35027
15739d02001a61549E0215M6855c00285a07392A28401d1617k00962B70146a56633
15728B58251d63266c6337A15417a95957f7465l04490a32994k080l4737j8939F0712
15716A65384d0695B44055a24394n0327A71014c9491J9044k34249J19791I5949
15705e7589K6812j08586B25408a68663A88301h3210k14704A06615K6737C223J16838
15694A20061K62313j08792n485b12872B91235j19902a49756B56404L4501j33822
15684A57083G0541f0695A2710K21362a42173k21351J18221A18678n9150a16431
$$ y = [120518, 125904, 88531, -421639, 176070, 331965, 188383, 214401, -74306, -30365, 134208, 37322, 18904, -281238, 185501, 385849, 42512, 160000, 346662, -60881, -178223, -166974, -402001, -161549, 50215, 97070, -300285, -107392, 128401, -41617, -242579, 270146, -156633, 258251, -463266, -36337, 115417, -195957, -67465, -371955, -132994, -135074, -169811, -188750, 60712, 165384, -40695, 244055, -124394, -174721, 171014, -39491, -20447, -254696, -134905, 95949, -57589, -30777, -139363, 225408, -168663, 188301, -83210, -297914, 106615, 133352, 3223, 120061, 382374, 273582, 268097, -212872, 291235, 171333, -149756, 256404, 290905, 157083, 70541, -60695, 12710, 234072, -142173, -363524, -245303, 118678, 59528, -116431]
15673e024k07040E47874h8475M1136j4780j27766j65584A04622b5396i168l8314
15662d7482A80202a16651A01887a38637K9275k36489J60814d7306A51375d2825
15651a08387C8282J23970a1125m2247f061p02k52039b3203A74573M8934g3872
15639a4029G6815e66000B35060C7315a26883B5025c0736p3432H3403f3530n5031
15628a18561I2321a53559L6841a6640k38867g8015A56509a60252K1310q1153A42011
15616b5777B45903F7566J69943B1224a77930c4294q6918Q316B52273A2541c17696
15604b9063A26444b7695k20206I3484M0609b97967J16619K2612k81574B26490
15593b29468J02710A54727i8316G4021l2764K12a43563C25823b4605C04929A06817
$$ y = [-5024, -212064, 547874, -88475, -47339, -62119, -189885, -355469, 104622, -25396, -9168, -47482, 180202, -116651, 101887, -138637, -109362, -345851, -185037, -47306, 151375, -42825, -108387, 38282, 162252, -11125, -53372, -6061, -6763, -258802, -23203, 174573, 223507, -73872, -14029, 76815, -566000, 235060, 37315, -126883, 25025, -30736, -104168, 83403, -63530, -118561, 92321, -153559, -116718, -16640, -255507, -78015, 156509, -160252, -138942, -220095, 142011, -25777, 245903, 67566, 237509, 21224, -177930, -34294, -121212, -112896, 252273, 12541, -317696, -29063, 126444, -27695, -247901, 93484, 134093, -297967, -181348, -158736, -440310, 226490, -229468, -126758, 154727, -98316, 74021, 41257, 41469, -143563, 325823, -24605, 304929, 106817]
15581h7974a5193A59757a9869j42367f2056A32245f8230P319A68467a26510E5259
15569b49232G2026J24391e6889C34023j47213m4604b52757N7011r2128C38921
15558d01984E69345A68746f9849A87724i9178A12970a1566j86236G1188a51511
15547g6045h751j00726I7788c70383a11683C32025h6221m1977A11423b83868d8881
15535f1987A1550Q5942d4519J316j49141R5789E8121i600j95199g257r9149A21934
15522D7245J27454c1344j89406A38490E6465O2299C7772d34551C38778a86987
15511c1730j28055A77879c7816q0533b7253E3676d6591F9029J53840j07613A5861
15499d6211k80270c4493A63081J19235K7354j13448a27878c3681B04088F6528
$$ y = [-87974, -15193, 159757, -19869, -162236, -62056, 132245, -68230, -60911, 168467, -126510, 55259, -249232, 72026, 196417, -56889, 334023, 186810, 142206, -252757, -195746, -287874, 338921, -401984, 569345, 168746, -69849, 187724, -99178, 112970, -11566, -197802, 71188, -151511, -76045, -8751, -109477, 97788, -370383, -111683, 332025, -86221, -128198, 111423, -283868, -48881, -61987, 11550, 97492, -44519, -43203, -192344, -96555, 58121, -9600, -204799, -7257, -106406, 121934, 47245, 174699, -31344, -220750, 138490, 56465, 118764, 37772, -434551, 338778, -186987, -31730, -159785, 177879, -37816, -118349, -27253, 53676, -46591, 69029, 222869, 115256, 15861, -46211, -326481, -34493, 163081, 282316, 309670, 196222, -127878, -33681, 204088, 66528]
15488b2350q2566L9383O90A16547K3089J71008G3025h9635E2736K04265b55948
15476C06791o7276a77843D06955i2678A1327J68770m1851P0664F5984A060a2783
15464f5960p036A5535d8769I5933N8490a15872F4832h7254A53016A1035M5077
15453E6112a66416C82691a56604A26750b25075C51225b49961A03964a29316C97319
15442a85329l74751b14256A07232a97716j35701a17697B82049b20152R6761A28684
15431h935j17907C5098r408a0170E9328K13270a58600K4325B64557o3243q0410
15420A20904f8876C2191K31318e6291k97142f6159p3446A39603i5005D4370b05790
15408A89267r1843b16669H5680a09586k3132G6141a77102A23013l089b10879e7300
$$ y = [-22350, -104916, -65533, -64843, 116547, 139636, 310644, 73025, -89635, 52736, 257001, -255948, 306791, 239515, -177843, 406955, -92678, 11327, 180097, 138246, 208910, 65984, 1060, -12783, -65960, -72996, 15535, -48769, 95933, 154423, -115872, 64832, -87254, 153016, 11035, 56112, -166416, 382691, -156604, 126750, -225075, 351225, -249961, 103964, -129316, 397319, -185329, -560080, -214256, 107232, -197716, -333417, -117697, 282049, -220152, -123391, 128684, -8935, -126842, 35098, 25690, -10170, 59328, 272598, -158600, -134275, 264557, 201314, 120904, -68876, 32191, 263509, -56291, -353433, -66159, -139605, 139603, -95005, 44370, -205790, 189267, 97424, -216669, 85680, -109586, -132718, 76141, -177102, 123013, 119924, -210879, -57300]
15396A88067q2277c63882a13769o6314A35414a65170C8499J69557j01744B0805
15385h4164j1888k2584n6386B77904a30822A82525a57403P3848A75819b15053
15374b68811G8481d5207j03374A72758a85056B3368a11436j5202C7519K9906K74529
15363C41954b00049h5973A89198l3005b87119g9115j0476r4248c2069G6489b69180
15351a56768G856e7459q419l9559A92434J62302j65010c52256M4294C05153C8422
15339a18479A1231J24006J46785a14442f634D54331a9344F9321a91236A32628
15328G2137a99588A0798N2615a12226D36079A21102f3419E6680a61612A99027
15317a4011D6380K41700Q5725j52391N2978a52345D8998a66396b4152B8992a21653
$$ y = [188067, 105790, -363882, -113769, -180083, 135414, -165170, 38499, 208056, 106312, 20805, -84164, -96052, -118636, -175022, 277904, -130822, 182525, -157403, -83555, 175819, -215053, -268811, 78481, -45207, -148581, 172758, -185056, 23368, -111436, -126638, 37519, 67425, 341954, -200049, -85973, 189198, 156193, -287119, -79115, -89591, -183839, -32069, 76489, -269180, -156768, 7856, -57459, -65878, -105437, 192434, 354736, 189726, -352256, -307962, 305153, 38422, -118479, 11231, 135237, 282022, -114442, -6634, 454331, -19344, 69321, -191236, 132628, 72137, -199588, 10798, 63413, -112226, 436079, 121102, -63419, 56680, -161612, 199027, -14011, 46380, 288080, 373805, 221414, 274392, -152345, 48998, -166396, -24152, 28992, -121653]
15305B11291d5031E33472A34811O1746G7395b18247F7672c0589F212h7258r203
15294i6461l5800G4593A2796O6779b1997q1179B61310M475N6577c3626H3177g3626
15281D1835K37424A16587h4035C50432a51808P1289I2812d7516p6375B08330N7828
15270B66158a25502G6243l2853g5967A5164J44112j4684N9359n3921J34471e0290
15258C47085a20909C87125J41209B1878g0576j10951B04487F9151M18952L86447
15248H74550P49360k37372k76300K79574B04098M1111l8356b28694A36490p843
15238A28647m4216j7668k5991J09715i5534A7247b07040B83898a56161B7807J9549
15227D7356g2734b5858j10192I2649D4030b39747C47944A01447K14323c81146
$$ y = [211291, -45031, 533472, 134811, 196557, 77395, -218247, 67672, -30589, 6212, -87258, -96461, -132261, 74593, 12796, 79575, -21997, -103176, 261310, 265785, 322362, -33626, 83177, -73626, 41835, 279259, 116587, -84035, 350432, -151808, -80519, 92812, -47516, -123891, 208330, 266158, -125502, 76243, 43390, -75967, 15164, 159276, 144592, 203951, 150030, 284501, -50290, 347085, -120909, 387125, 528334, 21878, -70576, -181527, 204487, 69151, 488103, 874550, 1623910, 1386538, 1110238, 1389812, 204098, 245209, 206853, -228694, 136490, 128647, 84431, 66763, 40772, 150487, -95534, 17247, -207040, 283898, -156161, 27807, 47356, -72734, -25858, -136050, 92649, 44030, -239747, 347944, 101447, 315770, -381146]
15216A50079a23690C50434A50521p2313K680b47763A48579g8007A46242O8620
15206B14862I000K21743d00161b5865B13695p6793J10197i446A27099D245i5086
15194C71326d10300A11124e1213B28981a45040G8498n488L9142c08641F7483a42720
15182A47419d640m16837C2757K68736G9270K5801a79704L0103A8927b7898B51998
15170B09367K6580p1962K0250b64439A59132J5104J33977C5770L8870l2861M20357
15159D62136a42868B1980a0769D1498a38872A14785f059A74597a95439E4754b9617
15147A21180a2881l06287A60192o1737m834q147a93489D52568A26038K84977A9721
15135G4669a50323A22190c08215a3998C9481L4865J4466J32973A04507a43349
$$ y = [150079, -123690, 350434, 150521, 78208, 80888, -247763, 148579, -78007, 146242, 214862, 9000, 230743, -400161, -25865, 213695, 136902, 247099, -9446, 127099, 4245, -95086, 371326, -410300, 111124, -51213, 228981, -145040, 78498, 73010, 112152, -308641, 67483, -142720, 147419, -4640, -421477, 32757, 301493, 79270, 105071, -179704, -149601, 18927, -27898, 251998, 209367, 235947, 163985, 184235, -264439, 159132, 174236, 308213, 35770, 74640, 41779, 462136, -142868, 21980, -10769, 41498, -138872, 114785, -6059, 174597, -195439, 54754, -29617, 121180, -12881, -319168, 160192, 98455, 93621, 85474, -193489, 452568, 126038, 411015, 19721, 74669, -150323, 122190, -308215, -13998, 39481, 74346, 88812, 221785, 104507, -143349]
15124A59029M8273Q9770j26151E0682L19340B4947N56320a25679D0986K47714
15114B88700p4946b43114j650B77992l661o6742p2077A2484R9523o656b1923B10868
15101D30033d2441k1017C70696A2510O8882K70499F4867K37777i8566C41501K3751
15090C65252Q9231B03710k1494b7395B98755C5635K7407J13707D0052L99470A20437
15078D7911L4029K38403h5327j8782G6035b58516e3770A77567o7209K62348A8457
15066g8520A85679J00085a61145C69064a55665C30139a20184A51579j1540j3428
15056A26611c3834A18538n4690O7021J42682K25485b8486A94625K10710j08497
15046B96838r7590K55980k18689I5210M32135G5778O3849K06906A35549J39303
$$ y = [159029, 207302, 297072, 170921, 50682, 370022, 24947, 581267, -125679, 40986, 288700, 213754, -243114, -244764, 277992, 274331, 207589, 135512, 12484, 112007, 105351, -21923, 210868, 430033, -42441, -63458, 370696, 12510, 81392, 351891, 64867, 302644, -98566, 341501, 365252, 454483, 203710, 182216, -27395, 298755, 35635, 63042, 176749, 40052, 439522, 120437, 47911, 81940, 320343, -85327, -104109, 76035, -258516, -53770, 177567, 110358, 372706, 18457, -78520, 185679, 285764, -161145, 369064, -155665, 330139, -120184, 151579, 140039, 126611, -33834, 118538, 63848, 130869, 273551, 499036, -28486, 194625, 405335, 296838, 199248, 455228, 236539, 95210, 527345, 75778, 139627, 346533, 135549, 274852]
15036B74852p645J21980j63882P0346a68276D3697J06440E4418r150a1876n1516
15025f3392B89416Q8775b4079A62669K54395j92205r0289F5122K51483F6393J46342
15014B12735D2675L02468M2000F0568J80369L62370k60148L0364J59982A67272
15003D65511d8058G7112k4404b33158A51169J27403c12826a51916N7115B3225
14992A26302M25382r3174j62375j243K8786a4732B58005m2310R3143A53271N9888
14981B13159J23542J47853B02986K95437e3122A69479k2505M4114K91003A50751
14970A92384J19272A4691M69988B04697G2734H723L13491I7505L03777A31003
14959B7498Q2646K17049j5676L3264J2873M4200j46325q711M9643j37321c5158
$$ y = [274852, 267207, 389187, 225305, 295651, -168276, 43697, 150137, 54418, 45268, -11876, -63392, 289416, 378191, -24079, 162669, 417064, 224859, 134570, 65122, 316605, 66393, 212735, 42675, 345143, 387143, 60568, 240937, 603307, 343159, 373523, 533505, 167272, 465511, -48058, 77112, 52708, -233158, 151169, 278572, -312826, -151916, -94801, 23225, 126302, 551684, 458510, 296135, 294892, 323678, -14732, 258005, 215695, 308838, 153271, 213159, 336701, 484554, 202986, 498423, -53122, 169479, 146974, 191088, 482091, 150751, 192384, 311656, 14691, 484679, 204697, 72734, 8723, 322214, 97505, 401282, 131003, 27498, 110144, 327193, 311517, 344781, 357654, 401854, 255529, 246818, 296461, 159140, -35158]
14947C13841o5969K57778A00472A9454O5802O8677K91929C5430J85210n3529M03724
14936E70835j09238O1326q6540j63386j09287n1915K02796L10376k22783m8069
14926C54115D4921f1398j03171B38397k4776J97469K5282G0343L92992j53227
14916C10108K4346L7448j73733K48117L0297B17674l7268K67813A79834L87204
14906E67038B06712R5884q0962K64623j29901j23522k2673J78196p5164l4233
14896B78960J96979j74278K87490B46768M74315k51016j71158K70998B45351J47660
14886C93011q3903Q3449q5363L991O3784J65542J37993j31517A13365Q19765G3810
14874F20981L2392l20143K0984J40156j37254O5954j38162q6694N66751l68364
$$ y = [313841, 247872, 505650, 100472, 19454, 85256, 153933, 445862, 35430, 220640, 167111, 570835, 461597, 522923, 436383, 272997, 163710, 111795, 314591, 624967, 402184, 354115, 44921, -61398, -164569, 238397, 213621, 411090, 436372, 70343, 463335, 310108, 334454, 371902, 198169, 446286, 476583, 217674, 180406, 448219, 179834, 567038, 206712, 302596, 221634, 486257, 356356, 232834, 210161, 388357, 313193, 278960, 475939, 301661, 589151, 246768, 721083, 470067, 298909, 569907, 245351, 393011, 309108, 392557, 307194, 311185, 374969, 540511, 678504, 546987, 113365, 933130, 73810, 620981, 653373, 333230, 354214, 494370, 357116, 423070, 284908, 198214, 764965, 396601]
14864C96601p1500N8342o9015j15507L73185j42620q4696M3256L41769j98816
14854E30999j46916q2924J65683M5059k32292A15571J76098J38418j41185P8760
14844C67662L68920B88294L45083k81962J38263j19671N776Q6891N0704j03232
14834D10146K11673j6752k19024k9802K36740J19614k4321l13422o7255L33328
14824F40925j21790k42428L17124B25366J91568P8255L70395l78122P757O8421
14814E63640J9245B74391K49865L23105l65512l5232j26932R4902J26935K91912
14804H33434l06467k56286L94581N7895l39188J79719q4844n3097n47K68642k19762
14793D74080L58986p6543k10194J52487R4633j26672p364J60924k44022l7215
$$ y = [396601, 325101, 383443, 314428, 198921, 572106, 429486, 344790, 388046, 729815, 530999, 384083, 301159, 466842, 511901, 279609, 115571, 291669, 430087, 288902, 367662, 736582, 288294, 633377, 351415, 489678, 370007, 375783, 462674, 513378, 410146, 621819, 605067, 386043, 356241, 592981, 712595, 688274, 374852, 307597, 640925, 519135, 276707, 593831, 225366, 416934, 495189, 865584, 487462, 495219, 563640, 582885, 274391, 524256, 847361, 481849, 446617, 319685, 414587, 541522, 833434, 526967, 270681, 665262, 723157, 383969, 563688, 478844, 425747, 425200, 693842, 474080, 833066, 756523, 546329, 698816, 793449, 666777, 659413, 820337, 576315, 539100]
14783E39100l8430A97060L77172n8021J05111B75372M03416p8781l0105R5329
14773F65231j87073M65131m42505L01050j73929j24475L15075l52930N3098K11234
14763G29907k05943j70817L67513K0733R9285J15053l56961J71198r9560J30857
14753H01265q8725j44630M08872j90202J05282k84221L1824j8286K35375k17351
14743F39203M6346m4938J17478R2742Q4823l53371L20411J38239n3477j33345
14733H54111j34415K20304n84j16642p797j27376M288L76392l32211J93946j60793
14722G69223K69779m03927K78729l30179J68144N9057J20902r0604K13529k00745
14712H53908O6216K64526k98941K04078l06349J9390q712j16799J05581m8066
$$ y = [539100, 500670, 197060, 574232, 516211, 621322, 275372, 678788, 600007, 569902, 665231, 478158, 943289, 500784, 801834, 627905, 503430, 818505, 465575, 518673, 729907, 523964, 353147, 720660, 741393, 840678, 955731, 598770, 769968, 670408, 801265, 712540, 567910, 976782, 786580, 891862, 607641, 639465, 621179, 856554, 639203, 685549, 640611, 758089, 850831, 935654, 582283, 902694, 1040933, 987456, 854111, 719696, 940000, 939416, 822774, 814977, 687601, 691889, 1068281, 736070, 930016, 769223, 1039002, 635075, 913804, 583625, 751769, 810826, 931728, 841124, 1054653, 853908, 920124, 1184650, 885709, 1089787, 783438, 802828, 794116, 677317, 782898, 734832]
14702G34832K73774J41495j86798j31668M9222P864K61698j75184Q1884j19624
14692I37495k54281L24327J52294l42649K74016m20737L64339J43034n83140K7248
14682F21946K77910K56039j61482L13859l12883N9435P33N9148R4189k19967K92944
14671A281871j26746n8681l1767J09551Q0468L2875k64690K08228k41984K11539
14661A200664J60072l70845N5479L2830N4422N9861K4559K4394N5225Q2742j86200
14650A193203j9939L20238l37720J73767M1365k01003M25265m73532j65159o3895
14640H92590P76321j66224m00080L98594l451j58938j16765J44756J96925j03761
14630A459967O9529q3540J12482O1709O5039l02455J70517l15033K63604q3764
$$ y = [734832, 1008606, 1150101, 963303, 831635, 880857, 888721, 1150419, 975235, 1057119, 937495, 683214, 1007541, 1159835, 817186, 1091202, 670465, 1034804, 1177838, 594698, 621946, 899856, 1155895, 994413, 1308272, 995389, 1054824, 1055557, 1114705, 1208894, 988927, 1281871, 1155125, 1096444, 1064677, 1174228, 1254696, 1287571, 1022881, 1231109, 989125, 1200664, 1360736, 989891, 1045370, 1078200, 1132622, 1192483, 1217042, 1241436, 1296661, 1379403, 1193203, 1173264, 1493502, 1155782, 1329549, 1370914, 1169911, 1595176, 1121644, 956485, 892590, 1668911, 1502687, 1102607, 1501201, 1497750, 1338812, 1222047, 1366803, 1563728, 1459967, 1529496, 1445956, 1558438, 1620147, 1685186, 1382731, 1553248, 1238215, 1501819, 1418055]
14620A418055K41366l0865k69234k40526K96868J57579k51305q4131J01994J18122
14610A457923Q5981J65574R7844R4013J63194k59949l3160k40118K18820j93611
14600A556511L50470J9588k56l37654L94459K09797k39905j72982L5794K90806
14590B106628j15495J05028n8507k33809N7313K16297o0419J58433P5274k24970
14580B025773J33289j86895O5347O6898K8447q4728J9604K07839J59077J4543
14570B449194j87462R6280J15077J925K49754J66075o05840L39813K91985l60897
14560B555904M80598k5757K98638K17597k16153M70400K84147J613Q25162P75875
14550E668024J234423K236549M314128P688135J5734784J0495288k2346831I448441
$$ y = [1418055, 1659421, 1628556, 1359322, 1118796, 1415664, 1573243, 1321938, 1237807, 1339801, 1457923, 1543904, 1709478, 1807322, 1901335, 2064529, 1804580, 1771420, 1531302, 1750122, 1556511, 1906981, 1926569, 1926313, 1588659, 1983118, 2192915, 1953010, 1780028, 1815822, 2106628, 1991133, 2096161, 2037654, 1803845, 1861158, 2077455, 2017036, 2175469, 2250743, 2025773, 2159062, 1972167, 2037514, 2104412, 2132859, 2048131, 2067735, 2275574, 2434651, 2449194, 2261732, 2358012, 2473089, 2475014, 2724768, 2890843, 2285003, 2624816, 2916801, 2555904, 3036502, 3010745, 3309383, 3526980, 3310827, 3781227, 4065374, 4066987, 4892149, 5668024, 6902447, 9138996, 13453124, 21141259, 36876043, 47371331, 25024500, 9448441]
14541D504822j530664n32256k52322j06984N0623j84302K69568L71359m6670k45995
14531B297179K37410l30159r1195L27695L34550l98898J73619Q8035J21899l16843
14521B443292L01164l24413k8898N60115j19843L16415J30961l79702r2784M52420
14511C258727m20027L15327m6485R1403Q5292k37927J07402L63962l45289Q9696
14501C262081L36486j58726K46080k72238J46058j51873P3302M3808m0287M02766
14491C887457k90240L43163j95819k18591O37353k40833J92528j07917n0877m8589
14481C907635J74960R9434K53679K02558j12930j39272J73321J6298l42631N66397
14471D799449J7280k30750M52255m54176K03025j37080K83923N09107k27188Q8606
$$ y = [4504822, 2974158, 2441902, 2189580, 2082596, 2133219, 1948917, 2218485, 2589844, 2543174, 2297179, 2534589, 2204430, 2113235, 2440930, 2775480, 2376582, 2550201, 2638236, 2760135, 2443292, 2744456, 2420043, 2391145, 2951260, 2831417, 3147832, 3278793, 2899091, 2806307, 3258727, 2838700, 3154027, 3107542, 3198945, 3284237, 3046310, 3153712, 3517674, 3172385, 3262081, 3598567, 3439841, 3685921, 3413683, 3559741, 3407868, 3481170, 3524978, 3484691, 3887457, 3597217, 3940380, 3744561, 3525970, 4163323, 3922490, 4115018, 4007101, 3956224, 3907635, 4082595, 4182029, 4435708, 4638266, 4525336, 4386064, 4559385, 4575683, 4233052, 4799449, 4816729, 4585979, 5038234, 4584058, 4787083, 4650003, 4933926, 5443033, 5215845, 5304451]
14461E304451k91632L45936J71984l80804M50547j39991L38785J31549J21119
14452F051944j30359j3466J31663N8531j25349M08222J22866m87318K89491J78112
14442F484337O0328J29879m5497K06186K48776j06987J54626k16984M85242L53854
14432G753760l07216P9076K9979M98930m08055J43364L07551K01333L84611l54819
14422H328514J68503J87540K5643J60810o9081P91604k48688J68793P5671R8029
14412I687338j8356J42794M17343P2386N9269M19598j4950L42855k55651K61134
14402A1113760J39363M86510L0970J79489m2900L64275K26530L71370J36744J24239
14392A3130350J90430J56927Q0132J99971N44445L44614K09481L38515J8870M03798
$$ y = [5304451, 5012819, 5358755, 5530739, 5149935, 5600482, 5460491, 5799276, 5930825, 6051944, 5921585, 5908119, 6039782, 6098313, 5972964, 6381186, 6504052, 6016734, 6306225, 6484337, 6544665, 6674544, 6629047, 6835233, 7084009, 6977022, 7131648, 6914664, 7399906, 7753760, 7446544, 7525620, 7555599, 8054529, 7646474, 7789838, 8097389, 8298722, 8683333, 8328514, 8497017, 8684557, 8710200, 8871010, 8801929, 9593533, 9344845, 9513638, 9589309, 9687338, 9668982, 9811776, 10229119, 10301505, 10360774, 10780372, 10765422, 11108277, 10852626, 11113760, 11253123, 11739633, 11770603, 11950092, 11907192, 12271467, 12497997, 12869367, 13006111, 13130350, 13320780, 13477707, 13557839, 13757810, 14302255, 14646869, 14856350, 15194865, 15213735, 15617533]
14382A5617533N44157O8290J26932P21091l0794N81781J62442O20931M9057M40322
14372A8901742L82337M67095L58181M47565J34439K22360N55755P14680K21352
14363B2405506P00991L05122M95608Q55932O11683R0168O97770O23682O24543
14354B7411005O59502R00593K85168J224642M31484O20942J016860N27328J338132
14345C4415656M19840O74231R71566J535727P91376O57416J370011J026251J470040
14336D3332114R43641J470237J205919J469656J035395J891930J454385J446999
14328E4250276J645077J929723J936459J860134J960200K325807K004871K470714
14320G0383261K603339K618448K735122K893388K743591L202564L493904L444546
$$ y = [15617533, 16161690, 16229980, 16356912, 17078003, 17047209, 17628990, 17791432, 18412363, 18461420, 18901742, 19284079, 19751174, 20109355, 20556920, 20691359, 20913719, 21469474, 22184154, 22405506, 23106497, 23411619, 23907227, 24763159, 25374842, 25465010, 26162780, 26786462, 27411005, 28070507, 28971100, 29256268, 30480910, 30912394, 31533336, 32550196, 33077524, 34415656, 34835496, 35509727, 36481293, 38017020, 38808396, 39465812, 40835823, 41862074, 43332114, 44275755, 45745992, 46951911, 48421567, 49456962, 51348892, 52803277, 54250276, 55895353, 57825076, 59761535, 61621669, 63581869, 65907676, 67912547, 70383261, 72986600, 75605048, 78340170, 81233558, 83977149, 87179713, 90673617, 94118163]
14312I4118163L715230L823355L912734M562258M438362M898651M785578N568094
14304A29822425N597349O190242O084497O885601O967473P205533Q136045Q419595
14296A85308760Q570167R361593R975169J0119440J0833943J1441953J1948914
14289B57559939J2683768J2677360J3504677J3925523J4698663J4555207J5272370
14282C54877507J4674140J5415587J4695108J4758263J3840125J3336376J1441123
14275D53038229R885720N388392K378892J278297M84305R22499K55533j987348
14267D71644519m271669o990582j0093561j2075202j3167438j4405060j5370609
14260C95270398j5699212j6056887j6227969j5835969j5874465j4402882j4373008
$$ y = [94118163, 97833393, 101656748, 105569482, 110131740, 114570102, 119468753, 124254331, 129822425, 135419774, 141610016, 147694513, 154580114, 161547587, 168753120, 176889165, 185308760, 193878927, 203240520, 213215689, 223335129, 234169072, 245611025, 257559939, 270243707, 282921067, 296425744, 310351267, 325049930, 339605137, 354877507, 369551647, 384967234, 399662342, 414420605, 428260730, 441597106, 453038229, 462923949, 468312341, 470691233, 471969530, 472453835, 473376334, 473631867, 471644519, 467372850, 460382268, 450288707, 438213505, 425046067, 410641007, 395270398, 379571186, 363514299, 347286330, 331450361, 315575896, 301173014, 286800006]
14253B86800006j3934206j3854149j2423748j2255853j1648856j0525281j0679904
14246B01478009r400222r391573q274426p927104p965780p215147p026020o519962
14238A37757775n616742n149676n767777n231561m965775m534896m153740l670332
14230I8667276l676757m004008l617843k716045l524118l221629k926593k480173
14222G2500110k703542k439460k196863k160335k016666j992912j735135k196598
14214E5058599j228228j508895j708672j389472j861600j102093j273453p98575
14206D4187611j183280j705663j275995r28804j097592p46621p38786j322566
14198C5188304p18206p28429j157153r28856q15294k15936o47818j302605o64672
$$ y = [286800006, 272865800, 259011651, 246587903, 234332050, 222683194, 212157913, 201478009, 192077787, 182686214, 174411788, 166484684, 158518904, 151303757, 144277737, 137757775, 132141033, 126991357, 121223580, 115992019, 111026244, 106491348, 102337608, 98667276, 94990519, 90986511, 87368668, 84652623, 81128505, 77906876, 74980283, 72500110, 69796568, 67357108, 65160245, 62999910, 60983244, 58990332, 57255197, 55058599, 53830371, 52321476, 50612804, 49223332, 47361732, 46259639, 44986186, 44187611, 43004331, 41298668, 40022673, 39093869, 37996277, 37249656, 36510870, 35188304, 34470098, 33741669, 32584516, 31655660, 30840366, 30624430, 29976612, 28674007, 28009335]
14189B8009335o55594o55003m50308n75161m98227l68884q08161l93962n76338
14180B3027697o90738k80322l87382o59450m56001l91411j47547o23538o38462
14171A8752846N3956m26462j38512l62535m52946m84502l68271k70838j61176
14162A6141560k91051n05883j79525k09009j43755m14664k71544l96827K66187
14153A3995489n95781n8889k94643M1629l51708k51751k83115M0580l65696k20486
14143A1655629l17254K18033m48811k02253k31527N93360n75088k72340p8679
14134A0341070j54840m2824k44742k69659l9827j96040q9296l56311J51258p1868
14124I026921l54824o5737N2909l21198L03114o20466N4299m92823L35512l9072
$$ y = [28009335, 27353741, 26698738, 26248430, 25673269, 25175042, 24806158, 23997997, 23604035, 23027697, 22336959, 22056637, 21669255, 21009805, 20553804, 20162393, 20014846, 19391308, 18752846, 18806802, 18380340, 18241828, 17879293, 17426347, 16941845, 16573574, 16302736, 16141560, 15850509, 15344626, 15165101, 14956092, 14812337, 14397673, 14126129, 13729302, 13995489, 13399708, 13340819, 13046176, 13087805, 12736097, 12484346, 12201231, 12241811, 11876115, 11655629, 11338375, 11556408, 11107597, 10905344, 10673817, 11267177, 10692089, 10419749, 10341070, 10186230, 10143406, 9898664, 9629005, 9589178, 9393138, 9303842, 8947531, 9098789, 9026921, 8672097, 8606360, 8659269, 8338071, 8641185, 8020719, 8075018, 7582195, 7917707, 7878635]
14114G878635n5927J6036m90506J29113o0840l3059l38520j87803J77547j38832
14104F895844j43791L95508l83054l46366K94808m60097K78785j58799j0699n65473
14094E796666L04923j64494j62003J0410K46914m94454K14090j5183J27455m21235
14084E443089l5462K1467l80892K57869r6227j21326L601k59019J38421L1940
14074E003461j0889m35956p0304M24089m19481M7105J5532o8953K96306r1494
14064D689416k64865K21879n09444K46752k28498L69670k27181j74549J59431
14055D282611k09104j4288j38584J84552n7893J3242l95559j97483K53187J18422
14045C839103k14513K13386k44485N0397l15244M747J48141M8005p132o2165l27940
$$ y = [7878635, 7822708, 7838744, 7348238, 7477351, 7416511, 7383452, 7044932, 6857129, 7034676, 6895844, 6752053, 7147561, 6764507, 6418141, 6712949, 6252852, 6531637, 6372838, 6362139, 5796666, 6101589, 5937095, 5775092, 5785502, 6032416, 5537962, 5752052, 5736869, 5864324, 5443089, 5407627, 5429094, 5048202, 5306071, 5209844, 5088518, 5092119, 4833100, 4971521, 5003461, 4992572, 4556616, 4486312, 4910401, 4490920, 4538025, 4553557, 4484604, 4780910, 4689416, 4424551, 4646430, 4136986, 4383738, 4155240, 4524910, 4297729, 4123180, 4282611, 4073507, 4059219, 3920635, 4105187, 4047294, 4060536, 3664977, 3467494, 3720681, 3839103, 3624590, 3837976, 3593491, 3643888, 3328644, 3333391, 3481532, 3529537, 3522405, 3460240, 3132300]
14034C132300J72559q8396K09170j37774K41809k37475P971k92554K43214q16819
14024B434005P73150l62423M07796m15584J60683l7317j56732J04095m5816J15436
14014B977293k54146K7879J25045j43108j45784p8823M6923J2644Q4043J65528
14004B817494k91672K27964j72437l25297j03598M40917k28787k95093K60270
13995B329761j75388L27179J6387J901L18569O67606J419133L217334O536645
13986A4659127J4404794J6429704j5513995A4603952n755500k609311j482559
13979D756582l15929o25056K11700p73487j0027p9491m07471K27333o419m07912
13969B569823j98998L07720L6255K29057j30026n40257Q4565q5883L4486k05849
$$ y = [3132300, 3304859, 3216463, 3425633, 3287859, 3529668, 3292193, 3300164, 3007610, 3250824, 2434005, 3207155, 2844732, 3252528, 2836944, 2997627, 2960310, 2803578, 2907673, 2861857, 2977293, 2723147, 2751026, 2876071, 2732963, 2587179, 2508356, 2555279, 2567923, 2651966, 2817494, 2525822, 2753786, 2581349, 2256052, 2152454, 2593371, 2364584, 2069491, 2329761, 2154373, 2481552, 2497939, 2499840, 2818409, 3486015, 4905148, 8122482, 14659127, 29063921, 45493625, 29979630, 14603952, 8848452, 6239141, 4756582, 4440653, 3815597, 4027297, 3253810, 3243783, 3164292, 2756821, 2984154, 2977735, 2569823, 2370825, 2678545, 2714800, 2943857, 2813831, 2273574, 2358139, 2272256, 2306742, 2100893]
13959B100893K18527j07089l82808M82373N8137k54988j63495L57489l73522K59056
13949B194573K2002l43640N1988k88239N68722l65475J26040j78574M01654j54075
13939B034976J21632n02490L1037J29331M5247K60813k93719P1266m5498j55464
13929A697131j93446R8627n8018K51205j83738K89551m29886k77343O42505j47831
13919A688757j28261L2238M05648l51001J55657p23505M73195O7470k97963M4047
13909A366282N31575k58318J37384n80258M0597K17608J44700j79514j30371J25063
13899A414748J13329J11171l21328L49274J35805j35605r6069j49095k09729o2491
13889A150010l1619L91658q9232q699j65454K57661M3846k91320K69508l72139
$$ y = [2100893, 2319420, 2212331, 1829523, 2311896, 2370033, 2115045, 1951550, 2309039, 1935517, 2194573, 2216575, 1872935, 1924923, 1636684, 2205406, 1839931, 1965971, 1787397, 2189051, 2034976, 2156608, 1654118, 1685155, 1814486, 1859733, 2120546, 1826827, 1898093, 1852595, 1697131, 1503685, 1602312, 1544294, 1795499, 1611761, 1901312, 1471426, 1194083, 1836588, 1688757, 1560496, 1592734, 1998382, 1647381, 1803038, 1079533, 1552728, 1620198, 1322235, 1366282, 1897857, 1639539, 1776923, 1196665, 1237262, 1454870, 1599570, 1420056, 1289685, 1414748, 1528077, 1639248, 1317920, 1667194, 1802999, 1667394, 1571325, 1422230, 1212501, 1150010, 1118391, 1510049, 1420817, 1412118, 1246664, 1504325, 1548171, 1256851, 1526359, 1154220]
13879A154220J56740k18563M29791o208p9338j90109J15519j96926K74234k26040
13869A213320m7362M34260j90606k29549j60957K45206N338J33931n65886J86291
13859A023986J06840j76065J10317Q9720q3273J61002j29824O7296l27129O8264
13849I11134L5201j26387L37043J97644j68910O791j24989j4561k22800L20123
13839A150289j06058k74209L30463m37548K44374j23019J22122M3642J49775K7231
13829A127062j22770K0319j13561L2478K27697m1471m04086J82722k6779K20915
13819A102526k08523J83756k12779j13388j14380M09881j32271n4789K03439j12595
13809I50877j13148J15397j83460q6849J15573L6617j16635k2787J06495R9545
$$ y = [1154220, 1310960, 1092397, 1522188, 1515980, 1436642, 1246533, 1362052, 1165126, 1439360, 1213320, 1165958, 1600218, 1409612, 1180063, 1019106, 1264312, 1269650, 1403581, 837695, 1023986, 1130826, 954761, 1065078, 1154798, 1071525, 1232527, 1102703, 1169999, 842870, 911134, 946335, 819948, 1156991, 1354635, 1185725, 1192516, 1067527, 1052966, 830166, 1150289, 1044231, 770022, 1100485, 662937, 907311, 784292, 906414, 950056, 1099831, 1127062, 1004292, 1024611, 911050, 943528, 1171225, 1129754, 725668, 908390, 881611, 1102526, 894003, 1077759, 864980, 751592, 637212, 1047093, 914822, 860033, 1063472, 950877, 837729, 953126, 769666, 682817, 798390, 835007, 718372, 695585, 802080, 901625]
13799I01625Q4104m1377L53013m14860J9666O4247O9680p8654q5921l1028j25382
13788G15113N389j51184L08271j43043J00499l21808L88033r6790k84093R1492
13778F11879K55414P7485p99B47281P31192j30436J05317k78375r1739J97495
13768G80735m8630p8252J77670j11933o8307J19763K9147j5989m7138j36859K37532
13757H37739q6301k37334M06679j20536K11588m07673L45321L8576o0289m5556
13747H82214l22694J02903J74919J4835k63389J78080l50439J45194J22217J26474
13737H10314O0679k70170k76229L18824j47333K24941j10426R0795j76351M6925
13727E71969K61797k04386j18697P8896J90462l31201J41233k38064J97150K96772
$$ y = [901625, 985729, 944352, 1297365, 882505, 902171, 966418, 1036098, 957444, 871523, 840495, 715113, 720502, 569318, 877589, 734546, 835045, 513237, 901270, 804480, 520387, 611879, 867293, 944778, 943979, 247281, 978473, 848037, 953354, 674979, 583240, 780735, 732105, 653853, 831523, 719590, 651283, 771046, 800193, 784204, 737066, 600207, 837739, 751438, 514104, 920783, 800247, 1011835, 604162, 949483, 988059, 927770, 882214, 559520, 662423, 837342, 852177, 588788, 766868, 416429, 561623, 683840, 810314, 870993, 600823, 324594, 643418, 496085, 721026, 610600, 701395, 525044, 571969, 833766, 629380, 510683, 589579, 780041, 448840, 590073, 352009, 549159, 845931]
13717H45931l50412K32344J79415l52131J0093m8906O3899o1822K17435j09643
13707F26203K71968j91698J8039j84025p0326K32072j54912J34244k05906J42350
13697F18009K79946l49075j57938j7792J68147J34100C13881L20792M089q3916
13687E54846J91299j55197j10867Q4352J4682O7500K999k22808M3655j13616K37709
13676E94554k20105J36600N7507j03836j24801M31016B98333M16922J23686l08794
13666E30147j58054J09591K11078K1317l48661m4885K46186j65592j94504O15787
13656H22410C70924j85336J22077p9988O3481m198J29465K97834B28885k6234
13646B02651M48569k61357J50886m3121n1740A07841K02504J16704O262J7411
$$ y = [845931, 495519, 727863, 907278, 555147, 565240, 516334, 580233, 518411, 735846, 626203, 898171, 706473, 724512, 540487, 470161, 702233, 547321, 681565, 475659, 618009, 897955, 548880, 390942, 373150, 541297, 675397, 313881, 634673, 638762, 554846, 746145, 590948, 480081, 564433, 579115, 646615, 649614, 426806, 470461, 356845, 594554, 374449, 511049, 568556, 464720, 339919, 770935, 298333, 715255, 838941, 530147, 372093, 481684, 692762, 714079, 365418, 320533, 566719, 401127, 206623, 822410, 370924, 185588, 307665, 227677, 291158, 286960, 416425, 714259, 228885, 202651, 651220, 389863, 540749, 497628, 445888, 107841, 310345, 427049, 433311, 450722]
13636D50722j94708N77168C22679K49451j13682P8157A93674L34577j88997A50977
13625B72322O3832l5861K60373B70749J71620L8664j57464K59982j07407j29541
13615C46603A62953K84324K35549B39145J87917N5419m1620p037J16165D2413
13604C53424J32229B34489M72722k53864m9022j10331J9271L06235k60088A78787
13593C04126J67127j21290K19169k69437m5471G0785L87418j33122j2248J52307
13583D65140k21952J9052q0402K23002J1201L45061k92608K79007j63647o8900
13573E14954j26289L1408K20466k32748J46498j5281J47679C08557L93574A99399
13562E71233k31860D6184K63360j22890N37201A72574o1016K34229A34746J32889
$$ y = [450722, 256014, 833182, 322679, 572130, 458448, 536605, 193674, 528251, 339254, 150977, 272322, 336154, 300293, 560666, 270749, 442369, 481033, 323569, 583551, 476144, 346603, 162953, 447277, 682826, 239145, 427062, 482481, 440861, 433824, 549989, 42413, 353424, 485653, 234489, 707211, 453347, 404325, 293994, 313265, 619500, 359412, 178787, 304126, 471253, 349963, 569132, 299695, 254224, 70785, 458203, 325081, 312833, 465140, 243188, 262240, 181838, 404840, 416041, 761102, 468494, 747501, 583854, 514954, 388665, 420073, 640539, 407791, 554289, 539008, 686687, 308557, 702131, 199399, 571233, 339373, 46184, 309544, 186654, 723855, 172574, 111558, 345787, 134746, 267635]
13552B67635j7410K22615j94595L74281r1610A93059O1976j26959O77444j20065
13542F85455A56940k3777p653K00248j49187L17469q9418R9356j30020m5345b17655
13530G2730J76492M0727B4105J81952D2169K16048J80102j90671m0481K57458
13520D64625J43630k31333j46927q0796K0221L92046k71771j22035L59609A76001
13509B03830O2310r5414K61810j83813Q0521Q9472j27280L0175A59187J44298
13499C03485M9307P4031A7450M19165B0892K91279L8963J26954I5226P0547o4873
13488A00900K17764H0659L51858F17e0408D14956E9434K53511O9569K41510l1324
13477E92700K6676k90943A7744M52610A88572M3821F4115J27950l3388J32235
$$ y = [267635, 250225, 472840, 278245, 652526, 560916, 193059, 255035, 128076, 805520, 685455, 156940, 133163, 125510, 325758, 176571, 494040, 404622, 503978, 373958, 328613, -217655, 72730, 249222, 289949, 24105, 206057, 42169, 258217, 438319, 247648, 207167, 464625, 608255, 376922, 229995, 149199, 169420, 561466, 289695, 167660, 527269, 176001, 203830, 266140, 170726, 432536, 248723, 329244, 418716, 291436, 321611, 159187, 303485, 352792, 426823, 17450, 436615, 20892, 312171, 351134, 478088, 95226, 165773, 100900, 318664, 80659, 432517, 617, -50408, 414956, 59434, 312945, 382514, 624024, 592700, 619376, 328433, 17744, 470354, 188572, 232393, 64115, 192065, 158677, 290912]
13467B90912l5066r6656L4993m4620N5292b3086A27534K33968l5835j33865J48665
13456C40467B6447J46353J8254O1181a66920C63541J95754j82561l7005k0799
13446C18930A4427K64360Q6674A81979p7180b00822A66016J52527j9192f3486
13435B83049J19594H9369j7475L01675A438M18800j12764b2604B47696J21461
13425C69157L0204R9861H4317J47265q2973B361J97610M731I3567M0608K48111
13414C82286N4514b52592D48603A02826i7342D84979E8506L64104A64447R0598
13404B55045L9045A06090J74669J03104j90848d0585G4095a39791D37566j06202
13394C31364j60194a13009A10624K93591q9032A10257J40385j12352a50830a230
$$ y = [290912, 255846, 159190, 194183, 149563, 204855, -23086, 127534, 361502, 325667, 191802, 340467, 26447, 172800, 191054, 252235, -166920, 363541, 559295, 376734, 339729, 318930, 14427, 278787, 365461, 181979, 104799, -200822, 166016, 318543, 299351, -63486, 283049, 402643, 89369, 71894, 373569, 1438, 420238, 307474, -22604, 247696, 369157, 399361, 499222, 84317, 231582, 148609, 2361, 199971, 204702, 93567, 134175, 382286, 436800, -252592, 448603, 102826, -97342, 484979, 58506, 422610, 164447, 255045, 294090, 106090, 280759, 383863, 193015, -40585, 74095, -139791, 437566, 331364, 171170, -113009, 110624, 404215, 315183, 110257, 250642, 138290, -150830, -1230]
13383A31613a01087A67938a9892B19187D2239J81169K52080b15388A00803J34261
13373B35064k0898K21498j47253n4766n9522E5897g2491C77735j35912J45621
13363C87444N7207A81308K9927L63767A43685N8794o382L6181r5670A6582J55823
13352A72405I74J11705R9631n7586G3246K47161N9386E5868J33644l8961o3758
13341H6793M67134k76479J47245c6824E62800k10133j4055j40502R4379j22774
13331A69715H0899O0148k1141P2763I3727L82950j47230L6661A56571o2437L43791
13320D37925a5206C84480D0055J68776A03029K46390M3853A94373C8861K63638
13310C02499n7736Q9180B1425J77453M3540D7860J7422M27127G3575K32703A09055
$$ y = [131613, -101087, 167938, -19892, 219187, 42239, 223408, 475488, -215388, 100803, 235064, 214166, 435664, 288411, 233645, 174123, 55897, -72491, 377735, 241823, 387444, 444651, 181308, 211235, 575002, 143685, 202479, 196097, 232278, 136608, 16582, 172405, 974, 112679, 212310, 154724, 73246, 320407, 379793, 55868, 189512, 150551, 86793, 553927, 277448, 424693, -36824, 562800, 352667, 338612, 198110, 292489, 169715, 80899, 141047, 119906, 192669, 93727, 476677, 329447, 366108, 156571, 94134, 437925, -15206, 384480, 40055, 208831, 103029, 349419, 393272, 194373, 38861, 302499, 244763, 333943, 21425, 198878, 242418, 47860, 65282, 492409, 73575, 306278, 109055]
13298A92416O8558D2772O0706c5708B68528l8583A8119J31484K31720c254B7852
13286A86689J6038m6359c3699I473J50903J46756a24717A26303P5159C0089J53246
13275A83335L50580A06645a48962A18028j7537J86883A21994b89931A37169b7457
13264C84599j61450J44667k4837r5993p5110J34759A24975K46633I7872b84084
13253A48612l3974J61835o44K0901A28409i7424r2782E95515k33716A66094L25594
13242D91688j57463j38230a26810B93746j33325n9097K85864P9722j07050e2872
13231A51023C7647M76976I3442e9896n7658K2974D11509E3634J72765K00317H6455
13219b24039A41859J28973m2304p9391b52587L9973C48858A47912K30628j37812
$$ y = [192416, 260974, 42772, 103478, -35708, 268528, 229945, 18119, 149603, 381323, -3254, 27852, 186689, 202727, 156368, -33699, 9473, 160376, 307132, -124717, 126303, 201462, 30089, 183335, 533915, 106645, -148962, 118028, 100491, 287374, 121994, -289931, 137169, -27457, 384599, 223149, 367816, 342979, 246986, 171876, 306635, 124975, 371608, 97872, -284084, 148612, 114638, 276473, 275829, 296730, 128409, -97424, -190206, 595515, 361799, 166094, 491688, 334225, 195995, -126810, 293746, 160421, 101324, 387188, 466910, 359860, -52872, 151023, 37647, 514623, 93442, -59896, -117554, -94580, 411509, 53634, 226399, 426716, 86455, -224039, 141859, 270832, 228528, 149137, -252587, -212614, 348858, 147912, 378540, 240728]
13209B40728a44083B38847F3940a44673H2888L9787c04259g219A63860B215J04696
13198A06911Q0881J03311F4789h0205A168K36469p5908L60973B13742Q2021d8382
13186B9451N5642K08515q971l8081E7928J82501K0861j20523N8316K3249n7185
13175A65147b10227N6227e0646j35123A7555h8129j5130A77818K13238i3276E4362
13163B99603M02080b12643A3865J43212n8960f7105I4983N8829a55304b8403A44394
13151E00637o3540b4104q5141K0853A61099h8460D80006H3066e9620A36487D333
13139A35541g2089R064A36040J05168B1051L44091j40993i3054A42882Q4599j09218
13128A18263L1468a38937A63663m2381a15134A77133n4291k4099O8871c63360
$$ y = [240728, -144083, 238847, 63940, -144673, 82888, 122675, -304259, -7219, 163860, 2215, 106911, 187792, 291103, 64789, -80205, 1168, 237637, 161729, 522702, 213742, 295763, -48382, 29451, 85093, 293608, 284637, 246556, 57928, 240429, 261290, 140767, 199083, 222332, 165147, -210227, -154000, -50646, -185769, 17555, -88129, -103259, 177818, 391056, -93276, 54362, 299603, 701683, -212643, 13865, 157077, 98117, -67105, 94983, 153812, -155304, -28403, 144394, 500637, 437097, -24104, -109245, -88392, 161099, -88460, 480006, 83066, -59620, 136487, 4333, 135541, -72089, -63025, 136040, 241208, 21051, 365142, 224149, -93054, 142882, 227481, 118263, 149731, -138937, 163663, 121282, -115134, 177133, 122842, 98743, 167614, -363360]
13117B1618Q4557d0923l8245B98803A9570J57537q2438P3846G8214N1387C132
13105A74963g4555a1645B13160G2753a05689D43376f1278j82792C15378G0702
13094A56719a20422b8305B59332a08997B8852b8458B915L47638A48774A21J27354
13083A27475c63700e9185b1648D0636K18958G9270J92608g5258A3018L13829g2803
13071A4204L59549c53285i0862A26134K14671A53567d368A94124J20521L8285
13061C52930j3466p8961F1588L18401h1155G5900L44747n9756a15760B35817a6403
13049e8711D31272j10324b25289D98121A19560J72859N2015a55277G2280K38833
13039C11113A08629l5949L4358J67692b69874A62249g7118B51438r8465m8695
$$ y = [21618, 106175, -40923, -79168, 298803, 19570, 177107, 94669, 168515, 78214, 129601, 3132, 174963, -74555, -11645, 213160, 72753, -105689, 443376, -61278, -244070, 315378, 70702, 156719, -120422, -28305, 259332, -108997, 28852, -28458, 2915, 350553, 148774, 121, 127475, -363700, -59185, -21648, 40636, 259594, 79270, 271878, -75258, 13018, 326847, -72803, 14204, 373753, -353285, -90862, 126134, 340805, 153567, -4368, 194124, 314645, 352930, 339464, 260503, 61588, 379989, -81155, 75900, 420647, 360891, -115760, 235817, -16403, -58711, 431272, 320948, -225289, 498121, 119560, 292419, 344434, -155277, 72280, 311113, 108629, 72680, 107038, 274730, -269874, 162249, -77118, 251438, 152973, 104278]
13029A04278e6145C06086l8078H154L34550c05358A51970F0017Q2505k5261R0515
13018B07776r3057e7882B53510F4175f9240H2077N320J33248q6347K76589o4883
13007C46004A12420b11309C09295a2973A96708P7941J58229j35281e0538B5064
12996B32621c01608H3868a69470H959J86596o0304b56918a8391C34789j05105
12986B29684q7138J31097I4775K98793a84975Q9687E9898R13i690j59081P9070
12975h9701A79159R4369J07365q1235i0041d1620A99708f5868C5967a99162D20300
12963e5886H615J01269K6934E1024L639Q523K69280A32051B9145J83002a60806
12951B26451b56149A86624a70520E4437Q3369L3308K4602M273c52467A88966d04097
$$ y = [104278, -56145, 306086, 268008, 8154, 342704, -305358, 151970, 60017, 142522, 117261, 207776, 114719, -57882, 253510, 64175, -69240, 82077, 87397, 220645, 134298, 410887, 346004, 112420, -211309, 309295, -12973, 196708, 274649, 432878, 297597, -50538, 25064, 232621, -301608, 83868, -169470, 8959, 195555, 135251, -256918, -18391, 334789, 229684, 142546, 273643, 94775, 393568, -184975, -95288, 59898, 60811, -9690, -168771, -89701, 179159, 273528, 380893, 299658, -90041, -41620, 199708, -65868, 35967, -199162, 420300, -55886, 8615, 109884, 136818, 51024, 54663, 63186, 332466, 132051, 29145, 212147, -160806, 226451, -256149, 186624, -170520, 54437, 137806, 171114, 195716, 199989, -352467, 188966, -404097]
12939b11380B70149a27731F1235J98935c9323A22963f94B40230j17291b2850D3772
12927C0944M7127a1402A04639a6131n484j72913B92016A23959a04636J9358d174
12915a39496A35795O025d80661A28367c18330P1984A33003M54826A76838c37252
12904a19776B65252i2280A34949J816M6942c8949I7198J10504I1209j8263K21108
12893B94054E8216a01093I1504J73733j06214b01745g1139d404m27624C86701
12882G4453a05130B67161j33362D720K97935d33294A04368c37741h2315A39324
12871a03974k6518n6194R2832A41535b59865N20A02682O8232c18004B62769a73091
12859E4935P7660a62899e7651q5936N7201L2296r4092b8315o9885A68559K06059
$$ y = [-211380, 270149, -127731, 61235, 260170, -39323, 122963, -694, 240230, 122939, -22850, 43772, 30944, 78071, -11402, 104639, -16131, -21615, -194528, 292016, 123959, -104636, -85278, -4174, -139496, 135795, 141820, -480661, 128367, -318330, -246346, 133003, 587829, 176838, -337252, -119776, 265252, -92280, 134949, 136765, 183707, -38949, 97198, 207702, 91209, 72946, 294054, 58216, -101093, 91504, 265237, 159023, -201745, -71139, -4404, -432028, 386701, 74453, -105130, 267161, 133799, 4720, 302655, -433294, 104368, -337741, -82315, 139324, -103974, -130492, -186686, -93854, 141535, -259865, -259345, 102682, 170914, -318004, 262769, -173091, 54935, 132595, -162899, -57651, -143587, -86386, -54090, -148182, -28315, -98200, 168559, 374618]
12848C74618A21907K09245F5744L29728q1963c29406A87238R1553J52808B6239
12837g8718B81539A25410J44485a97153G4558b25975A64377G1726J75391q5780
12827A61337J3152g2224o2647a8997A6933L91437b10472b0969B14452o2233d4755
12815A40616b05686A35444N8806h9192L7786B00333a75644l0474A51010P7688
12805B28698q5554l0471P8818Q4565c33592A88471h3019j64974A3823a39502k55630
12794c95132J50763J0444A84121o4224e0704A38038m4060f9876c4429r222j19971
12783a63622A40413b3455r2397L097c0448n3209q0647A27237j6354M24108F5598
12771c25207A24494a54575O0120B89848a49271F4311J48047J07484a36514A75180
$$ y = [374618, 121907, 331152, 65744, 395472, 313509, -329406, 187238, 278791, 431599, 26239, -78718, 281539, 125410, 269895, -197153, 74558, -225975, 164377, 71726, 247117, 161337, 174489, -72224, -134871, -18997, 16933, 408370, -210472, -20969, 214452, 152219, -44755, 140616, -205686, 135444, 194250, -89192, -51406, 200333, -175644, -206118, 151010, 228698, 143144, 112673, 191491, 276056, -333592, 188471, -83019, -247993, 13823, -139502, -395132, -244369, -233925, 184121, 119897, -50704, 138038, 93978, -69876, -34429, -43651, -163622, 140413, -23455, -115852, -112755, -30448, -83657, -164304, 127237, 110883, 534991, 65598, -325207, 124494, -154575, -94455, 289848, -149271, 64311, 212358, 319842, -136514, 175180]
12760h6464B97810c6002B1867a77183A27689H943d7474A151J94534C1389J39173
12749A70562J17093f5141A01841C5674K0302O6347Q1290o4629c0253q2058e176
12737A04885J75439D5576J20822N1905f1034j37984B67203j13511a90288A69216
12726C5559j6531R8704C7555J7542L6695k0038B3373J08142n4716a31979G8477
12714E5673f7087K1477j3457C92928A78371K07432A57713K46085E6341J68497
12704B24838J42103p2622P9282b32919d0398A08758b0156B35590i4162B01868
12693g9119c6394A34057J68508j07950a5392j0579l06801P6133C12345A6210i5675
12681a23547E65731A95552b0100F477R9503R681N11246G5859b36719A85160l5052
$$ y = [-86464, 297810, -36002, 21867, -177183, 127689, 8943, -47474, 1151, 195685, 31389, 170562, 287655, -65141, 101841, 35674, 55976, 122323, 203613, 138984, -30253, -112311, -5176, 104885, 280324, 45576, 166398, 218303, -61034, -199018, 267203, 153692, -190288, 169216, 35559, 19028, 117732, 37555, 55097, 91792, 71754, 23373, 131515, 76799, -131979, 78477, 55673, -67087, -45610, -59067, 392928, 178371, 385803, 157713, 403798, 56341, 224838, 366941, 294319, 373601, -232919, -40398, 108758, -20156, 235590, -94162, 201868, -79119, -36394, 134057, 302565, 194615, -15392, -25971, -332772, -256639, 312345, 16210, -95675, -123547, 565731, 195552, -20100, 6477, 105980, 115661, 626907, 75859, -236719, 185160, 150108]
12670A50108b20281B28667p4237a41777J3525A99471a5210A7579b09744C59987
12659A87693R9617K5452A08875a11799A34446M5990D2246J2017J69945G4684p305
12648F7379b05019B04449a35726C65316a14602H831M1392L948c1540n6475I0475
12636D25180f5622D96206D3080N8206a8065A28210L58519f2663D9883Q986M7537
12625A06406a26709D98764B09662o1716J93818a40001g371A78284i4889G8560
12614b34648F9331O3455e5477r9541A77401K72355A64660m0832a23237c1269C22462
12602B22260n1218b6087m1780C04275n3614G8760R4650N9306a83615N7917A24676
12590A31106n275K8731a91191G8632b75475c1751j84241h5141k02627A6461a64712
$$ y = [150108, -220281, 228667, 154430, -141777, -128252, 199471, -15210, 17579, -209744, 359987, 187693, 287310, 312762, 108875, -111799, 134446, 180436, 42246, 54263, 224208, 74684, 67379, -205019, 204449, -135726, 365316, -114602, 8831, 50223, 54171, -31540, -88015, 90475, 425180, -65622, 496206, 43080, 101286, -18065, 128210, 486729, -62663, 49883, 58869, 106406, -126709, 498764, 209662, 147946, 341764, -140001, -7371, 178284, -94889, 78560, -234648, 69331, 132786, -55477, -155018, 177401, 449756, 164660, 123828, -123237, -31269, 322462, 222260, 171042, -26087, -67867, 304275, 250661, 78760, 173410, 232716, -183615, -125698, 124676, 131106, 125831, 154562, -191191, 78632, -275475, -31751, -215992, -85141, -287768, 16461, -164712]
12578d3930n7039A36981K15050b34609c2634l09204C7566d6284H2090h4909a9321
12566a92057A9491M37327I860K745L17295A41800l6666J12999h1997k17311A77329
12554A1952b72558A27407a86730c8404m5580j91717N1955A98585h0470C21636
12543B83924d69066I6807B7157K86904m6272c4834j27600l5450h5277B3341J8866
12532D2207M4624b84200A43669J68653b00229E6991O6960a53398l1548F5373a40206
12520D51303B24758a72473B07383b19790L7967G2491K6502i6784A23195a77735
12509d6090A38441b62777b5132j35207A96038o9811b36950H6644D915J74633C1893
12497a15801B07776A01541J03730d4085A20481L4398c4625A53306c7753G284h6144
$$ y = [-43930, -100969, 136981, 352031, -234609, -32634, -341838, 37566, -46284, 82090, -84909, -19321, -192057, 19491, 456818, 9860, 12605, 329900, 141800, 105134, 218133, -81997, -299308, 177329, 11952, -272558, 127407, -186730, -38404, -83984, -275701, -223746, 198585, -80470, 321636, 283924, -469066, 96807, 27157, 314061, 267789, -34834, -162434, -197884, -85277, 23341, 42207, 86831, -284200, 143669, 312322, -200229, 56991, 123951, -153398, -184946, 65373, -140206, 451303, 224758, -172473, 207383, -219790, -181823, 72491, 98993, -96784, 123195, -177735, -46090, 138441, -262777, -25132, -160339, 196038, 126227, -236950, 86644, 4915, 179548, 31893, -115801, 207776, 101541, 205271, -44085, 120481, 154879, -34625, 153306, -37753, 7284, -86144]
12485a38417N0332I3557J31278a73075A47235a13044F9045J55845b94193F6424
12474b06159B03696E9412a03423b6726E8648c72552l6400B94289B6672K8288b4052
12462d4003e571m2036r4091B52966I699b30882b213B59880e2718B00849h7979
12450d2837J6424E32798b02686q1222h273j42649C7868c38411i4358A47290g819
12438I5670a13257A63708I967a7155B66025f4864l0732k80318A35339J04303e9463
12426b73958F3832b84538A28161e1512j44257D05147a95221E0990c01025D8472
12415A8922A57b42145a08913B7265a75016b3771E1972b23714f0960I9598O8280
12404A67878a61101I7648K15451b93634A17776M5870b8451H0285J1280O5667b89243
$$ y = [-138417, -88085, 93557, 224835, -173075, 147235, -113044, 69045, 224890, -294193, 66424, -206159, 203696, 59412, -103423, -26726, 58648, -372552, -408952, 294289, 26672, 54960, -24052, -44003, -5571, -47607, -141698, 252966, 9699, -230882, -2213, 259880, -52718, 200849, -87979, -42837, -26413, 532798, -202686, -283908, -8273, -150922, 37868, -338411, -94358, 147290, -7819, 95670, -113257, 163708, 9967, -17155, 266025, -64864, -95596, -375914, 135339, 239642, -59463, -273958, 63832, -284538, 128161, -51512, -195769, 405147, -195221, 50990, -301025, 48472, 18922, 157, -242145, -108913, 27265, -175016, -23771, 51972, -223714, -60960, 99598, 167878, -161101, 97648, 313099, -293634, 117776, 163646, -28451, 80285, 91565, 157232, -289243]
12392B66391a24099r5246D3931L9816M2944F0327M6097P4943J16099b01808o3181
12381b64989A06801b47446K4320R568H3389b7293n3318B53538n3321B9810K01125
12370B30935a49027A92705a01384k59A48696a35069c2904G9561N105a12429J2200
12359a00229A36903n9247N5449a81586C75300a47143C4137M35072b5315H2318
12348I916d4830K0539A61100a89804B22489f174H1300J35564E4119p916K00059
12337B46262m8790b19337N740B26049a73730D32341i8767C72148a15850A22903
12326a21350F2329g0082n4940C84105c659A29501f3924j83180d1956I907e2485
12314c3241q9154B6649N3272f3809l9800m5672B15916i0272B94682j37687J86631
$$ y = [266391, -124099, -219345, 43931, 83747, 126691, 60327, 106424, 181367, 297466, -201808, -264989, 106801, -247446, -223126, -213558, 83389, -27293, -80611, 253538, 200217, 29810, 230935, -149027, 192705, -101384, -101643, 148696, -135069, -32904, 79561, 84666, -112429, -100229, 136903, 77656, 133105, -181586, 375300, -147143, 34137, 469209, -25315, 82318, 9916, -44830, -24291, 161100, -189804, 222489, -6174, 81300, 216864, 54119, 46203, 246262, 197472, -219337, -213597, 226049, -173730, 432341, -98767, 372148, -115850, 122903, -121350, 62329, -70082, -125022, 384105, -3659, 129501, -63924, -247104, -41956, 9907, -52485, -33241, -122395, 26649, 79921, -63809, -103609, -149281, 215916, -90272, 294682, 156995, 343626]
12303C43626f0924r6975E9044K52720A17698f0238n0228C0886N0871e8510A48032
12291A16514L73545A13791d5786k06506c1129j73461A29135O7293B8411L7630
12281F6041J20864b9233B97906b95447a6285B74471r1310H2541Q1695g7779B86957
12269e0079C1062M6350i7608l3492A29686M5297K60918H5395g6357A95746a11607
12257A21729m2321i3565C30907a6588B36010K1446N5173D8963L57192b37914j7731
12246b55645A36050N8943J09119A33489m3667B5032P7686n368O3639n687J0295
12235A65597L5141j1590E9630A7980O1383N6828L5565g1938K8329A86010J8831
12224B04841M40275k83341A73846L41259k11867h867l55261A44177m3409l924
$$ y = [343626, -60924, -157899, 59044, 311764, 117698, -60238, -110466, 30886, 81757, -58510, 148032, 116514, 490059, 113791, -45786, -252292, -31129, -204590, 129135, 196428, 28411, 66041, 186905, -29233, 297906, -295447, -16285, 274471, 183161, 82541, 164236, -77779, 286957, -50079, 31062, 77412, -97608, -131100, 129686, 174983, 435901, 85395, -76357, 195746, -111607, 121729, 79408, -93565, 330907, -16588, 236010, 257456, 312629, 48963, 406155, -237914, -255645, 136050, 194993, 304112, 133489, 89822, 25032, 102718, 97350, 160989, 155302, 165597, 200738, 189148, 59630, 17980, 79363, 136191, 171756, -71938, -43609, 186010, 204841, 645116, 361775, 173846, 515105, 303238, -8867, -364128, 144177, 100768, 96844]
12214I6844K32068b37909A55784j0251J31974K2592a23704H9125J40594J37166
12204C66885h0480A25233L08736A50578d4293I6413k143L21435j44834e8081C40645
12192C65203j74623a66366D10678d6596A68207a63345o0158I3271J00733b44790
12181C57924A51406i926j27571D27353H0065R5185L20085F3755K2718M6866a80434
12169A88798c57506F7793J8762L21780A41163i8851B1445a67872l5819E11780
12158G7708a7981D52559a44802C56508b9428C55980A13214K65994C747J54402
12148A58149A9572c04715G657K6445M1208Q1509j0198n6083i22C29002a53917
12136a3502I3637a79313j43824J54487A2424J74189d3903A7366h707j37818m9721
$$ y = [96844, 328912, -237909, 155784, 145533, 277507, 300099, -123704, 89125, 229719, 366885, -80480, 125233, 433969, 150578, -44293, 96413, 94270, 415705, 270871, -58081, 340645, 365203, 190580, -166366, 410678, -46596, 168207, -163345, -223503, 93271, 194004, -244790, 357924, 151406, -9926, -137497, 427353, 80065, 175250, 495335, 63755, 86473, 133339, -180434, 188798, -357506, 67793, 86555, 408335, 141163, -98851, 21445, -167872, -203691, 511780, 77708, -17981, 452559, -144802, 356508, -29428, 355980, 113214, 379208, 3747, 158149, 19572, -304715, 7657, 34102, 75310, 156819, 146621, 90538, -922, 329002, -153917, -13502, 93637, -179313, -323137, -168650, 12424, 186613, -43903, 17366, -8707, -146525, -196246]
12125a96246A3635K23582c19368c0969p7878e2171q244j6662k47003a11051b455
12113a8668j21590n721e8419F7227K3500g0761A28162b5872F6096J8320a03822
12101D8138a52639g3187l3829J1552l16928g2233A21944b43804B5445c8454j41956
12090a80410A98041E717a28043r2455h7633A88655b64323I1505c6702A6883b863
12078D68737A71593J34844K16952M20292P37965l30091B05197K07855g6087A97530
12067C75103j70591F7472B470K76141e5691m4420B9253f2342A90703H0486e4485
12055c4516C5267p770a6254C3618B080a29230M3315D087O8935E045O6426d0747
12042B02376a0879o3047B62529f7702B76323H3972j411a45605O3444k2275k64314
$$ y = [-196246, 13635, 237217, -319368, -30969, -108847, -52171, -60415, -77077, -324080, -111051, -2455, -18668, -140258, -145979, -58419, 67227, 90727, -70761, 128162, -25872, 66096, 84416, -103822, 48138, -152639, -73187, -107016, -95464, -412392, -72233, 121944, -243804, 25445, -38454, -180410, 198041, 5717, -128043, -220498, -87633, 188655, -264323, 91505, -36702, 16883, -2863, 468737, 171593, 306437, 523389, 943681, 1681646, 1351555, 205197, 413052, -76087, 197530, 375103, 204512, 67472, 2470, 278611, -55691, -100111, 29253, -62342, 190703, 80486, -54485, -34516, 35267, 27497, -16254, 33618, 2080, -129230, -85915, 4087, 73022, 5045, 71471, -40747, 202376, -10879, -73926, 262529, -67702, 276323, 83972, 82561, -145605, -82161, -104436, -368750]
12031c68750E1445J23528a78443O8579J1630j16623A88032a93825Q9503D58733
12020A82975F6676a8379A65532B6569a04485A84561F4350b29434e4231n0714n6954
12009a61899d6450n2636F9533J92886G7869K0691c7267A01581B9428c7599D93812
11997a9102F0861a76717H1135e8314q4686F7559L0543R1380E2252N816a77331
11985a7100B59217i9606I5248j555b34044L1979A02258j9317i9315k43583A74841
11973A37376a15932I389N0646e6891C9277a4922m469I572J79944a47010A00188
11961B21410j08999k8521A8556o025b539k25272O3456A6101a48448k53261a95960
11949B2213J51530c9042j65712l4100E3669a08264J7041M1700a3406C5803J96097
$$ y = [-368750, 51445, 174973, -178443, -109864, -98234, -214857, 188032, -193825, -104322, 458733, 182975, 66676, -18379, 165532, 26569, -104485, 184561, 64350, -229434, -54231, -104945, -161899, -46450, -99086, 69533, 262419, 77869, 98560, -37267, 101581, 29428, -37599, 493812, -19102, 60861, -176717, 81135, -58314, -143000, 67559, 98102, 189482, 52252, 58068, -177331, -17100, 259217, -99606, 95248, 93693, -234044, -202065, 102258, 82941, -99315, -342898, 174841, 137376, -115932, 9389, 60035, -56891, 39277, -14922, -19391, 9572, 189516, -147010, 100188, 221410, 112411, 83890, 18556, 12531, -2539, -227811, -164355, 16101, -148448, -401709, -195960, 22213, 173743, -39042, -204754, -238854, 53669, -108264, -91223, -49523, -13406, 35803, 231900]
11938B31900a47164j02805a08305C66773j15888K6711h3469C94178j77465n2300
11928A64413p2397K9704D683b19248B36992A07080d58535C80159I0368C7130G462
11916b68917d8635k54251C60753c5873C13848b1617H6858c67003D1364M5361a03782
11904a70789e2332C7580L33527q4446G4304b25068M6626g0445C05580c71374P2849
11893b98525a6929p5013H1995L01197a0645A32205g0750j48593A43191D4616a93872
11881A7547K35502F3370b51076B3139f9704I5158d7799k87492e1026F1713f4966
11869A08870c83843J56312B26768c99099I4934d8011G3169j9646f917k24621b7659
11857a88933L4755M9364j26920B59857k5246a2200k63374p0101A34783d22414
$$ y = [231900, -147164, -249969, -108305, 366773, 250885, 277596, -83469, 394178, 216713, 164413, 92016, 121720, 4683, -219248, 236992, 107080, -458535, 380159, 90368, 37130, 7462, -268917, -48635, -302886, 360753, -35873, 313848, -21617, 86858, -367003, 41364, 86725, -103782, -170789, -52332, 37580, 371107, 286661, 74304, -225068, -178442, -70445, 305580, -371374, -298525, -16929, -91942, 81995, 383192, -10645, 132205, -70750, -219343, 143191, 44616, -193872, 17547, 253049, 63370, -251076, 23139, -69704, 95158, -47799, -335291, -51026, 61713, -64966, 108870, -383843, -227531, 226768, -399099, 94934, -48011, 73169, 53523, -6917, -231538, -27659, -188933, -154178, -104814, -231734, 259857, 234611, -12200, -275574, -345675, 134783, -422414]
11846B80179A8981c64905H3323R0051D8292d0501k55226D0996J90318D9253a08504
11834E5169P4409b74336I6933b9042p2161h532D35208b75167f4304A94877c01448
11822D4903b10533k21614a0746j20550h065m17812a54253A48251i8516d3240j8146
11811f1386j57361g0017a2768p1068q5980a0355E1371a14785A35457L4372D3867
11799b18189B0410g6282I1810J4380B2247b13422B22480I7136a06100K691A2657
11787b1231B0760b00542c4058C2597d4379j69125A36449a02525E1084c56456A56506
11775a41502f2733A84052o5089c77699a56205A81033O9669P8353a49005O0286
11765h8719A49661N2543d5111C81157F1959J38333k0177i5711M1930a6948F5807
$$ y = [280179, 18981, -364905, 83323, 173374, 48292, -40501, -295727, 40996, 231314, 49253, -108504, 55169, 129578, -274336, 96933, -29042, -101203, -8532, 435208, -275167, -64304, 194877, -301448, 44903, -210533, -432147, -10746, -131296, -8065, -425877, -154253, 148251, -98516, -43240, -61386, -218747, -70017, -12768, -83836, -169816, -10355, 51371, -114785, 135457, 169829, 43867, -218189, 20410, -76282, 91810, 106190, 22247, -213422, 222480, 97136, -106100, -103409, 12657, -21231, 20760, -200542, -34058, 32597, -44379, -213504, 136449, -102525, 51084, -356456, 156506, -141502, -62733, 184052, 118963, -377699, -156205, 181033, 250702, 329055, -149005, -88719, 149661, 202204, -45111, 381157, 61959, 200292, 180115, -95711, -53781, -16948, 65807]
11753C01192o6510A4793c00390A54618b20166c1397j19392G0688c29802a55580
11742a67215C4960a94985j67302J00414k1558A12904a22784C43264h1056A75713
11731A2663L3945J02837J3032J06275F6832a08359d8596A00850P7801K21330D2490
11719a0813j11777C24647B7655b02617G1667G393a56055L4454A25387J15470m8772
11708A92085b23727R1530K549B62279A15080O8228K6093E8375J23927F1826Q4285
11697A46111a02158J0535H7832k5198K78280j12931H3938f7421j21252A3500J48228
11686A61728b6150j10395b3923A94372l4036E5918L29280f1390m7450K6134l426
11675h6132C15280m2233a17346A93716l8414b1650q5781A3573R9120h045j50438
$$ y = [301192, 234682, 14793, -300390, 154618, -220166, -31397, -150789, 70688, -329802, -155580, -167215, 34960, -194985, -362287, -261873, -283431, 112904, -122784, 343264, -81056, 175713, 12663, 46608, 149445, 162477, 268752, 66832, -108359, -48596, 100850, 178651, 399981, 42490, -10813, -122590, 324647, 27655, -202617, 71667, 7393, -156055, -121601, 125387, 240857, 192085, -223727, -132197, -129648, 262279, 115080, 183308, 209401, 58375, 182302, 61826, 146111, -102158, -91623, 87832, 62634, 340914, 227983, 83938, -67421, -188673, 13500, 161728, -26150, -136545, -23923, 194372, 160336, 55918, 385198, -61390, -108840, -82706, -86132, 315280, 273047, -117346, 193716, 155302, -21650, -107431, 13573, 112693, -8045, -158483]
11664a58483A3003i180j59712B3257M5381K07932q66I7535L45667b61150a2984
11652A06370J9988r312D4645c48951a01206j32211E1885b9389B75635d0144B74715
11640h8019B20662r6446a42502C3816K86069B5049I252J69120B0310K49293J289
11629B70892E5553b16690Q0141A63537a21198C78562K7306b64290d5753K326l37292
11618c80719I0922c7116A14965C7974h8306D0715A0789D725K19273I2906b17211
11606A12078R9621a6008j68517B50464B6537J28758J58221K1195b68117E8839
11595i9450j02301B76118j32542J02384a77955D6824c48096B01696C4706K43599
11585B78305j15211m0256P8228q9413n0214K67178A51829e1219m2678B49414E5630
$$ y = [-158483, 13003, -9180, -168892, 23257, 68638, 276570, 275704, 97535, 443202, -261150, -12984, 106370, 126358, 117046, 44645, -348951, -101206, -233417, 51885, -29389, 275635, -40144, 274715, -88019, 220662, 124216, -142502, 33816, 319885, 25049, 9252, 178372, 20310, 269603, 270892, 55553, -216690, -136549, 163537, -121198, 378562, 405868, -264290, -45753, -43427, -380719, 90922, -37116, 114965, 37974, -88306, 40715, 10789, 4725, 223998, 92906, -217211, 112078, 211699, -16008, -184525, 250464, 26537, 155295, 313516, 334711, -268117, 58839, -99450, -201751, 276118, 143576, 245960, -177955, 46824, -348096, 201696, 34706, 278305, 163094, 122838, 201066, 111653, 61439, 328617, 151829, -51219, -93897, 249414, 55630]
11573A90997a02735A5449K27551b25719I1930f3469C07855B47J4649K08591d6340
11561G0228J81758a28050K9008D5171L45629h5780A12153D9339O4433J80999b19095
11549b02732A12504j7571a95389N2525A00235J8162B4592N7300J01374e57j28295
11538a28852j07792a7757E7331a11819B10676d05338B61386a50772D951O8911
11528G3862K405L6641p584h136B19139J3229F0889o477M2537K74682A56369a4774
11515D3407c47812A99417b91206i5505G6021f8807B11448k375m7762J46190p9030
11504B28471p0390J34703f6227D6768L19559j42315P4527j31803F0525A0574R7598
11493A08172N9982a49678k78174B67419f4615A49001K75774a02528G7356B1487
$$ y = [190997, -102735, 15449, 243000, -225719, 91930, -63469, 307855, 247, 14896, 223487, -46340, 70228, 251986, -128050, -99042, 45171, 390800, -85780, 112153, 49339, 113772, 294771, -219095, -202732, 112504, 94933, -195389, -142864, 100235, 118397, 24592, 81892, 183266, -557, -128852, -236644, -17757, 57331, -111819, 210676, -405338, 261386, -150772, 4951, 73862, 76267, 112908, 105324, -8136, 219139, 232368, 60889, 54412, 96949, 371631, 156369, -14774, 43407, -347812, 199417, -291206, -95505, 76021, -68807, 211448, 209073, 161311, 307501, 228471, 158081, 292784, -66227, 46768, 366327, 224012, 298539, 166736, 60525, 10574, 108172, 168154, -149678, -427852, 267419, -64615, 149001, 424775, -102528, 77356, 21487]
11482B1178M7959P3924a00694A26940J38037m0768J40358K2240N325j07582K3153
11471C07703D8497O1597J08203j04323N4250o3476J3997e3772A25616g596C45415
11459A72286k1305g2798A20910J94046j35309H1408M25995B52013K38545j70561
11449C19997Q5299q6650r9817J08314q3112C157J37980E8923J36542F8653J03081
11438A71734J24200A43219P0971L816c5670q1804B05709D5104j9201f8981j30048
11427a99029I10K9522J31666P5853I9938d53049f0615I8636a03173A3807L8377
11416E2184a51003b4299h924p8784a14o7567B31726J8396b84221h8602k1988r5227
11404b05817M8613B436Q6171L3695a62582j14462A55334E0283k2653P7417j1558
$$ y = [21178, 69137, 143061, -100694, 126940, 264977, 224209, 364567, 386807, 392132, 284550, 307703, 48497, 110094, 218297, 113974, 168224, 104748, 118745, -53772, 125616, -7596, 345415, 172286, 150981, -72798, 120910, 314956, 179647, 81408, 507403, 252013, 490558, 319997, 405296, 318646, 218829, 327143, 244031, 3157, 141137, 58923, 195465, 68653, 171734, 295934, 143219, 214190, 218006, -35670, -117474, 205709, 45104, 25903, -68981, -199029, 910, 30432, 162098, 237951, 99938, -453049, -60615, 98636, -103173, 13807, 52184, -151003, -24299, -8924, -87708, -114, -67681, 231726, 250122, -284221, -88602, -110590, -205817, -157204, 2436, 88607, 122302, -162582, -277044, 155334, 50283, 27630, 105047, 93489]
11393I3489J55450b92174A7946b88694b7929G6135c02175D33846a40759j90085
11383c30844O0329E1094l985K27206l0797M9354a60089B01502a41892A54818c06692
11371a57117g6993j2084L0104B7029d6224C1157f056F7206b34739k85190A94598
11359A67178G3721J38205b5614H6487B1578L2145f2550m6294a4308A99344m9508
11348A49836c25759L3585A4392a5486A06667J49405F3137g071m8945A2481Q1285
11337I3766c3202C84907j24048a24434C20331c7820j45797C3407M6628a00561
11326A8661a14297E271c4276F3573b48659i3092A94067D7918m251K1662b58424
11314B11977F9053A8656b1734C9341b9612m4687j57379d9471k52114f977H3272
$$ y = [93489, 248939, -292174, 17946, -288694, -27929, 76135, -302175, 433846, -140759, -330844, -270515, 51094, 47109, 274315, 243518, 292872, -160089, 201502, -141892, 154818, -306692, -157117, -76993, -89077, -58973, 27029, -46224, 31157, -6056, 67206, -234739, -519929, 194598, 167178, 73721, 211926, -25614, 86487, 21578, 53723, -62550, -108844, -14308, 199344, 149836, -325759, -292174, 14392, -15486, 106667, 256072, 63137, -7071, -56016, 12481, 93766, -33202, 384907, 260859, -124434, 320331, -37820, -183617, 33407, 80035, -100561, 18661, -114297, 5271, -34276, 63573, -248659, -93092, 194067, 47918, 43667, 65329, -258424, 211977, 69053, 18656, -21734, 39341, -29612, -74299, -231678, -49471, -301585, -6977, 83272]
11302C6663b31087B62025C7200c8161l8452j7155j97802a03148E8019b08683o8559
11291b77242O8176o814N4243k3424m701n539F1743a3004E336a75083l1012j16949
11279c23044B85110c43725a07383A93119a19517I9140h0578G7908b81768P9972
11269b01796a5935m6078q4970j299f3227D3975Q1829N4738b50001B43182A1318
11257a84685a6913m2744k02139d7134A58776l7341A162a42196d6629e49G6936
11245B05745I6356b83388C09000b15085j98808J02675H0952B0664c40029o230
11235c46259L4936B4504c78216a81514b7148n1597G4628j8929f9067B37142K07548
11224D44690b59127D83365B6453Q9672b45907H2418R8289F535e3329m2114q8600
$$ y = [36663, -231087, 262025, 37200, -38161, -76613, -93768, -291570, -103148, 58019, -208683, -277242, -209066, -215880, -161637, -185061, -189762, -195301, 61743, -13004, 5336, -175083, -206095, -323044, 285110, -343725, -107383, 193119, -119517, 99140, -80578, 77908, -281768, -201796, -15935, -62013, -146983, -148282, -63227, 43975, 125804, 180542, -250001, 243182, 11318, -184685, -16913, -59657, -261796, -47134, 158776, 121435, 1162, -142196, -46629, -549, 76936, 205745, 96356, -283388, 309000, -215085, -413893, -311218, 80952, 20664, -340029, -346259, -311323, 24504, -378216, -181514, -27148, -78745, 74628, 55699, -69067, 237142, 444690, -259127, 483365, 26453, 116125, -245907, 82418, 180707, 6535, -53329, -95443, -184043]
11213a84043K3508b9982k25284R2538d1890A12538h5258j80182R5837P7600j22663
11202b14666G4336c75118a3440p4185m66687a74831J0951r5410J16213l4298A37665
11190C24529h6007q9767h7388A71988a19486l5938b3529E0833a51143o7106q7245
11179c05494d7028C31125K53287B84846A02864d6159B57093a01426E6078a0417
11168c27859B80432a84650l3131a07215j35270e9162A9890Q7217C1883i5164A61831
11156a10841m5876A41007a20640B65966d5579l0762H9040J16567i4949D5755a77219
11144B00234a8425l60428C09740F5911M4491j3815a5941k14215P518A08992J86485
11133B95477j06368Q6922a6669F0379R5653J68564A45757J57308p4854k3093H2456
$$ y = [-184043, -160535, -29982, -255266, -162728, -41890, 112538, -85258, -265440, -169603, -92003, -214666, 74336, -375118, -13440, -87625, -554312, -174831, -163880, -259290, -143077, -177375, 137665, 324529, -86007, -175774, -87388, 171988, -119486, -155424, -23529, 50833, -151143, -218249, -305494, -47028, 331125, 584412, 284846, 102864, -46159, 257093, -101426, 56078, -10417, -327859, 280432, -184650, -217781, -107215, -242485, -59162, 19890, 107107, 31883, -95164, 161831, -110841, -156717, 141007, -120640, 265966, -45579, -76341, 89040, 205607, -94949, 45755, -177219, 200234, -18425, -378853, 309740, 65911, 110402, 96587, -15941, -230156, -222638, 108992, 295477, 189109, 276031, -16669, 60379, 156032, 324596, 145757, 303065, 228211, 205118, 82456]
11121B39021a4284A16775f5725q1632A73053o6151M2868a62793B71016p9087I1816
11109F03956B4638J739c4478n681A26552b84754B43285E8531J59374O607n7259
11098A67253n0974Q841m4116a1173j26929B5407K83069c1585C01051A33577K146
11087A35723K24070j44001p0357b7628o2237o3433D53861H4939a8665B01228g7978
11075A38080K55344e8782A58251C0333N66104o3290j21358q7174K30916B40628
11064B39787J67733M8977j10642L37419N0235C28567K37338K66581C49439p7582
11054B71857M05051j36378o3485M25250k10660N1348J49536B76357M22307J12119
11044H10783j52186Q91j18704L50334j50475l06652J70272L60430l31730k0154
$$ y = [239021, -14284, 116775, -65725, -147357, 173053, 106902, 149770, -162793, 271016, 191929, 91816, 603956, 24638, 26377, -34478, -40159, 126552, -284754, 243285, 58531, 217905, 224512, 167253, 116279, 125120, 81004, -11173, -138102, 25407, 308476, -31585, 301051, 133577, 135723, 359793, 215792, 145435, -27628, -89865, -153298, 453861, 84939, -18665, 201228, -77978, 138080, 393424, -58782, 158251, 30333, 596437, 533147, 411789, 324615, 555531, 240628, 239787, 407520, 456497, 345855, 683274, 733509, 328567, 565905, 832486, 349439, 271857, 676908, 540530, 477045, 902295, 691635, 742983, 892519, 276357, 698664, 810783, 658597, 659488, 540784, 891118, 740643, 433991, 604263, 964693, 632963, 612809]
11034F12809M0341O3475j5794k09938p5437M28967j58207K0227L75392j43048
11024I38787K00143n20555L10309n5967j17124p6120o3451J17240n4224Q3301
11014G62339C35714R7620J61012o1732J19882k12692K12806j05095j40240j2677
11004C94598q4602M1693R0224O0131L54489p8142k8408K38761l73213B99009M29452
10993G28461J92536j18139J22482j77225j2024J47119l54958R5187L27617Q3491
10983A034547K3725n5194q2351M62392p6005Q2140M24296J49347M14684Q3175
10973B460756M3790K53240J66221L3504r4842o62230j17911J52669o6321k95907
10963A872969j84278l97449K25367K99612j00684N9702j05436K66028m30505O5953
$$ y = [612809, 653150, 716625, 700831, 490893, 415456, 844423, 686216, 706443, 1081835, 938787, 1138930, 618375, 928684, 872717, 755593, 679473, 616022, 733262, 679038, 762339, 335714, 433334, 594346, 532614, 652496, 439804, 652610, 547515, 407275, 394598, 309996, 351689, 441913, 502044, 856533, 778391, 749983, 988744, 615531, 299009, 728461, 920997, 802858, 925340, 748115, 736091, 883210, 528252, 623439, 951056, 1034547, 1058272, 1003078, 920727, 1383119, 1307114, 1389254, 1813550, 1962897, 2377581, 2460756, 2504546, 2757786, 2924007, 2957511, 2862669, 2200439, 2082528, 2235197, 2168876, 1872969, 1688691, 1291242, 1516609, 1816221, 1715537, 1775239, 1669803, 1935831, 1505326, 1571279]
10953A571279l81151J54808k21124j11670m18835M6493q5705j23224A90031K05601
10943C95632N4034Q8484r6140k00945a19604A30969E8216b20208c5976A51129
10932C13555h4182A22780L3405K2630q6816f689B34836a56914k81764f1924k32153
10921b94077a36089a2154A64313J13516b53295B00086a64866A88065J9783a95375
10910A7915a17323e3581F1737a16310B72502g1701A40592a42310o6080p1579h4520
10898f7302m180B06197b65904E8769K2814a15458e984j04736j6674A18032Q7092
10887B05124C4561b32600A01429D2061b81809B1719O5271N9643a90924A30279
10876A5349a6682A96978a6168A41820c01294J07555A23181b2322k9059d488p5445
$$ y = [1571279, 1190128, 1344936, 1123812, 1012142, 593307, 639800, 554095, 430871, 190031, 395632, 449666, 538150, 442010, 241065, -119604, 130969, 58216, -220208, -35976, 151129, 313555, -84182, 122780, 156185, 178815, 91999, -6689, 234836, -156914, -438678, -61924, -294077, -136089, -12154, 164313, 277829, -253295, 200086, -164866, 188065, 207848, -195375, 17915, -117323, -53581, 61737, -116310, 272502, -71701, 140592, -142310, -208390, -279969, -84520, -67302, -71482, 206197, -265904, 58769, 81583, -115458, -5984, -110720, -127394, 118032, 205124, 34561, -232600, 101429, 42061, -281809, 21719, 86990, 146633, -190924, 130279, 15349, -16682, 196978, -16168, 141820, -301294, -193739, 123181, -22322, -51381, -4488, -79933]
10865g9933A29498j674I431g9381A69558f9527I8156K0631d0505k05323D10478
10853C4677a04572B10947b64531j6422b3115G5984P8553g284l2153a6999A11724
10841c0384A05847C4162Q9701m3891B1766f0502I4458J4419a78998A10780B545
10829A93950b60425A73434a39785d8940p3494L0522B95919I5324b53362E7575
10818f4577A38308h7241E0505L1431c62899a1255A91217e8739F8710i3299j3270
10807a06569K5595J8477C4408d80068g288A62774b56528k881k27737J67084J51783
10796a68279A8830a83622B16531b62294R4307j14456G4606Q5216B8665b54833
10785b92438G158k158K41619b19709B16025a95299k4520A11426a75175k2342F2088
$$ y = [-79933, 129498, 127824, 9431, -79381, 169558, -69527, 98156, 118787, -40505, -245828, 410478, 34677, -104572, 210947, -264531, -280953, -23115, 75984, 154537, -7284, -39437, -16999, 111724, -30384, 105847, 34162, 123863, 79972, 21766, -60502, 94458, 108877, -178998, 110780, 2545, 193950, -260425, 173434, -139785, -48940, -122434, -91912, 295919, 95324, -253362, 57575, -64577, 138308, -87241, 50505, 81936, -362899, -11255, 191217, -58739, 68710, -93299, -106569, -80974, -62497, 34408, -480068, -7288, 162774, -256528, -259409, -487146, -320062, -168279, 18830, -183622, 216531, -262294, -167987, -282443, 74606, 159822, 28665, -254833, -292438, 7158, 5000, 246619, -219709, 216025, -195299, -219819, 111426, -175175, -197517, 62088]
10773e2316F0359b07894G4542i108A83527a73912P88N3367l37905A2672a67087
10761B84517a70709I3143m0911k2421R4100j273A367O0447J04456a35834q1120
10750b16954E2226J46785f0198A11071b2715j58389g9504q9003l9397e2958m0553
10739i3511l141A00688e6299j79049R2296j33473D3025b75406J32851B8287a10596
10727c54139i749B83797c4199a6489A70384j1697J5885b33834D05738D932f3535
10715C87689A3650f4539l24612a13426A4847d0942J9182A96921a29526A16145
10704B29850A06148d1910H1808b70698d9548l7892j51011E8750J4938J62690G9362
10692F0479a07922k8113d6491B864K41941q1658o4294C9673A1510b78254A53275
$$ y = [-52316, 60359, -207894, 74542, -9108, 183527, -173912, -173124, -119757, -457662, 12672, -167087, 284517, -170709, 93143, 52232, 29811, 123911, 122638, 1367, 61814, 166270, -135834, -216954, 52226, 199011, -60198, 111071, -22715, -181104, -79504, -168507, -207904, -52958, -93511, -96652, 100688, -56299, -235348, -143052, -276525, 43025, -275406, -142555, 28287, -110596, -354139, -9749, 283797, -34199, -16489, 170384, 158687, 174572, -233834, 405738, 4932, -63535, 387689, 13650, -64539, -389151, -113426, 14847, -40942, -21760, 196921, -129526, 116145, 229850, 106148, -41910, 81808, -270698, -49548, -87440, -238451, 58750, 73688, 236378, 79362, 60479, -107922, -136035, -46491, 2864, 244805, 163147, 98853, 39673, 11510, -278254, 153275]
10680d97298A38342K00419a71332a0046A33302e7679j0260c081A70057c43374
10669A4662b12561o2898B130J28848K10446b02004B21187c06762R1093L231j3998
10658b26436R7485A28543C8854b94268B20762b06829f9397j51999d6429j17238
10648a63667o8925j13364b8150j76502j77062j22919f3398p6628p3692D58220
10637g0313n0854A49313b36374p9831r7342J87631N143f2619I5755M11322A6624
10625a76589B1659K16607b55589C29475a83081F3548b06150D0332d6856n2320
10615i9176j03265G377a5379j60003d5304J0685k47195a14349k81069A77091b42498
10603B30293j6961d874B72837a73654d8298j40847n8408A90251F811J77548K5779
$$ y = [-497298, 138342, 338761, -171332, -10046, 133302, -57679, -67939, -3081, 170057, -343374, 14662, -212561, -275459, 2130, 130978, 341424, -202004, 221187, -306762, -215669, -212438, -226436, -128951, 128543, 38854, -294268, 220762, -206829, -69397, -221396, -46429, -163667, -232592, -345956, -28150, -204652, -381714, -504633, -63398, -140026, -213718, 458220, -70313, -121167, 149313, -236374, -316205, -413547, -225916, -220773, -62619, 95755, 507077, 16624, -176589, 21659, 238266, -255589, 329475, -183081, 63548, -206150, 40332, -46856, -99176, -202441, 7377, -15379, -175382, -45304, -34619, -281814, -114349, -395418, 177091, -242498, 230293, 213332, -4874, 272837, -173654, -48298, -189145, -247553, 190251, 6811, 184359, 210138]
10592B10138b72234A2683M3027a62230A16403m4757c50568i8771B14410c1686
10581a41795l08137a44641q5644B72962G2217b05798Q8511d2171A53159M0191
10571A93350J11767c30517C1101Q4403J22639a05051l560b9292k05302B87191
10560E0232b40477B08571f0470E2026a13534A13481a47297n5325M5217l7284A14567
10548b53402c3676k06398B35878F884c0102F0516b00708e9521r4811j60654J32951
10537a82035C085J29009E6072b31739A06716L20330A22661a19296A99663q8748
10527A10915O1126c01257A9592a48043f9729B33517d9027B11169g5726B4869h3197
10515h5489n9674B10214M6183E1977a14250D5848J07620c06234A1398g8227c1550
$$ y = [210138, -272234, 12683, 55710, -162230, 116403, 71646, -350568, -98771, 214410, -31686, -141795, -449932, -144641, -230285, 272962, 72217, -205798, -117287, -42171, 153159, 193350, 305117, -330517, 31101, 115504, 238143, -105051, -108611, -29292, -234594, 287191, 50232, -240477, 208571, -60470, 52026, -113534, 113481, -147297, -202622, -157405, -194689, 114567, -253402, -33676, -240074, 235878, 6884, -30102, 60516, -200708, -59521, -154332, -314986, -182035, 3085, 132094, 56072, -231739, 106716, 427046, 122661, -119296, 199663, 110915, 172041, -301257, 19592, -148043, -69729, 233517, -49027, 211169, -75726, 24869, -83197, -85489, -145163, 210214, 256397, 51977, -114250, 45848, 153468, -306234, 11398, -78227, -31550]
10503i6878c6898B00075a5434j8722j93425i5357L9564j96060e6250j64782R0244
10492a30788a587B70704g2428A55841j7594c48814D7936g7203E1496b4514C25190
10480G07442G5302L2032k0841a970B83814A1061P1927C0438M4754J38206B7779
10468H2406h4272d284j08777A70125b92986A60256l4944c32600F167J04939c3730
10456g4427C2312h6831d0696B23334a19750a4272E0109a1207k52751a9995k13749
10445b33744H9774a63029D2954a5410B27603d0048k27729f9961f244F905b43013
10433A6573M91660a50269P3925k59241C50118A21806k5554c1890k40976D9883
10422b5612k7535H0103K37564b72092K4766c6912m5846j08034j16207j91589i4372
$$ y = [-96878, -36898, 200075, -15434, -34156, -227581, -95357, -55793, -251853, -56250, -221032, -130788, -1587, 270704, -72428, 155841, 138247, -348814, 47936, -77203, 51496, -24514, 325190, 707442, 75302, 107334, 86493, -1970, 283814, 11061, 82988, 30438, 75192, 213398, 27779, 82406, -84272, -4284, -113061, 170125, -292986, 160256, 125312, -332600, 6167, 111106, -33730, -74427, 32312, -86831, -40696, 223334, -119750, -14272, 50109, -11207, -263958, -19995, -233744, 89774, -163029, 42954, -15410, 227603, -40048, -267777, -69961, -6244, 6905, -243013, 16573, 508233, -150269, -76344, -335585, 350118, 121806, 96252, -31890, -272866, 49883, -25612, -53147, 80103, 317667, -272092, -247326, -36912, -82758, -190792, -306999, -498588, -94372]
10410B45901a57805a1501k2205k28530B46343h1130L4674l02558B38528p8045
10400A60483d8584h012A67356m8801a13623A44939g7815R233B63156H3352J92921
10389B76273j04521F062J29101J61497A07369k1734O2261i2521E32511B106g5959
10377a64735H8915o802k2803J20259R8906n8833J42305j78683M7869l7807J8829
10366B12155K57920P1255k14557Q9964q2340m3620q7602J04191n6184H4927Q4228
10355A69155B1446N5991M8824L21805K74554J76675m37295I8618M51918j78346
10345C72190k2426O6982j48765L41340A09850M08339A32358J13114r6190J64148
10335C13430p7534d0464A76579a02464B0642J94387O5121F8787f3139C36791o2801
$$ y = [245901, -157805, -11501, -33706, -262236, 246343, -81130, -46456, -349014, 238528, 160483, -48584, -8012, 167356, 118555, -113623, 144939, -77815, -68582, 263156, 83352, 276273, 171752, 6062, 135163, 296660, 107369, 85635, 147896, -92521, 532511, 2106, -75959, -164735, 88915, 82113, 59310, 179569, 278475, 219642, 361947, 183264, 231133, 193326, 212155, 470075, 541330, 326773, 416737, 334397, 290777, 203175, 307366, 251182, 84927, 169155, 21446, 77437, 126261, 448066, 722620, 899295, 462000, 98618, 550536, 372190, 349764, 416746, 267981, 609321, 109850, 518189, 132358, 245472, 149282, 313430, 235896, -40464, 176579, -102464, 20642, 215029, 280150, 68787, -63139, 336791, 273990]
10324B73990n7804l0632K52209b3510C21523K31604A36629A2527M11856a303A20152
10312A83907A466P7779g9832q2013B04559a3680A43666G0357M6437a00353C77936
10300a08061C7096b1101A89044a79817I7927b8296C28261A14429a11112E1667
10289A2950a79994P4722j24210A09640Q6973b69552d5287B15442a85352P4262
10279a11090A9398b8476E8334i3748l3155M7449A27928J24387A09325N3496C82
10267A43491a18714B05437c95190a88611h8616B92451K55994B34385J21786b0135
10256E65280j57957A42520n5776m1667M5792a36794k59384a67348o9111A25965
10245c14143J44099A09003J21185a1142k32711a13838M0458a7987l4495f969k30437
$$ y = [273990, 216186, 185554, 437763, -23510, 321523, 553127, 136629, 12527, 424383, -1303, 120152, 183907, 1466, 79245, -79832, -161845, 204559, -13680, 143666, 70357, 116794, -100353, 377936, -108061, 37096, -21101, 189044, -179817, 97927, -28296, 328261, 114429, -111112, 51667, 12950, -179994, -105272, -229482, 109640, 196613, -269552, -45287, 215442, -185352, -111090, 19398, -28476, 58334, -93748, -126903, -79454, 127928, 252315, 109325, 162821, 382, 143491, -118714, 205437, -395190, -188611, -88616, 292451, 548445, 234385, 356171, -20135, 565280, 407323, 142520, 86744, 45077, 90869, -136794, -396178, -167348, -236459, 125965, -314143, -170044, 109003, 230188, -11142, -243853, -113838, -73380, -17987, -52482, -6969, -237406]
10234b37406Q085R5205q8952D1359d0371p7761K6654A89299a79461O3307H5227
10222A04078a08575L5276D6596b38217B35444G7464b56756d5700A17807J29867
10212B47674l8247a3581j90301k41774K04213J9387k2263b5169k09559a7503q2384
10201i9887j19708A83042F8584D051b28027A22036j6652J21101a64832O2906l10087
10190d12013b02395d8939H0463b5641j99485j950P0673r4772A26116D3807a24079
10178b404C2882Q113P6646J5444N1712n6878c0184j63980R1201D5715k0558a48707
10165c47533B75193a39190A14142a82870F0154G748J42975e6691l8031B56533
10154f3307H398a15020P321A6932K0355K07249b80124p7150o7616G7596H148a96240
$$ y = [-237406, -229321, -134116, -223068, 41359, -40371, -118132, -91478, 189299, -179461, -116154, 85227, 104078, -108575, -73299, 46596, -238217, 235444, 77464, -256756, -45700, 117807, 247674, 209427, -13581, -203882, -445656, -241443, -222056, -244319, -25169, -234728, -17503, -99887, -219595, 183042, 68584, 4051, -228027, 122036, 105384, 226485, -164832, -101926, -412013, -202395, -48939, 80463, -25641, -225126, -227076, -156403, -251175, 126116, 43807, -124079, -2404, 32882, 40995, 117641, 133085, 184797, 127919, -30184, -194164, -102963, 45715, 25157, -148707, -347533, 275193, -139190, 114142, -182870, 60154, 7748, 150723, -56691, -94722, 256533, -63307, 8398, -115020, -107699, 16932, 37287, 244536, -280124, -357274, -424890, 77596, 8148, -196240]
10141i7975g589j673k74501C4963d46432g4075b7484o3806I6995k5960h8259l00024
10129c88283J86817q8151A69400h7747A62455a54113H9688f1654q9259k64230
10119d15143G4963k3195I90a98628h0663B60247b0829j88557j00068C07428G0746
10107A18666Q0074d3280a6667A95078e3723A58236o3222a28324k05302j45409
10097d79035A71145i1435k6550m5577g08k56251A73976H6292a32191p8412a5611
10085b67897b1321D6911b05571p1973i9991j25683P6468e0357k27787a24317I0437
10073d5943E0563J16835a08911k5804J9989C4740Q2957a65149B02181G6159a80881
10061A06985J49948a02416K1818k50038G4506l3286a24592k06753f165k34234
$$ y = [-97975, -7589, -9262, -283763, 34963, -446432, -74075, -27484, -91290, 96995, 71035, -88259, -388283, -201466, -289617, 169400, -87747, 162455, -154113, 89688, -61654, -150913, -415143, 74963, 51768, 990, -198628, -80663, 260247, -20829, -209386, -309454, 307428, 70746, 118666, 198740, -43280, -16667, 195078, -53723, 158236, 95014, -128324, -333626, -479035, 171145, -91435, -117985, -163562, -708, -256959, 173976, 86292, -132191, -210603, -15611, -267897, -21321, 46911, -205571, -277544, -99991, -225674, -149206, -50357, -278144, -124317, 90437, -45943, 50563, 167398, -108911, -134715, -114726, 34740, 117697, -165149, 202181, 76159, -180881, 106985, 256933, -102416, -80598, -330636, 74506, 41220, -124592, -331345, -6165, -240399]
10051b40399l9502A46000O5166c39910C30971a50309f6952B71847f5404J2977
10041e2427D880b13109l1536A767J90861c20597k35420K29269B48642H2444a92498
10029d56961A76816C8997J51386B9492h2779j56709B4902L47061d75798K0110
10019d55688A04202D9718a31994l16788A62101A390b2711o0725j80542I7542b50592
10007a62884A74589D8704a40471M5921C26449j44975F3140j7207c408n03974a15741
9995a9118B68601G950e05643K30195B981L80383b64183I7898b38578H4334C1119
9983b54422C7950b29704b6950l11210g5233c2055L495j40656A48397a8384l47858
9972c66242E01067a07527e0060C2287J4342c30532B55076e0594C4380J76588a48402
$$ y = [-240399, -279901, 146000, 211166, -339910, 330971, -150309, -66952, 271847, -65404, -52427, 4880, -213109, -244645, 1767, 192628, -320597, -556017, -326748, 248642, 82444, -192498, -456961, 176816, 38997, 190383, 29492, -82779, -239488, 24902, 371963, -475798, -455688, 104202, 49718, -131994, -448782, 162101, 1390, -22711, -83436, -263978, 97542, -250592, -162884, 174589, 48704, -140471, -94550, 326449, 181474, 63140, 45933, -3408, -507382, -115741, -19118, 268601, 7950, -505643, -275448, 2981, 383364, -264183, 97898, -238578, 84334, 31119, -254422, 37950, -229704, -26950, -338160, -75233, -32055, -28560, -169216, 148397, -18384, -366242, 501067, -107527, -50060, 32287, 46629, -330532, 255076, -50594, 34380, 210968, -148402]
9960A83639f1139o8101l32648J48983A101Q7392J01406N5868b26888O8965A5596
9948e9619k47729A23039a76717A62218b6885k08098j13893C78079a35220C24190
9937c62454N6691A0573J01830J07734b88414J31987e7917j21666h5639F8096n442
9926F2654L3012D0350c05078A66643g5418B2690Q8029a33046j6501G6117b94499
9914C6419a14295M5598B29275b5841j85065A33652a51161B86568o1102i9267d920
9902b11848g4886j8692l50654E2796a35805A8007N2450a20280B5995d11900B27800
9890a52246B08688g3061J3730a3422k10027A11872J38783C9636b79759r2667f5112
9878H6005c15419d6642j52876a6624j03853B14413d4662a1062j45990j83610R6942
$$ y = [183639, -61139, -129240, -461888, -312905, 1101, 88493, 189899, 245767, -226888, -157923, 15596, -59619, -307348, 123039, -176717, 162218, -26885, -234983, -348876, 378079, -135220, 324190, -362454, -305763, 10573, 112403, 220137, -288414, -156427, -57917, -179583, -85639, 68096, 62654, 95666, 40350, -305078, 166643, -75418, 22690, 110719, -133046, -149547, 76117, -294499, 36419, -114295, -68697, 229275, -25841, -210906, 133652, -151161, 286568, 225466, -99267, -4920, -211848, -74886, -93578, -444232, 52796, -135805, 18007, 70457, -120280, 25995, -411900, 227800, -152246, 208688, -73061, -59331, -13422, -223449, 111872, 250655, 39636, -279759, -372426, -65112, 86005, -315419, -46642, -199518, -16624, -120477, 214413, -44662, -11062, -157052, -340662, -243720]
9867b43720B23791a7393I9146b77702J07188b1022A6318b15234m5888D4584d3474
9855c70687b0773m4953j39338D5445e8371A61430J92394j18630a58851L8318k08648
9844c29181A69500B1136J92651Q5900b28283d3447B6463a46392I7359J98820R0649
9833C86828A09117J92173b32645j9010L0932A18c21054C4401a24167l3868f2959
9821B43540b06866p1951R0118Q9062k06217O7498l5219A35083a10933o933A77135
9809b1946l99580J48130A68791c06605G6323L3940K60600a84836N2052L7821a9334
9797h6315L0550m49257b19972L6271h9717n3132A38661M7030b3359q7890o023
9786a17272p5582g4854A72170B476Q5267b90797J00055h778B16403a37028A6535
$$ y = [-243720, 223791, -17393, 99146, -277702, -170514, -21022, 16318, -215234, -261122, 44584, -43474, -370687, -20773, -65726, -205064, 45445, -58371, 161430, 353824, 235194, -158851, -120533, -329181, 169500, 21136, 213787, 299687, -228283, -43447, 26463, -146392, 97359, 296179, 386828, 109117, 301290, -232645, -251655, -220723, 118, -321054, 34401, -124167, -158035, -62959, 243540, -206866, -278817, -188699, -99637, -305854, -238356, -273575, 135083, -110933, -117866, 177135, -21946, -421526, -273396, 168791, -306605, 76323, 110263, 370863, -184836, -132784, -94963, -19334, -86315, -55765, -505022, -219972, -183701, -89717, -142849, 138661, 185691, -23359, -111249, -117272, -192854, -74854, 172170, 2476, 87743, -290797, -190742, -8778, 216403, -137028, 16535]
9774C2414a3624j98942j30451B56853a34919A33723b63056Q8088l0459J01124
9764a04303l35020R7661J54691O8305D9677b2791I5883A8532a77796B39669I3905
9752b54146f0503q3081A50861b98796F789b33354F7309K1261l3860d21111a84995
9740i2092n1277B82590c09278G1253h9269b6049A6987a88458L4770j43149A13065
9728C11196d25602C19d81993d72j92081c0694p1612B84889b45347C14615J29069
9717D43684g3868l81590A44051F7949b39838a03720K6508a9055j4727l05981J67682
9706a72081J3012A77527c48532J32749Q5868B06970H2259d22092A19116a02944
9695a7130A28623P0899G2832K346b59706C4496M532P9733d1991j57219B2598f70
$$ y = [32414, -13624, -212566, -343017, 256853, -134919, 133723, -263056, -174968, -205427, -104303, -439323, -341662, -186971, -118666, 49677, -22791, 95883, 18532, -177796, 239669, 93905, -254146, -60503, -143584, 150861, -298796, 6789, -233354, 67309, 88570, 54710, -421111, -184995, -92092, -143369, 282590, -309278, 71253, -89269, -26049, 16987, -188458, -153688, -296837, 113065, 311196, -425602, 319, -481993, -472, -192553, -30694, -102306, 284889, -245347, 314615, 443684, -73868, -455458, 144051, 67949, -239838, -103720, -77212, -19055, -33782, -339763, -172081, -159069, 177527, -348532, -215783, -129915, 206970, 82259, -422092, 119116, -102944, -17130, 128623, 199522, 72832, 75178, -259706, 34496, 39028, 118761, -41991, -199210, 22598, -670]
9682a35950c9015G6223c7142A92260a46017m2997P3761j55238n290K9424h3412
9670B0610a09016B44140b19542A09801N0634b03629e4886A44518e7243a8677A09053
9658b24315A638P5680J9850c2622B29744f8065m1345j16795G3016a21206k5625
9647a46831c4829k0583D1483j0138b24268K456J00256D40177n0814A29239l4716
9636I4523b80592C0729P5010b66264M8001C7895a10709A42616D622a1237A0427
9624G4889a73505N9999A49010J15418a46506l2720r8666c5959k03079J9362r1666
9613c11342f8494D6734i7008j04356P2549a7233l48563h5248g528B7290b96737
9601A34535i9875K3517J8279n7444L9665H1040d38557B2657L8325a96360k07232
$$ y = [-135950, -39015, 76223, -37142, 192260, -146017, -189014, -115253, -270491, -275781, -246357, -83412, 20610, -109016, 244140, -219542, 109801, 160435, -203629, -54886, 144518, -57243, -18677, 109053, -224315, 1638, 77318, 97168, -32622, 229744, -68065, -109410, -226205, 73016, -121206, -146831, -34829, -55412, 41483, 31345, -224268, -221812, -121556, 440177, 389363, 129239, 94523, -280592, 30729, 105739, -266264, -218263, 37895, -110709, 142616, 4622, -11237, 10427, 74889, -173505, -113506, 149010, 264428, -146506, -179226, -277892, -35959, -239038, -219676, -311342, -68494, 46734, -97008, -201364, -128815, -17233, -365796, -85248, -7528, 27290, -296737, 134535, -99875, -76358, -58079, -115523, -75858, 81040, -438557, 22657, 60982, -196360, -403592]
9590d03592A7077B765K53275A07042a93779e0879a9620A6782b36923g9506j34766
9579b14272A96223a22318B4641c711n2214K7286O190C7457c6157B03688I4032
9567c76649a40780k43610A17994K3a15691r487A98804f1999A14131f5268J1900
9556e3368l37775H6224i6980L368C27389b15305h6407j14916F8876J09228k6517
9545A51587i5604j31289p6192A1059J32800b43992a16841k99843J87953A41621
9534a65693A27084o2245a52508o5426E9986f6785A7123J00693b45868i1390o271
9523i7661J8149j94972a1422j64528D8542Q1680O3195a47331n5069E0158a2870
9511a04215j65701H9119h5804C00857A29247d14179b114Q98l6424l8020l5440
$$ y = [-403592, 17077, 2765, 256040, 107042, -193779, -50879, -19620, 16782, -236923, -79506, -214272, 196223, -122318, 24641, -3711, -55925, -28639, -22449, 37457, -36157, 203688, 94032, -376649, -140780, -384390, 117994, 118017, -115691, -125178, 198804, -61999, 114131, -65268, -53368, -391143, 86224, -96980, -93612, 327389, -215305, -86407, -201323, 68876, 178104, 151587, -95604, -226893, -303085, 11059, 143859, -243992, -116841, -416684, -228731, 141621, -165693, 127084, 64839, -152508, -217934, 59986, -66785, 17123, 117816, -245868, -91390, -97661, -79512, -274484, -11422, -175950, 48542, 130222, 193417, -147331, -202400, 50158, -12870, -104215, -269916, 89119, -85804, 300857, 129247, -414179, -2114, -1216, -37640, -75660, -111100]
9500a11100j79663J10045p5711B8497L3220Q9376C7465N3600b75438J35030j3185
9489a53593E5902d3922l61110a84745I6794m0818A2771g7779K4946B21498b67516
9477i7293A89408a96720A5614c56835A86307f2133q7951E740J08500b20955A33197
9465A43116E6708b80400J38700J0699E5461b3980k59899J32880F9084d40457E944
9453a57048E69P6414a07145A04495B0919c40485a39781f5981C15184e4058K2676
9442c1382n1945J893J7862j11700r7586C2364j323c39974A06047J05365a8692
9430e9480j5868c6730j50854L4450j09585k00851G0893a32558d1899m0711G4242
9418b22151q1889E3101a64597g2398k64817J17868m9290A92749B9888P7939A6681
$$ y = [-111100, -290763, -180718, -256429, 28497, 61717, 151093, 37465, 91065, -275438, -140408, -153593, 55902, -43922, -405032, -184745, 96794, 55976, 12771, -77779, -52833, 221498, -267516, -97293, 189408, -196720, 15614, -356835, 186307, -62133, -150084, 5740, 114240, -220955, 133197, 143116, 56708, -280400, -141700, -131001, 55461, -23980, -283879, -150999, 69084, -440457, 5944, -157048, 569, 76983, -107145, 104495, 20919, -340485, -139781, -65981, 315184, -54058, -31382, -83327, -81434, -63572, -175272, -272858, 32364, 31041, -339974, 106047, 211412, -18692, -59480, -75348, -36730, -187584, -153134, -262719, -463570, 70893, -132558, -41899, -82610, 74242, -222151, -304040, 53101, -164597, -72398, -337215, -219347, -268637, 192749, 29888, 107827, 16681]
9406c07946c1094D5541e08127A6695b41940g247F4932a12553K7619K6125j1279
9395g0088L3035r4220n7976L1942D135a12621A96524f0667m4834L9994m1389M6258
9383f0638j72903D1081d6230H1000e9442j45801r7228C11418a716A19331c96144
9371a6025m0712A91625l7355E2507l748a38688d514p7191l5292j98336g0726A9128
9358A92290A9539h8952p1087C3835N8885b06489B49740O454j20771h042n8555
9347f6597B4328a28247a2147A05890e5490l18927e1129k5075n0900B1413c02000
9335C24279d50238a89473D3381a50608B64323a99971b9029j2026A9485c07992
9324H0304C5246a6956q8346E0390E593a16158q8923L12h0374r3870l930j05392
$$ y = [-307946, -31094, 45541, -508127, 16695, -241940, -7247, 64932, -112553, -84934, -58809, -70088, -37053, -131273, -189249, -157307, 4135, -112621, 196524, -60667, -105501, -65507, -106896, -60638, -233541, 41081, -46230, 81000, -59442, -205243, -302471, 311418, -1716, 119331, -396144, -16025, -56737, 191625, 154270, 52507, 48759, -138688, -4514, -81705, -116997, -315333, -70726, 19128, 192290, 19539, -88952, -160039, 33835, 92720, -206489, 249740, 256194, 135423, -8042, -66597, 24328, -128247, -12147, 105890, -55490, -374417, -51129, -76204, -127104, 21413, -302000, 324279, -450238, -189473, 43381, -150608, 264323, -199971, -29029, -41055, 19485, -307992, 80304, 35246, -16956, -105302, 50390, 5593, -116158, -205081, -204769, -80374, -174244, -178174, -283566]
9312b83566a04914A22979a20625N3144j7532r6125A46647L9361g25q0726a2247
9300i7298j02277B7090g0010j33646c9186J5441r1073L086n0881P1221k1399j34499
9288b47290B61628g8034j17302I4316N8643c98175E2801J42221l3372b83746B90034
9276I0523r727a25604m068a5602k11437B2122i6180j56982e5629j00838H5024
9264B51735I9829K20933a51261P2801c5033p9832A69754a83170C04416b23612
9253a66171B3370L6821b7511k31776f77j63993d0397B32314N1319b02899f2344
9241a17805m333m2088k1127j11000q6758A15752d4902j64234h4150G5387g5082
9229H3077a26406c5639B29370b69123G1544J3798a51557r2717A46104b988I0653
$$ y = [-283566, -104914, 122979, -120625, -67481, -85013, -181138, 146647, 186008, -725, -81451, -12247, -97298, -199575, 27090, -70010, -203656, -39186, -23745, -114818, -111732, -162613, -91392, -112791, -247290, 261628, -78034, -195336, 94316, 152959, -398175, 52801, 195022, 161650, -283746, 290034, 90523, 80796, -125604, -129672, -15602, -227039, 22122, -96180, -253162, -55629, -156467, 85024, 251735, 99829, 320762, -151261, -78460, -35033, -114865, 169754, -183170, 304416, -223612, -166171, 23370, 60191, -27511, -259287, -677, -164670, -40397, 232314, 283633, -202899, -62344, -117805, -122138, -164226, -185353, -296353, -383111, 115752, -44902, -209136, -84150, 75387, -75082, 83077, -126406, -35639, 229370, -269123, 71544, 85342, -151557, -244274, 146104, -2988, 90653]
9217b19034e5086A04303a90094D9531M2023J83689B0337l702J52370a24369J075
9206a23294j5422j38553i3314l07470F0171M5915n02e9253j5784J6833q7505K8644
9194a17065A12605a806A8602P0741c180j87981F7416b89310h5289j70793d2390
9182e9317H182b22512c329C9685A6004g3750k73502a2696j30634C84711A79393
9170b2389A3477b41651A36400c9689C85894d26963I820d33615J26168g366k16710
9159b24076R3527A12175E4265L3582o234C4621b76541e614F7235b3690k37658
9148b61348e3966C6241j1664a47138A89723g0403J2363k07620P6332Q6803L5650
9137f6875A39153f6102A17397b468j39565B27556c4756l5305l13814I616J01174
$$ y = [-219034, -55086, 104303, -190094, 49531, 91554, 275243, 20337, 16635, 169005, -124369, -123294, -138716, -277269, -93314, -400784, 60171, 106086, 105584, -59253, -75037, -58204, -145709, -117065, 112605, -1806, 18602, 89343, -3180, -191161, 67416, -289310, -85289, -256082, -42390, -59317, 8182, -222512, -3329, 39685, 16004, -73750, -347252, -12696, -143330, 384711, 179393, -22389, 13477, -241651, 136400, -39689, 385894, -426963, 9820, -433615, -307447, -7366, -224076, -130549, 112175, 54265, 87847, 81613, 34621, -276541, -5614, 67235, -23690, -261348, -53966, 36241, 24577, -147138, 189723, -70403, -58040, -265660, -189328, -102525, -66875, 139153, -66102, 117397, -2468, -142033, 227556, -34756, -70061, -383875, 9616, 110790]
9126A10790a83249I9678A3222c02796J00231R57l2322a5325A92467A0465a65852
9114d9640E4361b34168F6776J9506G588h6926B28151g0324k29122a25930n8267
9103a84197A13951K4746a82435J6856q4079g3123j13323P1919H0309J34789A02542
9091B01596a9799F9557b11086a04396q1251O5275b6842H8785b41562B78599b40770
9079a96405K3522P2978l5743l31480L4540C049c4898m1617c0435k5290A64721
9067a07098B66096a36371a5379k12840R8963e0018k48545Q6567a1306k84138b3801
9055b62868D5448J05471b5386p7151A09862h7143b0097b79j38769C52854f6996
9043A8976a28384b8162G3230i4090C77755b07051P1041A01478B9453n962L7282
$$ y = [110790, -183249, 99678, 13222, -302796, -202565, -201608, -233930, -15325, 192467, 10465, -165852, -49640, 54361, -234168, 66776, 86282, 7588, -86926, 228151, -70324, -299446, -125930, -184197, 113951, 138697, -182435, -165579, -249658, -73123, -186446, -114527, 80309, 215098, 102542, 201596, -19799, 69557, -211086, -104396, -185647, -120372, -26842, 88785, -241562, 278599, -240770, -196405, -172883, -99905, -135648, -467128, -432588, 3049, -34898, -76515, -30435, -55725, 164721, -107098, 266096, -136371, -15379, -228219, -129256, -50018, -298563, -211996, -11306, -295444, -23801, -262868, 45448, 150919, -25386, -102537, 109862, -87143, -20097, -279, -139048, 352854, -66996, 18976, -128384, -28162, 73230, -94090, 377755, -207051, -136010, 101478, 29453, 23491, 60773]
9032F0773d2207j78478d7750k02667M4529A76771D190c12911P1657b2298j23597
9021a45895B8065a25972m2917g3050B89235a88057C11608a90781m3101J01498
9011a32384A40565i0424j00480g2611I7969k8740a28711j96648H4604j6163b59260
8999b63618B42946b74511G3832a76524Q0538A34233a49614f399j24552B6059J5233
8988D1292b0012C3118a89170j48631a45895A14672a36806m3688a2153n3101j98022
8977b63276a7606r0992l08200J5805c0002j89585J07676j69922q1475a81176M0846
8966a40330C86686d55629B6945a09097I4274D3409M2812R1609K6496j00602b20075
8954b37618B5921h8689A21712J90357a72217n2017A54793m5977B0455K997a76354
$$ y = [60773, -42207, -220685, -47750, -250417, -205888, 176771, 4190, -312911, -241254, -22298, -145895, 28065, -125972, -168889, -73050, 289235, -188057, 311608, -190781, -233882, -132384, 140565, -90424, -190904, -72611, 97969, 69229, -128711, -325359, 84604, 68441, -259260, -263618, 242946, -274511, 73832, -176524, -95986, 134233, -149614, -6399, -130951, 26059, 41292, -20012, 33118, -189170, -337801, -145895, 114672, -136806, -180494, -12153, -65254, -263276, -17606, -108598, -416798, -400993, -30002, -219587, -111911, -281833, -363308, -181176, -140330, 386686, -455629, 26945, -109097, 94274, 43409, 86221, 177830, 204326, 103724, -220075, -237618, 25921, -88689, 121712, 312069, -172217, -224234, 154793, 108816, 20455, 23452, -176354]
8942a89277f1011I6499a6979A77227c6317A46844e0292A85399N908J98817B9083
8930c9792j97724A07049a59340B2276L87431N60573M43267J811134N721063N976154
8920A4921898C918299A099976D53656O988B17649J53175j83270p7213a61205d2121
8909C6179N1888M44244I388K67807a3945k3858G2997a90358M8021A1626b36190
8897a1817k66639n414i5805A84461c83120B0195a6535j88173C02187H8218j1870
8886G6348b23509A68944K98367a05313F8496Q3464i5449B11998H4311O0828b25583
$$ y = [-189277, -61011, 96499, -16979, 177227, -36317, 146844, -50292, 185399, 191307, 390124, 29083, -39792, -237516, 107049, -159340, 22276, 409707, 970280, 1413547, 3224681, 8945744, 14921898, 3918299, 1099976, 453656, 460644, 217649, 370824, 187554, 110341, -161205, -42121, 36179, 88067, 532311, 9388, 277195, -13945, -37803, 72997, -190358, -142337, 11626, -236190, -11817, -278456, -283870, -95805, 184461, -383120, 20195, -16535, -204708, 302187, 88218, 76348, -223509, 168944, 467311, -105313, 68496, 151960, -95449, 211998, 84311, 145139, -225583]
$$ [...]
##END NTUPLES=NMR SPECTRUM
##END=
