
##TITLE=AC1169_Tolima-ibage-TGAAH12004_6672652_X3OlbKJwfa
##JCAMPDX= 6.0         $$ Bruker NMR JCAMP-DX V2.0
##DATA TYPE= NMR SPECTRUM
##DATA CLASS= NTUPLES
##ORIGIN= BRUKER
##OWNER= Administrator
$$ 1.72 TOPSPIN		Version 2.1
$$ 2012-08-14 19:31:02.296 -0500  Administrator@TOPSPIN
$$ Compression mode = diff/dup
##.OBSERVE FREQUENCY= 400.02188249412
##.OBSERVE NUCLEUS= ^1H
##.ACQUISITION MODE= SIMULTANEOUS (DQD)
##.ACQUISITION SCHEME= undefined
##.AVERAGES= 64
##.DIGITISER RES= 22
##SPECTROMETER/DATA SYSTEM= spect
##.PULSE SEQUENCE= noesygpps1d.comp
##.SOLVENT NAME= COFFEE_meoh
##.SHIFT REFERENCE= INTERNAL, COFFEE_meoh, 1, 14.96112
##AUDIT TRAIL= $$ (NUMBER, WHEN, WHO, WHERE, PROCESS, VERSION, WHAT)
$$ ##TITLE= Audit trail, TOPSPIN		Version 2.1
$$ ##JCAMPDX= 5.01
$$ ##ORIGIN= Bruker BioSpin GmbH
$$ ##OWNER= Administrator
$$ $$ C:\Bruker\TOPSPIN/data/COFFEE/nmr/AC1169_Tolima-ibage-TGAAH12004_6672652_X3OlbKJwfa/12/pdata/1/auditp.txt
$$ ##AUDIT TRAIL=  $$ (NUMBER, WHEN, WHO, WHERE, PROCESS, VERSION, WHAT)
(   1,<2012-08-14 19:30:57.343 -0500>,<Administrator>,<TOPSPIN>,<go>,<TOPSPIN 2.1>,
      <created by zg
	started at 2012-08-14 19:19:26.984 -0500,
	POWCHK enabled, PULCHK disabled,
       configuration hash MD5:
       6B 1B 68 BB D9 2E 58 E2 7F 35 AD 54 07 DF 0E 41
       data hash MD5: 64K
       BD 49 03 3F 07 39 AD 26 45 79 3B EC 00 05 33 1D>)
(   2,<2012-08-14 19:31:00.187 -0500>,<Administrator>,<TOPSPIN>,<proc1d>,<TOPSPIN 2.1>,
      <Start of raw data processing
       efp LB = 0.3 FT_mod = 6 PKNL = 1 PHC0 = 0 PHC1 = 0 SI = 128K 
       data hash MD5: 128K
       A1 B1 32 37 9D F3 E2 B8 69 8F 14 4E E1 CE 75 2B>)
(   3,<2012-08-14 19:31:01.484 -0500>,<Administrator>,<TOPSPIN>,<proc1d>,<TOPSPIN 2.1>,
      <pk PHC0 = 0.4064941 PHC1 = 0 
       data hash MD5: 128K
       76 5D 73 46 11 BE 30 18 2F 8F 1E 17 F8 43 F2 AD>)
(   4,<2012-08-14 19:31:01.921 -0500>,<Administrator>,<TOPSPIN>,<proc1d>,<TOPSPIN 2.1>,
      <abs ABSG = 1 
       data hash MD5: 128K
       27 5E 68 50 A6 C6 43 3D 0A 0F 16 A1 94 9A 4B 68>)
(   5,<2012-08-14 19:31:02.000 -0500>,<Administrator>,<TOPSPIN>,<proc1d>,<TOPSPIN 2.1>,
      <abs ABSG = 2 
       data hash MD5: 128K
       25 D4 51 E0 46 49 26 86 84 5F DD 53 9C 84 D3 BC>)
(   6,<2012-08-14 19:31:02.078 -0500>,<Administrator>,<TOPSPIN>,<proc1d>,<TOPSPIN 2.1>,
      <abs ABSG = 3 
       data hash MD5: 128K
       C5 88 2B 25 A3 68 64 94 AE 73 A3 BF 7E CA 90 5C>)
(   7,<2012-08-14 19:31:02.156 -0500>,<Administrator>,<TOPSPIN>,<proc1d>,<TOPSPIN 2.1>,
      <abs ABSG = 4 
       data hash MD5: 128K
       D9 37 FA B2 FE 3C 5A 04 DB 0B BC 91 B7 47 59 DB>)
(   8,<2012-08-14 19:31:02.218 -0500>,<Administrator>,<TOPSPIN>,<proc1d>,<TOPSPIN 2.1>,
      <abs ABSG = 5 
       data hash MD5: 128K
       14 A4 CA BA 5B 61 94 CC 41 64 62 AA AF 49 A2 D4>)
$$ ##END=
$$ 
$$ $$ hash MD5
$$ $$ FE C5 49 34 66 DD 8A 64 E3 E4 BB A7 4C 8A 28 DB
##$RELAX= 
##$RELAX= 
##$RELAX= 
##$RELAX= 
##$RELAX= 
##$RELAX= 
##$RELAX= 
##$RELAX= 
$$ [...]
##$TP07= 0
##$TPNAME0= <>
##$TPNAME1= <>
##$TPNAME2= <>
##$TPNAME3= <>
##$TPNAME4= <>
##$TPNAME5= <>
##$TPNAME6= <>
##$TPNAME7= <>
##$TPOAL= (0..7)
0.5 0.5 0.5 0.5 0.5 0.5 0.5 0.5
##$TPOFFS= (0..7)
0 0 0 0 0 0 0 0
##$TUNHIN= 0
##$TUNHOUT= 0
##$TUNXOUT= 0
##$USERA1= <user>
##$USERA2= <user>
##$USERA3= <user>
##$USERA4= <user>
##$USERA5= <user>
##$V9= 5
##$VALIST= <valist>
##$VCLIST= <CCCCCCCCCCCCCCC>
##$VD= 0
##$VDLIST= <DDDDDDDDDDDDDDD>
##$VPLIST= <PPPPPPPPPPPPPPP>
##$VTLIST= <TTTTTTTTTTTTTTT>
##$WBST= 1024
##$WBSW= 4
##$XGAIN= (0..3)
0 0 0 0
##$XL= 0
##$YL= 0
##$YMAX_a= 12609206
##$YMIN_a= -9803521
##$ZGOPTNS= <>
##$ZL1= 120
##$ZL2= 120
##$ZL3= 120
##$ZL4= 120
##$ABSF1= 14.96112
##$ABSF2= -5.597062
##$ABSG= 5
##$ABSL= 3
##$ALPHA= 0
##$AQORDER= 0
##$ASSFAC= 0
##$ASSFACI= 0
##$ASSFACX= 0
##$ASSWID= 0
##$AUNMP= <proc_prof1d_extract.lims>
##$AXLEFT= 0
##$AXNAME= <>
##$AXNUC= <1H>
##$AXRIGHT= 0
##$AXTYPE= 0
##$AXUNIT= <>
##$AZFE= 0.1
##$AZFW= 0.1
##$BCFW= 0
##$BC_mod= 0
##$BYTORDP= 0
##$COROFFS= 0
##$CY= 15
##$DATMOD= 1
##$DC= 0
##$DFILT= <>
##$DTYPP= 0
##$F1P= 0
##$F2P= 0
##$FCOR= 0.5
##$FTSIZE= 131072
##$FT_mod= 6
##$GAMMA= 0
##$GB= 0
##$INTBC= 1
##$INTSCL= 1
##$ISEN= 128
##$LB= 0.3
##$LEV0= 0
##$LPBIN= 0
##$MAXI= 10000
##$MC2= 0
##$MEAN= 0
##$ME_mod= 0
##$MI= 0
##$NCOEF= 0
##$NC_proc= -2
##$NLEV= 6
##$NOISF1= 0
##$NOISF2= 0
##$NSP= 0
##$NTH_PI= 0
##$NZP= 0
##$OFFSET= 14.96112
##$PC= 1
##$PHC0= 0.4064941
##$PHC1= 0
##$PH_mod= 1
##$PKNL= yes
##$PPARMOD= 0
##$PPDIAG= 0
##$PPIPTYP= 0
##$PPMPNUM= 2147483647
##$PPRESOL= 1
##$PSCAL= 4
##$PSIGN= 0
##$PYNMP= <proc.py>
##$REVERSE= no
##$SF= 400.020009589188
##$SI= 131072
##$SIGF1= 0
##$SIGF2= 0
##$SINO= 400
##$SIOLD= 131072
##$SPECTYP= <>
##$SREGLST= <1H.CDCl3>
##$SSB= 0
##$STSI= 131072
##$STSR= 0
##$SW_p= 8223.68421052631
##$SYMM= 0
##$S_DEV= 0
##$TDeff= 65536
##$TDoff= 0
##$TI= <>
##$TILT= no
##$TM1= 0
##$TM2= 0
##$TOPLEV= 0
##$USERP1= <user>
##$USERP2= <user>
##$USERP3= <user>
##$USERP4= <user>
##$USERP5= <user>
##$WDW= 1
##$XDIM= 131072
##$YMAX_p= 395090543
##$YMIN_p= -12215
##$CURPLOT= <Network HP LaserJet P1505>
##$CURPRIN= <$Network HP LaserJet P1505>
##$DFORMAT= <normdp>
##$LAYOUT= <+/1D_H.xwp>
##$LFORMAT= <normlp>
##$PFORMAT= <normpl>
##$SURQMSG= 1
$$ End of Bruker specific parameters
$$ ---------------------------------
##NTUPLES= NMR SPECTRUM
##VAR_NAME=  FREQUENCY,     SPECTRUM/REAL,   SPECTRUM/IMAG
##SYMBOL=    X,             R,               I
##VAR_TYPE=  INDEPENDENT,   DEPENDENT,       DEPENDENT
##VAR_FORM=  AFFN,          ASDF,            ASDF
##VAR_DIM=   131072,        131072,          131072
##UNITS=     HZ,            ARBITRARY UNITS, ARBITRARY UNITS
##FACTOR=    0.0627417313425164, 1,          1
##FIRST=     8223.62146879497, 3262,         -63648
##LAST=      0,             4045,            -63777
##MIN=       0,             -12215,          0
##MAX=       8223.62146879497, 395090543,    0
$$ Real data points
##PAGE= N=1
##DATA TABLE= (X++(R..R)), XYDATA
$$ [...]
61575C13688j835j821j436o77L91J367J643R75j26p22l11O88J412J438J018N95
61559C16287L83M09N72N66J92j96J7P68J233Q99K03k22l97n95o03m5R04J768K463
61540C24606L097L320K685J586J034J419K121K494K559K450J892O85o32j185p36
61525C47395O8M34J45m80j144j823k454k666k163j247n71l30j13L33O98O45K89
61508C37016j27n68r09q37m74n03j161j679j375o96m42m86k28J36l6m79k50O51
61490C27553J141P56K68K23K4p84j360o72R39K212K551K278J694Q46J44K08R15
61473C38936J310Q14l2l57q4K37L69N83R28R17K12p72j347j362j178r91o78k66
61455C37239Q7N36J432K500K832K063J001O67J110J682J972J998J778J429J298
$$ plain form
61575 313688 311853 310032 308596 307919 308310 309677 311320 312295 312169 311447 311136 311824 313236 314674 315692 316287
61559 316287 316670 317079 317651 318217 318409 318213 318230 318998 320231 321130 321333 321111 320714 320119 319516 319471 320375 322143 324606
61540 324606 327703 331023 333708 335294 336328 337747 339868 342362 344921 347371 349263 349948 349316 348131 347395
61525 347395 347463 347897 348042 347562 346418 344595 342141 339475 337312 336065 335494 335164 335051 335384 336082 336727 337016
61508 337016 336889 336321 335412 334575 334101 333598 332437 330758 329383 328687 328245 327759 327531 327667 327631 327152 326902 327553
61490 327553 328694 329450 329718 329941 329965 329181 327821 327149 328088 330300 332851 335129 336823 337669 337813 338021 338936
61473 338936 340246 341060 341028 340671 340587 340824 341193 341776 342704 343621 343833 343061 341714 340352 339174 338183 337505 337239
61455 337239 337326 337862 339294 341794 344626 346689 347690 348357 349467 351149 353121 355119 356897 358326 359624
61440C59624J527J750J748J979K759L368K901J706J027J255J594J479J260J288
61426C85265J227P94L68L25M36L18R2N9K64O69J350K103K330J757Q98L95J97j52
61408C98695o63q53m81K3m2r40k215l067l082k529j870j220n51j66m45j148j527
61391C77919j215n67l8K60K77j16p01q45k38O24J017P70K60j01q0L78J078J609
61373C80291J736J658J751K132K573K703K271J361M00j69k07K35J164K417L408
61358D03724L539K942K373K421L127M341N886P302Q015Q008P931Q244Q600Q292
61344D84745P083N382L825K850K511K570K819L203L573L512K791J747Q63J41o72
61329E26943j490k066k561l249l786l550k665j927j645j388r91q15p27K14K370
$$ plain form
61440 359624 361151 362901 364649 366628 369387 372755 375656 377362 378389 379644 381238 382717 383977 385265
61426 385265 386492 387286 387654 387979 388415 388733 388825 388884 389148 389817 391167 393270 395600 397357 398255 398650 398847 398695
61408 398695 398032 397179 396698 396721 396679 395739 393524 390457 387375 384846 382976 381756 381205 381039 380594 379446 377919
61391 377919 376704 376137 376099 376359 376636 376520 375819 374974 374736 375360 376377 377147 377407 377306 377226 377604 378682 380291
61373 380291 382027 383685 385436 387568 390141 392844 395115 396476 396876 396707 396500 396735 397899 400316 403724
61358 403724 407263 410205 412578 414999 418126 422467 428353 435655 443670 451678 459609 467853 476453 484745
61344 484745 491828 497210 501035 503885 506396 508966 511785 514988 518561 522073 524864 526611 527474 527615 526943
61329 526943 525453 523387 520826 517577 513791 510241 507576 505649 504004 502616 501625 500810 500083 500297 502667
61314E02667M633N688N678N826O707P725Q201Q323Q783R893J1258J2187J2328
61301F09897J1873J1183J0276Q859O712L910P79k117m142n161n762o554p393p804
61287F24556p899q198q612q453p521o454n806n381m761l832k614j166J16P25Q39
61272E55539J283K476L921M950N391N299M684L807L173K926K823K962L839N379
61258F08452O711P285P469P653P502O619N277L879K366O91o77j432k000k796l464
61243F53535l530l320l438l772l794l558l510l528k944j584r6Q03J005Q81Q50
61228F24000J092J458J699J944K627L786M781N033M789M770N304O120O755O953
61214F81111O871O989P579Q154P918O791N475M404L346K280J818K341L362M308
$$ plain form
61314 502667 507300 512988 518666 524492 531199 538924 547125 555448 564231 574124 585382 597569 609897
61301 609897 621770 632953 643229 652088 658800 662710 663489 661372 657230 652069 646307 639753 632360 624556
61287 624556 616657 608459 599847 591394 583873 577419 571613 566232 561471 557639 555025 553859 553975 554700 555539
61272 555539 556822 559298 563219 568169 573560 578859 583543 587350 590523 593449 596272 599234 603073 608452
61258 608452 615163 622448 629917 637570 645072 651691 656968 660847 663213 663904 663227 661795 659795 656999 653535
61243 653535 650005 646685 643247 639475 635681 632123 628613 625085 622141 620557 620461 621264 622269 623150 624000
61228 624000 625092 626550 628249 630193 632820 636606 641387 646420 651209 655979 661283 667403 674158 681111
61214 681111 687982 694971 702550 710704 718622 725413 730888 735292 738638 740918 742736 745077 748439 752747
61200G52747N305O701Q385J0122J1963J3734J4816J5023J5160J5884J6590J6158
61188I02588J4456J2297J0238Q211O103M000K053N54j45k86q24k329m229n755
61174I46932p115q864j0662j1662j1854j2048j2595j3026j2949j2526j2088j1997
61162H09546j2735j4329j5706j5524j3829j2074j1288j0904r772p767n873m857
61150F74888m379l519k045q09o44j214j539j539k210l972n801o556o339n850n087
61135F23385l711k119j067m52N55K260M142N793P352R011J0726J2446J4157J5711
61121F98189J7131J8825K0988K3055K4328K4920K5428K5943K6165K6228K6607
61110I57807K7208K7310K6454K4817K2778K0695J8892J7244J4930J1332P091L461
$$ plain form
61200 752747 758052 764753 773138 783260 795223 808957 823773 838796 853956 869840 886430 902588
61188 902588 917044 929341 939579 947790 953893 957893 959946 960500 960355 960069 959245 956916 952687 946932
61174 946932 939817 930953 920291 908629 896775 884727 872132 859106 846157 833631 821543 809546
61162 809546 796811 782482 766776 751252 737423 725349 714061 703157 693385 685618 679745 674888
61150 674888 670509 666990 664945 664136 663492 662278 660739 659200 656990 653018 647217 640661 634322 628472 623385
61135 623385 619674 617555 616488 616036 616591 618851 622993 628786 636138 645149 655875 668321 682478 698189
61121 698189 715320 734145 755133 778188 802516 827436 852864 878807 904972 931200 957807
61110 957807 985015 1012325 1038779 1063596 1086374 1107069 1125961 1143205 1158135 1169467 1176558 1180019
61098A180019O52k367o336j0733j4550j7435j9700k1656k3240k4182k4440k4488
61086I91544k4881k5434k5265k3939k2086k0495j9145j7709j6349j5245j3849
61075G67147j1609r053p182o029m805l261j894q67J80J215J725J832K552M480
61061G34431O855Q386Q635Q309Q419R361J0671J1698J2524J3895J6037J8184J9633
61048H87038K0724K2146K3810K5160K6216K7564K9459L1666L3848L5659L6830
61037A200120L7634L8789M0335M1375M1561M2019M3825M6420M8594N0305N2227
61026A683204N4206N5581N6638N8364O1153O4970P0350P7937Q7532R8898J12837
61015B481670J30015J49335J69361J90750K15562K44878K79236L20849L73071
$$ plain form
61098 1180019 1180671 1178304 1171968 1161235 1146685 1129250 1109550 1087894 1064654 1040472 1016032 991544
61086 991544 966663 941229 915964 892025 869939 849444 830299 812590 796241 780996 767147
61075 767147 755538 746485 739303 733274 728469 725208 723314 722447 722627 723842 725567 727399 729951 734431
61061 734431 741286 749672 758307 766616 775035 784396 795067 806765 819289 833184 849221 867405 887038
61048 887038 907762 929908 953718 978878 1005094 1032658 1062117 1093783 1127631 1163290 1200120
61037 1200120 1237754 1276543 1316878 1358253 1399814 1441833 1485658 1532078 1580672 1630977 1683204
61026 1683204 1737410 1792991 1849629 1907993 1969146 2034116 2104466 2182403 2269935 2368833 2481670
61015 2481670 2611685 2761020 2930381 3121131 3336693 3581571 3860807 4181656 4554727
61006D554727M37995N16852O11927P25041Q54581R96910J148534J300493J431277
60997A2578337J515414J544431J529683J472804J339824J085818P17077L18644
60989B2102032L428j70202k26297k24639k06764j98032k43479m06304p12112j103381
60979A8614250j464962j698851j774489j719280j580274j399384j208126j026607
60971F742277q62833p17836n92795m89509m06298l38273k81927k36583k01399
60962B614824j73933j51954j34413j20227j07943r6874q7074p8175o9622o1808
60952A532801n5493n0258m5096m0278l7063l5640l4878l4109l3595l3202l2189
60941A101000l0558k9242k8570k7754k6281k4695k3575k2750k1949k1346k1067
$$ plain form
61006 4554727 4992722 5509574 6121501 6846542 7701123 8698033 9846567 11147060 12578337
60997 12578337 14093751 15638182 17167865 18640669 19980493 21066311 21783388 22102032
60989 22102032 22105460 21935258 21708961 21484322 21277558 21079526 20836047 20429743 19717631 18614250
60979 18614250 17149288 15450437 13675948 11956668 10376394 8977010 7768884 6742277
60971 6742277 5879444 5161608 4568813 4079304 3673006 3334733 3052806 2816223 2614824
60962 2614824 2440891 2288937 2154524 2034297 1926354 1829480 1742406 1664231 1594609 1532801
60952 1532801 1477308 1427050 1381954 1341676 1304613 1268973 1234095 1199986 1166391 1133189 1101000
60941 1101000 1070442 1041200 1012630 984876 958595 933900 910325 887575 865626 844280 823213
60930H23213k0780k0155j9232j8102j6725j5186j3722j2431j1281j0282r335q157
60918F47825o749n611m991m406l398k329j777j574j159n01Q5O43J308J702J422
60903F20490Q96Q86J415J918K148K197J867Q76n14j734k631l336l776l920m113
60888F12669m523m773m714m933n708o194n716n133n737p267q297q196p469o528
60874E27481n468m768m901n340n196m619m338m092l026j482p36q78o21N08J399
60859D83923J321J089J560K249K316J820J181L81m72o11L61J586J936J417Q44
60844E00901N68K57k69o88o46k46p5p96k369l695l574k158r57j096k100k674k302
60827D78081j573j252j372j298n09O61J233O75m56j188j280j295j793k789l823
$$ plain form
60930 823213 802433 782278 763046 744944 728219 713033 699311 686880 675599 665317 655982 647825
60918 647825 641076 635465 630474 626068 622670 620341 618564 616990 615831 615330 615415 616058 617366 619068 620490
60903 620490 621386 622272 623687 625605 627753 629950 631817 632693 632179 630445 627814 624478 620702 616782 612669
60888 612669 608146 603373 598659 593726 588018 581824 576108 570975 565238 557971 549674 541478 534009 527481
60874 527481 522013 517245 512344 507004 501808 497189 492851 488759 485733 484251 483515 482637 482016 482524 483923
60859 483923 485244 486333 487893 490142 492458 494278 495459 495840 495368 494757 495118 496704 498640 500057 500901
60844 500901 501469 501726 501457 500769 500123 499877 499802 499006 496637 492942 489368 487210 486253 485157 483057 480383 478081
60827 478081 476508 475256 473884 472586 472077 472738 473971 474646 474190 473002 471722 470427 468634 465845 462022
60812D62022m197l515k348j986k944m241m767m729m876m945m144k831k256k649
60798D11594k908k446k047k479l324l707l304k299j080l51p09j701k113j528q12
60783C80786p68j102j171q77l22O09J761K390K018J102M74M93J105K128L106L431
60767C95163L000K411K173K170K178K258K407K291J731R61K61k25j82O07J536
60752D18740J538M87m64m51M1J15k51m97m52l36k53k85p46j763k945l841m429
60735D04208m774m680m160l803m097m691m817m264l495l012k870k650j833m12
60721C54650P39O71l83j172r96m58k77k15K21P70Q83P05P67R70P26Nm97k57N25
60702C57377J364K002K415K602K522K219J943K005K323K255J363L01L21J677L190
$$ plain form
60812 462022 457825 454310 451962 449976 447032 442791 438024 433295 428419 423474 419330 416499 414243 411594
60798 411594 408686 406240 404193 401714 398390 394683 391379 389080 388000 387649 386940 385239 383126 381598 380786
60783 380786 380018 378916 377745 376868 376546 377155 378916 381306 383324 384426 384900 385393 386498 388626 391732 395163
60767 395163 398163 400574 402747 404917 407095 409353 411760 414051 415782 416743 417004 416779 416597 417204 418740
60752 418740 420278 420765 420301 419850 419891 420006 419755 419258 418806 418470 418217 417932 417186 415423 412478 408637 404208
60735 404208 399434 394754 390594 386791 382694 378003 373186 368922 365427 362415 359545 356895 355062 354650
60721 354650 355389 356060 355677 354505 353509 353051 352774 352559 352780 353550 354433 355138 355905 356875 357601 357606 357109 356852 357377
60702 357377 358741 360743 363158 365760 368282 370501 372444 374449 376772 379027 380390 380691 381012 382689 385879
60687C85879L739L540L480L726L745L304K793K560K548K508K230J636R63P76J366
60672D24793K218K429J626K33j139k226l043l595l875m012m213m437m288l436
60658C97035k175j219q62p08l50J00M91J004J572J546P34K39J199L000L916L328
60642D08850K120R83k61j500k027j926k320l534m361m006l385l424l304j898K2
60627C80029P29J63n8Q54J947K238J929J567J161P11O67J236J750J413L18o48
60611C96006p70j27O22R02P59O32O39L46m57j202j211p08m91p45q34l02M66P94
60593C94319N24O9k8M63J212J517J037L14J83P02J136J023P71R44J404J539J145
60576D08274O64O02J023J696K458L379M597O144P840R297J0149J0404J0491J0790
$$ plain form
60687 385879 389618 393158 396638 400364 404109 407413 410206 412766 415314 417822 420052 421688 422651 423427 424793
60672 424793 427011 429440 431066 431299 430160 427934 424891 421296 417421 413409 409196 404759 400471 397035
60658 397035 394860 393641 392779 392071 391721 391821 392312 393316 394888 396434 397168 397407 398606 401606 405522 408850
60642 408850 410970 411953 411692 410192 408165 406239 403919 400385 396024 392018 388633 385209 381905 380007 380029
60627 380029 380758 380921 380863 381717 383664 385902 387831 389398 390559 391270 391937 393173 394923 396336 396654 396006
60611 396006 395236 395109 395731 396633 397392 398024 398663 399009 398552 397350 396139 395431 394940 394195 393361 393059 393525 394319
60593 394319 394843 394912 394884 395347 396559 398076 399113 399427 399610 400312 401448 402471 403242 404186 405590 407129 408274
60576 408274 408938 409540 410563 412259 414717 418096 422693 428837 436677 445974 456123 466527 477018 487808
60562D87808J1094J0769R468P416M971K258n04k748m043m610m995n328n277m635
60548E01644l547k277j016J93J620L586N800P314P692P761Q615J0223J1730J2762
60534E72100J3571J4133J4069J3372J2297J0622P955M676J566j354m471p175q197
60521F43164p576o803o695o510n717n017m835m269k678j018l18M4J174K705L543
60506E99194L889M950P029R369J1692J4487J7769K0864K3549K6371K9623L2853
60494H01639L5550L7610L9026L9655L9271L7426L3496K7495K0452J3327N924k331
60482A128540j0980j8918k5814l2103l7707m1917m4466m5619m5257m3036l9598
60471G43125l6342l3642l0489k6367k2292j9339j7157j4925j2894j1798j1241
$$ plain form
60562 487808 498902 509671 519139 526555 531526 533784 533280 530532 526489 521879 516884 511556 506279 501644
60548 501644 498097 495820 494804 494997 496617 500203 506003 513317 521009 528770 537385 547608 559338 572100
60534 572100 585671 599804 613873 627245 639542 650164 658119 662795 664361 663007 658536 651361 643164
60521 643164 635588 628785 622090 615580 609863 604846 600011 595742 593064 592046 591728 591772 592946 595651 599194
60506 599194 603083 608033 615062 624431 636123 650610 668379 689243 712792 739163 768786 801639
60494 801639 837189 874799 913825 953480 992751 1030177 1063673 1091168 1111620 1124947 1130871 1128540
60482 1128540 1117560 1098642 1072828 1040725 1003018 961101 916635 871016 825759 782723 743125
60471 743125 706783 673141 642652 616285 593993 574654 557497 542572 529678 517880 506639
60460E06639r977p744n749m936m730m060l049k800l676m623m535l664l120l335
60446D40641l693l561k970k212j437q49p25r25r29o23m34m80k54M11Q28M56j93
60429D23051l35o0M5r8j33l0oNJ71L08K15R3N9k90j098j561q92M64J511K182L075
60408D26676L988M007L029K105K013K433K752K780K449J648O45N1J08N66J250
60393D56500K131K855K945K585K449K714K979L160L541L879L501K557K199K949
60379D96944L844L810L097K656K681K696K627K962L833M668M899M610M321M259
60365E47907M093L393K322J640J899K861L841M422M539M271L938M163N231O552
60351F01072P310P490P708Q151Q355P935O954N580L972K381Q22j227m081o974
$$ plain form
60460 506639 496662 488918 483169 478233 473503 469443 466394 463594 459918 455295 450760 447096 443976 440641
60446 440641 436948 433387 430417 428205 426768 425919 425194 424269 423340 422717 422283 421803 421549 421960 422788 423244 423051
60429 423051 422716 422656 422701 422603 422470 422440 422434 422439 422610 422918 423133 423226 423285 422995 421897 420336 419444 419908 421419 423601 426676
60408 426676 430664 434671 437700 439805 441818 444251 447003 449783 452232 453880 454525 454576 454684 455250 456500
60393 456500 458631 461486 464431 467016 469465 472179 475158 478318 481859 485738 489239 491796 493995 496944
60379 496944 500788 504598 507695 510351 513032 515728 518355 521317 525150 529818 534717 539327 543648 547907
60365 547907 552000 555393 557715 559355 561254 564115 567956 572378 576917 581188 585126 589289 594520 601072
60351 601072 608382 615872 623580 631731 640086 648021 654975 660555 664527 666908 667730 666503 662422 655448
60337F55448q694r025q717q158p128n924n461n803n725m476l068k963m110n178
60323E71018n331m959m778m928n006m558l414j760J05K044M031N873P377Q762
60309E64476J0521J2712J4729J5949J6261J5907J5137J4196J3233J2141J0628
60298G15890Q484N550J605l273q258j2247j4828j6364j7200j7295j6636j5379
60286F10049j3572j1286r101p758p253o871o214n539m966m204l264k742k920l264
60272E21095l147k624k128j888j945k244k427k072j385j055j236j330j079j084
60258D95451j694k191j749p23p4N4M09J285K006J827Q97O8j0N65J220J538J506
60241E00385J221O33j69p56q50p90r82j145p11J79Q84J375K206L295L739L148
$$ plain form
60337 655448 646754 637729 629012 620854 613726 607802 602341 596538 590813 586337 583269 580306 576196 571018
60323 571018 565687 560728 555950 551022 546016 541458 538044 536284 536389 538433 542464 548337 555714 564476
60309 564476 574997 587709 602438 618387 634648 650555 665692 679888 693121 705262 715890
60298 715890 724374 729924 731529 728256 719998 707751 692923 676559 659359 642064 625428 610049
60286 610049 596477 585191 576090 568332 561079 554208 547994 542455 537489 533285 530021 527279 524359 521095
60272 521095 517948 515324 513196 511308 509363 507119 504692 502620 501235 500180 498944 497614 496535 495451
60258 495451 493757 491566 489817 489094 489020 489074 489483 490768 492774 494601 495498 495566 495556 496121 497341 498879 500385
60241 500385 501606 502239 502070 501314 500464 499674 498692 497547 496836 497015 497899 499274 501480 504775 508514 511662
60225E11662K301J979J965J743J474J663K325L087L714M140M362M633N313O261
60211E56622O896P103P423Q033Q344Q033P689P783P828P300O633O448O345N525
60197F58005M204L381L341L362K796J710M41p52j571j912k213l051m226m901m694
60182F53920m253m516n710p149p853p378o184n112m497m014l411k893k571k119
60168E86260j381p61n46l30K49P07M34j96k55L19P28O37O47J182J801J957J875
60151E93327K091K520K526J804Q15K47L13O65J007J513K448L515M024L892L992
60136F24699N143O964Q223Q245P582P185P273P190O278M669L109K048J177J08
60122F99893p86p68J28R77J133R85J157J557J647J306R36Q57R85R44L16r12k027
$$ plain form
60225 511662 513963 515942 517907 519650 521124 522787 525112 528199 531913 536053 540415 545048 550361 556622
60211 556622 563518 570621 578044 586077 594421 602454 610143 617926 625754 633054 639687 646135 652480 658005
60197 658005 662209 665590 668931 672293 675089 676799 677240 676488 674917 673005 670792 667741 663515 658614 653920
60182 653920 649667 645151 639441 632292 624439 617061 610877 605765 601268 597254 593843 590950 588379 586260
60168 586260 584879 584118 583572 583242 583491 584198 584632 584436 584181 584500 585228 585865 586512 587694 589495 591452 593327
60151 593327 595418 597938 600464 602268 603083 603330 603643 604308 605315 606828 609276 612791 616815 620707 624699
60136 624699 629842 636806 645029 653274 660856 668041 675314 682504 688782 693451 696560 698608 699785 699893
60122 699893 699107 698339 698467 699444 700577 701562 702719 704276 705923 707229 708165 709022 710007 710951 711267 710355 708328
60105G08328k180j631j795l524n769o739o041m879m239l864l176k416k155k229
60091F57691j842o79O42J397J629J886K274K273J606P54L29K81J31k16m75n72
60075F67109p31j015j364k050l463n324o791p521p997q583q882q446p572o929
60061E90441o778o863o819o384n522m498l580k608j322p6M63L76N40J409K491
60046E51270L305L989M556M522L870L583M379N530N788N007M075L585L345K929
60032F09733K074P08q52k059k816l661m860n881o275o461p004p615p634p112o625
60017E43660o414o377o568o942o950o138m930m142l950l999m094m114l616k397
60003D73029j120n69n34k60K96N80N48O87J023J073Q04Q29J432K229K819L166
$$ plain form
60105 708328 706148 704517 702722 699198 693429 686690 680649 675770 671531 667667 664491 662075 659920 657691
60091 657691 655849 655170 655812 657209 658838 660724 662998 665271 666877 667631 667960 668241 668372 668156 667681 667109
60075 667109 666378 665363 663999 661949 658486 653162 646371 638850 630853 622270 613388 604942 597370 590441
60061 590441 583663 576800 569981 563597 558075 553577 549997 547389 546067 545991 546454 546830 547370 548779 551270
60046 551270 554575 558564 563120 567642 571512 575095 579474 585004 590792 595799 599874 603459 606804 609733
60032 609733 611807 612515 611663 609604 606788 603127 598267 592386 586111 579650 572646 565031 557397 550285 543660
60017 543660 537246 530869 524301 517359 510409 504271 499341 495199 491249 487250 483156 479042 475426 473029
60003 473029 471909 471340 470806 470546 470842 471422 471970 472657 473680 474753 475557 476386 477818 480047 482866 486032
59987D86032L238K934K458K213K255K230J845R85l31j669k242j838j339j601k268
59972D92902k470k215k013j644o09M70M19m99o09P97K528L394L653L885L757K945
59956E04691K235K505L245L223K297J464J245J067L26p18j487j914k297k642k635
59941E10605k255k007k321k898l039k634k309k498k777k488j629o30L48J350K157
59926D86975K520K802L669N122O347O606N906M797L900L564L598L424K802K240
59912E44272K222K402K120J484J246J755K642L499M150M335L811K892K239K104
59898E81173K233K462K819L041K722J953J353J339J789K369K777K839K789L181
59884F14839M020M440L933L329L651M483M613L893L190K738K024J262J310J898
$$ plain form
59987 486032 489270 492204 494662 496875 499130 501360 503205 504190 503859 502190 499948 498110 496771 495170 492902
59972 492902 490432 488217 486204 484560 483951 484421 484840 484341 483732 484529 487057 490451 494104 497989 501746 504691
59956 504691 506926 509431 512676 515899 518196 519660 520905 521972 522298 521580 520093 518179 515882 513240 510605
59941 510605 508350 506343 504022 501124 498085 495451 493142 490644 487867 485379 483750 483120 483468 484818 486975
59926 486975 489495 492297 495966 501088 507435 514041 519947 524744 528644 532208 535806 539230 542032 544272
59912 544272 546494 548896 551016 552500 553746 555501 558143 561642 565792 570127 573938 576830 579069 581173
59898 581173 583406 585868 588687 591728 594450 596403 597756 599095 600884 603253 606030 608869 611658 614839
59884 614839 618859 623299 627232 630561 634212 638695 643308 647201 650391 653129 655153 656415 657725 659623
59870F59623J547k14k002k652k692k940l015k355j605j682k246k326j864j511
59856F34066j317p57K34J211K073L040M014M660N040N474N891N919N413M409K856
59841F82226R62n35j170j533k402l390l336k091r78j244k776m607o045o865o924
59826F39292o205n078m182l960m421n216n790n632m672l439k689k746l278l726
59812E78258l857l834l839l832l661l248k649k118j969k118j936r94L2Mr98j478
59796E41763n70O47O49m56j394j750k146k609k274r25L88P89O31N52L95l15j411
59779E31964k264k515k254j772j384j153o90L12J346J587J163J104J830K647L003
59764E32924L298L946M538M649M637M942N252N180N094N554O330O832P068P361
$$ plain form
59870 659623 661170 660956 658954 656302 653610 650670 647655 645300 643695 642013 639767 637441 635577 634066
59856 634066 632749 631992 632226 633437 635510 638550 642564 647224 652264 657738 663629 669548 674961 679370 682226
59841 682226 683188 682653 681483 679950 677548 674158 670822 668731 667753 666509 663733 659126 653081 646216 639292
59826 639292 633087 628009 623827 619867 615446 610230 604440 598808 594136 590697 588008 585262 581984 578258
59812 578258 574401 570567 566728 562896 559235 555987 553338 551220 549251 547133 545197 544203 544235 544239 543241 541763
59796 541763 541193 541840 542489 542033 540639 538889 536743 534134 531860 530935 531323 532112 532743 533295 533690 533375 531964
59779 531964 529700 527185 524931 523159 521775 520622 519932 520244 521590 523177 524340 525444 527274 529921 532924
59764 532924 536222 540168 544706 549355 553992 558934 564186 569366 574460 580014 586344 593176 600244 607605
59750F07605P574P416P260P764Q806R506R338Q532P508O500N724N339N121M655
59736G08648L829K841J773N74o10j488j991k279k487k754l330m249n018n080m513
59721F83866l870l409k938k407k212k595l193l448l269l043l033l085k967k681
59707F41716k306j711q30n0J15j70j34M65Q82M85k02k99R3J90q5l3M96P27J55
59688F39504p27j231j377j582k050k703l305l438k885k125j900k263k668l002
59674F08248l640m452m727m377m228m660m940m443l611l073k684k184j908k035
59660E57286j872q42M31R88R92J295K040K641K896L089L177K830K265K135K476
59645E81827K570J948Q30m77j992l613m846n284n007m391l766l341l195l173k935
$$ plain form
59750 607605 615179 622595 629855 637619 646425 655931 665269 673801 681309 687809 693533 698872 703993 708648
59736 708648 712477 715318 717091 717665 717055 715567 713576 711297 708810 706056 702726 698477 693459 688379 683866
59721 683866 679996 676587 673649 671242 669030 666435 663242 659794 656525 653482 650449 647364 644397 641716
59707 641716 639410 637699 636869 636819 636934 636764 636630 637095 637977 638462 638260 637961 638054 638244 638159 638126 638622 639349 639504
59688 639504 638777 637546 636169 634587 632537 629834 626529 623091 620206 618081 616181 613918 611250 608248
59674 608248 604608 600156 595429 591052 586824 582164 577224 572781 569170 566097 563413 561229 559321 557286
59660 557286 555414 554572 555003 555991 556983 558278 560318 562959 565855 568944 572121 574951 577216 579351 581827
59645 581827 584397 586345 587175 586698 584706 581093 576247 570963 565956 561565 557799 554458 551263 548090 545155
59630E45155k183q90N15J173M45j244k583k735k202j976k225k405k343k541l259
59615E20702l949l856k891j637o61n5L32M98M07L96J021K283L433L866L873L984
59599E27746L955L147J723O39M05O09P25O79M92O6m12n43l07j02p9p4j20l28l95
59580E37826o2O3p06j714j697r66j209k664l293j718N54J158m7j249j239l20O67
59563E23384J087O68j33l29K98P49L19k78j81J39j78p27m57O72J818K584L046
59546E32481K938K147J680K794N255P625R165J0406J1842J3193J4075J4522J4615
59533F42738J4088J2336Q634K921l247p346q261p335o278m991k641J30J687J678
59519F44113J188Q48K57p87j856k796l866m951n737o568p939r286r503q645p796
$$ plain form
59630 545155 542972 542082 542597 543770 544215 542971 540388 537653 535451 533475 531250 528845 526502 523961 520702
59615 520702 516753 512897 510006 508369 507708 507653 507985 508483 508890 509286 510307 512590 516023 519889 523762 527746
59599 527746 531701 534848 536571 537210 537615 538224 538949 539628 540120 540186 539774 539231 538924 538822 538743 538669 538549 538221 537826
59580 537826 537764 537827 537121 535407 533710 532744 531535 528871 525578 523860 524414 525572 525525 524276 523037 522717 523384
59563 523384 524471 525139 525006 524677 524975 525724 526043 525765 525584 525723 525545 524818 524361 525033 526851 529435 532481
59546 532481 535419 537566 539246 542040 547295 554920 564085 574491 586333 599526 613601 628123 642738
59533 642738 656826 669162 677796 680717 677470 670124 661863 654528 648250 643259 640618 640748 642435 644113
59519 644113 645301 646149 646406 645619 643763 640967 637101 632150 626413 619845 611906 602620 593117 584472 576676
59504E76676p323o601n575n068n281n240m272k895j878j416j471j963k276j624
59490E23793k58O60O27L38M01O06P69J220K016K636K903L298L934M237M076M202
59474E55458M964N553N250M583M476M877M994M474L603K753K180K103K466K792
59460F10526K679K275K091K502L527M823N858O391O744P213P438O908N931N345
59446F80251N287M956L717J718o47l145n371o768p274p350p204o562n405m301
59432F41902l677l269k560j394pJ246K136K837L900N564P333Q743J0220J2467
59418F85441J5259J7644J9260K0584K1906K2832K2844K1764J9733J7212J4662
59407H99141J1556O389j224q947j3534j4095j2349r977p293m413j903K5J376J040
$$ plain form
59504 576676 569353 562752 557177 552109 546828 541588 537316 534421 532543 531127 529656 527693 525417 523793
59490 523793 523535 524195 524822 525160 525561 526167 526936 528156 530172 532808 535711 539009 542943 547180 551256 555458
59474 555458 560422 565975 571225 575808 580284 585161 590155 594629 598232 600985 603165 605268 607734 610526
59460 610526 613205 615480 617571 620073 623600 628423 634281 640672 647416 654629 662067 668975 674906 680251
59446 680251 685538 690494 694211 695929 695282 692137 686766 679998 672724 665374 658170 651608 646203 641902
59432 641902 638225 634956 632396 631002 630995 632241 634377 637214 641114 646678 654011 662754 672974 685441
59418 685441 700700 718344 737604 758188 780094 802926 825770 847534 867267 884479 899141
59407 899141 910697 917086 915862 906915 893381 879286 866937 856960 849667 845254 843351 843376 844752 845792
59393H45792k650r276j5787j9527k0571k0326j9219j6983j4097j1515r462p598
59381F78781n907m573l341j875m18N40R91J293J679K167K650K830K542K237K443
59366F82039K750K247J180R61K108L383L707L807M907O787Q258R017R765J0828
59352G51744J1774J2348J2878J3668J4533J5120J5344J5423J5586J5708J5297
59341I09423J4137J2671J1286R424O295K338j080l531n950q895j1604j3342j4535
59328I06637j5783j6698j6670j6050j5606j5404j5055j4573j4164j3560j2350
59317G40724j0682r060p682o557n813n369m718l610k574k167k068j430R3K133
59303F81220M137N693O626P109P508P898P897O994M701N81n070j0655j4188j5121
$$ plain form
59393 845792 843142 833866 818079 798552 777981 757655 738436 721453 707356 695841 686379 678781
59381 678781 672874 668301 664960 663085 662667 663207 664198 665491 667170 669337 671987 674817 677359 679596 682039
59366 682039 684789 687036 688216 689177 691285 694668 698375 702182 707089 713876 722134 731151 740916 751744
59352 751744 763518 775866 788744 802412 816945 832065 847409 862832 878418 894126 909423
59341 909423 923560 936231 947517 956941 963236 965574 964494 960963 955013 946118 934514 921172 906637
59328 906637 890854 874156 857486 841436 825830 810426 795371 780798 766634 753074 740724
59317 740724 730042 720982 713300 706743 700930 695561 690843 687233 684659 682492 680424 678994 679087 681220
59303 681220 685357 691050 697676 704785 712293 720191 728088 735082 739783 740364 735294 724639 710451 695330
59289F95330j4472j3138j1097q450o051m441l154j734n27K16J196L112N518P367
59275F49675Q282Q644Q923R440J0345J1356J2071J2666J3607J4421J3889J1801
59263G85120R457P742N933L204K05j924l200m325n332n914o410p287q080p984
59249G61205p181o476n916m824l083j426m71q7K29Q88J982L137L849M213M847
59234G50886N788O140N338M060L270K887K118O39j212l038m638o027p547r476
59220G49188j1226j1730j0925j0049r911r790q741p133o093o046o525o867o511
59207F37641n280l849l215l247k753j419m59p43j470j550j014j87J168K727L076
59192F19426J742M94R83K275K450J667J588K540L324L568M159N328O089N853N199
$$ plain form
59289 695330 680858 667720 656623 648173 642122 637681 634527 632793 632266 632482 633678 636790 642308 649675
59275 649675 657957 666601 675524 684964 695309 706665 718736 731402 745009 759430 773319 785120
59263 785120 794577 802319 808252 811456 811661 809737 806537 802212 796880 790966 784556 777269 769189 761205
59249 761205 754024 747548 741632 736808 733725 732299 731828 731741 731970 732858 734840 737977 741826 746039 750886
59234 750886 756674 762814 768152 772212 775482 778369 780487 781126 779914 776876 772238 766211 758664 749188
59220 749188 737962 726232 715307 705258 695347 685557 676816 669683 663590 657544 651019 644152 637641
59207 637641 632361 628512 625297 622050 619297 617878 617419 616676 615206 613656 612642 612455 613623 616350 619426
59192 619426 621168 621662 622645 624920 627370 629037 630625 633165 636489 640057 644216 649544 655633 661486 666685
59177F66685M809M814N240N998O497O246N728N683N894N668N176N072N190M853
59163G43553M138L513K636Q98j154k431l109m323o161p538q100q677r733j0724
59149F92788j1223j1363j0943r537p751p052p849q860q755p477n661l845k572
59136E89900k303k752l065k911k631k348j763r40l33R7Q61J949K748L071L418
59121E82998M119N075O374Q197J0029J0912J0734J0390J0495J0719J0531R875
59109F90448R024Q321Q068Q084P610O342N126M820M839L995K358J076N07j21j214
59094G59283k249k808l026k920k380j871k043k612k746k510k766l595m159m189
59080G19409m326m802n081n094n548o613p495p664p473p190o547n552m758m327
$$ plain form
59177 666685 671494 676308 681548 687546 694043 700289 706017 711700 717594 723262 728438 733510 738700 743553
59163 743553 747691 751204 753840 754738 753584 751153 748044 743721 737560 730022 721922 713245 703512 692788
59149 692788 681565 670202 659259 649722 641971 634919 627070 618210 609455 601978 596317 592472 589900
59136 589900 587597 584845 581780 578869 576238 573890 572127 571187 570854 570951 571812 573761 576509 579580 582998
59121 582998 587117 592192 598566 606763 616792 627704 638438 648828 659323 670042 680573 690448
59109 690448 699472 707793 715861 723945 731555 737897 743023 747843 752682 756677 759035 760111 760618 760497 759283
59094 759283 757034 754226 751200 748280 745900 744029 741986 739374 736628 734118 731352 727757 723598 719409
59080 719409 715083 710281 705200 700106 694558 687945 680450 672786 665313 658123 651576 646024 641266 636939
59066F36939l818l204l119l715m277m237l748l036k141j441j316j258m02Q66J131
59051F03224M9j059j186q39p46o16K6P63R59P40N93N61M13J27k29n97p03k20P08
59032F01968J646K497L327L813L829M284O168Q807J0433J0589J0575J1335J2309
59019F91580J2802J3034J3206J2714J1031Q460N465K204q42k826l655m224n026
59006G53923n509n180m367l420k136m49J174K504L812N001N438N044M605M572
58992G65012M511M090L583L053K078P13l36q72j504k377k780k501k331k637k527
58977G65175j155J080L246M903N966O458O881P913R348J0294J0632J1096J1740
58964H53577J1752J1152J1067J1679J1508R670P360N946M916K943n9l178o026
$$ plain form
59066 636939 633121 629917 626798 623083 618806 614569 610821 607785 605644 604203 602887 601629 601227 602093 603224
59051 603224 603273 602214 601028 600189 599443 598827 598853 599616 600575 601315 601908 602469 602882 603009 602780 602183 601480 601260 601968
59032 601968 603614 606111 609438 613251 617080 621364 627532 636339 646772 657361 667936 679271 691580
59019 691580 704382 717416 730622 743336 754367 762827 768292 770496 769654 766828 763173 758949 753923
59006 753923 748414 743234 738867 735447 733311 732862 734036 736540 740352 745353 750791 755835 760440 765012
58992 765012 769523 773613 777196 780249 782327 783040 782704 781832 780328 777951 775171 772670 770339 767702 765175
58977 765175 764020 765100 768346 773249 779215 785673 792554 800467 809815 820109 830741 841837 853577
58964 853577 865329 876481 887548 899227 910735 920405 927765 933711 938627 941570 941511 938333 932307
58951I32307q792j1408j3660j5680j7490j8553j8339j6986j4987j2858j1207j0367
58939G61980r775q640p240o412n831m299j943l38o5l9K82kr94j122K95J523J038
58922G18418j45m68m42j321k535k638j868j616k040k120j626j196p96K38J809
58907G01654L161M197N469P024Q371R405J0372J1239J1946J2841J4062J4986J5149
58894H29876J4974J4873J4514J3964J4434J6580J8970J9720J9014J8478J8688
58883A014085J8810J8278J7233J5503J2590Q694M608O95l116o606r529j2251j5070
58870A063924j7265j7850j6992j5711j4434j2866j1013r345q197p736q154r118
58858I15243r580r032q382q683r523r742r206q723q652q655q536q294p736o929
$$ plain form
58951 932307 923515 912107 898447 882767 865277 846724 828385 811399 796412 783554 772347 761980
58939 761980 752205 743565 736325 729913 724082 719783 717840 717502 717437 717398 717680 717678 716684 715562 715857 717380 718418
58922 718418 718273 717805 717363 716042 713507 710869 709001 707385 705345 703225 701599 700403 699607 699845 701654
58907 701654 704815 709012 714481 721505 729876 739281 749653 760892 772838 785679 799741 814727 829876
58894 829876 844850 859723 874237 888201 902635 919215 938185 957905 976919 995397 1014085
58883 1014085 1032895 1051173 1068406 1083909 1096499 1105193 1109801 1110496 1107380 1100774 1091245 1078994 1063924
58870 1063924 1046659 1028809 1011817 996106 981672 968806 957793 948448 940251 932515 924361 915243
58858 915243 905663 896631 888249 879566 870043 860301 851095 842372 833720 825065 816529 808235 800499 793570
58844G93570o652p441q674r465r890j0367j0516r835q916q675q759q074o591n372
58830F74343m954m846m543m005l164j870l51R52J901K476K519K207K257K983L755
58815F69660M054M303M932N426N216M690M329L701K341Q59J1n38j423k331k752
58800G02478l174m260n564o256o388o287n696m793m914o544p677o197l082j167
58786F30479j295j841j681j318j062k96J075K219K805L244L372K436O57p04j124
58771F36966j316j730j989k073k598l602m239m087l670l418l106k548j908j138
58757E99544p4R70J569K060L036M149M528M186L882L800L495L019K798K574J807
58742F41343J016J310K571L439L285K985L529M975O782Q216Q426P213N710N219
$$ plain form
58844 793570 786918 779477 770803 761338 751448 741081 730565 720730 711814 703139 694380 686306 679715 674343
58830 674343 669389 664543 660000 655995 652831 650961 650610 651562 653463 655939 658458 660665 662922 665905 669660
58815 669660 673714 678017 682949 688375 693591 698281 702610 706311 708652 709511 709522 708984 707561 705230 702478
58800 702478 699304 695044 689480 683224 676836 670549 664853 660060 655146 648602 640925 634728 631646 630479
58786 630479 629184 627343 625662 624344 623282 622986 624061 626280 629085 632329 635701 638137 638794 638090 636966
58771 636966 635650 633920 631931 629858 627260 623658 619419 615332 611662 608244 605138 602590 600682 599544
58757 599544 599470 600440 602009 604069 607105 611254 615782 619968 623850 627650 631145 634164 636962 639536 641343
58742 641343 642359 643669 646240 649679 652964 655949 659478 664453 671235 679451 687877 695090 700800 706019
58728G06019N562N629N253N208N587N647N276N143N456N781O236P373Q794R293
58714G92257Q605P749P397P132O584O008N411M203K067o75l692o809r542j1472
58700H15223j3022j4928j6999j8382j8928j9232j9438j9119j8198j6904j5067
58689F25006j2533j0005q329p219n945m859m801n279m927l651k747k806l046k868
58675E45991k584k349j699n20P15J804K934L938M486M923N885P191Q167Q751R161
58660E96794R044Q115P057O323M795J391k612m889n235n386n999o119n546n365
58646E92368n776n604m432l194k275r67O61J354Q45N95J617L149M108M426M282
58631E91157L494K336J628J504J191L54n22j137j578j426j53J606K604K801L171
$$ plain form
58728 706019 711581 717210 722463 727671 733258 738905 744181 749324 754780 760561 766797 774170 782964 792257
58714 792257 800862 808611 816008 823140 829724 835732 841143 845346 847413 846738 843046 836237 826695 815223
58700 815223 802201 787273 770274 751892 732964 713732 694294 675175 656977 640073 625006
58689 625006 612473 602468 594139 586920 580975 576116 571315 566036 561109 557458 554711 551905 548859 545991
58675 545991 543407 541058 539359 538839 539554 541358 544292 548230 552716 557639 563524 570715 578882 587633 596794
58660 596794 605838 613953 621010 627333 632128 633519 630907 626018 620783 615397 609398 603279 597733 592368
58646 592368 586592 580988 576556 573362 571087 570120 570781 572135 572980 573575 575192 578341 582449 586875 591157
58631 591157 594651 596987 598615 600119 601310 601664 601142 600005 598427 597001 596848 598454 601058 603859 607030
58616F07030L811L967L706L808M086L730L216L759M897M818L265J865J355P92
58602F54105j75o20n06j063k372k897k162j624k009k029q30M86R66J405K661M138
58586F47474N133O087P401Q488Q955R327R841J0029R975J0362J0806J0034Q260
58573G62172P340P943Q578Q267Q069R065J0859J2995J5893J9315K1856K2963K3742
58560I39057K4880K5651K5664K5475K4680K1713J6592J1608Q025M405m05m886
58548A122459p183p875q601r553r981r913r850r906j0348j1832j4217j6461j8194
58535I78545j9912k1194k0771j8965j7707j7436j6266j3264j0104q264o946n140
58523H02576l499k698k044j110p16j064j047n31r94k653l509k687k013k685l100
$$ plain form
58616 607030 610841 614808 618514 622322 626408 630138 633354 637113 642010 646828 650093 651958 653313 654105
58602 654105 653930 653310 652804 651741 649369 646472 644310 642686 640677 638648 637818 638304 639270 640675 643336 647474
58586 647474 652607 658694 666095 674583 683538 692865 702706 712735 722710 733072 743878 753912 762172
58573 762172 769512 777455 786033 794300 802369 811434 822293 835288 851181 870496 892352 915315 939057
58560 939057 963937 989588 1015252 1040727 1065407 1087120 1103712 1115320 1123345 1127750 1127345 1122459
58548 1122459 1115276 1107401 1098800 1089247 1079266 1069353 1059503 1049597 1039249 1027417 1013200 996739 978545
58535 978545 958633 937439 916668 897703 879996 862560 846294 833030 822926 814662 807716 802576
58523 802576 799077 796379 794335 793225 792509 791445 790398 789867 788873 786220 782711 780024 778011 775326 772226
58508G72226j961q53j477k680k634j857j774k149k159k225k723k632j426n27r46
58493G44203j402o56L23M76Q24K443M219M854N197O431P875Q681R817J2111J4245
58478H19641J4853J4784J5132J4995J3432J1661J0914J0002P299L422k42l792
58466I32101p424r798j0067r622r574q686n936k798o13J791N316Q055Q441Q415
58452H99601J0119J1943J1253Q864P162N764K889p29l078m588o905r263r706q727
58438I14599q178p716n868l472k496k348q75J820L859N001O310P339O980O282
58424I21237P149Q958R580Q901Q329P690N851L435J809K79k570n791p461q101
58410I59295r373j0542r673p434o223o283o075n574n763n735l891j280j77j20
$$ plain form
58508 772226 770265 769412 767935 765255 762621 760764 758990 756841 754682 752457 749734 747102 745676 745149 744203
58493 744203 742801 742145 742468 742944 743768 746211 750430 755284 760481 766912 774787 783468 793285 805396 819641
58478 819641 834494 849278 864410 879405 892837 904498 915412 925414 932713 936135 935893 932101
58466 932101 924677 914879 904812 895190 885616 876930 870994 868196 867583 869374 874690 882745 891186 899601
58452 899601 909720 921663 932916 941780 948942 954706 957595 956866 953788 949200 942295 933032 923326 914599
58438 914599 906421 898705 892837 889365 886869 884521 883646 885466 889325 894326 900636 907975 914955 921237
58424 921237 928386 937344 946924 955825 964154 971844 977695 981130 982939 983218 980648 974857 967396 959295
58410 959295 949922 939380 929707 922273 916050 909767 903692 898118 892355 886620 882729 881449 881272 881152
58396H81152J150L453M582M330M537N460N634N008M862N010M265L268L694N158
58382I41563O004O401P563Q733Q342P288P633Q874Q937P996P782Q054P356O465
58368A048991P308R265J0210J0399J1565J3075J2910J1694J1768J2914J2929J1749
58356A184777J1175J1167J0278Q999Q781Q635O668M062L413M189M031L486M881
58343A274542P454Q350P712Q185J0053J1387J2310J4432J6804J7183J6519J7513
58331A422444J9548J9892J8855J8810J9065J7069J3710J1931J1112Q436M900L944
58319A589716M981M512K962L921P063Q453P855Q947J2156J4044J4079J5313J7820
58306A711822J8303J6828J7263K0199K2016K1802K2490K4417K4539K2951K3318
$$ plain form
58396 881152 882302 885755 890337 894667 899204 904664 910298 915306 920168 925178 929443 932711 936405 941563
58382 941563 947567 953968 961531 970264 978606 985894 993527 1002401 1011338 1019334 1027116 1035170 1042526 1048991
58368 1048991 1056299 1065564 1075774 1086173 1097738 1110813 1123723 1135417 1147185 1160099 1173028 1184777
58356 1184777 1195952 1207119 1217397 1226396 1235177 1243812 1250480 1254542 1257955 1262144 1266175 1269661 1274542
58343 1274542 1281996 1290346 1298058 1306243 1316296 1327683 1339993 1354425 1371229 1388412 1404931 1422444
58331 1422444 1441992 1461884 1480739 1499549 1518614 1535683 1549393 1561324 1572436 1580872 1585772 1589716
58319 1589716 1594697 1599209 1602171 1606092 1613155 1621608 1629463 1638410 1650566 1664610 1678689 1694002 1711822
58306 1711822 1730125 1746953 1764216 1784415 1806431 1828233 1850723 1875140 1899679 1922630 1945948
58295A945948K5858K6818K5824K6665K9698L0741K8934K8344L0294L1359L0608
58284B261091L1488L4661L6347L5698L6579M0010M2087M1441M1582M3938M5649
58273B690571M6133M8465N2533N4323N3726N5329N9804O2570O2666O4568O9248
58262C319936P2162P2209P3954P8607Q1688Q1932Q3453Q6786Q7237Q4585Q4615
58251D207164Q8493R0723R0389R3706J02237J09505J12960J18263J27777J36053
58241E277270J41027J48325J59962J70160J76908J86127J99794K11904K20856
58232F892333K33331K51063K66850K78768K94725L17564L39844L59124L83512
58223I617114M15861M47992M77300N12987N58800O06484O53971P12115P85313
$$ plain form
58295 1945948 1971806 1998624 2024448 2051113 2080811 2111552 2140486 2168830 2199124 2230483 2261091
58284 2261091 2292579 2327240 2363587 2399285 2435864 2475874 2517961 2559402 2600984 2644922 2690571
58273 2690571 2736704 2785169 2837702 2892025 2945751 3001080 3060884 3123454 3186120 3250688 3319936
58262 3319936 3392098 3464307 3538261 3616868 3698556 3780488 3863941 3950727 4037964 4122549 4207164
58251 4207164 4295657 4386380 4476769 4570475 4672712 4782217 4895177 5013440 5141217 5277270
58241 5277270 5418297 5566622 5726584 5896744 6073652 6259779 6459573 6671477 6892333
58232 6892333 7125664 7376727 7643577 7922345 8217070 8534634 8874478 9233602 9617114
58223 9617114 10032975 10480967 10958267 11471254 12030054 12636538 13290509 14002624 14787937
58214A4787937Q64295R47150J047688J173276J315526J473797J665847J903567
58206B5179083K181718K503042K888001L344232L853496M406607N024995N732636
58198E5113810O541055P484884Q638510J0070583J1811163J3881307J6308589
58191A29849901J9077101K2087299K5157723K7977874L0044036L0802897K9992403
58184C14989234K7720097K4005752J8338141J0037319p46222j2519859k3100119
58177C58724343l0790671l5001818l6049752l4683789l1774923k8126192k4314302
58170A37982896k0655367j7314617j4397833j1940127r896937q204807o825926
58163D8747282n720643m824910m084243l478178k990681k587418k241594j953214
$$ plain form
58214 14787937 15652232 16599382 17647070 18820346 20135872 21609669 23275516 25179083
58206 25179083 27360801 29863843 32751844 36096076 39949572 44356179 49381174 55113810
58198 55113810 61654865 69139749 77778259 87848842 99660005 113541312 129849901
58191 129849901 148927002 171014301 196172024 224149898 254193934 284996831 314989234
58184 314989234 342709331 366715083 385053224 395090543 394344321 381824462 358724343
58177 358724343 327933672 292931854 256882102 222198313 190423390 162297198 137982896
58170 137982896 117327529 100012912 85615079 73674952 63778015 55573208 48747282
58163 48747282 43026639 38201729 34117486 30639308 27648627 25061209 22819615 20866401
58155B0866401j722827j530736j359193j211641j092889r91127q95117q09715
58147A1253156p39476o74800o08317n48169n01541m60639m17537l78050l48656
58138F575971l23681k97336k75238k62321k51584k35970k19971k08982j98227
58129D302661j82723j67677j58716j51359j39988j28248j21238j15883j07956
58120C028873j00597r7310r4290q7731q1302p8778p6651p1392o6681o6094o5798
58109B142249o1761n7259n6163n5432n1390m6946m5706m5044m1729l8474l8328
58098A604017l8408l5509l2314l1867l1536k8530k5727k5922k5908k2486j8913
58087A286897j9068k0444j9187j7126j7467j8270j6581j4659j5834j8211j8508
$$ plain form
58155 20866401 19143574 17612838 16253645 15042004 13949115 12957988 12062871 11253156
58147 11253156 10513680 9838880 9230563 8682394 8180853 7720214 7302677 6924627 6575971
58138 6575971 6252290 5954954 5679716 5417395 5165811 4929841 4709870 4500888 4302661
58129 4302661 4119938 3952261 3793545 3642186 3502198 3373950 3252712 3136829 3028873
58120 3028873 2928276 2830966 2736676 2648945 2567643 2488865 2412214 2340822 2274141 2208047 2142249
58109 2142249 2080488 2023229 1967066 1911634 1860244 1813298 1767592 1722548 1680819 1642345 1604017
58098 1604017 1565609 1530100 1497786 1465919 1434383 1405853 1380126 1354204 1328296 1305810 1286897
58087 1286897 1267829 1247385 1228198 1211072 1193605 1175335 1158754 1144095 1128261 1110050 1091542
58076A091542j8132j9587k0795j8899j6135j6079j7385j6800j5123j4751j4504
58065I03352j2309r970j0094j1053j0023q140p894q213p004n743o754q592q737
58052G88826q252r215j0287r310p712p844q491p443n946o203o969n995m492m795
58038F85872n918n680n003n826o991o394n131n441o603o746o612p653q597p798
58024E95479o751p411q288p141n256n044n645m935l762m010m591l584k300k992
58010E23769m422m022k596k556l250k412o77k90o89K36J730J386k96p90n7j46
57994E04918j119j320r22j325j808n38J718K548J930J738J985J142m37r46n38
57979E07026r61k208k770k673l160l901l532k394j842j658q99l46j134k072j457
$$ plain form
58076 1091542 1073410 1053823 1033028 1014129 997994 981915 964530 947730 932607 917856 903352
58065 903352 891043 881073 870979 859926 849903 841763 833869 825656 818652 812909 806155 797563 788826
58052 788826 780574 771359 761072 751762 744050 736206 727715 720272 714326 708123 701154 695159 690667 685872
58038 685872 679954 674274 669271 663445 656454 650060 644929 639488 632885 626139 619527 611874 603277 595479
58024 595479 588728 581317 573029 565888 560632 555588 549943 545008 541246 537236 532645 529061 526761 523769
58010 523769 519347 515325 512729 510173 506923 504511 503834 503544 502855 503091 504821 506207 505911 505121 505064 504918
57994 504918 503799 502479 501557 500232 498424 497886 499604 502152 504082 505820 507805 508947 508510 507564 507026
57979 507026 506065 503857 501087 498414 495254 491353 487821 485427 483585 481927 481028 480682 479548 477476 476019
57964D76019l65q11j879j166Q86J787J251J010J136L32p16j45J272R03j243k489
57948D75782j923j329j508j200pQ26J036J799L256M279M893O214P962Q726Q625
57933E17431Q990R548Q793P030O103O102N233L069R47q71l455o393p735p152o454
57918E41186o563o608o240o185o200n154l454k742k935k238m37O44M12M73J675
57903D95634K796K934K765K727K177J076L59J25m22q79J69K440L714L040J918
57888E20573J669J759J469J200J228R97K92l47p82j351j718j374j174k412m409
57873E15620n159m380l623l359k412o66K53l42j058p22K01J119K201L202L325
57858E04200K837L056M266N446O279P385Q401Q008O322N009M635M105L155K950
$$ plain form
57964 476019 475654 474843 472964 471798 472684 474471 475722 476732 477868 478200 477484 477339 478611 479514 478271 475782
57948 475782 473859 472530 471022 469822 469815 470641 471677 473476 476732 481011 485904 492118 500080 508806 517431
57933 517431 526421 535969 544762 551792 557895 563997 569230 572299 573246 572375 568920 562527 554792 547640 541186
57918 541186 534623 528015 521775 515590 509390 504236 500782 498040 495105 492867 492430 493074 493486 493959 495634
57903 495634 498430 501364 504129 506856 509033 510109 510468 510593 510171 509292 509461 511901 515615 518655 520573
57888 520573 522242 524001 525470 526670 527898 528895 529187 528840 528058 526707 524989 523615 522441 520029 515620
57873 515620 510461 506081 502458 499099 496687 496021 496274 495932 494874 494152 494353 495472 497673 500875 504200
57858 504200 507037 510093 514359 519805 526084 533469 541870 549878 556200 561209 565844 569949 573104 576054
57844E76054L561L347J733K26l41j227l192m723m349k959k295k630l213l731m092
57829E52169l860k983k141j752j463j060p09j88Q74J852J757J084J277K264K473
57814E49594J499O76N75L0j665l565m819n712o302n938m795m023l766k904j401
57799E07484p65j477k103j793j444j497q96N76J281N02O5J481L463M123L912M423
57783E17335N688O638P170P851Q478Q496Q172Q046P769O782N427M419L830L427
57769F09528L260L221K829K029J320O52n77k079k627k080j896k900m058m285l966
57754E98371l677l010j781r52j137j438q97J48J134K375L967M932M663L994L798
57739F10490L709L301L141L550L601K712J879K094K705K703K454K807L544L969
$$ plain form
57844 576054 579615 582962 584695 584921 584580 583353 580161 575438 571089 568130 565835 563205 559992 556261 552169
57829 552169 548309 545326 543185 541433 539970 538910 538201 538013 538887 540739 542496 543580 544857 547121 549594
57814 549594 551093 551769 552344 552374 550709 547144 542325 536613 530311 524373 519578 515555 511789 508885 507484
57799 507484 506719 505242 503139 501346 499902 498405 497509 498085 499366 499868 499933 501414 504877 509000 512912 517335
57783 517335 523023 529661 536831 544682 553160 561656 569828 577874 585643 592425 597852 602271 606101 609528
57769 609528 612788 616009 618838 620867 622187 622839 622262 620183 617556 615476 613580 610680 606622 602337 598371
57754 598371 594694 591684 589903 588951 587814 586376 585479 585627 586761 589136 593103 598035 602698 606692 610490
57739 610490 614199 617500 620641 624191 627792 630504 632383 634477 637182 639885 642339 645146 648690 652659
57725F52659M152M353M338M267M997O355O498M455J902Q55Q69K66j010j746j786
57710F91424k036k625k844k596k453k560k715l025l368k884j270J94K66l11k9
57695F63168R64J311Q47P65J504K140J939J265O91L27J82M14J043J977L196M548
57679F86281N763P103R323J2459J5434J7600J9871K3427K8097L2910L7537M2042
57667I37847M5858M8029M8136M6078M1332L3100K0921M905j3710l1759m5178n1794
57655A083765n2478m9240m3516l6777l0798k5955k0812j4814r866p595o704n044
57643G80166k920j926j662l04K086L483L119K436K565K985L064L091L231L016
57629H02430K411K131K446K796K734K346J657P07J86Q38K200L039K993K745K687
$$ plain form
57725 652659 656811 661164 665502 669769 674766 681121 687619 692074 693976 694831 695700 695966 694956 693210 691424
57710 691424 689388 686763 683919 681323 678870 676310 673595 670570 667202 664318 663048 663242 663508 663197 663168
57695 663168 664132 665443 666290 667055 668559 670699 672638 673903 674594 674921 675103 675517 676560 678537 681733 686281
57679 686281 692044 699147 708470 720929 736363 753963 773834 797261 825358 858268 895805 937847
57667 937847 983705 1031734 1079870 1125948 1167280 1200380 1221301 1226206 1212496 1180737 1135559 1083765
57655 1083765 1031287 982047 938531 901754 870956 845001 824189 809375 799509 791914 785210 780166
57643 780166 777246 775320 773658 773354 775440 778923 782042 784478 787043 790028 793092 796183 799414 802430
57629 802430 804841 806972 809418 812214 814948 817294 818951 819658 819844 820682 822882 825921 828914 831659 834346
57614H34346K579K472K764L289L500L445L557L590K987K180K218L088L692L549
57600H77256L303L394L459L270L173L304L401L538M084M731M564L384K044J327
57586I24232J231J485J904K179K162K341L178M121M174L455L093L564M164M257
57572I65540M073M039M231M610N055N093M459L843M110M885N031M512M493N409
57558A029383O291O387O280O769P601Q027P884P522P178P007P222P797Q360Q637
57544A132345Q655Q418P846P144O774O905P319P829Q439R090R691J0254J0588
57531A241297J0091Q521O677N687N706O057O370O830P385P659P648P713P826P557
57517A343024O879O313O187O376O799P510Q321Q870R018Q744P922O816O342O976
$$ plain form
57614 834346 836925 839397 842161 845450 848950 852395 855952 859542 862529 864709 866927 870015 873707 877256
57600 877256 880559 883953 887412 890682 893855 897159 900560 904098 908182 912913 917477 920861 922905 924232
57586 924232 925463 926948 928852 931031 933193 935534 938712 942833 947007 950462 953555 957119 961283 965540
57572 965540 969613 973652 977883 982493 987548 992641 997100 1000943 1005053 1009938 1014969 1019481 1023974 1029383
57558 1029383 1035674 1042061 1048341 1055110 1062711 1070738 1078622 1086144 1093322 1100329 1107551 1115348 1123708 1132345
57544 1132345 1141000 1149418 1157264 1164408 1171182 1178087 1185406 1193235 1201674 1210764 1220455 1230709 1241297
57531 1241297 1251388 1259909 1266586 1272273 1277979 1284036 1290406 1297236 1304621 1312280 1319928 1327641 1335467 1343024
57517 1343024 1349903 1356216 1362403 1368779 1375578 1383088 1391409 1400279 1409297 1418041 1425963 1432779 1439121 1446097
57503A446097P768P460O395O189P446R001R546R073Q355P845P532P307P133P136
57489A554283P627Q659R734J0360J0636J0898J1143J1411J2192J3598J4632J4275
57477A689448J3059J2509J3183J4225J4647J4121J2715J0921R782R946J0706J0915
57465A836177J0632J0759J1358J1633J1480J1652J2352J2915J3108J3453J4022
57454A969541J4152J3649J3127J2890J2527J1971J1892J2617J3601J4284J4707
57443B114958J5015J5162J5271J5488J5506J5042J4660J5106J5963J6149J5627
57432B283947J5331J5471J5415J5233J5787J6936J7385J6788J6452J7271J8424
57421B464440J8907J8936J8931J8414J7019J5579J5156J5683J6428J7085J7678
$$ plain form
57503 1446097 1453865 1461325 1467720 1473909 1481355 1490356 1499902 1508975 1517330 1525175 1532707 1540014 1547147 1554283
57489 1554283 1561910 1570569 1580303 1590663 1601299 1612197 1623340 1634751 1646943 1660541 1675173 1689448
57477 1689448 1702507 1715016 1728199 1742424 1757071 1771192 1783907 1794828 1804610 1814556 1825262 1836177
57465 1836177 1846809 1857568 1868926 1880559 1892039 1903691 1916043 1928958 1942066 1955519 1969541
57454 1969541 1983693 1997342 2010469 2023359 2035886 2047857 2059749 2072366 2085967 2100251 2114958
57443 2114958 2129973 2145135 2160406 2175894 2191400 2206442 2221102 2236208 2252171 2268320 2283947
57432 2283947 2299278 2314749 2330164 2345397 2361184 2378120 2395505 2412293 2428745 2446016 2464440
57421 2464440 2483347 2502283 2521214 2539628 2556647 2572226 2587382 2603065 2619493 2636578 2654256
57410B654256J8108J8459J9002J9478J9173J8238J7909J8807K0045K0623K0755
57399B864853K0998K1103K0668K0097J9989K0219K0492K1048K1977K2568K2280
57388C096292K1826K2233K3324K4047K4020K3842K4033K4395K4511K4324K4172
57377C357019K4381K4744K4622K3843K3259K3670K4463K4323K3192K2361K2526
57366C618403K3033K3305K3675K4276K4522K4304K4490K5435K6238K6316K6450
57355C890447K7273K7995K7753K7247K7647K8763K9501K9535K9344K9181K9118
57344D203804K9423K9897K9469K7720K6122K6442K8347K9953L0347L0283L0516
57333D522323L0838L0852L0599L0201K9701K9383K9568L0071L0476L0831L1427
$$ plain form
57410 2654256 2672364 2690823 2709825 2729303 2748476 2766714 2784623 2803430 2823475 2844098 2864853
57399 2864853 2885851 2906954 2927622 2947719 2967708 2987927 3008419 3029467 3051444 3074012 3096292
57388 3096292 3118118 3140351 3163675 3187722 3211742 3235584 3259617 3284012 3308523 3332847 3357019
57377 3357019 3381400 3406144 3430766 3454609 3477868 3501538 3526001 3550324 3573516 3595877 3618403
57366 3618403 3641436 3664741 3688416 3712692 3737214 3761518 3786008 3811443 3837681 3863997 3890447
57355 3890447 3917720 3945715 3973468 4000715 4028362 4057125 4086626 4116161 4145505 4174686 4203804
57344 4203804 4233227 4263124 4292593 4320313 4346435 4372877 4401224 4431177 4461524 4491807 4522323
57333 4522323 4553161 4584013 4614612 4644813 4674514 4703897 4733465 4763536 4794012 4824843 4856270
57322D856270L2048L2199L1934L1767L1799L1644L1237L1046L1373L1963L2358
57311E205638L2332L1962L1517L1266L1216L1228L1362L1777L2283L2531L2659
57300E555771L3103L3659L3590L2866L2342L2322L2007L1032L0417L1170L2780
57289E911059L4032L4601L4936L5253L5543L5962L6382L6212L5468L5180L5823
57278F300451L6290L5609L4742L5240L6773L7605L7107L6148L5265L4100L2698
57267F692028L1799L1474L0838K9494K8151K7432K7121K6948K7159K7863K8585
57256G008892K8937K9019K8972K8719K8405K8417K8731K8851K8617K8396K8333
57245G324289K8036K7269K6303K5356K4297K3169K2446K2383K2582K2589K2574
$$ plain form
57322 4856270 4888318 4920517 4952451 4984218 5016017 5047661 5078898 5109944 5141317 5173280 5205638
57311 5205638 5237970 5269932 5301449 5332715 5363931 5395159 5426521 5458298 5490581 5523112 5555771
57300 5555771 5588874 5622533 5656123 5688989 5721331 5753653 5785660 5816692 5847109 5878279 5911059
57289 5911059 5945091 5979692 6014628 6049881 6085424 6121386 6157768 6193980 6229448 6264628 6300451
57278 6300451 6336741 6372350 6407092 6442332 6479105 6516710 6553817 6589965 6625230 6659330 6692028
57267 6692028 6723827 6755301 6786139 6815633 6843784 6871216 6898337 6925285 6952444 6980307 7008892
57256 7008892 7037829 7066848 7095820 7124539 7152944 7181361 7210092 7238943 7267560 7295956 7324289
57245 7324289 7352325 7379594 7405897 7431253 7455550 7478719 7501165 7523548 7546130 7568719 7591293
57234G591293K3058K4180K5552K6651K7226K7414K7557K7804K7984K7913K7724
57223G884356K7611K7442K6896K5855K4400K2547K0365J8259J6786J6079J5679
57212H126275J5005J3891J2740J2065J1853J1442J0275Q646P245O158M849L129
57200H243573J404j23j684l160l902l729l354l316l225k655k047k029k427k624
57186H210702k464k201j969j884k224k948l501l548l492l852m582n406o240o935
57172H159456p252p427p999q788r073r156j0439j3284j6121j7688j8836k0820
57160H012573k3116k4512k5316k6718k8704l0484l2486l5925m0536m4555m7052
57149G653169m8692n0042n0700n0404m9606m8479m6513m3439l9558l5051k9983
$$ plain form
57234 7591293 7614351 7638531 7664083 7690734 7717960 7745374 7772931 7800735 7828719 7856632 7884356
57223 7884356 7911967 7939409 7966305 7992160 8016560 8039107 8059472 8077731 8094517 8110596 8126275
57212 8126275 8141280 8155171 8167911 8179976 8191829 8203271 8213546 8222192 8229437 8235595 8240444 8243573
57200 8243573 8244977 8244854 8243170 8240010 8236108 8232379 8229025 8225709 8222484 8219829 8217782 8215753 8213326 8210702
57186 8210702 8208238 8206037 8204068 8202184 8199960 8197012 8193511 8189963 8186471 8182619 8178037 8172631 8166391 8159456
57172 8159456 8152204 8144777 8136778 8127990 8118917 8109761 8099322 8086038 8069917 8052229 8033393 8012573
57160 8012573 7989457 7964945 7939629 7912911 7884207 7853723 7821237 7785312 7744776 7700221 7653169
57149 7653169 7604477 7554435 7503735 7453331 7403725 7355246 7308733 7265294 7225736 7190685 7160702
57138G160702k5196k1877j9994j8348j6605j6135j8207k2335k7138l2007l7001
57127F905859m1570m4319m4115m1032l6106l0312k3831j6347q051L5O840J2067
57115F639118J6107J9662K3799K9870L8875N1184O7104Q7119J11311J39297J71429
57104G394875K09428K55300L10293L75600M53448N46666O57527P87722R39164
57095A1930023J114414J316735J549693J815616K113326K437086K776895L118624
57087B8172412L444957L739493L991845M197949M354490M451493M464767M349398
57079F1166804M044859L503230K727356J782675P65398k43304j194800k058733
57071G0493485k808679l425811l906141m255679m480474m584520m573588m456787
$$ plain form
57138 7160702 7135506 7113629 7093635 7075287 7058682 7042547 7024340 7002005 6974867 6942860 6905859
57127 6905859 6864289 6819970 6775855 6734823 6698717 6668405 6644574 6628227 6620176 6620211 6627051 6639118
57115 6639118 6655225 6674887 6698686 6728556 6767431 6818615 6885719 6972838 7084149 7223446 7394875
57104 7394875 7604303 7859603 8169896 8545496 8998944 9545610 10203137 10990859 11930023
57095 11930023 13044437 14361172 15910865 17726481 19839807 22276893 25053788 28172412
57087 28172412 31617369 35356862 39348707 43546656 47901146 52352639 56817406 61166804
57079 61166804 65211663 68714893 71442249 73224924 73990322 73747018 72552218 70493485
57071 70493485 67684806 64258995 60352854 56097175 51616701 47032181 42458593 38001806
57063C8001806m246517l960644l623275l260018k891986k534770k200226j896251
57055A3388119j625857j388949j184737j011431q65273p41985o38639n52827m81256
57046D897165m20733l69690l27238k91626k60893k34185k11075j90371j70905
57037B420449j52715j36257j21034j06143r1460p7309o3492m9647l6182k4205
57027A562005j4761q160l574J11J532m412k2196m9131p5488r2488r8621r7498
57015A097319r2358q4654p5699o6700n7805m9045m1516l6119l2070k8217k4911
57004E08225k2992k1844k0145j7803j5651j3963j2569j1745j1584j1193r744p628
56992C31364n512l310j119J92O24J937N235Q929J0814J1028J1030J0851R453O832
$$ plain form
57063 38001806 33755289 29794645 26171370 22911352 20019366 17484596 15284370 13388119
57055 13388119 11762262 10373313 9188576 8177145 7311872 6569887 5931248 5378421 4897165
57046 4897165 4476432 4106742 3779504 3487878 3226985 2992800 2781725 2591354 2420449
57037 2420449 2267734 2131477 2010443 1904300 1812840 1735531 1672039 1622392 1586210 1562005
57027 1562005 1547244 1539084 1535510 1535621 1537153 1532741 1510545 1461414 1385926 1293438 1194817 1097319
57015 1097319 1004961 920307 844608 777908 720103 671058 629542 593423 561353 533136 508225
57004 508225 485233 463389 443244 425441 409790 395827 383258 371513 359929 348736 338992 331364
56992 331364 325852 322542 321423 321615 322239 324176 329411 338340 349154 360182 371212 382063 391516 398348
56978C98348L587q04o972j3449j7738j9330j9684j9489j8104j5498j2636r830
56966B48401o590l167m80J612M184P332J0061J2020J3767J5219J5660J5347J5246
56953C48612J4838J2007N759k323r848j5547j9087k0405j9907j8322j5891j2527
56941B47359q811n694l079N9L899P429J0223J3216J7151K1225K4018K4954K4345
56928C76294K2555J9534J4668P081l215j4331k3419k8830l0927l0874k9389k6762
56916B52385k3348j9675j6340j3739j1622r364p027n652n824o570o507n511m341
56903A16865l260k040q72j06O26J893L473M793N972P385Q753R801J1252J3832
56889A78367J6813J8945K0341K1950K3513K3742K2281J9811J6377J1357N211m32
$$ plain form
56978 398348 401935 401131 394159 380710 362972 343642 323958 304469 286365 270867 258231 248401
56966 248401 241811 238644 238164 239776 243960 251292 261353 273373 287140 302359 318019 333366 348612
56953 348612 363450 375457 381216 378893 369045 353498 334411 314006 294099 275777 259886 247359
56941 247359 238548 232854 229775 229834 233733 241162 251385 264601 281752 302977 326995 351949 376294
56928 376294 398849 418383 433051 440132 436917 422586 399167 370337 339410 308536 279147 252385
56916 252385 229037 209362 193022 179283 167661 158297 151270 145618 139794 133224 126717 121206 116865
56903 116865 113605 111565 110693 110587 111213 113106 116579 121372 127344 134729 143482 153283 164535 178367
56889 178367 195180 214125 234466 256416 279929 303671 325952 345763 362140 373497 378708 378276
56877C78276m757q220j0903j1884j0775q400n490j928K272O439J0247J4235J8898
56864C68010K4096K9554L5050L9998M3663M5838M6517M5031M0463L2649K1893
56853G72762Q266p408k2303l3123l8867m0699l9438l4929k7800j9699j1345k134
56841E03283P887J7413K5847L4214M3424N3010O2076P0028P5733P7470P4485O7259
56829A112129N5627L8079J4086j3869m1205o3502p7758q3032q0835p4018o4645
56818G21057n3550m1715l0538k0387j0370q4R783J8989K8265L7628M5579N0781
56806G55438N3189N2833M8879M0660K8351J2040q198l0241m9516o2109o7458o7231
56794G06637o2860n5410m6569l8088l0591k3863j7686j1667n089K170R176J5053
$$ plain form
56877 378276 373519 365299 354396 342512 331737 323337 317847 315919 318191 324630 334877 349112 368010
56864 368010 392106 421660 456710 496708 540371 586209 632726 677757 718220 750869 772762
56853 772762 781028 773620 751317 718194 679327 638628 599190 564261 536461 516762 505417 503283
56841 503283 511170 528583 554430 588644 632068 685078 747154 817182 892915 970385 1044870 1112129
56829 1112129 1167756 1205835 1219921 1206052 1164847 1101345 1023587 940555 859720 785702 721057
56818 721057 667507 625792 595254 574867 564497 564413 574196 593185 621450 659078 704657 755438
56806 755438 808627 861460 910339 950999 979350 991390 983192 952951 903435 841326 773868 706637
56794 706637 643777 588367 541798 503710 473119 449256 431570 419903 414814 416984 426160 441213
56782D41213J9759K3199K4652K3820K1462J8084J2834M642o186j8109k9297l7911
56770D98162m2533m3200m1341l8168l4004k9381k5399k2319j9135j5471j2525
56759A74686j1187j0508r215p548o361n524m522l682l421l132k118r31n29p24
56745A05284p18n24o14p62m77j29l69q87q72m16k47l82j57N28J002Q57M13J66
56727A01696L36Q46J347J470J278J185J284J307J361J859K519K407J363L38m9
56712A20547k34n03l33M21Q93N66J23J48J51k30l03L78R57O61J37K75O66M94p
56693A24807k47n40j256j618p78N42Q81J32m89k05P08J728K512K788K618K467
56677A34050K519K405K074K053K394K428K043K038K464K065L57j124r03M37J522
$$ plain form
56782 441213 460972 484171 508823 532643 554105 572189 585023 589665 583479 565370 536073 498162
56770 498162 455629 412429 371088 332920 298916 269535 244136 221817 202682 187211 174686
56759 174686 163499 152991 143776 136228 129867 124343 119821 116139 112718 109586 107468 106537 106008 105284
56745 105284 104566 104042 103428 102666 102189 102060 101691 100804 99932 99516 99269 98887 98730 99258 100260 101117 101530 101696
56727 101696 102032 102878 104225 105695 106973 108158 109442 110749 112110 113969 116488 118895 120258 120596 120547
56712 120547 120313 119810 119477 119898 120791 121357 121480 121628 121779 121549 121246 121624 122581 123242 123379 123654 124320 124814 124807
56693 124807 124560 124020 122764 121146 120368 120910 121791 121923 121434 121229 121937 123665 126177 128965 131583 134050
56677 134050 136569 138974 141048 143101 145495 147923 149966 152004 154468 156533 156890 155766 154863 155300 156822
56662A56822K098K363J777J97r83o09L72M33j53j78K76L18J03L09M89j95j175
56645A62264j262o50m14n79m55k61o11r14k39P72P20j81n13m1K74L25R49K082
56627A61266K757K841K971K886J750N4p55n54n49j041j076n29n05j278j664j018
56611A65556k53l29j067j932k729l125k746j999j677j689j348q60j158k172k653
56596A39819j944o76L70R55Q97J75n11m02J67M24N94J342K193K120J418J264J672
56579A49877J604R90Q37J297J481J222J259J587J396P82P32J313J730K197L724
56564A72028N816O625N850N317O072O940O817O380O486O598N963M851L661K125
56550B51529K82j076j689k334l291l664k949j987j624j629j662k030k776l162
$$ plain form
56662 156822 158920 161283 163060 163257 162274 161665 162037 162470 162317 162139 162415 162733 162836 163145 163634 163439 162264
56645 162264 161002 160352 159938 159359 158904 158643 158032 157118 156879 157651 158371 158190 157677 157636 157910 158235 159184 161266
56627 161266 164023 166864 169835 172721 174471 174525 173770 173216 172667 171626 170550 170021 169516 168238 166574 165556
56611 165556 165303 164974 163907 161975 159246 156121 153375 151376 149699 148010 146662 145802 144644 142472 139819
56596 139819 137875 137199 137569 138524 139421 139596 139085 138683 138850 139274 139868 141210 143403 145523 146941 148205 149877
56579 149877 151481 152471 153308 154605 156086 157308 158567 160154 161550 162332 163064 164377 166107 168304 172028
56564 172028 177844 184469 190319 195636 201708 208648 215465 221845 228331 234929 240892 245743 249404 251529
56550 251529 251811 250735 249046 246712 243421 239757 236808 234821 233197 231568 229906 227876 225100 221938
56536B21938k816k322k134k024j964k355k876k519j255l15l09l84J20O24N51K86
56520B02246J77j26o85q35m10j51l07j44N51P96L2q65r57n27l42o15j216j906
56502A94716k050j206j97l16j312j716j282j272k026k266j475r02j351j849j526
56487A73970j008q64m43N90J248Q93L83M18L56j74k00P68J488J034M68R70J740
56470A81637J442M21j28j26j30P3Q26J469J322Q86P94N66k62q42l54L72J78l74
56452A87770O9J350K080J710R44M04J61K16M04J90n90j222j093m78K49J290K486
56435A95940K802J777M77L3J63J56J82N47P05K74J8O54J531J759J642J748J556
56418B11964M16j022j710j733j687j420o77j73n58j130r57m38l51j80R86K557
$$ plain form
56536 221938 219122 216800 214666 212642 210678 208323 205447 202928 201673 201358 201049 200665 200785 201409 201960 202246
56520 202246 202423 202297 201612 200777 200367 200216 199909 199765 200316 201112 201144 200279 199322 198795 198453 197838 196622 194716
56502 194716 192666 191460 191263 190947 189635 187919 186637 185365 183339 181073 179598 178696 177345 175496 173970
56487 173970 172962 172098 171655 172245 173493 174386 174769 175187 175543 175369 175169 175937 177425 178459 178927 179897 181637
56470 181637 183079 183500 183372 183246 183116 183189 184015 185484 186806 187692 188486 189052 188790 187948 187594 187966 188144 187770
56452 187770 187839 189189 191269 192979 193923 194327 194488 194704 195108 195298 194708 193486 192393 191915 192164 193454 195940
56435 195940 198742 200519 200996 201029 201192 201348 201530 202077 202782 203056 203074 203728 205259 207018 208660 210408 211964
56418 211964 212380 211358 209648 207915 206228 204808 204131 203958 203400 202270 201313 200875 200524 200344 201330 203887
56402B03887L130K682K477L042L691L798L334K331J020K55O51J573J906J569J283
56387B36629J219R67N71N48J038J699K300K789L044L037K914K555J599K57o63
56372B60503q17o40m00P0M90L20Q3R04K332K449R28n1R73K494K434J106J23m6
56354B73255K03R40K048K464J666P96P90P33l01j246p73L25M36j99k04N17J048
56337B82498J351J917K318J934J428J728K351K415K415L143L798L210K119K077
56323C14702K761K621J666J422K348L289L457L148K599J763J103J148J474J400
56309C44901J250J695K399K694K911L676M523M656M306M118L960L677L942M942
56295C93650N441M728M096M700N325M418K961L009M536O083P438R151J0401R980
$$ plain form
56402 203887 207017 209699 212176 215218 218909 222707 226041 228372 229392 229647 230298 231871 233777 235346 236629
56387 236629 237848 238815 239386 239934 240972 242671 244971 247760 250804 253841 256755 259310 260909 261166 260503
56372 260503 259686 259046 258646 258716 259206 259526 259609 260513 262845 265294 266222 266171 267144 269638 272072 273178 273301 273255
56354 273255 273458 274398 276446 278910 280576 281372 282162 282895 282594 281348 280575 280900 281336 281137 280933 281450 282498
56337 282498 283849 285766 288084 290018 291446 293174 295525 297940 300355 303498 307296 310506 312625 314702
56323 314702 317463 320084 321750 323172 325520 328809 332266 335414 338013 339776 340879 342027 343501 344901
56309 344901 346151 347846 350245 352939 355850 359526 364049 368705 373011 377129 381089 384766 388708 393650
56295 393650 399091 403819 407915 412615 417940 422358 425319 428328 432864 438947 446385 455536 465937 475917
56281D75917Q716Q346Q769Q830R043J0731J3139J4229J4025J4321J5498J6319
56269F17883J6766J8156K0454K2178K3076K4408K6452K8293L0157L3398L7977
56258H99198M2375M6295N1089N7193O3534O9830P7140Q5724R4463J02884J11721
56247A701446J21031J29594J36576J42162J46363J48814J49600J48618J44435
56238B968639J35537J22416J06585Q8191O6665M3059J9242m676k9503n4013p5596
56227C386546r3568j09128j22153j31051j35845j38466j39623j38130j33733j27987
56217B116862j21878j15080j07925j01557r5694q8741q0622p3166o7246o1923
56207A203030n6705n2251m8426m4103l9319l5389l2550k9657k6452k3821k1687
$$ plain form
56281 475917 484633 492979 501748 510578 519621 530352 543491 557720 571745 586066 601564 617883
56269 617883 634649 652805 673259 695437 718513 742921 769373 797666 827823 861221 899198
56258 899198 941573 987868 1038957 1096150 1159684 1229514 1306654 1392378 1486841 1589725 1701446
56247 1701446 1822477 1952071 2088647 2230809 2377172 2525986 2675586 2824204 2968639
56238 2968639 3104176 3226592 3333177 3421368 3488033 3531092 3550334 3545658 3516155 3462142 3386546
56227 3386546 3292978 3183850 3061697 2930646 2794801 2656335 2516712 2378582 2244849 2116862
56217 2116862 1994984 1879904 1771979 1670422 1574728 1485987 1405365 1332199 1264953 1203030
56207 1203030 1146325 1094074 1045648 1001545 962226 926837 894287 864630 838178 814357 792670
56196G92670j9007j5994j3969j2932j1658j0164r527r345q096n997m765m456l465
56183F63295j716r01j411j844j734j808j600R4K276K573J158O16J686K583K759
56168F66026L648N297N963N642O274P793P840O214N687P344R078R830J1365J4293
56154G72294J6358J6483J6877J9143K1757K3392K5486K9459L4346L9117M4503
56143A059215N0856N6983O2723O9801P8551Q6681R2697R7557J01466J02175R8147
56132A956852R0586Q0957O9455N7351M7566M1202L6312L1333K6750K2170J5354
56121B475888N699m524j3872k3307l2866m0535m6114n2570o1617p1336p9752q7158
56109A967936r3165r5286r2536q7083q0500p1930o1556n1991m4328l6601k8061
$$ plain form
56196 792670 773663 757669 743700 730768 719110 708946 699419 690074 681978 675981 671216 666760 663295
56183 663295 661579 660678 659267 657423 655689 653881 652281 652375 654651 657224 658382 658998 660684 663267 666026
56168 666026 669674 674971 680934 686576 692850 700643 708483 714697 720384 727728 736806 746636 758001 772294
56154 772294 788652 805135 822012 841155 862912 886304 911790 941249 975595 1014712 1059215
56143 1059215 1110071 1167054 1229777 1299578 1378129 1464810 1557507 1655064 1756530 1858705 1956852
56132 1956852 2047438 2128395 2197850 2255201 2302767 2343969 2380281 2411614 2438364 2460534 2475888
56121 2475888 2481587 2477063 2463191 2439884 2407018 2366483 2320369 2267799 2206182 2134846 2055094 1967936
56109 1967936 1874771 1779485 1686949 1599866 1519366 1447436 1385880 1333889 1289561 1252960 1224899
56098A224899k1006j6496j2353p576m434l942l432j122J086J776K829N415P420
56085A173064P550P877R581J0443R330Q858J0641J2206J1698J1338J3036J4802
56073A300424J4796J4809J6373J7580J7027J6796J8311J9402J8730J8766K1057
56062A494071K2995K2653K2310K3732K4577K3136K1959K3062K4163K3375K2844
56051A748877K4021K4308K2308K1333K3651K6329K6848K7494L0053L1722L0814
56040B037758L0821L4109L7288L7650L8211M1351M3683M2783M2645M6541N0633
56029B483473N0963N0617N3452N6815N7309N7730O1244O4611O4412O4091O7496
56018C132213P1331P1599P1568P5479Q0347Q1990Q3266Q8187R3794R6230R8829
$$ plain form
56098 1224899 1203893 1187397 1175044 1167468 1163034 1159092 1155660 1154538 1155624 1157400 1160229 1165644 1173064
56085 1173064 1180614 1188491 1198072 1208515 1217845 1226703 1237344 1249550 1261248 1272586 1285622 1300424
56073 1300424 1315220 1330029 1346402 1363982 1381009 1397805 1416116 1435518 1454248 1473014 1494071
56062 1494071 1517066 1539719 1562029 1585761 1610338 1633474 1655433 1678495 1702658 1726033 1748877
56051 1748877 1772898 1797206 1819514 1840847 1864498 1890827 1917675 1945169 1975222 2006944 2037758
56040 2037758 2068579 2102688 2139976 2177626 2215837 2257188 2300871 2343654 2386299 2432840 2483473
56029 2483473 2534436 2585053 2638505 2695320 2752629 2810359 2871603 2936214 3000626 3064717 3132213
56018 3132213 3203544 3275143 3346711 3422190 3502537 3584527 3667793 3755980 3849774 3946004 4044833
56007D044833J05615J12967J16465J19761J27643J36732J42314J47799J57764
55998E211893J68401J74861J81211J92750K05558K14284K23024K37358K53220
55989G062560K65265K78412K98900L21973L41155L61402L89691M21377M49976
55980A0190711M81363N23399N70826O16343O66819P31805Q06324Q83113R71278
55971A6441981J083594J216392J362860J534901J749794K007243K303213K652942
55963C0352920L072980L553569M078590M661478N332619O108151P008051Q090879
55955G2259237R429602J1061578J2996480J5252126J7832959K0677865K3643838
55948A83153685K6472288K8709388K9769608K9259074K7203587K3732849J8511838
$$ plain form
56007 4044833 4150448 4263415 4379880 4499641 4627284 4764016 4906330 5054129 5211893
55998 5211893 5380294 5555155 5736366 5929116 6134674 6348958 6571982 6809340 7062560
55989 7062560 7327825 7606237 7905137 8227110 8568265 8929667 9319358 9740735 10190711
55980 10190711 10672074 11195473 11766299 12382642 13049461 13781266 14587590 15470703 16441981
55971 16441981 17525575 18741967 20104827 21639728 23389522 25396765 27699978 30352920
55963 30352920 33425900 36979469 41058059 45719537 51052156 57160307 64168358 72259237
55955 72259237 81688839 92750417 105746897 120999023 138831982 159509847 183153685
55948 183153685 209625973 238335361 268104969 297364043 324567630 348300479 366812317
55941C66812317J0816592M95716j1193428k1959041k9791213l3936435l4812677
55934B46431831l3340207l0445750k6896799k3237134j9760567j6594247j3814733
55927H2342394j1465596r521121p913254o593081n530107m674679l968621l382851
55919B9293084k908372k521513k190830j907028j674621j482788j312148j161089
55911A4134695j038579r38536q45793p60000o90300o32978n76483n22352m80002
55902G649672m46271m10153l72834l43788l21492k96483k69602k49489k35173
55893D704387k18056j98369j83771j73944j61757j47460j37430j30878j21513
55884C231209j10368j03837j00888r5063q7370q4740q7092q7789q5534q4475q3994
$$ plain form
55941 366812317 377628909 378124625 366931197 344972156 315180943 281244508 246431831
55934 246431831 213091624 182645874 155749075 132511941 112751374 96157127 82342394
55927 82342394 70876798 61355677 53442423 46849342 41319235 36644556 32675935 29293084
55919 29293084 26384712 23863199 21672369 19765341 18090720 16607932 15295784 14134695
55911 14134695 13096116 12157580 11311787 10551787 9861487 9228509 8652026 8129674 7649672
55902 7649672 7203401 6793248 6420414 6076626 5755134 5458651 5189049 4939560 4704387
55893 4704387 4486331 4287962 4104191 3930247 3768490 3621030 3483600 3352722 3231209
55884 3231209 3120841 3017004 2916116 2821053 2733683 2648943 2561851 2474062 2388528 2304053 2220059
55873B220059p9683p3238p0539p0886o8380o2863n9390n8068n4419m8823m5878
55862A527892m5244m2477l7989l6040l5879l3054k8560k7461k9286k8857k5973
55851A157072k5268k6856k6150k2888k1638k3079k3081k0858k0080k1467k1795
55840I03912k0611k0675k1577k0046j6733j5567j6414j5424j2607j1803j3075
55829G19380j2393r296p652q339q128o492o588q645r125p477p173r027r781q504
55815F00760q172r705j0227q618p232o979o007m189l655m042k567N53K106J878
55801E33904L106O240P992P406P197P942O756L135M31j49j642n494q757r220q639
55786E50208q852q998q485q637r656r797r025r574j1618j2367j0702q712p487
$$ plain form
55873 2220059 2140376 2067138 1996599 1925713 1857333 1794470 1735080 1677012 1622593 1573770 1527892
55862 1527892 1482648 1440171 1402182 1366142 1330263 1297209 1268649 1241188 1211902 1183045 1157072
55851 1157072 1131804 1104948 1078798 1055910 1034272 1011193 988112 967254 947174 925707 903912
55840 903912 883301 862626 841049 821003 804270 788703 772289 756865 744258 732455 719380
55829 719380 706987 697691 690039 681700 673572 667080 660492 651847 642722 635245 628072 619045 609264 600760
55815 600760 592588 582883 572656 564038 556806 549827 543820 539631 535976 531934 529367 529920 532026 533904
55801 533904 537010 543250 551242 558648 565845 573787 580543 583678 584109 583960 582318 576824 568067 558847 550208
55786 550208 541356 532358 523873 515236 505580 495783 486758 477184 465566 453199 442497 433785 426298
55773D26298n486k352k53L3M87J916K421J013q80k709n754r703j2082j2257j2290
55758C68402j2847j2197j0287r651j0896j1416j0010q842r133q927o885m598l292
55745B49421j812L42J466R10N64J326J481K47m41M70J079m8j485j842k089l083
55729B46506l682l134k706l209l502k967k793l423l462k464j983k499k287p28
55715B07667K95j71l98P29J726J599J846L463M732M109K745K168J825Q24j85o68
55699B32306j540l204m449m759n323o406o315m454k765k538k398j176n5j7K12
55684A87119J580K562J812P03J091K504L524L982M010K968J109K44R94J426J98
55669B15826j175j065n57j320k662k919k133j284m04O05Q78J13l18N25J489J420
$$ plain form
55773 426298 420812 418460 418207 418240 418727 420643 423064 424077 423197 420488 414734 405031 392949 380692 368402
55758 368402 355555 343358 333071 323420 312524 301108 291098 282256 273123 264196 257311 252713 249421
55745 249421 247609 247951 249417 250327 250891 252217 253698 253945 253504 253974 255053 255005 253520 251678 249589 246506
55729 246506 242824 239690 236984 233775 230273 227306 224513 221090 217628 215164 213181 210682 208395 207667
55715 207667 207962 207791 207393 208122 209848 211447 213293 216756 221488 225597 228342 230510 232335 233159 232974 232306
55699 232306 230766 227562 223113 218354 213031 206625 200310 195856 193091 190553 188155 186979 186924 186907 187119
55684 187119 188699 191261 193073 193776 194867 197371 200895 204877 208887 211855 212964 213208 214202 215628 215826
55669 215826 214651 213586 213029 211709 209047 206128 203995 202711 202307 202912 203790 203903 203585 204110 205599 207019
55653B07019J187J871K680K520K095K525L223K945J686P1j816l674m496m244m436
55638B09156n827p091p138o865p223p408o576n534n099m520l175k075k071k284
55624A36270j866j529j694j166N40J581N64r36q29J74M6j252k342k919l461l463
55608A17718k287q73n48r52r68p46j033j383r16r3J2n40r83j284j708j841j311
55591A00264o61l41J14Q50R74K12j64O20J411J127O42J103J944K191K277K884
55575A15447L422L328L440M324M742L673K390K641L992M871M983M799M030K402
55561A68484P89k95j877m482o489o535n917o343o917n926m175l698m237l840k250
55546A06292r60m43J19P78Q59P44J323K058J779R56J006J711J614O60K00N35N91
$$ plain form
55653 207019 208206 210077 212757 215277 217372 219897 223120 226065 227751 227822 226006 222332 217836 213592 209156
55638 209156 203329 196238 189100 182235 175012 167604 161028 155494 150395 145875 142700 140625 138554 136270
55624 136270 134404 132875 131181 130015 130555 132136 132700 131764 130935 131109 131155 129903 127561 124642 121181 117718
55608 117718 115431 114558 114010 113058 112090 111344 110311 108928 108012 107919 107931 107391 106408 105124 103416 101575 100264
55591 100264 99603 99262 99376 100226 101200 101412 101248 101868 103279 104406 105048 106151 108095 110286 112563 115447
55575 115447 118869 122197 125637 129961 134703 138376 140766 143407 147399 152270 157253 162052 166082 168484
55561 168484 169273 168978 167101 162619 156130 149595 143678 137335 130418 124492 120317 116619 112382 108542 106292
55546 106292 105332 104889 105008 105786 106645 107389 108712 110770 112549 113505 114511 116222 117836 118496 118696 119231 119822
55529A19822Pm83p07j258k059k395k301k396k530k153j670j902k579k962l303
55514I1131m133m693l928k432j616j461r46j86j05m62j87O06R14Q04J142J654
55498G6102J332M36J54L92m6j218j921j752j398r79j7R88R35J22K4R54J766J908
55480G7782K004K230J922J026L23K8l03n14k8O81N24l10n68m5J62m04j036j401
55462H2073j898k358k014j000l20j58K58R94J156N35k4m6J33M13J032J542J171
55445H1489K15k92k58l86n46m1O25J21j333j849n73J088J451M02j110k114j909
55428G4980n80O36O02o8J08J219K054K160K120J940J045j20l40L12N90L63P61
55411H7782J802J946O52o53q88p91j195j574j255o76n11o32p10q31r05n82j26
$$ plain form
55529 119822 119829 119346 118639 117381 115322 112927 110626 108230 105700 103547 101877 99975 97396 94434 91131
55514 91131 86998 82305 78377 75945 74329 72868 71922 71736 71631 71169 70982 71588 72502 73306 74448 76102
55498 76102 77434 77870 78024 78416 78370 77152 75231 73479 72081 71102 71085 72073 73008 73130 73154 74108 75874 77782
55480 77782 79786 82016 83938 84964 85287 85315 85012 84498 84470 85151 85675 85365 84797 84752 84914 84510 83474 82073
55462 82073 80175 77817 75803 74803 74483 74325 74583 75577 76733 77268 77244 77198 77331 77744 78776 80318 81489
55445 81489 81704 81412 81154 80768 80222 80181 80806 80927 79594 77745 77172 78260 79711 80113 79003 76889 74980
55428 74980 74400 75036 75638 75570 75678 76897 78951 81111 83231 85171 86216 86096 85756 86068 86658 87021 87782
55411 87782 89584 91530 92182 91529 90641 89850 88655 87081 85826 85150 84639 84007 83297 82466 81561 80979 80853
55394H0853l11j115j672j734j808j753p32J030K088J798J077O80K66k51r2R10
55378G9234J601J112L9o50p68n34q7J53k74r66j109q44r28j049k28J036J005m67
55360G6276j383o20M21K17o49q77m52k5M07R39R94K82m05l60NN5p8j59m55r32
55340G3201q61k1O66M16m22j181j686j746j047J0M86M05P46J552J557L89n65l06
55322G1593L37L92K74N20N04k14o57N4J070J149N57L19M00O4o94j239j299q99
55304G2231l3Q32Q07k0k46P88J754J326K92K60J146J525Q59p2o26q93r73p02p0
55285G8185P21J399J459N16q19j282o74k31o92j163q23l90p50j201n88O22R71
55268G5260J82o44o94r0P59J438J409N86k67m51j81M8K99O02M02n18j303j239
$$ plain form
55394 80853 80542 79427 77755 76021 74213 72460 71728 72758 74846 76644 77721 78401 78667 78416 78324 79234
55378 79234 80835 81947 81986 81336 80568 80034 79947 80100 79826 78860 77751 76907 75979 74930 74702 75738 76743 76276
55360 76276 74893 74273 74694 74911 74262 73385 72933 72908 73315 74254 75248 75530 75125 74765 74770 74825 74747 74588 74133 73201
55340 73201 72340 72319 72985 73401 72979 71798 70112 68366 67319 67329 67815 68220 68966 70518 72075 72464 71899 71593
55322 71593 71930 72322 72596 73116 73620 73406 72749 72803 73873 75022 75579 75898 76298 76362 75668 74429 73130 72231
55304 72231 72198 73030 73837 73817 73571 74359 76113 77439 77731 77991 79137 80662 81521 81449 80823 79930 78957 78255 78185
55285 78185 78906 80305 81764 82280 81461 80179 79505 79274 78582 77419 76596 76206 75456 74255 73667 74289 75260
55268 75260 75442 74798 74104 74014 74773 76211 77620 78206 77939 77488 77307 77355 77654 78256 78658 78140 76837 75598
55250G5598r47j230j538q52M69J126P77K66K08M75R11J435J591R54q4p23p46m49
55232G7241M5N96O10k25j184j324p77l67l28k47l5N5J25M77R19R85P28N77N50
55213G8421K63l89j084j464j342p90k79k31k28N77J945K449J431M3m58l45m55
55196G8064n76q7O28P12K40q0j26j84n9M49P31K02m55j51Q60J374J107Q83J131
55177H4663J385J282R33L70m11q96n26K89N48K0n77p55p16o82m70J16J048K095
55159H7716K707K214O88q21j451j448j323q37K60J196R98l3p61q16p17o89m61
55142H6422n7J73K22L41M28K34r3l12n88r57q62m6O95N46m8j74Q0K9k84k97k6
55121H5426J93N69J244J474O53l45l36K15J5p35o26M63J118P47L93P99J330J370
$$ plain form
55250 75598 74651 73421 71883 71031 71500 72626 73403 73669 73877 74352 75263 76698 78289 79243 79159 78436 77690 77241
55232 77241 77286 77882 78492 78267 77083 75759 74982 74615 74287 74040 74005 74060 74185 74662 75581 76566 77294 77871 78421
55213 78421 78684 78295 77211 75747 74405 73615 73336 73105 72877 73454 75399 77848 79279 79322 78864 78519 78064
55196 78064 77488 77401 78029 78741 78981 78901 78775 78591 78532 78981 79712 79914 79459 79308 80168 81542 82649 83532 84663
55177 84663 86048 87330 88263 88633 88222 87326 86800 87089 87637 87657 87080 86325 85609 84927 84457 84573 85621 87716
55159 87716 90423 92637 93325 92504 91053 89605 88282 87445 87705 88901 89899 89866 89105 88289 87572 86883 86422
55142 86422 86365 86538 86760 87101 87529 87763 87670 87358 86770 85813 84951 84905 85600 86146 86098 85924 86004 86033 85749 85452 85426
55121 85426 85619 86188 87432 88906 89559 89214 88878 89093 89108 88373 87747 88210 89328 90075 90468 91267 92597 93967
55103I3967J318J538J548R55K88K05N78Q15N35k18r19q13J28P96L53l96k00N73
55085A01051N40l17n82K28R68P95K28j90o72j132q48J34O26N2o57o24k09K5L12
55066I9728Q01R09L87%K06K25o21j631j798j365j147j062m60N49J165J060N86
55049I7532Q6l36n79o58p82r16o53N1N86N83M90P05P69J24q57j402j473j496j369
55030I0405o62L21O62J16n11n08j67j76n40o17l8Q12J328J377J249J136J028J062
55012I6277J450J932J877J185N49M15K50n07j335j307n17P6M4j73j97o9K60Q80
54994A01090J378J155M06m4R5L97O15Q91J025N80j81l68K03P03M95j34o75q87
54976A06744n30M70J411J353N20R4M33O03Np82j224j593j886j297K97J548J412
$$ plain form
55103 93967 95285 96823 98371 99326 99614 99819 100397 101212 101747 101529 100610 99797 99925 100721 101074 100678 100478 101051
55085 101051 101591 101274 100692 100920 101888 102683 102911 102721 102049 100917 100069 100203 100829 100881 100224 99600 99391 99416 99728
55066 99728 100529 101438 101825 101825 102031 102256 101635 100004 98206 96841 95694 94632 94172 94721 95886 96946 97532
55049 97532 97618 97282 96703 96045 95263 94347 93694 93745 94331 94914 95404 96109 96878 97002 96145 94743 93270 91774 90405
55030 90405 89743 90064 90726 90842 90331 89823 89656 89480 88940 88323 88285 89097 90425 91802 93051 94187 95215 96277
55012 96277 97727 99659 101536 102721 103270 103685 103935 103428 102093 100786 100269 100345 100389 100216 100019 99950 100210 101090
54994 101090 102468 103623 104029 103985 104080 104477 105092 105983 107008 107588 107407 107039 107242 107945 108440 108306 107631 106744
54976 106744 106214 106684 108095 109448 109968 110062 110495 111098 111103 110321 109097 107504 105618 104321 104618 106166 107578
54959A07578P08P10J076N49q50j803j609r16n08m15l47j74K12Q70J542J783J409
54942A09815N82m09j116j009o0R53J178O76K99O89J680K553K647J905J035R35
54926A22353J796K980L866M425M845N071N019M820M547M067L499L360L837M192
54912A78677L390J202j581l912n285n873o153o357o296n813n151m559l842k789
54898A25658j820j527j698j547r17m35m07m09j63pj18o0N35J443K345L202L870
54881A27945L978L560L180L168L287L427L902M735N358N321M713L660K079K22
54867A78535j434k943m730o383o757n697m557m353m436l817k758k136k054k051
54853A24429k019j982j657j037q16j352j896j746j413j559j560m74J049J300m1
$$ plain form
54959 107578 108286 108996 110072 110621 109771 107968 106359 105443 104935 104520 104173 103999 104211 105081 106623 108406 109815
54942 109815 110397 109988 108872 107863 107803 108756 109934 110610 110909 111598 113278 115831 118478 120383 121418 122353
54926 122353 124149 127129 130995 135420 140265 145336 150355 155175 159722 163789 167288 170648 174485 178677
54912 178677 182067 183269 181688 177776 172491 166618 160465 154108 147812 141999 136848 132289 128447 125658
54898 125658 123838 122311 120613 119066 118149 117714 117307 116898 116735 116728 116610 116550 117085 118528 120873 124075 127945
54881 127945 131923 135483 138663 141831 145118 148545 152447 157182 162540 167861 172574 176234 178313 178535
54867 178535 177101 174158 169428 163045 156288 150591 146034 141681 137245 133428 130670 128534 126480 124429
54853 124429 122410 120428 118771 117734 116918 115566 113670 111924 110511 108952 107392 106918 107967 109267 109226
54838A09226j367j252m1R06P56k81j339j555p72K84P92O85M07J89k0j16L3K52
54820A06787L40M54P16P42J21p77j167q86n00m56o08n37LQ76J532J433P06J37
54802A08916J90M60L82J2k63l65l30l1M51O10K05k62l00j56k68m50k88J14M60
54783A09087Q72J524K038J891J202M97J18L07J268K604L299L039K847L589M497
54768A38679M373L599L643M803N857N914N414N042M736M101L010J508k78j933
54754A88468l020l653m299n045n532n562n289m905m585m455m207l113j144M66
54740A34125N39m80j179r89m27R0N46O21q8j040j077J7J288K053K608L287L793
54723A43687L856L792M012M520N090N393M955L611K017R38J61j101k819m135m764
$$ plain form
54838 109226 107859 106607 106566 107472 108228 107947 106608 105053 104281 104565 105357 106042 106449 106638 106618 106502 106535 106787
54820 106787 107127 107581 108297 109039 109160 108383 107216 106330 105830 105374 104766 104229 104232 105108 106640 108073 108779 108916
54802 108916 109106 109566 109948 109960 109697 109332 109002 108971 109422 110032 110237 109975 109675 109519 109251 108801 108513 108627 109087
54783 109087 109959 111483 113521 115412 116614 117111 117229 117536 118804 121408 124707 127746 130593 134182 138679
54768 138679 143052 146651 150294 155097 160954 166868 172282 177324 182060 186161 189171 190679 190401 188468
54754 188468 185448 181795 177496 172451 166919 161357 156068 151163 146578 142123 137916 134803 133659 134125
54740 134125 134664 134184 133005 132016 131589 131679 132225 132846 132758 131718 130641 130658 131946 133999 136607 139894 143687
54723 143687 147543 151335 155347 159867 164957 170350 175305 178916 180933 181871 182032 180931 178112 173977 169213
54708A69213n247n717n565m727m109m142l972k837j403q22j107j334j064p66r19
54693A25482j369j610j381q57m16j71J32N81P39K70l57m43k08n07j346j667r01
54676A15971R9K70k56n05m4O09P72L11l73q41j108j511j989j860q15K47K33n49
54658A08661q22l36j67p49r01L93K250K956K147R35K53O9K6j3j28m03o37n02k0
54639A13012M12N56N69O35O32L35k14o49o94m85l24j76K56Q45R27K40m69l92J30
54620A15146J11n22p75j16O72N40n01j495j578o49O45J426J389J099J122J077
54604A17591K55j007j484q12k9m7m33l59mr0o26r30o99l01k7K98Q41J318J235
54585A14690N09k90m72QM97N65N57Q23Q72J47p05m57O97J091p3j489j598o47N1
$$ plain form
54708 169213 163966 158249 152684 147957 143848 139706 135734 132897 131494 130672 129565 128231 127167 126401 125482
54693 125482 124113 122503 121122 120265 119849 119678 119810 120391 121130 121400 121043 120600 120392 119885 118539 116872 115971
54676 115971 116070 116340 116084 115579 115535 116144 116916 117227 116854 116013 114905 113394 111405 109545 108730 108977 109210 108661
54658 108661 107839 107503 107336 106587 105686 106079 108329 111285 113432 114367 114620 114689 114715 114702 114574 114171 113534 113032 113012
54639 113012 113424 113980 114549 115184 115816 116151 115937 115288 114594 114109 113785 113609 113865 114710 115637 115877 115408 115016 115146
54620 115146 115257 114735 113960 113844 114516 115056 114555 113060 111482 110833 111478 112904 114293 115392 116514 117591
54604 117591 117846 116839 115355 114543 114514 114467 114034 113675 113671 113581 112955 112025 111326 111025 110998 111296 112137 113455 114690
54585 114690 115199 114909 114437 114445 114942 115507 116064 116887 117759 117906 117201 116744 117441 118532 118459 116970 115372 114725 114776
54566A14776J21K36O37P96N14L25O41J152J345J108N93q3p59j133r78m26J12L34
54548A19311L42M90Q15R33O64M98R25J503J320L76k88k6O17Q87Q01O07R5q84j713
54529A27273j636q34j42Q4J80M22P00R21J191J495J594J302O13l61j361j950j846
54512A27645j211n33k65n76j186j399o89N48J255R54K86N8K74N45Q09J093R73
54495A28581J28q68j080m59J04J3l90n19l44k54n02r68j252r46nJ071J634J535
54477A25479J178R64R27Q74P21O11P72J173J367R10N9k70M15J437J633P51k87
54460A38714n18K6N16L45l11q42r35p75o26m53j55P7j8k81k64J28N12N77L53p0
54440A36000o03q89n45J25K66l62r10n60L47Q92Q49P47Q71R43P76O45Q14J107
$$ plain form
54566 114776 114897 115133 115770 116566 117080 117405 118046 119198 120543 121651 122244 122161 121402 120269 119291 118865 118977 119311
54548 119311 119653 120143 120958 121891 122555 123053 123978 125481 126801 127177 126889 126863 127480 128367 129168 129775 129870 128986 127273
54529 127273 125637 124803 124661 124745 124925 125347 126047 126968 128159 129654 131248 132550 133163 132802 131441 129491 127645
54512 127645 126434 125901 125636 125060 123874 122475 121786 122334 123589 124543 124829 124887 125161 125706 126515 127608 128581
54495 128581 128709 127841 126761 126302 126406 126419 126029 125510 125166 124912 124410 123442 122190 121244 121239 122310 123944 125479
54477 125479 126657 127621 128548 129422 130143 130754 131526 132699 134066 134976 135035 134765 135180 136617 138250 139001 138714
54460 138714 138196 138222 138738 139083 138772 137930 136995 136220 135594 135141 134986 135063 135045 134764 134500 134628 135140 135717 136070 136000
54440 136000 135397 134508 133963 134088 134354 133992 133082 132522 132869 133761 134610 135357 136228 137171 137947 138592 139406 140513
54422A40513J086N86j13n50n42l37k29q0M69J281J639J076l8r36j230r97m52J59
54404A41305N37N01J58k81o24o00K9J008J622J385N88q0j91J88O47O65R2n12m24
54385A46013K85P78N92J46r8k87n97o64j91M12O04N63Q02J308J691J859J974J962
54367A57152J732J598J865K162J900J301J282K218L448M045L718K838J963J393
54353A88615R24N3j325k584l067k950l008l587m250m398l914l111k331j710j161
54338A52196o01j74o5j20N0M12M37j05o56n76kM02K54l42j130j807k021j647r86
54319A43519m66k76m10o49m68N89K098K916K499J535Q68M48j41p68j007r00p55
54302A48632o14m64n45q35p65j87M1p32j681j450k6J348J793J411N99k04k90O07
$$ plain form
54422 140513 141599 142185 142072 141522 140980 140643 140414 140334 140803 142084 143723 144799 144761 143825 142595 141598 141146 141305
54404 141305 141842 142343 142501 142220 141596 140996 141025 142033 143655 145040 145628 145548 145357 145545 146192 146857 146949 146437 146013
54385 146013 146298 147076 147668 147814 147716 147429 146832 146168 145977 146389 146993 147556 148358 149666 151357 153216 155190 157152
54367 157152 158884 160482 162347 164509 166409 167710 168992 171210 174658 178703 182421 185259 187222 188615
54353 188615 189539 189592 188267 185683 182616 179666 176658 173071 168821 164423 160509 157398 155067 153357 152196
54338 152196 151595 151421 151356 151236 151286 151698 152135 152030 151374 150798 150796 151198 151452 151110 149980 148173 146152 144505 143519
54319 143519 143053 142777 142367 141718 141250 141839 143937 146853 149352 150887 151755 152203 152062 151294 150287 149387 148632
54302 148632 148018 147554 147009 146174 145409 145222 145263 144531 142850 141400 141374 142722 144515 145926 146525 146321 146031 146638
54284A46638J554J397L93k14j05j27o35r20n62j05N8L01Q37J187J096J079J419
54267A53291J541J019M03L51O20O06L27K00K71L23L88N39M97oo40q07m02Q3J44
54248A58748k51o99p26l00O2k4k23j6L04n9j084j682j098J20Q97P89O8p94j254
54229A52778r29o5N47N09K52L10N91P16N84L38J44K55P71J170P65j76n53j12k3
54210A57872j136k568k966k510k395k759k460j038M20P37J80j16L32J003J281
54195A43877J186J156J383J556J212L57m53o58k25M16Q15P74L23l06p35o69j22
54178A49887O24J244J555J579J443J195P59J90j62rL77L88k31j089j646j730j511
54161A52863j241j077r46o33j23K58L30M65J101J959K276J761Q25j08r16j406
$$ plain form
54284 146638 148192 149589 149982 149768 149663 149536 148901 147981 147419 147314 147372 147673 148510 149697 150793 151872 153291
54267 153291 154832 155851 156254 156605 157225 157831 158158 158358 158629 158952 159340 159879 160376 160370 159730 158923 158521 158604 158748
54248 158748 158497 157798 157072 156772 156834 156810 156587 156571 156875 156816 155732 154050 152952 153072 153969 154758 154826 154032 152778
54229 152778 151849 151784 152331 152840 153092 153402 153993 154709 155293 155631 155775 156030 156801 157971 158736 158560 158007 157895 157872
54210 157872 156736 154168 151202 148692 146297 143538 141078 140040 140460 141197 141377 141261 141593 142596 143877
54195 143877 145063 146219 147602 149158 150370 150727 150274 149616 149391 149807 150622 151396 151719 151413 150678 150009 149887
54178 149887 150511 151755 153310 154889 156332 157527 158286 158476 158314 158305 158682 159070 158839 157750 156104 154374 152863
54161 152863 151622 150545 149599 148966 148843 149101 149431 149896 150997 152956 155232 156993 157818 157710 156794 155388
54145A55388j310q71p66j184j457r17L52J741K625K491J207m74j263o41N69J220
54129A56710R99L09m31r33r07l10M83J134J640K020K054J676J211R88R81J068
54113A68692J181J122O37j03n94p18p25m94L86J555J977J475J114J473J649Q76
54097A79503L1K95J199J475J257J835L444M861N259N121N024M805M298L816L304
54082B25527K022l19k829m436n099n408n500m995l815k468j540j196j163j108
54068A87673r29p55o45m75k18q0j11OM34Q04Q10Q28J345K033K137J704J622K377
54050A98560L384L846L653L324L430M205N320O007N832N231M864M629L979L024
54036B59288K463K445K436K366K819L799M287L625K454J671J205O28K44N86J253
$$ plain form
54145 155388 154078 153207 152441 151257 149800 148883 149235 150976 153601 156092 157299 156825 155562 154921 155490 156710
54129 156710 157709 158018 157587 156654 155747 155437 155920 157054 158694 160714 162768 164444 165655 166643 167624 168692
54113 168692 169873 170995 171632 171529 170935 170217 169492 168998 169384 170939 172916 174391 175505 176978 178627 179503
54097 179503 179534 179829 181028 182503 183760 185595 189039 193900 199159 204280 209304 214109 218407 222223 225527
54082 225527 227549 227230 224401 219965 214866 209458 203958 198963 195148 192680 191140 189944 188781 187673
54068 187673 186744 185989 185344 184869 184651 184571 184460 184466 184900 185704 186514 187342 188687 190720 192857 194561 196183 198560
54050 198560 201944 205790 209443 212767 216197 220402 225722 231729 237561 242792 247656 252285 256264 259288
54036 259288 261751 264196 266632 268998 271817 275616 279903 283528 285982 287653 288858 289486 289730 290316 291569
54021B91569J215K04j013j656j596j114o35o82j492k574l170l183l263l890m830
54006B63890n517n645n260m594l881l159k360j701j753k636l490l310k240j415
53992B16929j447j779j704j320j066r06n62k20l64j027j698j981j924j697j301
53977A97933o95J2N76P46M66O1P3O33J103P21m40j437j396k76J328K687L295L131
53959B08521K733K707K960K863K276J978K736M324N906P059P915Q582R066R551
53945B79177J0189J0563R940Q145N723L165N94j710l090l282k881k661k688k528
53931C08656j967j189l79M37J201J807K237K555K793K972L140L306L538M122N245
53916C38474O472O946O400N592N347N495N283M536L858L685L683L233K106N46
$$ plain form
54021 291569 292784 292988 291975 290319 288723 287609 286974 286292 284800 282226 279056 275873 272610 268720 263890
54006 263890 258373 252728 247468 242874 238993 235834 233474 231773 230020 227384 223894 220584 218344 216929
53992 216929 215482 213703 211999 210679 209613 208707 208145 207925 207561 206534 204836 202855 200931 199234 197933
53977 197933 197238 197250 197826 198572 199038 199099 199172 199805 200908 201629 201189 199752 198356 198080 199408 202095 205390 208521
53959 208521 211254 213961 216921 219784 222060 224038 226774 231098 237004 244063 251978 260560 269626 279177
53945 279177 289366 299929 309869 318014 323737 326902 327496 325786 322696 319414 316533 313872 311184 308656
53931 308656 306689 305500 305121 305558 306759 308566 310803 313358 316151 319123 322263 325569 329107 333229 338474
53916 338474 344946 351892 358292 363884 369231 374726 380009 384545 388403 392088 395771 399004 401110 401656
53902D01656j036k353l338m061m426m141l214k398k680m205n991o937o847o437
53888C43592o428o919p550q002q196q072p452o314n054m202l823l519l041k625
53874B62395k516k492k208j757j561j789k258k832l515m125m181l405k146j211
53860B26399j165j838k466k385j654r38p88j120j453j457j170q03n00l01k18l19
53844B07824o14q49o45l7L10j22q85j037m12K01K39L3R0L14M59O84J156J537J460
53825B09706J125Q49M55k65p79l72P50J578J594J251J171J432J784K004J955J701
53809B25939J644K108K793L094K978L097L893N015N748N663M865L853L212L169
53795B77071L410L507L369L000K222J115M43R38K225L111K876J747K26j311k398
$$ plain form
53902 401656 400620 398267 394929 390868 386442 382301 379087 376689 374009 369804 363813 356876 350029 343592
53888 343592 337164 330245 322695 314693 306497 298425 290973 284659 279605 275403 271580 268061 265020 262395
53874 262395 259879 257387 255179 253422 251861 250072 247814 244982 241467 237342 233161 229756 227610 226399
53860 226399 225234 223396 220930 218545 216891 215953 215165 214045 212592 211135 209965 209162 208662 208361 208143 207824
53844 207824 207210 206361 205716 205679 205989 205867 204982 203945 203533 203734 203973 204006 204096 204410 204869 205553 206709 208246 209706
53825 209706 210831 211680 212135 211870 211091 210719 211469 213047 214641 215892 217063 218495 220279 222283 224238 225939
53809 225939 227583 229691 232484 235578 238556 241653 245546 250561 256309 261972 266837 270690 273902 277071
53795 277071 280481 283988 287357 290357 292579 293694 294137 295075 297300 300411 303287 305034 305260 303949 301551
53780C01551k716k712l180m077m485m073l677m067m850n192m937m381l567k513
53766B47124j788j991k812l245k772j901j462j722k249k434k130j801j960k524
53752B16333k939k865k349j457k86O43P22K06J01P35J204P32j04k81J42K95q5
53735B10747m39m04j64J41N91J005J074J022J333J718J220k80j435r44Q52K479
53719B18516L078L031K931K736K125J288Q25R26J069P37K91N85J713K636K485
53704B44972J804J863K918L918M042L752L887M365M410L774K976K509K412K621
53690B90223L128L563L199J771jj078j142o73k35n0k04p89j606k131j977j333
53674B90665p47n75p64j040j153r65n21o1J95L24O46J266J777J559M96p36j244
$$ plain form
53780 301551 298835 296123 292943 288866 284381 280308 276631 272564 267714 262522 257585 253204 249637 247124
53766 247124 245336 243345 240533 237288 234516 232615 231153 229431 227182 224748 222618 220817 218857 216333
53752 216333 213394 210529 208180 206723 206437 207080 207802 208008 208109 208844 210048 210780 210676 210395 210537 210832 210747
53735 210747 210308 209904 209740 209881 210472 211477 212551 213573 214906 216624 217844 217564 216129 215185 216037 218516
53719 218516 221594 224625 227556 230292 232417 233705 234530 235456 236525 237262 237553 238138 239851 242487 244972
53704 244972 246776 248639 251557 255475 259517 263269 267156 271521 275931 279705 282681 285190 287602 290223
53690 290223 293351 296914 300113 301884 301883 300805 299663 298990 298755 298705 298501 297712 296106 293975 291998 290665
53674 290665 289918 289343 288579 287539 286386 285421 284900 284839 285034 285358 286004 287270 289047 290606 291102 290366 289122
53657B89122q27j84j14o53j145j042l75M40R92J024N98K23M63J180J487Q16k26
53640B91779n07K26J092J325J296J889L103L807L059J322L9R0J103K267L294M198
53624C19382M658M263L255K448K313K739L547M627N477N526N083N193O065O521
53610C81097N612L950K701K020J413J080J583K541K816K126J356J184J300J249
53596D12028J086R66Q25P78J042J241N79r23k111k102j320o91m15j41J37J6p29
53579D10266j896k972l247k249m41Q96Q84j26j208j917k321k438k198j768j447
53564C87818j301j156q06j15Q54J675J898J652J435J276P56L0K2J042K082K164
53548C99326J700J611J758J334M75K08Q26J488J635J792K545L606M388M859N278
$$ plain form
53657 289122 288295 288111 287997 287344 286199 285157 284782 285222 286214 287238 287836 288059 288522 289702 291189 292005 291779
53640 291779 291272 291498 292590 293915 295211 297100 300203 304010 307069 308391 308430 308520 309623 311890 315184 319382
53624 319382 324040 328303 331558 334006 336319 339058 342605 347232 352709 358235 363318 368511 374576 381097
53610 381097 386709 390659 393360 395380 396793 397873 399456 401997 404813 406939 408295 409479 410779 412028
53596 412028 413114 414080 414905 415683 416725 417966 418545 417622 415511 413409 412089 411398 410983 410842 410979 410995 410266
53579 410266 408370 405398 402151 399902 399461 400357 401241 401115 399907 397990 395669 393231 391033 389265 387818
53564 387818 386517 385361 384555 384440 385294 386969 388867 390519 391954 393230 393986 394016 394038 395080 397162 399326
53548 399326 401026 402637 404395 405729 406204 406412 407238 408726 410361 412153 414698 418304 422692 427551 432829
53533D32829N641N877O209O770P268P512P939Q980J0156J0600J0366J0516J1599
53520E42262J2875J3442J3586J4261J5567J6622J6952J7118J7703J8467J9081
53509G17936J9999K1836K4192K5948K6529K6210K5346K4094K2903K2343K2252
53498I79588K1847K0964K0344K0352K0263J9381J8156J7493J7460J7425J7141
53487A190414J6923J7022J7396J7935J8413J8402J7814J7221J7147J7204J6652
53476A382543J5520J4488J3691J2436J0225P426M685K196j20k202l942n474p072
53463A444400q787j0385j1587j2355j2933j3612j4368j4912j5136j5325j5802
53452A299198j6542j7378j8297j9283k0031k0241k0041j9780j9421j8500j6777
$$ plain form
53533 432829 438470 444347 450556 457326 464594 472106 480045 489025 499181 509781 520147 530663 542262
53520 542262 555137 568579 582165 596426 611993 628615 645567 662685 680388 698855 717936
53509 717936 737935 759771 783963 809911 836440 862650 887996 912090 934993 957336 979588
53498 979588 1001435 1022399 1042743 1063095 1083358 1102739 1120895 1138388 1155848 1173273 1190414
53487 1190414 1207337 1224359 1241755 1259690 1278103 1296505 1314319 1331540 1348687 1365891 1382543
53476 1382543 1398063 1412551 1426242 1438678 1448903 1456329 1461014 1463210 1463090 1460888 1456946 1451472 1444400
53463 1444400 1435613 1425228 1413641 1401286 1388353 1374741 1360373 1345461 1330325 1315000 1299198
53452 1299198 1282656 1265278 1246981 1227698 1207667 1187426 1167385 1147605 1128184 1109684 1092907
53441A092907j4660j2886j1839j1206j0271q610o498m517k863j366j02N56O81
53428A009326J055K275M036N636O837P852Q802R697J0653J1734J2879J4250J6271
53415A121303J8785K0764K1492K1651K2481K4158K5898K7355K8914L0628L1915
53404A395344L2609L3436L5027L7126L9190M1127M3077M4902M6428M7843M9435
53393A845544N1144N2681N3889N4734N5110N4919N4267N3402N2507N1574N0402
53382B430173M8674M6199M3068L9517L5780L2215K9263K6907K4366K0763J6033
53371B792958J0793N490J79n003r851j4660k0082k6159l2008l6831m0686m4015
53359B580125m6849m8873m9995n0393n0268m9846m9430m9102m8569m7542m6123
$$ plain form
53441 1092907 1078247 1065361 1053522 1042316 1032045 1023435 1016937 1012420 1009557 1008191 1008089 1008645 1009326
53428 1009326 1010381 1012656 1016692 1022328 1029165 1037017 1045819 1055516 1066169 1077903 1090782 1105032 1121303
53415 1121303 1140088 1160852 1182344 1203995 1226476 1250634 1276532 1303887 1332801 1363429 1395344
53404 1395344 1427953 1461389 1496416 1533542 1572732 1613859 1656936 1701838 1748266 1796109 1845544
53393 1845544 1896688 1949369 2003258 2057992 2113102 2168021 2222288 2275690 2328197 2379771 2430173
53382 2430173 2478847 2525046 2568114 2607631 2643411 2675626 2704889 2731796 2756162 2776925 2792958
53371 2792958 2803751 2809241 2809420 2804417 2794566 2779906 2759824 2733665 2701657 2664826 2624140 2580125
53359 2580125 2533276 2484403 2434408 2384015 2333747 2283901 2234471 2185369 2136800 2089258 2043135
53348B043135m4550m2824m0891l9055l7775l7113l6726l6388l6089l5603l4444
53337A621677l2444l0056k7740k5343k2611k0028j8571j8364j8245j7013j4727
53326A376535j2446j1042j0776j1584j3051j4269j4512j4111j3920j3961j3404
53315A233459j1953j0370r269q309p053n774m769l629j915nJ422K357L243M245
53301A181680N410P028R223J1553J3631J5609J7516J8826J9407K0184K1870K3729
53289A365666K4651K4805K4996K4962K3793K1720J9958J8865J7685J6055J4318
53278A597474J2358R656O646M365K552k98m371p797r336j0283j2565j6096j9251
53265A553054k1072k1897k2485k3414k4876k6324k6921k6870k7420k8900k9819
$$ plain form
53348 2043135 1998585 1955761 1914870 1875815 1838040 1800927 1764201 1727813 1691724 1656121 1621677
53337 1621677 1589233 1559177 1531437 1506094 1483483 1463455 1444884 1426520 1408275 1391262 1376535
53326 1376535 1364089 1353047 1342271 1330687 1317636 1303367 1288855 1274744 1260824 1246863 1233459
53315 1233459 1221506 1211136 1201867 1193558 1186505 1180731 1175962 1172333 1170418 1170413 1171835 1174192 1177435 1181680
53301 1181680 1187090 1194118 1203341 1214894 1228525 1244134 1261650 1280476 1299883 1320067 1341937 1365666
53289 1365666 1390317 1415122 1440118 1465080 1488873 1510593 1530551 1549416 1567101 1583156 1597474
53278 1597474 1609832 1619488 1626134 1630499 1633051 1632753 1628382 1620585 1611249 1600966 1588401 1572305 1553054
53265 1553054 1531982 1510085 1487600 1464186 1439310 1412986 1386065 1359195 1331775 1302875 1273056
53254A273056k8908k7100k6279k6715k7110k6683k5887k5230k4578k3769k2941
53243I87856k2191k1526k1160k1213k1267k0822k0011j9297j8669j7752j6494
53232G67454j5108j3535j1690j0037r189r073r144r302r852j0632j0923j0460
53220F38509r872r961j0860j2061j3001j3483j3721j3899j3745j2894j1696j1027
53208D92289j1067j0934j0065r164r006r073q399p257o768p103p357p158p177
53195C81761p739q105p634o770o266o082n685m982m431m381m663m751m225l245
53181C02802k509k501k904l069k925k853k867k582k023j683j686j600j289j224
53167B71087j577j729j178m11k11n42p36n45l35l57m12l20k55m51q92j438j995
$$ plain form
53254 1273056 1244148 1217048 1190769 1164054 1136944 1110261 1084374 1059144 1034566 1010797 987856
53243 987856 965665 944139 922979 901766 880499 859677 839666 820369 801700 783948 767454
53232 767454 752346 738811 727121 717084 707895 698822 689678 680376 670524 659892 648969 638509
53220 638509 628637 618676 607816 595755 582754 569271 555550 541651 527906 515012 503316 492289
53208 492289 481222 470288 460223 451059 442053 432980 424581 417324 410556 403453 396096 388938 381761
53195 381761 374022 365917 358283 351513 345247 339165 333480 328498 324067 319686 315023 310272 306047 302802
53181 302802 300293 297792 294888 291819 288894 286041 283174 280592 278569 276886 275200 273600 272311 271087
53167 271087 269510 267781 266603 266192 265981 265439 264703 264158 263823 263466 263054 262734 262479 262028 261136 259698 257703
53150B57703k431k480j953r93l1N06M36r9p32j019p46j18L60L54M8q1J72N32O10
53131B50038L91K70O64J555K452K784K431J739J070M98N0q7J08K92K95N11J265
53114B66326K041K035J342P89O10J79p70j655k072k417k922k988k157j092p01
53099B56548q76r07o95o98r68j106j020r85j055j029r07q52q39q13j001j460j679
53082B39658j175k55M24P74J077J245R69M51J57O0r1n7N52J272J141J00q76j123
53064B44303r53q40p91p73r66j264j184n83O9L90N26P29R43J010Q83N08n2l78
53046B41577j32L17K19n11j152j116m82L54R66Q99J04o20l56O56J261R54M02K65
53028B43605L52K22j77p32j326j505p80M74J186R60M69K77J84J17N69J553K067
$$ plain form
53150 257703 255272 252792 250839 249846 249815 250321 250757 250658 249926 248907 248161 248043 248403 248757 248805 248724 248896 249428 250038
53131 250038 250429 250699 251363 252918 255370 258154 260585 262324 263394 263892 263942 263855 263963 264255 264550 265061 266326
53114 266326 268367 270402 271744 272533 273143 273322 272552 270897 268825 266408 263486 260498 258341 257249 256548
53099 256548 255672 254765 254070 253372 252404 251298 250278 249293 248238 247209 246302 245450 244611 243798 242797 241337 239658
53082 239658 238483 238228 238652 239426 240503 241748 242717 243168 243325 243385 243294 243237 243789 245061 246202 246302 245426 244303
53064 244303 243350 242510 241719 240946 239980 238716 237532 236949 237018 237408 237934 238663 239606 240616 241499 242007 241955 241577
53046 241577 241445 241762 241981 241470 240318 239202 238720 239074 240040 240939 241043 240423 240067 240723 241984 242938 243340 243605
53028 243605 243957 244179 244002 243270 241944 240439 239659 240133 241319 242279 242748 243025 243209 243326 243895 245448 247515
53011B47515J427L83N5L72M66P9k83k76k3L45P95J196J475J709J720J006m35j707
52993B55819j967j383o32L7O88J099J003O23L12j0m43n30J77J284J942J926J670
52976B61615J450J240J162J395J735J854J828J873J747J105K25l25m99o10n31
52961B75264N9P44O67k02r78j213j418j924k159j638r08q03j239j445j135p80
52945B60892p44p80n04J5L53K29k65q01j063r31n26j61j12l50n93o81p62r72j138
52926B51106j084j005j070r24j79O57N92l52r54n42j5l75j119j060k04L56J96
52909B44024M2M16Q94R09N55K12J4k6J21K67J38j04OM61O88N05N05J136J880J880
52889B54523J040L0n69p01n08m7N76J027R32K70m57o54k42K75M91N41O83P82O16
$$ plain form
53011 247515 248942 249325 249380 249752 250218 250297 250014 249738 249715 250060 250855 252051 253526 255235 256955 257961 257526 255819
52993 255819 253852 252469 251837 251874 252562 253661 254664 255287 255599 255589 255146 254616 254793 256077 258019 259945 261615
52976 261615 263065 264305 265467 266862 268597 270451 272279 274152 275899 277004 277229 276904 276405 275795 275264
52961 275264 275323 276067 276734 276532 275554 274341 272923 270999 268840 267202 266294 265491 264252 262807 261672 260892
52945 260892 260148 259368 258864 258879 259232 259461 259196 258395 257332 256401 255875 255714 255602 255252 254659 253978 253216 252244 251106
52926 251106 250022 249017 247947 247023 246844 247501 248093 247741 246787 246245 246230 245855 244736 243676 243472 243828 244024
52909 244024 244066 244482 245376 246285 246840 247052 247066 247040 247161 247428 247566 247462 247468 247929 248617 249122 249627 250763 252643 254523
52889 254523 255563 255593 255024 254323 253815 253768 254344 255371 256303 256573 256116 255462 255220 255495 255986 256527 257210 257992 258608
52870B58608M18O14J201J878K497K871K504J284J86K58J012R89k7p36o03q07k091
52853B70056l171k711j718k192m004n073m500l553l261k892j694n49o42j511j826
52838B30759j354q96p04l17J74O9n40n90L54J279J089P4o40n09J72R43J413J199
52820B31975L21n41p65o00o47p65k19J085K285K634K244J597R25M01L05N23L78
52803B41136n64j757k283j960j395j087r30n71P7P43R60L84q08j887k181j671
52787B26206q10O9Q30J264J164P59O34J048J573J595R97J82m09o14m73r5K68K67
52769B34455j66n07j30P63J076Q8j545k546k525k060j444l62J023J719J249N25
52753B29613N49R32O90l0j69N37J249J509J808K435K837K663K487K730K691J582
$$ plain form
52870 258608 259026 259640 260841 262719 265216 268087 270591 271875 272061 272319 273331 274320 274293 273557 272954 272147 270056
52853 270056 266885 264174 262456 260264 256260 251187 246687 243134 239873 236981 235287 234738 234096 232585 230759
52838 230759 229405 228509 227805 227488 227662 227731 227191 226601 226955 228234 229323 229397 228757 228248 228420 229363 230776 231975
52820 231975 232296 231755 230990 230390 229743 228978 228759 229844 232129 234763 237007 238604 239529 239930 240235 240758 241136
52803 241136 240572 238815 236532 234572 233177 232090 231160 230589 230666 231409 232369 232753 231945 230058 227877 226206
52787 226206 225396 225465 226295 227559 228723 229482 230116 231164 232737 234332 235329 235511 235102 234488 234015 233920 234188 234455
52769 234455 234289 233782 233652 234415 235491 235579 234034 231488 228963 226903 225459 225097 226120 227839 229088 229613
52753 229613 230162 231094 231784 231754 231585 232122 233371 234880 236688 239123 241960 244623 247110 249840 252531 254113
52737B54113M7l97O33J837J855P54l21n57j25K65J02n28j081j004j89R09J538
52720B57851J133k40j789k519k067j016k68j71m05n92p16q63q88n90j08J62N0
52703B46964j89j99R4M80P11O33K62j49k37Q5M68N05K24p1k57l94l46J71J029
52684B49784J588J395P00N3l68p41j120j285j023m11J80L58R1j24K32R67J306
52667B51582Q83K72K35P53J165J043N74K02J98N32Q95J037J132J554K133K111
52651B66301J230L46L83J022J167M63m37j047j589k227k595k440k116j975j777
52636B54709j100L0J292K476L307L295K292J044N95J182K139K830L138K956J884
52621B82069q8k047k876k533k031k090k377k247j732j232p50n3N96O40J58j11
$$ plain form
52737 254113 254160 253763 254396 256233 258088 258842 258521 257964 257839 258104 258206 257678 256597 255593 255404 256313 257851
52720 257851 258984 258744 256955 254436 252369 251353 251085 250914 250509 249917 249201 248338 247450 246860 246752 246914 246964
52703 246964 246775 246576 246670 247150 247861 248494 248756 248607 248370 248455 248923 249428 249652 249581 249324 248930 248584 248755 249784
52684 249784 251372 252767 253467 253520 253152 252411 251291 250006 248983 248572 248752 249110 249201 249077 249309 250276 251582
52667 251582 252465 252737 252972 253725 254890 255933 256507 256709 256907 257439 258334 259371 260503 262057 264190 266301
52651 266301 267531 267877 268260 269282 270449 270912 270475 269428 267839 265612 263017 260577 258461 256486 254709
52636 254709 253609 253639 254931 257407 260714 264009 266301 267345 267940 269122 271261 274091 277229 280185 282069
52621 282069 281981 279934 277058 274525 272494 270404 268027 265780 264048 262816 262066 262013 262609 263249 263407 263296
52605B63296J31M09L45J65J9l68r31r39j31N58K35n33m65O05J659J951J613R39
52587B68558Q4n19l73K86O98O96Q05J140J123N26l3n5J23nl62o31q09r85j002
52568B69265p41m17k97m41q13j291j506j192p40p85j159r97p6P43P81M14K38J48
52550B61134j33l17m2M26O92Q98J282J499J138N36L11M38M50K40l0n21j341j805
52532B64855j044O45J920J995J379Q68N65K84K65Q35J639J776Q44m24q23N2J345
52515B76976J917J638J347J565J909J929J922K314K738K489J656J048R69P90j01
52500C01106j484k698l413l692l605l100k294j578j337j580j866j763j282p62
52486B70652l17K21Q37J158R90P02P78J225J661J767J441Q10K95L56Q77J145P52
$$ plain form
52605 263296 263427 263836 264181 264346 264365 263997 263066 262127 261996 262554 262789 262256 261791 262396 264055 266006 267619 268558
52587 268558 268642 268123 267750 268036 268734 269430 270235 271375 272498 273024 272991 272936 273059 273054 272692 272061 271252 270267 269265
52568 269265 268524 268107 267810 267369 266556 265265 263759 262567 261827 261042 259883 258886 258810 259553 260334 260748 260986 261134
52550 261134 261001 260684 260642 261068 261760 262658 263940 265439 266577 267113 267424 267862 268312 268552 268522 268001 266660 264855
52532 264855 263811 264456 266376 268371 269750 270618 271183 271467 271732 272567 274206 275982 276826 276402 275579 275631 276976
52515 276976 278893 280531 281878 283443 285352 287281 289203 291517 294255 296744 298400 299448 300417 301207 301106
52500 301106 299622 296924 293511 289819 286214 283114 280820 279242 277905 276325 274459 272696 271414 270652
52486 270652 270335 270556 271393 272551 273541 274243 275021 276246 277907 279674 281115 281925 282220 282576 283453 284598 285350
52469B85350J49k8K03M58O54R19J104J101J347K320L623M158L325J579j18j142
52453C05002j527j851k627l585l831l079k190k019k215j959j305q79o26q0L01
52438B77530n16k330l471k914j450k83N04J273J679J198K67j74K8K56K30K86O60
52421B72773J143J514J749J789J596J451J774K508L097L126K794K713L393M880
52407C06300O634P847Q119P780P388O973O131M672K835Q08j537m189o542p729
52393C45490p470o383n344m659l959k940j899j335j206r75m35l0j53m44k31N81
52377C08608J409J874K256K931L656L902L695L688M170M532M107L312L234M031
52363C55405M472L472J569K05p3K2j70l87j19N07R47R90R04R92J305J710K068
$$ plain form
52469 285350 285499 285471 285674 286132 286786 287705 288809 289910 291257 293577 297200 301358 304683 306262 306144 305002
52453 305002 303475 301624 298997 295412 291581 288502 286312 284293 282078 280119 278814 277935 277309 277229 277530
52438 277530 277014 274684 271213 268299 266849 266566 267070 268343 270022 271220 271487 271313 271341 271597 271827 272113 272773
52421 272773 273916 275430 277179 278968 280564 282015 283789 286297 289394 292520 295314 298027 301420 306300
52407 306300 312934 320781 328900 336680 344068 351041 357172 361844 364679 365487 363950 359761 353219 345490
52393 345490 338020 331637 326293 321634 317675 314735 312836 311501 310295 309320 308885 308855 308702 308258 308027 308608
52377 308608 310017 311891 314147 317078 320734 324636 328331 332019 336189 340721 344828 348140 351374 355405
52363 355405 359877 363349 364918 365123 365050 365072 364902 364515 364396 364903 365850 366840 367744 368736 370041 371751 373819
52346C73819K323K476K441K100J677J870L128M911O103O280O171O701Q011R566
52332D37577J0846J1655J2088J2429J2874J3237J3210J3043J3511J4957J6789
52321E82216J8211J9078J9690K0125K0228K0002J9585J9028J8488J8374J8892
52310G93917J9620J9962J9895J9766J9589J9087J8303J7582J6891J5780J4170
52299I94562J2617J1532J0607R329P724O151M602K664J49k516m653n960o710p391
52285A032707q180q834r072q911q451p495n783l632j913j061m06J110L572N944
52271I79595P287P769Q195Q974R922J0920J2130J3380J3963J3513J2779J2936
52259A111363J4093J5087J4878J3779J2988J3209J4107J4802J4545J3025J0473
$$ plain form
52346 373819 376142 378618 381059 383159 384836 386706 389834 394745 400848 407128 413299 420000 428011 437577
52332 437577 448423 460078 472166 484595 497469 510706 523916 536959 550470 565427 582216
52321 582216 600427 619505 639195 659320 679548 699550 719135 738163 756651 775025 793917
52310 793917 813537 833499 853394 873160 892749 911836 930139 947721 964612 980392 994562
52299 994562 1007179 1018711 1029318 1038647 1046371 1052522 1057124 1059788 1059937 1057421 1052768 1046808 1040098 1032707
52285 1032707 1024527 1015693 1006621 997710 989259 981764 975981 972349 970436 969375 968969 970079 973651 979595
52271 979595 986882 994651 1002846 1011820 1021742 1032662 1044792 1058172 1072135 1085648 1098427 1111363
52259 1111363 1125456 1140543 1155421 1169200 1182188 1195397 1209504 1224306 1238851 1251876 1262349
52248A262349P542M776K166n35l145n111o338p504r224j1271j2891j3746j4071
52235A192997j4083j3728j3093j2623j2642j2944j3092j2903j2420j1560j0172
52224A053737q382o604n211m323l880l663l320k588j533l81P55J781K453K625
52210A021466K642K992L623M097M398M891N430N301M424L823M304N335N953O142
52196A084821O464O754O328N311M660M757M912M484L662K812J848O38o10j728
52182A135113k859m037n026n864o939q218q982q749p932p163o544o029n828n897
52168A045046n506m112k264r24k02N51J612K579L151L498L778L821L369K344R91
52153A057732o1j35O82J343J049L58M83J631K747K911K326J814J844K253K490
$$ plain form
52248 1262349 1269891 1274667 1276833 1276298 1273153 1268042 1261704 1254200 1244976 1233705 1220814 1207068 1192997
52235 1192997 1178914 1165186 1152093 1139470 1126828 1113884 1100792 1087889 1075469 1063909 1053737
52224 1053737 1045355 1038751 1033540 1029217 1025337 1021674 1018354 1015766 1014233 1013852 1014607 1016388 1018841 1021466
52210 1021466 1024108 1027100 1030723 1034820 1039218 1044109 1049539 1054840 1059264 1063087 1067391 1072726 1078679 1084821
52196 1084821 1091285 1098039 1104367 1109678 1114338 1119095 1124007 1128491 1132153 1134965 1136813 1137451 1136841 1135113
52182 1135113 1132254 1128217 1123191 1117327 1110388 1102170 1093188 1084439 1076507 1069344 1062800 1056771 1050943 1045046
52168 1045046 1039540 1035428 1033164 1032240 1032038 1032589 1034201 1036780 1039931 1043429 1047207 1051028 1054397 1056741 1057732
52153 1057732 1057671 1057536 1058218 1059561 1060610 1060968 1061451 1063082 1065829 1068740 1071066 1072880 1074724 1076977 1079467
52138A079467K105J322J032J798L035L728L864M397N857P812R854J2190J4946
52125A151407J7663K0050K2508K5254K7584K8729K9019K9408L0000K9923K8741
52114A440286K7143K5987K5149K3852K1836J9747J8301J7311J5829J3294J0307
52103A659042Q126P335P308O983N869M136K045l46k934n470p843j0299j3080j5941
52089A644931j8184j9380j9813k0075k0232j9823j8630j7040j5400j3456j0834
52078A452064p781m914k475l29J509L042M757P089R487J0856J1218J1856J3431
52065A509810J4913J5154J4663J4765J5581J6007J5492J4618J3839J2826J1433
52054A669101J0320R850R089O777L000q40l732o005q500j1310j3801j5647j7316
$$ plain form
52138 1079467 1081572 1082894 1083926 1085724 1088759 1092487 1096351 1100748 1106605 1114417 1124271 1136461 1151407
52125 1151407 1169070 1189120 1211628 1236882 1264466 1293195 1322214 1351622 1381622 1411545 1440286
52114 1440286 1467429 1493416 1518565 1542417 1564253 1584000 1602301 1619612 1635441 1648735 1659042
52103 1659042 1667168 1674503 1681811 1688794 1694663 1698799 1700844 1700498 1697564 1692094 1684251 1673952 1660872 1644931
52089 1644931 1626747 1607367 1587554 1567479 1547247 1527424 1508794 1491754 1476354 1462898 1452064
52078 1452064 1444283 1439369 1436894 1436565 1438074 1441116 1445873 1452962 1462449 1473305 1484523 1496379 1509810
52065 1509810 1524723 1539877 1554540 1569305 1584886 1600893 1616385 1631003 1644842 1657668 1669101
52054 1669101 1679421 1689271 1698360 1705137 1708137 1707297 1703565 1697560 1689060 1677750 1663949 1648302 1630986
52041A630986j9312k1247k2125k1593k0516k0075k0462k0855k0536j9593j8509
52030A406163j7521j6684j6171j6166j6484j6661j6434j6008j5724j5639j5512
52019A227159j5113j4451j3659j2806j1898j1038j0363r909r618r572r921j0604
52007A088207j1335j1981j2665j3389j3943j4402j5221j6401j7028j6374j5123
51996I30345j4636j5061j5121j3982j2316j1112j0418r924r968j0911j2019j2180
51984G82697j1558j1475j2579j4067j4920j4999j4621j3915j3144j2862j3106
51973F35451j2908j1336q695o037l805j642N74K404L577M444N383O228O495N898
51959F26031M499K658J017J25j66o64j933l666n110n912o182n965n091l518j491
$$ plain form
52041 1630986 1611674 1590427 1568302 1546709 1526193 1506118 1485656 1464801 1444265 1424672 1406163
52030 1406163 1388642 1371958 1355787 1339621 1323137 1306476 1290042 1274034 1258310 1242671 1227159
52019 1227159 1212046 1197595 1183936 1171130 1159232 1148194 1137831 1127922 1118304 1108732 1098811 1088207
52007 1088207 1076872 1064891 1052226 1038837 1024894 1010492 995271 978870 961842 945468 930345
51996 930345 915709 900648 885527 871545 859229 848117 837699 827775 817807 806896 794877 782697
51984 782697 771139 759664 747085 733018 718098 703099 688478 674563 661419 648557 635451
51973 635451 622543 611207 602512 596475 592670 591028 591602 594006 597583 602027 607410 613638 620133 626031
51959 626031 630530 633188 634205 634330 634164 633500 631567 627901 622791 616879 610697 604732 599641 596123 594632
51944E94632P02K852M664N815O414P207Q932J1416J3508J4081J3065J1378R960
51931G04626Q976P931O377M358K280N15q28j883k849l823m839o062p781j0067
51917F96931j2525j4565j5972j6962j7701j7958j7427j6180j4533j2526r892o654
51905E24036l454j053M68J662K881L748L704K825J717O66p10k767n183p291q822
51890E12427r915j0553j0420r448q058o694n251l256n58K276M355N302N638O235
51876D72080P321Q299Q594Q358P989P335N927L918K115R05j93j734l506m887n593
51861E16928n680n156m128l074k449k045j233J55J545K296K301J818J011j82j854
51846E00253l867n737o824o822o092n337m945m768m487l983l344k677k008j285
$$ plain form
51944 594632 595334 598186 602850 608665 615079 622286 631218 642634 656142 670223 683288 694666 704626
51931 704626 713602 721533 727910 732268 734548 735063 734235 732352 729503 725680 720841 714779 706998 696931
51917 696931 684406 669841 653869 636907 619206 601248 583821 567641 553108 540582 530690 524036
51905 524036 520582 519529 519997 521659 524540 528288 531992 534817 536534 537200 536490 533723 528540 521249 512427
51890 512427 502512 491959 481539 472091 464033 457339 452088 448832 448274 450550 454905 460207 465845 472080
51876 472080 479401 487700 496294 504652 512641 519976 525903 529821 531936 532841 532648 530914 527408 522521 516928
51861 516928 511248 506092 501964 498890 496441 494396 493163 493318 494863 497159 499460 501278 502289 502107 500253
51846 500253 496386 490649 483825 477003 470911 465574 460629 455861 451374 447391 444047 441370 439362 438077
51832D38077m43M83J276J648J500J061P60Q51J062P22n23k139l136l102k515j988
51816D33594j601j169p27l98q6L18O53P34O58N13J46m41q11p44p49j267j752j366
51798D25505l92L8l99q65q27q01j212j525j232q02q93j178q89j22L30K11L9J77
51780D15163L98M73N52Q77J506K407L451M355M983N623O555P532Q139Q553R248
51765D79815J0041J0102R045P323N392L084J89k886n472p257q295q774r059r575
51751D73673j0234j0332r434q024o867o032n077l916k820j725k38J565L020L807
51737D17366M429N319N971N545M179L054K986L433L266K191R91M02K65m7o99j261
51721D57390j359j099q77j035j721k765l654l898l509k899k315j663r27l65p2
$$ plain form
51832 438077 437634 438117 439393 441041 442541 443602 444362 445213 446275 446997 446474 444335 441199 438097 435582 433594
51816 433594 431993 430824 430097 429699 429613 429931 430584 431318 431976 432489 432635 432194 431383 430639 429890 428623 426871 425505
51798 425505 425113 425151 424752 423887 423060 422259 421047 419522 418290 417488 416595 415417 414528 414406 414736 414947 414986 415163
51780 415163 415561 416034 416586 417463 418969 421376 424827 429182 434165 439788 446343 453875 462014 470567 479815
51765 479815 489856 499958 509003 516326 521718 524802 524991 522105 516633 509376 501081 492307 483248 473673
51751 473673 463439 453107 443673 435649 428782 422750 417673 413757 410937 409212 408974 410539 413559 417366
51737 417366 421795 427114 433085 438630 442809 445863 448849 452282 455548 457739 458730 459132 459397 459350 458651 457390
51721 457390 456031 454932 454055 453020 451299 448534 444880 440982 437473 434574 432259 430596 429669 429304 429232
51706D29232K38P72J368J930K737L856M603M164K579O69q26j604j502o07M50R66
51690D49025J019J218J507J023o12k546l735m144m357m493m117l076j843j073
51676D23796j024j279r04O93K837L995L539K547K358K902L246L315L882M982N555
51661D60440N054M327M263M330L330J207p65j501j118l19O51K014L646M734M446
51646D94739K759L87k075m610p225r423j0613j0830j0570j0073r185p843o219
51633D09219m367k307m32P19J177J477J816J833J472J349J847K359J985O35r60
51618D17822k120k694k860k925l169l618m042m219m035l270j812k11N07Qp96p47
51602C81819L79J986L525M733N468N859O397P326Q200Q452Q105P407O179M149
$$ plain form
51706 429232 429470 430242 431610 433540 436277 440133 444736 448900 451479 452148 451322 449718 448216 447609 448059 449025
51690 449025 450044 451262 452769 453792 453180 450634 446899 442755 438398 433905 429788 426712 424869 423796
51676 423796 422772 421493 420589 421282 424119 428114 431653 434200 436558 439460 442706 446021 449903 454885 460440
51661 460440 465494 469821 474084 478414 481744 482951 482186 480685 479567 479248 479899 481913 485559 490293 494739
51646 494739 497498 497885 495810 491200 483975 474552 463939 453109 442539 432466 423281 415438 409219
51633 409219 404852 402545 402113 402832 404009 405486 407302 409135 410607 411956 413803 416162 418147 418782 417822
51618 417822 415702 413008 410148 407223 404054 400436 396394 392175 388140 384870 383058 382847 383354 383362 382566 381819
51602 381819 382198 384184 387709 392442 397910 403769 410166 417492 425692 434144 442249 449656 455835 459984
51588D59984J678n33k238l540m246m056l173k053n96J580M243O668Q625J0398
51574D72741J1960J2994J3809J5135J6829J7834J7825J7857J8796K0062K0701
51563F56543K0879K1428K2493K3712K5366K8249L2257L5909L7622L6992L4638
51552I76088L1041K5810J8223Q500j627j0166j6719k2557k8666l4410l8591m1003
51540H65923m2164m2030m0141l6887l3488l0514k7303k3226j8818j5095j2327
51529E43930j0041p939o186m930m020l307k816k538k284j931j689k018l192m955
51515D86084o595p427p286o570n787n139m551m005l698l823m290m752m892m601
51501D12668l951l141k454k099j958j642r53k27kl70q50q86l64L98J038J413J555
$$ plain form
51588 459984 461662 461129 458891 455351 451105 447049 443876 441823 441227 442807 447050 453718 462343 472741
51574 472741 484701 497695 511504 526639 543468 561302 579127 596984 615780 635842 656543
51563 656543 677422 698850 721343 745055 770421 798670 830927 866836 904458 941450 976088
51552 976088 1007129 1032939 1051162 1059662 1058035 1047869 1031150 1008593 979927 945517 906926 865923
51540 865923 823759 781729 741588 704701 671213 640699 613396 590170 571352 556257 543930
51529 543930 533889 525950 519764 514834 510814 507507 504691 502153 499869 497938 496249 494231 491039 486084
51515 486084 479489 472062 464776 458206 452419 447280 442729 438724 435026 431203 426913 422161 417269 412668
51501 412668 408717 405576 403122 401023 399065 397423 396470 396243 396241 395871 395021 394135 393771 394169 395207 396620 398175
51484C98175J434Q84j14j169j702j561j180j058j258j563j855k078k108j964j927
51469C80956k137k297k121j826j728j614j031r8N79P45O94O43N64N63Q25J075
51453C73792Q40L76N42J567K628L109L499M511N946P096P805Q489R371J0317J1086
51438D50974J1259J0227P798M683J820n76k760m526n204m661l705l300l660m275
51424D54094m586m542m557m900n169m643l208j596n42j01k2k70q03j199j117p55
51408D16084m69k07J75M39L66L44Q76J740K316K594L125L984M543M398L952L890
51392D48150M530N789P399R039J0590J2317J4507J7058J9766K2827K6528L0553
51380F29053L4288L7783M1728M6286N0541N3368N4401N3816N1670M7667M1389
$$ plain form
51484 398175 399609 400493 400379 399210 397508 395947 394767 393709 392451 390888 389033 386955 384847 382883 380956
51469 380956 378819 376522 374401 372575 370847 369233 368202 368104 368683 369428 370122 370765 371329 371892 372717 373792
51453 373792 374632 375008 375550 377117 379745 382854 386353 390864 396810 403906 411711 420200 429571 439888 450974
51438 450974 462233 472460 480258 484941 486761 486185 483425 478899 473695 469034 465329 462029 458369 454094
51424 454094 449508 444966 440409 435509 430340 425697 422489 420893 420351 420250 420228 419958 419155 417956 416839 416084
51408 416084 415615 415408 415583 416022 416388 416732 417608 419348 421664 424258 427383 431367 435910 440308 444260 448150
51392 448150 452680 458469 465868 474907 485497 497814 512321 529379 549145 571972 598500 629053
51380 629053 663341 701124 742852 789138 839679 893047 947448 1001264 1052934 1100601 1141990
51369A141990L2592K1597R536k138j2600k1934l0413l7920m4107m8754n1795n3200
51357I02854n3032n1446m8596m4822m0797l7120l3768l0286k6550k2910j9643
51346D93884j6710j4135j2152j0801r761q689p447n989m428l150k473k212j970
51333C93967j762j759j646r98k86n13j600k113j126N20J478J661J890K347K357
51318C92417J572N45nP3M41O82N75K05j44l34m93p30r72j194j484j704j506r60
51300C86984p35j275k153k677k815l003l266l133k367j343n97l15k64n3N10J252
51284C64750J959K744L726M445M268L534L458M396N076M300K676J623J249N04
51270D08708q25j644j264l66K28P08J629K829L684L889L450K385Q71o58j990l324
$$ plain form
51369 1141990 1174582 1196179 1205715 1203577 1190977 1169043 1138630 1100710 1056603 1007849 956054 902854
51357 902854 849822 798376 749780 704958 664161 627041 593273 562987 536437 513527 493884
51346 493884 477174 463039 450887 440086 430325 421636 414189 408200 403772 400622 398149 395937 393967
51333 393967 392205 390446 388800 387802 387516 387003 385403 383290 382164 382684 384162 385823 387713 390060 392417
51318 392417 393989 394534 394529 394602 395043 395725 396300 396505 396361 396027 395534 394804 393832 392638 391154 389450 387944 386984
51300 386984 386249 384974 382821 380144 377329 374326 371060 367927 365560 364217 363620 363305 363041 362988 363498 364750
51284 364750 366709 369453 373179 377624 381892 385426 388884 393280 398356 402656 405332 406955 408204 408708
51270 408708 407883 406239 404975 404609 404837 405545 407174 410003 413687 417576 421026 423411 424282 423624 421634 418310
51254D18310m579n003m139k767k198k763l614l898l544k905k266j884j937k175
51240C74638k059j497j116j478k254k561j965q35J83P61R36Q94Q48R82J308J648
51224C68433J841J879J835J702J446J117Q71Q85J263J930K533K580J892Q37J5
51209C91059k39N4P86J769K572K718K209J558J159R45P93Q95J344J605J012l43
51193D09896j621k198k127j599n78P34J531J131j32j188j385q66J9J072J909J948
51177D06546J185M58M46O99L26o45j290j099n02M8O87J472J877J505Q65O89R07
51160D14174R63Q82J219J985K359J685J97j378k540l179l437l598l796l795l329
51145C98412k599k053j727j339j021j287k085k572k110j028j2O79J053R53M25
$$ plain form
51254 418310 413731 408728 404589 401822 399624 396861 393247 389349 385805 382900 380634 378750 376813 374638
51240 374638 372579 371082 369966 368488 366234 363673 361708 360873 361056 361817 362753 363647 364495 365477 366785 368433
51224 368433 370274 372153 373988 375690 377136 378253 379124 380009 381272 383202 385735 388315 390207 391044 391059
51209 391059 390820 390874 391660 393429 396001 398719 400928 402486 403645 404590 405383 406278 407622 409227 410239 409896
51193 409896 408275 406077 403950 402351 401773 402507 404038 405169 405037 403849 402464 401598 401617 402689 404598 406546
51177 406546 407731 408189 408635 409334 409660 409015 407725 406626 406124 406172 406859 408331 410208 411713 412578 413267 414174
51160 414174 415137 416019 417238 419223 421582 423267 423464 422086 419546 416367 412930 409332 405536 401741 398412
51145 398412 395813 393760 392033 390694 389673 388386 386301 383729 381619 380591 380579 381258 382311 383264 383689
51130C83689R7O51J951L172L678L516L138L014L345L900M224M169L990L829L425
51115D29788K648J859J379R98M30m3M1N27P54M53o3m31m95j07P80J729K077J636
51097D43960Q10k8p98j298j132k65O68J065J043J161J576J818J438N86j71n42
51081D49891p48j011j077n47L84J028J102J101J505K088K411K629L236M206N027
51066D71225N536O180P325Q764J0102J1239J2288J3267J4126J4865J5526J6087
51054F06530J6432J6370J5692J4301J2400J0511R352R381J0139J0166Q130M306
51042G43710L99k295m093o015q308j0446j2020j2815j2431j0780q839q000q645
51029F39422r925j0934j1296j0732r056o831n110m190l321j983o25K36Q44J621
$$ plain form
51130 383689 383786 384437 386388 389560 393238 396754 399892 402906 406251 410151 414375 418544 422534 426363 429788
51115 429788 432436 434295 435674 436672 437102 437059 437100 437627 438381 438834 438771 438340 437845 437738 438518 440247 442324 443960
51097 443960 444770 444742 443944 442646 441514 441249 441917 442982 444025 445186 446762 448580 450018 450604 450433 449891
51081 449891 449143 448132 447055 446508 446892 447920 449022 450123 451628 453716 456127 458756 461992 466198 471225
51066 471225 476761 482941 490266 499030 509132 520371 532659 545926 560052 574917 590443 606530
51054 606530 622962 639332 655024 669325 681725 692236 701588 710969 721108 731274 739404 743710
51042 743710 744109 741814 737721 731706 723398 712952 700932 688117 675686 664906 656067 648067 639422
51029 639422 629497 618563 607267 596535 587479 580648 575538 571348 568027 566044 565419 565655 566499 568120
51015E68120K517L487M947O946Q522Q800Q301Q332R286J0459J1351J2157J2883
51002F76108J2932J1994J0642R639R065Q507P692O565N094L422K044J382J259
50989G66345J082N55J0K1R46K805N285P831R915J1473J2900J4567J6395J8066
50975H68196J9529K1081K2977K5225K7737L0549L3775L7519M1781M6313N0598
50964A225280N4318N7827O1734O5872O9160P0817P1161P0770O9300O5984O1084
50953A943307N5917N1216M6228L9857L2218K4550J7943J2560P904L469q12m477
50941B229880o946q154q728r428j0608j2324j4594j7245j9707k1487k2870k4806
50929B052983k7850l1465l4613l6947l9156m2072m5725m9451n2692n5259n6960
$$ plain form
51015 568120 570637 574124 579071 586017 594539 603339 611640 619972 629258 639717 651068 663225 676108
51002 676108 689040 701034 711676 721315 730380 738887 746579 753144 758238 761660 763704 765086 766345
50989 766345 767427 767982 767992 768013 768959 771764 777049 784880 794795 806268 819168 833735 850130 868196
50975 868196 887725 908806 931783 957008 984745 1015294 1049069 1086588 1128369 1174682 1225280
50964 1225280 1279598 1337425 1399159 1465031 1534191 1605008 1676169 1746939 1816239 1882223 1943307
50953 1943307 1999224 2050440 2096668 2136525 2168743 2193293 2211236 2223796 2231700 2235169 2234357 2229880
50941 2229880 2222934 2214780 2206052 2196624 2186016 2173692 2159098 2141853 2122146 2100659 2077789 2052983
50929 2052983 2025133 1993668 1959055 1922108 1882952 1840880 1795155 1745704 1693012 1637753 1580793
50918A580793n7452n6724n5230n3246n0490m6789m2763l9233l6180l2932k9318
50907A080436k5963k3316k1050j8683j6252j4125j2516j1487j1037j0877j0427
50896I04703r366p954o604n375m089k706j343j75N49O71N53Q95J932L120L992
50881H78803M862O139P314P429O596O355Q053J1239J4062J5191J5041J5044J6036
50868A012164J7676J9337K1092K3408K6268K9162L1955L5119L8957M3067M6993
50857A345198N0995N5794O1725O8511P5745Q3266R1102R9296J07807J16395J24709
50846B280543J32469J39490J45523J50281J53733J55942J56488J54328J48620
50837C617417J39475J27570J13272R6404P6930N5602L3994J3926l419j8016l0494
$$ plain form
50918 1580793 1523341 1466617 1411387 1358141 1307651 1260862 1218099 1178866 1142686 1109754 1080436
50907 1080436 1054473 1031157 1010107 991424 975172 961047 948531 937044 926007 915130 904703
50896 904703 895337 887383 880779 875404 871315 868609 867266 867091 867640 868311 868864 869759 871691 874811 878803
50881 878803 883665 889804 897118 904547 911143 917498 925551 936790 950852 966043 981084 996128 1012164
50868 1012164 1029840 1049177 1070269 1093677 1119945 1149107 1181062 1216181 1255138 1298205 1345198
50857 1345198 1396193 1451987 1513712 1582223 1657968 1741234 1832336 1931632 2039439 2155834 2280543
50846 2280543 2413012 2552502 2698025 2848306 3002039 3157981 3314469 3468797 3617417
50837 3617417 3756892 3884462 3997734 4094138 4171068 4226670 4260664 4274590 4271171 4253155 4222661
50826D222661m0939m8534n2475n2903n0500m5691l8935l1594k5618k2120k0856
50815C792496k1388k4291l0622m0554n3002o6618q0614r4438j07132j17501j24917
50804C031419j29653j32334j33277j32407j29494j24342j17005j08014r8227q8182
50794A838484p7889o7413n7325m8157l9835l2134k5419k0145j5876j1727p768
50783A434796n067m078l980l914m075m874n890o459o725p334q378r424j0303j1224
50769A343071j2238j3256j4415j5834j7135j7784j7800j7643j7458j7047j6379
50758A166082j5596j4499j2607r849o751l930j750l31O45K116M986R116J3430
50745A131062J7170K0638K4512K8879L3249L7339M1427M5947N0924N5935O0580
$$ plain form
50826 4222661 4181722 4133188 4080713 4027810 3977310 3931619 3892684 3861090 3835472 3813352 3792496
50815 3792496 3771108 3746817 3716195 3675641 3622639 3556021 3475407 3380969 3273837 3156336 3031419
50804 3031419 2901766 2769432 2636155 2503748 2374254 2249912 2132907 2024893 1926666 1838484
50794 1838484 1760595 1693182 1635857 1587700 1547865 1515731 1490312 1470167 1454291 1442564 1434796
50783 1434796 1429729 1425651 1421671 1417757 1413682 1408808 1402918 1396459 1389734 1382400 1374022 1364598 1354295 1343071
50769 1343071 1330833 1317577 1303162 1287328 1270193 1252409 1234609 1216966 1199508 1182461 1166082
50758 1166082 1150486 1135987 1123380 1113531 1106780 1102850 1101100 1100769 1101414 1103530 1108516 1117632 1131062
50745 1131062 1148232 1168870 1193382 1222261 1255510 1292849 1334276 1380223 1431147 1487082 1547662
50734A547662O4802O8629P1790P4034P5734P7656P9918Q1678Q2059Q0933P8553
50723B383448P5079P0805O6178O0956N3995M4559L3356K1536R274l667j6481k7746
50711B771292l6995m4565m9842n1225m8298m2862l7059l1334k5015j8145j1947
50700B374005p720n999o610r068j3031j8574k5934l4825m4299n3315o1155o7263
50688B026212p1242p3112p3126p1193o7028o0990n4129m7147l9916l2334k4980
50677A411015j8409j2334o074M62O752J2367J7208K1246K4390K6574K7722K7798
50665A538717K7009K5715K4036K1844J9301J6889J4790J2834J1285J1007J2291
50654A735718J4063J4906J4668J4365J4753J5691J6854J8382K0635K3592K6734
$$ plain form
50734 1547662 1612464 1681093 1752883 1826917 1902651 1980307 2060225 2141903 2223962 2304895 2383448
50723 2383448 2458527 2529332 2595510 2656466 2710461 2755020 2788376 2809912 2819186 2815519 2799038 2771292
50711 2771292 2734297 2689732 2639890 2588665 2540367 2497505 2460446 2429112 2404097 2385952 2374005
50700 2374005 2366285 2360286 2353676 2344608 2331577 2313003 2287069 2252244 2207945 2154630 2093475 2026212
50688 2026212 1954970 1881858 1808732 1737539 1670511 1609521 1555392 1508245 1468329 1435995 1411015
50677 1411015 1392606 1380272 1374198 1374660 1381412 1393779 1410987 1432233 1456623 1483197 1510919 1538717
50665 1538717 1565726 1591441 1615477 1637321 1656622 1673511 1688301 1701135 1712420 1723427 1735718
50654 1735718 1749781 1764687 1779355 1793720 1808473 1824164 1841018 1859400 1880035 1903627 1930361
50643A930361K9420L1438L3266L5633L8692M1776M4074M5302M5569M4928M3395
50632B363854M1219L8895L6921L5540L4411L2533K9028K4202J9236J4461Q349
50621B678649j089j4041k8215m0184m7239m8558m5318l9628l3027k5965j8615
50610B336770j1660n896j730N69O10j584n285r938j5871k3390l1654l9351m6200
50597B145390n2790n9046o3921o6689o7644o7244o5425o2162n8044n3889n0172
50586A478364m7086m4636m2374l9567l5993l2238k8858k5692k2281j8634j5125
50575A125880j1912q793n515k004J601M878P293Q707R590J0564J1886J3461J5246
50562A180882J7307J9555K1685K3454K4953K6507K8299L0049L1199L1482L1265
$$ plain form
50643 1930361 1959781 1991219 2024485 2060118 2098810 2140586 2184660 2229962 2275531 2320459 2363854
50632 2363854 2405073 2443968 2480889 2516429 2550840 2583373 2612401 2636603 2655839 2670300 2678649
50621 2678649 2677560 2663519 2635304 2595120 2547881 2499323 2454005 2414377 2381350 2355385 2336770
50610 2336770 2325110 2319214 2317484 2318053 2318663 2317079 2311794 2301856 2285985 2262595 2230941 2191590 2145390
50597 2145390 2092600 2033554 1969633 1902944 1835300 1768056 1702631 1640469 1582425 1528536 1478364
50586 1478364 1431278 1386642 1344268 1304701 1268708 1236470 1207612 1181920 1159639 1141005 1125880
50575 1125880 1113968 1105175 1099660 1097656 1099257 1104135 1111428 1120135 1129725 1140289 1152175 1165636 1180882
50562 1180882 1198189 1217744 1239429 1262883 1287836 1314343 1342642 1372691 1403890 1435372 1466637
50551A466637L1188L1523L1964L1981L1320L0270K9480K9344K9565K9597K9662
50540A802531L0889L4074L8707M3668M8551N3733N9389O5143P0692P6106Q1430
50529B404913Q6479R1170R5648R9977J04054J07714J10589J11961J11321J08835
50519C432661J04677R8174Q8564P6503O3608N0349L5538J8438K28j7427l4177
50508C917136n0381o5473p8157q7868r4857r8983r9541r6357r0163q1663p0940
50497C002753n8013m3379k7855j2368K042J4443K4432L1905L6453L7303L3855
50486C041571K5878J3363l209k2488m2761o2859q2022r8948j11918j20065j23820
50475B412722j23907j20703j14851j07565r9650r0926q1272p1564o2860n5219
$$ plain form
50551 1466637 1497825 1529348 1561312 1593293 1624613 1654883 1684363 1713707 1743272 1772869 1802531
50540 1802531 1833420 1867494 1906201 1949869 1998420 2052153 2111542 2176685 2247377 2323483 2404913
50529 2404913 2491392 2582562 2678210 2778187 2882241 2989955 3100544 3212505 3323826 3432661
50519 3432661 3537338 3635512 3724076 3800579 3864187 3914536 3950074 3968512 3968740 3951313 3917136
50508 3917136 3866755 3801282 3723125 3635257 3540400 3441417 3341876 3245519 3155356 3073693 3002753
50497 3002753 2944740 2901361 2873506 2861138 2863180 2877623 2902055 2933960 2970413 3007716 3041571
50486 3041571 3067449 3080812 3077603 3055115 3012354 2949495 2867473 2768525 2656607 2536542 2412722
50475 2412722 2288815 2168112 2053261 1945696 1846046 1755120 1673848 1602284 1539424 1484205
50465A484205m8179m1926l6991l3100k9450k5972k3279k1231j8697j5096j1144
50454A179140p611m221n09L046N639P347Q884J0403J1560J2534J4018J6046J7764
50441A274040J8601J8947J9248J9142J8063J6179J4079J1920R549P276N772N180
50429A437996M948M684M612M944N424N891O808Q649J0987J2872J4130J5747J8736
50416A556428K3042K7824L2450L6904M1365M5811N0008N3588N6176N7678N8390
50405B039664N8551N7721N5052N0368M4640L8978L3425K7097J9356J0376N91r733
50393B426086k0223l0262l9525m8271n6518o3315o7435o8737o8114o6047o1942
50382A835697n5282m6809l7957k9383k0679j1542k664M730R918J3105J4997J5910
$$ plain form
50465 1484205 1436026 1394100 1357109 1324009 1294559 1268587 1245308 1224077 1205380 1190284 1179140
50454 1179140 1171529 1167308 1166799 1169845 1175484 1182831 1191715 1202118 1213678 1226212 1240230 1256276 1274040
50441 1274040 1292641 1311588 1330836 1349978 1368041 1384220 1398299 1410219 1419768 1427044 1432816 1437996
50429 1437996 1442944 1447628 1452240 1457184 1462608 1468499 1475307 1483956 1494943 1507815 1521945 1537692 1556428
50416 1556428 1579470 1607294 1639744 1676648 1718013 1763824 1813832 1867420 1923596 1981274 2039664
50405 2039664 2098215 2155936 2210988 2261356 2305996 2344974 2378399 2405496 2424852 2435228 2435819 2426086
50393 2426086 2405863 2375601 2336076 2287805 2231287 2167972 2100537 2031800 1963686 1897639 1835697
50382 1835697 1780415 1733606 1695649 1666266 1645587 1634045 1631381 1636111 1646029 1659134 1674131 1690041
50370A690041J5268J2009N782k397j1042j9597k8425l7393m5179n0442n3103n3947
50358A421575n3351n1190m7793m4096m0636l7069l3023k8906k5399k2480j9414
50347A018218j5607j1108o471k476J28J058P05m09k325n402r218j2235j2972j1453
50333I30433r143p361o059m333j866N67K089K759L286M007M736N438O362P356
50319I38271P723P207O534O433O569O103N048M167L723L117J960P25L3p9J45O33
50303I98312J340K088K937M258O016P504Q214Q564R204J0035J0550J0935J1949
50290A091906J3840J5979J7603J8344J8039J6657J4482J1758P995K362m850j1741
50278A212374j6215j7602j6608j4230j1308q670o884n773m670l345k256j808j746
$$ plain form
50370 1690041 1705309 1717318 1723100 1720703 1709661 1690064 1661639 1624246 1579067 1528625 1475522 1421575
50358 1421575 1368224 1317034 1269241 1225145 1184509 1147440 1114417 1085511 1060112 1037632 1018218
50347 1018218 1002611 991503 985032 982556 982684 983742 984447 984038 981713 976311 967093 954858 941886 930433
50333 930433 921290 913929 907870 903537 901671 902238 904327 907086 910372 914379 919115 924553 930915 938271
50319 938271 945994 953201 959735 966168 972737 978840 983888 988055 991778 994895 996855 997580 997613 997534 997679 998312
50303 998312 999652 1001740 1004677 1008935 1014951 1022455 1030669 1039233 1048437 1058472 1069022 1079957 1091906
50290 1091906 1105746 1121725 1139328 1157672 1175711 1192368 1206850 1218608 1226603 1228965 1224115 1212374
50278 1212374 1196159 1178557 1161949 1147719 1136411 1127741 1120857 1115084 1110414 1107069 1104813 1103005 1101259
50265A101259j537j054n32m0O85J815L105M238N409P255J0018J2998J5186J6416
50251A175221J7528J9192K0916K1572K0782J9403J8637J8875J9492J9503J8411
50240A389532J6551J4647J2934J0795P481L043j776o498j1293j6247k0758k4030
50228A374381k5786k6194k5415k3739k1943k0850k0549k0574k0899k2165k4721
50217A121546k7908l0591l2025l2012l0657k8420k6018k3793k1396j8445j5311
50206H34970j2756j1024r727q555p555o721n885n161m922n115n047m206l014k383
50192G42899k608l093l087k533k028k067k518k906l133l539m225m677m426l723
50178F98336l087k451j434k67L29K89L93R99J387Q94P5L2R70K144K932L351L584
$$ plain form
50265 1101259 1099722 1098668 1098136 1098096 1098781 1100596 1103701 1107939 1113348 1120603 1130621 1143619 1158805 1175221
50251 1175221 1192749 1211941 1232857 1254429 1275211 1294614 1313251 1332126 1351618 1371121 1389532
50240 1389532 1406083 1420730 1433664 1444459 1451940 1454983 1453207 1446709 1435416 1419169 1398411 1374381
50228 1374381 1348595 1322401 1296986 1273247 1251304 1230454 1209905 1189331 1168432 1146267 1121546
50217 1121546 1093638 1063047 1031022 999010 968353 939933 913915 890122 868726 850281 834970
50206 834970 822214 811190 801463 792908 785353 778632 772747 767586 762664 757549 752502 748296 745282 742899
50192 742899 740291 737198 734111 731578 729550 727483 724965 722059 718926 715387 711162 706485 702059 698336
50178 698336 695249 692798 691364 691097 691426 691715 692108 693107 694494 695388 695463 695495 696465 698609 701541 704892 708476
50161G08476L711L945M592N653O844P998R131J0087J0631J0898J1299J1885J2271
50148H17421J2316J2413J2764J2882J2322J1688J2254J4513J7685K0859K4158
50137I81275K8228L2967L7424M0939M3680M5821M6933M6736M5886M5195M4424
50126A439508M2687L9942L7122L4630L1694K7448K1882J5276P515j456j1070k0655
50114A664523k9865l8110m4227m7569m8914m9480m9430m8169m5705m2701l9422
50103A180931l5684l1796k8576k6278k4349k2423k0780j9639j8727j7729j6483
50092I18467j4627j1792q374n437l489k054n93P79J840K786L785M605N045N260
50078H96201N288M851L972L204K831K453J733R84N35J20m59p78n36m16j284k931
$$ plain form
50161 708476 712187 716132 720724 726377 733221 741219 750350 760437 771068 781966 793265 805150 817421
50148 817421 829737 842150 854914 867796 880118 891806 904060 918573 936258 957117 981275
50137 981275 1009503 1042470 1079894 1120833 1164513 1210334 1257267 1304003 1349889 1395084 1439508
50126 1439508 1482195 1522137 1559259 1593889 1625583 1653031 1674913 1690189 1697704 1696248 1685178 1664523
50114 1664523 1634658 1596548 1552321 1504752 1455838 1406358 1356928 1308759 1263054 1220353 1180931
50103 1180931 1145247 1113451 1084875 1058597 1034248 1011825 991045 971406 952679 934950 918467
50092 918467 903840 892048 883674 878237 874748 872694 872101 872880 874720 877506 881291 885896 890941 896201
50078 896201 901489 906340 910312 913516 916347 918800 920533 921517 922052 922172 921713 920935 920399 919983 918699 915768
50062I15768m357n112n508n727n481m668l695l029k869l125l319k712j071P76
50048H65871J841K234K879M108N374O347P415Q751R834J0366J1024J2544J4491
50035I63079J5637J5384J4256J3075J2227J1716J1494J1415J1199J0638R831R055
50023A109006Q441P888P349P138P777R410J1409J2808J3280J3508J4392J5933
50011A238339J7081J6900J5689J4680J4614J4843J4125J2049R442P410O329N716
49999A387217M602J936k857r304j6090k2098k7091l1264l4539l6645l7554l7348
49987A138965l5946l3503l0869k9042k8165k7615k6996k6340k5367k3420k0489
49976H31213j7596j5623j4306j2911j1409j0279r450q340o892n736n160m615l573
$$ plain form
50062 915768 911411 906299 900791 895064 889583 884915 881220 878191 875322 872197 868878 866166 865095 865871
50048 865871 867712 869946 872825 876933 882307 888654 896069 904820 914654 925020 936044 948588 963079
50035 963079 978716 994100 1008356 1021431 1033658 1045374 1056868 1068283 1079482 1090120 1099951 1109006
50023 1109006 1117447 1125335 1132684 1139822 1147599 1157009 1168418 1181226 1194506 1208014 1222406 1238339
50011 1238339 1255420 1272320 1288009 1302689 1317303 1332146 1346271 1358320 1367762 1375172 1381501 1387217
49999 1387217 1391819 1393755 1390898 1381594 1365504 1343406 1316315 1285051 1250512 1213867 1176313 1138965
49987 1138965 1103019 1069516 1038647 1009605 981440 953825 926829 900489 875122 851702 831213
49976 831213 813617 797994 783688 770777 759368 749089 739639 731299 724407 718671 713511 708896 705323
49963G05323k301j333o96j45K00K14N39K183N066P744R006R279R858J1087J2030
49948G68054J1900J1038J0191R391Q097O143L962J928q2k300m598o589q108r410
49934G99617j0931j2829j4739j6015j6379j6246j6154j5948j4855j2534r682p267
49922F36038n456l751k008p16q1M77J519K728L405L563L879M635N413N900O375
49907F61920P132P973Q667R451J0575J1752J2504J2807J2949J2920J2495J1643
49895G92788J0391Q536N986L257Q89j395m303p687j0460j1957j2684j3447j4338
49882G45576j4909j4846j4132j2999j1970j1522j1393j0706r079p144n598m385
49870F16893l170k147j687j528r56L84K257M250N945O999P497Q103R342J0924
$$ plain form
49963 705323 703022 701689 700993 700848 701048 701262 701801 703984 709050 716794 725800 735079 744937 756024 768054
49948 768054 779954 790992 801183 810574 818671 824814 828776 830704 830622 828322 823724 817135 809027 799617
49934 799617 788686 775857 761118 745103 728724 712478 696324 680376 665521 652987 643305 636038
49922 636038 630582 626831 624823 624107 624026 624503 626022 628750 632155 635718 639597 644232 649645 655545 661920
49907 661920 669052 677025 685692 695143 705718 717470 729974 742781 755730 768650 781145 792788
49895 792788 803179 811715 817701 820958 821847 820452 816149 808462 798002 786045 773361 759914 745576
49882 745576 730667 715821 701689 688690 676720 665198 653805 643099 634020 626876 621278 616893
49870 616893 613723 611576 609889 608361 607405 607789 610046 614296 620241 627240 634737 642840 652182 663106
49856F63106J2143J2814J3284J3657J3530J2563J0950R252P922O941N793M004
49844G85959J790k32j984m084o727r179j0774j1749j2413j2227j0680q541p069
$$ plain form
49856 663106 675249 688063 701347 715004 728534 741097 752047 761299 769221 776162 781955 785959
49844 785959 787749 787517 785533 781449 774722 765543 754769 743020 730607 718380 707700 699159 692090
$$ [...]
##END NTUPLES=NMR SPECTRUM
##END=
