
##TITLE=AC1169_Tolima-ibage-TGAAH12004_6672652_X3OlbKJwfa
##JCAMPDX= 6.0         $$ Bruker NMR JCAMP-DX V2.0
##DATA TYPE= NMR SPECTRUM
##DATA CLASS= NTUPLES
##ORIGIN= BRUKER
##OWNER= Administrator
$$ 1.72 TOPSPIN		Version 2.1
$$ 2012-12-12 00:35:44.849 -0500  Administrator@X
$$ Compression mode = diff/dup
##.OBSERVE FREQUENCY= 400.02188249412
##.OBSERVE NUCLEUS= ^1H
##.ACQUISITION MODE= SIMULTANEOUS (DQD)
##.ACQUISITION SCHEME= undefined
##.AVERAGES= 8
##.DIGITISER RES= 22
##SPECTROMETER/DATA SYSTEM= spect
##.PULSE SEQUENCE= zg30
##.SOLVENT NAME= COFFEE_meoh
##.SHIFT REFERENCE= INTERNAL, COFFEE_meoh, 1, 14.98509
##AUDIT TRAIL= $$ (NUMBER, WHEN, WHO, WHERE, PROCESS, VERSION, WHAT)
$$ ##TITLE= Audit trail, TOPSPIN		Version 2.1
$$ ##JCAMPDX= 5.01
$$ ##ORIGIN= Bruker BioSpin GmbH
$$ ##OWNER= Administrator
$$ $$ E:\/data/COFFEE/nmr/AC1169_Tolima-ibage-TGAAH12004_6672652_X3OlbKJwfa/20/pdata/1/auditp.txt
$$ ##AUDIT TRAIL=  $$ (NUMBER, WHEN, WHO, WHERE, PROCESS, VERSION, WHAT)
(   1,<2012-12-12 00:35:36.208 -0500>,<Administrator>,<X>,<go>,<TOPSPIN 2.1>,
      <created by zg
	started at 2012-12-12 00:34:30.052 -0500,
	POWCHK enabled, PULCHK disabled,
       configuration hash MD5:
       86 BA 57 50 F2 9D 5C 9B 26 00 A9 28 5F 66 2E 89
       data hash MD5: 64K
       DD CC E6 CC 9A 91 A6 C1 8B 71 24 38 62 A6 B8 A6>)
(   2,<2012-12-12 00:35:39.458 -0500>,<Administrator>,<X>,<proc1d>,<TOPSPIN 2.1>,
      <Start of raw data processing
       efp LB = 0 FT_mod = 6 PKNL = 1 PHC0 = 0 PHC1 = 0 SI = 32K 
       data hash MD5: 32K
       01 6E E4 82 AC 09 A9 0E 52 BD FE D3 A4 61 E6 45>)
(   3,<2012-12-12 00:35:39.943 -0500>,<Administrator>,<X>,<proc1d>,<TOPSPIN 2.1>,
      <pk PHC0 = 96.17432 PHC1 = 0 
       data hash MD5: 32K
       BA 90 F8 B1 99 67 2C 6F 94 43 7F C9 7D 4D A1 01>)
(   4,<2012-12-12 00:35:40.208 -0500>,<Administrator>,<X>,<proc1d>,<TOPSPIN 2.1>,
      <abs ABSG = 1 
       data hash MD5: 32K
       DF 4B BE CE 55 BB DD F8 09 69 67 F8 47 9B 78 80>)
(   5,<2012-12-12 00:35:40.365 -0500>,<Administrator>,<X>,<proc1d>,<TOPSPIN 2.1>,
      <abs ABSG = 2 
       data hash MD5: 32K
       E8 6A 82 AF 64 3E 0F 48 ED 13 03 69 0C 2E EF EC>)
(   6,<2012-12-12 00:35:40.536 -0500>,<Administrator>,<X>,<proc1d>,<TOPSPIN 2.1>,
      <abs ABSG = 3 
       data hash MD5: 32K
       1A BF 47 1D 1E E7 51 F2 22 2B D0 29 2E 5C AB E6>)
(   7,<2012-12-12 00:35:40.693 -0500>,<Administrator>,<X>,<proc1d>,<TOPSPIN 2.1>,
      <abs ABSG = 4 
       data hash MD5: 32K
       A3 6B 86 3F 7B 15 74 F4 F3 6C 8F 05 7E C7 A7 A8>)
(   8,<2012-12-12 00:35:40.880 -0500>,<Administrator>,<X>,<proc1d>,<TOPSPIN 2.1>,
      <abs ABSG = 5 
       data hash MD5: 32K
       6F 87 D2 B6 89 80 AA 95 52 0E 38 4A B7 C4 36 3D>)
$$ ##END=
$$ 
$$ $$ hash MD5
$$ $$ 71 A0 03 7C 3C 9D 7C 61 72 9D 87 A9 90 A3 C6 B7
##$RELAX= 
##$RELAX= 
##$RELAX= 
##$RELAX= 
##$RELAX= 
##$RELAX= 
##$RELAX= 
##$RELAX= 
$$ Bruker specific parameters
$$ --------------------------
##$DU= <E:\>
##$EXPNO= 20
$$ [...]
150 150 150 150 150 150 150 150
##$TP07= 0
##$TPNAME0= <>
##$TPNAME1= <>
##$TPNAME2= <>
##$TPNAME3= <>
##$TPNAME4= <>
##$TPNAME5= <>
##$TPNAME6= <>
##$TPNAME7= <>
##$TPOAL= (0..7)
0.5 0.5 0.5 0.5 0.5 0.5 0.5 0.5
##$TPOFFS= (0..7)
0 0 0 0 0 0 0 0
##$TUNHIN= 0
##$TUNHOUT= 0
##$TUNXOUT= 0
##$USERA1= <user>
##$USERA2= <user>
##$USERA3= <user>
##$USERA4= <user>
##$USERA5= <user>
##$V9= 5
##$VALIST= <valist>
##$VCLIST= <CCCCCCCCCCCCCCC>
##$VD= 0
##$VDLIST= <DDDDDDDDDDDDDDD>
##$VPLIST= <PPPPPPPPPPPPPPP>
##$VTLIST= <TTTTTTTTTTTTTTT>
##$WBST= 2048
##$WBSW= 25
##$XGAIN= (0..3)
0 0 0 0
##$XL= 0
##$YL= 0
##$YMAX_a= 630869
##$YMIN_a= -536339
##$ZGOPTNS= <>
##$ZL1= 120
##$ZL2= 120
##$ZL3= 120
##$ZL4= 120
##$ABSF1= 14.98509
##$ABSF2= -5.573092
##$ABSG= 5
##$ABSL= 3
##$ALPHA= 0
##$AQORDER= 0
##$ASSFAC= 0
##$ASSFACI= 0
##$ASSFACX= 0
##$ASSWID= 0
##$AUNMP= <proc_prof1d_extract_pilot.lims>
##$AXLEFT= 0
##$AXNAME= <>
##$AXNUC= <1H>
##$AXRIGHT= 0
##$AXTYPE= 0
##$AXUNIT= <>
##$AZFE= 0.1
##$AZFW= 0.1
##$BCFW= 0
##$BC_mod= 0
##$BYTORDP= 0
##$COROFFS= 0
##$CY= 15
##$DATMOD= 1
##$DC= 0
##$DFILT= <>
##$DTYPP= 0
##$F1P= 0
##$F2P= 0
##$FCOR= 0.5
##$FTSIZE= 32768
##$FT_mod= 6
##$GAMMA= 0
##$GB= 0
##$INTBC= 1
##$INTSCL= 1
##$ISEN= 128
##$LB= 0
##$LEV0= 0
##$LPBIN= 0
##$MAXI= 10000
##$MC2= 0
##$MEAN= 0
##$ME_mod= 0
##$MI= 0
##$NCOEF= 0
##$NC_proc= -8
##$NLEV= 6
##$NOISF1= 0
##$NOISF2= 0
##$NSP= 0
##$NTH_PI= 0
##$NZP= 0
##$OFFSET= 14.98509
##$PC= 1
##$PHC0= 96.17432
##$PHC1= 0
##$PH_mod= 1
##$PKNL= yes
##$PPARMOD= 0
##$PPDIAG= 0
##$PPIPTYP= 0
##$PPMPNUM= 2147483647
##$PPRESOL= 1
##$PSCAL= 4
##$PSIGN= 0
##$PYNMP= <proc.py>
##$REVERSE= no
##$SF= 400.02
##$SI= 32768
##$SIGF1= 0
##$SIGF2= 0
##$SINO= 400
##$SIOLD= 32768
##$SPECTYP= <>
##$SREGLST= <1H.CDCl3>
##$SSB= 0
##$STSI= 32768
##$STSR= 0
##$SW_p= 8223.68421052631
##$SYMM= 0
##$S_DEV= 0
##$TDeff= 65536
##$TDoff= 0
##$TI= <>
##$TILT= no
##$TM1= 0
##$TM2= 0
##$TOPLEV= 0
##$USERP1= <user>
##$USERP2= <user>
##$USERP3= <user>
##$USERP4= <user>
##$USERP5= <user>
##$WDW= 1
##$XDIM= 32768
##$YMAX_p= 480961938
##$YMIN_p= -700582
##$CURPLOT= <Network HP LaserJet P1505>
##$CURPRIN= <$Network HP LaserJet P1505>
##$DFORMAT= <normdp>
##$LAYOUT= <+/1D_H.xwp>
##$LFORMAT= <normlp>
##$PFORMAT= <normpl>
##$SURQMSG= 1
$$ End of Bruker specific parameters
$$ ---------------------------------
##NTUPLES= NMR SPECTRUM
##VAR_NAME=  FREQUENCY,     SPECTRUM/REAL,   SPECTRUM/IMAG
##SYMBOL=    X,             R,               I
##VAR_TYPE=  INDEPENDENT,   DEPENDENT,       DEPENDENT
##VAR_FORM=  AFFN,          ASDF,            ASDF
##VAR_DIM=   32768,         32768,           32768
##UNITS=     HZ,            ARBITRARY UNITS, ARBITRARY UNITS
##FACTOR=    0.250966925370066, 1,           1
##FIRST=     8223.43324360094, 43014,        -69678
##LAST=      0,             -18437,          122574
##MIN=       0,             -700582,         0
##MAX=       8223.43324360094, 480961938,    0
$$ Real data points
##PAGE= N=1
##DATA TABLE= (X++(R..R)), XYDATA
$$ [...]
$$ plain form
19541 189758 -199772 -15658 -442405 294595 -551584 22077 -373577 -66352 -173725 -303649
19531 -303649 -155235 114214 -277959 -48312 -343600 8296 -2612 142581 -4618 -79228 134596
19519 55149 -18178 -141321 126981 200230 -86873 249229 41759 187753 -40360 -224934 235081
19507 -207588 -38520 147478 113945 -311497 -88224 -247761 -255641 -169543 49719 -86560 -48667
19496 -48667 -112616 -165343 110846 106802 33793 65707 -64241 -147105 -15173 -287545 195289
19484 -283704 -133209 -204794 52606 58720 -158897 -311745 -561932 20639 -113690 -4053 -105541
19473 -105541 -119811 116563 146186 162333 -22458 -300231 -294975 -83806 108645 145312 -196794
19461 -164479 -33145 169726 -157129 -126321 -80446 -157833 -29011 -285231 -230981 -101295 4876
$$ packed form
19541A89758a99772a5658m26747B94595e51584B2077c73577f6352j07373j29924
19531c03649J48414A14214b77959d8312k95288H296b612A42581d618p4610A34596
19519E5149a8178j23143A26981P3249h6873B49229D1759J45994d0360j84574B35081
19507b07588c8520A47478l3533c11497h8224j59537p880Q6098D9719h6560L7893
19496d8667o3949n2727A10846m044C3793L1914f4241q2864a5173k72372A95289
19484b83704a33209p1585E2606O114a58897j52848k50187B0639a13690d053j01488
19473a05541j4270A16563K9623J6147b2458k77773N256h3806A08645L6667a96794
19461a64479c3145A69726a57129L0808M5875p7387b9011k56220N4250a01295D876
$$ plain form
19449 -170333 -144430 250319 163916 535863 -50780 -38048 174049 -112429 -50247 -208161
19439 -208161 26834 63870 -167190 -153734 304730 -23253 -331969 36044 78308 58375 21105
19427 -292760 -99906 -64573 -122861 -36615 -279318 283543 -35691 40498 -64720 102470 109143
19416 109143 -162689 77440 -61158 -78617 91246 -28141 -111126 -56556 170465 186538 -221709
19404 -43785 -344759 -223168 -5228 -202890 -59535 -2508 148862 91006 -148054 -72274 -16926
19392 -7701 -222293 151610 -151355 -80030 -122229 -223196 188890 -239445 -40275 -181693
19382 -181693 -191406 -56881 -113542 -77863 -143671 -159052 -116132 -349761 -603397 -181697 -231492
19371 -231492 10234 -319104 -172769 2693 68422 109990 -388480 -82173 -35234 126222 -274261
$$ packed form
19449a70333K5903B50319q6403L71947e0780J2732A74049a12429e0247j57914
19439b08161B6834L7036a67190J3456C04730b3253l08716C6044M2264j9933B1105
19427b92760i9906L5333n8288c6615k42703B83543c5691D0498f4720A02470O673
19416A09143a62689G7440f1158j7459I1246b8141q2985N4570A70465J6073b21709
19404d3785l00974J21591e228j97662e9535b508A48862n7856a48054g2274a6926
19392g701k14592A51610a51355P1325m2199j00967A88890b39445d0275j41418
19382a81693r713e6881n6661L5679o5808j5381M2920k33629k53636a81697m9795
19371b31492A0234c19104J46335B693O5729M1568c88480h2173c5234A26222b74261
$$ plain form
19359 -7098 93495 132352 119325 69251 98042 -227090 53593 -512369 -138059 -25864 -149552
19348 -149552 -239725 236047 -251490 332800 102230 103524 -89359 -213357 -24792 -171726
19338 -171726 -134750 -31932 19466 -344646 55640 160932 -107456 -187940 73395 178213 -105507
19326 -348413 26117 360041 -61216 56694 -118768 -133494 -88059 -101371 44113 -6966 216129
19314 -258381 46881 -321792 -290831 -397478 73569 -84468 -169676 -104192 -311451 -22962 -44956
19303 -44956 -250905 -23157 -55499 155019 46301 -415986 113317 161120 -391211 -44737 -176774
19292 -176774 -3992 -257328 7378 -45663 80021 180363 -399552 -288868 -76210 407392 3479
19280 -57440 -380097 85188 -36807 136526 -264589 -460368 52211 34212 -201288 -38632 79006
$$ packed form
19359g098I3495L8857j3027n0074K8791b27090E3593e12369a38059b5864j23688
19348a49552r0173B36047b51490C32800A02230J294h9359j23998b4792j46934
19338a71726L6976c1932A9466c44646E5640J05292a07456q0484G3395J04818a05507
19326c48413B6117L33924f1216E6694a18768j4726M5435j3312D4113f966B16129
19314b58381D6881c21792L0961j06647G3569h4468q5208O5484k07259b2962k1994
19303d4956k05949b3157l2342A55019D6301d15986A13317M7803c91211d4737j32037
19292a76774c992k53336G378d5663H0021J00342c99552J10684g6210D07392C479
19280e7440l22657H5188c6807A36526b64589j95779E2211j7999b01288c8632G9006
$$ plain form
19268 -386125 -150615 -85400 10008 135057 -376020 -48853 -111665 -355002 228891 -154872
19257 31365 -237581 -191685 161315 180928 -138437 -539525 32857 -57421 160169 -119837
19246 92231 -277781 -186767 -93375 -129928 -114134 -108447 203373 133308 138788 -253941 -9207 -1834
19233 -75488 -135911 122277 -225945 -190010 -222682 -141463 101094 -274145 95226 -211377 -194422
19222 -194422 -116516 -171829 172045 16538 72568 -46442 244942 7400 -170415 -1075 -55426
19211 -55426 84920 -160597 -74175 -11661 -151174 -110639 -193096 -130691 -94758 -21602 62677
19199 -24371 -54792 -120923 24751 -54239 -10452 506637 -88957 75231 217903 183340 -211316
19187 -248401 311291 -162201 78928 -127838 -13333 -149275 -372625 -156796 135566 -258107
$$ packed form
19268c86125a50615O5215A0008J25049c76020d8853o2812k43337B28891a54872
19257C1365b37581M5896A61315J9613a38437m01088C2857e7421A60169a19837
19246I2231b77781R1014i3375l6553J5794N687B03373p0065N480b53941i207a834
19233g5488o0423A22277b25945L5935l2672Q1219A01094b74145I5226b11377J6955
19222a94422P7906n5313A72045A6538N6030d6442B44942G400a70415a075n4351
19211e5426H4920a60597g4175a1661j39513M0535q2457O2405L5933b1602F2677
19199b4371l0421o6131B4751e4239a0452E06637h8957G5231J42672l4563b11316
19187b48401C11291a62201G8928a27838a3333j35942k23350a56796A35566b58107
$$ plain form
19176 -111840 67005 -67903 109443 383756 237338 83080 -32197 8973 51800 -105370 99755
19164 206269 -107944 106474 -85827 -198329 105529 -12951 27895 122105 60408 -145412
19153 -215505 -218396 -112384 186616 -88277 -174820 43642 -260168 99646 -196204 -203297 61913
19141 151842 -97053 -18897 7177 -94522 210496 358923 37066 -248997 -200971 -118916 152715
19129 15510 -238202 -262164 119496 93143 85564 -160687 -276134 8654 -47354 -106662 28106
19117 101458 -100754 -199412 -314976 -2983 -248525 190350 -188668 -13518 -663942 -598508
19107 -598508 -8738 237480 229175 96644 33059 -41169 56825 -162302 153698 -10303 188474
19095 -68030 -263081 -163814 -397506 -445879 -87904 311105 -85694 90404 -177549 23728 9268
$$ packed form
19176a11840F7005f7903A09443K74313j46418H3080c2197H973M2827a05370I9755
19164B06269a07944A06474h5827j12502A05529a2951B7895R4210F0408a45412
19153b15505k891J06012A86616h8277q6543D3642b60168I9646a96204p093F1913
19141A51842i7053a8897G177i4522B10496J48427C7066b48997M8026Q2055A52715
19129A5510b38202k3962A19496k6353p579a60687j15447H654d7354n9308B8106
19117A01458a00754r8658j15564b983k45542A90350a88668a3518o50424O5434
19107e98508h738B37480q305I6644C3059d1169E6825a62302A53698a0303A88474
19095f8030j95051R9267k33692m8373h7904C11105h5694I0404a77549B3728I268
$$ plain form
19083 -382980 -12369 -228067 -74830 20184 -105083 -412419 71744 92231 -97184 -139859 -92929
19072 -92929 -190688 -21562 112446 129424 -59901 -218484 -494515 -42988 -258684 -162492 111458
19060 161657 -38540 -317387 -204423 311413 -175540 -3569 -300135 212900 -15465 -228457
19050 -228457 -10478 4891 -103745 67185 -138548 208808 -205060 -61902 -433785 -40148 -223370
19039 -223370 136022 134091 -7014 -178219 72158 -3352 239878 -109791 102121 -21196 166683
19027 -128965 266501 105015 -157387 125326 207380 78770 147319 443415 40828 32039 83480
19016 83480 -56263 -117260 171358 172457 -10623 162149 110326 34318 -257782 -37392 -145336
19005 -145336 -4010 134488 106958 -43620 -159428 -126338 -5430 88510 -385009 -142734 142008
$$ packed form
19083c82980a2369k15698g4830B0184a05083l07336G1744K0487i7184m2675M6930
19072i2929r7759b1562A12446J6978e9901j58583k76031d2988k15696R6192A11458
19060A61657c8540k78847J12964C11413a75540c569k96566B12900a5465k12992
19050b28457a0478D891a03745F7185a38548B08808b05060f1902l71883d0148j83222
19039b23370A36022j931g014j71205G2158c352B39878a09791A02121b1196A66683
19027a28965B66501A05015a57387A25326Q2054G8770O8549K96096D0828q789N1441
19016H3480e6263o0997A71358J099a0623A62149n1823C4318b57782c7392j07944
19005a45336d010A34488k7530d3620j15808L3090e430H8510c85009a42734A42008
$$ plain form
18993 156193 -288775 -47028 -141806 46547 -90777 128022 1346 43806 -22963 39735 166849
18982 166849 378811 126044 -103753 187465 -61607 132106 -36635 48490 51862 -274513
18971 177347 40924 -58222 -163281 151121 202592 -9377 -219282 303664 -272274 -418107
18961 -418107 49859 -16314 -412230 258383 -184427 167750 -13850 -204392 134767 9944
18950 -320074 -29477 -139153 -283820 189704 -70744 -160510 -86721 199851 -103878 54481
18939 5489 67906 -57971 82152 -60023 -403226 130358 -47982 -314958 -282022 -217890 -181891
18928 -181891 137676 -66459 15269 128471 -497435 130965 171394 -440340 -287130 -32475
18917 -40401 -102205 60507 23000 -141259 4476 237919 439597 -72358 225580 134481 119935
$$ packed form
18993A56193b88775d7028r4778D6547i0777A28022A346M2460b2963C9735J27114
18982A66849K11962A26044a03753A87465f1607A32106c6635D8490L372b74513
18971A77347D0924e8222j05059A51121N1471i377k09905C03664b72274j45833
18961d18107D9859a6314l95916B58383a84427A67750a3850j90542A34767I944
18950c20074b9477j09676j44667A89704g0744q9766P3789A99851a03878E4481
18939E489O2417e7971H2152f0023l43203A30358d7982k66976L2936O4132L5999
18928a81891A37676f6459A5269J13202d97435A30965M0429d40340J53210c2475
18917d0401o1804F0507B3000a41259D476K33443K01678g2358B25580r1099j4546
$$ plain form
18906 119935 -15634 -80076 9934 -267556 61036 9094 -108361 -276265 149194 -130022 224661
18894 31117 38169 182576 -92784 -269387 -147529 -23133 -27841 -102 -381596 -168554 -491886
18883 -491886 65578 -12914 1771 -227347 -356896 -310662 -57289 88474 -44199 124988 -164406
18871 207321 -28238 54328 36257 100815 -91273 24769 -81258 238572 402145 -285269 -318510
18860 -318510 -166928 166476 226881 2025 -186500 124472 -135998 -390946 123211 238366
18850 238366 87981 136984 -17610 100796 9700 -37595 31167 -370543 -37203 170007 -181008
18838 -27797 -241072 157013 -168845 7171 201755 -200318 -151030 -35095 -19989 -27037 196331
18826 -143732 -152001 -238834 -18789 48883 343768 -350111 -103462 136668 -272667 57923 124569
$$ packed form
18906A19935a5634o4442I934b67556F1036I094a08361j67904A49194a30022B24661
18894C1117P052J44407i2784j76603J21858b3133m708a02l81494a68554l23332
18883d91886F5578a2914A771b27347j29549M6234e7289H8474d4199A24988a64406
18871B07321b8238E4328j8071O4558i1273B4769h1258B38572J63573b85269l3241
18860c18510J51582A66476O0405B025a86500A24472a35998k54948A23211J15155
18850B38366H7981M9003a7610A00796I700c7595C1167c70543c7203A70007a81008
18838b7797k13275A57013a68845G171J94584b00318M9288c5095J5106p048A96331
18826a43732q269q6833a8789D8883K94885c50111a03462A36668b72667E7923O6646
$$ plain form
18815 124569 -208260 -292972 113740 210645 361201 368182 180788 -65706 148677 -4253 82649
18803 107759 -388911 -270780 -281110 191786 -88717 179653 -48177 86933 -64114 -147286 -88719
18792 -88719 -138480 -44233 194118 14752 -41093 36629 150576 -61456 -257852 -94425 92865
18780 92441 132724 -143495 67378 13828 169981 41745 -303620 1100 231725 -180623 192038
18768 -314660 211984 106226 180462 -48607 269052 -16992 -194199 81470 39188 96310 19970
18756 149944 -399594 -463613 77081 -1080 -409509 13222 -136142 103090 227721 -354116
18745 -33866 251206 -33335 -157425 -316662 -224574 -19909 352971 110627 57026 -385096
18734 20918 -107034 -286230 112840 28965 -358197 -334283 143688 -6364 50074 -33506 -336663
$$ packed form
18815A24569b08260q4712A13740R6905J50556O981A80788f5706A48677d253H2649
18803A07759c88911J18131j0330A91786h8717A79653d8177H6933f4114q3172N8567
18792h8719m9761d4233A94118A4752d1093C6629J13947f1456j96396i4425I2865
18780I2441M0283a43495F7378A3828J56153D1745c03620A100K30625a80623A92038
18768c14660B11984j05758P4236d8607B69052a6992j77207H1470C9188N7122A9970
18756A49944c99594o4019G7081a080m08429A3222a36142A03090J24631c54116
18745c3866B51206c3335j24090j59237R2088a9909C52971A10627n3601c85096
18734B0918a07034j79196A12840B8965c58197K3914A43688f364E0074c3506l03157
$$ plain form
18723 -336663 307644 215341 -55474 -61056 5418 189377 467715 -50354 86892 147064 9410
18711 -86363 32485 80964 -233677 -46309 -394286 129191 -476413 250838 -55164 -119860 -75573
18700 -75573 -121573 -41829 259677 23248 -295144 -365676 -214054 115367 -77877 183257 101896
18689 101896 90112 286178 -345265 91517 -64079 -590377 -174712 -117424 135460 -193966
18678 -118080 -4958 240846 -133745 -148476 -120832 258203 -56634 154535 -7481 17747 -240822
18666 -103235 -137181 370401 138964 -298189 -3463 73791 78598 -48740 47806 -247757 -208076
18655 -208076 -73982 -479317 67357 -243870 -345534 5660 64604 -140184 175238 -149019
18644 -19571 -162771 56160 153486 -339071 -145841 -50036 -196657 -214483 -100067 -222685
$$ packed form
18723c36663C07644r2303e5474n582E418J83959K78338e0354H6892O0172I410
18711h6363C2485M8479b33677d6309l47977A29191d76413B50838e5164o4696M4287
18700g5573m6000d1829B59677B3248b95144p0532J51622A15367g7877A83257q1361
18689A01896j1784J96066c45265I1517f4079n26298a74712N7288A35460a93966
18678a18080d958B40846a33745j4731K7644B58203e6634A54535g481A7747b40822
18666a03235l3946C70401A38964b98189c463G3791M807d8740D7806b47757L9681
18655b08076g3982m05335F7357b43870j01664E660N8944a40184A75238a49019
18644a9571j43200E6160R7326c39071a45841e0036j46621j7826a00067j22618
$$ plain form
18634 -222685 -35569 161296 -189149 -5214 -73606 187832 -505235 2463 48214 300044 -394319
18622 -11840 5206 -90040 -117468 -4849 188660 -300458 535627 -68716 -56921 -87460 -244106
18611 -244106 -124864 -2757 -90347 20163 -221597 -11551 203282 -239084 19302 36622 111067
18600 111067 -35958 -91884 -140991 156073 -217766 -165197 -104127 -196699 -42062 -123256 -260075
18589 -260075 17257 209265 49325 -410013 -36793 50110 -85979 -230262 -306828 -38872 -269144
18578 -269144 -300868 -102820 -218817 76911 -63139 31428 90251 241021 -278823 -72808 -75171
18567 -75171 -137969 86624 -116574 33719 -116550 67992 95176 -279687 -281944 -115788 -271444
18556 -271444 42455 23042 -8502 -141122 249683 -252636 -21697 359848 11030 39282 -318927
$$ packed form
18634b22685c5569A61296a89149e214o8392A87832e05235B463M5751K51830c94319
18622a1840E206i0040k7428d849A88660c00458E35627f8716J1795l0539j56646
18611b44106J19242b757q7590B0163b21597a1551B03282b39084A9302J7320P4445
18600A11067c5958n5926m9107A56073b17766N2569O1070r2572d2062q1194j36819
18589b60075A7257J92008D9325d10013c6793E0110h5979j44283p6566c8872k30272
18578b69144l1724a02820j15997G6911f3139C1428N8823J50770b78823g2808k363
18567g5171o2798H6624a16574C3719a16550F7992K7184b79687k257a15788j55656
18556b71444D2455j9413h502j32620B49683b52636b1697C59848A1030K8252c18927
$$ plain form
18544 -66778 -167505 11073 36780 218240 -33172 -86423 -97368 67426 -9793 58225 -111343
18532 160686 18253 -189128 -47109 -81718 80501 -312480 -147777 -21481 78173 270267 75614
18520 -122720 -63205 122358 -14051 -75195 -18260 -149552 -50995 100240 -106305 -33664 -356886
18509 -356886 190033 151863 84020 -170106 56701 -250683 244410 122647 94147 16032
18498 -173984 -304727 417876 307938 -75365 -82854 -162246 -73957 107139 186711 155785 -5380
18486 150873 85 -197604 -100686 -40162 187866 -50882 -202946 91089 71821 78076 -321466
18474 -108649 -121581 86971 -448878 167555 -188841 -156594 -27645 90476 -78855 147306 42764
18462 -303489 -154664 339900 67399 -227949 -249538 -57737 -85237 -212923 -32690 -468987
$$ packed form
18544f6778j00727A1073K5707J81460c3172n3251j0945F7426i793E8225a11343
18532A60686A8253a89128d7109l4609H0501c12480a47777b1481G8173J92094G5614
18520a22720N9515A22358a4051o1144a8260j31292e0995A00240a06305c3664l23222
18509c56886A90033l8170o7843a70106E6701b50683B44410j21763k8500A6032
18498a73984j30743D17876j09938g5365p489p9392g3957A07139P9572l0926e380
18486A50873H5a97604R6918d0162A87866e0882j52064I1089j9268O255c21466
18474a08649j2932H6971d48878A67555a88841L2247b7645I0476g8855A47306D2764
18462c03489J48825C39900F7399b27949k1589e7737k7500j27686c2690m36297
$$ plain form
18452 -468987 161150 146287 -144233 100984 52365 -41925 -163657 -103905 -130546 27054 91588
18441 91588 -27668 164088 -391566 -70305 -302966 -79814 -247338 -6534 218991 -102079 111194
18429 -90143 -169681 -30485 -70177 -33445 -294457 -84071 76026 249120 -220161 -129129 -76526
18418 -76526 70781 -73772 -92480 505 -135294 31762 142521 123599 -179389 241221 -20456
18406 51370 373524 294054 -83014 -266521 440126 -91495 -267224 228724 -14579 -176897
18396 -176897 32977 -299630 -161239 -118564 -105062 -83221 -250843 31631 -74390 -243427 -145607
18385 -145607 142729 271926 28273 173184 2891 17391 381569 247056 -405701 -79380
18374 78216 -111539 17395 -53457 64228 11741 122600 -395137 -113902 57488 -198623 -173814
$$ packed form
18452d68987A61150j4863a44233A00984m8619d1925j21732N9752k6641B7054O4534
18441I1588b7668A64088c91566g0305k32661g9814j67524f534B18991a02079A11194
18429i0143p9538c0485l9692c3445k61012h4071G6026J73094b20161R1032N2603
18418g6526G0781g3772j8708E05a35294C1762J10759j8922a79389B41221b0456
18406E1370L22154p9470h3014j83507D40126i1495j75729B28724a4579j62318
18396a76897C2977b99630J38391M2675J3502K1841j67622C1631g4390j69037R7820
18385a45607A42729J29197B8273J44911B891J4500L64178j34513d05701g9380
18374G8216a11539A7395e3457F4228A1741J10859c95137a13902E7488a98623K4809
$$ plain form
18363 -173814 15609 -84179 75287 228261 290695 194170 104001 -53129 -110676 -229597 14132
18351 -452821 -466440 -237067 -172538 173633 -87630 -167709 -198416 29909 -70932 65938 -23111
18339 -485319 -191641 86129 -218020 181745 -140960 40503 -217480 -322986 -323827 -414866 -76255
18327 -63125 -151017 146289 -295429 -217629 -116320 -327776 -264078 154362 -134302 -127251 -584520
18316 -584520 -26549 -161617 -90805 -97589 159462 -292871 -434263 -34737 77122 -193414 -18907
18304 -46935 338129 -33410 -66906 -175494 264881 -243053 35731 -7675 -207141 -85889 139058
18292 150166 159091 -179876 -285374 -377048 -292574 102642 -119344 69114 -106676 100112
18281 -198792 131553 -119025 -127373 -189960 58642 320687 -21813 -180220 10635 -342022 -104020
$$ packed form
18363a73814A5609h4179G5287J52974O2434r6525r0169e3129n7547j18921A4132
18351d52821j3619K29373O4529A73633h7630q0079l0707B9909g0932F5938b3111
18339d85319a91641H6129b18020A81745a40960D0503b17480j05506q41r1039g6255
18327f3125q7892A46289b95429P7800J01309k11456O3698A54362a34302P051m57269
18316e84520b6549j35068P0812o784A59462b92871j41392c4737G7122a93414a8907
18304d6935C38129c3410l3496j08588B64881b43053C5731g675j99466h5889A39058
18292A50166Q925a79876j05498r1674Q4474A02642a19344F9114a06676A00112
18281a98792A31553a19025q348o2587E8642K62045b1813j58407A0635c42022a04020
$$ plain form
18269 -58113 86343 66270 68573 120780 179518 -269015 185363 213349 -225869 109573 -107663
18257 -50023 -114391 337037 58750 -195943 118939 239046 1632 32071 -15020 265985 -308024
18245 -36093 143185 -86223 156097 -56980 -189707 247592 57927 37153 35910 -126444 -111816
18234 -111816 -173256 -151308 -208264 17970 94562 120963 -150311 64436 201332 -5997 111403
18222 -151570 14396 -321181 86782 23676 -350429 -234276 101264 221898 -355247 -129286
18211 -60203 249559 58946 -293330 -163981 325162 181255 79598 131829 173865 -162890
18200 -155099 295113 -109496 460588 -83253 -70708 -17466 -252409 22609 -227026 -44706
18189 -380203 183816 -196889 131126 -318145 -371449 -161289 -241379 139410 22491 43798
$$ packed form
18269e8113H6343k0073K303N2207N8738b69015A85363K7986b25869A09573a07663
18257e0023o4368C37037E8750a95943A18939J20107A632L0439a5020B65985c08024
18245c6093A43185h6223A56097e6980j32727B47592E7927k0774j243a26444J4628
18234a11816o1440K1948n6956A7970P6592K6401a50311F4436J36896e997A11403
18222a51570A4396c21181H6782B3676c50429J16153A01264J20634c55247a29286
18211f0203B49559E8946b93330J29349C25162j43907G9598N2231M2036a62890
18200a55099B95113a09496D60588h3253J2545a7466k34943B2609b27026d4706
18189c80203A83816a96889A31126c18145n3304a61289q0090A39410B2491K1307
$$ plain form
18179 43798 -453772 48801 32310 -902 278086 47312 -50609 169797 -22025 -21234 413250 348125
18167 348125 -231729 58206 -13361 458034 -220928 -298768 43421 -3799 19245 -21538 103884
18155 -13398 -753 -11470 133908 417017 -119041 -78039 145736 -365203 -152268 144276 -217135
18143 -81983 -3806 -260833 104037 -162366 418991 221258 62794 114084 -15590 -72418 -187279
18132 -187279 127402 -238892 98622 19517 -401208 190123 -283310 -190087 62119 209847
18122 209847 -343511 110293 28038 271565 -700582 -135627 68903 143006 -75576 -255625
18112 -255625 -166623 -150706 69975 116274 -62320 322906 -203021 -167803 -109385 -218653 -196763
18101 -196763 184445 -97781 -93539 -69813 151143 -165404 -10649 -25961 186069 -185365 -126894
$$ packed form
18179D3798d53772D8801j6491i02B78086D7312e0609A69797b2025P91D13250o5125
18167C48125b31729E8206a3361D58034b20928p7840D3421c799A9245b1538A03884
18155a3398g53j0717A33908K83109a19041M1002A45736c65203a52268A44276b17135
18143h1983c806k57027A04037a62366D18991j97733F2794N1290a5590n6828j14861
18132a87279A27402b38892I8622A9517d01208A90123b83310R3223F2119J47728
18122B09847c43511A10293B8038K43527g00582a35627F8903P4103g5576j80049
18112b55625Q9002J5917F9975M6299f2320C22906b03021L5218N8418j09268K1890
18101a96763A84445i7781M242K3726A51143a65404a0649j5312A86069a85365N8471
$$ plain form
18090 -126894 -72983 345617 164335 115228 181391 -75534 -183777 91344 129235 -193482 105062
18078 -115518 98725 71969 -37992 482445 80278 144393 130615 -483683 -168777 7263 228509
18067 228509 -20781 -141968 -68163 -30861 -116225 188926 -32574 -74853 -51642 -269613 -618948
18056 -618948 -122316 -13151 344677 -49595 47728 -44398 -87928 94389 -68675 -168283 56220
18044 342591 -146521 -65608 119125 51720 -38868 21526 126625 -108708 -206197 -195633 336872
18032 -149974 189422 456633 239956 -5427 110445 -30433 2946 -96993 -168848 23609 -208588
18020 -73150 -380616 103342 110139 22939 85921 97067 -243724 -119086 43858 -318327 -209767
18009 -209767 153301 200297 200139 -51475 -35075 -413866 -216255 27813 -107597 71751 -272676
$$ packed form
18090a26894N3911C45617A64335m9107O6163g5534j08243I1344L7891a93482A05062
18078a15518I8725k6756c7992D82445H0278O4115j3778d83683a68777G263K21246
18067B28509b0781j21187f8163c0861q5364A88926c2574m2279K3211k17971l49335
18056f18948a22316a3151C44677d9595D7728d4398m3530I4389f8675r9608E6220
18044C42591a46521f5608A19125E1720c8868B1526J05099a08708r7489J0564C36872
18032a49974A89422K67211k16677e427A10445c0433B946i6993p1855B3609b08588
18020g3150l07466A03342O797B2939O2982J1146b43724a19086D3858c18327J08560
18009b09767A53301M6996j58e1475J6400l78791J97611B7813a07597G1751b72676
$$ plain form
17997 -101055 111975 -93699 69935 -36421 -10185 62090 305376 110810 -130275 -65987 -295295
17986 -295295 162057 -70815 -78321 -40535 69984 -123429 -32639 61900 42917 72007 -236529
17974 279810 345701 -104004 -87917 -260085 -68002 49275 -111893 -87028 114216 -98477 14470
17962 339600 -12237 -129909 69745 12711 61670 189278 96944 375637 -78058 -291629 28139
17950 517 -66634 -38220 46346 -184219 172723 -188143 16572 23077 -108893 -32706 121310
17938 -67882 16432 32730 -509 -176699 -153577 116730 -248776 -293106 -228633 -4927 119776
17926 51661 -23608 31744 -115559 63754 -171635 -42451 -302041 -67498 190470 -80938 -224455
17915 -224455 175751 -112491 -75172 25426 24256 137184 86253 93946 106405 227539 199268
$$ packed form
17997a01055A11975i3699F9935c6421a0185F2090K43286A10810a30275O4288k29308
17986b95295A62057g0815p506L7786F9984a23429c2639F1900j8983K9090b36529
17974B79810O5891a04004J6087j72168f8002D9275a11893K4865A14216i8477A4470
17962C39600a2237j17672F9745A2711M8959J27608r2334K78693g8058k13571B8139
17950E17f6634K8414D6346a84219A72723a88143A6572O505a08893c2706A21310
17938f7882A6432J6298e09j76190K3122A16730b48776m4330O4473d927A19776
17926E1661b3608C1744a15559F3754a71635d2451k59590f7498A90470h0938j43517
17915b24455A75751a12491L7319B5426j170J12928n0931P693J2459J21134k8271
$$ plain form
17904 199268 -196971 -69103 -193180 -235707 256756 -88234 -75173 -88570 -79832 12112 -281690
17892 314081 -140230 186294 250677 250994 81819 121619 211568 111774 -31905 -337905 -81604
17880 162599 -337213 -300031 -65245 -201288 -244816 106067 -29805 -151628 -20958 -15066 -109332
17869 -109332 -69395 -125408 -164151 227933 -20212 -26158 87117 69001 -151403 186606 -88835
17857 -169886 86659 -47946 -75575 -16159 56546 -81617 -228825 13661 -156457 323971 -405655
17845 -72534 -396577 -68500 200976 -95250 123006 56775 -245636 236193 -151027 -48467
17834 47491 95000 114156 196836 -30529 116423 -31193 156608 -108321 -207306 221385 206749
17823 206749 277532 401498 -16075 -148303 -10179 219960 -166571 169220 270144 -142567
$$ packed form
17904A99268a96971f9103j24077m2527B56756h8234J3061j3397Q738A2112b81690
17892C14081a40230A86294O4383L17H1819L9800Q9949r9794c1905l06000h1604
17880A62599c37213L7182f5245j36043m3528A06067b9805j21823b0958N892r4266
17869a09332L9937n6013l8743B27933b0212n946H7117j8116a51403A86606h8835
17857a69886H6659d7946k7629a6159E6546h1617j47208A3661a56457C23971d05655
17845g2534l24043f8500B00976i5250A23006E6775b45636B36193a51027d8467
17834D7491M7509J9156Q2680c0529A16423c1193A56608a08321r8985B21385j4636
17823B06749P0783J23966a6075j32228a0179B19960a66571A69220J00924a42567
$$ plain form
17812 -337436 223455 126473 175134 -159782 17307 -93540 -62335 -128753 100647 123323 130576
17801 130576 -82130 145618 563607 242847 -257923 87974 135754 29297 129930 -149602
17790 299151 -63236 -9806 333891 195105 180413 -120357 -93830 5872 322004 198454 64546
17778 -128326 111872 -127586 242696 -3191 70130 -328484 145317 423354 119365 337278
17768 337278 22474 -31002 235349 170597 59596 -38599 -227435 -23962 349577 -1659 39555
17756 -317370 -145942 -103527 -58659 120412 120679 -15794 121524 -15436 173433 -113464 49166
17744 -55566 155345 111968 -39386 76215 67484 81353 -17855 16509 -432812 -13360 -10292 -83998
17732 -83998 151003 189489 182153 -41531 6990 43949 -183581 -14389 27142 26525 -80126 136630
$$ packed form
17812c37436B23455r6982M8661a59782A7307i3540L1205o6418A00647K2676P253
17801A30576h2130A45618M17989B42847b57923H7974M7780B9297J00633a49602
17790B99151f3236i806C33891j38786j4692a20357K6527E872L16132j23550F4546
17778a28326A11872a27586B42696c191G0130c28484A45317K78037A19365K17913
17768C37278B2474c1002B35349o4752E9596c8599j88836b3962C49577a659C9555
17756c17370a45942M2415M4868A20412K67a5794A21524a5436A73433a13464D9166
17744e5566A55345m3377c9386G6215q731J3869a7855A6509d32812a3360L068p3706
17732h3998A51003L8486p336d1531F990L6959a83581a4389B7142o17h0126A36630
$$ plain form
17719 31851 461749 303237 155960 -166025 24001 49119 63486 -73396 -17118 12019 13541
17708 13541 -157708 -4125 107828 -116432 -55485 32723 71954 -331389 -92001 146506 258504
17697 258504 -119681 -175190 -170871 -92179 -71484 143103 124936 134142 303113 -209539 -46279
17685 -80507 -129688 -394724 417621 -529253 -79 31884 29396 245427 23098 55811 -170741
17673 -155956 -40942 369046 -38763 337008 -4461 -69734 -97738 -108543 -88241 129258 143753
17662 143753 -205916 -66918 305892 -23690 -111521 105495 171977 231864 194072 93976 68025
17651 68025 195509 356896 132288 135240 128123 -89685 -147346 26038 -145965 -248874 90489
17639 -12524 245639 244930 117161 133420 155518 131694 12854 412634 -57447 35876 304451
$$ packed form
17719C1851M29898j58512j47277a66025B4001K5118J4367g3396a7118A2019J522
17708A3541a57708d125A07828a16432e5485C2723L9231c31389i2001A46506J11998
17697B58504a19681n5509M319P8692K0695A43103j8167R206J68971b09539d6279
17685h0507m9181k65036D17621e29253g9C1884k488K16031B3098L2713a70741
17673a55956d0942C69046c8763C37008d461o5273k8004j0805K0302A29258J4495
17662A43753b05916f6918C05892b3690q7831A05495O6482N9887l7792I3976k5951
17651F8025J27484J61387A32288K952p117h9685n7661B6038a45965j02909I0489
17639a2524B45639p09A17161J6259K2098k3824A2854L99780e7447C5876K68575
$$ plain form
17628 304451 30781 -83120 226052 -146589 345874 103140 120440 12450 -147992 -141490 209553
17616 177113 26052 192282 -75627 -102734 -3513 -194762 -51318 -14330 300318 -42931 287656
17604 382091 -11804 -3278 47932 96175 279764 288332 133997 -45473 -97871 72499 -36217
17592 312461 -41373 -288654 -18654 94655 -21337 194713 -18352 139436 -173699 -131255 99459
17580 263908 21460 -79407 16461 225690 -108695 -81059 -82768 -82975 -90226 -49385 -154412 -50722
17567 -8307 316248 122966 -215031 170969 231105 177727 -89878 253081 -116993 -105857 10684
17555 -253766 186391 58453 159710 -295834 118381 -249909 -116692 -113761 35372 -943 -120206
17544 -120206 -62118 327634 -51377 85303 211451 -17314 -89252 379579 291186 -21802 109437
$$ packed form
17628C04451C0781h3120B26052a46589C45874A03140J7300A2450a47992O502B09553
17616A77113B6052J66230g5627k7107c513j91249e1318a4330C00318d2931B87656
17604C82091a1804c278D7932M8243J83589Q568A33997d5473n2398G2499c6217
17592C12461d1373k47281a8654I4655b1337A94713a8352A39436a73699M2444I9459
17580B63908B1460g9407A6461K09229a08695K7636j709k07p251M0841j05027e0722
17567h307C16248A22966b15031A70969O0136n3378h9878B53081a16993J1136A0684
17555b53766A86391E8453J01257b95834A18381b49909a16692K931C5372i43j19263
17544a20206N8088C27634e1377H5303J26148a7314p1938C79579q8393b1802A09437
$$ plain form
17532 4135 18436 35749 -14659 399617 83588 -6053 -164375 5824 23649 31806 308187 67014
17519 -7119 252233 118226 -268895 388687 245494 -119180 95233 -50278 137842 251480
17509 251480 259634 71744 53011 73569 299158 255053 -5108 140387 82355 -72864 105707
17497 145907 -37978 -260799 -111287 -28514 168291 502320 142907 -135404 170073 -145163
17486 238563 473427 184866 183621 -91707 -92069 -106513 342823 152507 214286 -166264 593466
17474 55958 -162384 127002 -30375 329603 343820 -308402 361979 84043 -33980 38554 264693
17463 264693 -163739 88673 77817 123190 425779 261304 110954 574140 -138899 119451
17452 234416 27518 265872 -72307 249600 424369 260518 576104 92603 75865 250693
$$ packed form
17532D135J4301J7313a4659C99617H3588f053j58322E824J7825Q157K76381F7014
17519g119B52233A18226b68895C88687j43193a19180I5233e0278A37842J13638
17509B51480Q154G1744j8733K0558K25589m4105e108A40387n8032g2864A05707
17497A45907c7978k22821a11287b8514A68291L34029A42907a35404A70073a45163
17486B38563K34864A84866j245i1707l62j4444C42823A52507O1779a66264E93466
17474E5958a62384A27002c0375C29603J4217c08402C61979H4043c3980C8554K26139
17463B64693a63739H8673j0856M5373L02589j64475A10954M63186a38899A19451
17452B34416B7518K38354g2307B49600J74769j63851L15586I2603j6738J74828
$$ plain form
17442 250693 568574 272354 -45922 323651 273353 -12958 116546 133378 139810 74172 70947
17431 70947 62469 76412 48399 331394 186763 -40946 34390 474297 92767 -44110 282226
17419 356356 180719 353767 18501 217795 247164 418660 175248 398950 157357 237493
17409 237493 22874 233838 181685 183629 158758 243870 108413 368634 -231781 47628 182732
17398 182732 30502 243401 26338 84464 21767 248934 263246 148664 -9931 329007 76638
17386 491287 89372 105595 234 10468 225951 -116899 600852 247804 -141926 -278210 157968
17374 5756 182764 193460 270399 364110 148043 274280 153704 -89949 31014 18898 104091
17363 104091 187806 152203 -29024 -74227 -78918 -40461 47112 121429 514080 20945 -173100
$$ packed form
17442B50693L17881B72354d5922C23651n0298a2958A16546J6832O432o5638l225
17431G0947q478J3943k8013K82995j44631d0946C4390M39907I2767d4110B82226
17419C56356j75637J73048A8501J99294K9369J71496A75248K23702A57357Q0136
17409B37493B2874K10964n2153J944k4871Q5112A08413K60221b31781D7628J35104
17398A82732C0502K12899B6338N8126B1767K27167J4312j14582i931C29007G6638
17386D91287H9372J6223B34J0234K15483a16899F00852B47804a41926j36284A57968
17374E756J77008J0696P6939R3711A48043J26237j20576h9949C1014j2116Q5193
17363A04091Q3715l5603b9024m5203m691L8457D7112P4317L92651B0945a73100
$$ plain form
17351 19535 243661 -47614 415717 391093 258884 19653 -88265 522650 175475 96562 239540
17340 239540 152046 212944 57619 124369 109807 162100 136764 174108 111490 -155303 -343479
17329 -343479 163964 462067 406196 178308 454611 111822 426535 269206 26284 422087
17319 422087 -24639 -316955 237075 219819 -35793 474906 205211 -15497 24720 304301
17309 304301 -38017 62223 292895 364453 -42790 221251 207846 -69116 170723 -76314 258509
17297 -167536 142643 -177631 232615 -83028 503872 -1364 -97744 74191 157233 500247 232682
17285 92271 204107 283856 157163 -440383 82648 -18420 116018 207218 99342 120917 432126
17274 432126 -62022 261146 46140 418001 -221201 -220903 77464 -46035 520037 120896 326425
$$ packed form
17351A9535K24126d7614D15717k4624j32209A9653h8265E22650A75475p8913J42978
17340B39540q7494O0898E7619O6750j4562N2293k5336L7344o2618a55303j88176
17329c43479A63964K98103n5871A78308K76303A11822L14713j57329B6284L95803
17319D22087b4639k92316B37075j7256c5793D74906B05211a5497B4720K79581
17309C04301c8017F2223K30672P1558d2790B21251j3405f9116A70723g6314B58509
17297a67536A42643a77631B32615h3028E03872a364r6380G4191Q3042L43014B32682
17285I2271J11836P9749j26693d40383H2648a8420A16018R1200I9342K1575L11209
17274D32126f2022B61146D6140L71861b21201K98G7464d6035E20037A20896K05529
$$ plain form
17263 326425 -152937 -94818 73906 280051 164855 84841 -27900 498289 350338 178727
17253 178727 195304 444522 -12433 254707 -1267 337322 400879 6903 165017 131560 308464
17242 308464 -48362 396029 247502 66191 -76789 213850 511862 286283 376392 354146
17232 354146 -122559 257875 -41292 163733 414920 417356 262961 -134701 -34328 457424
17221 3881 270106 140582 -8391 -153430 671543 63154 237888 271831 113268 140974 189546
17210 189546 -59435 52602 271063 378204 151735 399912 395942 407787 76151 293146 69055
17198 -209717 415769 233991 463314 251832 -51622 470774 540417 308963 99957 -77567
17187 128549 178261 221420 258360 302848 200056 197984 334987 525420 286562 48323 611873
$$ packed form
17263C26425a52937N8119G3906K06145j15196q0014b7900D98289j47951j71611
17253A78727J6577K49218a2433B54707a267C37322O3557F903J58114l3457J76904
17242C08464d8362C96029j48527F6191g6789B13850K98012k25579R0109k2246
17232C54146a22559B57875d1292A63733K51187K436j54395a34701c4328D57424
17221C881K66225j29524h391j45039F71543F3154J74734L3943A13268K7706M8572
17210A89546e9435E2602K18461J07141A51735K48177l970J1845G6151K16995F9055
17198b09717D15769j81778K29323k11482e1622D70774O9643k31454I9957g7567
17187A28549M9712M3159L6940M4488j02792k072J37003J90433k38858D8323N63550
$$ plain form
17176 611873 270859 305244 263682 66465 278356 247876 629648 428030 425838 72096 335388
17165 335388 255645 285521 90516 205088 60293 125886 256877 739607 379734 491103
17155 491103 457093 325522 457696 213186 389292 206235 302342 278448 218142 402051
17145 402051 371891 328678 401775 399678 -125019 335528 519327 348514 240105 223528 189115
17134 189115 73118 371217 439582 205983 416900 311925 248506 615447 208894 360900
17124 360900 204542 451272 453250 197188 20296 875025 153660 700712 487837 382093
17114 382093 373265 408456 75673 197527 -81 197665 365034 294221 525074 606837 355450
17103 355450 371088 223857 597868 420453 307371 198930 596784 334852 314989 -67550
$$ packed form
17176F11873B70859L4385m1562F6465K11891l0480L81772k01618k192G2096K63292
17165C35388p9743K9876I0516J14572F0293O5593J30991M82730l59873J11369
17155D91103l4010j31571J32174B13186J76106j83057R6107k3894o0306J83909
17145D02051l0160m3213P3097k097a25019C35528J83799j70813j08409j6577l4413
17134A89115G3118K98099O8365B05983K10917j04975o3419L66941B08894J52006
17124C60900j56358K46730J978A97188B0296Q54729A53660N47052k12875j05744
17114C82093q828L5191G5673J21854h1A97665J67369p0813K30853Q1763k51387
17103C55450J5638j47231L74011j77415j13082j08441L97854k61932j9863f7550
$$ plain form
17092 641991 184709 317091 439814 584415 416362 435982 76212 549099 251704 485840
17082 485840 363281 413151 760847 749117 633452 568668 650567 327156 488211 458521
17072 458521 337784 500265 522774 718575 507720 480681 386791 509881 522418 504505
17062 504505 504172 563416 715163 254723 695835 425936 269965 187038 382155 739046
17052 739046 608221 267324 595231 718659 893807 579735 354662 425045 649354 689137
17042 689137 461086 644504 638076 413191 890639 513607 784308 550753 213723 444070
17032 444070 846737 828775 577098 694253 1144342 649929 734433 614867 713382 993566
17022 993566 548955 753251 725881 537131 939196 450760 452488 924878 698248 1037536
$$ packed form
17092F41991A84709J32382J22723J44601j68053J9620G6212M72887B51704K34136
17082D85840j22559M9870L47696j1730j15665o4784Q1899l23411J61055k9690
17072D58521j20737J62481K2509J95801k10855k7039r3890J23090J2537j7913
17062E04505l33N9244J51747B54723M41112k69899j55971q2927J95117L56891
17052G39046j30825B67324L27907J23428J75148l14072k25073P0383K24309L9783
17042F89137k28051J83418o428k24885M77448l77032K70701k33555B13723K30347
17032D44070M02667j7962k51677J17155M50089m94413Q4504j19566R8515K80184
17022I93566m44611K04296k7370j88750M02065D50760J728M72390k26630L39288
$$ plain form
17012 1037536 729125 595449 1027272 862581 809586 548170 657416 518399 464773 433863
17002 433863 1047537 522661 1158065 926580 803032 521502 825977 690415 771369 478914
16992 478914 761183 784316 747806 1036778 612250 935528 931056 1095990 768030 953437
16982 953437 1063749 1035906 892430 910029 744758 787560 913424 894121 554542 743430
16972 743430 878644 911367 1105494 1014887 756119 1046134 858503 1396821 1175155 976475
16962 976475 940820 1044702 876578 1228048 1403682 1354563 997663 1244443 950683 1106480
16952 1106480 1064953 1009452 1394652 1057315 1447174 1043547 917881 1239618 1256464 1178089
16942 1178089 1441165 1182387 1531721 997760 1490905 1236619 1491007 1331055 1409425 1563727
$$ packed form
17012A037536l08411j33676M31823j64691n2995k61416J09246j39017n3626l0910
17002D33863O13674E22661O35404k31485j23548k81530L04475j35562Q0954k92455
16992D78914K82269K3133l6510K88972m24528L23278m472J64934l27960J85407
16982I53437J10312k7843j43476J7599j65271M2802J25864j9303l39579J88888
16972G43430J35214L2723J94127r0607k58768K90015j87631N38318k21666j98680
16962I76475l5655J03882j68124L51470J75634m9119l56900K46780k93760J55797
16952A106480m1527n5501L85200l37337L89859m03627j25666L21737J6846p8375
16942A178089K63076k58778L49334n33961M93145k54286K54388j59952P8370J54302
$$ plain form
16932 1563727 1264309 1315533 1362953 1452977 1413565 1182212 1354565 1506080 1632100 1294197
16922 1294197 1427193 1077107 1684861 1640447 1834085 1498739 1728662 1719501 1584861 1560358
16912 1560358 1546932 1850602 1567676 1947485 1595486 1867037 2060143 1897149 1703778 1754370
16902 1754370 2034007 1657799 1719899 1911970 1871189 1833509 1697790 1882395 1878922 1744431
16892 1744431 1975206 1900370 2302388 1716723 2116768 1964734 2112499 2099525 2053848 2090169
16882 2090169 1882706 2341430 2354548 2566704 2533488 2359556 2496998 2455922 2381598 2541248
16872 2541248 2610424 2450187 2369999 2427541 2825476 2323542 2775069 2681566 2693361 3044653
16862 3044653 2784342 3045748 2990818 3163740 2820510 2994361 3120896 3543209 3357306 3456926
$$ packed form
16932A563727k99418N1224M7420R0024l9412k31353J72353J51515J26020l37903
16922A294197J32996l50086O07754m4414J93638l35346K29923r161j34640k4503
16912A560358j3426L03670k82926L79809l51999K71551J93106j62994j93371N0592
16902A754370K79637l76208O2100J92071m0781l7680j35719J84605l473j34491
16892A744431K30775p4836M02018n85665M00045j52034J47765j2974m5677L6321
16882B090169k07463M58724J3118K12156l3216j73932J37442m1076p4324J59650
16872B541248O9176j60237q0188N7542L97935n01934M51527r3503J1795L51292
16862C044653k60311K61406n4930J72922l43230J73851J26535M22313j85903R9620
$$ plain form
16852 3456926 3644875 3231790 3311393 3611223 3444429 3603340 4144482 3703356 3670890 3918277
16842 3918277 3888897 4104232 3765725 4317881 4179045 4308136 3788258 4436413 4371699 4183497
16832 4183497 4639498 4539996 4602864 4848755 4701966 4497246 4992009 5250457 5269120 5142364
16822 5142364 5648722 5706220 5603425 5656130 5813582 5773035 6005688 5877624 6115651 6675686
16812 6675686 6529611 6575558 6594523 6829954 7001861 6936144 7135935 7935979 7783203 7822013
16802 7822013 8217299 7946822 8164646 8099480 8618139 8593497 9290222 9594078 9497302 9576833
16792 9576833 9895475 10143165 10296339 10628158 11016821 11281492 11436645 11882962 12153529
16783 12153529 12246635 12639147 13073813 13420397 13637433 14184451 14482445 14884841 15678922
$$ packed form
16852C456926J87949m13085P9603K99830j66794J58911N41142m41126l2466K47387
16842C918277k9380K15335l38507N52156j38836J29091n19878O48155o4714j88202
16832D183497M56001r9502O2868K45891j46789k04720M94763K58448J8663j26756
16822E142364N06358N7498j02795N2705J57452m0547K32653j28064K38027N60035
16812F675686j46075M5947J8965K35431J71907o5717J99791Q00044j52776L8810
16802G822013L95286k70477K17824o5166N18659k4642O96725L03856r6776P9531
16792I576833L18642K47690J53174L31819L88663K64671J55153M46317K70567
16783A2153529R3106L92512M34666L46584K17036N47018K97994M02396P94081
$$ plain form
16774 15678922 15771176 16301166 17269675 17756909 18109036 18740168 19243066 19985495 20659284
16765 20659284 21335929 22130597 23387693 23753842 24630883 25679635 26634162 27452470 29127155
16756 29127155 30214500 31165864 32632701 33730036 35151102 36675061 38289653 39883251
16748 39883251 42067369 43839154 46246482 48441343 50305298 53248776 55710283 58666849
16740 58666849 61400400 64967073 68243954 71744945 75764427 79593153 83992560 88671334
16732 88671334 93386182 98886921 104124513 109574968 115473878 120995116 126997194 132791439
16724 132791439 138590486 144505205 149905152 154940204 160126574 163839549 167359612 169918912
16716 169918912 172186726 172639232 173002229 171853470 169983169 167245119 163696267 159541904
$$ packed form
16774A5678922R2254N29990R68509M87234L52127O31132N02898P42429O73789
16765B0659284O76645P94668J257096L66149Q77041J048752R54527Q18308J674685
16756B9127155J087345R51364J466837J097335J421066J523959J614592J593598
16748C9883251K184118J771785K407328K194861J863955K943478K461507K956566
16740E8666849K733551L566673L276881L500991M019482L828726M399407M678774
16732H8671334M714848N500739N237592N450455N898910N521238O002078N794245
16724A32791439N799047N914719N399947N035052N186370L712975L520063K559300
16716A69918912K267814M52506L62997j148759j870301k738050l548852m154363
$$ plain form
16708 159541904 154463899 149487016 144055917 137838535 131837594 125957215 119995689 114094318
16700 114094318 108303555 102761276 97180707 92529416 87877701 82811889 78635217 74037254
16692 74037254 70573291 66985128 63555652 60029579 56902669 54055159 51782673 48792340
16684 48792340 46769383 44498873 42451720 40235403 38458079 36884123 35209845 33874348
16676 33874348 32359222 31018864 29881434 28495631 27178946 26114580 25447672 24308871
16668 24308871 23592610 22355796 21474479 21157366 20015058 19379036 18704349 18391792 17630136
16659 17630136 16863754 16632347 16152687 15609811 14785076 14583502 13888105 13593129 13083728
16650 13083728 12902850 12351233 12231015 11651711 11353278 11013714 10515252 10588534 10312615
$$ packed form
16708A59541904n078005m976883n431099o217382o000941n880379n961526n901371
16700A14094318n790763n542279n580569m651291m651715n065812m176672m597963
16692G4037254l463963l588163l429476l526073l126910k847510k272486k990333
16684D8792340k022957k270510k047153k216317j777324j573956j674278j335497
16676C3874348j515126j340358j137430j385803j316685j064366o66908j138801
16668B4308871p16261j236814q81317l17113j142308o36022o74687l12557p61656
16659A7630136p66382k31407m79660n42876q24735k01574o95397k94976n09401
16650A3083728j80878n51617j20218n79304k98433l39564m98462P3282k75919
$$ plain form
16641 10312615 9670849 9615758 9263901 9010384 8761162 8653684 8555288 8243427 8333393 7899348
16631 7899348 7372739 7438923 7010054 7108531 6950649 6869218 6741820 6638667 6326654 6006268
16621 6006268 6030378 6099399 6258266 5728405 5151855 5348003 5359507 5085191 5364085 5178968
16611 5178968 5049190 4646229 4869407 4742912 4407978 4329996 4584026 4347120 4520060 4298623
16601 4298623 4290754 3686722 3684287 3952801 3759003 3761998 3522539 3542751 3545651 3462885 3429781
16590 3429781 3263522 3198451 3402431 3132945 3028836 2818131 2868358 3140978 2970890 2886393
16580 2886393 2862064 2669712 2580285 2578589 2780488 2620354 2666626 2813134 2390236 2880580
16570 2880580 2329377 2369338 2354804 2413821 2342305 2318133 2629450 2231428 2077641 2223969
$$ packed form
16641A0312615o41766n5091l51857k53517k49222j07478r8396l11861Q9966m34045
16631G899348n26609O6184m28869R8477j57882q1431j27398j03153l12013l20386
16621F006268K4110O9021J58867n29861n76550J96148J1504k74316K78894j85117
16611E178968j29778m02961K23178j26495l34934p7982K54030k36906J72940k21437
16601D298623p869o04032k435K68514j93798K995k39459K0212K900q2766l3104
16590C429781j66259o5071K03980k69486j04109k10705N0227K72620j70088q4497
16580B886393k4329j92352q9427j696K01899j60134M6272J46508m22898M90344
16570B880580n51203L9961j4534N9017p1516k4172L11317l98022j53787J46328
$$ plain form
16560 2223969 2153016 2161397 1832217 2282373 2153803 2144727 1895711 2161156 2002172 1905461
16550 1905461 1918096 1811692 1714452 1984582 1466961 2045148 1625802 1752586 1781882 1854555
16540 1854555 1766811 1568348 1639424 1491498 1274672 1472854 1561814 1681266 1709026 1409391
16530 1409391 1180716 1331489 1236485 1522073 1304961 1522675 1630620 1303674 1433494 1112085
16520 1112085 1476372 1380135 1379881 1257566 1456137 1348798 1303782 968552 1335144 1334172 1337143
16509 1337143 1068456 1258765 1377140 760029 1192163 1613403 1170460 1185790 1213682 1082534
16499 1082534 1045235 1197707 1176744 1107003 1023408 949601 413133 879303 884562 913423 1050894
16488 1050894 897132 1051798 828088 856755 805528 697117 668965 588160 982511 466263
$$ packed form
16560B223969p0953Q381l29180M50156j28570r076k49016K65445j58984r6711
16550A905461J2635j06404r7240K70130n17621N78187m19346J26784K9296P2673
16540A854555q7744j98463P1076j47926k16826J98182Q8960J19452K7760k99635
16530A409391k28675J50773r5004K85588k17112K17714J07945l26946J29820l21409
16520A112085L64287r6237k54j22315J98571j07339m5016l35230L66592r72K971
16509A337143k68687J90309J18375o17111M32134M21240m42943J5330K7892j31148
16499A082534l7299J52472k0963o9741q3595p3807D13133M66170N259K8861J37471
16488A050894j53762J54666k23710K8667n1227j08411k8152q0805L94351D66263
$$ plain form
16477 727496 971895 1018793 846468 970340 732405 770664 609028 488752 866891 422256
16466 744494 823551 812090 778672 515338 575404 848250 601380 579264 744571 490773
16456 490773 532880 536738 437448 626899 686115 407858 917451 795806 727693 748340 500275
16445 500275 1000721 803418 682302 647428 494818 782092 388707 669117 604565 969645
16435 969645 346697 315257 426635 904007 667580 128490 659889 732819 473436 233090
16424 496087 435573 889253 612414 481444 596557 572352 462363 511600 506323 570180 267991
16412 117461 389323 424721 340155 460753 442155 534730 293895 491950 466024 226603
16401 508499 228391 317535 426864 254977 476036 502841 281378 213761 152980 803752
$$ packed form
16477G27496K44399M6898j72325J23872k37935L8259j61636j20276L78139D22256
16466G44494P9057j1461l3418k63334O0066K72846k46870k2116J65307k53798
16456D90773M2107L858r9290J89451N9216k78257N09593j21645o8113K0647k48065
16445E00275N00446j97303j21116l4874j52610K87274C88707K80410o4552L65080
16435I69645C46697l1440J11378M77372k36427A28490N31399P2930k59383B33090
16424D96087o0514M53680k76839j30970J15113k4205j09989M9237n277O3857B67991
16412A17461K71862L5398q4566J20598j8598R2575k40835J98055k5926B26603
16401E08499B28391Q9144J09329j71887K21059K6805k21463o7617o0781O50772
$$ plain form
16391 803752 463005 308784 261903 319566 276272 294271 42991 136948 338417 492807 226203
16379 469337 499199 382598 390234 4329 312389 488013 513657 569970 70131 279309 220268
16368 220268 290221 414583 128874 382645 349900 326766 19604 582203 574852 -25639 382116
16356 328907 329074 -77285 448954 534327 329603 441606 173288 285812 455952 571622
16346 571622 167331 225018 234046 -92202 273689 389351 167083 279093 127369 -19044
16335 324134 417704 504316 162053 331999 107726 177793 326037 376887 157404 119880
16325 119880 413593 42103 190414 774565 10920 349233 194533 21968 370924 341941
16315 341941 431777 156730 302943 -36789 328806 381045 62008 249090 37787 103842 406786
$$ packed form
16391H03752l40747j54221m6881N7663m3294J7999D2991R3957K01469J54390B26203
16379D69337K9862j16601P636D329L08060J75624K5644N6313G0131K09178n9041
16368B20268O9953J24362A28874K53771l2745k3134A9604N62599p351b5639C82116
16356C28907J67g7285D48954Q5373k04724J12003A73288J12524J70140J15670
16346E71622A67331N7687R028i2202B73689J15662A67083J12010A27369a9044
16335C24134R3570Q6612A62053J69946A07726P0067J48244N0850A57404l7524
16325A19880K93713D2103J48311N84151A0920L38313j54700B1968L48956k8983
16315C41941Q9836A56730J46213c6789C28806N2239F2008J87082C7787O6055L02944
$$ plain form
16304 406786 204728 222670 286163 427186 95205 112550 270067 321670 -125196 198434
16293 165921 163032 -78459 -63870 261011 41403 177186 202409 173843 -74413 35666 38285
16282 38285 127393 5776 10081 -97284 265804 193109 -37116 130606 153184 323024 -32977
16270 72119 56572 5850 149671 406825 294657 -36748 147169 131595 -326700 172194 150807
16259 150807 325281 205278 -70209 262952 227539 18519 181531 276404 -38026 38066 143930
16248 143930 271699 250031 87594 262883 24689 136798 267748 500439 -231773 -222652
16238 -222652 -110894 -32704 173912 60275 -34275 322076 311661 243209 -94110 66064 168239
16227 168239 -138091 -47989 297368 259328 511804 -265608 32175 278137 -119872 -74537
$$ packed form
16304D06786k02058J7942O3493J41023I5205J7345J57517N1603a25196A98434
16293A65921k889g8459J4589B61011D1403J35783K5223k8566g4413C5666K619
16282C8285Q9108E776M305i7284B65804p2695c7116A30606K2578J69840c2977
16270G2119j5547E850J43821K57154j12168c6748A47169j5574c26700A72194k1387
16259A50807J74474j20003g0209B62952l5413A8519J63012R4873c8026C8066J05864
16248A43930J27769k1668H7594J75289B4689J12109J30950K32691b31773R121
16238b22652a10894c2704A73912F0275c4275C22076j0415o8452i4110F6064J02175
16227A68239a38091d7989B97368l8040K52476b65608C2175K45962a19872M5335
$$ plain form
16217 -74537 168164 189978 208210 58608 393258 -23206 19182 169719 232858 126017 -28988
16205 -112171 299594 184761 437853 248791 90779 146837 31394 326059 174648 -49928
16194 98057 299222 127779 13871 2988 177557 444217 -210822 87772 201809 82170 287637
16183 287637 556060 -198342 185199 219696 -92917 10849 -51524 -161570 -14640 131788
16172 47535 -221459 -129040 67738 62691 15411 120351 25598 8929 -70820 -125945 154182
16160 -165868 175052 -45642 -263273 -28559 146091 -29754 364643 110360 -220073 32946
16149 -180299 23403 199053 6098 83339 380863 34723 -317497 333780 340611 -80933 -59139
16138 -59139 -70246 -8923 271020 -120814 -273011 -205756 -71803 245753 -211554 284820 -77402
$$ packed form
16217g4537A68164K1814J8232E8608L34650b3206A9182J50537O3139j06841b8988
16205a12171B99594j14833K53092j89062I0779N6058C1394K94665j51411d9928
16194I8057K01165A27779A3871B988J74569K66660b10822H7772J14037H2170K05467
16183B87637K68423a98342A85199L4497i2917A0849e1524j10046a4640A31788
16172D7535b21459R2419F7738n047A5411J04940B5598H929g0820n5125A54182
16160a65868A75052d5642k17631b8559A46091b9754C64643A10360b20073C2946
16149a80299B3403J75650F098P7241K97524C4723c17497C33780O831h0933K1794
16138e9139j1107h923B71020a20814j52197O7255g1803B45753b11554B84820g7402
$$ plain form
16126 -73171 268551 110376 -264908 175989 122096 42889 -18968 -25582 -172779 114308 67629
16115 67629 -23698 -100921 -21075 20106 -56055 27519 -172160 -198264 386507 100299 155869
16104 155869 128890 34959 -43794 229956 98921 169211 41811 96049 113006 -135782 72660
16092 -98722 177687 -67796 -341706 -31739 145153 113562 -395368 45351 279595 -73737 -1220
16080 83010 83200 100827 68503 -80606 -4084 179307 -186215 92837 -63041 -3198 -174731 -93162
16068 -93162 -100311 -29526 229160 -113578 253913 167547 244483 86225 220401 173971 122313
16057 122313 -55464 -119732 -203404 276261 145569 -121851 67292 -43523 -51411 171321 75430
16045 -29998 -282725 -127654 -128225 -114903 32394 -68088 116403 209133 -272573 -227047 -143862
$$ packed form
16126g3171B68551A10376b64908A75989n3893D2889a8968o614j47197A14308m6679
16115F7629b3698p7223b1075B0106e6055B7519a72160k6104C86507A00299N5570
16104A55869k6979C4959d3794B29956I8921P0290D1811N4238J6957a35782G2660
16092i8722A77687f7796k73910c1739A45153l1591c95368D5351K34244g3737a220
16080H3010J90J7627l2324h0606d084A79307a86215I2837f3041c198j71533Q1569
16068i3162p149b9526B29160a13578B53913q6366P6936H6225J34176m6430n1658
16057A22313e5464o4268q3672B76261j30692a21851F7292d3523p888A71321G5430
16045b9998k52727a27654n71J3322C2394f8088A16403R2730b72573M5526Q3185
$$ plain form
16034 -143862 180440 -4053 -71746 370657 -16451 135549 80776 152117 216251 -7480 -299234
16023 -299234 29046 247738 -78119 180176 -96997 14821 31984 -183249 -50523 20002 17357
16012 17357 206809 -240162 -29900 31593 150694 -100314 128766 -146574 -277378 -146414
16002 -146414 1829 102950 84267 -167321 -25422 183857 -83172 -159178 50964 70474 -63859
15990 281010 -94424 177668 75744 453231 141669 -38000 307552 222120 320181 212346
15980 212346 539838 411773 -102034 369694 3225 -329532 -33646 -65692 -148073 28674 8658
15968 301095 328559 426246 331559 -37027 42642 -163004 133627 133192 -372898 -127398 -317601
15957 -317601 -14281 360655 -91346 -293187 140346 -173069 -134411 1935 -83796 28746 -355261
$$ packed form
16034a43862A80440d053o7693C70657a6451A35549n4773P1341O4134g480k91754
16023b99234B9046K18692g8119A80176i6997A4821J7163a83249e0523B0002k645
16012A7357J89452b40162b9900C1593J19101a00314A28766a46574j30804J30964
16002a46414A829J01121j8683a67321b5422A83857h3172p6006E0964J9510f3859
15990B81010i4424A77668G5744L77487A41669c8000C07552q5432R8061j07835
15980B12346L27492j28065a02034C69694C225c29532c3646l2046q2381B8674H658
15968C01095K7464R7687r4687c7027D2642a63004A33627m35c72898a27398j90203
15957c17601a4281C60655i1346k01841A40346a73069L8658A935h3796B8746c55261
$$ plain form
15945 -2215 -231925 -60113 89208 -10100 208303 82274 -33185 -217011 -51682 33659 -118867
15933 -28321 -227295 -150234 -25843 -23247 40995 -6463 -131578 44898 17423 -250321 -216218
15922 -216218 -60094 -272830 -66105 -82478 -15093 -268103 -91090 98127 -103645 -226243 -175912
15911 -175912 -39412 57984 51785 105745 25044 -248390 2578 -207428 -148263 -223323 408037
15899 -171647 152009 -204544 -292537 -225423 126375 -117761 31737 20310 -10437 -202089
15889 -202089 155217 -31527 -159881 204496 364377 -277436 -95911 -31564 -390778 -364914
15879 -364914 -44630 -55577 -374464 -157636 -358447 205575 -214497 316217 -267179 -195060
15869 -195060 55791 131740 51026 -168019 -250312 183302 71448 -135356 60474 -182838 28339
$$ packed form
15945b215k29710f0113H9208a0100B08303H2274c3185j83826e1682C3659a18867
15933b8321j98974P7061b5843K596D0995f463j25115D4898A7423b50321L4103
15922b16218f0094k12736f6105j6373a5093k53010i1090I8127a03645j22598N0331
15911a75912c9412E7984o199N3960B5044b48390B578b07428N9165p5060D08037
15899a71647A52009b04544q7993O7114A26375a17761C1737j1427a0437j91652
15889b02089A55217c1527j28354B04496J59881b77436i5911c1564l59214K5864
15879c64914d4630j0947l18887a57636k00811B05575b14497C16217b67179P2119
15869a95060E5791P5949E1026a68019q2293A83302G1448a35356F0474a82838B8339
$$ plain form
15857 136103 286309 -2122 245093 366601 131342 195165 37154 -91759 61216 178512 113335
15846 113335 -55772 -89925 -330335 -53787 254685 -193388 -32059 77929 -17099 357106 130332
15834 -156267 117850 -17174 -165892 79615 -62743 -19507 27619 110762 6893 -228745 -154846
15823 -154846 -335364 -147449 -200077 42824 -81104 18854 -155457 164066 -49912 -73028 -247391
15812 -247391 111260 -290534 -80038 157747 88836 160120 -3636 -303623 192217 -38161 66979
15800 -102692 88730 -49380 271864 208200 -130601 32139 59688 127012 -79053 -197576 166769
15788 341784 -118192 -21192 2526 -192676 -113772 -35217 -89415 -15854 108827 286360 -340572
15776 61204 16916 -301683 -70624 -132918 -307545 146880 -330873 351496 193234 -66307
$$ packed form
15857A36103J50206b122B45093J21508A31342O3823C7154i1759F1216J17296o5177
15846A13335e5772l4153k40410e3787B54685a93388c2059G7929a7099C57106A30332
15834a56267A17850a7174j48718G9615f2743a9507B7619Q3143F893b28745P3899
15823a54846j80518a47449n2628D2824h1104A8854a55457A64066d9912k3116j74363
15812b47391A11260b90534h0038A57747o8911P1284c636k99987A92217c8161F6979
15800a02692H8730d9380B71864o3664a30601C2139K7549O7324g9053j18523A66769
15788C41784a18192b1192B526a92676P8904c5217n4198a5854A08827J77533c40572
15776F1204A6916c01683g0624o2294j74627A46880c30873C51496j58262f6307
$$ plain form
15765 245963 -72294 -20676 60985 -80505 168985 12980 109502 315799 458333 -7800 -70357
15754 -70357 19752 234772 264993 139361 3832 251033 47054 161223 -39002 -154994 57293
15742 -106784 -56832 30909 93107 208552 266467 -295231 -380125 235264 91109 -165243 -135632
15731 -135632 -19262 -221169 -231897 -44738 -127252 41063 93324 -27102 -12110 288224 -47635
15719 155045 135436 24900 183840 -32352 55966 47804 148432 -200570 -44696 10910 134333
15708 134333 -184739 157136 225517 -401907 -15871 -173519 177557 -157028 88793 -53642
15697 -383279 80386 230882 -124599 -54698 31345 -59348 358759 -74202 264493 48384 -188855
15685 -440274 76145 -567529 215435 -56159 -29023 -37650 128871 -46910 -19798 -85021 140795
$$ packed form
15765B45963g2294b0676F0985h0505A68985A2980R6522K06297J42534g800o2557
15754g0357A9752K15020L0221j25632C832K47201D7054J14169c9002j15992E7293
15742a06784M9952C0909O2198J15445N7915b95231q4894B35264I1109a65243K9611
15731a35632a9262k01907j0728d4738q2514D1063N2261b7102a2110B88224d7635
15719A55045j9609B4900J58940c2352E5966q162J00628b00570d4696A0910J23423
15708A34333a84739A57136O8381d01907a5871j57648A77557a57028H8793e3642
15697c83279H0386J50496a24599e4698C1345e9348C58759g4202B64493D8384a88855
15685d40274G6145e67529B15435e6159K7136q627A28871d6910a9798o5223A40795
$$ plain form
15673 443578 -68643 -78412 -36668 -361966 -43075 81414 102217 61856 -30585 -260723 -284600
15662 -284600 115564 160524 -6478 -48316 221304 -244142 -294347 58382 -28581 220328 -78975
15650 171238 -254190 107196 83602 -94270 -64251 235476 -424111 -75059 -164884 123272
15639 -205943 -40620 51773 -127473 -139191 435419 -224865 -51881 -384315 -5458 202093 68436
15627 98590 5498 -118842 -85706 -168872 -194929 -220038 91300 -98580 -72904 5530 -110168 -202378
15615 -202378 297228 -86196 -294903 236703 313260 -237530 -224953 -219445 88488 9562 -1650
15603 -30995 -41479 508969 -50659 79126 -264014 -323083 120525 -14667 -12350 116049 -82231
15591 -114066 9753 -49669 11242 244865 -288267 -44853 141050 170552 275603 457033 242318
$$ packed form
15673D43578f8643r769c6668l25298d3075H1414K0803m0361c0585k30138k3877
15662b84600A15564M4960f478m1838B21304b44142n0205E8382b8581B20328g8975
15650A71238b54190A07196k3594i4270L0019B35476d24111g5059q9825A23272
15639b05943d0620E1773a27473j1718D35419b24865e1881l32434e458B02093F8436
15627I8590E498a18842L3136q3166k6057k5109I1300i8580K5676E530a10168r2210
15615b02378B97228h6196k08707B36703P6557b37530J2577N508H8488I562a650
15603c0995j0484E08969e0659G9126b64014n9069A20525a4667K317A16049h2231
15591a14066I753d9669A1242K33623b88267d4853A41050K9502J05051J81430k14715
$$ plain form
15580 242318 208545 128345 136399 47394 -237514 -285323 91215 -96979 146363 -199068 227720
15568 157935 -367066 49424 190006 165298 203392 -186258 376483 -42221 -158631 -174329
15558 -174329 251792 167140 6436 14170 192382 107227 48960 -31286 208204 -284827 117857
15546 -295320 30321 83338 -135882 -216418 -8760 -184229 -80174 40677 -324289 37499 240877
15535 240877 -167694 24420 -297122 -117046 144951 -268440 50524 5665 10818 -124297 -55607
15523 -130236 245648 17167 192919 -54022 344713 49830 -37278 8266 -262094 -39766 -86173
15512 -86173 455391 250102 258865 -59681 -74997 2786 -1346 -169790 -217535 -119125 -79034 92030
15499 146931 -196353 76606 -274448 35530 -35579 162448 137060 258580 -135566 -90428
$$ packed form
15580B42318l3773q0200Q054D7394b37514m7809I1215i6979A46363a99068B27720
15568A57935c67066D9424J40582k4708L8094a86258C76483d2221j16410j5698
15558a74329B51792q4652F436P734J78212q5155D8960c1286B08204b84827A17857
15546b95320C0321N3017a35882q0536h760j75469h0174D0677c24289C7499K03378
15535B40877a67694B4420b97122a17046A44951b68440E0524E665N153a24297e5607
15523a30236B45648A7167J75752e4022C44713D9830c7278H266b62094c9766m6407
15512h6173D55391k05289Q763e9681j5316B786a346j68444m7745R8410M0091I2030
15499A46931a96353G6606b74448C5530c5579A62448k5388J21520a35566M5138
$$ plain form
15489 -90428 -431746 -673 -184253 -139022 59930 12947 -59176 143802 -244792 -14565 415125
15477 -173695 -25819 264002 326863 -190887 88474 -164051 179824 -148797 -142836 20438 -149344
15465 -316860 -50265 173527 13613 74533 211952 100788 -25850 276165 125718 142208
15455 142208 151652 164180 99628 41037 -30997 114521 191881 -104173 -11539 199149 -68375
15443 86067 -181649 -93692 -275919 -224826 215431 138778 -63567 -127106 -428911 53710 116795
15432 116795 146636 71521 -89714 -83653 -153918 21278 184001 79248 -159441 -196006 48979
15420 97525 -245766 132684 25837 -348510 -31468 -53601 -3135 28917 -12115 68486 165688
15409 165688 9497 89972 -199498 162470 237500 -129381 10169 81657 197517 -343295 -89509
$$ packed form
15489i0428l41318f73j83580M5231E9930A2947e9176A43802b44792a4565D15125
15477a73695b5819B64002O2861a90887H8474a64051A79824a48797N961B0438a49344
15465c16860e0265A73527A3613O0920J37419A00788b5850B76165A25718J6490
15455A42208R444J2528o4552D1037c0997A14521P7360a04173a1539A99149f8375
15443H6067a81649Q7957j82227N1093B15431p6653f3567o3539l01805E3710O3085
15432A16795K9841G1521h9714O061p0265B1278J62723G9248a59441l6565D8979
15420I7525b45766A32684B5837c48510c1468k2133c135B8917a2115F8486R7202
15409A65688I497Q0475a99498A62470P5030a29381A0169P1488J15860c43295h9509
$$ plain form
15397 -375571 -40989 -365683 -182162 309227 -302203 -81102 107154 17273 -367545 130754
15386 143248 88380 -102844 -42205 13482 -162021 37370 -194080 112538 -114342 -292436
15376 -292436 95013 129358 42094 -85182 -141420 81202 382142 -37183 97218 -93704 74795
15364 69214 -4983 -56019 15365 -130280 189770 194555 -1003 -164887 125302 -15373 -206308
15353 -206308 172811 39453 9624 103014 224470 -97354 -26552 78675 -350169 135821 6027
15341 81530 122321 -143446 -8560 284660 -76541 -216429 -5877 -1230 -140389 -100367 104954
15329 32932 212258 -100398 170064 -43361 -180401 311791 -92357 -215773 30531 8792 101118
15318 101118 7837 207238 68882 168696 -31430 254033 171138 -82693 29713 -95434 143471
$$ packed form
15397c75571d0989l24694a82162C09227c02203h1102A07154A7273c67545A30754
15386A43248n4868a02844d2205A3482a62021C7370a94080A12538a14342j78094
15376b92436I5013L4345D2094h5182n6238H1202L00940c7183I7218i3704G4795
15364F9214d983n1036A5365a30280A89770M785a003j63884A25302a5373j90935
15353b06308A72811C9453I624R3390J21456i7354b6552G8675c50169A35821F027
15341H1530M0791a43446h560B84660g6541j39888e877a230j39159M0022A04954
15329C2932J79326a00398A70064d3361j37040C11791i2357j23416C0531H792R2326
15318A01118G837J99401F8882R9814c1430B54033q2895h2693B9713i5434A43471
$$ plain form
15306 -251510 28032 -291151 -105257 148163 -11276 140607 201975 -127360 191658 87072
15295 -4339 153778 328487 -145421 -332740 461248 -52362 111286 -267219 -280570 -7880 32935
15283 150654 52637 61286 31873 -408878 26287 54011 12549 170334 -221772 -77393 -30374
15271 238112 -57613 -4321 296735 -9544 -96163 118313 -6020 284035 181359 169343 -108986
15259 -4723 -417857 219713 199162 32106 32845 64381 -77598 78569 160529 375048 658417
15248 658417 1394318 1540576 1393441 1043979 510373 739965 454606 121269 93571 274803
15238 274803 -359629 -2923 -124856 63495 -344459 18399 63082 -178673 19323 -202163 -206121
15227 -206121 206277 165897 -31359 430183 -63415 -10182 287753 -47965 -88518 145941 -130019
$$ packed form
15306b51510B8032b91151a05257A48163a1276A40607O1368a27360A91658H7072
15295d339A53778J74709a45421j87319D61248e2362A11286b67219j3351g880C2935
15283A50654E2637Q649k9413d08878B6287K7724A2549J57785b21772g7393c0374
15271B38112e7613d321B96735i544q6619A18313f020B84035j02676j2016a08986
15259d723m13134B19713k0551C2106P39L1536g7598G8569Q1960K14519K83369
15248F58417P35901J46258j47135l49462E10373K29592k85359A21269k7698J81232
15238B74803c59629b923j21933F3495c44459A8399M4683a78673A9323b02163l958
15227b06121B06277m0380c1359D30183f3415a0182B87753d7965m0553A45941a30019
$$ plain form
15215 66364 -2777 -65332 20989 37478 357905 -207128 22495 -149801 149526 281794 -119162
15203 411616 -59499 -109367 -140846 28298 -52609 57639 -18600 281608 -143347 207788 266188
15192 266188 86032 426531 32919 157462 -3334 172552 184043 86791 261520 173665 465058
15181 465058 6744 218786 201494 118281 269765 98935 136755 -125272 92351 171942 188301
15170 188301 -292690 301422 272557 -9880 309733 320525 -12408 252607 -136711 113304
15159 -60059 -5723 130304 -137046 -35063 256407 -139742 -72188 499191 55154 148519 214658
15148 214658 95391 -62076 316586 326566 -153529 274473 11390 142971 -233964 -98538 -26503
15136 -43588 -73949 391318 -142965 277433 265331 -105212 294860 167985 119915 -184357
$$ packed form
15215F6364b777o2555B0989J6489L20427b07128B2495a49801A49526J32268a19162
15203D11616e9499m9868l1479B8298e2609E7639a8600B81608a43347B07788N8400
15192B66188H6032L40499C2919J24543c334A72552J1491H6791J74729q7855K91393
15181D65058F744K12042j7292q3213J51484I8935L7820a25272I2351P9591J6359
15170A88301b92690C01422k8865i880C09733J0792a2408B52607a36711A13304
15159f0059e723A30304a37046c5063B56407a39742O7554D99191E5154R3365O6139
15148B14658I5391f2076C16586R980a53529B74473A1390J31581b33964i8538b6503
15136d3588l0361C91318a42965B77433j2102a05212B94860j26875m8070a84357
$$ plain form
15125 240709 107968 172157 -97020 343201 127417 421065 4991 57582 272218 125228
15114 51862 104941 46186 -61206 324670 67299 -28049 272543 120175 100955 -32389 389444
15102 -2168 68114 458361 12987 243620 -12471 78025 -66557 43470 -29655 326479 417820
15091 417820 131528 -154941 151112 -67716 -91797 56845 260374 -120857 157590 23054
15080 365025 304680 308388 413502 330282 -171050 232958 364374 321364 558437 -79738 -3197
15068 42542 10057 -158396 71831 -136506 530861 -83017 107625 111693 16323 83817 145641
15057 145641 313546 180867 488993 188285 158873 183699 239454 18891 151840 -10955
15046 118399 313839 -69988 23728 301692 215897 157221 -149327 264172 251273 33297 301617
$$ packed form
15125B40709A07968O4189i7020C43201A27417K93648D991N2591K14636A25228
15114E1862N3079D6186f1206C24670F7299b8049B72543A20175j9220c2389C89444
15102b168F8114L90247A2987K30633a2471G8025f6557D3470b9655C26479R1341
15091D17820A31528a54941A51112f7716k4081E6845K03529a20857A57590B3054
15080C65025o0345L708J05114q3220a71050B32958J31416m3010K37073g9738c197
15068D2542A0057a58396G1831a36506E30861h3017A07625M068A6323O7494O1824
15057A45641J67905j32679L08126A88285k9412K4826N5755A8891J32949a0955
15046A18399J95440f9988B3728K77964q5795n8676a49327B64172j2899C3297K68320
$$ plain form
15035 301617 13056 32541 404822 198669 408846 399715 -158945 44591 24323 185402 -85990
15023 4730 457626 -1617 246687 99951 517260 94252 27187 158926 166494 402477 376954
15012 376954 161422 62741 302873 125967 -13030 47955 184635 96382 145615 154340 117818
15001 117818 147403 164652 -69555 412053 307866 403450 304245 107343 26669 60832 111180
14990 111180 369772 -68243 152214 111065 125837 154313 543866 133011 439649 318973
14980 318973 -5626 303159 241880 74673 374767 224125 48617 -23495 21168 205369 492277
14969 492277 547623 152815 466583 -159117 256197 -55522 18829 27485 256165 29341 -13148
14957 293013 427493 547745 281792 403957 393321 -22950 127091 133249 158405 132253 534595
$$ packed form
15035C01617A3056J9485L72281A98669K10177r131a58945D4591k0268J61079h5990
15023D730M52896a617B46687I9951M17309I4252B7187J31739P568K35983k5523
15012C76954A61422F2741K40132A25967a3030D7955J36680q8253M9233Q725l6522
15001A17818K9585J7249f9555D12053j04187R5584r9205A07343B6669L4163N0348
14990A11180K58592f8243A52214m1149J4772K8476L89553A33011L06638j20676
14980C18973e626C03159o1279G4673L00094j50642D8617b3495B1168J84201K86908
14969D92277N5346A52815L13768a59117B56197e5522A8829Q656K28680B9341a3148
14957B93013J34480J20252k65953J22165j0636b2950A27091O158K5156k6152M02342
$$ plain form
14946 534595 130542 296661 503443 93671 498088 143071 68329 15628 266542 432326
14936 432326 -30492 406535 77906 186287 317646 111378 -78969 267479 169728 -88134
14925 9505 575682 480186 149054 90062 263893 352955 277394 287840 365620 217096 485415
14914 485415 166629 239788 625618 154755 448671 335207 314937 379004 736830 369984
14904 369984 451942 306314 350351 102001 475976 26995 431430 412138 289570 361837
14894 361837 378895 440804 451134 548474 304642 868104 203009 420653 378250 536152
14884 536152 422825 323398 458722 520987 353068 418861 323959 682567 88538 554248
14874 554248 441360 392454 143258 579557 228502 572810 212864 203832 293989 350942
$$ packed form
14946E34595A30542J66119K06782I3671M04417A43071F8329A5628K50914J65784
14936D32326c0492D06535G7906J08381J31359A11378g8969B67479r7751h8134
14925I505N66177r5496A49054n8992J73831Q9062p5561J0446P7780j48524K68319
14914D85415A66629P3159L85830A54755K93916j13464k0270O4067L57826l66846
14904C69984Q1958j45628M4037A02001L73975B6995M04435j9292j22568P2267
14894C61837J7058O1909J0330R7340k43832N63462B03009K17644m2403J57902
14884E36152j13327r9427J35324O2265j67919O5793r4902L58608H8538M65710
14874E54248j12888m8906A43258M36299B28502L44308B12864r032R0157N6953
$$ plain form
14864 350942 87188 304462 232359 223551 388384 486546 506036 471723 323287 121261 394198
14853 394198 444879 145589 94574 99902 128258 441543 292278 515490 243290 634749
14843 634749 476367 313012 739029 170371 423718 597612 530953 335373 195472 530643
14833 530643 312875 535317 512205 377906 447994 157699 285047 657108 229586 411931
14823 411931 424440 441322 625781 62473 393561 181775 216605 635990 518407 232652
14812 805651 459452 370475 245454 195673 358941 497311 355163 547704 586737 385073
14802 385073 467543 439906 543726 699670 341376 83132 628293 673868 399958 544771
14792 544771 815570 817450 335081 169645 411683 213120 658111 371739 385972 480306
$$ packed form
14864C50942H7188K17274p2103q808J64833R8162J9490l4313j48436A21261K72937
14853C94198N0681A45589n1015N328K8356L13285j49265K23212B43290L91459
14843F34749j58382j63355M26017A70371K53347J73894o6659j95580j39901L35171
14833E30643k17768K22442k3112j34299P0088A57699J27348L72061B29586J82345
14823D11931J2509J6882J84459F2473L31088A81775L4830M19385j17583B32652
14812H05651l46199q8977j25021m9781J63268J38370j42148J92541L9033k01664
14802C85073Q2470k7637J03820J55944C41376H3132N45161M5575k73910J44813
14792E44771K70799J880C35081j65436K42038j98563M44991k86372J4233R4334
$$ plain form
14782 480306 194186 461652 799399 677218 549820 293248 531441 632116 532667 597973
14772 597973 331509 714899 580862 824360 489789 516189 455190 655086 589709 484444
14762 484444 614087 557712 528609 528468 682296 461131 827590 823798 639029 324249 420775
14751 420775 636462 563786 439157 139068 659782 1014320 639308 795112 688035 544855
14741 544855 401150 661635 738690 702867 808101 165189 700586 769344 841166 736466
14731 736466 1011459 561600 814057 813400 838308 665885 829492 386296 856082 802661
14721 802661 850869 855720 723632 672717 754694 497145 985837 523512 608515 1058815 717780
14710 717780 1009953 597674 987126 620970 1133295 560689 902080 963926 703777 680719
$$ packed form
14782D80306A94186K67466L37747j22181j27398k56572K38193J00675r9449O5306
14772E97973k66464L83390j34037K43498l34571K6400o0999J99896o5377j05265
14762D84444J29643n6375k9103j41J53828k21165L66459l792j84769l14780R6526
14751D20775K15687p2676j24629A39068N20714L54538l75012J55804j07077j43180
14741E44855j43705K60485P7055l5823J05234A65189N35397O8758P1822j04700
14731G36466K74993m49859K52457o57K4908j72423J63607C86296M69786n3421
14721H02661M8208M851j32088n0915Q1977k57549M88692m62325Q5003M50300l41035
14710G17780K92173m12279L89452l66156N12325E60689L41391O1846k60149k3058
$$ plain form
14700 680719 949739 814218 653887 724248 562200 813328 681343 802156 667224 780864
14690 780864 907202 561558 976059 794529 910035 891908 907242 872261 906681 1171057
14680 1171057 640699 1160346 919917 927766 1101926 1042025 849714 649290 922452 735551
14670 735551 484698 673382 892432 962793 1174385 1142112 903089 1144181 1048175 974266
14660 974266 1142135 1285451 1336415 659146 777897 884126 979215 730081 885310 997268
14650 997268 977130 1163413 734392 826446 1136809 1540541 1234054 1170578 807592 1202968
14640 1202968 995366 1482543 1079132 1348486 1171589 1142693 772466 959012 1506655 1242506
14630 1242506 1139407 1200633 986283 1577433 1225845 1196484 919440 1298765 1273611 1302358
$$ packed form
14700F80719K69020j35521j60331P0361j62048K51128j31985J20813j34932J13640
14690G80864J26338l45644M14501j81530J15506j8127J5334l4981L4420K64376
14680A171057n30358N19647k40429P849J74160n9901j92311k00424K73162j86901
14670G35551k50853J88684K19050P0361K11592l2273k39023K41092r6006p3909
14660I74266J67869J43316N0964F59146J18751J06229R5089k49134J55229J11958
14650I97268k0138J86283m29021R2054L10363M03732l06487o3476l62986L95376
14640A202968k07602M87177m03411K69354j76897k8896l70227J86546N47643k64149
14630A242506j03099O1226k14350N91150l51588k9361k77044L79325k5154K8747
$$ plain form
14620 1302358 978020 1278928 1517433 1413112 1421729 1688280 1524490 1386419 1692714 983090
14610 983090 1529201 1735336 1133676 1650636 1342965 1417103 1428619 1609578 1403102 1483876
14600 1483876 1694847 1528570 1464548 1509134 1718133 1769305 1641225 1625908 1457666 1666560
14590 1666560 1398083 1618553 1696394 1686236 1654356 1627494 1491229 1553872 2209116 1907774
14580 1907774 1972156 1813233 1838346 1894153 2190922 1968396 1918436 1692418 2078157 1776487
14570 1776487 2009142 2310267 2210097 1894489 2201266 1824457 2189505 2304834 2586073
14561 2586073 2366462 2469875 2323780 2711681 2746468 2542831 2483385 2809400 3334228 3738021
14551 3738021 4082083 4929929 6524035 10967112 18886130 37674307 46239755 27178532
$$ packed form
14620A302358l24338L00908K38505j04321Q617K66551j63790j38071L06295p09624
14610I83090N46111K06135o01660N16960l07671P4138J1516J80959k06476Q0774
14600A483876K10971j66277o4022M4586K08999N1172j28080j5317j68242K08894
14590A666560k68477K20470P7841j0158l1880k6862j36265O2643O55244l01342
14580A907774O4382j58923K5113N5807K96769k22526m9960k26018L85739l01670
14570A776487K32655L01125j00170l15608L06777l76809L65048J15329K81239
14561B586073k19611J03413j46095L87901L4787k03637n9446L26015N24828M03793
14551C738021L44062Q47846J594106M443077P919018J8788177Q565448j9061223
$$ plain form
14543 27178532 8843673 3859377 2864864 2172550 1768381 1831181 1853350 2091264 1589963
14534 1589963 1774839 1730699 2026781 1738100 1799777 1767305 2293338 2289486 2074796 2244684
14524 2244684 2288643 2011555 2185512 2307378 2840443 2253572 2373356 2309400 2489628 2725538
14514 2725538 2361999 2445880 2546436 2639237 2753757 2727629 2727050 2361868 2957082 2674533
14504 2674533 2841069 2835826 2817243 2981989 3127636 2787535 2699567 2959174 3081403 3034413
14494 3034413 3053010 2942884 2982985 3267877 3528785 3440881 3632378 3074294 3376093 3104041
14484 3104041 3705063 3424064 3597429 3483673 3527584 3719995 3584191 3567152 3711649 3935298
14474 3935298 3521856 4037996 4350768 3771984 4005308 3949797 3380874 4234265 4425434 4121703
$$ packed form
14543B7178532H843673C859377r94513o92314m04169O2800K2169K37914n01301
14534A589963J84876m4140K96082k88681O1677l2472N26033l852k14690J69888
14524B244684M3959k77088J73957J21866N33065n86871J19784o3956J80228K35910
14514B725538l63539Q3881J00556R2801J14520k6128n79l65182N95214k82549
14504B674533J66536n243j8583J64746J45647l40101q7968K59607J22229m6990
14494C034413J8597j10126M0101K84892K60908q7904J91497n58084L01799k72052
14484C104041O01022k80999J73365j13756M3911J92411j35804j7039J44497K23649
14474C935298m13442N16140L12772n78784K33324n5511n68923Q53391J91169l03731
$$ plain form
14464 4121703 4249146 4371752 4060073 4469988 4612981 4224418 4299656 4455381 4417630 4693651
14454 4693651 4960796 4701432 4856095 4587259 5103964 4904532 5087845 5177795 5167133 5432785
14444 5432785 5430709 4984242 5655681 5627206 5300040 5753709 5849983 6016515 5612523 5928388
14434 5928388 6283841 5992540 6324459 6468767 6474115 6267908 6540564 6553076 6627467 6833866
14424 6833866 7063063 7209878 6970940 7103884 7514058 7559890 7381269 7401344 7596007 7540603
14414 7540603 7613369 8104822 8435913 8136255 8425818 8546520 8762053 8817032 8760891 9211460
14404 9211460 9305750 9313011 9474529 10032299 9797613 10244737 9666461 10405503 10522850 10686701
14394 10686701 10750371 10908401 11094484 11653164 11478179 11521353 11971795 12091279 12323542 12371869
$$ packed form
14464D121703J27443J22606l11679M09915J42993l88563P5238J55725l7751K76021
14454D693651K67145k59364J54663k68836N16705j99432J83313Q9950j0662K65652
14444E432785k076m46467O71439k8475l27166M53669R6274J66532m03992L15865
14434E928388L55453k91301L31919J44308N348k06207K72656J2512P4391K06399
14424F833866K29197J46815k38938J32944M10174M5832j78621K0075J94663n5404
14414G540603P2766M91453L31091k99658K89563J20702K15533N4979n6141M50569
14404I211460R4290P261J61518N57770k34686M47124n78276P39042J17347J63851
14394A0686701O3670J58030J86083N58680j74985M3174M50442J19484K32263M8327
$$ plain form
14384 12371869 12806072 12967380 13545730 13317099 14042525 14208963 14169556 14589612 14715596
14375 14715596 14814786 15510934 15531775 15836269 16369653 16604799 17295679 16818564 17636297 17749406
14365 17749406 18456261 18222299 19202174 19538338 20015985 20610929 20615085 21415985 21724623 22265115
14355 22265115 22963004 23121803 23975789 24501389 24809036 25402461 26236875 26546691 27247811
14346 27247811 28082929 28492990 29716563 30443643 31089133 31976875 32681921 33770548 34618944
14337 34618944 35395214 36656060 37251872 38887166 39818550 40900951 42402996 43784012
14329 43784012 45236511 46629518 47969175 49760262 51331544 53145025 54800161 57057913
14321 57057913 58570898 60951001 63255169 65588581 68038688 70839177 73184794 76197122
$$ packed form
14384A2371869M34203J61308N78350k28631P25426J66438l9407M20056J25984
14375A4715596R9190O96148K0841L04494N33384K35146O90880m77115Q17733J13109
14365A7749406P06855k33962R79875L36164M77647N94944M156Q00900L08638N40492
14355B2265115O97889J58799Q53986N25600L07647N93425Q34414L09816P01120
14346B7247811Q35118M10061J223573P27080O45490Q87742P05046J088627Q48396
14337C4618944P76270J260846N95812J635294R31384J082401J502045J381016
14329D3784012J452499J393007J339657J791087J571282J813481J655136K257752
14321E7057913J512985K380103K304168K333412K450107K800489K345617L012328
$$ plain form
14313 76197122 79447423 82661111 86132468 89763890 93716712 97289729 101909717 106397091
14305 106397091 111450426 116765185 122564975 128469607 134513001 141074252 148373773 155953325
14297 155953325 164054476 172706085 182011809 191723530 202168315 213374332 225152502
14290 225152502 237720232 251012280 264926963 279530647 294614095 310921930 327330674
14283 327330674 344017164 361064499 378576471 395490836 412402243 428122472 442675049
14276 442675049 455772826 467139729 475901671 480961938 480489292 478621153 476398454 473812260
14268 473812260 474766545 468721260 458759672 447350925 433667048 419278338 403703107
14261 403703107 387218562 369783164 352164199 334867123 317830131 301243290 286153094
$$ packed form
14313G6197122L250301L213688L471357L631422L952822L573017M619988M487374
14305A06397091N053335N314759N799790N904632O043394O561251P299521P579552
14297A55953325Q101151Q651609R305724R711721J0444785J1206017J1778170
14290B25152502J2567730J3292048J3914683J4603684J5083448J6307835J6408744
14283C27330674J6686490J7047335J7511972J6914365J6911407J5720229J4552577
14276D42675049J3097777J1366903Q761942N060267m72646j868139k222699k586194
14268D73812260R54285o045285r961588j1408747j3683877j4388710j5575231
14261D03703107j6484545j7435398j7618965j7297076j7036992j6586841j5090196
$$ plain form
14254 286153094 271313387 257256035 243368490 230618513 218487979 206406978 196041845
14247 196041845 185896953 176204443 167423775 159523838 151585795 144216098 136956450 130446416
14239 130446416 124676583 118894554 113968249 108684605 104029033 99442951 94813469 91418778
14231 91418778 87885071 84410870 80881342 77624163 74571295 71342879 68980967 65918562
14223 65918562 64031261 61600050 59604126 57658119 55988664 53500792 51752385 49845717
14215 49845717 48342072 47170810 45983033 44568966 42649921 41234421 40097501 39182085
14207 39182085 38646362 37707916 36566033 35137070 33915563 33026123 31997330 31696979 30857806
14198 30857806 29655326 28874625 28086550 27421748 27086636 26246376 25753228 24762818 24187675
$$ packed form
14254B86153094j4839707j4057352j3887545j2749977j2130534j2081001j0365133
14247A96041845j0144892r692510q780668p899937p938043p369697p259648o510034
14239A30446416n769833n782029m926305n283644m655572m586082m629482l394691
14231I1418778l533707l474201l529528l257179l052868l228416k361912l062405
14223F5918562j887301k431211j995924j946007j669455k487872j748407j906668
14215D9845717j503645j171262j187777j414067j919045j415500j136920r15416
14207C9182085n35723r38446j141883j428963j221507q89440j028793l00351q39173
14198C0857806j202480p80701p88075o64802l35112q40260m93148r90410n75143
$$ plain form
14189 24187675 23321524 22877888 22660742 21854710 21510816 20829405 20357590 19816875 19509435
14180 19509435 19317103 18806019 18306962 18063977 17678648 17425674 17334234 16356727 16123220
14171 16123220 16532543 15313291 15258412 15257336 14677028 14915331 14348106 13885945 13692228 13264037
14161 13264037 12854873 12759525 12709025 12525196 12339442 12280056 11813643 11663810 11320703 11224131
14151 11224131 11115309 10842816 10551439 10544614 10461835 10420454 10187618 9859622 9862022 9761261
14141 9761261 9541230 9521615 9150964 8772799 9041273 8573912 8575466 8664068 8343195 8559790
14131 8559790 8073897 7971730 7766997 8049709 7608465 7773109 7549972 7382032 7527227
14122 7527227 7225678 7475118 6990924 7102802 6800884 6687822 6782949 6673219 6691852 6374309
$$ packed form
14189B4187675q66151m43636k17146q06032l43894o81411m71815n40715l07440
14180A9509435j92332n11084m99057k42985l85329k52974r1440r77507k33507
14171A6123220M09323j219252n4879j076n80308K38303n67225m62161j93717m28191
14161A3264037m09164r5348n0500j83829j85754n9386m66413j49833l43107r6572
14151A1224131j08822k72493k91377o825q2779m1381k32836l27996K400j00761
14141I761261k20031j9615l70651l78165K68474m67361J554Q8602l20873K16595
14131H559790m85893j02167k04733K82712m41244J64644k23137j67940J45195
14122G527227l01549K49440m84194J11878l01918j13062R5127j09730J8633l17543
$$ plain form
14112 6374309 6478910 6487701 6177764 6188131 6141121 5828480 5862104 5565867 5798409 5611642
14102 5611642 5591974 5556103 5389452 5459199 5123698 4869677 5414245 5234449 5225642 4707538
14092 4707538 5215902 4869220 5119859 4829325 4730765 4660890 4854208 4575482 4593830 4345678
14082 4345678 4409225 4589415 4454277 4704925 4464176 4133266 4173386 4435016 4006606 4402368
14072 4402368 4119669 4101460 3976738 4109639 3998658 4065732 3590909 3831015 3813422 3770433
14062 3770433 3464977 3635781 3564929 3745658 3504617 3489001 3436002 3335785 3356203 3177052
14052 3177052 3464482 3249678 3194588 3044551 3241734 3469286 3157718 3068531 3005386 3048538
14042 3048538 2978771 2991323 2972697 3002594 2633454 2755635 2888320 2437620 2606853 2953648
$$ packed form
14112F374309J04601Q791l09937J0367m7010l12641L3624k96237K32542j86767
14102E611642j9668l5871j66651O9747l35501k54021N44568j79796q807n18104
14092D707538N08364l46682K50639k90534r8560o9875J93318k78726J8348k48152
14082D345678O3547J80190j35138K50648k40749l30910M0120K61630m28410L95762
14072D402368k82699j8209j24722J32901j10981O7074m74823K40106j7593m2989
14062C770433l05456J70804p0852J80729k41041j5616n2999j00217K0418j79151
14052C177052K87430k14804n5090j50037J97183K27552l11568q9187o3145M3152
14042C048538o9767J2552j8626K9897l69140J22181J32685m50700J69233L46795
$$ plain form
14032 2953648 3065447 2994818 2724993 2708079 2705915 2783698 2850870 2400342 2579401 2432422
14022 2432422 2624650 2640766 2341542 2232169 2219331 2278080 2728985 2011465 2203824 1965200
14012 1965200 2021951 2207393 2221346 1958937 1922377 2219286 2338519 1649205 1868386 1978009
14002 1978009 2079124 1668450 1517599 1863262 1732960 1781131 1822998 2257930 1702437 1991426
13992 1991426 1838714 2010158 2257861 3139413 5834582 12171722 28577615 45258853
13984 45258853 32661674 13030708 7321049 5594004 4420103 3830337 3591533 2927921
13976 2927921 2514841 2672422 2605738 2365132 2766504 2411393 2491257 1915184 2360006 2365699
13966 2365699 2075107 1903469 1995270 2161712 1890509 2012394 2104274 1870806 2012361 2142391
$$ packed form
14032B953648J11799p0629k69825j6914k164P7783O7172m50528J79059j46979
14022B432422J92228J6116k99224j09373j2838N8749M50905p17520J92359k38624
14012A965200N6751J85442J3953k62409l6560K96909J19233o89314K19181J09623
14002A978009J01115m10674j50851L45663j30302M8171M1867M34932n55493K88989
13992A991426j52712J71444K47703Q81552K695169O337140J6405893J6681238
13984D5258853j2597179A3030708n709659j727045j173901n89766k38804o63612
13976B927921m13080J57581o6684k40606M01372l55111P9864n76073M44822N693
13966B365699k90592j71638R1801J66442k71203J21885R1880k33468J41555J30030
$$ plain form
13956 2142391 1822018 1896433 1658875 1650938 1774950 1735314 1600441 1905587 1482518 1697317
13946 1697317 1676166 1976179 1592048 1644490 1550750 1797317 1389949 1875867 1462889 1689837
13936 1689837 1460027 1527326 1304789 1554535 1593491 1269997 1778880 1644924 1608460 1338544
13926 1338544 1345481 1189515 1279498 1362678 1504931 1602195 1824964 1286171 1165551 1289491
13916 1289491 1663801 1437512 1529633 1589152 1223816 1506970 1447294 1352129 1438561 1407312
13906 1407312 1142873 1397767 1337348 1140388 1119458 1341963 1462378 1441828 1214662 1186384
13896 1186384 1147130 1172512 1154825 1221888 1475214 1236866 1222386 702062 979476 1061640
13886 1061640 921514 1050499 1142299 887169 908848 1019753 959793 849443 1006983 1116551
$$ packed form
13956B142391l20373P4415k37558p937J24012l9636j34873L05146m23069K14799
13946A697317k1151L00013l84131N2442r3740K46567m07368M85918m12978K26948
13936A689837k29810O7299k22537K49746L8956l23494N08883j33956l6464k69916
13926A338544O937j55966Q9983Q3180J42253R7264K22769n38793j20620J23940
13916A289491L74310k26289R2121N9519l65336K83154n9676r5165Q6432l1249
13906A407312k64439K54894o0419j96960k0930K22505J20415k0550k27166k8278
13896A186384l9254K5382j7687O7063K53326k38348j4480n20324K77414Q2164
13886A061640j40126J28985R1800k55130K1679J10905n9960j10350J57540J09568
$$ plain form
13876 1116551 1108984 1603825 1098980 1052935 893795 1005707 947600 896974 1192268 1142497
13866 1142497 1012358 732759 801435 1129468 890832 1107509 809223 1231421 700459 1156787
13856 1156787 790831 657755 1170225 1021992 948066 654423 926929 637839 834338 990721
13846 990721 955295 862469 777341 737806 925530 1179958 936664 1009478 907318 566040
13836 566040 1187875 581390 872571 680810 817700 987030 1039754 1297617 931560 499506
13826 499506 863048 1121854 841983 398165 664321 918536 721420 772388 905034 852401
13816 852401 723463 939335 697044 773917 718791 528454 502045 350729 558642 605898
13806 605898 691873 767199 828653 711460 1002438 640211 871650 759547 472395 998288
$$ packed form
13876A116551p567M94841n04845m6045j59140J11912n8107n0626K95294m9771
13866A142497j30139k79599O8676L28033k38636K16677k98286M22198n30962M56328
13856A156787l65956j33076N12470j48233p3926k93643K72506k89090J96499J56383
13846I90721l5426r2826q5128l9535J87724K54428k43294P2814j02160l41278
13836E66040O21835E81390K91181j91761J36890J69330N2724K57863l66057m32054
13826D99506L63542K58806k79871C98165K66156K54215j97116N0968J32646n2633
13816H52401j28938K15872k42291P6873n5126j90337k6409j51316K07913M7256
13806F05898Q5975P5326O1454j17193K90978l62227K31439j12103k87152N25893
$$ plain form
13796 998288 510850 795134 856361 745737 699182 711679 721389 551991 467375 585925 635025
13785 635025 451463 608992 585771 628281 1067058 476868 1055379 685627 576130 522325
13775 522325 517706 433042 821351 642635 491947 559262 799287 366937 421334 519239 218612
13763 904801 430673 762716 365622 625820 591246 690467 648317 745414 664684 319733
13752 511953 614463 604044 787015 372939 701167 506017 403464 425884 335254 752071
13742 752071 565671 527654 331213 658445 529820 468150 311640 359986 708788 693185
13732 693185 488987 598045 407251 564097 664767 444546 644790 439375 565926 849675
13722 849675 23274 483323 481603 391895 501054 501127 697354 273997 581067 671459 238824
$$ packed form
13796I98288m87438K84284O1227j10624m6555J2497R710j69398q4616J18550M9100
13785F35025j83562J57529k3221M2510M38777D76868N78511l69752j09497n3805
13775E22325m619q4664L88309j78716j50688O7315K40025C66937N4397R7905B18612
13763I04801D30673L32043C65622K60198l4574R9221m2150R7097q0730C19733
13752E11953J02510j0419J82971C72939L28228j95150j02553K2420r0630M16817
13742G52071j86400l8017j96441L27232j28625o1670j56510M8346L48802j5603
13732F93185k04198J09058j90794J56846J00670k20221K00244k05415J26551K83749
13722H49675B3274M60049j720q9708J09159P3J96227B73997L07070R0392B38824
$$ plain form
13710 790179 464864 650644 797503 601150 525766 560532 459778 504512 451596 -14546
13699 472165 465010 147540 324891 667648 295924 616636 657942 471562 321947 496295
13689 496295 364563 363544 382759 283409 418825 495518 457545 321734 719760 386740 386258
13678 386258 434039 636639 421950 401950 304268 402571 396039 453419 797534 362397 621336
13667 621336 549819 237360 443831 413927 484141 151432 511769 358874 411873 414832 577552
13656 577552 199994 342919 332838 164764 516043 317928 349809 237271 455140 436751
13646 436751 347378 186477 419911 256302 265143 243132 213584 171703 358538 258290 287757
13635 287757 331406 480233 86810 532493 276622 84600 353626 95989 233081 527101
$$ packed form
13710G90179l25315J85780J46859j96353p5384L4766j00754M4734n2916a4546
13699D72165p155A47540J77351L42757B95924L20712M1306j86380j49615J74348
13689D96295j31732j019J9215r9350J35416P6693l7973j35811L98026l33020m82
13678C86258M7781K02600k14689k0000r7682R8303o532N7380L44115C62397K58939
13667F21336p1517B37360K06471k9904P0214A51432L60337j52895N2999K959J62720
13656E77552A99994J42925j0081A64764L51279j98115L1881j12538K17869j8389
13646D36751q9373j60901K33434j63609Q841k2011k9548m1881J86835j00248K9467
13635B87757M3649J48827H6810M45683k55871H4600K69026I5989J37092K94020
$$ plain form
13625 527101 274236 -9364 434717 823189 376174 83311 278596 271921 374619 204039
13615 204039 254558 449109 372706 284910 324266 220107 475905 334228 338176 215734 430251
13604 430251 207983 225601 201561 344910 128903 184369 122317 271634 578334 713649
13594 713649 563970 323033 130664 153937 172384 511562 108765 109795 326049 152196
13583 102991 241634 121994 390319 252669 284398 501689 354298 470853 272737 208845
13573 208845 352700 635228 247898 136275 164683 351728 297116 197107 169233 368398
13563 368398 -69010 249674 172750 -47011 224717 258327 278635 285297 405759 116803 107224
13552 107224 656823 498662 438933 202872 136078 195639 239674 355245 282057 -130945
$$ packed form
13625E27101k52865i364D34717L88472C76174H3311J95285o675J02698j70580
13615B04039N0519J94551p6403q7796L9356j04159K55798j41677L948j22442K14517
13604D30251B07983J7618k4040J43349A28903N5466o2052J49317L06700J35315
13594G13649j49679k40937A30664K3273J8447L39178A08765J030K16254A52196
13583A02991J38643j19640K68325j37650L1729K17291j47391J16555j98116o3892
13573B08845J43855K82528B47898j11623K8408J87045n4612j00009k7874J99165
13563C68398f9010B49674p6924d7011B24717L3610K0308O662J20462A16803r579
13552A07224N49599j58161n9729B02872o6794N9561M4035J15571p3188a30945
$$ plain form
13541 259856 134456 212118 34054 329503 282432 448801 383512 599691 434546 55522
13530 286968 421005 304677 252928 80475 200573 307593 118317 563842 -18849 411363
13519 152666 471993 636622 205737 557661 253754 187347 18661 191937 73842 170648
13509 170648 144459 181112 -116836 199815 311514 478938 239118 247771 379559 286379
13499 286379 29094 493552 360105 211842 21861 -75668 354315 179408 261001 65873
13488 11910 253634 199137 479977 165073 469753 -76581 135098 68062 320161 296872
13478 296872 -2428 424220 448728 -7229 471621 124192 84259 129707 422634 -207201 -198840
13467 -198840 4998 487326 108761 -41658 -3525 201140 255618 129794 254773 84144 299723
$$ packed form
13541B59856j25400P7662C4054K95449m7071J66369o5289K16179j65145E5522
13530B86968J34037j16328n1749H0475J20098J07020A18317M45525a8849D11363
13519A52666L19327J64629B05737L51924B53754o6407A8661J73276G3842R6806
13509A70648k6189L6653a16836A99815J11699J67424B39118Q653J31788r3180
13499B86379B9094M64458j33447j48263B1861g5668C54315j74907Q1593F5873
13488A1910K41724n4497K80840A65073L04680g6581A35098o7036K52099k3289
13478B96872b428D24220K4508g229D71621A24192l9933M5448K92927b07201Q361
13467a98840D998M82328A08761d1658c525B01140N4478j25824J24979H4144K15579
$$ plain form
13456 299723 156122 15099 209048 281983 424811 560059 26984 225730 64479 -243537
13445 183685 86099 567580 420389 102909 -61374 86965 424978 448716 200662 -13478
13434 293718 235469 -36940 -106126 16648 -140302 202102 209938 -36653 219426 -93060 171833
13422 328818 166808 32982 257793 175402 256700 148496 283178 220968 -62060 372872
13411 84347 193802 594937 65739 240972 201719 215483 138800 476296 281100 354224 469163
13400 469163 114750 117516 215720 352179 271560 114272 34505 232478 163617 83122 184047
13389 184047 268113 15113 117219 514379 160719 303988 264818 247268 202524 -59761 -112524
13378 -112524 322543 71098 -30582 64479 103009 152534 461267 255433 111874 371157
$$ packed form
13456B99723j43601A5099J93949P2935J42828J35248B6984J98746F4479b43537
13445A83685H6099M81481j47191A02909f1374H6965L38013K3738B00662a3478
13434B93718n8249c6940o9186A6648a40302B02102P836c6653B19426i3060A71833
13422C28818j62010C2982K24811q2391Q1298j08204J34682o2210f2060C72872
13411H4347J09455M01135F5739J75233l9253J3764p6683L37496j95196P3124J14939
13400D69163A14750K766R8204J36459q0619A14272C4505J97973o8861q0495J00925
13389A84047Q4066A5113J02106L97160A60719J43269l9170j7550m4744e9761n2763
13378a12524C22543G1098c0582F4479L8530M9525L08733k05834A11874K59283
$$ plain form
13368 371157 240885 156543 134222 391038 339292 -98481 165624 231369 379842 261476
13358 261476 209904 484077 103656 50265 414496 -65263 153739 56470 -283036 19522
13347 162326 142588 383040 361125 423733 191406 319117 551947 81252 153715 274651
13337 274651 33694 -206987 390321 120682 300105 107675 32947 73403 115250 -111251
13326 32907 564071 -169613 -63510 332934 393481 -67884 141597 -92372 243471 437223
13316 437223 98760 360487 23270 103603 252362 351312 -193246 91991 168960 143581 8186
13304 280136 21531 296928 209825 -127074 142216 85792 58551 70781 229068 61115 139073
13293 139073 -191701 -3697 120227 354749 146733 -172434 -86430 94783 206823 181002
$$ packed form
13368C71157j30272q4342k2321K56816n1746i8481A65624O5745J48473j18366
13358B61476n1572K74173A03656E0265L64231f5263A53739E6470b83036A9522
13347A62326j9738K40452k1915O2608A91406J27711K32830H1252P2463J20936
13337B74651C3694b06987C90321A20682J79423A07675C2947M0456M1847a11251
13326C2907N31164a69613f3510C32934O0547f7884A41597i2372B43471J93752
13316D37223I8760K61727B3270Q0333J48759R8950a93246I1991P6969k5379H186
13304B80136B1531K75397q7103a27074A42216n6424k7241J2230J58287F1115P7958
13293A39073a91701c697A20227K34522A46733a72434Q6004I4783J12040k5821
$$ plain form
13283 181002 115747 45781 -25470 137288 -7300 0 -153222 251676 196348 195717 250441 23648
13270 228524 134804 563391 217479 231202 45442 73802 -141121 -248641 144245 23003
13259 -178372 -40730 155513 -68135 50899 -221539 15497 226464 209091 116966 98583 -90509
13247 39018 42060 340949 188124 81758 16573 69453 241694 62294 244540 322317 341572
13236 341572 162414 167254 313055 297535 227118 22306 165450 62082 -8696 388660 -57876
13224 -248015 79719 -58537 57182 261448 401708 171850 -58040 -356154 344862 -125203
13213 -44480 -26612 342251 124952 321729 -9843 -228281 168645 -130714 4832 145124 -97569
13201 -35875 -52328 16415 -121772 31858 367676 137323 163156 115758 55268 118898 279772
$$ packed form
13283A81002o5255D5781b5470A37288g300@a53222B51676n5328o31N4724B3648
13270B28524r3720M28587B17479J3723D5442K8360a41121j07520A44245B3003
13259a78372d0730A55513f8135E0899b21539A5497K10967j7373r2125j8383i0509
13247C9018L042K98889j52825H1758A6573N2880J72241F2294J82246P7777J9255
13236C41572A62414M840J45801j5520p0417B2306J43144F2082h696C88660e7876
13224b48015G9719e8537E7182K04266J40260A71850e8040k98114C44862a25203
13213d4480J7868C42251A24952J96777i843k18438A68645a30714D832J40292i7569
13201c5875j6453A6415a21772C1858L35818A37323K5833m7398E5268O3630J60874
$$ plain form
13190 279772 252203 232023 -87131 117385 385469 -3278 -53256 131767 95647 283881 206916
13179 206916 177448 -96758 13801 264890 80358 48018 276600 -66235 20221 212747 -134465
13167 -222870 96703 -36277 -73945 170196 -7584 11452 1666 6411 -123420 -93670 -99919 52174
13154 24927 280701 37027 20480 22884 -82856 226020 49883 65372 -6756 255070 -133778
13142 71273 -15068 64183 128523 120626 144840 29515 -80990 45715 -307761 -7993 -168330 21679
13129 -7840 53411 166972 127994 172022 -60068 137095 448251 117501 -138803 133572 -34593
13117 122863 172293 345624 44224 13234 -42212 69736 140801 31875 454122 58524 -248153
13105 -179846 -154114 223568 -239384 99261 104150 -185483 -54829 79645 -133211 26569 65574
$$ packed form
13190B79772k7569k0180h7131A17385K68084c278m9978A31767l6120J88234p6965
13179B06916k9468i6758A3801K51089H0358l2340K28582f6235B0221J92526a34465
13167b22870I6703c6277l7668A70196g584A1452A666M745a23420K9750o249E2174
13154B4927K55774C7027j6547K404h2856B26020D9883J5489f756B55070a33778
13142G1273a5068F4183O4340p897K4214B9515h0990D5715c07761g993j60337B1679
13129g840E3411J13561l8978M4028f0068A37095L11156A17501a38803A33572c4593
13117A22863M9430J73331D4224A3234d2212F9736P1065C1875M22247E8524b48153
13105a79846K5732B23568b39384I9261M889a85483e4829G9645a33211B6569L9005
$$ plain form
13094 65574 -5285 -25537 -14524 117222 269063 58506 -216730 363456 -15754 41598 56493
13083 56493 392657 -43564 166210 261252 195753 -111674 172031 22341 -219305 -208583 -324573
13072 -324573 -286404 -20200 -654 -20740 152286 222883 -56822 198823 -146756 -140362 -251945
13061 -251945 141449 471460 2003 220160 212650 -5829 -94917 -65246 326183 54784 212643
13050 212643 182821 -114313 103983 -14518 -32025 -25213 172047 151351 17931 86218 -412130
13038 221353 3526 197461 356873 -150628 56393 252544 314287 1428 -125214 -92552 280879
13026 -186044 159665 339293 -75025 75509 250072 30029 235005 191480 -89289 -72190 31342
13014 -59474 297996 11989 170656 92293 -116079 123715 121153 143454 140218 199401 98105
$$ packed form
13094F5574e285k0252J1013A17222J51841E8506b16730C63456a5754D1598J4895
13083E6493L36164d3564A66210R5042o5499a11674A72031B2341b19305J0722j15990
13072c24573L8169b0200f54k0086A52286P0597e6822A98823a46756O394j11583
13061b51945A41449L30011B003K18157p510e829q9088K9671C26183E4784J57859
13050B12643k9822a14313A03983a4518j7507O812A72047k0696A7931O8287d12130
13038B21353C526J93935J59412a50628E6393J96151O1743A428a25214L2662B80879
13026a86044A59665J79628g5025G5509J74563C0029K04976m3525h9289J7099C1342
13014e9474B97996A1989J58667p8363a16079A23715k562K2301l236N9183I8105
$$ plain form
13002 -236208 -453422 164336 -115996 -198678 277459 -12010 -343366 135711 147280 -139387
12991 48802 34268 -135742 15612 -224731 117090 -37643 247308 79505 215923 59154 204081
12980 204081 401503 168224 92230 -51908 -218757 80672 139314 278234 131135 193966
12970 193966 91048 -69231 56941 -22582 49949 -56464 -209591 45501 364629 -169696 254014
12958 60854 130725 -27822 -47453 -89980 -270398 -329297 108605 -75203 76254 -66877 92612
12946 234867 202740 30598 151118 210245 22407 200862 113464 256603 204421 212271 291464
12935 291464 107926 208020 208462 24902 41255 -269852 -174657 -32672 -144281 -25680 -20326
12924 -20326 -55160 34150 91903 51413 -307951 205063 -189047 296397 -205478 5371 9033
$$ packed form
13002b36208k17214A64336a15996q2682B77459a2010l31356A35711J1569a39387
12991D8802j4534a35742A5612b24731A17090c7643B47308G9505J36418E9154J44927
12980B04081J97422A68224p5994e1908j66849H0672N8642J38920A31135O2831
12970A93966I1048f9231E6941b2582D9949e6464j53127D5501L19128a69696B54014
12958F0854O9871b7822j9631m2527j80418n8899A08605g5203G6254f6877I2612
12946B34867l2127C0598J20520N9127B2407J78455q7398J43139n2182P850P9193
12935B91464A07926J00094M42B4902J6353b69852R5195c2672j11609b5680N354
12924b0326l4834C4150N7753m0490c07951B05063a89047B96397b05478E371L662
$$ plain form
12913 9033 -141096 -151116 -11904 95040 104110 204830 -48373 171434 11265 -171946 -253977
12902 -253977 109553 -181130 -29940 16220 176651 -159847 121167 232945 21317 122092
12892 122092 145900 67792 229550 -144748 14380 90167 177014 15515 -151979 -56058 353452
12880 23912 -232249 119676 129560 138610 77768 134719 33621 -35630 249504 -243364 -4571
12868 -250559 127240 173334 -3747 354913 -76424 -24292 -92458 -18075 -152543 -111882 66398
12856 166604 121113 -349551 -143770 96461 12259 -277297 194877 -159931 119300 -114200
12845 29976 113035 91230 -9609 186085 195904 132955 11042 70932 113034 60026 20303 -98511
12832 63877 -175557 135550 12303 -289304 -285573 248552 -609 189293 -146415 119906 -164608
$$ packed form
12913I033a41096j0020a1904I5040R070J00720d8373A71434A1265a71946q2031
12902b53977A09553a81130b9940A6220J60431a59847A21167J11778B1317J00775
12892A22092K3808F7792J61758a44748A4380P5787Q6847A5515a51979e6058C53452
12880B3912b32249A19676R884R050o0842N6951C3621c5630B49504b43364d571
12868b50559A27240M6094c747C54913g6424b4292o8166a8075j34468M0661F6398
12856A66604m5491c49551a43770I6461A2259b77297A94877a59931A19300a14200
12845B9976Q3059k1805i609A86085R819o2949A1042N9890M2102n3008B0303i8511
12832F3877a75557A35550A2303b89304L731B48552f09A89293a46415A19906a64608
$$ plain form
12820 -195809 -165729 -171486 56485 -40262 14602 4643 168602 -94444 31218 -45261 29969 223372
12808 223372 94192 -25200 -71246 -156534 122711 -159375 -46826 70962 3107 -93965 91165
12796 54866 101147 252459 -62742 -85195 -231837 -34020 -28066 168005 -172722 122779 -65342
12784 -170761 297205 371112 125743 -28340 28567 -297338 -24531 109693 168403 -117198
12773 -21183 -72664 -224890 127592 -64724 -163516 -54941 -189537 139193 -12658 -17663 -271057
12762 -271057 65932 -172231 120155 5536 -176975 210044 67951 288636 -354600 290240
12751 -11339 -218051 -34026 1954 -87903 -58672 -109278 -297868 26273 194888 181202 45957
12739 -258114 -25204 113863 255551 316632 34635 175661 6858 120111 8814 -338697 -164589
$$ packed form
12820a95809L0080n757E6485d0262A4602D643J63959i4444C1218d5261B9969J93403
12808B23372I4192b5200m6046q5288A22711a59375d6826G0962C107i3965I1165
12796E4866M6281J51312f2742k2453j46642c4020N954A68005a72722A22779f5342
12784a70761B97205P3907A25743b8340B8567b97338b4531A09693N8710a17198
12773b1183n1481j52226A27592f4724r8792e4941j34596A39193a2658n005k53394
12762b71057F5932a72231A20155E536a76975B10044F7951K20685c54600B90240
12751a1339k06712c4026A954h7903K9231n0606j88590B6273J68615j3686D5957
12739b58114b5204A13863J41688O1081C4635J41026F858J13253H814c38697a64589
$$ plain form
12727 -50531 -88151 56921 49435 30271 339856 -46507 -43513 203743 -426562 138332 138483 -29395
12714 -56605 -100928 194460 -3995 25853 446933 268320 302960 300544 -184858 -49315 -37138
12703 -37138 181660 161733 -29091 246394 135306 -61503 -31756 134080 43340 -1372 -388405
12692 -388405 243884 -108002 28391 -162277 126106 69562 290025 139316 193866 97680
12682 97680 -230161 235133 19167 321269 3833 -64920 326975 -237471 -29010 191014 479663
12671 479663 -159312 -51966 -70702 -16323 447763 147837 303560 144565 19386 57089
12661 57089 121808 265910 83282 279376 96095 384404 23825 -45308 -536064 97066 -103404
12649 64336 248071 162576 116403 40486 133070 -143030 -33029 -84767 111339 97980 -127789
$$ packed form
12727e0531l7620E6921p486j9164L09585d6507K994B03743d26562A38332J51b9395
12714e6605m4323A94460c995B5853M21080j78613L4640k416a84858d9315J2177
12703c7138A81660j9927b9091B46394j11088f1503K9747A34080D3340a372l87033
12692c88405B43884a08002B8391a62277A26106n6544K20463A39316N4550r6186
12682I7680b30161B35133A9167L02102C833f4920C26975b37471b9010A91014K88649
12671D79663a59312e1966j8736a6323D47763A47837J55723A44565A9386L7703
12661E7089O4719J44102H3282J96094I6095K88309B3825d5308m90756I7066a03404
12649F4336J83735q5495m6173D0486R2584a43030c3029n1738A11339j3359a27789
$$ plain form
12637 67687 178761 359400 262862 130045 -74013 -119159 -75721 -173044 489903 222972 296303
12626 296303 80541 -136292 -46553 14439 -262559 -57506 200955 264006 -68281 298298 -127588
12614 -74873 54044 141405 153016 191313 -75879 -206144 122421 125667 79020 159150 223263
12603 223263 -87864 236306 -161395 79636 178262 258870 73029 207915 148081 208139 102358
12591 44438 290985 35421 -277331 64768 -12344 198866 -206777 -14567 -439267 -54248 59207
12579 50309 82739 349210 -9864 -500106 19891 -222037 -26441 15275 179590 -411660 48715
12567 232035 262717 -115766 81873 63035 142900 56557 144324 86657 181396 24862 -360196
12555 -34262 70003 28510 -265929 219059 202802 -74999 -56863 -68326 -7089 172947 -243783
$$ packed form
12637F7687J11074J80639r6538A30045g4013m5146M3438r7323D89903B22972P3331
12626B96303H0541a36292d6553A4439b62559e7506B00955O3051f8281B98298a27588
12614g4873E4044Q7361J1611L8297g5879j30265A22421L246m6647Q0130O4113
12603B23263h7864B36306a61395G9636R8626Q0608G3029J34886n9834O0058A02358
12591D4438K46547C5421b77331F4768a2344A98866b06777a4567m24700e4248E9207
12579E0309L2430K66471i864m90242A9891b22037b6441A5275J64315d11660D8715
12567B32035L0682a15766H1873j8838P9865E6557Q7767n7667R4739B4862c60196
12555c4262G0003B8510b65929B19059j6257g4999J8136j1463g089A72947b43783
$$ plain form
12543 -7048 -111000 8586 322089 -97146 -244165 101775 -156737 26329 14930 -25977 12681
12531 193783 211487 270865 -117223 102860 265932 -21692 -277667 -289428 35027 -309290
12520 115830 -86831 162044 -80840 -21075 -176849 181574 254334 -139122 -185877 -101986 -102689
12509 -102689 -224081 113221 6910 -139925 -145775 -70981 65779 -238755 -55896 -6916 -159627
12498 -159627 -305391 -281517 -77288 303341 -95012 198594 46599 -397373 -327326 -156251
12487 -287929 -171554 148322 86349 211039 -5700 131319 335164 -158959 -33777 -124594
12477 -124594 -66942 -92624 -138893 -61725 -103381 128326 -50272 -57681 28251 -207936 -81402
12465 252488 -51887 66468 273709 367833 -69165 -192433 164273 12511 -111386 30940 -48832
$$ packed form
12543g048j03952H586L13503i7146j47019A01775a56737B6329j1399b5977A2681
12531A93783J7704N9378a17223A02860J63072b1692k55975j1761C5027c09290
12520A15830h6831A62044h0840b1075j55774A81574P2760a39122m6755Q3891p03
12509a02689j21392A13221F910a39925n850g0981F5779b38755e5896f916j52711
12498a59627j45764K3874g7288C03341i5012A98594D6599c97373P0047a56251
12487b87929J16375A48322o1973J24690e700A31319K03845a58959c3777r0817
12477a24594N7652k5682m6269f1725m1656A28326e0272p409B8251b07936h1402
12465B52488e1887F6468K07241R4124f9165j23268A64273A2511a11386C0940d8832
$$ plain form
12453 44739 -146807 -178930 83942 125194 -417874 -162321 279653 296196 -4235 133921 -6394
12441 123389 132952 -60428 209710 36136 -140179 65322 -432148 -25778 -102358 -148014 14746
12429 -124562 183013 218155 190582 -26169 -77731 -154300 -52187 -125095 291644 147394 109610
12418 109610 1032 6375 -169910 -11134 36244 100488 -209974 -245427 -230602 57586 65709 -155693
12405 -247739 -107529 -47682 -128943 -40392 91921 25170 -3616 164927 -151511 -178665 -296556
12394 -296556 37826 61976 278268 -1063 109750 183338 -16789 -302135 30498 99580 -101512
12382 -88745 135296 -209855 -39907 -208870 69353 -45913 16289 418724 76506 -258472 80089
12370 -308577 127785 -110456 -188347 159248 -192582 -153305 212572 75763 193031 246076
$$ packed form
12453D4739a46807l2123H3942M1252d17874a62321B79653J6543d235A33921f394
12441A23389R563f0428B09710C6136a40179F5322d32148b5778p6580m5656A4746
12429a24562A83013L5142k7573b6169n1562p6569e2187p2908B91644j44250l7784
12418A09610A032N343a69910a1134C6244O4244b09974l5453J4825E7586Q123a55693
12405b47739a07529d7682q1261d0392I1921B5170c616A64927a51511k7154j17891
12394b96556C7826K4150K16292a063A09750P3588a6789k85346C0498O9082a01512
12382h8745A35296b09855c9907j68963F9353d5913A6289M02435G6506b58472H0089
12370c08577A27785a10456p7891A59248a92582L9277B12572G5763J17268N3045
$$ plain form
12360 246076 28888 253659 341731 101587 11079 -8697 -27245 60549 92130 258614 217097
12349 217097 150530 -169513 -21917 112895 231521 -685 198569 245340 -193906 104805 52249
12337 167269 -233528 -264999 -132647 -114075 32917 224906 -299625 -89341 -185394 -14076 -92033
12326 -92033 524032 239134 58430 -22638 37502 -344056 35347 193727 -85610 126852 141432
12315 141432 -176221 -63786 139248 155945 297688 -341563 -510 42461 33959 -95930 -304254
12304 -304254 -25773 -43436 -36064 171317 -86943 -48061 218211 -102038 -3196 -90509 29111
12292 -116411 11310 46121 17305 306906 -14749 -10158 65209 -101103 142709 55333 66447
12281 66447 364302 59883 -87583 -97704 60303 31566 308408 318269 -213090 16450 162049
$$ packed form
12360B46076B8888K24771Q8072A01587A1079h697j8548F0549L1581J66484m1517
12349B17097o6567a69513b1917A12895J18626f85A98569M6771a93906A04805E2249
12337A67269b33528l1471J32352J8572C2917J91989b99625h9341r6053a4076p7957
12326i2033E24032B39134E8430b2638C7502c44056C5347J58380h5610A26852J4580
12315A41432a76221f3786A39248J6697J41743c41563e10D2461q502i5930k08324
12304c04254b5773j7663P372A71317h6943L8882B18211a02038c196q7313B9111
12292a16411A1310L4811A7305K89601a4749M591F5209a01103A42709E5333J1114
12281F6447K97855E9883h7583j0121F0303k8737K76842R861b13090A6450J45599
$$ plain form
12270 162049 44102 123469 43659 305381 -73296 182901 -342239 -207327 193548 5917 -191341
12258 -45050 -43827 -173938 -203756 -44443 202934 -389846 204228 9637 59986 112268 156231
12247 156231 244120 -14908 136417 157978 298996 -90169 68587 89691 5282 -60434 -20996
12235 187468 83558 -16528 234313 203625 31280 223164 131088 160220 23020 7101 612370
12224 612370 527464 66390 317280 427631 192462 258960 179600 182295 1708 174845 -170360
12212 -110223 -29539 -404172 52761 -129823 220978 -82204 18314 112644 -195558 -85588 545277
12200 289988 178459 -53572 169361 108282 332422 2850 75001 232016 142086 -183413 81599
12188 29889 -358376 161675 -93487 196790 1133 -56241 236514 -87679 280205 202284 352952
$$ packed form
12270A62049D4102P9367D3659K61722g3296A82901c42239J34912A93548E917a91341
12258d5050J223j30111k9818d4443B02934c89846B04228I637N0349N2282M3963
12247A56231Q7889a4908A36417K1561J41018i0169F8587K1104E282f0434b0996
12235A87468H3558a6528B34313l0688C1280J91884r2076K9132B3020G101O05269
12224F12370q4906F6390K50890J10351A92462O6498p9360K695A708J73137a70360
12212a10223b9539l74633E2761a29823B20978h2204A8314R4330a95558h5588E45277
12200B89988j11529e3572A69361o1079K24140B850P2151J57015q9930a83413H1599
12188B9889c58376A61675i3487A96790A133e6241B36514h7679B80205p7921J50668
$$ plain form
12177 352952 191520 29055 -278935 327712 183747 -273429 326114 326297 373027 217544
12167 217544 273732 -173999 369282 119547 303120 121510 232906 -156269 -57250 -217380
12157 -217380 165464 95590 193372 117676 -120365 277437 389571 -238418 247450 18880
12146 -56854 438692 -215089 262448 -15892 73052 -33288 85084 -115846 118112 -268596
12135 32447 -7244 -13376 217070 -225048 -328506 38162 176931 461176 258671 -173064 65607
12123 -174430 55522 -62443 -159007 10116 82057 -184431 -95222 -190191 -14201 -86287 352468
12111 -222099 -118078 -12666 72521 98698 -32101 -131073 17966 -27207 -411739 -353228 35960
12099 101128 -58214 -201259 -239346 -158126 307991 72665 53907 40017 39641 -296292 329859
$$ packed form
12177C52952j61432B9055b78935C27712j43965b73429C26114J83M6730j55483
12167B17544N6188a73999C69282A19547J83573A21510J11396a56269e7250j60130
12157b17380A65464o9874R7782p5696a20365B77437J12134b38418B47450A8880
12146e6854D38692b15089B62448a5892G3052c3288H5084a15846A18112b68596
12135C2447g244o132B17070b25048j03458C8162J38769K84245k02505a73064F5607
12123a74430E5522f2443r6564A0116P1941a84431Q9209r4969a4201p2086C52468
12111b22099J04021a2666G2521K6177c2101r8972A7966b7207l84532N8511C5960
12099A01128e8214j43045l8087Q1220C07991G2665j8758j3890l76b96292C29859
$$ plain form
12087 -43535 -46249 252706 -373324 46201 -131460 225257 261459 66400 860167 2203949
12077 2203949 1579394 440715 -56215 126856 17809 11408 -102542 124921 69581 70808 34852
12065 -77973 -194036 302251 -189099 126846 268720 -293060 -65660 28793 -25263 28073
12054 -305720 -221480 -279170 -176414 113398 41791 14519 38719 -174250 -250133 -91116 229205
12042 209950 -101978 40977 -238606 -32216 -41954 -518951 -348141 -201370 -99796 -190076 -164729
12031 -164729 81652 -56486 -182352 -63430 -59346 139672 -239898 -94661 -104710 -11960 -84898
12020 -84898 -54060 -401896 -114828 172338 74420 -192464 27217 -252960 346894 279656
12010 279656 329689 -70615 106904 122959 -86245 -95097 102480 -7706 -107892 -134971 -6553
$$ packed form
12087d3535k714B52706c73324D6201a31460B25257L6202F6400P93767J343782
12077B203949o24555D40715e6215A26856A7809o401a02542A24921n5340J227C4852
12065g7973j16063C02251a89099A26846J41874b93060f5660B8793b5263B8073
12054c05720Q4240n7690J02756A13398D1791A4519K4200a74250p5883i1116B29205
12042B09950a01978D0977b38606c2216r738m76997J70810J46771i9796r0280K5347
12031a64729H1652e6486j25866f3430M084A39672b39898i4661j0049a1960p2938
12020h4898L0838l47836a14828A72338G4420a92464B7217b52960C46894o7238
12010B79656N0033g0615A06904J6055h6245q852A02480g706j00186k7079f553
$$ plain form
11998 -222728 20312 157501 115817 -29156 168605 -157504 -294530 -352032 -17882 -180192
11988 -180192 -148556 -114024 -474118 119257 543209 -335258 -145713 -29652 295768 103626
11977 97420 -219443 218915 69136 17159 -231611 61778 45251 163609 77790 85696 -317172
11965 127500 126682 373141 -228558 -38735 29350 -61635 314520 73421 240477 -176747 216556
11953 -109638 48691 45299 79046 35805 -220776 198673 -345513 -48502 -34141 86539 304476
11942 304476 198394 -239555 43830 17136 105323 69554 -162125 39463 15546 -263552 163531
11930 431679 -355933 152192 131282 -165388 -107756 -56399 -205740 -135112 -101009 9187 61191
11919 61191 -93945 -128204 97657 409695 -133563 -270937 -35995 3569 -221926 -97618 -140823
$$ packed form
11998b22728B0312J37189m1684b9156A68605a57504j37026n7502a7882j62310
11988a80192L1636L4532l60094A19257M23952c35258a45713b9652B95768A03626
11977I7420b19443B18915F9136A7159b31611F1778j6527J18358G7790P906c17172
11965A27500q18K46459b28558c8735B9350f1635C14520G3421J67056a76747B16556
11953a09638D8691l392L3747C5805b20776A98673c45513d8502J4361H6539K17937
11942C04476j06082b39555D3830A7136Q8187l5769a62125C9463A5546b63552A63531
11930D31679c55933A52192k0910a65388N7632N1357j49341P0628L4103I187N2004
11919F1191i3945l4259I7657L12038a33563j37374c5995C569b21926i7618m3205
$$ plain form
11908 -140823 -212138 -345374 -187344 -98870 149820 60573 -100333 195031 172839 -141776
11897 -13661 323286 -214724 85772 33783 102563 -63967 -18410 -38296 -341267 110968 -196188
11885 -150168 -38937 -104467 -118285 -79572 -15561 5512 -300099 -322215 -85941 45973 -46563
11873 -94828 68459 -67472 275799 -104995 -126976 50220 -180187 196166 -276263 -182507 -132373
11862 -132373 -152418 -6700 -65191 212389 421349 -291249 -104456 -18328 -10278 -52034 161728
11850 48758 -83955 -160731 -38630 -252614 71519 -199910 -112575 -68915 -355397 -147240 214826
11838 2984 30545 -5642 -311298 -185978 -131531 -167100 132385 -120612 -119187 2480 62794 283122
11826 283122 181208 -82644 161735 -155790 53921 -133423 -44621 -306034 -436311 -15852
$$ packed form
11908a40823p1315j33236J58030Q8474A49820F0573a00333A95031k2192a41776
11897a3661C23286b14724H5772C3783O8780f3967a8410j9886l02971A10968a96188
11885a50168c8937o5530j3818L8713a5561E512c00099k2116h5941D5973d6563
11873i4828F8459f7472B75799a04995k1981E0220a80187A96166b76263R3756N0134
11862a32373k0045f700n8491B12389K08960b91249a04456a8328Q050m1756A61728
11850D8758h3955p6776c8630k13984G1519a99910Q7335M3660k86482a47240B14826
11838B984K7561e642l05656J25320N4447l5569A32385a20612J425B480O0314K20328
11826B83122j01914h2644A61735a55790E3921a33423d4621k61413j30277a5852
$$ plain form
11815 -100003 -100933 -65039 -22815 -126284 -286402 -714 -25745 -380767 258269 114315 124487
11804 124487 48796 184140 -237666 -105408 165168 2961 174918 68 -124 -93679 69856 -65898
11791 -66751 161316 -342241 97777 76405 312025 -161405 60546 45892 54635 211422 216056
11780 216056 194111 42730 419622 89086 -168277 -131251 -190921 188871 45680 24327 -125906
11768 120562 -113320 -10389 -154208 247249 -171562 -151831 223957 -233862 -469231 24975
11757 -151084 489094 77402 36735 197127 -80191 -317386 -241269 -140188 35881 -42150 253192
11745 87281 403423 229534 124463 -323929 -68962 91969 78135 -12240 181776 -69607 118533
11733 -111934 -18306 -71294 70483 282785 79929 75352 -117845 -124477 54717 -107909 87187
$$ packed form
11815a00003r30L5894b2815j03469j60118g14k5031l55022B58269A14315J0172
11804A24487D8796J35344b37666a05408A65168B961J71957F8a24r3555F9856f5898
11791f6751A61316c42241I7777k1372K35620a61405F0546j4654Q743J56787M634
11780B16056k1945D2730L76892H9086a68277L7026n9670A88871D5680k1353a25906
11768A20562a13320a0389j43819B47249a71562J9731B23957b33862k35369B4975
11757a51084D89094G7402C6735J60392h0191k37195P6117J01081C5881d2150B53192
11745H7281L16142j73889j05071c23929f8962I1969j3834a2240A81776f9607A18533
11733a11934a8306n2988G0483K12302G9929m577a17845o632E4717a07909H7187
$$ plain form
11721 -24973 -58456 -32213 68020 217002 -196939 -171161 -31794 -6265 -56488 24717 -96652
11709 305731 396038 161477 35169 115601 3676 95747 236922 359424 86495 82873 -150701
11697 -13097 -162989 167067 -199843 402678 -215835 202938 43311 -173573 65100 39326
11687 39326 29825 142558 -48409 59103 147068 -105019 105424 167710 -47528 12945 152795
11676 152795 231516 83039 93312 388523 -241905 -333687 38244 113092 -346573 -180193 -130800
11665 -130800 -321798 -140956 -165269 8366 91543 247978 -169587 11657 -151895 -52580 -18320
11653 -14683 320642 -56478 -102040 -206547 -233273 7695 -232353 416103 -311178 -12036 -176748
11642 -176748 -52385 -176503 -106068 -219310 -262687 202785 257663 155816 150135 134338 -39766
$$ packed form
11721b4973l3483K6243F8020J48982a96939K5778c1794f265n0223B4717i6652
11709C05731R0307A61477C5169Q0432C676R2071J41175J22502H6495l622a50701
11697a3097j49892A67067a99843D02678b15835B02938D3311a73573F5100k5774
11687C9326r501J12733d8409E9103Q7965a05019A05424O2286d7528A2945J39850
11676A52795P8721H3039J0273K95211b41905r1782C8244P4848c46573J66380M9393
11665a30800j90998a40956k4313H366Q3177J56435a69587A1657a51895e2580a8320
11653a4683C20642e6478m5562j04507k6726G695b32353D16103c11178a2036j64712
11642a76748e2385j24118P0435j13242m3377B02785N4878j01847n681j5797c9766
$$ plain form
11630 -94636 -37769 329521 81879 202372 -351492 61167 -291129 -85259 232808 151559 209583
11619 209583 -355396 390315 -260856 -170235 271014 -83414 -125518 -43795 90120 -76119 85384
11607 136887 -337296 45287 -148026 -192718 -169065 -92625 38286 239681 -329548 136162
11596 -127502 -148513 476602 -26350 102696 147675 -77568 248689 380853 -159318 13598
11585 234611 300082 -73438 -164346 169535 358187 -64982 256834 393369 -33211 132658
11574 122808 21748 145949 238335 -5788 24459 41234 298878 -90062 137663 -2001 -94151
11563 -94151 -165780 -94803 -183536 206411 99549 423609 94379 -87576 309970 -3149 -141774
11552 -141774 -14418 148781 -225185 144597 -49082 326485 -79093 17986 188200 -272705
$$ packed form
11630i4636c7769C29521H1879J20493c51492F1167b91129h5259B32808q1249N8024
11619B09583c55396C90315b60856R0621B71014h3414m2104d3795I0120g6119H5384
11607A36887c37296D5287a48026m4692K3653P6440C8286K01395c29548A36162
11596a27502k1011D76602b6350A02696M4979g7568B48689J32164a59318A3598
11585B34611O5471g3438r0908A69535J88652f4982B56834J36535c3211A32658
11574A22808B1748J24201R2386e788B4459J6775K57644i0062A37663b001r2150
11563i4151p1629P0977q8733B06411I9549L24060I4379h7576C09970c149j38625
11552a41774a4418A48781b25185A44597d9082C26485g9093A7986J70214b72705
$$ plain form
11541 -38944 -230852 140400 120480 -48509 2782 54586 260293 82731 156804 67259 134635
11530 134635 -90455 139854 67144 50679 -142082 -139155 30969 -64076 128405 -201496 164862
11518 -36453 -203093 210582 40175 45916 284275 281836 -90627 38200 62793 285460 164436
11507 164436 85539 -83936 250786 -147872 56816 296415 291047 156862 171246 300472 126164
11495 208298 -117499 682633 -94387 -126053 235659 321353 64692 332288 53088 -168552
11484 75405 33925 -296151 60695 133656 160133 181029 165782 -971 237723 83444 72668 9614
11471 31537 438295 230478 -176102 -116776 101891 272126 269804 41192 233215 40403 218486
11460 218486 185183 54079 -9184 114081 113702 -192911 302450 263233 272858 291567 92301 -321241
$$ packed form
11541c8944j91908A40400j9920d8509B782N1804K05707H2731P4073F7259O7376
11530A34635i0455A39854F7144j6465a42082K927C0969f4076A28405b01496A64862
11518c6453j66640B10582D0175N741K38359k439i0627C8200K4593K22667j21024
11507A64436p8897h3936B50786a47872E6816K39599n368j34185J4384J29226A26164
11495B08298a17499F82633i4387l1666B35659Q5694F4692K67596E3088a68552
11484G5405C3925b96151F0695P2961K6477K0896j5247i71B37723H3444j0776I614
11471C1537M06758k07817a76102N9326A01891J70235k322D1192J92023D0403J78083
11460B18486l3303E4079i184A14081l79a92911C02450l9217R625J8709I2301c21241
$$ plain form
11447 291382 228217 6738 59666 215140 202023 -161512 191591 524685 16940 141093 -18579
11435 24409 239782 290737 -8021 -9606 23156 -35874 79476 1898 6460 5591 -113983 5923 -129761
11421 -76051 56787 -148406 -114101 -68100 -219 -142203 49774 129999 287930 -273077 165821
11409 -171078 366674 145694 -322999 -144271 9024 -120557 -49156 -220218 114400 -4276
11398 398468 -306659 -88799 362973 138588 28150 -189303 47371 268066 3845 395147
11388 395147 71557 -50857 -9450 60207 -307645 70748 -241229 -216968 -122751 -106372 231631
11376 21152 -126537 108110 -263678 -256002 -250078 145642 -341973 -127244 -206430 -107664 -21972
11364 268474 -85254 -279626 -123809 113189 -511759 82372 301457 57591 -30630 259213
$$ packed form
11447B91382o3165F738N2928J55474j3117a61512A91591L33094A6940J24153a8579
11435B4409K15373N0955h021j585B3156c5874G9476A898M562q69a13983E923a29761
11421g6051E6787a48406L4305M6001b19j41984D9774Q0225J57931b73077A65821
11409a71078C66674A45694c22999a44271I024a20557d9156j71062A14400d276
11398C98468c06659h8799C62973A38588B8150a89303D7371K20695C845L91302
11388C95147G1557e0857i450F0207c07645G0748b41229K4261R4217J6379B31631
11376B1152a26537A08110b63678P676N924A45642c41973a27244p9186R8766b1972
11364B68474h5254j94372a23809A13189e11759H2372K19085E7591c0630B59213
$$ plain form
11353 40995 -197043 -185824 174415 -84188 -415381 -369419 -95139 -124615 298451 199119 287194
11342 287194 -10853 204069 -51312 182813 -241106 -22348 -94261 -181948 285364 170042
11332 170042 -44636 14985 -6747 28423 -98370 -168033 -47182 -48629 -177117 247240 39416
11320 -105784 119827 -208126 -66320 -28372 281532 42946 -55635 125362 -185822 -1868 10586
11308 120477 -225583 69574 183965 20295 -140285 -74528 9659 71904 -166056 -132126 46074
11296 55988 -135272 250529 150633 157985 104176 -194581 66592 -234099 -49885 -51109 -84919
11285 -84919 -259184 347811 -50659 -80966 206703 -194558 88298 -320257 -183967 -227484
11275 -227484 -312457 158044 79555 -12315 77305 -199853 -160399 -60013 291685 -94940 163413
$$ packed form
11353D0995a97043J1219A74415h4188l31193M5962i5139k9476B98451r9332Q8075
11342B87194a0853B04069e1312A82813b41106b2348p1913q7687B85364j15322
11332A70042d4636A4985f747B8423i8370o9663d7182j447j28488B47240C9416
11320a05784A19827b08126f6320b8372B81532D2946e5635A25362a85822a868A0586
11308A20477b25583F9574J14391B0295a40285O5757I659O2245a66056L3930D6074
11296E5988a35272B50529r9896P352n3809a94581F6592b34099d9885j224l3810
11285h4919j74265C47811e0659l0307B06703a94558H8298c20257J36290m3517
11275b27484q4973A58044p8489a2315G7305a99853L9454f0013B91685i4940A63413
$$ plain form
11263 -100253 296508 -1926 -169997 -50656 116665 -366912 -43586 165093 508894 -349448
11252 114115 -79701 -88697 14563 -198779 -23158 -316937 61146 32912 -108672 -197204 50324
11240 82390 172471 -240185 104504 -121940 40982 -213669 14703 -362128 -81363 44165 12622
11228 -89823 322751 -376312 245871 8037 43525 -282187 149585 -207037 -259944 40935 -183079
11216 19324 -344331 19904 -165571 77214 -307831 67619 70472 91706 199421 -39989 -552319
11205 -552319 65573 -26753 20930 101239 56198 -205914 31176 -245816 58579 -66898 -161286
11194 -161286 144155 174970 99573 -121790 -112587 -279204 -210094 12204 195358 -187155 -127266
11183 -127266 -878 -110687 -204788 -66636 250472 -104537 106501 163845 -89576 82144 27579
$$ packed form
11263a00253B96508a926j68071e0656A16665c66912d3586A65093L43801c49448
11252A14115g9701q996A4563a98779b3158k93779F1146k8234a08672q8532E0324
11240H2390R0081b40185A04504a21940D0982b13669A4703c62128h1363D4165A2622
11228h9823C22751c76312B45871H037L5488b82187A49585b07037n2907D0935a83079
11216A9324c44331A9904a65571G7214c07831F7619K853K1234J07715c9989n12330
11205e52319F5573b6753B0930Q0309m5041b05914C1176b45816E8579f6898r4388
11194a61286A44155L0815p5397a21790R203j66617O9110A2204J83154a87155N9889
11183a27266h78j09809r4101f6636B50472a04537A06501N7344h9576H2144B7579
$$ plain form
11171 6145 65272 107760 -13267 -97372 176860 -309489 -229476 -98163 294060 195057 -207479
11159 -64964 257455 -305410 257461 269373 -358815 -186932 -142842 -57912 -249370 59300
11148 -285787 184620 -173503 45712 34534 9729 -132404 -196006 -39739 -16613 -22377 226098
11136 -164416 -177797 -58317 129986 -79528 -155184 91505 -20986 58272 102553 30003 -440 26934
11123 139765 -103131 151460 56400 -70983 -177634 29141 22371 -2090 1641 -51438 -98776
11112 -98776 -20384 237516 325399 223050 88380 -142050 192699 222605 6385 33513 110884
11101 110884 -272302 53028 346645 -25917 27700 145714 2258 290940 423170 309862
11091 309862 21890 101969 -93282 -119569 157428 264358 263957 246575 224372 45633 405005
$$ packed form
11171F145N9127M2488a3267q4105A76860c09489Q0013i8163B94060r9003b07479
11159f4964B57455c05410B57461J1912c58815J71883M4090e7912j91458E9300
11148b85787A84620a73503D5712j1178I729a32404o3602c9739a6613n764B26098
11136a64416j3381e8317A29986g9528p5656I1505b0986E8272M4281C0003d40B6934
11123A39765a03131A51460E6400g0983j06651B9141o770b090A641e1438m7338
11112i8776b0384B37516Q7883j02349H8380a42050A92699K9906F385K7128P7371
11101A10884b72302E3028K93617b5917B7700J18014B258K88682J32230j13308
11091C09862B1890Q0079i3282k6287A57428J06930m01j7382k2203D5633L59372
$$ plain form
11080 405005 215142 71490 282698 383037 74463 17573 -68433 83667 218987 52133 49935
11069 49935 292846 506710 323253 493485 585293 424941 387628 185439 626944 169728
11058 111674 427108 587584 283297 742716 649672 458636 551851 726900 836667 773240
11048 773240 572219 479962 635084 891376 416984 770593 839890 938235 463664 323994
11038 323994 789318 532730 544972 810449 1040784 677959 645546 710130 818217 436853
11028 436853 546714 684083 940616 620443 611793 277851 492714 601344 633565 754856
11018 754856 400811 646607 440067 594441 313714 549686 722111 658425 659338 105219
11007 578857 441072 470882 593090 398474 696238 650367 512243 401636 683200 795219
$$ packed form
11080D05005j89863G1490K11208J00339G4463A7573f8433H3667J35320E2133k198
11069D9935K42911K13864j83457J70232R1808j60352l7313A85439M41505A69728
11058A11674L15434J60476B83297M59419r3044j91036R3215J75049J09767o3427
11048G73240k01021r2257J55122K56292D16984L53609O9297R8345D63664j39670
11038C23994M65324k56588J2242K65477K30335l62825l2413O4584J08087l81364
11028D36853J09861J37369K56533l20173q650B77851K14863J08630L2221J21291
11018G54856l54045K45796k06540J54374k80727K35972J72425o3686R13A05219
11007E78857j37785K9810J22208j94616K97764m5871j38124j10607K81564J12019
$$ plain form
10997 795219 605298 896627 644892 730345 720651 751776 659245 685475 705871 762763 1016708
10986 1016708 668749 1028184 824449 717386 1109289 1018370 1012964 1209368 1183433 1684541
10976 1684541 1646970 1444809 1983641 2433155 2312420 2533038 2472196 2654681 2489807 2405559
10966 2405559 1994656 1736455 1747716 1201456 1538049 1878954 1832591 1515751 1842733 1884671
10956 1884671 1613632 2018305 1780025 1327898 1701007 1226029 742817 697189 541712 594996
10946 594996 835915 394598 244634 293234 440420 241937 201710 -112777 450281 175241
10935 321517 385426 215988 70065 244728 188092 -104196 330893 -189875 75194 72028 -91155
10923 -211585 16644 33793 197779 33336 -478531 163629 -130489 215386 -119270 197546
$$ packed form
10997G95219j89921K91329k51735Q5453r694L1125r2531K6230K0396N6892K53945
10986A016708l47959L59435k03735j07063L91903r0919n406J96404k5935N01108
10976A684541l7571k02161N38832M49514j20735K20618o0842J82485j64874q4248
10966B405559m10903k58201J1261n46260L36593L40905m6363l16840L26982M1938
10956A884671k71039M04673k38280m52127L73109m74978m83212m5628j55477N3284
10946E94996K40919C94598j49964M8600J47186j98483m0227a12777D50281A75241
10935C21517O3909j69438G0065J74663n6636a04196C30893a89875G5194l166i1155
10923b11585A6644J7149J63986C3336d78531A63629a30489B15386a19270A97546
$$ plain form
10912 84323 80005 -519973 9953 128745 -20026 -157107 -268962 -253820 226557 100668 -211414
10900 45129 46226 46396 160959 -143044 203305 54518 -77552 -188107 178332 184092 65287
10888 175216 -79730 -75987 -15723 -13044 -90343 -146060 -370487 -93574 -134492 105519 -388657
10876 -183663 -55438 128468 -150901 -137812 51429 93870 -199775 29352 -106087 -149335 -340088
10865 -340088 -100779 -83475 10119 298989 81424 122141 145024 -40256 47553 57155 14306
10853 -21993 -363048 23248 379483 -72722 169413 -1494 -16469 35717 -149829 -69192 -108185
10842 -108185 -211861 86453 -33416 -227970 -31979 21586 -51591 -55125 -164186 19962 132567
10831 132567 278081 -116933 66500 132279 118481 -246164 -48513 204535 86755 -251528
$$ packed form
10912H4323m318e19973I953J18792b0026j37081j11855J5142B26557A00668b11414
10900D5129J097J70J14563a43044B03305E4518g7552j10555A78332N760F5287
10888A75216g9730L743a5723K679p7299n5717k24427i3574m0918A05519c88657
10876a83663e5438A28468a50901J3089E1429M2441a99775B9352a06087m3248j90753
10865c40088a00779J7304A0119K88870H1424M0717K2883d0256D7553R602A4306
10853b1993l41055B3248L56235g2722A69413a494j4975C5717a49829f9192l8993
10842a08185j03676H6453c3416j94554c1979B1586e1591l534j09061A9962J12605
10831A32567J45514a16933F6500O5779j3798b46164d8513B04535H6755b51528
$$ plain form
10820 100243 -89516 -73839 -102103 -148674 30755 -480486 -21583 286619 -67320 255867 -57734
10808 -3958 164069 87785 101357 -133667 4658 -261868 186105 167652 -289310 -274242 1978
10796 -82943 259351 -111270 133773 175181 -39340 212193 -78832 -268042 28174 -152830
10785 -98558 -272753 251278 -39086 -194975 -77055 -218690 50119 -227841 -306742 -1324 268498
10773 -136891 38711 -332285 -3180 -24581 -93928 -71272 -298596 -225595 149238 86103 -199680
10761 27346 -37471 116674 -50464 -36871 280577 -26626 39846 -192075 -157554 141220 -9826
10749 163781 -230393 -163831 -222089 -107911 188784 -2852 445430 -18483 86039 -134746 159701
10737 -275128 -98548 -389725 92484 14305 -106543 296024 -3743 -72871 -120705 -296307 -128382
$$ packed form
10820A00243h9516J5677k8264m6571C0755d80486b1583B86619f7320B55867e7734
10808c958A64069p6284J3572a33667D658b61868A86105j8453b89310J5068A978
10796h2943B59351a11270A33773M1408c9340B12193g8832j89210B8174a52830
10785i8558j74195B51278c9086j55889g7055j41635E0119b27841p8901a324B68498
10773a36891C8711c32285c180k1401o9347K2656k27324P3001A49238o3135a99680
10761B7346c7471A16674e0464J3593B80577b6626C9846a92075L4521A41220i826
10749A63781b30393O6562n8258a07911A88784b852D45430a8483H6039a34746A59701
10737b75128i8548k91177I2484A4305a06543B96024c743o9128m7834j75602a28382
$$ plain form
10725 -2641 130260 100330 154801 -81964 166073 -65181 340151 -224677 -254687 1456 -361212
10713 305462 11886 -34212 -70146 11656 3455 -40243 -202447 -87269 -197491 -119053 -62291
10702 -62291 -128462 10010 -178558 -27235 -56347 -322765 161518 42711 -155587 -360577 40269
10690 311190 -19848 163105 40176 -252783 -39563 -59155 57534 13183 45546 22995 -211182
10678 -29288 -486784 -9601 158937 -9493 -143922 7064 247010 -138233 -133201 64460 16319
10666 311185 -320929 103281 -93632 -298740 105123 -87621 93344 67411 -471173 -59503
10655 -117031 -419842 71925 156364 -202634 50423 -18530 -57457 163386 142359 36450 124262
10644 124262 -184664 -535718 -78861 160595 -109589 -139806 232501 36110 -172684 -270781
$$ packed form
10725b641A30260k9930N4471h1964A66073f5181C40151b24677l0010A456c61212
10713C05462A1886c4212l5934A1656C455d0243j62204h7269j10222P8438N6762
10702f2291o6171A0010a78558b7235k9112k66418A61518D2711a55587k04990D0269
10690C11190a9848A63105D0176b52783c9563j9592E7534A3183L2363k2551b11182
10678b9288m57496i601A58937i493j34429G064K39946a38233N032F4460A6319
10666C11185c20929A03281i3632k05108A05123h7621I3344k5933d71173e9503
10655a17031l02811G1925Q4439b02634E0423a8530l8927A63386k1027C6450Q7812
10644A24262a84664l51054g8861A60595a09589l0217B32501C6110a72684r8097
$$ plain form
10634 -270781 -315042 -325458 -109094 -122053 -103968 -155229 -362606 -333619 -221232 171628 292042
10623 292042 -31972 -128265 -125770 -378947 81772 185282 342672 62899 373018 176457 -291357
10611 119439 -152726 10499 -182460 -133514 -108314 -70480 25580 63394 -143042 -37541 -209886
10600 -209886 -44804 -141812 -46446 -249812 -11715 -64449 -35673 60408 -31104 44201 223417
10589 223417 -59756 240279 -135126 262053 -174542 -18491 -30399 -167394 -292846 228525
10578 -150764 -48345 -158344 -140700 -1973 216561 -26547 -96676 -8720 192635 -177929 -153789
10567 -153789 -207274 -109495 -67562 -202965 -363403 -325031 167696 2041 -41511 -15060 24278
10555 125302 -74864 -150345 -75205 178207 -55806 122056 14558 -245908 -147242 -188107 -15972
$$ packed form
10634b70781m4261j0416a09094j2959J8085n1261k07377K8987J12387A71628J20414
10623B92042c1972r6293K495k53177H1772J03510J57390F2899L10119A76457b91357
10611A19439a52726A0499a82460M8946K5200L7834B5580L7814a43042c7541j72345
10600b09886d4804r7008d6446k03366a1715n2734K8776F0408c1104D4201J79216
10589B23417e9756B40279a35126B62053a74542a8491j1908j36995j25452B28525
10578a50764d8345j09999J7644a973B16561b6547p0129h720A92635a77929K4140
10567a53789n3485R7779M1933j35403j60438L8372A67696B041d1511a5060B4278
10555A25302g4864p5481P5140A78207e5806A22056A4558b45908R8666m0865a5972
$$ plain form
10543 137243 239296 -39213 32612 16475 111228 16194 24676 85030 -195956 72442 174773
10532 174773 -325795 75087 -77035 169936 -212212 114222 -124814 62598 -3355 -94806 -46190
10520 -41525 -199797 274992 -196899 -254141 230600 262980 -242891 -77502 216099 261765
10510 261765 -205565 -236270 -265330 -147503 -62877 76883 -236844 13901 203763 -158613
10499 188196 -210295 -241796 258255 -76534 164908 -367611 129436 186317 -128254 -232480
10489 -232480 -251614 -372357 57069 -13073 139588 -72754 192594 115331 228437 509592
10479 509592 253488 178434 330050 160130 -30747 -205310 -73699 -123954 -55831 -354796
10469 -354796 219546 228413 -49791 -141306 351330 3778 68743 214370 118198 -178661 59436
$$ packed form
10543A37243J02053c9213C2612j6137R4753A6194Q482O0354a95956G2442J02331
10532A74773c25795G5087g7035A69936b12212A14222a24814F2598c355r1451d6190
10520d1525j58272B74992a96899n7242B30600L2380b42891g7502B16099M5666
10510B61765b05565l0705k9060J17827f2877G6883b36844A3901J89862a58613
10499A88196b10295l1501B58255g6534A64908c67611A29436N6881a28254j04226
10489b32480j9134j20743E7069a3073A39588g2754A92594p7263J13106K81155
10479E09592B53488p5054J51616A60130c0747j74563g3699n0255e5831k98965
10469c54796B19546Q867d9791r1515C51330C778O4965J45627r6172a78661E9436
$$ plain form
10457 -159757 -260051 169836 -97915 -113825 150367 87627 119204 114080 115944 64313 68056
10446 68056 -13689 212972 -45556 -70152 -221281 -148455 -244121 304519 -62159 84909 6576
10434 -147636 -137885 -90312 -99616 129714 256096 -84241 5033 12234 21309 299687 56679 -204040
10421 -89497 36386 -15973 -306990 89103 177920 -12910 -37978 52095 -483711 -17069 -171551
10410 -171551 17733 79045 -341855 -164080 -112726 -197273 -223605 -149419 479165 -218863 71846
10398 -80593 71233 -143518 58 -25840 51438 130270 335002 358674 -20768 338409 -52746 187419
10385 208980 -227151 39431 -164359 151404 -222487 -144322 268119 178230 213375 122429
10375 122429 60430 420331 258927 -80370 435529 170472 211628 506085 268952 183493
$$ packed form
10457a59757j00294A69836i7915j5910A50367o2740L1577n124J864n1631L743
10446F8056a3689B12972d5556k4596j51129P2826r5666C04519f2159H4909F576
10434a47636R751M7573r304A29714J26382h4241E033P201R075K78378E6679b04040
10421h9497C6386a5973k91017H9103Q8817a2910k5068E2095d83711a7069j54482
10410a71551A7733O1312c41855a64080N1354q4547k6332P4186D79165b18863G1846
10398h0593G1233a43518E8b5840E1438P8832K04732K3672b0768C38409e2746A87419
10385B08980b27151C9431a64359A51404b22487P8165B68119q9889L5145r0946
10375A22429F0430L59901j61404h0370D35529A70472M1156K94457k37133q5459
$$ plain form
10365 183493 689208 213323 127145 213329 24767 201923 56392 353358 253414 356902
10355 356902 -29832 96961 170533 16402 584335 686334 334297 146009 411707 702594
10345 702594 471369 313862 272238 97121 301930 98952 240244 135785 432008 84689
10334 262506 252458 -90209 -42431 -2298 -70022 62000 217419 -129284 -217577 376942 -56775
10322 232468 148532 159480 137818 -193588 145604 -300951 -94594 481352 167636 194601
10312 194601 186429 369107 158233 -86766 33544 70461 223239 223466 198896 -199145 -293889
10301 -293889 197894 -160397 215027 90663 110280 -204931 34075 59242 68640 -58741 11501
10289 -313951 -65016 -258505 -42455 -257095 21675 394084 20315 -135234 107956 180997
$$ packed form
10365A83493N05715B13323q6178Q6184B4767J77156E6392K96966r9944J03488
10355C56902b9832I6961P3572A6402N67933J01999C34297A46009K65698K90887
10345G02594k31225j57507m1624I7121K04809I8952J41292j04459K96223H4689
10334B62506j0048i0209d2431b298o7724F2000J55419a29284q8293C76942e6775
10322B32468q3936J0948k1662a93588A45604c00951i4594D81352A67636K6965
10312A94601q172J82678A58233h6766C3544L6917J52778K27k4570a99145r4744
10301b93889A97894a60397B15027I0663J9617b04931C4075K5167R398e8741A1501
10289c13951f5016j93489d2455k14640B1675L72409B0315a35234A07956P3041
$$ plain form
10279 180997 -166967 -147010 -26621 -166091 82537 -10123 -35091 -193044 35246 -120064 54230
10267 -214635 -164143 -150645 157559 281539 -24820 -240708 118738 10019 -5637 180181 254022
10256 254022 392278 312063 255962 391100 -6177 -116595 142275 -55748 145415 -181035
10245 37315 -220385 -133641 325356 215040 -174637 108510 195722 -120189 80340 -142960
10234 210645 -147383 192374 -53364 -142122 -471395 214054 -347230 352361 180562 -223283
10223 -148124 36658 133410 -124191 -2700 -154091 38687 45925 70478 -204669 -146195 159110
10211 -217545 85295 -137745 216139 81418 12253 -189784 32208 -60388 177019 -300343
10200 45082 173494 -536876 38796 -245169 -188143 -335374 -142615 285920 87393 -139041
$$ packed form
10279A80997a66967J9957b6621j39470H2537a0123k4968j57953C5246a20064E4230
10267b14635N0492J3498A57559J23980b4820k15888A18738A0019e637A80181P3841
10256B54022J38256q0215n6101J35138f177j10418A42275e5748A45415a81035
10245C7315b20385Q6744C25356j10316a74637A08510Q7212a20189H0340a42960
10234B10645a47383A92374e3364q8758l29273B14054c47230C52361j71799b23283
10223a48124C6658R6752a24191b700j51391C8687P238K4553b04669N8474A59110
10211b17545H5295a37745B16139H1418A2253a89784C2208f0388A77019c00343
10200D5082J28412e36876C8796b45169N7026j47231a42615B85920H7393a39041
$$ plain form
10189 224926 -310729 34018 94716 111754 -118776 -96553 207286 -116654 -273666 -31046
10178 -79202 -98770 -30700 158253 -183005 16223 -267769 15074 -251805 -197278 -243713 130678
10166 -30713 107699 122317 139329 -189556 -132405 -185994 -209227 -255421 -111395 -192754 -79297
10154 -298952 159870 -82904 -66872 84203 -95947 171882 -211774 -197938 126920 -180220
10143 -216736 -13166 -5365 -416568 -136327 9589 -475823 -306648 -27327 -178144 -161234 140160
10131 63847 131939 238653 -241176 -98869 -440629 -49816 -214782 269614 -129705 -300111
10121 -300111 110751 -218126 26694 -209524 -148272 -93604 -65899 -316100 28151 -95119 33419
10109 163352 33450 -141745 -88341 66170 -161934 -38124 -69623 51931 -7899 58740 71674
$$ packed form
10189B24926c10729C4018O0698J7038a18776K2223B07286a16654j57012c1046
10178g9202j9568c0700A58253a83005A6223b67769A5074b51805N4527m6435A30678
10166c0713A07699J4618J7012a89556N7151n3589k3233m6194a11395q1359g9297
10154b98952A59870h2904J6032H4203i5947A71882b11774J3836A26920a80220
10143b16736a3166e365m11203a36327I589d75823J69175b7327j50817J6910A40160
10131F3847O8092J06714b41176i8869l41760d9816j64966B69614a29705j70406
10121c00111A10751b18126B6694b09524O1252N4668K7705k50201B8151i5119C3419
10109A63352C3450a41745N3404F6170a61934c8124l1499E1931g899E8740J2934
$$ plain form
10098 71674 -294364 -246369 -58536 62899 -61295 -200772 -69061 83143 -210443 -56694 -2504
10086 -253748 -319786 -29490 -138686 -398991 -91094 190048 -100027 -135984 -354355 -195885
10076 -195885 -257627 -407956 -196165 -17943 -211948 150876 21444 -257523 2120 -77437 102212
10064 86469 -41252 111521 -218721 133640 -135374 -647541 169307 -244630 -391547 81228
10053 503322 1922 22168 16632 50498 134119 -423150 -28088 -282415 12010 -197563 -7349
10041 -53911 128719 82547 124294 286162 -63152 -97937 -97017 -121955 35443 -237169 -86511
10029 -6533 -201031 -34821 535508 -288374 -71830 228534 -187349 43567 -25295 -51289 8506
10017 5672 -93976 32742 -49728 153961 -320079 -174373 -100487 87689 -57195 166271 -62959
$$ packed form
10098G1674b94364M7995e8536F2899f1295j39477f9061H3143b10443e6694b504
10086b53748o6038b9490j09196k60305i1094A90048a00027l5957k18371J58470
10076a95885o1742j50329a96165a7943j94005A50876B1444b57523B120g7437A02212
10064H6469d1252A11521b18721A33640a35374n12167A69307b44630j46917H1228
10053E03322A922K0246n536L3866Q3621d23150b8088k54327A2010a97563g349
10041e3911A28719m6172M1747J61868f3152l4785R20k4938C5443b37169h6511
10029f533j94498c4821E35508b88374g1830B28534a87349D3567b5295k5994H506
10017E672i3976C2742d9728A53961c20079J45706P3886H7689e7195A66271f2959
$$ plain form
10005 -10932 -110911 183109 -70860 -146522 -278060 -49473 -26136 -115307 55306 131428 -546648
9993 -63649 -97123 11431 25339 -71042 -309938 -391103 143237 -353907 -372484 -20996 -154525
9982 -154525 104541 -269920 -174216 -62320 1274 -75309 -295298 -8851 -179792 -207442 -170912
9971 -170912 -35605 -456113 212360 -55957 -291577 7581 112839 -119156 20549 122050 -127071
9959 -476344 -80440 -133102 -6695 -208311 -103341 128410 -79396 -212035 -206417 143125 -96344
9947 15541 72874 66084 89051 -109836 -25414 -258955 107761 74287 -241023 -98320 218756
9935 157176 -150640 -62531 139133 -212339 122772 -272616 -261951 210217 53937 -229727
9924 151189 -2124 -62466 23201 197026 39364 -1927 -371322 60401 -76967 -128884 45109 -80719
$$ packed form
10005a0932r9979A83109g0860p5662j31538d9473K3337q9171E5306P6122e46648
9993f3649l3474A1431J3908g1042k38896q1165A43237c53907j8577b0996j33529
9982a54525A04541b69920R5704f2320A274g5309k19989h851j70941k7650L6530
9971a70912c5605m20508B12360e5957k35620G581J05258a19156B0549J01501a27071
9959d76344h0440n2662f695k01616a03341A28410g9396j32639N618A43125i6344
9947A5541N7333o790K2967a09836b5414k33541A07761l3474b41023i8320B18756
9935A57176a50640f2531A39133b12339A22772b72616J0665B10217E3937b29727
9924A51189b124o0342B3201J73825C9364a927l69395F0401g6967n1917D5109h0719
$$ plain form
9911 -140532 -105685 222958 20255 77220 -276578 -153908 45360 50076 -65085 74215 -136177
9899 -315122 -112577 -129093 -381909 -182401 -581284 -35642 -279258 -226357 332530 121097
9888 -180051 51675 -34662 -167149 11659 -402646 -233681 -114956 -62139 -113251 236792 -126348
9876 -272427 -59193 26126 -49908 -298701 80614 235136 15042 -404320 191608 -127023 -40403
9864 -254225 -16048 200349 78841 81026 85754 -284685 112647 52200 -342192 -182771 75454
9852 -138160 397780 -69835 -383981 199596 51358 34545 -115479 31038 226341 69004 -91663
9840 -577925 14763 -54637 -347027 -149236 -174022 173082 -156353 -484920 -115149 -71652
9830 -71652 88424 -124613 61390 -165958 124188 -35562 -78784 -261178 -238537 -387796 282646
$$ packed form
9911a40532L4847B22958B0255N6965b76578J22670D5360M716f5085G4215a36177
9899c15122a12577j6516k52816a82401l98883c5642k43616N2901C32530A21097
9888a80051E1675c4662j32487A1659d02646J68965a14956N2817n1112B36792a26348
9876b72427e9193B6126d9908k48793H0614J54522A5042d04320A91608a27023d0403
9864b54225a6048B00349G8841K185M728b84685A12647E2200c42192J59421G5454
9852a38160C97780f9835l14146A99596E1358j6813a15479C1038J95303F9004i1663
9840e77925A4763e4637k92390a49236k4786A73082a56353l28567a15149M3497
9830g1652H8424a24613F1390a65958A24188c5562m3222j82394K2641j49259B82646
$$ plain form
9818 139411 2568 30529 -409020 -197439 -153668 -231228 -24079 134835 225023 -227182 -171089
9807 -171089 -244144 -115970 -383961 -94812 -6607 -353429 -45561 101922 -96935 188643 -32585
9795 236639 -15774 29746 -49315 7447 -88768 -290105 24384 -14126 -218051 33654 -171272
9783 -240541 187748 -110931 -39640 -172541 -193538 -121779 160091 383598 -139603 -38899
9772 -82365 -151476 -295202 100356 153266 116413 76126 -57501 -166964 -56576 115245 14986
9760 -484323 91065 46498 -208676 -97890 37598 -46076 72357 -248469 -36770 -44644 -299900
9749 -299900 -303966 -174261 255000 207796 -178178 187152 -256575 -33143 -213138 3935 39536
9738 39536 84886 8620 23682 -192880 26712 -47900 -231722 72316 -113687 -80019 -322454
$$ packed form
9818A39411B568K7961d09020a97439M3771p7560b4079A34835R0188b27182N6093
9807a71089p3055a15970k67991i4812f607l46822d5561A01922i6935A88643c2585
9795B36639a5774B9746d9315G447h8768k01337B4384a4126k03925C3654a71272
9783b40541A87748a10931c9640j32901k0997P1759A60091K23507a39603c8899
9772h2365o9111j43726A00356N2910l6853m0287e7501j09463e6576A15245A4986
9760d84323I1065m4567b08676i7890C7598d6076G2357b48469c6770p874k55256
9749b99900m066J29705B55000m7204a78178A87152b56575c3143j79995C935L5601
9738C9536M5350H620J5062a92880B6712d7900j83822G2316a13687L3668k42435
$$ plain form
9727 -322454 -259536 62919 156220 -8429 -124058 161730 22269 -155873 244608 46040 -62553
9715 -44112 -150757 161265 13694 102108 -63952 162180 95381 49003 5568 272185 -85607
9703 72929 163241 -269673 -28378 -64363 -129207 -108072 -50856 -110588 -209934 -81915 -27875 -209299
9691 -209299 122802 66152 83939 -119772 199265 -78156 -53257 -77479 439852 -21290 147763
9679 -178345 277337 -197736 -71857 -186243 55464 -113157 121106 35239 -108260 -147659
9669 -147659 -51783 -33707 -307960 87526 84299 -60522 -526683 -382782 -277154 342912 5353
9657 -337371 52465 31155 109516 -115312 -201748 -118632 84602 -256053 -73108 -74224 -184045
9646 -184045 -603 -24340 -12977 -71419 127639 143350 -125953 -23604 261347 -271790 -145565
$$ packed form
9727c22454O2918F2919R3301h429j15629A61730B2269a55873B44608D6040f2553
9715d4112j06645A61265A3694Q8414f3952A62180o6799m6378E568K66617h5607
9703G2929R0312b69673b8378l5985o4844K1135e0856n9732r9346h1915b7875j81424
9691b09299A22802n6650J7787a19772A99265g8156K4899k4222D39852b1290A47763
9679a78345B77337a97736g1857j14386E5464a13157A21106C5239a08260l9399
9669a47659e1783J8076k74253H7526l227f0522m66161J43901J05628C42912E353
9657c37371E2465k1310P8361a15312q6436Q3116H4602b56053g3108j116j09821
9646a84045f03k3737J1363n8442A27639J5711a25953b3604B61347b71790J26225
$$ plain form
9635 -145565 25458 65958 -126298 -218129 -150624 188594 -157992 -442142 -195209 -246972 204244
9623 106202 -414004 -163372 -10567 -34630 -112559 -68257 -204265 -290710 -250227 179163 -323249
9611 178816 -38781 141530 -116579 253 -56070 -177379 -79386 -166390 -217224 50207 -11817
9599 99314 211428 152076 88250 -90790 -270373 6234 -85815 -22351 138844 -168693 2942
9587 73779 99596 163261 2494 -148465 31156 -221992 -123215 -76478 68493 -336864 5458 -296509
9574 -397769 83092 103727 -287619 -113630 210466 430960 -139304 -84207 156446 105133
9564 105133 -262296 17576 26572 -85567 -621265 -418655 -100822 495912 -193166 138618
9553 -85051 66035 -299115 81222 34261 -227343 -101077 -136549 157168 124973 -363704 -6437
$$ packed form
9635a45565B5458M0500a26298r1831O7505A88594a57992k84150a95209n1763B04244
9623A06202d14004a63372a0567k4063p7929M4302j36008q6445M0483A79163c23249
9611A78816c8781A41530a16579B53e6070j21309g9386q7004n0834E0207a1817
9599I9314J12114n9352o3826i0790j79583F234h5815b2351A38844a68693B942
9587G3779K5817O3665B494a48465C1156b21992R8777M6737F8493c36864E458b96509
9574c97769H3092K0635b87619a13630B10466K20494a39304N5097A56446n1313
9564A05133b62296A7576Q996h5567n35698K02610a00822D95912a93166A38618
9553h5051F6035b99115H1222C4261b27343a01077l5472A57168l2195c63704f437
$$ plain form
9541 -90380 101274 -90844 74844 -208874 -306207 88773 -341029 -15862 -180412 -233081 77580
9529 -100398 166211 -41240 -2969 -265697 239361 -240464 40038 166248 -488788 -101877
9518 -351767 205603 -20240 -28992 -2219 -71777 -151661 -40011 23115 -141823 -165742 -48304 221691
9505 511320 -120917 -71344 49126 -185754 9565 22298 -306917 -181384 122621 151516 -309578
9493 -60281 28943 -164584 120213 44718 65268 69078 -151940 -298262 -117903 1404 228503
9482 228503 -112699 -286615 -131087 11196 -85562 107177 -263927 30453 99868 59059 139100
9471 139100 -63949 -194631 -49550 -358585 -37990 195660 -234822 -99195 -165354 37207 -12342
9459 -208309 93713 198077 -398038 56952 217640 -141332 50808 204418 198562 -235728 -79554
$$ packed form
9541i0380A01274i0844G4844b08874r7333H8773c41029a5862j64550n2669G7580
9529a00398A66211d1240b969k62728B39361b40464D0038J26210d88788a01877
9518c51767B05603b0240q752b219o9558p9884d0011B3115a41823k3919d8304B21691
9505E11320a20917M9573D9126a85754I565J2733c06917J25533A22621K8895c09578
9493f0281B8943a64584A20213D4718K0550L810a51940j46322a17903A404K27099
9482B28503a12699j73916a31087A1196h5562A07177b63927C0453O9415m0809Q0041
9471A39100f3949j30682d9550l09035c7990A95660b34822i9195o6159C7207a2342
9459b08309I3713J04364c98038E6952J60688a41332E0808J53610n856b35728g9554
$$ plain form
9447 -173941 97353 -211996 -401610 49476 119294 -189846 -55357 187306 -150804 -42349 -325305
9436 -325305 -15663 -356591 -17025 158977 -107975 -67376 2639 -176310 78857 43214 -40588
9424 -235933 206790 -332684 -89685 134740 -259246 -364668 -253065 -121040 -148641 142930
9413 -222228 139675 -204731 45850 -24199 -119282 -3050 -6045 18367 -280155 -102720 24575
9401 -247071 75228 -552 -182801 58740 26021 324257 91429 19704 -290766 236524 6707
9389 62241 -221263 -211799 -99136 -293841 27924 -258253 27777 114080 96094 37447 -32406
9377 72809 105900 -113794 168180 107876 -193443 -134535 -178764 -217057 -16646 -311698 -203997
9366 -203997 184000 -167116 247816 -108786 -253438 276846 -58592 143220 -125095 1383
$$ packed form
9447a73941I7353b11996j89614D9476O9818a89846e5357A87306a50804d2349k82956
9436c25305a5663l40928a7025A58977a07975M0599B639a76310G8857l5643d0588
9424b35933B06790c32684h9685A34740b59246j05422J11603a21040k7601A42930
9413b22228A39675b04731D5850b4199r5083c050k995A8367b80155a02720B4575
9401b47071G5228e52j82249E8740B6021K98236I1429A9704b90766B36524F707
9389F2241b21263R464i9136j94705B7924b58253B7777Q6303j7986C7447c2406
9377G2809L3091a13794A68180o0304a93443N8908m4229l8293a6646k95052J07701
9366b03997A84000a67116B47816a08786j44652B76846e8592A43220a25095A383
$$ plain form
9355 -40790 -252303 -161488 58072 -842 -20756 -196268 -3851 338420 40618 -79136 -51124 -136665
9343 -136665 -265672 152022 -351776 221975 -303875 -4752 150060 -161707 -237862 2562 -157031
9331 20085 -65805 256348 -171260 -1223 183573 -405296 -3545 235201 -92503 -243741 -156487
9320 -156487 -245316 -63093 -285195 -55512 -183235 -129478 175166 -19754 -374699 234839 -159446
9308 -159815 -92083 5430 -45625 -107756 -219702 -395572 -285099 -88175 -67854 81630 149994
9297 149994 -198329 -75091 -350149 -68477 71309 7286 -51793 -278710 -223158 -35449 -47808
9286 -47808 -48411 -115348 219290 -106725 -257287 -256268 141747 -23437 -273247 191226 227750
9275 227750 -108994 -275 -3011 -278329 -83941 33931 57425 -23469 -90514 -148603 61805 127952
$$ packed form
9355d0790k11513R0815E8072h42j9914j75512c851C38420D0618g9136K8012q5541
9343a36665j29007A52022c51776B21975c03875d752A50060a61707p6155B562a57031
9331B0085f5805B56348a71260a223A83573d05296c545B35201i2503j51238Q7254
9320a56487q8829f3093k22102e5512j27723N3757A75166a9754l54945B34839a59446
9308a59815O7732E430d5625o2131j11946j75870J10473h8175K0321H1630O8364
9297A49994a98329g5091k75058f8477G1309G286e1793k26917N5552c5449j2359
9286d7808o03o6937B19290a06725j50562J019A41747b3437k49810A91226L6524
9275B27750a08994b75k736k75318h3941C3931K3494b3469o7045n8089F1805O6147
$$ plain form
9263 127952 52177 -35425 61860 -151693 185816 -447207 -60735 -179915 -111772 182184 159672
9252 159672 90547 -2736 -184277 113232 -200697 144477 -59819 140562 -379191 162455
9241 181676 34090 -162463 79298 -376235 170799 -219147 -90808 34351 -215249 60407 -228497
9229 -93531 28586 94799 -350899 123641 -42612 -190801 128628 -548519 -164049 16959 36719
9218 36719 109682 39805 98740 192880 -8223 -427528 -516165 128071 28198 316058 -13377
9206 -271339 -114815 372630 -106786 113585 26734 4484 -47160 103443 159637 51418 -284882
9194 17119 -28278 202052 193467 -181755 115966 -350196 -385603 -166859 -224598 24751 -159924
9182 -238761 -365304 -75587 102155 -144790 -56892 -99872 223879 -266521 56554 206488
$$ packed form
9263A27952E2177c5425F1860a51693A85816d47207f0735j19180O8143A82184k2512
9252A59672o9125b736j81541A13232b00697A44477e9819A40562c79191A62455
9241A81676C4090a62463G9298c76235A70799b19147i0808C4351b15249F0407b28497
9229i3531B8586O6213c50899A23641d2612j48189A28628e48519a64049A6959J9760
9218C6719P2963C9805N8935R4140h223m19305q8637A28071B8198K87860a3377
9206b71339a14815C72630a06786A13585B6734D484d7160A03443N6194E1418b84882
9194A7119b8278B02052q585a81755A15966c50196l5407a66859n7739B4751a59924
9182b38761j26543g5587A02155a44790e6892m2980B23879b66521E6554J49934
$$ plain form
9172 206488 -102823 -388824 -95138 -111047 132868 -268580 46094 42715 -36227 -170592 -111006
9161 -111006 166854 -2026 207923 40174 -28893 -72621 229209 -41017 -6050 19296 138032
9150 138032 -191429 159427 -309394 -84796 25843 -175449 61527 43875 -292512 230268
9139 -179082 -120882 30540 -269014 -215218 14411 77757 -11303 156161 -32449 -257104 -188777
9128 -188777 487225 -46439 68849 -151207 120429 -91669 -258780 25474 245291 -8777 460023
9116 37037 12557 110400 201875 -251776 434844 -247750 298640 70392 146650 114961 -130608
9104 7528 -6653 -74555 283746 -103862 -79884 67138 -266842 -242043 -348277 -277475 -8387 346941
9091 38478 -199485 180085 -223885 53614 57003 57697 96122 -142170 -183561 -15724 -123686
$$ packed form
9172B06488a02823k86001i5138j5909A32868b68580D6094l379c6227j34365N9586
9161a11006A66854b026B07923D0174b8893m3728B29209d1017f050A9296J18736
9150A38032a91429A59427c09394h4796B5843a75449F1527j7652b92512B30268
9139a79082N8200C0540b69014N3796A4411O3346a1303A56161c2449k24655O8327
9128a88777D87225d6439F8849a51207A20429i1669j67111B5474K19817h777D60023
9116C7037A2557R7843R1475b51776D34844b47750B98640G0392P6258l1689a30608
9104G528f653o7902B83746a03862K3978F7138b66842K4799j06234P0802h387C46941
9091C8478a99485A80085b23885E3614L389O94L8425a42170m1391a5724j07962
$$ plain form
9080 -123686 66915 14780 96650 90744 -193952 -356081 -303827 -45907 -464053 7180 -96120
9068 -196411 27209 -305805 -230137 -135000 203592 -3529 139764 -184756 43345 -187599 155008
9056 -48950 -217026 48564 73798 -65458 81217 89811 -283632 -172464 -140033 -79114 -252507
9045 -252507 -325525 -44639 196817 -173683 -222139 -28844 -189406 -314366 58648 172889 112401
9034 112401 -6537 132657 21592 101837 -54935 -100227 -196070 120536 -516087 105934 -407216
9022 28165 -97201 -3193 -79865 -203005 -231133 -219375 -144574 -304478 -104294 -294467 -79691
9010 -198213 10206 -197729 90742 -148048 -222913 -221622 -302927 -116988 -224924 -428499 -89092
8998 258165 29621 8901 -240251 -9605 -351522 22967 110295 -275573 222120 154462 -85822
$$ packed form
9080a23686F6915A4780Q1870n906a93952j62129N2254d5907m18146G180i6120
9068a96411B7209c05805P5668R5137B03592c529A39764a84756D3345a87599A55008
9056d8950j68076D8564K5234f5458H1217Q594b83632J11168L2431O0919j73393
9045b52507p3018d4639A96817a73683m8456b8844j60562j24960E8648J14241o0488
9034A12401f537A32657B1592Q0245e4935m5292r5843A20536e16087A05934d07216
9022B8165i7201c193p6672j23140k8128J1758P4801j59904a04294j90173g9691
9010a98213A0206a97729I0742a48048p4865J291q1305a16988j07936k03575h9092
8998B58165B9621H901b40251i605l41917B2967Q7328b75573B22120o7658h5822
$$ plain form
8986 165985 -97126 56536 -403215 -17471 188332 -51133 -338247 63307 63650 -82034 -38043
8974 18236 1634 104443 -34421 50321 -402669 -64690 103234 206875 77555 89550 223552
8963 223552 -163755 -328814 12242 -422739 -19108 82598 187557 43052 -346366 103388
8952 -133191 -152492 -20162 -115930 -42443 106070 -59000 -180409 -60638 39051 -37386 114376
8940 1202 171145 37851 93501 262245 -222925 171747 -32165 -75030 361098 -216298 62467
8928 -104449 -53341 -131844 31948 51404 473134 1328967 2972391 8085343 4820713 829749
8917 224958 147013 100186 -88248 13861 -403228 70988 259596 136226 71589 62278 144041
8906 144041 55884 216360 -170016 151440 -111981 -194217 107744 -5700 213067 -208654
$$ packed form
8986A65985i7126E6536d03215a7471A88332e1133k87114F3307L43h2034c8043
8974A8236A634J02809c4421E0321d02669f4690A03234J03641G7555J1995J34002
8963B23552a63755j65059A2242d22739a9108H2598J04959D3052c46366A03388
8952a33191j9301b0162r5768d2443A06070e9000j21409f0638C9051c7386A14376
8940A202J69943C7851N5650J68744b22925A71747c2165m2865C61098b16298F2467
8928a04449N1108p8503C1948J9456M21730Q55833J643424N112952l264630H29749
8917B24958p7945m6827h8248A3861d03228G0988J88608j23370o4637r311Q1763
8906A44041E5884J60476a70016A51440a11981q2236A07744e700B13067b08654
$$ plain form
8895 -406776 -71728 333964 -213305 -1661 25963 -235185 -182955 -69630 -165509 -213860 -125983
8884 -125983 -87886 -162708 -72011 -194582 -227053 327417 97751 198882 13201 -143215 -169899
8873 -169899 95261 -166875 -134901 231055 -166250 -147349 -307241 81919 324117 43675 118830
8862 118830 185300 279420 -14392 170613 129286 198516 -255832 -474958 72153 -26937 104465
8850 -365 -193915 -36041 61722 7236 -42106 -42991 226035 -39780 -167168 -172381 359947 -212929
$$ packed form
8895d06776g1728C33964b13305a661B5963b35185N2230f9630r5879m8351Q7877
8884a25983L8097p4822g2011j22571l2471C27417I7751J01131A3201a43215k6684
8873a69899I5261a66875L1974B31055a66250J8901j59892H1919K42198D3675P5155
8862A18830O6470R4120a4392A70613m1327O9230b55832k19126G2153b6937A04465
8850c65j93550c6041F1722G236d2106q85B26035c9780j27388n213C59947b12929
$$ [...]
##END NTUPLES=NMR SPECTRUM
##END=
