
##TITLE=AC1169_Tolima-ibage-TGAAH12004_6672652_X3OlbKJwfa
##JCAMPDX= 6.0         $$ Bruker NMR JCAMP-DX V2.0
##DATA TYPE= NMR SPECTRUM
##DATA CLASS= NTUPLES
##ORIGIN= BRUKER
##OWNER= Administrator
$$ 1.72 TOPSPIN		Version 2.1
$$ 2012-12-12 00:48:48.568 -0500  Administrator@X
$$ Compression mode = diff/dup
##.OBSERVE FREQUENCY= 400.02188249412
##.OBSERVE NUCLEUS= ^1H
##.ACQUISITION MODE= SIMULTANEOUS (DQD)
##.ACQUISITION SCHEME= undefined
##.AVERAGES= 64
##.DIGITISER RES= 22
##SPECTROMETER/DATA SYSTEM= spect
##.PULSE SEQUENCE= noesygpps1d.comp
##.SOLVENT NAME= COFFEE_meoh
##.SHIFT REFERENCE= INTERNAL, COFFEE_meoh, 1, 14.96125
##AUDIT TRAIL= $$ (NUMBER, WHEN, WHO, WHERE, PROCESS, VERSION, WHAT)
$$ ##TITLE= Audit trail, TOPSPIN		Version 2.1
$$ ##JCAMPDX= 5.01
$$ ##ORIGIN= Bruker BioSpin GmbH
$$ ##OWNER= Administrator
$$ $$ E:\/data/COFFEE/nmr/AC1169_Tolima-ibage-TGAAH12004_6672652_X3OlbKJwfa/22/pdata/1/auditp.txt
$$ ##AUDIT TRAIL=  $$ (NUMBER, WHEN, WHO, WHERE, PROCESS, VERSION, WHAT)
(   1,<2012-12-12 00:48:42.396 -0500>,<Administrator>,<X>,<go>,<TOPSPIN 2.1>,
      <created by zg
	started at 2012-12-12 00:37:12.521 -0500,
	POWCHK enabled, PULCHK disabled,
       configuration hash MD5:
       86 BA 57 50 F2 9D 5C 9B 26 00 A9 28 5F 66 2E 89
       data hash MD5: 64K
       1D AD F6 F8 FE 86 8D 17 04 9A 3D E5 47 75 E3 AE>)
(   2,<2012-12-12 00:48:45.552 -0500>,<Administrator>,<X>,<proc1d>,<TOPSPIN 2.1>,
      <Start of raw data processing
       efp LB = 0.3 FT_mod = 6 PKNL = 1 PHC0 = 0 PHC1 = 0 SI = 128K 
       data hash MD5: 128K
       9E 71 F6 49 74 44 D0 E0 7A 99 41 1F B2 66 6B 16>)
(   3,<2012-12-12 00:48:46.724 -0500>,<Administrator>,<X>,<proc1d>,<TOPSPIN 2.1>,
      <pk PHC0 = -81.55701 PHC1 = 0 
       data hash MD5: 128K
       57 89 80 B1 F8 3F 1B 9B 13 15 48 3A 59 45 31 62>)
(   4,<2012-12-12 00:48:47.505 -0500>,<Administrator>,<X>,<proc1d>,<TOPSPIN 2.1>,
      <abs ABSG = 1 
       data hash MD5: 128K
       A9 AD AB 77 F2 7E E1 D7 0C 6F B8 38 4F 7A 14 AB>)
(   5,<2012-12-12 00:48:47.693 -0500>,<Administrator>,<X>,<proc1d>,<TOPSPIN 2.1>,
      <abs ABSG = 2 
       data hash MD5: 128K
       C7 41 94 7B 79 A5 E1 60 9B EA 63 4F 8B 66 EC B8>)
(   6,<2012-12-12 00:48:47.865 -0500>,<Administrator>,<X>,<proc1d>,<TOPSPIN 2.1>,
      <abs ABSG = 3 
       data hash MD5: 128K
       8B 88 CA 3E 56 59 B3 B3 B7 AB E2 A2 F8 AB 5B 62>)
(   7,<2012-12-12 00:48:48.052 -0500>,<Administrator>,<X>,<proc1d>,<TOPSPIN 2.1>,
      <abs ABSG = 4 
       data hash MD5: 128K
       31 CE CB 20 36 AF 0A 9E EA 5D CD 6A 8E BF F4 DF>)
(   8,<2012-12-12 00:48:48.224 -0500>,<Administrator>,<X>,<proc1d>,<TOPSPIN 2.1>,
      <abs ABSG = 5 
       data hash MD5: 128K
       81 F0 06 F4 43 61 DC D7 DC 6D 7B EA 29 3A AE F1>)
$$ ##END=
$$ 
$$ $$ hash MD5
$$ $$ D0 2E 1A 03 29 E2 41 97 5A 72 8B C5 AA 9D DC CC
##$RELAX= 
##$RELAX= 
##$RELAX= 
##$RELAX= 
##$RELAX= 
##$RELAX= 
##$RELAX= 
##$RELAX= 
##$RELAX= 
$$ Bruker specific parameters
$$ --------------------------
$$ [...]
##$TP07= 0
##$TPNAME0= <>
##$TPNAME1= <>
##$TPNAME2= <>
##$TPNAME3= <>
##$TPNAME4= <>
##$TPNAME5= <>
##$TPNAME6= <>
##$TPNAME7= <>
##$TPOAL= (0..7)
0.5 0.5 0.5 0.5 0.5 0.5 0.5 0.5
##$TPOFFS= (0..7)
0 0 0 0 0 0 0 0
##$TUNHIN= 0
##$TUNHOUT= 0
##$TUNXOUT= 0
##$USERA1= <user>
##$USERA2= <user>
##$USERA3= <user>
##$USERA4= <user>
##$USERA5= <user>
##$V9= 5
##$VALIST= <valist>
##$VCLIST= <CCCCCCCCCCCCCCC>
##$VD= 0
##$VDLIST= <DDDDDDDDDDDDDDD>
##$VPLIST= <PPPPPPPPPPPPPPP>
##$VTLIST= <TTTTTTTTTTTTTTT>
##$WBST= 2048
##$WBSW= 25
##$XGAIN= (0..3)
0 0 0 0
##$XL= 0
##$YL= 0
##$YMAX_a= 5874408
##$YMIN_a= -12144299
##$ZGOPTNS= <>
##$ZL1= 120
##$ZL2= 120
##$ZL3= 120
##$ZL4= 120
##$ABSF1= 14.96125
##$ABSF2= -5.596931
##$ABSG= 5
##$ABSL= 3
##$ALPHA= 0
##$AQORDER= 0
##$ASSFAC= 0
##$ASSFACI= 0
##$ASSFACX= 0
##$ASSWID= 0
##$AUNMP= <proc_prof1d_extract.lims>
##$AXLEFT= 0
##$AXNAME= <>
##$AXNUC= <1H>
##$AXRIGHT= 0
##$AXTYPE= 0
##$AXUNIT= <>
##$AZFE= 0.1
##$AZFW= 0.1
##$BCFW= 0
##$BC_mod= 0
##$BYTORDP= 0
##$COROFFS= 0
##$CY= 15
##$DATMOD= 1
##$DC= 0
##$DFILT= <>
##$DTYPP= 0
##$F1P= 0
##$F2P= 0
##$FCOR= 0.5
##$FTSIZE= 131072
##$FT_mod= 6
##$GAMMA= 0
##$GB= 0
##$INTBC= 1
##$INTSCL= 1
##$ISEN= 128
##$LB= 0.3
##$LEV0= 0
##$LPBIN= 0
##$MAXI= 10000
##$MC2= 0
##$MEAN= 0
##$ME_mod= 0
##$MI= 0
##$NCOEF= 0
##$NC_proc= -2
##$NLEV= 6
##$NOISF1= 0
##$NOISF2= 0
##$NSP= 0
##$NTH_PI= 0
##$NZP= 0
##$OFFSET= 14.96125
##$PC= 1
##$PHC0= -81.55701
##$PHC1= 0
##$PH_mod= 1
##$PKNL= yes
##$PPARMOD= 0
##$PPDIAG= 0
##$PPIPTYP= 0
##$PPMPNUM= 2147483647
##$PPRESOL= 1
##$PSCAL= 4
##$PSIGN= 0
##$PYNMP= <proc.py>
##$REVERSE= no
##$SF= 400.02000953723
##$SI= 131072
##$SIGF1= 0
##$SIGF2= 0
##$SINO= 400
##$SIOLD= 131072
##$SPECTYP= <>
##$SREGLST= <1H.CDCl3>
##$SSB= 0
##$STSI= 131072
##$STSR= 0
##$SW_p= 8223.68421052631
##$SYMM= 0
##$S_DEV= 0
##$TDeff= 65536
##$TDoff= 0
##$TI= <>
##$TILT= no
##$TM1= 0
##$TM2= 0
##$TOPLEV= 0
##$USERP1= <user>
##$USERP2= <user>
##$USERP3= <user>
##$USERP4= <user>
##$USERP5= <user>
##$WDW= 1
##$XDIM= 131072
##$YMAX_p= 432144035
##$YMIN_p= -63967
##$CURPLOT= <Network HP LaserJet P1505>
##$CURPRIN= <$Network HP LaserJet P1505>
##$DFORMAT= <normdp>
##$LAYOUT= <+/1D_H.xwp>
##$LFORMAT= <normlp>
##$PFORMAT= <normpl>
##$SURQMSG= 1
$$ End of Bruker specific parameters
$$ ---------------------------------
##NTUPLES= NMR SPECTRUM
##VAR_NAME=  FREQUENCY,     SPECTRUM/REAL,   SPECTRUM/IMAG
##SYMBOL=    X,             R,               I
##VAR_TYPE=  INDEPENDENT,   DEPENDENT,       DEPENDENT
##VAR_FORM=  AFFN,          ASDF,            ASDF
##VAR_DIM=   131072,        131072,          131072
##UNITS=     HZ,            ARBITRARY UNITS, ARBITRARY UNITS
##FACTOR=    0.0627417313425164, 1,          1
##FIRST=     8223.62146879497, -1138,        -56525
##LAST=      0,             939,             -58113
##MIN=       0,             -63967,          0
##MAX=       8223.62146879497, 432144035,    0
$$ Real data points
##PAGE= N=1
##DATA TABLE= (X++(R..R)), XYDATA
$$ [...]
61723D94981J180J419J654J912J965J472M85k85j25O19O66n88k103k485j919j916
61707D96932l187m728n280m869m359m114l873l624l699m059m147l722l294l368
61693D40609l704l739l427l157k984k601k051j867k262k746k882k831k777k361
61679D01220j337m29o62j950l057k983j862m78M74O20J16k76J69J156J592R13
61663C93226k79j067j160p49p4N23N73On84n84m5N56R82J379J905K438K666K445
61645D02157K130K387L386M391M508L729K734J905J084K28m85j132j968k812l243
61630D18999l446l943m448m019k616j498j519k013j979j473j052o46M3O50O38
61615C91678L33M82R60Q54k07j591k551k974l137l244l354l439l474l561l853
$$ plain form
61723 494981 496161 497580 499234 501146 503111 504583 505068 504783 504658 505277 505943 505355 503252 500767 498848 496932
61707 496932 493745 489017 483737 478868 474509 470395 466522 462898 459199 455140 450993 447271 443977 440609
61693 440609 436905 433166 429739 426582 423598 420997 418946 417079 414817 412071 409189 406358 403581 401220
61679 401220 399883 399454 398792 396842 393785 390802 388940 388462 388936 389556 389672 389396 389565 390721 392313 393226
61663 393226 392947 391880 390720 389971 389897 390420 390993 390999 390415 389831 389786 390342 391324 392703 394608 397046 399712 402157
61645 402157 404287 406674 410060 414451 418959 422688 425422 427327 428411 428639 428154 427022 425054 422242 418999
61630 418999 415553 411610 407162 403143 400527 399029 397510 395497 393518 392045 390993 390347 390390 391040 391678
61615 391678 392011 392493 393453 394307 394100 392509 389958 386984 383847 380603 377249 373810 370336 366775 362922
61600C62922m199m143l543k931k871l229l325k770j817j018p27q40r63q56p29
61585C28961q65j090j031p63o86q11q01p16r65j432j465r25m31l36k64L4K40K49
61567C16903M48P71M69n75j283q81p5J10k00k76l2K56P46J551K084J925J710K093
61549C25744K495K070J271J108J323P89m38j036l95O66J377J925K574K985K818
61534C45276K171J170k8p42k61R09J299L48q97j350j246j327j556j455j160j314
61518C39837k025k616k395j389k21M65N20K56L4m6lJ58K86R6l56n62k83Pj12k55
61498C31396R7O04N71J59J31N31O28K52J70Q23J636J949J890J792J492P51o6l78
61480C44428k13q1k00k88j06J75K63J93K60M87M15k71j071j124l91K34K39K29
$$ plain form
61600 362922 358723 354580 351037 348106 345235 342006 338681 335911 334094 333076 332349 331509 330546 329690 328961
61585 328961 328096 327006 325975 325212 324526 323715 322914 322198 321233 319801 318336 317411 316980 316644 316380 316414 316654 316903
61567 316903 317351 318122 318591 318016 316733 315852 315777 315887 315687 315411 315379 315635 316381 317932 320016 321941 323651 325744
61549 325744 328239 330309 331580 332688 334011 334800 334362 333326 332931 333597 334974 336899 339473 342458 345276
61534 345276 347447 348617 348589 347847 347586 348495 349794 350142 349245 347895 346649 345322 343766 342311 341151 339837
61518 339837 337812 335196 332801 331412 331191 331656 332176 332432 332466 332420 332417 332575 332861 332957 332601 332039 331756 331763 331651 331396
61498 331396 331493 332097 332668 332827 332958 333489 334117 334369 334539 335362 336998 338947 340837 342629 344121 344872 344806 344428
61480 344428 344215 344134 343934 343646 343540 343715 343978 344171 344431 344918 345333 345062 343991 342867 342476 342710 342949 343178
61462C43178P99J374R43m15j637k070j971j713j296o47J44R53J522J400N57k55
61446C40866k89K31O45R62J561K153K084J563J515K161K772K892K802K615K079
61431C66612J558K016L511M696M459L264K283J930J919K072K331K449K353K426
61417D03879K878L211K837J902R61K20m36r44j159j242j449j659j546j123q02
61402D05528q65j117j073m47M62R59P24K83L75R42J212Q41L33K22L69L90L12L84
61384D09834N50M84J15k23j29L62O64J55r99j806j517m65N07J094J431J324N08
61367D11889n17q50m42j34k47q8Q37K032K803L133L256L188L137L746N223O827
61351D43793P787Q244Q744R205R099Q267P015N614M283L405L192L286L135K665
$$ plain form
61462 343178 343977 345351 346294 345879 344242 342172 340201 338488 337192 336545 336689 337642 339164 340564 341121 340866
61446 340866 340577 340808 341453 342415 343976 346129 348213 349776 351291 353452 356224 359116 361918 364533 366612
61431 366612 368170 370186 373697 378393 382852 386116 388399 390329 392248 394320 396651 399100 401453 403879
61417 403879 406757 409968 412805 414707 415668 415888 415452 414508 413349 412107 410658 408999 407453 406330 405528
61402 405528 404663 403546 402473 402026 402488 403447 404171 404454 404829 405771 406983 407824 408157 408379 408748 409138 409450 409834
61384 409834 410384 410868 410983 410760 410631 410993 411657 411812 410813 409007 407490 407025 407532 408626 410057 411381 411889
61367 411889 411372 410522 410080 409946 409699 409611 410448 412480 415283 418416 421672 424860 427997 431743 436966 443793
61351 443793 451580 459824 468568 477773 486872 495139 502154 507768 512051 515456 518648 521934 525069 527734
61337E27734K161J684R96l8j238k268k763k542j928j625j991k574k662k042j034
61322E09870l4O90R70Q98R23J510K670L964M889N246N282N539O364P559Q717R835
61306E74892J1216J2703J3543J3153J1696R684P399N048L018J621O51m44j996
61293F62184l836n506o656p327p779q050p890p322o974p343p964p873o757n124
61279E65783l423j728l06L10J24r4K20P64J044J155J472J983K367K578K975L930
61263E79154N460P116Q273Q760R086R742J0375J0093Q535O132L418P17j525k785
61249F62551l065k943k979l435m447n768o505n918m507l486l190k946k444k136
61235F08782k074j621p48l65p66q68K48K048L594M946O482P742Q019P542P066
$$ plain form
61337 527734 529895 531579 532575 532537 531299 529031 526268 523726 521798 520173 518182 515608 512946 510904 509870
61322 509870 509836 510526 511496 512394 513317 514827 517497 521461 526350 531596 536878 542417 548781 556340 565057 574892
61306 574892 586108 598811 612354 625507 637203 646887 654286 659334 662352 663973 664624 664180 662184
61293 662184 658348 652842 646186 638859 631080 623030 615140 607818 600844 593501 585537 577664 570907 565783
61279 565783 562360 560632 560326 560636 560760 560666 560886 561650 562694 563849 565321 567304 569671 572249 575224 579154
61263 579154 584614 591730 600003 608763 617849 627591 637966 648059 656594 662726 666144 666861 665336 662551
61249 662551 659486 656543 653564 650129 645682 639914 633409 627491 622984 619498 616308 613362 610918 608782
61235 608782 606708 605087 604339 603974 603208 602340 602588 604636 608230 613176 619658 627400 635419 642961 650027
61220F50027O761O464O493P175P968Q024P454P045O967O686O034N438N064M558
61206G42158L818L284L396M184N511P253R226J1254J3285J5186J6646J7535J8134
61193H70870J8607J8540J7362J5053J2117R134O547M500K542M5k756m704n197
61180I62660n167n873p321q682r698j0741j1784j2391j2645j3124j3889j4321
61168H37024j4172j4015j4362j4932j5048j4409j3265j2124j1344j0767r798q096
61156F84692o065m296k743r20J204L023M072M543M842M990M612L413J504p16k838
61141F99317m523n314m762l043j154J15J230L233O070Q521R929J0992J2445J3952
61127G47008J5007J6108J8092K0834K3456K5498K7165K8716L0249L1773L3035
$$ plain form
61220 650027 656788 663252 669745 676920 684888 692912 700366 707411 714378 721064 727098 732536 737600 742158
61206 742158 745976 749260 752656 756840 762351 769604 778830 790084 803369 818555 835201 852736 870870
61193 870870 889477 908017 925379 940432 952549 961683 968230 972730 975272 975317 972561 967857 962660
61180 962660 957493 951620 944299 935617 925919 915178 903394 891003 878358 865234 851345 837024
61168 837024 822852 808837 794475 779543 764495 750086 736821 724697 713353 702586 692788 684692
61156 684692 678627 674331 671588 670668 671872 674895 678967 683510 688352 693342 697954 701367 702871 702155 699317
61141 699317 694794 689480 684718 681675 680521 680636 681866 685099 691169 699690 709619 720611 733056 747008
61127 747008 762015 778123 796215 817049 840505 866003 893168 921884 952133 983906 1016941
61116A016941L3593L3558L3713L4378L4740L3991L2486L1051K9772K8356K6998
61105A369577K5858K4185K1191J7466J4236J1487Q129M028M60j735l210m878o701
61092A480093q273r683j1089j2098j2291j1974j1803j1908j1903j1632j1455j1848
61080A344136j2905j4233j5157j5131j4164j2938j2357j2764j3594j3989j3881
61069A193023j4041j4836j5372j4611j2987j1956j1995j2121j1521j0562r730
61058A053291q762p396n993m657k793l87J282J388J170K497N363Q039R434J0056
61044A062532J0807J1915J3171J4378J5426J6401J7508J8635J9409J9964K0895
61033A241041K2122K2760K2784K3618K6087K8954L0711L1702L3052L4508L5197
$$ plain form
61116 1016941 1050534 1084092 1117805 1152183 1186923 1220914 1253400 1284451 1314223 1342579 1369577
61105 1369577 1395435 1419620 1440811 1458277 1472513 1484000 1492129 1496157 1496617 1494882 1491672 1486794 1480093
61092 1480093 1471820 1462137 1451048 1438950 1426659 1414685 1402882 1390974 1379071 1367439 1355984 1344136
61080 1344136 1331231 1316998 1301841 1286710 1272546 1259608 1247251 1234487 1220893 1206904 1193023
61069 1193023 1178982 1164146 1148774 1134163 1121176 1109220 1097225 1085104 1073583 1063021 1053291
61058 1053291 1044529 1037133 1031140 1026483 1023690 1023303 1024585 1025973 1027143 1029640 1035003 1043042 1052476 1062532
61044 1062532 1073339 1085254 1098425 1112803 1128229 1144630 1162138 1180773 1200182 1220146 1241041
61033 1241041 1263163 1285923 1308707 1332325 1358412 1387366 1418077 1449779 1482831 1517339 1552536
61022A552536L5776L7903M2029M7475N4245O2960P3171Q3714R4714J07684J23777
61011B315984J43600J68527K00437K40335K88880L47777M18588N00961N94945
61002E220034P05055Q39410J004941J205327J439215J689272J907571K020833
60994A6031658J965443J725929J341639Q81550M20562L5905j97372k37538j17376
60985B1850400N2716J39327N7500j99717n84923j031837j467322j811984j998847
60976A5005313k005568j865442j642204j393979j156802r48498p75508o35707
60968D581605n22398m29920l55241k95564k47596k09232j79503j56588j37860
60959B047703j21923j08710r7528q6872p6228o6404n7877n0336m3858l8948l5308
$$ plain form
61022 1552536 1588312 1626215 1668244 1715719 1769964 1832924 1906095 1989809 2084523 2192207 2315984
61011 2315984 2459584 2628111 2828548 3068883 3357763 3705540 4124128 4625089 5220034
61002 5220034 5925089 6764499 7769440 8974767 10413982 12103254 14010825 16031658
60994 16031658 17997101 19723030 21064669 21946219 22366781 22402686 22205314 21967776 21850400
60985 21850400 21903116 22042443 22099943 21900226 21315303 20283466 18816144 17004160 15005313
60976 15005313 12999745 11134303 9492099 8098120 6941318 5992820 5217312 4581605
60968 4581605 4059207 3629287 3274046 2978482 2730886 2521654 2342151 2185563 2047703
60959 2047703 1925780 1817070 1719542 1632670 1556442 1490038 1432161 1381825 1337967 1299019 1263711
60948A263711l2122k9679k9102l0231l1309l1220l0579l0071k9140k7120k4594
60937I38544k2736k1942k1736k1509k0861j9663j8134j6606j5116j3612j2407
60926G34222j1810j1392j0378q775p366o577o129n854n957o233n924m736l407
60913F39684k823l031l420l442k937k088j300q82p84q50j216k084l250m273m985
60898F02319n468n712n802o139o875p410p109o336o000o221o299n891n339m808
60884E16910m106l420l310l662l597k799k079k102k354k003j200q09j177j757
60870D82535j746p60R38K528L227L018K675K867L520M149M466M419M062L622L416
60855E22936L435L268K634J696P12k26q51o82L04J290J388N86m61j383k384l742
$$ plain form
60948 1263711 1231589 1201910 1172808 1142577 1111268 1080048 1049469 1019398 990258 963138 938544
60937 938544 915808 893866 872130 850621 829760 810097 791963 775357 760241 746629 734222
60926 734222 722412 711020 700642 691867 684501 677924 671795 665941 659984 653751 647827 643091 639684
60913 639684 636861 633830 630410 626968 624031 621943 620643 619761 618977 618127 616911 614827 611577 607304 602319
60898 602319 596851 591139 585337 579198 572323 564913 557804 551468 545468 539247 532948 527057 521718 516910
60884 516910 512804 509384 506074 502412 498815 496016 493937 491835 489481 487478 486278 485469 484292 482535
60870 482535 480789 480029 480967 483495 486722 489740 492415 495282 498802 502951 507417 511836 515898 519520 522936
60855 522936 526371 529639 532273 533969 534681 534455 533604 532922 533226 534516 535904 536490 536029 534646 532262 528520
60839E28520n395p012q164q515q118p520p246p209o880o053n145m708m818n048
60825D36689m854l996k846k238k765l955m501l595j952j099j668k728l012k401
60811C95079j856k069k661k764k060r87j40L19O00Q41Q98N96P1l41m40j77N80
60794C85489J886L218L691L065K134J666J415P50j67n69k25M00R64J365J204J73
60778D06459r89j097l29k67j636l166l443k798k387k267j667o40n1j41k06K13
60762C85588P99J166J284J149P24K81J21m8p22j623j911j418q91o68j10J246K665
60745C87632L010K168J057M12J21k93j060k035k907l453l687l843m071m146l613
60730C65292k325p84K33N08O49J308K267K691K250J538J220J354J706K263K890
$$ plain form
60839 528520 523125 516113 507949 499434 491316 483796 476550 469341 462461 456408 451263 446555 441737 436689
60825 436689 431835 427839 424993 422755 419990 416035 411534 407939 405987 404888 403220 400492 397480 395079
60811 395079 393223 391154 388493 385729 383669 382682 382542 382861 383461 384302 385200 385796 385867 385526 385086 384909 385489
60794 385489 387375 390593 394284 397349 399483 401149 402564 403314 403147 402578 402353 402753 403717 405082 406286 406459
60778 406459 405470 404373 404044 403777 402141 398975 395532 392734 390347 388080 386413 385773 385722 385581 385375 385588
60762 385588 386387 387553 388837 389986 390710 390991 391112 391064 390342 388719 386808 385390 384499 383831 383721 384967 387632
60745 387632 390642 392810 393867 394279 394400 394107 393047 391012 388105 384652 380965 377122 373051 368905 365292
60730 365292 362967 362183 362416 362924 363573 364881 367148 369839 372089 373627 374847 376201 377907 380170 383060
60715C83060L034K301J065l2q82j604j820j087M4L59m43j239r72k3L75l15j526
60698C80295k452k764k507j766p46L8L9p39j615j896j598j209q58k03P94J505
60682C64318J445J025J033J586K123K294K318K544L069L814M531M713L928K322
60668D01063N03j103k407l236l257k482j524j024j046j219j274j189r54m93J12
60653C80470N58O80P98J408K475L234L030K121J348J068Q96L69n29j606k626l135
60637C90559k733j784j240j448j688j316p27n98p33m89Q0L37J74J76O61J238J418
60620C81887J069L11n37q41j16J250K212K165J449O79N6m78q01p04k28K51L22
60603C87946j22p36r78o36qN04P50P30M95L76Q22J687K044J314K08p5O13J272
$$ plain form
60715 383060 386094 388395 389460 389428 388546 386942 385122 384035 384079 384438 383995 382756 381784 381761 382136 381821 380295
60698 380295 377843 375079 372572 370806 370060 370098 370137 369398 367783 365887 364289 363080 362222 362019 362813 364318
60682 364318 365763 366788 367821 369407 371530 373824 376142 378686 381755 385569 390100 394813 398741 401063
60668 401063 401566 400463 398056 394820 391563 389081 387557 386533 385487 384268 382994 381805 380851 380358 380470
60653 380470 381028 381708 382506 383914 386389 389623 392653 394774 396122 397190 398086 398455 397926 396320 393694 390559
60637 390559 387826 386042 384802 383354 381666 380350 379623 379025 378292 377803 377883 378220 378394 378570 379231 380469 381887
60620 381887 382956 383267 382730 381889 381773 383023 385235 387400 388849 389528 389584 389106 388305 387601 387373 387624 387946
60603 387946 387824 387088 386110 385474 385466 385970 386720 387450 387945 388321 389143 390830 392874 394188 394396 394321 394934 396206
60585C96206J147N54K38N00J115J699J943J739J256P84N07N70J205K469L994N265
60569D21191O059O473O742P206Q168R455J0464J0917J1139J1246J0606Q693N964
60556E34323L217N37k306m745n815n467m546l511k147n88M31P23J121K331M031
60541E17589N542O727P807Q772R565J0455J1811J3673J5740J7582J8686J8602
60529F62551J7212J4654J1033O583K091j432l708n374p048q571r444r553r169
60516F59825q496p595o608n796n272m742l587j483J027K906L823M573N986P923
60502F42484R900J2174J5413J9636K4296K9164L4165L8585M1613M3657M5868M8046
60490A005001M8384M5772M1241L6266L0698K3399J4212M141o040j6307k6477l5714
$$ plain form
60585 396206 397353 397907 398145 398645 399760 401459 403402 405141 406397 407181 407688 408258 409463 411932 415926 421191
60569 421191 427250 433723 440465 447671 455839 465294 475758 486675 497814 509060 519666 528359 534323
60556 534323 537540 538077 535771 531026 525211 519744 515198 511687 509540 508952 509383 510106 511227 513558 517589
60541 517589 523131 529858 537665 546437 556002 566457 578268 591941 607681 625263 643949 662551
60529 662551 679763 694417 705450 712033 714124 712692 708984 703610 696562 687991 678547 668994 659825
60516 659825 651329 643734 637126 631330 626058 621316 617729 616246 617273 620179 624002 628575 634561 642484
60502 642484 652384 664558 679971 699607 723903 753067 787232 825817 867430 911087 956955 1005001
60490 1005001 1053385 1099157 1140398 1176664 1207362 1230761 1244973 1249114 1243074 1226767 1200290 1164576
60478A164576m3180m8651n2340n4447n5021n4010n1353m7192m2039l6661l1773
60467F47909k7772k4576k1766j9059j6637j4794j3320j1637r578p675o513o124
60455D68458o067n797m937l551k232j626j756k126k421k699k880k634j982j462
60441D26288j360j224n29M47Q24J84q36j181n24K80J16j060k128k152j361m62
60425D15322L41J125J558J307Q31Q46J270J528J682K195K716K349J212N27Q14
60410D35623J178Q50K94J84L13K73L08P10J115J172J256J757K249K173J745J498
60394D52698J459J517K015L064L843L549K720K573L283L900L815L355K926K466
60380D93183J946J628J593J601J581J820K525L552M598N266N083L984K730K234
$$ plain form
60478 1164576 1121396 1072745 1020405 965958 910937 856927 805574 758382 716343 679682 647909
60467 647909 620137 595561 573795 554736 538099 523305 509985 498348 488770 481095 474582 468458
60455 468458 462391 456594 451657 448106 445874 444248 442492 440366 437945 435246 432366 429732 427750 426288
60441 426288 424928 423704 423175 423622 424446 424630 423794 422613 422089 422369 422485 421425 419297 417145 415784 415322
60425 415322 415663 416788 418346 419653 420484 421330 422600 424128 425810 428005 430721 433070 434282 434809 435623
60410 435623 436801 437651 437945 438129 438442 438715 439023 439733 440848 442020 443276 445033 447282 449455 451200 452698
60394 452698 454157 455674 457689 460753 464596 468145 470865 473438 476721 480621 484436 487791 490717 493183
60380 493183 495129 496757 498350 499951 501532 503352 505877 509429 514027 519293 524376 528360 531090 533324
60366E33324K511K828K866L020L467L746L609L613M290N227N668N713O312P976
60352E94170J0121J1740J2384J2185J1302R661P152L838N5l593o441q174r079
60339F45321r652j0048j0108r788r221q374p116n690m647m105l619k957k525k608
60325E54863k779k627k517k926l432l148j956n48O84K043L834N965Q235J0437
60311E66128J2210J3350J4140J4742J4501J2661R611O560M134K280J370K032L569
60298F77288L950K075r22l340m986o828r283j1766j3536j4271j4051j3275j2375
60285E78680j1325r768p846o327n628n274m717m129l941m127m365m522m544m322
60271D97845l925l532k944j791m17K19j61p29q44q59j112j063k36O89P42R5k02
$$ plain form
60366 533324 535835 538663 541529 544549 548016 551762 555371 558984 563274 568501 574169 579882 586194 594170
60352 594170 604291 616031 628415 640600 651902 661563 668715 672553 672608 669015 662574 654400 645321
60339 645321 635669 625621 615513 605725 596504 588130 581014 575324 570677 566572 562953 559996 557471 554863
60325 554863 552084 549457 546940 544014 540582 537434 535478 534930 535614 537657 541491 547456 555691 566128
60311 566128 578338 591688 605828 620570 635071 647732 657343 663903 668037 670317 671687 673719 677288
60298 677288 681238 683313 682391 679051 674065 667237 657954 646188 632652 618381 604330 591055 578680
60285 578680 567355 557587 549741 543414 537786 532512 527795 523666 519725 515598 511233 506711 502167 497845
60271 497845 493920 490388 487444 485653 485236 485455 485294 484565 483721 482862 481750 480687 480451 481140 481882 481977 481775
60254D81775L71J481K633L485L714L251K455J632P07k30o62m34k36o21j115j103
60238D97103r21j186j491r62K38J056J165J302J878K328K188J947K272K938L115
60223E12970K611K281L034M619N752N624M951N027N980O741O725O579O869P097
60209E86860O622N823N427N410N330N223N263N039M126L083K814L178L168K365
60195F49731J281K74r02k368l747m805n714o457o555n723m424l414l025l028k989
60180E98135k724k453k579l164l730l696k896j639m71P9j54p03q56m55N6L06L22
60163E73378J04m18q90p12L5N33M35L20O55J115J417J838K365K254J257L31L33
60146E84350Q25J131J630K878M185M426L752L300L545M161N146O743Q376Q980
$$ plain form
60254 481775 482146 483627 486260 489745 493459 496710 499165 500797 501504 501274 500612 500178 499942 499321 498206 497103
60238 497103 496182 494996 493505 492543 492781 493837 495002 496304 498182 500510 502698 504645 506917 509855 512970
60223 512970 515581 517862 520896 525515 531267 536891 541842 546869 552849 559590 566315 572894 579763 586860
60209 586860 593482 599305 604732 610142 615472 620695 625958 630997 635123 638206 641020 644198 647366 649731
60195 649731 651012 651286 650384 648016 644269 639464 633750 627293 620738 615015 610591 607177 604152 601124 598135
60180 598135 595411 592958 590379 587215 583485 579789 576893 575254 574783 574862 574708 574005 573149 572694 572750 573056 573378
60163 573378 573482 573064 572174 571462 571497 572030 572465 572785 573440 574555 575972 577810 580175 582429 583686 584017 584350
60146 584350 585175 586306 587936 590814 594999 599425 603177 606477 610022 614183 619329 626072 634448 643428
60132F43428Q462P768P448P099O293N089L603J877K85p20j305j947k534k435j518
60117F80893l96K90K69m83j614k401k537k652l356m209m442m244m226m096l114
60102F43682j718j357k479l860m226l532k452j434o17MO03J205J382Q44J42N7
60086F26244M62O68O79J085J818K036J451P08L05Rm66j091k023l607n549o905
60070F15824p164o759o282n912n773o146o951p575p479o642n343l982l078k913
60056E33825l067k757j648l1J598K718K970K596K406K846L479L856M165M474M187
60041E61617L194K567K952L156J819k83j325j232j478k410k794k199j837k593
60027E59154l834m703n217n671o149o959q306r434r325q336p737p617o857n331
$$ plain form
60132 643428 651890 659658 667106 674205 680498 685587 689190 691067 691352 690632 689327 687380 684846 682411 680893
60117 680893 680497 680787 681056 680573 678959 676558 674021 671369 668013 663804 659362 655118 650892 646796 643682
60102 643682 641964 640607 638128 634268 630042 626510 624058 622624 622007 622011 622614 623819 625201 626045 626187 626244
60086 626244 626706 627374 628053 629138 630956 632992 634443 635151 635456 635465 634999 633908 631885 628278 622729 615824
60070 615824 608660 601901 595619 589707 583934 577788 570837 563262 555783 549141 543798 539816 536738 533825
60056 533825 530758 528001 526353 526322 527920 530638 533608 536204 538610 541456 544935 548791 552956 557430 561617
60041 561617 564811 567378 570330 573486 575305 575022 573697 572465 570987 568577 565783 563584 561747 559154
60027 559154 555320 550617 545400 539729 533580 526621 518315 508881 499556 491220 483483 475866 469009 463678
60013D63678m246l963l401k119j199j250j393r63n64m99Q0J374K011J220L04N77
59997D49647J261R93J69J22R24J700K312L181L991M049L536L117K753K010J153
59982D80918P01L44n93j933k905l307l451l298k618j730j196r33m13M63J306J821
59966D63176J903J556J213J594K772L942M628N303O215O512N423L569K130J320
59952E11256O49j6o07j466k747l711l738l467l834m529m554l921l513l484l177
59937D69141k474j959j647p48J017K839L897M207M194M127M183M441M540L948
59923D99706K710J475O00k43j437k743l504l249k066n37O81J411K015K914M152
59908E01885N532O800P573P429O349M775L131J535Q0j054j895k522k627j829n44
$$ plain form
60013 463678 459432 455469 452068 449949 448750 447500 446107 445144 444580 444081 444161 445535 447546 448766 449070 449647
59997 449647 450908 451901 452070 452192 453116 454816 457128 460309 464300 468349 471885 475002 477755 479765 480918
59982 480918 481619 481963 481370 479437 476532 473225 469774 466476 463858 462128 460932 459999 459586 460049 461355 463176
59966 463176 465079 466635 467848 469442 472214 476156 480784 486087 492302 498814 504237 507806 509936 511256
59952 511256 511905 511889 511282 509816 507069 503358 499620 496153 492319 487790 483236 479315 475802 472318 469141
59937 469141 466667 464708 463061 462313 463330 466169 470066 474273 478467 482594 486777 491218 495758 499706
59923 499706 502416 503891 504491 504248 502811 500068 496564 493315 491249 490712 491393 492804 494819 497733 501885
59908 501885 507417 514217 521790 529219 535568 540343 543474 545009 545089 544035 542140 539618 536991 535162 534618
59893E34618K50L47N71J398K229K445K371K528K823L100L705M774N689N968O018
59878E78834O236O138N241M143L713L742L378K492J623R49K01n79j070j259j354
59863F12428j299r77o11m39l47k82n12r32p63L60J681K379K729L375M232M987
59847F26009N997P515Q636Q278O778N257L784J588j045k589k224q16L82R74J086
59832F69610O92k17j371k505l558m413m858m893m783m828n290o333p684q632q701
59817F02236q083p093n687l983k678k348k668k936k927k691k028r16rQ3l07l75
59801E57590K4M05M30M0p96j855k593k830l038l401l300k426j560j398j457j118
59785E32717r25j572k423k433k008k308l079k920j593m47l22n47k96L89J294K519
$$ plain form
59893 534618 534868 535215 535786 537184 539413 541858 544229 546757 549580 552680 556385 561159 566848 572816 578834
59878 578834 585070 591208 596449 600592 604305 608047 611425 613917 615540 616489 616690 616111 615041 613782 612428
59863 612428 611129 610152 609541 609102 608755 608473 607961 607029 606266 606626 608307 610686 613415 616790 621022 626009
59847 626009 632006 639521 648157 656435 663213 668470 672254 673842 672797 670208 667984 667168 667550 668524 669610
59832 669610 670302 670085 668714 666209 662651 658238 653380 648487 643704 638876 633586 627253 619569 610937 602236
59817 602236 594153 587060 581373 577390 574712 572364 569696 566760 563833 561142 559114 558198 558189 558272 557965 557590
59801 557590 557614 558019 558449 558489 557693 555838 553245 550415 547377 543976 540676 538250 536690 535292 533835 532717
59785 532717 531792 530220 527797 525364 523356 521048 517969 515049 513456 513009 512687 512140 511844 512233 513527 516046
59769E16046L769M255L809L230L163L410L647M053M836N795O646P221P297O880
59755E84057O644P258Q299Q645Q116P727Q154Q858R128R126R286R360Q704P280
59741G00642N839N121N061M805L624J748O0j054j973k770k807j962j435k294l797
59726G08808m351l666k852k591k526k370k369k519k366j862j520j560j675j769
59712F74812k133k715k909k308j061N04K052L042L068K405J675J116O47L90M66
59697F79051O12O94J133K109K793K376J342N91k30k078m451n568m720l119k127
59682F68408j876j973k348k982l695m531n584o413o463o127o328p046p348o917
59668E98777o370n879m821l145j835j485j528j418j483j953k132j349l4Q91J221
$$ plain form
59769 516046 519815 524070 527879 531109 534272 537682 541329 545382 550218 556013 562659 569880 577177 584057
59755 584057 590701 597959 606258 614903 623019 630746 638900 647758 656886 666012 675298 684658 693362 700642
59741 700642 706481 711602 716663 721468 725092 726840 726900 725846 723873 721103 718296 716334 714899 712605 708808
59726 708808 704457 700791 697939 695348 692822 690452 688083 685564 683198 681336 679816 678256 676581 674812
59712 674812 672679 669964 667055 664747 663686 664190 666242 669284 672352 674757 676432 677548 678195 678585 679051
59697 679051 679663 680357 681490 683599 686392 688768 690110 690701 690471 688393 683942 678374 673654 670535 668408
59682 668408 666532 664559 662211 659229 655534 651003 645419 639006 632543 626416 620088 613042 605694 598777
59668 598777 592407 586528 581707 578562 576727 575242 573714 572296 570813 568860 566728 565379 565345 566236 567457
59653E67457J433J849K301K416J973J161M65J8o64j805k691k671k418l105m478
59638E61241m987l940k320j190m48M33J396K006J961J009q99l105m551m890m733
59623E36983m664m591m183l373k389j659j569j897j884j408j441k481l361k719
59609D99364r37P12K059L556M463L613J723Q11J292J694J401J452K238K611K053
59594E28105J670K109K412J894J412J591J521N34l19P7J015J129M19k61p30j260
59578E41318j581j377j122j440k091k474k497k345j940j298p54l29L47J177J465
59563E25059J079O70M41r9q00o83L09Q70L91m9L61P62L24j03N85J873K579K658
59545E36227K808L168L684M938P316J0168J2831J5526J8154J9225J7405J3308
$$ plain form
59653 567457 568890 570739 573040 575456 577429 578590 579055 579073 578409 576604 573913 571242 568824 565719 561241
59638 561241 556254 552314 549994 548804 548356 548789 550185 552191 554152 555161 554262 551157 546606 541716 536983
59623 536983 532319 527728 523545 520172 517783 516124 514555 512658 510774 509366 507925 505444 502083 499364
59609 499364 498427 499139 501198 504754 509217 512830 514553 515364 516656 518350 519751 521203 523441 526052 528105
59594 528105 529775 531884 534296 536190 537602 539193 540714 541248 540929 541006 542021 543150 543569 543308 542578 541318
59578 541318 539737 538360 537238 535798 533707 531233 528736 526391 524451 523153 522399 522070 522417 523594 525059
59563 525059 526138 526808 527249 527150 526350 525667 525976 526846 527237 527188 527549 528311 528635 528532 529117 530990 533569 536227
59545 536227 539035 542203 545887 550825 558141 568309 581140 596666 614820 634045 651450 664758
59533F64758Q432L223k370p223r609r144o853l776o19J707K656K798K917K755
59519F49652J657r2j758l418n413p019p144o183n822o915q598r532r173p841o271
59504E66130n122m411l622k715k408k970l516l284k813k941l314k995j952r20
59490E23147j80M23P28M91J01J91P50J335J751J937J802J757K640M390N707N811
59474E52781N589N947O209N414M223L945M381M302L536K934K675K214J711J982
59460F07843L060M155M994N964O984P514P607P780P850P132N786M775M407L982
59446F89833K927J341n90k726m537n483n819o203o616o482n655m431k890j136
59432F41533J42M65O25J814L815N263N642N903P054R120J1568J3887J5743J7260
$$ plain form
59533 664758 673190 676413 674043 666820 657211 648067 641214 637438 636819 638526 641182 643980 646897 649652
59519 649652 651309 651217 649459 646041 640628 633609 626465 620282 614460 607545 598947 589415 580242 572401 566130
59504 566130 561008 556597 552975 550260 547852 544882 541366 538082 535269 532328 529014 526019 524067 523147
59490 523147 522967 523390 524118 524609 524710 524901 525651 526986 528737 530674 532476 534233 536873 541263 546970 552781
59474 552781 558370 564317 570526 575940 580163 584108 588489 592791 596327 599261 601936 604150 605861 607843
59460 607843 610903 615058 620052 626016 633000 640514 648121 655901 663751 670883 676669 681444 685851 689833
59446 689833 692760 694101 693511 690785 686248 680765 674946 668743 662127 655645 649990 645559 642669 641533
59432 641533 641675 642140 642765 644579 648394 653657 659299 665202 672256 681376 692944 706831 722574 739834
59418G39834J9014K1085K2584K3058K3676K5631K7764K7304K2944J5781P385j399
59406I74661r558j5442j8016j7515j4407q862j872M209P109O243K367l705j1315
59393H93897j9273k5685k8858k8428k5610k2064j8518j4826j1258q774p668o918
59381F76017n681m447l827l172j642J24Q56O42O13J067J392J597K281L220L485
59366F72525L146L299M249N071N362N973P468R073R882J0166J0791J1988J3225
59353G72218J4010J4423J5115J6669J8643J9649J8921J7350J6132J5050J3121
59342I51301J0452Q009N739K528j925o576j0593j4115j7171j9205k0151k0809
59330H67484k1531k1565k0353j8570j7232j6445j5664j4611j3429j2302j1310
$$ plain form
59418 739834 758848 779933 802517 825575 849251 874882 902646 929950 952894 968675 976060 974661
59406 974661 965103 949661 931645 914130 899723 890861 888989 893198 900307 906550 908917 905212 893897
59393 893897 874624 848939 820081 791653 766043 743979 725461 710635 699377 690603 682935 676017
59381 676017 670336 665889 662062 658890 657248 657372 658228 658870 659483 660550 661942 663539 665820 669040 672525
59366 672525 675671 678970 683219 688290 693652 699625 707093 716166 726048 736214 747005 758993 772218
59353 772218 786228 800651 815766 832435 851078 870727 889648 906998 923130 938180 951301
59342 951301 961753 969762 975501 978029 976104 969528 958935 944820 927649 908444 888293 867484
59330 867484 845953 824388 804035 785465 768233 751788 736124 721513 708084 695782 684472
59319F84472j0437r550q597p740p021o126m942m028l880m033l560k222m32J524
59305F13428L451M876N648O594Q592J1285J3619J5156J5747J4513J0671N180m2
59292G28718m470q990j3460j5976j5195j2114q815o388m611k841o70J804M032
59279F41024N753P447R481J1152J1664J1658J2505J4201J5328J5157J4394J3677
59267G83441J2734J1434J0379R878R353Q130O051L067o76m169o090o374o287o684
59253H24187p224p486p656p713p097n739m415l543k541j008L12M12o41j779k007
59238G66062j233l00k84j366k635l377l977m967n893o153o241o879p603p644p710
59223F99800r028j0911j1283r646p624o371n342m042l081k843k769k636l015l759
$$ plain form
59319 684472 674035 664485 655888 648148 641127 635001 630059 626031 622151 618118 614558 612336 611904 613428
59305 613428 616879 621755 627403 633997 642589 653874 667493 682649 698396 712909 723580 728760 728718
59292 728718 724248 715258 701798 685822 670627 658513 649698 643310 638699 635858 635188 636992 641024
59279 641024 646777 654224 663705 674857 686521 698179 710684 724885 740213 755370 769764 783441
59267 783441 796175 807609 817988 827866 837219 845349 851400 854467 853791 849622 843532 837158 830871 824187
59253 824187 816963 809477 801821 794108 787011 781272 776857 773314 770773 769765 770077 770489 769848 768069 766062
59238 766062 764829 764529 764245 762879 760244 756867 752890 747923 742030 735877 729636 722757 715154 707510 699800
59223 699800 690772 679861 668578 658932 651308 644937 639595 635553 632472 629629 626860 624224 621209 617450
59209F17450l660k331j011o53n77J14J042J396J130N40l96j479k053j909j567
59194F06036j236n44L26M31m65j316j233m32N91J614K062J264j87n88O16K095
59178F09034K605K459K394K405K369K584K983L063L050L796M972N098L959L226
59164F53997L791M273L337J743P10j66j760l568m643n332o440p585p875p557p518
59149F15407p780p737p340o815n886m379l102l004l877m796n266n226m619l786
59135E41794l518l846l562j865K78J363J236Q67R36J520K532L606M164M272M736
59120E54513N830O859P539Q587J0187J1219J1027J0726J1408J2302J2122J1244
59108F73563J0921J1093J0595R143P589O415N263L841K286O81r68k457l641m684
$$ plain form
59209 617450 613790 611459 610448 609795 609218 609332 610374 611770 612900 613440 613044 611565 609512 607603 606036
59194 606036 604800 604256 604582 605013 604548 603232 601999 601567 602158 603772 605834 607098 606911 606323 606939 609034
59178 609034 611639 614098 616492 618897 621266 623850 626833 629896 632946 636742 641714 646812 650771 653997
59164 653997 657788 662061 665398 667141 667851 667685 665925 662357 657714 652382 645942 638357 630482 622925 615407
59149 615407 607627 599890 592550 585735 579849 575470 572368 569364 565487 560691 555425 550199 545580 541794
59135 541794 538276 534430 530868 529003 529281 530644 531880 532747 533683 535203 537735 541341 545505 549777 554513
59120 554513 560343 567202 574741 583328 593515 604734 615761 626487 637895 650197 662319 673563
59108 673563 684484 695577 706172 715315 722904 729319 734582 738423 740709 741390 740422 737965 734324 729640
59094G29640n522n661m957l953k973j766n69m14j518k488k190j502k059m019o174
59079F83875p645q331q232p428o400n581m955m566m740n238n128m144l294l405
59065F04788l996m289m261l999l176k037j647k194k311j199j07l95j383j582r62
59050E71250m87l80l03m45r05r15PR61J034Q54J265J563P21n75q69j79M88J089
59032E74174K249L556M091M217N060O608Q027R458J1643J4074J5406J5510J5332
59019F89405J4850J3047R973O957M536J857j450m448o427p797q879r009p561m997
59005F90057k355l56P77J210J522K235L215M007M586N196N635N395M434L239K303
58990G31100J912K116K363J701o7j868k602k445k270k376k429k112j165P03L268
$$ plain form
59094 729640 724118 718457 713500 709547 706574 704808 704239 703825 702307 699819 697629 696127 694068 690049 683875
59079 683875 676230 667899 659667 652239 645839 640258 635303 630737 625997 620759 615631 611487 608193 604788
59065 604788 600792 596503 592242 588243 585067 583030 581383 579189 576878 575679 575572 575177 573794 572212 571250
59050 571250 570763 570383 570080 569635 568730 567815 567822 568783 569817 570671 571936 573499 574220 573645 572776 572597 573085 574174
59032 574174 576423 579979 584070 588287 593347 599955 607982 617440 629083 643157 658563 674073 689405
59019 689405 704255 717302 727275 734232 738768 740625 739175 734727 728300 720503 711624 702615 695054 690057
59005 690057 687702 687346 688123 689333 690855 693090 696305 700312 704898 710094 715729 721124 725558 728797 731100
58990 731100 733012 735128 737491 739192 739125 737257 734655 732210 729940 727564 725135 723023 721858 722561 725829
58975G25829N736P731R624J1491J2634J2735J2467J2304J1846J1012J0663J1105
58963H55177J1268J0419R363Q824P972N859L017K70k720o246r224j0817j2125
58950H71037j4485j7156j8551j8690j8545j7924j6040j3409j1203r422p530o067
58938G02015n662n319l794j876j191j391q57M19J017P52P22R60L85r02j529j181
58922F82568j015j540k057k252k607l036k906k393k224k167j377p3Q16J394K522
58907F63653M072N319O640Q867J1337J2666J3155J4221J5682J5960J4989J4455
58895H01016J5002J5523J5492J5736J6507J7001J7251J8369K0293K1323K0552
58884I94065J8885J7095J4661J1166P167L100j163n287q511j1001j3587j6033
$$ plain form
58975 725829 731565 739296 748920 760411 773045 785780 798247 810551 822397 833409 844072 855177
58963 855177 866445 876864 886227 895051 903023 908882 911899 912169 909449 903203 893979 883162 871037
58950 871037 856552 839396 820845 802155 783610 765686 749646 736237 725034 715612 708082 702015
58938 702015 696353 691034 687240 685364 684173 682782 681925 682344 683361 684113 684835 685795 686180 685278 683749 682568
58922 682568 681553 680013 677956 675704 673097 670061 667155 664762 662538 660371 658994 658921 659737 661131 663653
58907 663653 667725 673044 679684 688551 699888 712554 725709 739930 755612 771572 786561 801016
58895 801016 816018 831541 847033 862769 879276 896277 913528 931897 952190 973513 994065
58884 994065 1012950 1030045 1044706 1055872 1063039 1066139 1064976 1059689 1051178 1040177 1026590 1010557
58872A010557j7287j7481j7727j7760j5923j2015q149o081n432n139m984n038
58860H77541n167n681p091q853r745r695r659r725r068p856p272p378p018o068
58846G67265n818o690p686q496j0053j2356j3848j3678j2746j1771j0346q530
58834F45247p394p087o250m301k519j909j676p67N75J724K709L536L886M031M682
58819F34487N508N343M282L800M287M397L430K483K423K477J729M37r38k439l680
58804F68026l804l105l079m195n207n253n030n211n483n681o237o864o529n326
58790E97022m603m676m290k876j409m45O40J797J856Q30M73J559K637K590K310
58775E93415K737L166K803K129J456n8k672n021o049o335o463n789m047k441j836
$$ plain form
58872 1010557 993270 975789 958062 940302 924379 912364 904215 898134 892702 887563 882579 877541
58860 877541 872374 866693 859602 850749 841004 831309 821650 811925 802857 795001 787729 780351 773333 767265
58846 767265 761447 754757 747071 738575 728522 716166 702318 688640 675894 664123 653777 645247
58834 645247 637853 630766 624516 620215 617696 615787 614111 613344 613919 615643 618352 621888 625774 629805 634487
58819 634487 639995 645338 649620 653420 657707 662104 665534 668017 670440 672917 674646 675083 674145 671706 668026
58804 668026 664222 661117 658038 653843 648636 643383 638353 633142 627659 621978 615741 608877 602348 597022
58790 597022 592419 587743 583453 580577 579168 578723 579363 581160 583016 583846 584319 585878 588515 591105 593415
58775 593415 596152 599318 602121 604250 605706 605648 602976 597955 591906 585571 579108 573319 569272 566831 564995
58760E64995j411k73J077K003K926M112M787M512L984L555K547Q78k58l19k78
58745E92837o43m11R74K429L097L686M838N852O161O393O981P315P217P505Q193
58730F62424Q065O913O311P100Q019P848O940N753M023K412K675M935O969P420
58716G47807P480Q195Q565P739O657N891M267J310j288k439l636o279r318j1408
58702G63543j3215j5524j7317j7807j8266j9652k0509j9418j7570j6542j5509
58691E72214j3040r979q044p110o118n215m863m343l178k544l242l931l333k464
58677D94810k590k837j947o27J12J120L293N398O117O556Q323J0776J2565J4113
58663E55182J6019J6740J4651J0904P554M364J21m340p288q941j0483j1474j0920
$$ plain form
58760 564995 563584 563311 564388 566391 569317 573429 578216 582728 586712 590267 592814 593692 593434 593115 592837
58745 592837 592194 591783 592757 595186 598283 601969 606807 612659 618820 625213 632194 639509 646726 654231 662424
58730 662424 670489 677402 683713 690813 698832 706680 713620 719373 723396 725808 728483 733418 740387 747807
58716 747807 755287 763482 772047 779786 786443 792334 796601 797911 796623 794184 790548 784269 774951 763543
58702 763543 750328 734804 717487 699680 681414 661762 641253 621835 604265 587723 572214
58691 572214 559174 549195 541151 534041 527923 522708 517845 513502 510324 507780 504538 500607 497274 494810
58677 494810 492220 489383 487436 486809 486921 488041 491334 496732 502849 509405 517728 528504 541069 555182
58663 555182 571201 587941 602592 613496 621050 625414 625535 621195 613907 604966 594483 583009 572089
58650E72089r725r356r282q256o892o342n810m163k624k942m140m071l054k915
58636D92517l534l497l318m716p318r135r920j1019j2386j2657j1911j1567j1673
58623C79866j0780q261m408J256R182J7644K3855K7031K8300K8193K6413K3564
58611E41855K0677J7493J3296Q881N600L193P23j220j528r26j008j695j917j933
58597F01491k623l430l306k810k857k550o27J974L571M571O251P956Q356Q333
58583F24300R558J1233J1388J0476J0441J1026J0303Q402P308P339O984O076O122
58570G40956P519R221J1065J3780J6951J9493K1776K4814K7842K9176K8849K7943
58558I79385K6089K2264J7166J2150O819M81n163p880q430r127r991r550q350
$$ plain form
58650 572089 562364 553008 543726 535470 528578 522236 516426 512263 509639 506697 502557 498486 495432 492517
58636 492517 488983 485486 482168 477452 470134 460999 451079 440060 427674 415017 403106 391539 379866
58623 379866 369086 360825 356417 357673 366855 384499 408354 435385 463685 491878 518291 541855
58611 541855 562532 580025 593321 602202 607802 610995 611718 610498 608970 608044 607036 605341 603424 601491
58597 601491 598868 595438 592132 589322 586465 583915 583288 585262 588833 593404 599655 607611 615967 624300
58583 624300 633858 645091 656479 666955 677396 688422 698725 707127 714435 721774 728758 734834 740956
58570 740956 748475 757696 768761 782541 799492 818985 840761 865575 893417 922593 951442 979385
58558 979385 1005474 1027738 1044904 1057054 1063873 1064354 1059191 1051311 1042881 1033754 1023763 1014213 1005863
58545A005863q090q361p819p652j0013j3870j6334j7446j9443k1992k2479k0774
58533H31590j9300j8421j6160j2619j0284r543q135n651m315m570m070k094q83
58520G15545j488k024j353r61j821k699k817l163m022m099l104k478k742k843
58506F79931k654l262m295l992k412j553j830j552l17K40k95l50N25R45O65J192
58490F60986K801L960M275N056O519P433P893R335J1553J2856J3344J4666J6406
58477G77083J6286J4224J2431J1180Q296L470q17l451n989q975j0690j0495r873
58464G92680r284p516m842l186k387r1L864O739P441P978R414J0212R674R211
58450H29907R024P201L331n15l420o639j0058j1456j0390r153q775p735n614m238
$$ plain form
58545 1005863 997773 989412 981593 973941 963928 950058 933724 916278 896835 874843 852364 831590
58533 831590 812290 793869 777709 765090 754806 745263 737128 731477 727162 722592 718522 716428 715545
58520 715545 714057 712033 710680 709719 707898 705199 702382 699219 695197 691098 687994 685516 682774 679931
58506 679931 677277 674015 669720 665728 663316 661763 659933 658381 658064 658304 658009 657659 658184 659129 659794 660986
58490 660986 663787 667747 672022 677078 683597 691030 698923 708258 719811 732667 746011 760677 777083
58477 777083 793369 807593 820024 831204 839500 842970 842153 838702 832713 823738 813048 802553 792680
58464 792680 783396 775880 771038 767852 765465 765374 769238 775977 783418 791396 800810 811022 820696 829907
58450 829907 838931 846132 849463 848948 845528 838889 828831 817375 806985 797832 789057 781322 775708 771470
58436G71470m124l507j905r19o49P32L032L850L223M131P255R578R500Q899Q759
58421H19325P231L741O44r56k899n852p626p305p010p901q386p785p692q295p545
58406G51689n368m411n148m717k096J34O34J298K862L338K452K816M893N688M196
58391G58260L172L657K974J89j696j235j009k323k671r13L43n0N30L065M616M101
58375G71010M792Q121J0651J0291R949J1681J2767J1186R620J0312J1079J0155
58363H91614R827J1569J2593J0971R267R495R424P460O017O410N671K212o48n37
58349I91345n2j192j294J346L513L023L067O219R516J0139J0518J3070J5300J4900
58335A079418J4510J6489J8079J6591J4322J3622J2331Q747N790N473M765J635
$$ plain form
58436 771470 767346 763839 761934 761015 760366 761098 764130 767980 771203 775334 782589 792167 801667 810566 819325
58421 819325 826556 830297 830941 829985 827086 821234 813608 806303 799293 791392 783006 775221 767529 759234 751689
58406 751689 746321 741910 736762 732045 729949 730083 730717 732015 734877 738215 740667 743483 748376 754064 758260
58391 758260 761432 765089 768063 768252 766556 765321 764312 761989 759318 758405 758748 758698 759228 762293 766909 771010
58375 771010 775802 783923 794574 804865 814814 826495 839262 850448 860068 870380 881459 891614
58363 891614 901441 913010 925603 936574 945841 955336 964760 972220 978237 984647 990318 992530 991882 991345
58349 991345 991293 990101 988807 990153 993666 996689 999756 1005975 1015491 1025630 1036148 1049218 1064518 1079418
58335 1079418 1093928 1110417 1128496 1145087 1159409 1173031 1185362 1194109 1199899 1205372 1210137 1211772
58323A211772n02P17J730j94j435J204M292M185L635N958Q471Q036P451R963J2810
58308A278093J2611J1795J3463J5204J4201J3092J4613J5978J4604J3615J5571
58297A432840J6860J4595J2758J4869J7150J5783J4346J6796J9740J9122J8021
58286A612880K0093K2038K0439J9354K2841K6699K6057K4503K7046L0734L0944
58275A883628L0312L2579L4390L2324L1086L5409M0717M1269M0461M3540M7466
58264B293181M7930M8762N4073N8744N7314N4470N5987N7542N3825N0168N3008
58253B885004N7296N5915N3226N6335O1532O2684O4412P2955Q2684Q6016Q8000
58242C626059R6305J05815J08633J10078J18662J29404J33803J37002J47716J60650
$$ plain form
58323 1211772 1211270 1211987 1213717 1213523 1212088 1213292 1217584 1221769 1225404 1231362 1239833 1247869 1255320 1265283 1278093
58308 1278093 1290704 1302499 1315962 1331166 1345367 1358459 1373072 1389050 1403654 1417269 1432840
58297 1432840 1449700 1464295 1477053 1491922 1509072 1524855 1539201 1555997 1575737 1594859 1612880
58286 1612880 1632973 1655011 1675450 1694804 1717645 1744344 1770401 1794904 1821950 1852684 1883628
58275 1883628 1913940 1946519 1980909 2013233 2044319 2079728 2120445 2161714 2202175 2245715 2293181
58264 2293181 2341111 2389873 2443946 2502690 2560004 2614474 2670461 2728003 2781828 2831996 2885004
58253 2885004 2942300 2998215 3051441 3107776 3169308 3231992 3296404 3369359 3452043 3538059 3626059
58242 3626059 3722364 3828179 3936812 4046890 4165552 4294956 4428759 4565761 4713477 4874127
58232D874127J66969J72538J87050K04756K15497K24918K43592K66351K83319
58223F839117L00826L29441L62321L88374M15376M55867N02361N42224N84460
58214A0720367O44326P14566P81208Q54334R52039J067988J188317J326223J504473
58205A9753841J719212J959867K249473K624946L095210L663073M368281N258249
58197D4692152O336107P591905R063110J0807036J2847050J5224069J8076268
58190A24637697K1584155K5844984L0810998L6147804M0880418M3258580M1427987
58183C64592623L4579092K3424138R548182n425934j9897454l1995457l9958562
58176C34866628m3086524m2119852l8563888l3769462k8625531k3724208j9442482
$$ plain form
58232 4874127 5041096 5213634 5400684 5605440 5820937 6045855 6289447 6555798 6839117
58223 6839117 7139943 7469384 7831705 8220079 8635455 9091322 9593683 10135907 10720367
58214 10720367 11364693 12079259 12860467 13714801 14666840 15734828 16923145 18249368 19753841
58205 19753841 21473053 23432920 25682393 28307339 31402549 35065622 39433903 44692152
58197 44692152 51028259 58620164 67683274 78490310 91337360 106561429 124637697
58190 124637697 146221852 172066836 202877834 239025638 279906056 323164636 364592623
58183 364592623 399171715 422595853 432144035 426718101 406820647 374825190 334866628
58176 334866628 291780104 249660252 211096364 177326902 148701371 124977163 105534681
58169A05534681j5886712j2971212j0601155q720142p238253o038307n055327
58162C9023573m273448l654189l135977k693962k336899k050908j800501j577807
58154A7499882j399736j261028j135157j016500r19565q40866p60599o78279o10512
58145H877640n56809n01252m44424m01442l71306l38692l03423k79320k66132
58136E414840k50294k31341k21040k17918k08258j91334j79400j73489j62563
58127C579203j46084j35034j30397j22048j09212j01734j00484r5845q6282q0172
58117B471911p8714p4529o7471o4883o6057o2868n5840n3477n5685n3804m7266
58106A791317m4453m6597m6094m1452l9145l9936l7652l2375l0903l3288l2503
$$ plain form
58169 105534681 89647969 76676757 66075602 57355460 50117207 44078900 39023573
58162 39023573 34750125 31095936 27959959 25265997 22929098 20878190 19077689 17499882
58154 17499882 16100146 14839118 13703961 12687461 11767896 10927030 10166431 9488152 8877640
58145 8877640 8320831 7819579 7375155 6973713 6602407 6263715 5960292 5680972 5414840
58136 5414840 5164546 4933205 4712165 4494247 4285989 4094655 3915255 3741766 3579203
58127 3579203 3433119 3298085 3167688 3045640 2936428 2834694 2734210 2638365 2552083 2471911
58117 2471911 2393197 2318668 2251197 2186314 2120257 2057389 2001549 1948072 1892387 1838583 1791317
58106 1791317 1746864 1700267 1654173 1612721 1573576 1533640 1495988 1463613 1432710 1399422 1366919
58095A366919k8131k7102k9930k9540k4768k2199k3344k2506j8595j6875j7765
58084A106164j5881j1394j0623j4053j5359j3461j4042j7852j9053j6716j6570
58073I41160j9644k0257j7192j5871j7454j6581j2222j0144j2111j2844j0283
58062G76557q893j0142r562o049m578o723p710n791n555q831j1042r773q644r559
58048F63705r265o621n430o970p375n271m494o436p243n437m857p057q126o109
58034E73014m447n002m700k287j543m324o855o398n493o398p135o207n689o709
58020D99827p080n922n419n959n020k705k577n007n786l414j572k163k214k63
58006D44726N92j082j939j98Q43j018k774j748q2k54q73l22m6j041j372J5J118
$$ plain form
58095 1366919 1338788 1311686 1281756 1252216 1227448 1205249 1181905 1159399 1140804 1123929 1106164
58084 1106164 1090283 1078889 1068266 1054213 1038854 1025393 1011351 993499 974446 957730 941160
58073 941160 921516 901259 884067 868196 850742 834161 821939 811795 799684 786840 776557
58062 776557 767664 757522 747960 741911 737333 730610 722900 717109 711554 702723 691681 681908 673264 663705
58048 663705 654440 647819 642389 635419 628044 622773 618279 611843 604600 599163 594306 587249 579123 573014
58034 573014 568567 563565 558865 556578 555035 550711 543856 537458 531965 525567 518432 512225 506536 499827
58020 499827 492747 486825 481406 475447 470427 467722 465145 460138 454352 450938 449366 447203 444989 444726
58006 444726 445318 444236 442297 442099 442942 441924 439150 437402 437320 437066 436193 435871 435825 434784 433412 433427 434545
57989D34545R29J392L083L466J647L01O61L70j595k747k117k403m593n539l628
57974D23772j870k443l038j653l53j053j982j485j109j936j992k58R24J94k40
57959D05478Q91J279k97j184J34P43j618m448m878m127m148l745j675J73K51M37
57943C83266K260L688L058K612M474O722P108P248R215J1237J0797R092Q451Q040
57929D77268N966L183J465j70l412p099r238j0438j2101j3279j2584j1222j0894
57916C97445j0676r015o891n899n151l192j131q31j571j450n54o9J89Q14R82l5
57900C52965j086j112j096j971k570j783p53o68n12O95J662J169N78J457K773
57885C49748K955K722L335L972L351K181J654J286M38P7Q12J207L28j89J108K824
$$ plain form
57989 434545 435474 436866 439949 443415 445062 445363 446024 446394 444799 442052 439935 437532 432939 427400 423772
57974 423772 421902 419459 416421 414768 414415 413362 411380 409895 408786 406850 404858 404600 405524 405718 405478
57959 405478 406369 407648 407351 406167 406301 407044 405426 400978 396100 391973 387825 384080 382405 382578 382829 383266
57943 383266 385526 389214 392272 394884 399358 406080 413188 420436 429651 440888 451685 460777 469228 477268
57929 477268 483234 486417 487882 487712 484300 477201 467963 457525 445424 432145 419561 408339 397445
57916 397445 386769 377754 370863 364964 359813 356621 355490 354659 353088 351638 351084 351015 351204 352018 353000 352965
57900 352965 351879 350767 349671 347700 345130 343347 342594 341926 341414 342109 343771 344940 345518 346975 349748
57885 349748 352703 355425 358760 362732 366083 368264 369918 371204 371642 371719 372531 373738 374066 373877 374985 377809
57869C77809L188L025L725M429L869L003L240L887L825L755M368M327K675J163
57855D26288J543K530K136J051Q81R63j40j753k517l036m320n276m572l354l355
57840D07069l872l391k594k837l259k277n56L45Q37K047L153K826J964K219L099
57825D04773L224L076L746M385L685K535K379K395J204n9M33J648J167r08k707
57810D30976m186o635r433j0638j0275j0012j0031r188p789p268p446o881n667
57797C25527n208n484n155m089l401l188k571j607j021m58Q00J999J956J278J372
57782C00750J974J976J888K967M554M804L676K821K873L036K921K666J769j75
57768C38500k140l039l567m733n652n030l736l439l690k914j298q3J078L263N774
$$ plain form
57869 377809 380997 384022 387747 392176 396045 399048 402288 406175 410000 413755 418123 422450 425125 426288
57855 426288 427831 430361 432497 433548 434429 435392 435252 433499 430982 427946 423626 418350 413778 410424 407069
57840 407069 403197 399806 397212 394375 391116 388839 388283 388628 389465 391512 394665 397491 399455 401674 404773
57825 404773 407997 411073 414819 419204 422889 425424 427803 430198 431402 431343 431776 433424 434591 433683 430976
57810 430976 426790 420155 410722 400084 389809 379797 369766 360578 352789 345521 338075 331194 325527
57797 325527 320319 314835 309680 305591 302190 299002 296431 294824 293803 293345 294145 296144 298100 299378 300750
57782 300750 302724 304700 306588 309555 314109 318913 322589 325410 328283 331319 334240 336906 338675 338500
57768 338500 336360 333321 329754 325021 319369 314339 310603 307164 303474 300560 299262 299179 300257 303520 309294
57753C09294P380R259J3561J9576K4394K6958K8346K8354K5155J8708J1553N733
57741E28271J261k186m488o172q018r364q890p055n660n209m848m586n185o116
57727D51755o057n291n290o066o246n584n097m838l979k830k463k527j871r92
57713C92624j358k548k739j892j706k468k675j891j252r58K6J466J819J093J128
57698C78669K532L839M208M489N027M756L211J295m55k418m318n229n305n497
57684C84804n415l798j236J23j56j98J101K935M899P816J1659J5125J8102K2238
57670D57999K8267L4980M1567M8621N5788O0443N9698N2158L7428J6212q276l1047
57658H53838m8608o0183o5713o4938n9011n0795m2529l4791k8022k2928j8988
$$ plain form
57753 309294 316674 325933 339494 359070 383464 410422 438768 467122 492277 510985 522538 528271
57741 528271 529532 527346 522858 516686 508668 499304 490414 483359 477699 472490 467642 463056 457871 451755
57727 451755 445698 440407 435117 429051 422805 417221 412124 407286 403307 400477 398014 395487 393616 392624
57713 392624 391266 388718 385979 384087 382381 379913 377238 375347 374095 373137 373163 374629 376448 377541 378669
57698 378669 381201 385040 389248 393737 398764 403520 406731 408026 407571 405153 400835 395606 390301 384804
57684 384804 379389 375591 374355 374478 374322 374124 375225 378160 383059 390875 402534 417659 435761 457999
57670 457999 486266 521246 562813 611434 667222 727665 787363 839521 876949 893161 884885 853838
57658 853838 805230 745047 679334 614396 555385 504590 462061 427270 399248 376320 357332
57647C57332j4833j0679q247p716p162n646m485m510m510l509k387j985j625p43
57633B79295j45m45q81p76n99p11o23k60l44q74r39o27j168k594l302k698k135
57616B60174k404k441j505n59l59k11K05j93j824l190l027k015j165k40J001J699
57600B43946J282N37Q7o66k075l206l331l009k804k392j770j685k079j806p37
57585B20292k88r92j463q45k68p65j591j861k024k460k463j829j619k140k091
57570A97593r41j62p11j291p42r2m89r74l15O73O52J36K92P29M13l26o04p25j323
57551A91793j857j621j256j544j720o98R35J762J564J047L95m28p77j72O80R89
57535A89092J065J342J267M43k06J54P96P02L14O29J514K343L370N023O625P247
$$ plain form
57647 357332 342499 331820 323573 315857 308695 303049 298564 294054 289544 286035 283648 281663 280038 279295
57633 279295 279150 278705 277824 277048 276449 275738 275115 274855 274511 273637 272698 272071 270903 268309 265007 262309 260174
57616 260174 257770 255329 253824 253265 252906 252695 252900 252707 250883 247693 244666 242651 241486 241246 242247 243946
57600 243946 245228 245765 245852 245186 243111 239905 236574 233565 230761 228369 226599 224914 222835 221029 220292
57585 220292 220004 219012 217549 216704 216436 215671 214080 212219 210195 207735 205272 203443 201824 199684 197593
57570 197593 196652 196490 195779 194488 193746 193654 193165 192191 191876 192549 193201 193337 193629 194358 194771 194445 193841 193116 191793
57551 191793 189936 188315 187059 185515 183795 183097 184032 185794 187358 188405 188800 188372 187595 187423 188103 189092
57535 189092 190157 191499 192766 193209 193003 193157 193953 194655 194969 195598 197112 199455 202825 207848 214473 221720
57519B21720P059O745O373N868N596N466M571K777J389J095O67r49k723l221k888
57504B59545l026l658m130m623n391n492m069k042r32q45j036j546k643l609l659
57489B12844l226k979k501j391o29j175k272k695k667k893k847j754l49J88J23
57474A85777L09L92l22j182j215r14j159j272j71J466K161J974J824J435J71q67
57458A88407o5J837K533J527M72L29M60N08R43J513J270M24L16J198J799J423
57442B04894Q61Q10Q69M88k51j063j635j415k93P31O46p7k77M9L6l07j90L93P05
57423B04974O74Q28J011O25k4n5M24M72q6n31n76n42l83J62O85O13L57O52J094
57404B10374P15k74q07p28q23j218j228p34l39k28lM42R25J535K161K021Q23k56
$$ plain form
57519 221720 228779 235524 241897 247765 253361 258827 263398 266175 267564 268659 269326 268377 265654 262433 259545
57504 259545 256519 252861 248731 244108 238717 233225 229156 227114 226182 225337 224301 222755 220112 216503 212844
57489 212844 209618 206639 204138 202747 202118 200943 198671 195976 193309 190416 187569 185815 185466 185654 185777
57474 185777 186086 186478 186156 184974 183759 182845 181686 180414 180243 181709 183870 185844 187668 189103 189274 188407
57458 188407 188342 190179 192712 194239 194711 195040 195500 196008 196951 198464 199734 200158 200474 201672 203471 204894
57442 204894 205755 206565 207434 207922 207671 206608 204973 203558 203265 203996 204642 204565 204288 204337 204373 204066 203876 204269 204974
57423 204974 205648 206476 207487 208112 208088 208033 208457 208929 208843 208312 207736 207194 206811 206973 207658 208271 208628 209280 210374
57404 210374 211089 210815 210008 209280 208457 207239 206011 205277 204938 204710 204707 205149 206074 207609 209770 211791 212614 212358
57386B12358q1O47N85j0R7Q61J205J077J319J749J310Q1o54m11K8J60K88M82M22
57367B21513K69M15N71K63j71k62m24j041j303n44K32k0k40J084K987L271K053
57350B28653J422J902J993J226Q86J377J498Q07L74O32P07M21P01J462J312L6
57334B45409p57k72K63j55p14m24K95O32N65L53K1j75mj7p51j314n31O76K70j593
57314B41777k560j678n81n13o32j20K96j0l80m22q29j729j933q37N42J260J494
57297B33145J320L09r43q43P50J959J717J265J873K989L645L975M197L913L355
57282B62626L601M559M693L674L265M328N142M178K565K029K228J969J510J630
57268C07997J773J110L86Q79K254L117L001K413J644Q32M67O94P91L29K7N05J173
$$ plain form
57386 212358 212277 212924 213509 213499 213596 214457 215662 216739 218058 219807 221117 221198 220544 220133 220161 220321 220609 221091 221513
57367 221513 221782 222197 222768 223031 222860 222598 222174 221133 219830 219286 219518 219498 219258 220342 223329 226600 228653
57350 228653 230075 231977 233970 235196 236082 237459 238957 239764 240138 240770 241477 241898 242599 244061 245373 245409
57334 245409 244652 244380 244643 244488 243774 243350 243645 244277 244842 245195 245216 245041 245037 245020 244269 242955 242424 243100 243370 241777
57314 241777 239217 237539 236958 236445 235813 235693 235989 235979 235599 235177 234348 232619 230686 229849 230391 231651 233145
57297 233145 234465 234774 233831 232988 233738 235697 237414 238679 240552 243541 247186 251161 255358 259271 262626
57282 262626 266227 270786 275479 279153 282418 286746 291888 296066 298631 300660 302888 304857 306367 307997
57268 307997 309770 310880 311266 312145 314399 317516 320517 322930 324574 325406 325873 326567 327358 327687 327714 328219 329392
57251C29392J335J379J800K130J857J464J477J509J226J304K252L263L284K482
57237C56154J655J104Q76J304K335L179L365L301L287L016K592K763L482L543
57223C91956K471J448J555K353K983L375L581L291K874L477N169O404O255N725
57209D42917N922O400O373O072N873N494N116N810P679Q990Q423O884O068O418
57195E34439P464Q771R620R194Q018P761Q808R616R236Q573Q325P810O926P016
57181F51577Q501R811J0120J0828J2737J4121J3571J2574J3056J4374J4973J5182
57169H01425J6005J6800J6586J6210J6937J8159J8657J8896J9937K1282K1818
57158A002712K1690K1488K0881J9863J9802K1396K3166K3739K3929K4727K5142
$$ plain form
57251 329392 330727 332106 333906 336036 337893 339357 340834 342343 343569 344873 347125 350388 353672 356154
57237 356154 357809 358913 359789 361093 363428 366607 369972 373273 376560 379576 382168 384931 388413 391956
57223 391956 394427 395875 397430 399783 402766 406141 409722 413013 415887 419364 424533 430937 437192 442917
57209 442917 448839 455239 461612 467684 473557 479051 484167 489977 497656 506646 515069 521953 528021 534439
57195 534439 541903 550674 560294 569488 577506 585267 594075 603691 612927 621500 629825 637635 644561 651577
57181 651577 660078 669889 680009 690837 703574 717695 731266 743840 756896 771270 786243 801425
57169 801425 817430 834230 850816 867026 883963 902122 920779 939675 959612 980894 1002712
57158 1002712 1024402 1045890 1066771 1086634 1106436 1127832 1150998 1174737 1198666 1223393 1248535
57147A248535K4253K3444K4267K5864K6803K7650K9377L1071L1671L2115L3309
57136A558359L3993L3152L2441L3379L4350L3404L1816L1612L1751L0341K8691
57125A913289K9296L1487L2909L3910L6728M1692M7795N5550O5650P6389Q6051
57114B450746R6108J08347J21141J33053J47862J70432J98390K22947K37657K42912
57104D129595K43721K47821K64267K98499L49331M14507M96874O00717P25282
57095G770614Q67388J026539J200487J379454J552516J715998J867243J994984
57087A9375223K086123K136385K142431K093625J993308J880274J793367J705090
57079C5205826J526243J204494P97017M12826R2646k23093o10422j077986j570524
$$ plain form
57147 1248535 1272788 1296232 1320499 1346363 1373166 1400816 1430193 1461264 1492935 1525050 1558359
57136 1558359 1592352 1625504 1657945 1691324 1725674 1759078 1790894 1822506 1854257 1884598 1913289
57125 1913289 1942585 1974072 2006981 2040891 2077619 2119311 2167106 2222656 2288306 2364695 2450746
57114 2450746 2546854 2655201 2776342 2909395 3057257 3227689 3426079 3649026 3886683 4129595
57104 4129595 4373316 4621137 4885404 5183903 5533234 5947741 6444615 7045332 7770614
57095 7770614 8638002 9664541 10865028 12244482 13796998 15512996 17380239 19375223
57087 19375223 21461346 23597731 25740162 27833787 29827095 31707369 33500736 35205826
57079 35205826 36732069 37936563 38733580 39146406 39239052 39015959 38405537 37327551 35757027
57070C5757027k021855k384375k628245k741980k737122k640146k477212k269755
57062A5856337k038460j801770j570952j352198j152313r77731q29590p04443
57054E428880n99135n11843m39922l80534l32851k96981k71325k52903k39053
57045B104333k26973k13096j95326j74886j54226j34189j14746r6937q1905o9131
57035F42918n7512m7268l8962l1608k3542j4483n034M999J5882K6014L2550L4009
57023E37963L0899K3796J2190m283k4141m3852n9150o7068o7385o2330n4673m6320
57011A75646l8429l1805k6596k2201j8106j4425j1344D118a955m052k883k333
56999a1223j959j677j666k029k710l384l374k152n9J932L278M254N369P000A161
$$ plain form
57070 35757027 33735172 31350797 28722552 25980572 23243450 20603304 18126092 15856337
57062 15856337 13817877 12016107 10445155 9092957 7940644 6962913 6133323 5428880
57054 5428880 4829745 4317902 3877980 3497446 3164595 2867614 2596289 2343386 2104333
57045 2104333 1877360 1664264 1468938 1294052 1139826 1005637 890891 793954 712049 642918
57035 642918 585406 538138 499176 467568 444026 429543 424509 429508 445390 471404 503954 537963
57023 537963 568862 592658 604848 600565 576424 532572 473422 406354 338969 276639 221966 175646
57011 175646 137217 105412 78816 56615 38509 24084 12740 4118 -1955 -6007 -8890 -11223
56999 -11223 -13182 -14859 -16525 -18554 -21264 -24648 -28022 -30174 -30233 -28301 -25023 -20769 -15400 -8400 1161
56983A4354J7041J9648K0158J8641J5192R624K389m995j0987j4939j6790j6522
56971E2814j4469j1561q633n800k927k94J676L202N079P775J0955J3970J6644
56958F8431J9390K2472K5265K6428K4917K0574J3806N138m516j3594k0524k4581
56946A63206k5889k4802k1726j7397j2792q609m964j619J720N123Q409J1545J5074
56933H7279J9725K5476L1316L5917L8027L6226K9404J8036M353r268k1420l0960
56921B64111l6459l7418l5275l2021k8238k3515j8242j3752j0765q858p488E518
56908d34n341m739m453m442m235l683l177l101l479m130m744m896m425l660k890
56893f1829j870k68J764M067P162J1712J7461A563K8609L2637L4512L3012K7782
$$ plain form
56983 14354 31395 51043 71201 89842 105034 114658 117047 112052 101065 86126 69336 52814
56971 52814 38345 26784 18151 12351 9424 9130 10806 14008 19087 26862 37817 51787 68431
56958 68431 87821 110293 135558 161986 186903 207477 221283 226421 221905 208311 187787 163206
56946 163206 137317 112515 90789 73392 60600 51991 47027 45408 47128 52251 60660 72205 87279
56933 87279 107004 132480 163796 199713 237740 273966 303370 321406 325759 316491 295071 264111
56921 264111 227652 190234 154959 122938 94700 71185 52943 39191 28426 19568 12080 5518
56908 -434 -5775 -10514 -14967 -19409 -23644 -27327 -30504 -33605 -37084 -41214 -45958 -50854 -55279 -58939 -61829
56893 -61829 -63699 -63967 -62203 -58136 -50974 -39262 -21801 1563 30172 62809 97321 130333 158115
56880A58115J9848J0927K642l731p450q571p782n836l249l47K694N864R208J2821
56866A85153J6939K1765K7149L2886L9308M6991N5546O3244O7955O7920O1579
56855F86435M7888K7626L936j9098l8155n1118n7004n6327n0852m2426l2333k1843
56843C96729j2153l286N921J6053K6353L6334M6913N9041P2418Q6261R9768J10369
56831I40721J12979J03186Q0742M8801J0950k9035o5611r2595j06703j08807j01925
56820G92703q9297p4094n8930m4934l2148k0654j0399l82J0460K1713L2256M2429
56808E68723N3698O5915P6161Q0572P6343O2281L9168J0131k0392m8484p1127
56797H92989q5566r0147q6036p6690o5198n3047m1198l0700k1835j3929o565K0
$$ plain form
56880 158115 177963 188890 191532 187801 180351 171780 163998 158162 154913 154566 157260 163124 172332 185153
56866 185153 202092 223857 251006 283892 323200 370191 425737 488981 556936 624856 686435
56855 686435 734323 761949 765885 746787 708632 657514 600510 544183 493331 450905 418572 396729
56843 396729 384576 381290 387211 403264 429617 465951 512864 571905 644323 730584 830352 940721
56831 940721 1053700 1156886 1237628 1286429 1297379 1268344 1202733 1110138 1003435 894628 792703
56820 792703 703406 629312 570382 525448 493300 472646 462247 461865 472325 494038 526294 568723
56808 568723 622421 688336 764497 845069 921412 983693 1022861 1032992 1012600 964116 892989
56797 892989 807423 717276 631240 554550 489352 436305 395107 364407 342572 328643 322078 322098
56785C22098N935J1938J8444K5159L1747L7682M1347M0587L4476K3639Q974q452
56773E93574k6104m0350m8987n2426n2032m8593m2916l6566l0919k6218k2183
56762A66280j8772j5892j3154j0499q395p001n874m828m283m372m500m177l600
56749F0933l037k388j674j230j145j133j219j745k499k656j868p35R1N33O26K21
56733D1075n07r76q93n30j56J71K79om20n13l15r2L56J295K264K569K377K345
56715D8323K438K174J784J823J845R26n41j088l52M61N27L20K66J9m53m29K88
56698E8331Q52P66O36R87J423J481J354J194P61J99K25J037J956K525K892K901
56682G9520J994M61l94O2J018J535J644J598J177L57k61k86jL27P45R85O11L2
$$ plain form
56785 322098 328033 339971 358415 383574 415321 453003 494350 534937 569413 593052 602026 593574
56773 593574 567470 527120 478133 425707 373675 325082 282166 245600 214681 188463 166280
56762 166280 147508 131616 118462 107963 99568 92567 86693 81865 77582 73210 68710 64533 60933
56749 60933 57896 55508 53834 52604 51459 50326 49107 47362 44863 42207 40339 39604 39695 40228 40854 41075
56733 41075 40568 39592 38699 38169 38013 38184 38463 38457 38037 37524 37209 37117 37473 38768 41032 43601 45978 48323
56715 48323 50761 52935 54719 56542 58387 59313 58772 57684 57332 57793 58320 58640 58906 58925 58472 58043 58331
56698 58331 59183 59949 60585 61572 62995 64476 65830 67024 67785 67984 68209 69246 71202 73727 76619 79520
56682 79520 81514 81975 81581 81643 82661 84196 85840 87438 88615 88972 88711 88425 88424 88751 89496 90481 91092 91124
56664I1124J79R57J213N44j75m39p82j363j412p23l03p15j094o15L21J094J749
56647H9560K047J053j255l158l129j622l4J070J675J363n0j753k864l561m367
56632G4975m973m704l650k523j860j832k302k603j980o81J74J26r4J27N36R00
56616D9636J461K027J865J080P79J296J595J145Q87J502K117J840J244J123J042
56601G0639L77k45O6R14J328J290J357J469J217P88N85M57J73J05O12J232J281
56584H3645P35M8m16l99J12N51L96K45J063K282K217P46k17M15J372J346J018
56567I5159J523K445K868L090L817M735N243N600O141O359N900N417N254M512
56553A58063K622P02oP6n9k66N8N52N86M38N05L08m79j076r31q55j559k161j679
$$ plain form
56664 91124 91303 92260 93473 94017 93842 93403 92621 91258 89846 89123 88820 88105 87011 86396 86717 87811 89560
56647 89560 91607 92660 91405 88247 85118 83496 83462 84532 86207 87570 87520 85767 82903 79342 74975
56632 74975 70002 65298 61648 59125 57265 55433 53131 50528 48548 47867 48041 48167 48073 48200 48736 49636
56616 49636 51097 53124 54989 56069 56848 58144 59739 60884 61771 63273 65390 67230 68474 69597 70639
56601 70639 71016 70771 70837 71751 73079 74369 75726 77195 78412 79200 79785 80242 80415 80520 81132 82364 83645
56584 83645 84380 84428 84012 83613 83725 84276 84672 84917 85980 88262 90479 91225 91008 91423 92795 94141 95159
56567 95159 96682 99127 101995 105085 108902 113637 118880 124480 130621 136980 142880 148297 153551 158063
56553 158063 160685 161387 161381 161457 161398 161132 161190 161742 162328 162766 163271 163579 163100 162024 161093 160238 158679 156518 154839
56534A54839q45r01j569j754j373j032p77m98o45j250j354o84n71j716k480j189
56518A36201J096K085J440M79k61j098j723j679j704k603l525l192k163j870k147
56503A19336j744p05j38j26M3M0r97k400k525j279j76R0K85Q55J199R01K87k96
56485A12650o68m85K28O59L99L10J000J500P78l52n31q0j01l13J95Q94O09k69
56467A16423m35L6J58J58R64K040J994J010M58M38o8q42n95O27J364J156R02Q64
56449A26652M14j91Q9J061J357P14K72M38L75j65m00j60k16p40r86p34n35m81
56431A26764k03om84j203j261r41j127j480r33L23J146J430J850K013R39p83j454
56414A24590q14j65n6J88O82P19L07J19lp24j630j788j521j709j853j021j12p92
$$ plain form
56534 154839 153994 153093 151524 149770 148397 147365 146588 146090 145445 144195 142841 142157 141586 139870 137390 136201
56518 136201 137297 139382 140822 141301 141040 139942 138219 136540 134836 132233 128708 125516 123353 121483 119336
56503 119336 117592 116887 116749 116623 116666 116706 115709 113309 110784 109505 109329 109419 109704 110559 111758 112659 112946 112650
56485 112650 111982 111497 111725 112384 112783 113093 114093 115593 116371 116019 115488 115408 115307 114994 115189 116083 116692 116423
56467 116423 115988 116024 116182 116340 117304 119344 121338 122348 122806 123244 123176 122334 121739 122366 123730 124886 125788 126652
56449 126652 127066 126875 126964 128025 129382 130096 130368 130806 131181 131016 130616 130456 130240 129500 128514 127780 127245 126764
56431 126764 126561 126555 126071 124868 123607 122666 121539 120059 119126 119449 120595 122025 123875 125888 126827 126044 124590
56414 124590 123776 123611 123555 123743 124425 125144 125451 125570 125567 124843 123213 121425 119904 118195 116342 115321 115209 114417
56396A14417k510l182k600k497l382m047m312n408p359q658r021r872j1568j2503
56382B7498j1459G422C435K755J0448J6832K1129K4030K5159K3216J8861J4675
56370A60540J1694Q752N606L813L739L609K510J661J769J766J230J375K417K579
56356B13060J012o34q96n35n78m93K96J015R19M44m3q61j651j292J06R66P61O68
56338B12264J213J417J014J199K355L239L210L093L107K309Q63M43J439K203J927
56323B41295J793K290K066N81n73l17L18M43P88J672J963J341J272K370L097K459
56307B62858J745K166L001L433M086N330O157O023N844N979N428M110L644M613
56293C24417N415M979M407M701N228N493O118O945O711N675N869P580Q522P722
$$ plain form
56396 114417 111907 108725 106125 103628 100246 96199 91887 86479 79120 70462 61441 51569 40001 27498
56382 27498 16039 7422 3435 6190 16638 33470 54599 78629 103788 127004 145865 160540
56370 160540 172234 180986 186592 190405 194144 197753 200263 201924 203693 205459 206689 208064 210481 213060
56356 213060 214072 213438 212542 212007 211429 210936 211232 212247 213166 213610 213567 212706 211055 209763 209869 210835 211596 212264
56338 212264 213477 214894 215908 217107 219462 222701 225911 229004 232111 234420 235283 235726 237165 239368 241295
56323 241295 243088 245378 247444 248025 247452 247135 247453 247896 248684 250356 252319 253660 254932 257302 260399 262858
56307 262858 264603 266769 269770 273203 277289 282619 288776 294799 300643 306622 312050 316160 319804 324417
56293 324417 329832 334811 339218 343919 349147 354640 360758 367703 374414 380089 385958 393538 402060 409782
56279D09782P192Q231R268R138R439J1451J3588J4165J4138J4828J5499J5365
56267E52084J5672J7532J9990K2132K4864K8710L2317L5136L8947M4767N0917
56256H83068N6239O2466P1030Q0274Q8410R6610J06476J16783J25571J33274J41054
56245A961255J48058J52838J55558J56438J53992J47109J36783J23608J06008
56236C241647Q3263N7824L2182N938k1342m7061o8512q6492j02925j17005j26871
56225B850646j33160j37565j39650j38240j34499j30550j26268j20248j12673
56216A677793j04795r6902q9091q2492p7433p2094o5231n8411n3382m9233m4510
56205H84219m0048l7142l4893l1825k8344k5260k1971j8339j6043j5775j5410
$$ plain form
56279 409782 416974 425205 434473 443611 453050 464501 478089 492254 506392 521220 536719 552084
56267 552084 567756 585288 605278 627410 652274 680984 713301 748437 787384 832151 883068
56256 883068 939307 1001773 1072803 1153077 1241487 1338097 1444573 1561356 1686927 1820201 1961255
56245 1961255 2109313 2262151 2417709 2574147 2728139 2875248 3012031 3135639 3241647
56236 3241647 3324910 3382734 3414916 3420854 3399512 3352451 3283939 3197447 3094522 2977517 2850646
56225 2850646 2717486 2579921 2440271 2302031 2167532 2036982 1910714 1790466 1677793
56216 1677793 1572998 1476096 1387005 1304513 1227080 1154986 1089755 1031344 977962 928729 884219
56205 884219 844171 807029 772136 740311 711967 686707 664736 646397 630354 614579 599169
56194E99169j3391j1271j0569r866p843o224o594p057n416l074k417k817k583
56181E10047k327l062l375k033q45j519k180o75J356J429O64J307K388J957J206
56166E04338K183L593L269K613M217P100Q615R111J0378J1496J0798J0035J1925
56153E99671J5237J6881J7299J9183K2369K4666K6525L0245L5698M1149M7207
56142H96130N5806O6330P6731Q7179R8562J08790J14522J15220J11922J03993
56132A835185R1203P7069O5731N7229M9701M3787M0366L6470K8557J7929Q035
56121B351262j424j2531k3666l1644l7782m6169n7291o8515p9421r1228j02210
56110A799381j08962j11087j09959j04657r4179q1697p1162o1617n0231l8776
$$ plain form
56194 599169 585778 574507 563938 554072 546229 540005 533411 526354 520938 517864 515447 512630 510047
56181 510047 507720 504658 501283 499250 498405 496886 494706 494031 495387 496816 497480 498787 501175 503132 504338
56166 504338 506521 510114 513383 515996 520213 527313 535928 545039 555417 566913 577711 587746 599671
56153 599671 614908 631789 649088 668271 690640 715306 741831 772076 807774 848923 896130
56142 896130 951936 1018266 1094997 1182176 1280738 1389528 1504050 1619270 1731192 1835185
56132 1835185 1926388 2003457 2069188 2126417 2176118 2219905 2260271 2296741 2325298 2343227 2351262
56121 2351262 2349838 2337307 2313641 2281997 2244215 2198046 2140755 2072240 1992819 1901591 1799381
56110 1799381 1690419 1579332 1469373 1364716 1270537 1188840 1117678 1056061 1005830 967054
56100I67054l1087k6258k0626j4755j1995j1557r676o307m394l686j679O79O36
56087H26349l01J429M532M871L082L341N595O132M953N555P983R034Q751R965
56073I01271J2142J2404J1767J3516J6400J6492J4682J5128J7303J7107J4772
56062A062984J4107J4796J3227J0073R277J0349R521P565Q424J1145J1411J0028
56050A192907J1338J4374J4472J2591J3880J7855J9405J8700K0478K4216K4962
56039A385178K3337K4649K8379K8936K6482K6560K9202K9210K7114K8729L3640
56028A691416L5435L3736L4598L8572L9942L8395L9574M3390M3862M1379M2824
56017B123123M8569N1724N1229N3075N7686N9212N8250O1800O9486P3521P3405
$$ plain form
56100 967054 935967 909709 889083 874328 862333 850776 841100 834793 830399 826713 825034 825713 826349
56087 826349 826048 827477 832009 836880 839962 843303 848898 855030 859983 865538 873521 882555 891306 901271
56073 901271 913413 925817 937584 951100 967500 983992 998674 1013802 1031105 1048212 1062984
56062 1062984 1077091 1091887 1105114 1115187 1124464 1134813 1144334 1151899 1160323 1171468 1182879 1192907
56050 1192907 1204245 1218619 1233091 1245682 1259562 1277417 1296822 1315522 1336000 1360216 1385178
56039 1385178 1408515 1433164 1461543 1490479 1516961 1543521 1572723 1601933 1629047 1657776 1691416
56028 1691416 1726851 1760587 1795185 1833757 1873699 1912094 1951668 1995058 2038920 2080299 2123123
56017 2123123 2171692 2223416 2274645 2327720 2385406 2444618 2502868 2564668 2634154 2707675 2781080
56006B781080P6533Q3311Q6542Q6682R2147J02941J09876J11788J17143J26856
55996C774899J32549J33871J39848J50765J57053J58700J66674J82263J94806
55987E191428K03026K17925K41006K61091K76731K99563L31142L59522L83406
55978G764840M15572M57735M97314N34091N83220O46555P09691P73262Q56501
55969A3238781R63221J077109J198453J350912J543747J765290K024012K356683
55961B5518208K785598L310564L953407M761763N755349O920611Q272666R866355
55953G1144521J1737457J3909509J6483051J9639998K3524652K8155690L3343077
55946B17937955L8391874M1779712M1479563L6085993K5779163J2124309k928894
$$ plain form
56006 2781080 2857613 2940924 3027466 3114148 3206295 3309236 3419112 3530900 3648043 3774899
55996 3774899 3907448 4041319 4181167 4331932 4488985 4647685 4814359 4996622 5191428
55987 5191428 5394454 5612379 5853385 6114476 6391207 6690770 7021912 7381434 7764840
55978 7764840 8180412 8638147 9135461 9669552 10252772 10899327 11609018 12382280 13238781
55969 13238781 14202002 15279111 16477564 17828476 19372223 21137513 23161525 25518208
55961 25518208 28303806 31614370 35567777 40329540 46084889 53005500 61278166 71144521
55953 71144521 82881978 96791487 113274538 132914536 156439188 184594878 217937955
55946 217937955 256329829 298109541 339589104 375675097 401454260 413578569 410649675
55939D10649675j7616777l0182112l8864993m2625619m1837705l8015715l2838242
55932A68668512k7467130k2532968j8341235j4947983j2225776j0024038q261710
55925E4867672o871194n753093m831142m085791l498616l017745k604234k260431
55917B1945426j986405j753045j540350j360081j218753j095547r75874q71715
55909A1143656p90481p16290o39025n71486n21622m76244m27228l86631l61128
55900F253521l37269l06294k79192k63443k48148k25743k06244j96582j86795
55891D003811j69751j54685j48366j41794j28007j15155j09689j03798r1472q0722
55881B760372p8113p6749p0941o7806p2921p8586p7527p4945p6353p6354p0085
$$ plain form
55939 410649675 393032898 362850786 323985793 281360174 239522469 201506754 168668512
55932 168668512 141201382 118668414 100327179 85379196 73153420 63129382 54867672
55925 54867672 47996478 42243385 37412243 33326452 29827836 26810091 24205857 21945426
55917 21945426 19959021 18205976 16665626 15305545 14086792 12991245 12015371 11143656
55909 11143656 10353175 9636885 8997860 8426374 7904752 7428508 7001280 6614649 6253521
55900 6253521 5916252 5609958 5330766 5067323 4819175 4593432 4387188 4190606 4003811
55891 4003811 3834060 3679375 3531009 3389215 3261208 3146053 3036364 2932566 2841094 2760372
55881 2760372 2682259 2605510 2534569 2466763 2393842 2315256 2237729 2162784 2086431 2010077 1939992
55870A939992o3640o2822o2711n7964n2592n0594m7623m0598l5076l4875l4711
55859A396786l0903k8774l1739l3707l0297k7080k8644k9840k6074k2276k3234
55848A084218k4752k2590k0873k3341k5276k2452j9378k0534k1901j9262j6613
55837H47246j8107j9741j7187j4158j4945j6049j3292j0041j0357j0961p921m706
55825F89781n615p639o561m977o604q634p404n871p902j0627r860p803q067q363
55811E83854n374j818j487j972N92M136M858M353N890P926P805P464R137R818
55797F35182O382J754l58k291p481j3152j4878j4287j5316j6582j4503j0571q705
55784E25194q313o530m495n027o695o271m556l984l065J016O882J1463J5287J9793
$$ plain form
55870 1939992 1876352 1813530 1750819 1692855 1640263 1589669 1542046 1501448 1466372 1431497 1396786
55859 1396786 1365883 1337109 1305370 1271663 1241366 1214286 1185642 1155802 1129728 1107452 1084218
55848 1084218 1059466 1036876 1016003 992662 967386 944934 925556 905022 883121 863859 847246
55837 847246 829139 809398 792211 778053 763108 747059 733767 723726 713369 702408 694487 689781
55825 689781 684166 676527 669966 664989 658385 649751 642347 636476 628574 617947 608087 600284 592217 583854
55811 583854 578480 576662 575175 573203 573795 577931 582789 587142 593032 600958 608763 616227 625364 635182
55797 635182 641564 643318 642960 640669 633188 620036 605158 590871 575555 558973 544470 533899 525194
55784 525194 516881 510351 505856 500829 494134 487863 483307 479323 476258 477274 484156 495619 510906 530699
55770E30699K2275J9208J2146M840k908j2927k2813k8232k9119k8362k6350k2065
55758D16392j7362j4878j3419j0321o594m921m635l467k250l073m759m888m421
55745C21404n575p086o233l775k242j282P52K432J282j490k829k913l962n540
55731B82943n413l747k377j345N6M53j512l979m486l956m439n022l818j887j203
55716B40268q64P76K519K801L291N762P885O649L629K186J781j15k680l364k937
55701B67587l833n172m543l130l912o114o555n337n104n707m734k515j602j902
55687B07427j098O63J234R48K009L919M197L171L498N209N757M686L895L526J914
55672B50955n46j695j658k408l645l202j424q71j763j792m54M93Q06J968L566
$$ plain form
55770 530699 552974 572182 584328 589168 586260 573333 550520 522288 493169 464807 438457 416392
55758 416392 399030 384152 370733 360412 353818 348897 344262 340795 338545 335472 330713 325825 321404
55745 321404 315829 308743 302510 298735 296493 295211 295963 298395 299677 298187 295358 292445 288483 282943
55731 282943 277530 273783 271406 270061 270117 270570 269058 265079 260593 256637 252198 247176 243358 241471 240268
55716 240268 239404 240180 242699 245500 248791 254553 262438 269087 272716 274902 276683 276568 273888 270524 267587
55701 267587 263754 258582 254039 250909 246997 240883 234328 228991 223887 218180 213446 210931 209329 207427
55687 207427 206329 206992 208226 209174 211183 215102 219299 222470 225968 231177 236934 241620 245515 249041 250955
55672 250955 250409 248714 247056 244648 241003 237801 236377 235506 233743 231951 231497 231990 232796 234764 238330
55657B38330L504J975J343K000K092J409J603K433J686p79k679l282m132n556
55643B39947o069n644o013p355q001p713p894q367p399n208l961l972l351j731
55629A57269r28j421j491m60L59M35P18J177O52n56q58l98q96k372l097k854l094
55612A42185l724l108j484j005k017k539j880j475j694j198m9n0j266j461Q5J270
55596A20590O81m71q66q14o20J73J149J062K15K63J302J644R27O75J387J783J484
55579A30564J634K321K187J219J249K960M974O472Q095R783J0346R749R197Q594
55565B09344O611L577J381J42j980n162p324p802q373r678r981q630p527p713
55551A46885p486n634l660l051k775j471M9M28L8k9K33L65N23P36M33m10r36q41
$$ plain form
55657 238330 241834 243809 245152 247152 249244 250653 252256 254689 256375 255596 252917 249635 245503 239947
55643 239947 233878 228234 222221 214866 206865 199152 191258 182891 175492 170284 166323 162351 159000 157269
55629 157269 156341 154920 153429 152969 153328 153763 154481 155658 156310 155754 154896 154498 153602 151230 148133 145279 142185
55612 142185 138461 135353 133869 132864 130847 128308 126428 124953 123259 122061 122012 121962 120696 119235 119320 120590
55596 120590 121271 120800 119934 119120 118500 118673 119822 120884 121099 121362 122664 124308 125235 125910 127297 129080 130564
55579 130564 132198 134519 136706 137925 139174 142134 147108 153580 161675 171458 181804 191553 200750 209344
55565 209344 215955 219532 220913 221055 219075 213913 206589 198787 190414 180736 170755 162125 154598 146885
55551 146885 139399 133765 130105 127054 124279 122808 122857 123285 123323 123294 123527 123892 124415 125151 125584 125174 124238 123397
55533A23397q28j153j241j043j239j860k344k909m077m972m189k297j225j263
55519I2757r91k20k07q21k46K047M621O775R425J2870J6236J9350K2513K4201
55505B08310K2008J6337J0163M782r71o853j0278j0368r543r595r366p889o638
55492A90099o781p055o210n192n021m915m204l871m529m952m224l274k935k514
55478A24422j674j477k242k498j448l25m2J97Q49R13J70M5Q55Q31p12j825j218
55461A14821m28q33j186k46O44n3j297j445j023j220j463q46k37o41j074k80Q47
55444A04040Q10J18J80P94Q67N36N99P54K49n61r14r63j043o34N26J436J259O70
55426A08723N36N26J62l0L08M79J46K40J279K322K691L120L986M209L255K391
$$ plain form
55533 123397 122569 121416 120175 119132 117893 116033 113689 110780 106703 101731 97542 95245 94020 92757
55519 92757 91766 91546 91339 90518 90272 92319 96940 103715 113140 126010 142246 161596 184109 208310
55505 208310 230318 246655 256818 261600 260629 253776 243498 233130 223587 213992 204626 196737 190099
55492 190099 183318 176263 170053 164861 159840 154925 150721 146850 142321 137369 133145 129871 126936 124422
55478 124422 122748 121271 119029 116531 115083 114758 114716 114913 115762 116675 116845 116890 117745 118576 117864 116039 114821
55461 114821 114393 113560 112374 112128 112772 112719 111422 109977 108954 107734 106271 105425 105188 104547 103473 103193 104040
55444 104040 104850 104968 105148 105942 106809 107345 107944 108698 108947 108386 107472 106509 105466 104832 105358 106794 108053 108723
55426 108723 109259 109785 109947 109917 110225 110704 110850 111090 112369 114691 117382 120502 124488 128697 131952 134343
55410A34343K460K286Q50q17j552k121l438m541m211l171k813l107l456m047m665
55395A02000l912j437O63O08m02l14O62J098R70R94P11m00j221o07L48r0j421
55378I8250j883j345r93r59n07Q3j10q34j063p22l59J90J216J936J539O84N02
55361I5625Q30R05Q57J013P50l83j393j246n50l49m28l45p75j990k466j010R45
55344H9990J310M10l1J80J10l9M79R13L5j395j587o51k84q87j244q49m25k16K53
55325H6072Q81J101J108J392J496Q10M4J68O00K17m85k31O15N83l89j000q80q38
55307I1264j058r23n68o91j018o31K78O44L15P2J84L89Q71J730K061J163O5J37
55289I4284Q63Q25J75J07M92K16o15r59q87j223j490n40J079J702J270J136J320
$$ plain form
55410 134343 136803 139089 139939 139122 137570 135449 132011 127470 123259 120088 117275 114168 110712 106665 102000
55395 102000 98088 96651 97314 97922 97520 97206 97868 98966 99936 100930 101641 101241 100020 99413 99761 99671 98250
55378 98250 96367 95022 94029 93070 92563 92646 92536 91702 90639 89917 89558 89748 90964 92900 94439 95123 95625
55361 95625 96455 97360 98217 99230 99980 99597 98204 96958 96408 96059 95631 95286 94511 92521 90055 89045 89990
55344 89990 91300 91710 91679 91859 91969 91930 92409 93322 93357 91962 90375 89724 89440 88553 87309 86460 86035 85819 86072
55325 86072 86953 88054 89162 90554 92050 92860 92904 93072 93672 93889 93404 93173 93788 94371 93982 92982 92102 91264
55307 91264 90206 89283 88715 88024 87006 86375 86653 87297 87612 87684 87868 88257 89128 90858 92919 94082 94147 94284
55289 94284 95147 95972 96147 96254 96746 96962 96347 95388 94501 93278 91788 91248 92327 94029 95299 96435 97755
55272I7755N81p96r64K85Q84k07j424j267m45k63o38q52q71q89o62r5M31P77J171
55253I2511J460J201O43M45M58pp48q78m20k62n18m03J66L62nk00LK5k55l08k43
55232I3027p31j536j576p06k9j15l37k78l70p65q46l03L58P10Q04N75n8n02m2
55213H7280R12J260Q39L75K5o38j301j073m9O99P62O54N00j63j136j587j389j041
55195H4929m50Q13K084K127J059K06Jk52o23l38N08Q61N77N46P81K91p69q52M26
55176I1925J412R11j32l95m2J31P9J62M12P98J277J266K57q88o32R73K202K107
55158A01823J449Q74nj152j605j205j145j928k451k001j518j718j699n88P54J095
55142H8980P30O89R96J030Q14P71Q12O33M03L62K72r8n50r54j484j888j491k99
$$ plain form
55272 97755 98336 97540 96576 96861 97745 97538 96114 94847 94402 94139 93501 92649 91778 90889 90227 90132 90563 91340 92511
55253 92511 93971 95172 95815 96260 96718 96711 95963 95085 94665 94403 93885 93482 93648 94010 94005 93805 93808 93833 93578 93270 93027
55232 93027 92296 90760 89184 88478 88449 88334 87997 87719 87349 86584 85738 85435 85793 86503 87307 87882 87824 87322 87280
55213 87280 88192 89452 90291 90666 90691 90053 88752 87679 87630 88329 89091 89745 90245 90082 88946 87359 85970 84929
55195 84929 84479 85292 87376 89503 90562 90768 90769 90517 89894 89556 90064 90925 91502 92048 92829 93120 92351 91499 91925
55176 91925 93337 94248 94116 93721 93679 93810 93889 94051 94463 95261 96538 97804 98061 97173 96541 97514 99716 101823
55158 101823 103272 104146 104141 102989 101384 100179 99034 97106 94655 92654 91136 89418 87719 87131 87885 88980
55142 88980 89710 90399 91395 92425 93239 94010 94822 95455 95858 96220 96492 96394 95844 94890 93406 91518 90027 89728
55124H9728P56J088J097J125R27M87L03M20K94K7L80J194J240K41m90j47L99M21
55106I9490O11J450J831P79o98j047m07O2J55M06O43L16k20k19N1j77o36l88M67
55087A02469P82J20o03m39M93J411J702J221L50j44K28J122J627J144j12j289
55071A10082j463m42Q92J408R49L55J75J21j46m09m74o27j084j542j675j571j358
55054A03191q93j24O75J228J373Q99j39r49o49M61J156Q52J54l33o85r10n88K89
55036A05008R55Q91M22n0n67j031r38k33L05L4p85j497j675j115P1J126J273P73
55018A02967N62P64O69K61M08J219J553P82j71l14R0L41M25N01K08n68j101q08
55000A07788j51J56K02M05O52N56J14m54r62j081n50J74K23m06p42l32J56J62
$$ plain form
55124 89728 90484 91572 92669 93794 94721 95208 95511 95931 96225 96252 96632 97826 99066 99307 98817 98670 99069 99490
55106 99490 100101 101551 103382 104161 103463 102416 102009 102071 102226 102632 103275 103591 103371 103152 103203 103026 102390 102002 102469
55087 102469 103251 103371 102768 102329 102822 104233 105935 107156 107506 107362 107590 108712 110339 111483 111371 110082
55071 110082 108619 108177 109069 110477 111426 111781 111956 112077 111931 111522 111048 110421 109337 107795 106120 104549 103191
55054 103191 102298 102174 102849 104077 105450 106349 106210 105261 104612 105073 106229 107081 107235 106902 106217 105307 104719 105008
55036 105008 105963 106854 107276 107226 106659 105628 104690 104457 104762 104796 104011 102514 100839 99724 99795 100921 102194 102967
55018 102967 103529 104293 104962 105223 105631 106850 108403 109185 109014 108700 108790 109131 109556 110057 110265 109697 108596 107788
55000 107788 107637 107793 107995 108400 109052 109608 109722 109268 108306 107225 106675 106849 107072 106666 105924 105592 105748 105910
54982A05910P0L00N77O19O45P14M24j76l65J01N61N87N30N43K27k58j5J064J812
54963A13870J542R93Q42N98p2l40L26R56N49k52k97K26L84J06l8n4k56l93j86
54944A18504j58q32j578j411n24O5O8J05N06Q93R06P55R59J896L349M458M578
54927A32539M235M491N389O009O121O492P234P322O212M593K847L91k665m778
54913A86432n128n035n875o918o713n463m451l983l487k947k766k761k539k323
54899A26043k242j638k47P64L64n72m89N59J361J674K234L084L486L382L465L909
54883A45137M232M379M791N479N928N853N284M185K687J266N4j428l215m419m651
54868A75562m871n821o622o193n053m331l888k977j933j558j503r92n39j113k047
$$ plain form
54982 105910 105980 106280 106857 107476 108121 108835 109259 109083 108718 108819 109380 109967 110497 111040 111267 111009 110994 112058 113870
54963 113870 115412 116405 117247 117845 117773 117433 117759 118715 119264 119012 118715 118941 119325 119431 119393 119339 119083 118690 118504
54944 118504 118346 117514 115936 114525 114001 114066 114134 114239 114745 115638 116544 117299 118258 120154 123503 127961 132539
54927 132539 136774 141265 146654 152663 158784 165276 172510 179832 186044 190637 193484 193875 191210 186432
54913 186432 181304 176269 170394 163476 156763 151300 146849 142866 139379 136432 133666 130905 128366 126043
54899 126043 123801 122163 121916 122680 123044 122472 121983 122542 123903 125577 127811 130895 134381 137763 141228 145137
54883 145137 149369 153748 158539 164018 169946 175799 181083 185268 187955 189221 189275 187847 184632 180213 175562
54868 175562 170691 164870 158248 152055 147002 142671 138783 135806 133873 132315 130812 129820 129281 128168 126121
54853A26121j780m24K86l51j177j218r18r65j287j568j713j587j132p42o61l59
54837A10525N43J171N16q07j284o21K05P01J085J078J91q69p49M28J099N21m49
54820A13284r98j199j006l4J290J810J359J021J224J048p9j248j431q15n9P49
54804A14916J586J895J307L81k7K59Q03J142J037N27o8n63j112j637j435j54J231
54787A20088J437O77K80P16J194J220J186J278J042M90M77J465K859L905M525
54772A42839M920N190N594O388P179P248O621N977N376M083J886l80k011l227
54758A97683m434n485o076o175n767m837l853l573m066m567m444l758k701j317
54744A36630K4O23K86l85p97r11q88o40k4Q90J846K455K430K075K173K978L763
$$ plain form
54853 126121 124341 123917 124203 123852 122675 121457 120539 119574 118287 116719 115006 113419 112287 111545 110884 110525
54837 110525 111068 112239 112755 111948 110664 110043 110248 110949 112034 113112 113303 112434 111685 112113 113212 113733 113284
54820 113284 112286 111087 110081 110047 111337 113147 114506 115527 116751 117799 117720 116472 115041 114226 114167 114916
54804 114916 116502 118397 119704 120085 120058 120317 121120 122262 123299 123826 123758 123195 122083 120446 119011 118857 120088
54787 120088 121525 122202 122482 123198 124392 125612 126798 128076 129118 129608 130085 131550 134409 138314 142839
54772 142839 147759 152949 158543 164931 172110 179358 185979 191956 197332 201415 203301 202921 200910 197683
54758 197683 193249 187764 181688 175513 169746 164909 161056 157483 153417 148850 144406 140648 137947 136630
54744 136630 136654 137277 137563 137178 136381 135470 134582 133942 133918 134808 136654 139109 141539 143614 145787 148765 152528
54727A52528L943M027M693N525N647N063M330L391J876J43j198k385l930n390
54713A78263o021o209o686o815n508l497k650l015k733j245l22j100k288k381
54699A27793j897j957k173j540l29L70L42J67k9n54j183j223n15L40O60K45n58
54682A17959j116j096q47q42q35k37P78J385J344J223J313J264R64P97Q12N27
54666A23393j66p94j169j473j455o87K23%j287k001j208P1O26P13J065J370R73
54649A18194K63J92Q39J392J304P74K52jo7l53j109j867j856j066k93r3k82n58
54631A15665p62n38L65J341J423O85J69K99M29J77J9J93J43m82j251j742j928
54614A14205j560l01J222J787J337J082J427J285O6j162j324p69k00M82J268J290
$$ plain form
54727 152528 156471 160498 165191 170716 176363 181426 185756 189147 191023 191166 189968 187583 183653 178263
54713 178263 172242 166033 159347 152532 147024 143527 140877 137862 135129 133884 133562 132462 130174 127793
54699 127793 125896 123939 121766 120226 119897 120267 120609 120776 120747 120193 119010 117787 117272 117612 118272 118517 117959
54682 117959 116843 115747 114900 114058 113223 112986 113764 115149 116493 117716 119029 120293 121257 122054 122866 123393
54666 123393 123227 122433 121264 119791 118336 117649 117872 117872 116585 114584 113376 113447 114073 114786 115851 117221 118194
54649 118194 118457 118649 119488 120880 122184 122958 123210 123209 123142 122789 121680 119813 117957 116891 116598 116505 116223 115665
54631 115665 114903 114365 114730 116071 117494 118179 118348 118647 119076 119253 119272 119465 119608 119126 117875 116133 114205
54614 114205 112645 112344 113566 115353 116690 117772 119199 120484 120550 119388 118064 117295 117095 117577 118845 120135
54598A20135J56j047j202o82l48o3O29J303J364J213J471J717J171O3p67j114
54582A23999j288j229p46j60J49L29N50M89P8m9L71N58k3n87k20N82P62L38P0
54563A23973Q1k1j84j60k32o65r54o05r5k3Q3Q59J699J505N03o7J82N18N23N45
54543A27465P77R69J091J324J443J070M37l1n62j512k256j799l85O47O89M57N41
54526A30365M99j90j104j384q08JK73j77p74q18l40k5q7P6P61J252R28M00N96
54507A29444J235J287O09O5R9K24j6m20o12m77p2L57L26l52j098j152n03K60Q12
54488A30016J227J490J548J615J840J821J114M3o30p04n69m36k02M7J5k72m51
54471A37512k91J60P49J259J494J624J981K253J577o5j276r36K16N78j98j128
$$ plain form
54598 120135 120291 119244 118042 117360 117012 116949 117578 118881 120245 121458 122929 124646 125817 125880 125113 123999
54582 123999 122711 121482 120736 120576 120725 121054 121604 122093 122171 122122 122493 123051 123028 122441 122221 122803 123565 123903 123973
54563 123973 124054 124033 123849 123689 123457 122792 121838 121233 121138 121115 121198 122057 123756 125261 125764 125697 125879 126397 126920 127465
54543 127465 128242 129211 130302 131626 133069 134139 134576 134545 133983 132471 130215 128416 128031 128678 129367 129824 130365
54526 130365 130864 130674 129570 128186 127378 127379 127652 127475 126701 125883 125543 125518 125431 125507 126268 127520 128448 128848 129444
54507 129444 130679 131966 132575 132640 132739 132963 132947 132527 131915 131438 131366 131723 132049 131697 130599 129447 128944 129204 130016
54488 130016 131243 132733 134281 135896 137736 139557 140671 140714 140084 139380 138811 138375 138173 138220 138235 137963 137512
54471 137512 137221 137381 138130 139389 140883 142507 144488 146741 148318 148253 146977 146041 146257 146835 146637 145509
54455A45509j525j543j268m90M93Q55L15m84q47p05m01l13p36j561k130j863r52
54438A32354PP79J348J371N74m40o37J43J046J379J288J211J200J010M62l39r25
54421A41831p98j09K68j63p59n52M10J202J267Q55L66n7l16k65L5L58O15Q21R27
54402A45936Q80O89K91l37q03n63K08O76N63N89J221J787J545Q85O76R60J161
54385A56364J064P69J58p37j282j008m32k73k92K21J236K133K699L099L187K784
54369A69690K328K367K675K674K400K209J969J380P20L66Kp53j407j347j039j394
54353A82840k284k870l021l182l222k680j909j657j681j097o4L40j33o08o56p72
54337A57344j121j108n76j66j29J16P86J184Q63L90L38L60j42j027j568j350o45
$$ plain form
54455 145509 143984 142441 141173 140683 141176 142031 142346 141862 141015 140310 139909 139596 138860 137299 135169 133306 132354
54438 132354 132361 133140 134488 135859 136433 135993 135356 135499 136545 137924 139212 140423 141623 142633 143095 142756 141831
54421 141831 141033 140924 141192 141029 140270 139718 140128 141330 142597 143452 143818 143761 143445 143180 143215 143573 144188 145009 145936
54402 145936 146816 147505 147796 147459 146656 146093 146301 146977 147540 148129 149350 151137 152682 153567 154243 155203 156364
54385 156364 157428 158197 158355 157618 156336 155328 154896 154623 154331 154552 155788 157921 160620 163719 166906 169690
54369 169690 172018 174385 177060 179734 182134 184343 186312 187692 188412 188778 188780 188027 186620 185273 184234 182840
54353 182840 180556 177686 174665 171483 168261 165581 163672 162015 160334 159237 159173 159513 159380 158772 158116 157344
54337 157344 156223 155115 154539 154373 154244 154360 155146 156330 157193 157583 157921 158281 158139 157112 155544 154194 153549
54320A53549j18j86m72j72P54J277O73l86q48p77q71j120j123j177j721k124j453
54303A43705j30O23P17J052J563J215K5o37r9Q11J341J655J711R11m92j143n06
54286A52322K59Q8n31o70l92k62l28l68l80k61K48Q60Q59K97R3N43Q26M72J40
54267A53815L82O73M31K4j2K25N54J221K070K161J012m36q94j12J246K448K850
54250A67658K041M73p20j000r23j010r76n63k01k70n00o31r30j495j857j719j329
54233A56048p54K94J491J857J219O63R27J378J233P10K96r4m88m89k73p99k160
54216A61059k934k153p77j28qL26N02j74j149j396j088j016r62j98Q66J098M48
54199A52316j03k04l81p27o80k13J7j84k94n7J99L20M51L97j69q39o69N61J983
$$ plain form
54320 153549 153431 153245 152773 152601 153355 154632 155305 154919 154071 153294 152423 151303 150180 149003 147282 145158 143705
54303 143705 143575 144198 144915 145967 147530 148745 148770 148133 148034 148845 150186 151841 153552 154463 153971 152828 152322
54286 152322 152581 152669 152138 151468 151076 150814 150486 150118 149738 149477 149725 150585 151444 151741 151834 152377 153203 153675 153815
54267 153815 154197 154870 155301 155325 155313 155538 156092 157313 159383 161544 162556 162120 161226 161114 162360 164808 167658
54250 167658 169699 170172 169452 168452 167529 166519 165543 164980 164779 164509 164009 163378 162448 160953 159096 157377 156048
54233 156048 155294 155588 157079 158936 160155 160818 161745 163123 164356 165066 165362 165268 164780 164291 164018 163219 161059
54216 161059 158125 155972 155195 155067 155059 155385 155887 155713 154564 153168 152080 151064 150102 149904 150770 151868 152316
54199 152316 152213 152009 151628 150901 150221 150008 150025 149841 149547 149490 149689 150009 150460 150857 150688 149849 149180 149741 151724
54180A51724K626K138O75j109k090j582l37J43n93j529j633j002l36M1L09P18
54164A48163J294J787J864J511J071O92O1r33j700j645r94l52K18R18J381R98
54148A54334K2n35k16M27P46P44O26L36j57n42m95j28J54J58J41N08J265J844
54130A59232J697R97M14J70q2l64o4J030K171K759L282M373N456N453M624M531
54114A95679O014Q137R495R793R606R093P673N001J659j393l890o318q833j0649
54100B31067j0972j0100q923p625n842l960l067l268l273k219q76k82k20k5P0
54085A70485l93p60o4J198J521O08j72J96J061J290Q00L17J92J61K3k1K18M70
54067A77130K51m30q73m93L90R53R84R53J070J057R25J124J524J305K90n10l62
$$ plain form
54180 151724 154350 156488 157163 156054 153964 152382 152045 152188 151595 150066 148433 147431 147095 147136 147445 148163
54164 148163 149457 151244 153108 154619 155690 156382 156443 155510 153810 152165 151171 150819 151037 151955 153336 154334
54148 154334 154356 153821 153605 154032 154778 155522 156148 156484 156327 155785 155290 155162 155316 155474 155615 156123 157388 159232
54130 159232 160929 161926 162340 162510 162428 162064 162000 163030 165201 167960 171242 175615 181071 186524 191148 195679
54114 195679 201693 209830 219325 229118 238724 247817 255490 260491 262150 260757 256867 250549 241716 231067
54100 231067 220095 209995 201072 193447 187605 183645 180578 177310 174037 171818 170942 170660 170440 170415 170485
54085 170485 170092 169332 169268 170466 171987 172595 172423 172619 173680 174970 175770 176087 176279 176440 176463 176442 176660 177130
54067 177130 177381 176951 176078 175585 175975 176928 177912 178865 179935 180992 181917 183041 184565 185870 186160 185650 185288
54050A85288J13J52J84R59K091K634K578K625K991L470M236N361N987N286M035
54035B27990L878N065O227O400O053N826N525M775L728K701J855J487J870K518
54021B85898K409J255j03p83p51m77l89q66k060l433m097l874l497l590m047m552
54005B57043n066n540n704n356m540l296j794o33m22r69j476j583j580j595j366
53990B16123r37p42q19p12l68k60m00p5R76J989K309K334K733L479M348N661P621
53973B43260R409R837Q736O852M624J872j330m322o549p953q501q011o746n589
53959B35589n102m793l801k143p49k96m36l99O9O46J025J208J306J414J665K111
53943B27314K571K836L042L437L877L919L553L329L576L893L755L199K643K328
$$ plain form
54050 185288 185401 185553 185737 186696 188787 191421 193999 196624 199615 203085 207321 212682 218669 223955 227990
54035 227990 231868 236933 243160 249560 255613 261439 266964 271739 275467 278168 280023 281510 283380 285898
54021 285898 288307 289562 289459 288676 287925 287448 287059 286193 284133 280700 276603 272729 269232 265642 261595 257043
54005 257043 251977 246437 240733 235377 230837 227541 225747 225114 224692 223723 222247 220664 219084 217489 216123
53990 216123 215186 214444 213625 212913 212545 212285 211885 211810 212786 214775 217084 219418 222151 225630 229978 235639 243260
53973 243260 252669 262506 271242 278094 282718 284590 283260 278938 272389 264436 255935 247924 241178 235589
53959 235589 230487 225694 221893 219750 219001 218705 218269 217870 217939 218585 219610 220818 222124 223538 225203 227314
53943 227314 229885 232721 235763 239200 243077 246996 250549 253878 257454 261347 265102 268301 270944 273272
53929B73272K271K477K800K856K488K139K425L470M869O105O748O567N795N152
53915C29434N208N827O391O467O111N718N725O156O412N860M612L266J870m3k244
53900C96770l580l527l090l400m182m421m058l948m558n583o673p664q287q373
53886C25426q227q170p914p067n994n370n150m750m100l663l503l187k554j921
53872B53856j508j307j434j944k448k604k823l653m659m791l852k731k078j662
53858B16362j144p44p88j262j971k597k599j688n11j75r01j731j670o81N46J290
53842A99736J201N56O2R6K22k9k25L42J420K024J807J244N57n47j861k456j861
53825B02288o63L88J138J564J355M86l58m35K62J176J797J943J754J622J841K262
$$ plain form
53929 273272 275543 278020 280820 283676 286164 288303 290728 294198 299067 305172 311920 318487 324282 329434
53915 329434 334642 340469 346860 353327 359438 365156 370881 377037 383449 389309 393921 397187 399057 399014 396770
53900 396770 393190 389663 386573 383173 378991 374570 370512 366564 362006 356423 349750 342086 333799 325426
53886 325426 317199 309029 301115 294048 288054 282684 277534 272784 268684 265021 261518 258331 255777 253856
53872 253856 252348 251041 249607 247663 245215 242611 239788 236135 231476 226685 222833 220102 218024 216362
53858 216362 215218 214474 213686 212424 210453 207856 205257 203569 203058 202883 201982 200251 198581 197900 198446 199736
53842 199736 200937 201493 201555 201651 201873 201844 201619 201961 203381 205405 207212 208456 209013 208466 206605 204149 202288
53825 202288 201625 202013 203151 204715 206070 206556 206198 205763 206025 207201 208998 210941 212695 214317 216158 218420
53809B18420K560K755L090L532L846M012M148M204M252M737N784O571O197M973
53795B79081M033L833L954M141M492M637L861K253P66q4o77j380k050k606l146
53780C01108l387k926k161j983k457k854l054l647m432m304l152k469l191m251
53766B56840m242l487l250l713l949l441k517j591q55n32p09j047j196j285j531
53751B23495j701j544j405j818k627l044k534j278J53J241J729J632J111M23n
53736B13828K58R85J237M78n21o87k05m4k23K05J293J758Q84l03m68L29J095J240
53718B21139Q67L76L49J139K153K289J510J099J807K730K738K125J906K261K586
53703B47074K616K557K528K650L281M439N348N219M197L055K281J933J874J720
$$ plain form
53809 218420 220980 223735 226825 230357 234203 238215 242363 246567 250819 255556 261340 267911 274108 279081
53795 279081 283114 286947 290901 295042 299534 304171 308032 310285 311051 310967 310290 308910 306860 304254 301108
53780 301108 297721 294795 292634 290651 288194 285340 282286 278639 274207 269903 266751 264282 261091 256840
53766 256840 252598 249111 245861 242148 238199 234758 232241 230650 229795 229263 228554 227507 226311 225026 223495
53751 223495 221794 220250 218845 217027 214400 211356 208822 207544 207697 208938 210667 212299 213410 213833 213828
53736 213828 214086 215071 216308 216786 216265 215578 215373 215329 215106 215311 216604 218362 219246 218943 218475 218804 219899 221139
53718 221139 222006 222382 222731 223870 226023 228312 229822 230921 232728 235458 238196 240321 242227 244488 247074
53703 247074 249690 252247 254775 257425 260706 265145 270493 275712 279909 282964 285245 287178 289052 290772
53689B90772J035P1l01J55O00M73M30J145J966J830R03K22N2k26q25j149q48l10
53671B95995pM3M3J18L03M27J26o77j409j337l68Q65J607J454N18n95j173r82
53653B94951l45L31P94P96K67l53n16l42l10l15J01O60O26L23R76K623L630L039
53635C06936K067K254L287L853L698L539L662L852M148M525M370L292J982J271
53621C52736Q89K11l83p7R25J713K018K170K096J580J146J428J965J831J264J345
53605C72857K169K722K579K469K875L308L293L075K952K693K054J218M58j59n31
53590D04032n43l49k83m57q31j400j917j829j021k99m02r79j208j018r11j019
53574C89566j262j918l005l538k638j048k63l79j92N86Q05j71j354j623j125n78
$$ plain form
53689 290772 291807 291878 291577 291732 292332 292805 293235 294380 296346 298176 299079 299301 299353 299127 298302 297153 296305 295995
53671 295995 295988 296031 296074 296192 296495 296922 297048 296371 294962 293625 293257 294122 295729 297183 297701 297106 295933 294951
53653 294951 294606 294937 295731 296527 296794 296441 295925 295583 295273 294958 295059 295719 296345 296668 297644 300267 303897 306936
53635 306936 309003 311257 314544 318397 322095 325634 329296 333148 337296 341821 346191 349483 351465 352736
53621 352736 353625 353836 353453 353376 354301 356014 358032 360202 362298 363878 365024 366452 368417 370248 371512 372857
53605 372857 375026 377748 380327 382796 385671 388979 392272 395347 398299 400992 403046 404264 404722 404563 404032
53590 404032 403489 403140 402857 402400 401569 400169 398252 396423 395402 395103 394701 393722 392514 391496 390585 389566
53574 389566 388304 386386 383381 379843 377205 376157 375894 375515 375323 375909 376714 376543 375189 373566 372441 371863
53558C71863n8O96J437J568R06j27q94r67m66K2J29J31L86O61O22N85R99J527
53540C79020J467R31O84R97J499K081K920L725L963L894M378N598O886P862Q774
53525D34679R675J0196J0267J0149R758Q986Q604R645J1773J3494J4221J4917
53513E66364J6315J7862J8945J9874K0950K1652K1598K1417K1773K2354K2566
53502G91670K2521K2534K2292K1432K0413K0022K0314K0725K0909K0872K0541
53491A024245J9882J9188J8828J8765J8650J8248J7607J6995J6799J7112J7479
53480A223798J7436J7272J7608J8231J8137J6926J5376J4293J3500J2411J0892
53469A395880R135P155M966K743M55k241n403q564j1300j3531j5047j5475j5010
$$ plain form
53558 371863 371805 372501 373938 375506 376412 376285 375391 374424 373958 373980 374109 374240 374626 375287 375909 376494 377493 379020
53540 379020 380487 381418 382102 383099 384598 386679 389599 393324 397287 401181 405559 411157 418043 425905 434679
53525 434679 444354 454550 464817 474966 484724 493710 502314 511959 523732 537226 551447 566364
53513 566364 582679 600541 619486 639360 660310 681962 703560 724977 746750 769104 791670
53502 791670 814191 836725 859017 880449 900862 920884 941198 961923 982832 1003704 1024245
53491 1024245 1044127 1063315 1082143 1100908 1119558 1137806 1155413 1172408 1189207 1206319 1223798
53480 1223798 1241234 1258506 1276114 1294345 1312482 1329408 1344784 1359077 1372577 1384988 1395880
53469 1395880 1405015 1412170 1417136 1419879 1420334 1418093 1412690 1404126 1392826 1379295 1364248 1348773 1333763
53456A333763j4600j4856j5402j5633j5597j5719j6201j7057j8215j9209j9347
53445A151927j8679j8125j8242j8454j7974j6877j5664j4398j2890j1236r533
53434I79855p478m935k526r81k68J47M94P60J152J847K593L174M015N685P950
53419I91484R923J1125J1869J2685J3907J5663J7767J9614K0595K0762K0765K1184
53407A187343K2120K3378K4790K6387K8328L0610L2807L4394L5466L6819L9042
53396A521484M1860M4564M6777M8555M9941N0869N1405N1846N2555N3671N4830
53385B068357N5273N4578N3208N1934N0799M9161M6786M4149M1572L8747L5402
53374B589966L1770K8039K4027J9790J5912J2627R257N075J96n026j0977j8223
$$ plain form
53456 1333763 1319163 1304307 1288905 1273272 1257675 1241956 1225755 1208698 1190483 1171274 1151927
53445 1151927 1133248 1115123 1096881 1078427 1060453 1043576 1027912 1013514 1000624 989388 979855
53434 979855 972377 967442 964916 963935 963667 963814 964308 965068 966220 968067 970660 973834 977849 983534 991484
53419 991484 1001407 1012532 1024401 1037086 1050993 1066656 1084423 1104037 1124632 1145394 1166159 1187343
53407 1187343 1209463 1232841 1257631 1284018 1312346 1342956 1375763 1410157 1445623 1482442 1521484
53396 1521484 1563344 1607908 1654685 1703240 1753181 1804050 1855455 1907301 1959856 2013527 2068357
53385 2068357 2123630 2178208 2231416 2283350 2334149 2383310 2430096 2474245 2515817 2554564 2589966
53374 2589966 2621736 2649775 2673802 2693592 2709504 2722131 2731388 2736463 2736659 2731633 2720656 2702433
53362B702433k6248l3582l9188m3147m5997m8047m9416n0207n0416n0004m9171
53351B217010m8352m7799m7272m6249m4449m2203m0282l9182l8664l8197l7740
53340A746621l7692l8095l8334l7808l6408l4298l1697k9067k6888k5004k2719
53329A388611j9838j7184j5571j4747j3796j2350j0936j0373j1118j2939j4854
53318A234905j5620j4738j2926j1414j0875j1085j1274j0655q990o836n050l855
53306A111587k751j345J19J244J973K477K954L829N548Q004J0526J2680J4556
53293A171401J6163J7214J7843J8810K0561K2577K4114K5013K5396K5186K4452
53282A408730K3635K2876K1627J9535J7183J5296J3704J1783R460P009M242P52
$$ plain form
53362 2702433 2676185 2642603 2603415 2560268 2514271 2466224 2416808 2366601 2316185 2266181 2217010
53351 2217010 2168658 2120859 2073587 2027338 1982889 1940686 1900404 1861222 1822558 1784361 1746621
53340 1746621 1708929 1670834 1632500 1594692 1558284 1523986 1492289 1463222 1436334 1411330 1388611
53329 1388611 1368773 1351589 1336018 1321271 1307475 1295125 1284189 1273816 1262698 1249759 1234905
53318 1234905 1219285 1204547 1191621 1180207 1169332 1158247 1146973 1136318 1127328 1120492 1115442 1111587
53306 1111587 1108836 1107491 1107610 1108854 1110827 1113304 1116258 1120087 1125635 1133639 1144165 1156845 1171401
53293 1171401 1187564 1204778 1222621 1241431 1261992 1284569 1308683 1333696 1359092 1384278 1408730
53282 1408730 1432365 1455241 1476868 1496403 1513586 1528882 1542586 1554369 1563829 1570838 1575080 1575832
53270A575832l172o701r505j1962j4364j6504j8087j9141j9972k1030k2680k4721
53258A387993k6327k6860k6646k6570k7017k7571k7642k7081k6277k5808k5850
53247A094344k5849k5116k3810k2862k2724k2773k2296k1442k0804k0566k0597
53236H45505k0822k0986k0524j9266j7836j6788j5825j4391j2592j0883r329p795
53224F58468o526n780n442n478o306p954r493j0177j0570j1514j2550j2669j2183
53211E41826j2400j3430j3847j2808j1207j0187r615q752p575o657o270o240o408
53198D16430o700p005p315p730q219q539q604q542q361p832o888n847n117m881
53184C14850n055n294n152m548m017m053m299l911k736j576j180j411j617j465
$$ plain form
53270 1575832 1572660 1565959 1556454 1544492 1530128 1513624 1495537 1476396 1456424 1435394 1412714 1387993
53258 1387993 1361666 1334806 1308160 1281590 1254573 1227002 1199360 1172279 1146002 1120194 1094344
53247 1094344 1068495 1043379 1019569 996707 973983 951210 928914 907472 886668 866102 845505
53236 845505 824683 803697 783173 763907 746071 729283 713458 699067 686475 675592 666263 658468
53224 658468 651942 646162 640720 635242 628936 620982 611489 601312 590742 579228 566678 554009 541826
53211 541826 529426 515996 502149 489341 478134 467947 458332 449580 442005 435348 429078 422838 416430
53198 416430 409730 402725 395410 387680 379461 370922 362318 353776 345415 337583 330695 324848 319731 314850
53184 314850 309795 304501 299349 294801 290784 286731 282432 278521 275785 274209 273029 271618 270001 268536
53170B68536j159j075j325j611j532j070o26m75m83o07j168k153k688j974n19
53155B50071K81j67j091j516j266o89o6L20J00p67j662j804r92J85Q85P47K03
53138B42772n8R0K26K39N59J218J393N63m65n31K07P11Q04J346K577L488L287
53121B58426K452J847J594J422J388J577J593J022P0p33j178j238p63P2M32l62
53105B67621j787k614k431j977j870j773j182m14j40l13l14q1k37q70j086l22
53089B50210N29K52q96j509j070n06o03r60r48o88m32J34J103J619R04m39j105
53072B45595p47j26Q0k19r51j873k299j707o02J4o8j94l0J25R4Q7J26j1j98o5
53052B37031K58K73N8K68J051J740J868J641J256N22m35r45p64n75r83j518j268
$$ plain form
53170 268536 267377 266302 264977 263366 261834 260764 260138 259663 259180 258573 257405 255252 252564 250590 250071
53155 250071 250352 250185 249094 247578 246312 245623 245557 245877 245977 245210 243548 241744 240752 240937 241822 242569 242772
53138 242772 242714 242804 243030 243269 243828 245046 246439 247002 246537 246006 246213 246924 247728 249074 251651 255139 258426
53121 258426 260878 262725 264319 265741 267129 268706 270299 271321 271391 270658 269480 268242 267479 267551 267983 267621
53105 267621 265834 263220 260789 258812 256942 255169 253987 253573 253433 253120 252806 252725 252488 251618 250532 250210
53089 250210 250739 250991 250095 248586 247516 247010 246407 245447 244499 243811 243379 243513 244616 246235 247139 246700 245595
53072 245595 244848 244722 244802 244583 243632 241759 239460 237753 237151 237165 237097 236903 236873 236998 237092 237179 237305 237294 237096 237031
53052 237031 237289 237562 237620 237888 238939 240679 242547 244188 245444 245966 245531 244586 243822 243247 242264 240746 239478
53035B39478j47R59J208N81k14m41k0M71N21K16j65o62j216j148K2J488J902J285
53017B44118J011J672K183J567N50M11J036J160K22j003j592j482j239j292j547
53002B45775j549r68k8O66Q14O89O80Q34J003J083R93O98M58O44J212J682J765
52985B56451J628J392Q86J71k14R5P63J185J133O96l0q10j172q62j46N92J288
52968B63046J947K274K013J404Q77N43L38L97P98J055M30j079k559l140k831k209
52952B63304j613r96m28k61n71q44n61K1J33m61j165j372j145q38n57l22l20n71
52934B51433o91m11m3O9J04K66J84m86j137p75N78J817K101J624J041P31O80N82
52916B57667J11n68p77l14K1m17r43n60K83K40q02j513j126k97K83P78J219R69
$$ plain form
53035 239478 239331 240290 241498 242079 241865 241424 241404 241875 242396 242612 242447 241785 240569 239421 239443 240931 242833 244118
53017 244118 245129 246801 248984 250551 251101 251512 252548 253708 253930 252927 251335 249853 248614 247322 245775
53002 245775 244226 243258 243230 243896 244710 245399 246079 246913 247916 248999 249992 250690 251148 251792 253004 254686 256451
52985 256451 258079 259471 260357 260528 260314 260409 261172 262357 263490 264186 264156 263346 262174 261312 261166 261758 263046
52968 263046 264993 267267 269280 270684 271561 272104 272442 272839 273637 274692 275122 274043 271484 268344 265513 263304
52952 263304 261691 260695 260267 260006 259435 258591 258030 258051 258184 257723 256558 255186 254041 253203 252646 252324 252004 251433
52934 251433 250742 250331 250288 250357 250461 250727 250911 250425 249288 248513 249091 250908 253009 254633 255674 256405 257085 257667
52916 257667 257778 257210 256433 256119 256140 255723 254780 254220 254503 254743 253941 252428 251302 251005 251288 252066 253285 254254
52898B54254r5r55p91q8K68K41K57L43L81N68R58J144R67Q72J020P73k58j381
52880B58478j757j443r24k33N63P99M0r01q07M21J807K579K671K283J765J642
52864B66983K058K348J774M72q07j621j972j948j829k159l066l822l739l115k697
52849B46860k587k387k030j737j452j070r30j307j736j634j257j201j212n62N76
52834B26334J159P96K95M83J217J827J898J400O04Op4O3p6l85k90L08R35J335
52816B37835J751K228K371K007J545J352J183O57o5m99n45o77j398k647l743l959
52800B37396l166j927r47n40n84p20n82j21K24L1m12l82J62M64J51j65N0L98M49
52781B29779P25J805K990L007J848P53M13K48l19r27j016p57o58p59p23m16j16
$$ plain form
52898 254254 254159 253204 252413 252325 252593 252834 253091 253434 253815 254383 255341 256485 257452 258324 259344 260117 259859 258478
52880 258478 256721 255278 254354 254121 254684 255483 255523 254622 253815 254236 256043 258622 261293 263576 265341 266983
52864 266983 269041 271389 273163 273635 272828 271207 269235 267287 265458 263299 260233 256411 252672 249557 246860
52849 246860 244273 241886 239856 238119 236667 235597 234667 233360 231624 229990 228733 227532 226320 225758 226334
52834 226334 227493 228289 228584 229067 230284 232111 234009 235409 236013 236019 235945 236008 235932 235547 235257 235565 236500 237835
52816 237835 239586 241814 244185 246192 247737 249089 250272 250929 250864 250365 249820 249143 247745 245098 241355 237396
52800 237396 234230 232303 231356 230816 230232 229512 228930 228809 229033 229064 228652 228270 228432 228896 229047 228882 228932 229330 229779
52781 229779 230504 232309 235299 238306 240154 240907 241320 241568 241249 240322 239306 238549 237891 237132 236409 235993 235877
52764B35877j87p29j394j583j021j02N58P48O98O95R08J267J295M55q47j223Q7
52747B35502J976K740K170J508J430J402J080J108J926K759K613J670R97J097
52733B59978J411J146K18p21j014p22n03p18r28o78l87q54j931k507j938q32j29
52716B48891j7q7k9K17N85Q12O04J70K36J106K076K153J185j13j036j439j500
52699B53814j376j171q92m33K58R43J161P06q9o19n56p4M99R86J208P99l57j596
52681B53211j965j381q15r77j399j240n48l8L7J06M99J047J428J435R66K01k86
52664B50281r1M95R47J289J855K472K645K464K479K708K574J987J601J721J730
52649B77157J053p8j165k110k803k741j811r32j062j808j839o36Q35J360Q17R1
$$ plain form
52764 235877 235690 234961 233567 231984 230963 230861 231419 232167 232865 233560 234468 235735 237030 237485 236638 235415 235502
52747 235502 237478 240218 242388 243896 245326 246728 247808 248916 250842 253601 256214 257884 258881 259978
52733 259978 261389 262535 262753 262032 261018 260296 259793 259075 258147 257469 257082 256228 254297 251790 249852 249020 248891
52716 248891 248874 248787 248758 248975 249560 250372 250976 251146 251382 252488 254564 256717 257902 257789 256753 255314 253814
52699 253814 252438 251267 250375 249942 250200 251143 252304 253010 252921 252302 251746 251672 252171 253157 254365 255164 254807 253211
52681 253211 251246 249865 249050 248073 246674 245434 244886 244848 244885 244991 245490 246537 247965 249400 250366 250567 250281
52664 250281 250190 250685 251632 252921 254776 257248 259893 262357 264836 267544 270118 272105 273706 275427 277157
52649 277157 278210 278132 276967 274857 272054 269313 267502 266570 265508 263700 261861 261225 262060 263420 264237 264328
52633B64328M9Q73K135L197L603L327K651J836Q84k64j440k327k856l311l829
52618B68856l992l268j841o05j51k06k92m73r64j371r75J97J212J279O34J27K15
52601B58382O03P88P26Q15J200J331O00o59j334q66R9P26J027J358J444P49m17
52584B66572j029o54J17O27Q47J000J050Q96O58N06M91O31Q34O72k30j473j981
52567B69534j189J70Q14K54q08j352j039l18K85P02R99P88m37k270l348k758j138
52550B58889J58N82O05O90Q06Q03O95M73J13k89o79j158j553j249l2J233J497
52533B61584Q73L17K03J08o0K18R64J285N65n89j137q02p0N92J047J238J141R17
52515B68394Q96J297J924K290K219K265L045M109M142K666P93l13r10j821k822
$$ plain form
52633 264328 264377 265250 267385 270582 274185 277512 280163 281999 282883 282619 281179 278852 275996 272685 268856
52618 268856 264864 261596 259755 259150 258999 258793 258501 258028 257064 255693 254718 254915 256127 257406 258040 258167 258382
52601 258382 258985 259773 260499 261314 262514 263845 264445 263786 262452 261586 261685 262411 263438 264796 266240 266989 266572
52584 266572 265543 264889 265006 265633 266480 267480 268530 269426 270084 270590 271081 271712 272546 273218 272988 271515 269534
52567 269534 268345 268515 269329 269583 268775 267423 266384 266066 266351 267053 268052 268840 268403 266133 262785 260027 258889
52550 258889 259047 259629 260234 260924 261730 262533 263228 263701 263814 263525 262846 261688 260135 258886 258854 260087 261584
52533 261584 262457 262774 262977 263085 263025 263243 264207 265492 266057 265468 264331 263529 263459 264051 265098 266336 267477 268394
52515 268394 269290 270587 272511 274801 277020 279285 282330 286439 290581 293247 294040 293727 292817 290996 288174
52500B88174l125k873k807k794k109j078q37j363j258kJ064P01m84j146r91o70
52484B68402n82o54p78p72l31N61J485K082K210J618L18p03k33J387K374J811
52468B78195P69N53J041J496J914K503K784K298J531J107O77l66j585k010j554
52453B89353j043j041j436j895k030j518o12j24l51o16m29l60r56j621j543j115
52437B72663j180j506j223m38n7k00p1N81J036Q06K46k08m90m70O5Q15J079O71
52419B72119J17q6K04J048K294L247L267K794K931L998N330O576Q168J0184J1648
52404C33839J1576J0108Q056N773L011l52l889o861q723r436r395q958q134o824
52390C09791n175l498k011r35n28p11r26q00n24k98J81J032J604J358R23J321
$$ plain form
52500 288174 285049 282176 279369 276575 274466 273388 272551 271188 269930 269928 270992 271693 271209 270063 269072 268402
52484 268402 267820 267166 266388 265616 265285 265846 267331 269413 271623 273241 273559 272856 272623 274010 276384 278195
52468 278195 278964 279517 280558 282054 283968 286471 289255 291553 293084 294191 294868 294502 292917 290907 289353
52453 289353 288310 287269 285833 283938 281908 280390 279778 279654 279303 278687 278258 277898 276942 275321 273778 272663
52437 272663 271483 269977 268754 268316 268259 268059 267988 268569 269605 270411 270657 270449 269959 269489 269554 270369 271448 272119
52419 272119 272236 272150 272354 273402 275696 278943 282210 285004 287935 291933 297263 303839 312007 322191 333839
52404 333839 345415 355523 363579 369352 372363 372011 368122 361261 352538 343102 333707 324749 316615 309791
52390 309791 304616 301118 299107 298172 297644 296933 296007 295207 294683 294385 294566 295598 297202 298560 299483 300804
52374C00804K423L206L357L563M187M686M532L807K711J367L15J46M44O2j126
52359C34484j765q37Q88J934J917J518J250J041P40M19K40M26J068J755J845J324
52343C48247R60J209J653J925K486L755N075N457N039M866N373N984O262O573
52329D04864P346Q413R412J0302J1117J1619J1711J1864J2603J3722J4468J4511
52317E41952J4338J4509J4971J5286J5369J5558J6069J6746J7399J8010J8473
52306G18680J8525J8161J7848J8004J8475J8813J8829J8498J7596J5928J3851
52295I13208J1997J0514R009P241N359L411J222j024k665l357l615m138m914n413
52281I36835n369m995m596m333m210l960l083j393M95J611J656J265J212J682
$$ plain form
52374 300804 303227 306433 309790 313353 317540 322226 326758 330565 333276 334643 334958 335104 335548 335610 334484
52359 334484 332719 331882 332770 334704 336621 338139 339389 340430 341170 341589 341829 342255 343323 345078 346923 348247
52343 348247 349207 350416 352069 353994 356480 360235 365310 370767 375806 380672 386045 392029 398291 404864
52329 404864 412210 420623 430035 440337 451454 463073 474784 486648 499251 512973 527441 541952
52317 541952 556290 570799 585770 601056 616425 631983 648052 664798 682197 700207 718680
52306 718680 737205 755366 773214 791218 809693 828506 847335 865833 883429 899357 913208
52295 913208 925205 935719 944728 951969 957328 960739 961961 960937 958272 954915 951300 947162 942248 936835
52281 936835 931466 926471 921875 917542 913332 909372 906289 904896 905391 907002 908658 909923 911135 912817
52267I12817K404L161L916M599N188N964P392R534J1767J3321J4110J4790J5912
52254A024875J7220J7943J7702J6818J5753J4532J2909J0897Q836O919M976K827
52242A172207O95j045k411l774n192o219o531o559p056q206r498j0431j0989j1400
52228A083591j1840j2407j3015j3190j2356j0564q659p477p058o804o209n240
52216I68772m186l343k686j871p04M32R68R65J061J555K001J982J738J722K026
52201I70432K641L749N342O927Q102Q992R692R676Q501O695N212M186K940J195
52187A054282n28j753k648l585m628n607o370o835p047p207p308o916n783m516
52173I83551m063m410m443l404j933j331j990k950k934j670l6R84J377J904K827
$$ plain form
52267 912817 915221 918382 922298 926897 932085 938049 945441 954975 966742 980063 994173 1008963 1024875
52254 1024875 1042095 1060038 1077740 1094558 1110311 1124843 1137752 1148649 1157485 1164404 1169380 1172207
52242 1172207 1172902 1171857 1169446 1165672 1160480 1154261 1147730 1141171 1134115 1125909 1116411 1105980 1094991 1083591
52228 1083591 1071751 1059344 1046329 1033139 1020783 1010219 1001560 994083 987025 980221 974012 968772
52216 968772 964586 961243 958557 956686 955982 956414 957382 958347 959408 960963 962964 964946 966684 968406 970432
52201 970432 973073 976822 982164 989091 997193 1006185 1015877 1025553 1034054 1040749 1045961 1050147 1053087 1054282
52187 1054282 1053754 1052001 1049353 1045768 1041140 1035533 1029163 1022328 1015281 1008074 1000766 993850 988067 983551
52173 983551 979488 975078 970635 967231 965298 963967 961977 959027 956093 954423 954387 955371 956748 958652 961479
52158I61479L433L042K041J346J200J141R32Q39J061J537K338L497M390M044K353
52143I94673M48n39o77q33j482k254k501j963r31J12J018K065L447M862N911O782
52127A008138Q086J0066J2368J4604J6672J8472J9759K0444K0677K0582K0234
52116A190102J9947K0108K0619K0962K0954K0956K1146K1057K0255J9088J8326
52105A413520J8248J8417J8205J7231J5472J3255J1062R067O905M127Q12k540
52093A543781n690q824j1875j4080j4679j3961j3097j2823j2766j2418j2127j2434
52081A399007j2860j2331j0785r347q675q150p161o142n596m940l311r34J289
52068A310064L092M751O146P030Q005R965J2580J4458J5002J5069J5507J6053
$$ plain form
52158 961479 964912 967954 969995 971341 972541 973682 974614 975453 976514 978051 980389 983886 988276 992320 994673
52143 994673 995121 994582 993905 993072 991590 989336 986835 984872 983941 984053 985071 987136 990583 995445 1001356 1008138
52127 1008138 1016224 1026290 1038658 1053262 1069934 1088406 1108165 1128609 1149286 1169868 1190102
52116 1190102 1210049 1230157 1250776 1271738 1292692 1313648 1334794 1355851 1376106 1395194 1413520
52105 1413520 1431768 1450185 1468390 1485621 1501093 1514348 1525410 1534477 1541382 1545509 1546321 1543781
52093 1543781 1538091 1529267 1517392 1503312 1488633 1474672 1461575 1448752 1435986 1423568 1411441 1399007
52081 1399007 1386147 1373816 1363031 1353684 1345009 1336859 1329698 1323556 1317960 1313020 1309709 1308775 1310064
52068 1310064 1313156 1317907 1324053 1331083 1339088 1349053 1361633 1376091 1391093 1406162 1421669 1437722
52056A437722J6026J5308J4057J2259J0090Q164O861N695L875J237j597l835n130
52043A520732n817o595p776q940r554r765j0078j0605j1216j2220j4021j6095
52031A398050j7236j7034j6418j6434j7155j7982j8440j8416j8092j7871j7944
52020A205028j7863j7017j5497j3919j2535j1247j0303j0073j0145r743r125r429
52008A058132j0838j2126j2511j2766j3749j4930j5264j4730j3985j3158j1947
51997I12128j0496r325q691q678r529j1207j2997j4202j4973j5879j6953j7709
51985G61489j7849j7467j6823j6337j6450j7055j7383j6779j5297j3259j0802
51974E85988q209o026m328k485j86J937L280M220N322O260O317N510M363K961
$$ plain form
52056 1437722 1453748 1469056 1483113 1495372 1505462 1513626 1520487 1526182 1530057 1531294 1529697 1525862 1520732
52043 1520732 1514915 1508320 1500544 1491604 1482050 1472285 1462207 1451602 1440386 1428166 1414145 1398050
52031 1398050 1380814 1363780 1347362 1330928 1313773 1295791 1277351 1258935 1240843 1222972 1205028
52020 1205028 1187165 1170148 1154651 1140732 1128197 1116950 1106647 1096574 1086429 1076686 1067561 1058132
52008 1058132 1047294 1035168 1022657 1009891 996142 981212 965948 951218 937233 924075 912128
51997 912128 901632 892307 883616 874938 865409 854202 841205 827003 812030 796151 779198 761489
51985 761489 743640 726173 709350 693013 676563 659508 642125 625346 610049 596790 585988
51974 585988 577779 571753 567425 564940 564754 566691 569971 574191 579513 585773 592090 597600 601963 604924
51960F04924J065j109l003m436n442n716m875l122j033J019K793M098N394P825
51946E98382J1795J6118J9518K2423K5975K9757L1900L1352K8640K4263J7861
51935H57984R429J87q418j5671k1131k4156k4690k3898k3283k3391k3741k3605
51923F55616k2580k0789j8914j7636j6815j5615j3645j1485r832q597p201n317
51911D87190l019o11J304K148K132K291L220M141L867K364N98j017l037n670p962
51896D87939r004r316j0066j1100j0905q811o203m720l992k334O12L270M358M535
51882D24263N131O264P147P598Q216R228J0049J0018Q918O793L861P24j862l565
51868E02783m577n131n284n075m576l791k761j686o38O02K062L151L158K044M12
$$ plain form
51960 604924 605989 604880 601877 597441 591999 586283 581408 578286 577253 578272 581065 585163 590557 598382
51946 598382 610177 626295 645813 668236 694211 723968 755868 787220 815860 840123 857984
51935 857984 867413 867600 859182 843511 822380 798224 773534 749636 726353 702962 679221 655616
51923 655616 633036 612247 593333 575697 558882 543267 529622 518137 508305 499708 492507 487190
51911 487190 484171 483560 484864 487012 489144 491435 494655 498796 502663 505027 505625 504608 501571 495901 487939
51896 487939 478935 469619 459553 448453 437548 428737 422534 417814 413822 411488 412100 415370 419728 424263
51882 424263 429394 435658 442805 450403 458619 467847 477896 487914 496832 503625 507486 508210 506348 502783
51868 502783 498206 493075 487791 482716 478140 474349 471588 469902 469264 469866 471928 475079 478237 480281 480693
51853D80693j195k556l587m362n225o326p217p327o762o112n608m983m119l231
51839D12083k436j671j029o79m43j6M44N02L27O48J656K507K336J295K15m40q43
51822D14456j179j235p00K88J103J197O64J07r9j58l97p92j198j616j917j643
51806D06881o12N39J032R79J125J638J861J365O34L76O16Q11N47q5o47p30k42
51789D16088N00J018J038O54K45J80M15L55m67j518j626m31J087J918K264K886
51773D24606L883M861N787O708P030O146M616L575K949J440j496m716o861p795
51759D50733q110p992p317o283n285m487l981m028m601n018m512l126j650p65
51745C83578m65k60K44R84J616K041K584L397L974L682K718J998K054K496K602
$$ plain form
51853 480693 479498 476942 473355 468993 463768 457442 450225 442898 436136 430024 424416 419433 415314 412083
51839 412083 409647 407976 406947 406268 405825 405809 406253 406755 407082 407730 409386 411893 414229 415524 415739 415299 414456
51822 414456 413277 412042 411342 411630 412733 413930 414594 414701 414602 414444 414047 413255 412057 410441 408524 406881
51806 406881 406269 406808 407840 408819 409944 411582 413443 414808 415442 415818 416434 417245 417792 417707 417060 416330 416088
51789 416088 416588 417606 418644 419298 419543 419723 420138 420493 420026 418508 416882 416451 417538 419456 421720 424606
51773 424606 428489 433350 439137 445845 452875 459021 463637 467212 470161 471601 470105 465389 458528 450733
51759 450733 442623 434631 427314 421031 415746 411259 407278 403250 398649 393631 389119 385993 384343 383578
51745 383578 383113 382853 383097 384081 385697 387738 390322 393719 397693 401375 404093 406091 408145 410641 413243
51730D13243K052J008j8l41L14J303J651J245R15J140J310O72n40j397j351o17
51714D20589K39O85L86m68j033m48J247L028L915L905L707L613L083J672J6q27
51698D43309p97q06j131q66N25K039K397J711Q46k58k238m638n974n647m530l457
51682D20485k348j091j68K32O47J264J307K35j203j841j568j175j141j191q46
51667D11598J25J590L071M030M315M085L404K377J591J610J904J317m5l46J834
51652D42460N640Q898J0345J0180Q962O902M028N11l215o315q011q471q670r076
51638D54168r137q549q127q517q850p873n913m517m184l794k393m84Q09J055N32
51623C84226l90j389k161k627k975l272l353l166k890k595k088j324o15j63K68
$$ plain form
51730 413243 415295 416303 416285 415944 416258 417561 419212 420457 421372 422512 423822 424494 423954 422557 421206 420589
51714 420589 420828 421513 421899 421431 420398 419950 421197 424225 428140 432045 435752 439365 442448 444120 444136 443309
51698 443309 442512 441706 440575 439709 440234 442273 444670 446381 447227 446969 444731 440093 434119 428472 423942 420485
51682 420485 418137 417046 416878 417110 417757 419021 420328 420563 419360 417519 415951 414776 413635 412444 411598
51667 411598 411723 413313 416384 420414 424729 428814 432218 434595 436186 437796 439700 441017 440972 440626 442460
51652 442460 448100 456998 467343 477523 486485 493387 497415 497926 494711 488396 480385 471914 463244 454168
51638 454168 445031 436482 428355 419838 410988 403115 397202 392685 388501 384707 382314 381830 382639 383694 384226
51623 384226 383836 382447 380286 377659 374684 371412 368059 364893 362003 359408 357320 355996 355381 355218 355486
51608C55486R29J502J395O46J83R31K732M511N540O269P646R805J1830J2772J2431
51593D34608J1108R015O206K798r25m465p019p770o541l982r52K084M941P335
51579D46441R013J0068J0893J1804J2864J3938J4753J4979J4385J3010J1213R535
51567E92896Q316P388O505O224P880J2140J7993K3803K8923L3532L7174L8656
51555H21430L7465L4190K9361K2971J5521Q349K237l422r374j5208k0082k4029
51543H99409k7564l0568l2405l2851l2139l0564k8608k7064k6180k5145k3143
51532E83178k0582j8425j6714j4748j2495j0725r756q994p928o749n820n170m794
51519D40278m810n044m926m163l180k657k716k775k160q64K19J20j067k174k333
$$ plain form
51608 355486 356415 357917 359312 359958 360141 361072 363804 368315 373855 380124 387770 397575 409405 422177 434608
51593 434608 445716 454731 460937 463735 462810 458345 451326 443556 437015 433033 432081 434165 439106 446441
51579 446441 455454 465522 476415 488219 501083 515021 529774 544753 559138 572148 583361 592896
51567 592896 601212 608600 615105 621329 629209 641349 659342 683145 712068 745600 782774 821430
51555 821430 858895 893085 922446 945417 960938 969287 971524 968102 958728 943520 923438 899409
51543 899409 871845 841277 808872 776021 743882 713318 684710 657646 631466 606321 583178
51532 583178 562596 544171 527457 512709 500214 489489 479733 470739 462811 456062 450242 445072 440278
51519 440278 435468 430424 425498 421335 418155 415498 412782 410007 407847 406983 407202 407322 406255 404081 401748
51504D01748j914j749j818j332RJ529K240J752M96o12q82n22l39n63m21P04K148
51487D00474K669K005R95K86l23j295k650l972m696m434l402k481k407l053l767
51472C73949m243m546m584m099l164k178j420r56p70o25j02P94J364J085L70o1
51456C50814r5J16R52K719M675N717N981O671Q308J0211J1807J3325J4824J5611
51442D51636J5123J3631J1590R049O099L260R02j086k773l980n009o812r697j2531
51428D69402j3902j3729j3027j2447j1689j0241q056n519l156j414m33mO0k41
51414C75604p44r19l71N93J268J349J181J287J883K773L513L763L648L734M448
51399D03010N581O428O433N649M672M179M489N451O675P844Q825R694J0775J2424
$$ plain form
51504 401748 399834 398085 396267 394935 394944 396473 398713 400465 400961 400349 399467 398945 398606 398043 397622 398326 400474
51487 400474 403143 405148 406143 406429 406106 404811 402161 398189 393493 389059 385657 383176 380769 377716 373949
51472 373949 369706 365160 360576 356477 353313 351135 349715 348759 347989 347364 347262 348056 349420 350505 350875 350814
51456 350814 350719 350835 351787 354506 359181 364898 370879 377550 385858 396069 407876 421201 436025 451636
51442 451636 466759 480390 491980 501029 507128 510388 511290 510204 507431 503451 498442 491630 481933 469402
51428 469402 455500 441771 428744 416297 404608 394367 386311 380792 377636 376222 375789 375785 375845 375604
51414 375604 374860 373941 373570 374163 375431 376780 377961 379248 381131 383904 387417 391180 394828 398562 403010
51399 403010 408591 415019 421452 427101 431773 435952 440441 445892 452567 460411 469236 478930 489705 502129
51385E02129J4659J7195K0025K3632K8256L3274L7780M1639M5367M8931N1265
51374H64152N1133M8091M2458L4778K5629J5633N465m229j2955k0698k8012l5346
51362I86099m2166m7152m9443m9407m8064m6000m3151l9362l4916l0403k6270
51351E29765k2509j8873j5305j2064r446p584o529o157n891n026l605k584k641
51338D11551l198l202k558k121k439l174l741l899l655l153k762k772l002l033
51324C68842k773k379j764p80J97N68L96M39J143K197L134L767L928L398K330
51309C82643J247M51j97q58j494k069k507k454j691p33l79o26p28m00k24o15j141
51292C68225j197p43j20L84N59M74P09J812L392M466M825N171N724N710M681L346
$$ plain form
51385 502129 516788 533983 554008 577640 605896 639170 676950 718589 763956 812887 864152
51374 864152 915285 963376 1005834 1040612 1066241 1081874 1087339 1083110 1070155 1049457 1021445 986099
51362 986099 943933 896781 847338 797931 749867 703867 660716 621354 586438 556035 529765
51351 529765 507256 488383 473078 461014 451568 443984 437455 431298 425407 420381 416776 414192 411551
51338 411551 408353 405151 402593 400472 398033 394859 391118 387219 383564 380411 377649 374877 371875 368842
51324 368842 366069 363690 361926 361146 361343 361911 362307 362746 363889 366086 369220 372987 376915 380313 382643
51309 382643 383890 384341 384144 383286 381792 379723 377216 374762 373071 372338 371959 371333 370605 370205 369981 369366 368225
51292 368225 367028 366285 366165 366549 367108 367582 368291 370103 373495 377961 382786 387957 393681 399391 404072 407418
51276D07418K388J387k43j980k811k660k215j691o51R87K572L410L316K494J253
51261D12974r9j369k442l070l004k465k097k222k504k564k445k230j737r80l34
51246C83412R0O67J377J452M78o73q90l15k9n53j430k021k027j392m28J09k30
51229C77597r45j254j192j350j704j552o62L39Q14P83O29P05J274K301L121K988
51213C81892K046J375J720K691L361L362L063K986L267L672L928L983L886L463
51199D24695K397P71q06j879k595l200l444k997k204j728j595j232m02M94J104
51184D07379J542J957K228K253K117J768R52k76j386j964k181k408k661k739k708
51169D03873k842l099l009k250j105j89K81O37J158J558J350N89j64n66q14j135
$$ plain form
51276 407418 409806 411193 410950 408970 406159 403499 401284 399593 398942 399929 402501 405911 409227 411721 412974
51261 412974 412875 411506 409064 405994 402990 400525 398428 396206 393702 391138 388693 386463 384726 383746 383412
51246 383412 383502 384169 385546 386998 387476 386803 385913 385598 385569 385016 383586 381565 379538 378146 377718 377827 377597
51229 377597 376652 375398 374206 372856 371152 369600 368938 369277 370091 370874 371503 372208 373482 375783 378904 381892
51213 381892 383938 385313 387033 389724 393085 396447 399510 402496 405763 409435 413363 417346 421232 424695
51199 424695 427092 427863 427057 425178 422583 419383 415939 412942 410738 409010 407415 406183 405781 406275 407379
51184 407379 408921 410878 413106 415359 417476 419244 420196 419920 418534 416570 414389 411981 409320 406581 403873
51169 403873 401031 397932 394923 392673 391568 391379 391660 392297 393455 395013 396363 396952 396788 396222 395408 394273
51153C94273j413j454j285r45m04J47L43K36L76R39J273P77j91q38r74r44q68
51136C89048o23l72l92m74k07K39L28J59M60J482K559L012K946K896L176L769
51120D08006M339M217K905R46k98o0R71J613J565J325J164P42j32r55r63NJ246
51103D26636J830J485Q07M72M32J29n77j094q42J5Q21J202J308J441J634J721
51087D37420J605J382J221J169J074P57J99l58n45j68N45J108J320J545K150K871
51071D53295L179L220L792N165O622P578Q519J0207J2519J4775J6870J9101K1112
51058E85954K1928K1166J9355J6889J3512R254N177K613J964K518L158L021J835
51045G08344p7k301m883p948j0895j2672j3036j2786j2368j1114q477n384l448
$$ plain form
51153 394273 392860 391406 390121 389176 388772 388919 389262 389498 389874 390813 392086 392863 392672 391834 390860 389916 389048
51136 389048 388425 388053 387661 387187 386980 387219 387547 387706 388166 389648 392207 395219 398165 401061 404237 408006
51120 408006 412345 416562 419467 420413 420115 420055 421026 422639 424204 425529 426693 427435 427303 426348 425385 425390 426636
51103 426636 428466 429951 430758 431230 431662 431791 431214 430120 429278 429293 430114 431316 432624 434065 435699 437420
51087 437420 439025 440407 441628 442797 443871 444628 444827 444469 443924 443756 444301 445409 446729 448274 450424 453295
51071 453295 456474 459694 463486 468651 475273 482851 491370 501577 514096 528871 545741 564842 585954
51058 585954 607882 629048 648403 665292 678804 688058 693235 695848 697812 700330 703488 706509 708344
51045 708344 708267 705966 701083 693135 682240 669568 656532 643746 631378 620264 611787 606403 602955
51032F02955l248m210n812p846r627j0050q869p019n307l376n12L090O450Q824
51018E55443J0174J0879J1465J2330J3227J3273J2000J0197R039Q520P494N404
51006F79445L175J995J866J826J135k87k230m254n670n994n472m731l985l000
50992F53819j642j7J841L847N564O652P591R276J1837J4424J6326J7587J8413
50979G65518J8706J8545J8390J8476J8562J8721J9790K2486K6580L1413L6651
50968A013838M2001M6825N0794N4429N8207O1579O3666O4653O5478O6364O6564
50957A654398O5530O3319N9720N4028M6176L7354K8997K1604J4962R101M467J324
50945B060980n62j656k257k464k515l076m956q314j2323j5807j8083j9135j9414
$$ plain form
51032 602955 599707 595497 589685 581839 572212 562162 553293 546274 540967 537591 537079 540169 546619 555443
51018 555443 565617 576496 587961 600291 613518 626791 638791 648988 658027 666547 674041 679445
51006 679445 682620 684615 686481 688307 689442 689155 686925 682671 677001 671007 665535 660804 656819 653819
50992 653819 652177 652160 654001 657848 663412 670064 677655 686931 698768 713192 729518 747105 765518
50979 765518 784224 802769 821159 839635 858197 876918 896708 919194 945774 977187 1013838
50968 1013838 1055839 1102664 1153458 1207887 1266094 1327673 1391339 1455992 1521470 1587834 1654398
50957 1654398 1719928 1783247 1842967 1896995 1943171 1980525 2009522 2031126 2046088 2055189 2059656 2060980
50945 2060980 2060418 2058762 2056505 2054041 2051526 2048450 2043494 2035180 2022857 2007050 1988967 1969832 1950418
50932A950418j9890k1745k5389k9874l3909l7188m0226m3270m6135m8906n1762
50921A552124n4037n4485n2765m9975m7334m5002m2453l9369l5789l2014k8642
50910A070259k6146k4185k1968j9527j7794j7040j6234j4574j2796j1923j1479
50899H76593j0134p780n724m757m177l060j587n83l60n09n07p5Q10J896K778L356
50883H46180L993N017O209P059P397P546P884Q541R570J0992J2506J3464J3568
50870I59926J3513J4439J6644J9259K1405K3221K5277K7508K9480L1503L4577
50859A216752L9009M3937M8681N3859O0523O8666P7365Q6172R5448J05237J14655
50848B010304J22834J29937J36645J42988J48253J51869J53680J53171J49111
$$ plain form
50932 1950418 1930528 1908783 1883394 1853520 1819611 1782423 1742197 1698927 1652792 1603886 1552124
50921 1552124 1498087 1443602 1390837 1340862 1293528 1248526 1206073 1166704 1130915 1098901 1070259
50910 1070259 1044113 1019928 997960 978433 960639 943599 927365 912791 899995 888072 876593
50899 876593 866459 858679 852955 848198 844021 840961 839374 838791 838431 837922 837415 837340 838150 840046 842824 846180
50883 846180 850173 855190 861399 868458 875855 883401 891285 899826 909396 920388 932894 946358 959926
50870 959926 973439 987878 1004522 1023781 1045186 1068407 1093684 1121192 1150672 1182175 1216752
50859 1216752 1255761 1299698 1348379 1402238 1462761 1531427 1608792 1694964 1790412 1895649 2010304
50848 2010304 2133138 2263075 2399720 2542708 2690961 2842830 2996510 3149681 3298792
50839C298792J40591J28091J12936R5814P6505N5212L3409J2937n274k1035l3911
50828C894067m3208m8850n1403n1123m7623m0856l1951k2715j4644q725n795o497
50816C520677j0944j8792k9553m2518n6522p0331q3415r5918j07663j17495j24096
50805B763430j27245j27824j26495j22894j16520j08002r8769q9527p9752o9014
50795A697388n8144m8522m0492l3152k5726j8587j2724q529n419k569J96K270
50783A445990L037K552J380j05j894l825n395o444p533r214j1169j2577j3233
50770A381570j3813j5024j6849j8649j9773k0101k0185k0681k1451k1529k0253
50759A173262j8171j6325j4929j3307j0938p948m645j194K178N215Q044J1119
$$ plain form
50839 3298792 3439383 3567474 3680410 3776224 3852729 3907941 3941350 3954287 3949013 3927978 3894067
50828 3894067 3850859 3802009 3750606 3699483 3651860 3611004 3579053 3556338 3541694 3532969 3527174 3520677
50816 3520677 3509733 3490941 3461388 3418870 3362348 3292017 3208602 3112684 3005021 2887526 2763430
50805 2763430 2636185 2508361 2381866 2258972 2142452 2034450 1935681 1846154 1766402 1697388
50795 1697388 1639244 1590722 1550230 1517078 1491352 1472765 1460041 1451512 1446093 1443524 1443720 1445990
50783 1445990 1449027 1451579 1452959 1452854 1450960 1447135 1441740 1435296 1427763 1418549 1407380 1394803 1381570
50770 1381570 1367757 1352733 1335884 1317235 1297462 1277361 1257176 1236495 1215044 1193515 1173262
50759 1173262 1155091 1138766 1123837 1110530 1099592 1091644 1086999 1085805 1087983 1093198 1101242 1112361
50747A112361J4653J8362K1764K4497K6535K8430L1128L5001L9263M2880M5940
50736A440814M9476N4054N9219O4288O8932P2892P5838P7690P8630P8669P7712
50725B198214P5969P3623P0105O4420N6318M6437L5305K2970R693l854j7247l0195
50713B601758m1560m9452n2804n2160m8566m2615l4948k6758j9063j2170o345
50702B215317k258k27J23j167m932j1598k0209k9545l9455m9983n9843o7011p0608
50689A858604p1284o9977o7234o3468n8841n2982m5624l7482k9763k2791j5931
50678A323227q724j458N380J1510J6735K1099K5132K9255L2968L5219L5615L4648
50666A560606L2736K9801K5925K1795J8177J5299J2931J0845R145Q294Q669R845
$$ plain form
50747 1112361 1127014 1145376 1167140 1191637 1218172 1246602 1277730 1312731 1351994 1394874 1440814
50736 1440814 1490290 1544344 1603563 1667851 1736783 1809675 1885513 1963203 2041833 2120502 2198214
50725 2198214 2274183 2347806 2417911 2482331 2538649 2585086 2620391 2643361 2653054 2649200 2631953 2601758
50713 2601758 2560198 2510746 2457942 2405782 2357216 2314601 2279653 2252895 2233832 2221662 2215317
50702 2215317 2213059 2212832 2212955 2211788 2206856 2195258 2175049 2145504 2106049 2056066 1996223 1929212 1858604
50689 1858604 1787320 1717343 1650109 1586641 1527800 1474818 1429194 1391712 1361949 1339158 1323227
50678 1323227 1314503 1313045 1318425 1329935 1346670 1367769 1392901 1422156 1455124 1490343 1525958 1560606
50666 1560606 1593342 1623143 1649068 1670863 1689040 1704339 1717270 1728115 1737260 1745554 1754223 1764068
50654A764068J0669J0400R505Q889Q747Q747R011J0111J2193J4888J7938K1277
50642A906443K4565K7376K9893L2717L5905L8785M0737M1657M1672M1074M0401
50631B301225L9970L9456L8680L8456L9510M0413L7860K9585J6214J5j7100l3594
50619B570690m7444n6518n9786n7600n1074m1734l1471k2010j4216q047l079J056
50607B178767M321O086N547K591k128q143j5745k5139l5472m5235n3398n9760
50595A952292o4443o7547o9193o9476o8432o6310o3627o0652n7039n2461m7343
50584A265769m2458l7961l3368k8522k3926k0086j6901j3898j0684p076l184M44
50572A028149L139M848O300Q198J0517J2799J4857J6819J8705K0376K1862K3260
$$ plain form
50654 1764068 1774737 1785137 1794642 1803531 1812278 1821025 1830036 1840147 1852340 1867228 1885166 1906443
50642 1906443 1931008 1958384 1988277 2020994 2056899 2095684 2136421 2178078 2219750 2260824 2301225
50631 2301225 2341195 2380651 2419331 2457787 2497297 2537710 2575570 2605155 2621369 2621384 2604284 2570690
50619 2570690 2523246 2466728 2406942 2349342 2298268 2256534 2225063 2203053 2188837 2180790 2177711 2178767
50607 2178767 2183088 2189174 2194721 2197312 2195184 2187041 2171296 2146157 2110685 2065450 2012052 1952292
50595 1952292 1887849 1820302 1751109 1681633 1613201 1546891 1483264 1422612 1365573 1313112 1265769
50584 1265769 1223311 1185350 1151982 1123460 1099534 1079448 1062547 1048649 1037965 1030889 1027705 1028149
50572 1028149 1031288 1036136 1042436 1050634 1061151 1073950 1088807 1105626 1124331 1144707 1166569 1189829
50560A189829K4356K4799K4858K5538K7579L0499L3046L4477L5081L5465L5744
50549A521271L5556L4547L2671L0155K7422K5016K3391K2741K3032K4220K6410
50538A826432K9721L3974L8606M3103M7498N2276N7714O3644O9926P6724Q4006
50527B423624R1207R7810J03825J09160J12877J13891J12226J08666J03265R5157
50517C471708Q4015P0692N6052M0058K2529L982j4827l3484n1437o7590q1129
50506C500569r2047j00232j04702j04685j00833r4356q5376p3265n8301m1918
50496B644854k5321q905O954K1442L3767M3285M9188N0797M8153M1537L0529J4546
50484B950826n604k7667m9628p0503q9238j04114j13870j18733j19772j17834
$$ plain form
50560 1189829 1214185 1238984 1263842 1289380 1316959 1347458 1380504 1414981 1450062 1485527 1521271
50549 1521271 1556827 1591374 1624045 1654200 1681622 1706638 1730029 1752770 1775802 1800022 1826432
50538 1826432 1856153 1890127 1928733 1971836 2019334 2071610 2129324 2192968 2262894 2339618 2423624
50527 2423624 2514831 2612641 2716466 2825626 2938503 3052394 3164620 3273286 3376551 3471708
50517 3471708 3555723 3626415 3682467 3722525 3745054 3749036 3734209 3700725 3649288 3581698 3500569
50506 3500569 3408522 3308290 3203588 3098903 2998070 2903714 2818338 2745073 2686772 2644854
50496 2644854 2619533 2610628 2617582 2639024 2672791 2716076 2765264 2816061 2864214 2905751 2936280 2950826
50484 2950826 2945222 2917555 2867927 2797424 2708186 2604072 2490202 2371469 2251697 2133863
50474B133863j13592j07898j01415r4273q6598p8850p1341o3910n6548m9802m4027
50463A265609l8760l3398k8064k3241j8841j4314r484m767o31K784N652Q281J0842
50450A121668J3078J4655J5862J7415J9324K0639K0738K0222J9868J9295J7525
50439A320289J4490J1064P834M696J655r04k807m248n159n097m016k508j095K75
50425A334469J781L300M760O468Q775J1673J4960J8520K2271K6128L0243L4907
50413A518255M0039M5133M9904N4463N8589O1405O2384O2165O1590O0254N6927
50402B131108N1377M4833L8377L1739K4010J4875M580o671j8549l0219m0899n0555
50390B194006n9354o6610p1137p2581p1622o8789o3880n6909m8793m0520l2190
$$ plain form
50474 2133863 2020271 1912373 1810958 1716685 1630087 1551237 1479896 1415986 1359438 1309636 1265609
50463 1265609 1226849 1193451 1165387 1142146 1123305 1108991 1099507 1094740 1094109 1096893 1102545 1110826 1121668
50450 1121668 1134746 1149401 1165263 1182678 1202002 1222641 1243379 1263601 1283469 1302764 1320289
50439 1320289 1334779 1345843 1353677 1358373 1360028 1359124 1356317 1352069 1346910 1341813 1337797 1335289 1334194 1334469
50425 1334469 1336250 1339550 1344310 1350778 1359553 1371226 1386186 1404706 1426977 1453105 1483348 1518255
50413 1518255 1558294 1603427 1653331 1707794 1766383 1827788 1890172 1952337 2013927 2074181 2131108
50402 2131108 2182485 2227318 2265695 2297434 2321444 2336319 2340899 2334228 2315679 2285460 2244561 2194006
50390 2194006 2134652 2068042 1996905 1924324 1852702 1783913 1720033 1663124 1614331 1573811 1541621
50379A541621k3437j4459n931J875R220J6057K1558K4648K4824K2329J7690J1225
50367A647220L083o274j5813k4349l1113l5674l7598l6775l4100l1114k8829k7460
50355A341204k7348k9328l3617l9059m3980m7376m8772m7647m3850l8276l2339
50344I09612k6863k1943j7511j3544r976o968m950l862k889j527l27K10Q45K599
50330H02906M980O415O325N630N243N305N872P080Q385Q817Q403Q264Q925R518
50316I02068R200Q308P476O536N076L444K360J995K015K180K425K703L168M084
50302I63038N196N718N323M635M354M418M547M922N704O304N819M027J447j351
50288A024101m043o410q253r362r405q205o295m686l771k854j075J591M546P246
$$ plain form
50379 1541621 1518184 1503725 1497794 1499669 1508889 1524946 1546504 1571152 1595976 1618305 1635995 1647220
50367 1647220 1650303 1644029 1628216 1603867 1572754 1537080 1499482 1462707 1428607 1397493 1368664 1341204
50355 1341204 1313856 1284528 1250911 1211852 1167872 1120496 1071724 1024077 980227 941951 909612
50344 909612 882749 860806 843295 829751 819775 812807 807857 803995 801106 799579 799252 799462 800307 802906
50330 802906 807886 814301 820626 826256 831499 836804 842676 849756 858141 866958 875361 883625 892550 902068
50316 902068 911268 919576 927052 933588 938664 942108 944468 946463 948478 950658 953083 955786 958954 963038
50302 963038 968234 973952 979275 983910 988264 992682 997229 1002151 1007855 1014159 1019978 1024005 1025452 1024101
50288 1024101 1020058 1013648 1005395 996033 986628 978423 972128 967442 963671 960817 959742 961333 965879 973125
50274I73125R402J1000J2458J4308J6371J7867J8651J9598K1274K2964K3768K3959
50262A184745K4430K5209K5536K5069K4140K2861K0927J8368J5814J3813J2275
50251A413187J0688Q505N327J045m082r645j5251k0335k4108k5977k5812k3662
50239A289880j9619j4285r010n184l518m255p522j2954j9323k5099k9259l1372
50227A108480l1331k9546k6988k4424k1894j9307j7150j5979j5577j5274j4788
50216H76222j4120j2998j1233r453q598q691q866q606q273q240q245p902p360
50203G53637p029o940o647n687m128k663k108k625l554m119m078l626l011k470
50189F94952k233k255k200j833j206l76O16J384J482J248J589K558L026K341J442
$$ plain form
50274 973125 982527 993527 1005985 1020293 1036664 1054531 1073182 1092780 1114054 1137018 1160786 1184745
50262 1184745 1209175 1234384 1259920 1284989 1309129 1331990 1352917 1371285 1387099 1400912 1413187
50251 1413187 1423875 1432380 1437707 1438752 1434670 1425025 1409774 1389439 1365331 1339354 1313542 1289880
50239 1289880 1270261 1255976 1246966 1241782 1238264 1234009 1226487 1213533 1194210 1169111 1139852 1108480
50227 1108480 1077149 1047603 1020615 996191 974297 954990 937840 921861 906284 891010 876222
50216 876222 862102 849104 837871 828418 819820 811129 802263 793657 785384 777144 768899 760997 753637
50203 753637 746608 739668 733021 727334 723206 720543 718435 715810 712256 708137 704059 700433 697422 694952
50189 694952 692719 690464 688264 686431 685225 684849 685465 686849 688331 689579 691168 693726 696752 699093 700535
50174G00535J490K179K447K209K175K429K477K440L004M097M886N101N430O364
50160G47263P656R046J0695J2672J4819J7313K0522K4172K7426L0015L2461L5079
50148I89139L7527L9645M1840M4197M5940M6259M5211M3443M1529L9918L9040
50137A453688L8992L9345L9394L8352L5289K9457K0818R932k634j6246k9599m0959
50125A615829m9302n4833n8253n9972o0033n8248n4377m8764m2746l7743l3844
50114A057714l0129k6409k3705k2619k2266k1402j9941j8573j7483j6155j4205
50103H24827j1820r499p792p018o906o662n739m417l459l292l670l902l381k136
50089G45134q95l28k25K09J247K257K518J997J295J201K192M024N750O637O932
$$ plain form
50174 700535 702025 704204 706651 708860 711035 713464 715941 718381 721385 725482 730368 735469 740899 747263
50160 747263 754919 763965 774660 787332 802151 819464 839986 864158 891584 921599 954060 989139
50148 989139 1026666 1066311 1108151 1152348 1198288 1244547 1289758 1333201 1374730 1414648 1453688
50137 1453688 1492680 1532025 1571419 1609771 1645060 1674517 1695335 1705267 1702633 1686387 1656788 1615829
50125 1615829 1566527 1511694 1453441 1393469 1333436 1275188 1220811 1172047 1129301 1091558 1057714
50114 1057714 1027585 1001176 977471 954852 932586 911184 891243 872670 855187 839032 824827
50103 824827 813007 803508 795716 788698 781792 775130 769391 764974 761515 758223 754553 750651 747270 745134
50089 745134 744239 743911 743686 743895 745142 747399 749917 751914 753209 754410 756602 760626 766376 773013 779945
50074G79945P345P981Q435Q670Q968R137Q669P679O762N930M636K943J598P35
50060H69433k93j584k302k145j956k297k537k123j648j714j712p76P96K114L060
50045H54316M050N090O069P465R622J1785J2986J3593J4891J7250J9808K1883
50033I98808K3716K5697K7777K9762L1568L3000L3832L4130L3980L3115L1323
50022A336708K9020K6763K4352K1183J7394J3821J0830P935M725J377j990n911
50010A486207j1154j8025k6190l4709m2169m7186m9155m8437m5821m1969l7297
49999A084095l2146k7043k2809k0105j8697j7561j6061j4670j4104j4189j4175
49988H72535j3894j3862j4366j4997j5178j4679j3676j2604j1813j1120r935q150
$$ plain form
50074 779945 787290 795271 803706 812376 821344 830481 839150 846829 853591 859521 864157 867100 868698 869433
50060 869433 869140 867556 865254 863109 861153 858856 856319 854196 852548 850834 849122 848346 849142 851256 854316
50045 854316 858366 863456 869525 876990 886612 898397 911383 924976 939867 957117 976925 998808
50033 998808 1022524 1048221 1075998 1105760 1137328 1170328 1204160 1238290 1272270 1305385 1336708
50022 1336708 1365728 1392491 1416843 1438026 1455420 1469241 1480071 1488006 1492731 1494108 1492118 1486207
50010 1486207 1475053 1457028 1430838 1396129 1353960 1306774 1257619 1209182 1163361 1121392 1084095
49999 1084095 1051949 1024906 1002097 981992 963295 945734 929673 915003 900899 886710 872535
49988 872535 858641 844779 830413 815416 800238 785559 771883 759279 747466 736346 726411 718261
49976G18261o495n570n008m174l173k490k080j674j618k374l381l457k257m97
49962F74013J215K803M104M891N606P072R183J0873J1495J1361J0720R323P250
49949G69909N200L443J544m98j861k253k652l950n769p339q678r986j0765j0596
49935G15749j0166j0429j1175j1474j1114j0518r597p877n659l863k750j875j247
49922F18005j335j703r46J382L797M628M001L338L477M149M952N889O944P841
49908F64419Q472R046R704J0223J0321R952R283Q475P667O960O280N294L638J269
49894G71003j465m152o674r144j1453j3097j3625j3157j2214j1132r939q799q143
49881F48009q148q416q384p894p056n886m495l355k872k674j942n43O80J087J208
$$ plain form
49976 718261 711766 706196 701188 697014 693841 691351 689271 687597 685979 683605 680224 676767 674510 674013
49962 674013 675228 678031 682135 687026 692632 699704 708887 719760 731255 742616 753336 762659 769909
49949 769909 775109 778552 780096 779598 777737 775484 772832 768882 763113 755774 747096 737110 726345 715749
49935 715749 705583 695154 683979 672505 661391 650873 641276 633399 627740 623877 621127 619252 618005
49922 618005 616670 614967 614021 615403 619200 623828 627829 631167 634644 638793 643745 649634 656578 664419
49908 664419 672891 681937 691641 701864 712185 722137 731420 739895 747562 754522 760802 766096 769734 771003
49894 771003 769538 765386 758712 749568 738115 725018 711393 698236 686022 674890 664951 656152 648009
49881 648009 639861 631445 623061 615167 608111 602225 597730 594375 591503 588829 586887 586344 587024 588111 589319
49866E89319K077L907O001P803R387J0898J2072J2673J2941J3258J3442J2836
$$ plain form
49866 589319 591396 595303 601304 609107 618494 629392 641464 654137 667078 680336 693778 706614
$$ [...]
##END NTUPLES=NMR SPECTRUM
##END=
