
##TITLE=AC1170_Tolima-ibage-TCHAH12003_7164977_dnJbvTW6tr
##JCAMPDX= 6.0         $$ Bruker NMR JCAMP-DX V2.0
##DATA TYPE= NMR SPECTRUM
##DATA CLASS= NTUPLES
##ORIGIN= BRUKER
##OWNER= Administrator
$$ 1.72 TOPSPIN		Version 2.1
$$ 2012-12-01 17:40:10.113 -0500  Administrator@X
$$ Compression mode = diff/dup
##.OBSERVE FREQUENCY= 400.02188249412
##.OBSERVE NUCLEUS= ^1H
##.ACQUISITION MODE= SIMULTANEOUS (DQD)
##.ACQUISITION SCHEME= undefined
##.AVERAGES= 64
##.DIGITISER RES= 22
##SPECTROMETER/DATA SYSTEM= spect
##.PULSE SEQUENCE= noesygpps1d.comp
##.SOLVENT NAME= COFFEE_meoh
##.SHIFT REFERENCE= INTERNAL, COFFEE_meoh, 1, 14.961
##AUDIT TRAIL= $$ (NUMBER, WHEN, WHO, WHERE, PROCESS, VERSION, WHAT)
$$ ##TITLE= Audit trail, TOPSPIN		Version 2.1
$$ ##JCAMPDX= 5.01
$$ ##ORIGIN= Bruker BioSpin GmbH
$$ ##OWNER= Administrator
$$ $$ E:\/data/COFFEE/nmr/AC1170_Tolima-ibage-TCHAH12003_7164977_dnJbvTW6tr/12/pdata/1/auditp.txt
$$ ##AUDIT TRAIL=  $$ (NUMBER, WHEN, WHO, WHERE, PROCESS, VERSION, WHAT)
(   1,<2012-12-01 17:40:03.846 -0500>,<Administrator>,<X>,<go>,<TOPSPIN 2.1>,
      <created by zg
	started at 2012-12-01 17:28:36.317 -0500,
	POWCHK enabled, PULCHK disabled,
       configuration hash MD5:
       86 BA 57 50 F2 9D 5C 9B 26 00 A9 28 5F 66 2E 89
       data hash MD5: 64K
       C1 76 8A BD F9 B7 97 B4 6B 22 BF 9C 95 24 B2 1F>)
(   2,<2012-12-01 17:40:07.131 -0500>,<Administrator>,<X>,<proc1d>,<TOPSPIN 2.1>,
      <Start of raw data processing
       efp LB = 0.3 FT_mod = 6 PKNL = 1 PHC0 = 0 PHC1 = 0 SI = 128K 
       data hash MD5: 128K
       25 1C BC 08 C9 CA E0 71 C6 48 84 EE 22 AB 6F 89>)
(   3,<2012-12-01 17:40:08.294 -0500>,<Administrator>,<X>,<proc1d>,<TOPSPIN 2.1>,
      <pk PHC0 = -78.60718 PHC1 = 0 
       data hash MD5: 128K
       84 A2 E9 53 64 9B 32 EB 25 CC 37 08 20 C4 96 7C>)
(   4,<2012-12-01 17:40:09.052 -0500>,<Administrator>,<X>,<proc1d>,<TOPSPIN 2.1>,
      <abs ABSG = 1 
       data hash MD5: 128K
       5E FC 9A F0 74 25 DD 4D 6D 48 C7 F8 E6 EB B5 B7>)
(   5,<2012-12-01 17:40:09.237 -0500>,<Administrator>,<X>,<proc1d>,<TOPSPIN 2.1>,
      <abs ABSG = 2 
       data hash MD5: 128K
       EF 74 BC D5 A6 AB 37 57 42 4A E0 3E 1E 27 FA 9C>)
(   6,<2012-12-01 17:40:09.405 -0500>,<Administrator>,<X>,<proc1d>,<TOPSPIN 2.1>,
      <abs ABSG = 3 
       data hash MD5: 128K
       77 95 7A 1E A2 1E CE F7 9A E2 D7 52 32 EB D0 FD>)
(   7,<2012-12-01 17:40:09.591 -0500>,<Administrator>,<X>,<proc1d>,<TOPSPIN 2.1>,
      <abs ABSG = 4 
       data hash MD5: 128K
       7A 40 E1 0B 2A E6 46 AA CE 89 24 0C 98 96 88 C0>)
(   8,<2012-12-01 17:40:09.759 -0500>,<Administrator>,<X>,<proc1d>,<TOPSPIN 2.1>,
      <abs ABSG = 5 
       data hash MD5: 128K
       BA 8F 14 51 D1 C3 88 D1 49 D6 08 1B 37 17 79 F3>)
$$ ##END=
$$ 
$$ $$ hash MD5
$$ $$ B2 E7 33 6E 19 F2 89 00 E9 7F 3B 04 41 ED 56 33
##$RELAX= 
##$RELAX= 
##$RELAX= 
##$RELAX= 
##$RELAX= 
##$RELAX= 
##$RELAX= 
##$RELAX= 
$$ Bruker specific parameters
$$ --------------------------
##$DU= <E:\>
$$ [...]
150 150 150 150 150 150 150 150
##$TP07= 0
##$TPNAME0= <>
##$TPNAME1= <>
##$TPNAME2= <>
##$TPNAME3= <>
##$TPNAME4= <>
##$TPNAME5= <>
##$TPNAME6= <>
##$TPNAME7= <>
##$TPOAL= (0..7)
0.5 0.5 0.5 0.5 0.5 0.5 0.5 0.5
##$TPOFFS= (0..7)
0 0 0 0 0 0 0 0
##$TUNHIN= 0
##$TUNHOUT= 0
##$TUNXOUT= 0
##$USERA1= <user>
##$USERA2= <user>
##$USERA3= <user>
##$USERA4= <user>
##$USERA5= <user>
##$V9= 5
##$VALIST= <valist>
##$VCLIST= <CCCCCCCCCCCCCCC>
##$VD= 0
##$VDLIST= <DDDDDDDDDDDDDDD>
##$VPLIST= <PPPPPPPPPPPPPPP>
##$VTLIST= <TTTTTTTTTTTTTTT>
##$WBST= 1024
##$WBSW= 4
##$XGAIN= (0..3)
0 0 0 0
##$XL= 0
##$YL= 0
##$YMAX_a= 5782479
##$YMIN_a= -11782084
##$ZGOPTNS= <>
##$ZL1= 120
##$ZL2= 120
##$ZL3= 120
##$ZL4= 120
##$ABSF1= 14.961
##$ABSF2= -5.597181
##$ABSG= 5
##$ABSL= 3
##$ALPHA= 0
##$AQORDER= 0
##$ASSFAC= 0
##$ASSFACI= 0
##$ASSFACX= 0
##$ASSWID= 0
##$AUNMP= <proc_prof1d_extract.lims>
##$AXLEFT= 0
##$AXNAME= <>
##$AXNUC= <1H>
##$AXRIGHT= 0
##$AXTYPE= 0
##$AXUNIT= <>
##$AZFE= 0.1
##$AZFW= 0.1
##$BCFW= 0
##$BC_mod= 0
##$BYTORDP= 0
##$COROFFS= 0
##$CY= 15
##$DATMOD= 1
##$DC= 0
##$DFILT= <>
##$DTYPP= 0
##$F1P= 0
##$F2P= 0
##$FCOR= 0.5
##$FTSIZE= 131072
##$FT_mod= 6
##$GAMMA= 0
##$GB= 0
##$INTBC= 1
##$INTSCL= 1
##$ISEN= 128
##$LB= 0.3
##$LEV0= 0
##$LPBIN= 0
##$MAXI= 10000
##$MC2= 0
##$MEAN= 0
##$ME_mod= 0
##$MI= 0
##$NCOEF= 0
##$NC_proc= -2
##$NLEV= 6
##$NOISF1= 0
##$NOISF2= 0
##$NSP= 0
##$NTH_PI= 0
##$NZP= 0
##$OFFSET= 14.961
##$PC= 1
##$PHC0= -78.60718
##$PHC1= 0
##$PH_mod= 1
##$PKNL= yes
##$PPARMOD= 0
##$PPDIAG= 0
##$PPIPTYP= 0
##$PPMPNUM= 2147483647
##$PPRESOL= 1
##$PSCAL= 4
##$PSIGN= 0
##$PYNMP= <proc.py>
##$REVERSE= no
##$SF= 400.020009635754
##$SI= 131072
##$SIGF1= 0
##$SIGF2= 0
##$SINO= 400
##$SIOLD= 131072
##$SPECTYP= <>
##$SREGLST= <1H.CDCl3>
##$SSB= 0
##$STSI= 131072
##$STSR= 0
##$SW_p= 8223.68421052631
##$SYMM= 0
##$S_DEV= 0
##$TDeff= 65536
##$TDoff= 0
##$TI= <>
##$TILT= no
##$TM1= 0
##$TM2= 0
##$TOPLEV= 0
##$USERP1= <user>
##$USERP2= <user>
##$USERP3= <user>
##$USERP4= <user>
##$USERP5= <user>
##$WDW= 1
##$XDIM= 131072
##$YMAX_p= 433375993
##$YMIN_p= -12423
##$CURPLOT= <Network HP LaserJet P1505>
##$CURPRIN= <$Network HP LaserJet P1505>
##$DFORMAT= <normdp>
##$LAYOUT= <+/1D_H.xwp>
##$LFORMAT= <normlp>
##$PFORMAT= <normpl>
##$SURQMSG= 1
$$ End of Bruker specific parameters
$$ ---------------------------------
##NTUPLES= NMR SPECTRUM
##VAR_NAME=  FREQUENCY,     SPECTRUM/REAL,   SPECTRUM/IMAG
##SYMBOL=    X,             R,               I
##VAR_TYPE=  INDEPENDENT,   DEPENDENT,       DEPENDENT
##VAR_FORM=  AFFN,          ASDF,            ASDF
##VAR_DIM=   131072,        131072,          131072
##UNITS=     HZ,            ARBITRARY UNITS, ARBITRARY UNITS
##FACTOR=    0.0627417313425164, 1,          1
##FIRST=     8223.62146879497, 691,          -53966
##LAST=      0,             2153,            -54568
##MIN=       0,             -12423,          0
##MAX=       8223.62146879497, 433375993,    0
$$ Real data points
##PAGE= N=1
##DATA TABLE= (X++(R..R)), XYDATA
$$ [...]
68087 95503 96941 98081 98520 98445 98464 99144 100700 102828 104885 106491 107904 109541 111263 112527 113198 113718
68071 113718 114508 115711 117549 120338 123921 127635 131109 134620 138445 142375 146247 150422 155187 160072
68057 160072 164330 167767 170513 172282 172703 172324 172430 173543 174740 174872 173943 172820 171948 170955 169479 167805
68041 167805 166540 166059 166432 167622 169389 171103 172014 171871 171161 170645 170718 171253 171926 172575 173261 174152 175267
68024 175267 176293 176681 176156 175090 174132 173416 172407 170671 168515 166578 165001 163453 161905 160819 160409
68009 160409 160155 159477 158537 157949 157847 157774 157455 157067 156647 155804 154300 152411 150351 147810 144581 141231 138428
67992 138428 135827 132407 127922 123292 119394 116196 113326 110786 108629 106517 104184 101968 100323 99072
67978 99072 97705 96185 94879 93776 92406 90594 88774 87403 86465 85673 84842 83901 82820 81687 80614
67963 80614 79437 77709 75222 72437 70220 69154 69113 69479 69632 69231 68166 66566 65029 64522 65515 67169
67947 67169 67862 66774 64622 62664 61476 61003 61241 62171 63302 64014 64371 64992 66101 67207 67823 68021 68099
67930 68099 68143 68144 68234 68582 69184 69823 70168 70030 69698 69847 70773 71871 72327 72193 72274 72985 73937 74640 74970 74767
67910 74767 73626 71461 68814 66282 64061 62306 61392 61354 61530 61309 60886 60777 60896 60792 60629 61128 62407
67893 62407 63545 63677 63083 62779 63287 64236 65073 65676 66109 66180 65638 64697 63962 63743 63770 63716 63663 63756 63668 62886 61436
67872 61436 59923 58899 58517 58748 59450 60152 60246 59663 59014 58897 59307 59911 60590 61444 62483 63503 64146 64006
67854 64006 62960 61529 60615 60626 61004 60809 59564 57484 55157 53235 52150 51779 51537 51003 50335 49972 50112
67837 50112 50656 51314 51578 50934 49496 48213 48003 48822 49945 51078 52710 55356 58794 62226 64959 66848
67821 66848 68265 69706 71326 72804 73744 74183 74565 75187 75793 75708 74310 71486 67808 64270 61674 60150
67805 60150 59224 58314 57163 55876 54679 53676 52800 51952 51115 50270 49338 48429 47995 48456 49578 50530 50659
67788 50659 50043 49199 48529 48149 48019 48003 47996 48121 48636 49496 50228 50440 50238 49920 49534 49038 48700 48889 49495 49964
67768 49964 50036 50149 50947 52499 54231 55565 56500 57416 58407 59043 58950 58398 58076 58361 59109 60132 61422 62822
67750 62822 63883 64269 64071 63536 62801 62062 61691 61829 62092 61964 61343 60460 59457 58359 57268 56284 55290 54118
67732 54118 52891 51974 51606 51699 51930 51918 51445 50681 50096 50053 50550 51328 51969 51894 50741 48949 47533 46972 46748
67713 46748 46297 45934 46233 46892 46978 46190 45183 44580 44312 44057 43833 43866 44218 44807 45572 46424 47225 47904 48460
67694 48460 48853 49032 49044 48996 48929 48855 48764 48425 47475 46036 44929 44790 45186 45260 45136 45899 48014 50514 52154
67675 52154 52753 52882 52756 52196 51433 51165 51618 52131 52024 51538 51556 52493 53863 54999 55870 56937 58364 59758
67657 59758 60678 61067 61044 60688 60263 60289 60926 61527 61266 60217 59339 59353 59998 60415 59936 58479 56631 55406 55468
67638 55468 56331 56694 55836 54406 53611 53911 54843 55779 56411 56693 56794 57165 58185 59583 60602 60919 61098 61775
67620 61775 62680 62942 62342 61678 61669 61997 61931 61561 61714 62660 63666 64111 64416 65315 66617 67397 67237 66662 66267
67601 66267 65972 65368 64385 63298 62302 61353 60314 59143 57981 57132 56796 56751 56469 55704 54817 54344 54316 54265 53947
67582 53947 53763 54213 55066 55473 54970 53983 53146 52501 51796 51198 51121 51458 51688 51720 51926 52248 52086 51388 51026 51528
67562 51528 52183 52083 51464 51182 51337 51310 50918 50599 50533 50480 50470 50845 51490 51785 51484 50968 50500 49865 48995 48271
67542 48271 47918 47669 47358 47320 47836 48607 49166 49538 50086 50889 51531 51524 50858 50150 50094 50593 50717 49834 48457 47493
67522 47493 47019 46515 45964 45772 45703 45030 43916 43561 44539 45926 46612 46638 46613 46585 46249 45713 45286 44917 44463 44187
67502 44187 44407 45014 45822 46942 48250 49000 48667 47827 47484 47811 48207 48305 48151 47656 46685 45670 45332 45732
67484 45732 46196 46269 46163 46171 46157 45839 45205 44527 44166 44313 44730 44880 44556 44110 43811 43314 42283 41139 40547 40420
67464 40420 40143 39679 39667 40436 41657 43044 44642 46230 47164 47180 46809 46671 46761 46784 46802 47196 48194 49664 51165
67445 51165 52103 52137 51614 51319 51646 52270 52703 52847 52852 52793 52700 52629 52532 52287 52003 52006 52379 52816 53069 53215 53283 52938
67423 52938 51886 50413 49199 48622 48452 48233 47871 47873 48905 51023 53413 55090 55773 55811 55430 54531 53189
67406 53189 51792 50551 49373 48424 48232 48894 49656 49723 49172 48618 48304 48028 47730 47622 47762 48002 48325 48822
67388 48822 49370 49740 50023 50582 51536 52605 53503 54053 53976 53050 51676 50830 51110 52123 53070 53654 54087 54518
67370 54518 54865 55084 55211 55144 54759 54235 53952 54072 54535 55383 56655 57910 58392 57965 57403 57419 57756 57685 57035
67351 57035 56206 55379 54397 53384 52830 52917 53303 53739 54361 55150 55604 55361 54741 54292 54131 54112 54359 55133 56369
67332 56369 57724 59001 60174 61159 61930 62735 63779 64790 65324 65483 65886 66894 68153 68946 68734 67450
67316 67450 65601 64093 63546 63668 63562 62763 61733 61311 61962 63593 65725 67643 68640 68436 67401 66285
67300 66285 65638 65424 65134 64432 63684 63628 64410 65378 66051 66831 68163 69416 69435 68201 67132 67487 69026 70502
67282 70502 71011 70678 70432 71214 72988 74424 74185 72664 71744 72531 74093 74935 74932 74997 75458 75837 76056 76737 78066
67263 78066 79188 79134 77878 76187 74787 73961 73637 73535 73379 73127 72900 72659 72146 71318 70611 70599 71427 72631
67245 72631 73485 73575 73156 72913 73251 73829 73985 73545 72944 72539 72125 71306 70103 68966 68306 68212 68536 69061 69568
67226 69568 69919 70133 70325 70564 70831 71096 71390 71769 72261 72817 73316 73592 73508 73035 72310 71640 71304 71252 71044 70302
67206 70302 69307 68926 69781 71586 73507 75057 76350 77531 78351 78534 78271 78040 78068 78288 78744 79678 81121
67189 81121 82666 83789 84245 84219 84183 84565 85300 85754 85453 84831 84846 85786 86916 87436 87255 86611 85579 84427
67171 84427 83905 84521 85825 87047 88094 89236 90117 90020 89092 88386 88529 89085 89516 89991 90844 91876 92631 92932
67153 92932 92747 91987 90842 89912 89613 89824 90390 91497 93083 94407 94814 94593 94517 94762 94920 94857 94952 95516 96489
67134 96489 97695 98939 99912 100440 100785 101290 101815 101990 101928 102124 102608 102790 102298 101537 101215 101642 102600 103597 104129
67115 104129 104107 104160 105132 107131 109367 111112 112454 113896 115566 117164 118454 119405 119931 119807 118972 117794
67099 117794 116942 116904 117626 118681 119891 121545 123795 126032 127379 127761 127997 128688 129554 130100 130428 130949 131664
67082 131664 132278 132844 133713 134879 135880 136477 137017 137927 139134 140254 141166 142167 143662 145902 148981 152739
67066 152739 156514 159239 160238 160017 159987 161078 162754 163667 163216 162108 161363 161236 161418 161936 163313 165860 169162
67049 169162 172423 175105 177196 179037 180998 183180 185303 186968 188079 189015 190337 192326 194710 196817
67035 196817 198109 198736 199531 201218 203622 205875 207461 208828 210851 213880 217501 221036 223988 226140 227590
67020 227590 228789 230282 232262 234500 236760 239106 241776 244909 248484 252306 255990 259213 262123 265211
67006 265211 268610 271814 274447 277001 280355 284694 289429 294134 298961 304009 308871 313120 316880 320525
66992 320525 324109 327400 330326 333158 336439 340824 346592 353073 358992 363828 368459 373983 380281 386422
66978 386422 392265 398695 406184 413955 420910 426793 432006 436907 441820 447329 453877 461171 468537 475843
66964 475843 483575 491969 500571 508857 516973 525477 534503 543548 552140 560500 569307 578950 589285 600176
66950 600176 611847 624389 637233 649683 661911 674823 688724 702722 715905 728668 742230
66939 742230 757028 772242 786930 801069 815295 830192 846202 863799 883131 903492 923582
66928 923582 942578 960818 979352 998899 1019344 1040162 1061114 1082433 1104431 1127131 1150374
66917 1150374 1174091 1198279 1222815 1247536 1272565 1298360 1325270 1353181 1381654 1410346 1439184
66906 1439184 1468244 1497610 1527322 1557350 1587656 1618283 1649210 1680033 1710054 1739042 1767770
66895 1767770 1797390 1828199 1859376 1890035 1920091 1949882 1979376 2008219 2036283 2063641 2090121
66884 2090121 2115431 2139734 2163565 2187052 2209695 2231025 2250953 2269262 2285367 2299052 2311042
66873 2311042 2322243 2332671 2341613 2348601 2353636 2356604 2357172 2355371 2351720 2346593 2339919 2331659 2322090 2311373
66859 2311373 2299191 2285121 2269074 2251207 2231782 2211328 2190513 2169465 2147487 2123791 2098249
66848 2098249 2071155 2042692 2013195 1983591 1954756 1926402 1897270 1866693 1835466 1804922 1775538
66837 1775538 1746748 1717801 1688412 1658756 1629191 1599985 1571166 1542627 1514400 1486560 1458802
66826 1458802 1430489 1401461 1372542 1344786 1318276 1292122 1265698 1239387 1213965 1189678 1166287
66815 1166287 1143667 1121846 1100558 1079282 1057871 1036737 1016245 996229 976379 956859 938173
66804 938173 920505 903536 886905 870529 854431 838562 822957 807803 793147 778725 764331
66793 764331 750219 736811 724024 711245 698135 685191 673189 662151 651197 639545 627420
66782 627420 615715 604822 594179 583050 571486 560285 550197 541481 534063 527641 521556 515002
66770 515002 507692 500055 492556 485050 477125 468912 461089 454071 447543 440928 434043 427122 420389 413775
66756 413775 407004 399838 392322 384892 378152 372444 367634 363337 359217 355004 350437 345467 340487 336096
66742 336096 332520 329409 326310 323152 320026 316651 312458 307377 302218 298010 295068 292924 290944 288655
66728 288655 285643 281708 277312 273367 270237 267250 263543 259142 254832 251202 248256 245768 243455 240795
66714 240795 237289 233123 229190 226210 224121 222502 221193 220215 219340 218128 216279 213774 210810 207815 205286
66699 205286 203375 201749 200075 198404 196778 194792 192021 188784 185947 183854 181960 179663 177093 174795
66685 174795 172976 171471 170307 169803 169932 169904 168723 166257 163554 161902 161566 161632 161073 159739 158142 156588
66669 156588 154914 152987 151012 149276 147854 146688 145660 144463 142677 140219 137578 135432 134119 133582
66655 133582 133608 133921 134138 133911 133133 131946 130630 129584 129268 129914 131195 132313 132516 131553 129740 127667 125836
66638 125836 124486 123639 123127 122552 121463 119848 118337 117637 117771 118210 118651 119170 119537 119022 117322 115203 113642
66621 113642 112650 111536 110172 109318 109566 110501 111147 110844 109588 107843 106251 105219 104552 103666 102282 100750
66605 100750 99602 99060 99074 99519 100077 100203 99536 98278 96901 95616 94366 93223 92468 92255 92451 92836 93249
66588 93249 93506 93436 93223 93460 94530 95945 96629 96018 94680 93640 93262 93082 92618 91885 91071 90178 89276 88717
66570 88717 88682 88782 88529 88010 87668 87556 87382 87189 87356 87810 87844 87023 85836 85084 85012 85314 85646 85719 85167 83822
66550 83822 82039 80412 79167 78082 76917 75675 74513 73625 73188 73187 73270 72946 71992 70673 69604 69348 69939
66533 69939 70734 70903 70150 68862 67608 66803 66757 67524 68580 69131 69046 69043 69655 70488 70878 70797 70626 70486 70391 70672
66513 70672 71503 72271 72174 71274 70231 69151 67618 65866 64855 64908 65132 64657 63687 62864 62322 61965 62070 62829
66495 62829 63635 63609 62683 61577 60862 60568 60568 60747 60787 60373 59661 59109 58768 58197 57201 56205 55705 55660 55650 55420 55066
66474 55066 54792 54612 54208 53109 51246 49335 48379 48651 49457 50080 50659 51763 53358 54653 55039 54694 54135
66457 54135 53541 52873 52410 52636 53581 54662 55346 55618 55531 54684 52648 49886 47701 47019 47491 48042 48064 47810
66439 47810 47764 48033 48451 49003 49887 51124 52289 52768 52321 51299 50247 49374 48595 47999 48006 48893 50325 51559
66421 51559 52126 52191 52262 52667 53332 54053 54869 56039 57570 58852 59020 57780 55775 54042 53212 53265 53854 54582
66403 54582 55051 54939 54253 53460 53221 53816 54819 55419 55212 54669 54658 55462 56526 57221 57599 58095 58755 59231 59422
66384 59422 59564 59554 58758 56991 55262 54836 55629 56220 55687 54804 54995 56564 58552 60099 61231 62259 63055
66367 63055 63260 62857 62179 61514 60931 60390 59851 59324 58896 58583 58167 57379 56306 55365 54788 54406 54017 53621 53174
66348 53174 52503 51771 51687 52832 54984 57336 59149 59957 59542 58200 56770 55870 55260 54384 53341 52807 53141
66331 53141 54123 55441 56875 58085 58857 59531 60541 61472 61298 59742 57768 56481 56052 56007 55975 55803 55443
66314 55443 55166 55490 56557 57830 58703 59058 59027 58607 57884 57240 57019 57257 57986 59349 61067 62232 62144 61082
66296 61082 59863 58937 58295 57956 57975 58161 58228 58214 58391 58889 59595 60285 60616 60283 59444 58717 58461 58347 57949 57423
66276 57423 57240 57560 58263 59270 60430 61384 61962 62392 62748 62572 61566 60222 59212 58515 57808 57304 57416
66259 57416 57880 58047 57846 57643 57362 56712 56173 56692 58233 59644 60189 60309 60554 60756 60728 60857 61351 61566 60860
66240 60860 59596 58628 58136 57656 56997 56493 56387 56516 56622 56700 56987 57708 58751 59576 59760 59621 59915 60809 61659
66221 61659 61950 61917 61934 61892 61641 61543 62000 62722 62992 62449 61211 59584 58098 57514 58148 59383 60377 61031 61681
66202 61681 62077 61542 60227 59347 59794 61047 61901 61935 61796 62207 63136 64000 64414 64518 64623 64743 64624 64161 63541
66183 63541 62958 62449 62075 61947 61897 61520 60834 60579 61327 62484 62743 61592 59933 59091 59558 60786 61839 62069
66165 62069 61438 60452 59714 59430 59444 59697 60356 61369 62182 62233 61614 60997 60878 61091 61153 60926 60655 60371 59577 57866
66145 57866 55727 54335 54381 55445 56696 57787 58753 59392 59431 59249 59771 61364 63238 64261 64148 63539 63111
66128 63111 62943 62745 62341 61775 61099 60289 59410 58760 58727 59420 60455 61157 61000 59916 58316 56920 56420 57125
66110 57125 58782 60774 62500 63611 64053 64021 63822 63601 63205 62434 61481 60936 61234 62147 62912 62937 62400 62202
66092 62202 63249 65680 68682 71089 72281 72560 72729 73274 73974 74296 74112 73870 74010 74363 74309 73503 72250
66075 72250 71165 70670 70779 71157 71260 70659 69431 68155 67354 67036 66870 66677 66606 66937 67855 69330 71013 72316
66057 72316 72860 72844 72807 72937 72811 71945 70488 69186 68642 68803 69226 69685 70264 70962 71555 71984 72541 73402 74254
66038 74254 74692 74745 74639 74307 73719 73490 74376 76060 77240 77227 76743 76714 77023 77139 77313 78156 79366 79946 79713
66019 79713 79627 80332 81208 81372 80991 80978 81689 82529 82821 82589 82398 82675 83383 84240 85063 85767 86161 86074 85821 86217
65999 86217 87777 90062 92186 93895 95711 98041 100647 103146 105561 108070 110482 112306 113285 113660 113979
65984 113979 114646 115508 115865 115150 113675 112412 111894 111606 110688 108928 106790 104682 102552 100163 97414 94438
65968 94438 91612 89492 88431 88201 88164 87892 87445 87020 86573 85991 85461 85379 85861 86545 87007 87237 87569 88245 89220
65949 89220 90346 91504 92565 93489 94537 96094 98094 99892 100958 101537 102333 103739 105649 107838 110076
65934 110076 111937 113015 113425 113725 114209 114600 114576 114284 114161 114488 115298 116485 117852 119226 120644 122266 124026
65917 124026 125622 126958 128340 130116 132354 134952 137800 140696 143381 145823 148129 150080 151122 151064 150401
65902 150401 149657 148788 147610 146433 145792 145770 146057 146443 146753 146500 145245 143277 141355 139716 137797 135013
65886 135013 131354 127174 122910 119159 116492 114867 113582 112039 110239 108384 106433 104399 102683 101658
65872 101658 101113 100445 99292 97735 96058 94640 93868 93792 93953 93882 93673 93759 94227 94801 95394 96137 96774 96619
65854 96619 95450 94065 93501 93901 94597 95171 95911 97087 98282 98853 98797 98743 99041 99295 99041 98584 98814 100165
65836 100165 102076 103592 104262 104306 104148 104079 104290 104886 105827 107083 108929 111796 115664 119839 123557 126717
65820 126717 129730 132786 135628 138072 140347 142633 144557 145467 145233 144416 143589 142706 141258 138953 136099
65805 136099 133381 131325 129953 128878 127767 126688 125919 125440 124791 123606 122074 120659 119513 118468 117637
65790 117637 117602 118773 120755 122619 123714 124061 124141 124608 126149 129172 133405 138059 142614 147277 152474 158094
65774 158094 163498 168150 171880 174573 175988 176046 174920 172649 168941 163654 157287 150655 144242 138213 132936
65759 132936 128934 126240 124265 122608 121624 121884 123357 125572 128376 132065 136770 142187 148029 154356 161319
65744 161319 168928 177236 186360 195979 205103 212778 218896 223916 227817 229827 229263 226274 221564 215649
65730 215649 208672 200719 192043 182975 173793 164667 155644 146810 138535 131423 125804 121388 117610 114231
65716 114231 111324 108773 106181 103456 101124 99761 99197 98595 97324 95546 93869 92632 91691 90805 90034
65701 90034 89684 89989 90933 92292 93689 94656 94845 94326 93519 92679 91572 89912 88078 87082 87638 89459 91639
65684 91639 93642 95640 97935 100348 102402 103977 105528 107627 110511 114199 118839 124617 131340 138405
65670 138405 145380 152465 160223 169002 178781 189379 200489 211518 221770 230957 239352 247297 254699
65657 254699 261130 266229 269836 271842 272267 271530 270463 269761 269446 269083 268592 268603 269697 271418 272493 272111
65641 272111 270554 268353 265334 260959 255245 248674 241353 232974 223554 213541 203062 191838 180101
65628 180101 168871 158890 149867 141284 133392 126749 121278 116564 112761 110348 109123 108262 107406 106863 106569
65613 106569 105666 103499 100502 97662 95507 93981 92923 92258 91897 91804 92035 92489 92772 92544 91838 90882 89826
65596 89826 88864 88362 88568 89314 90334 91728 93788 96365 98750 100279 100879 100943 100907 101082 101793 103410 106132
65579 106132 109804 114103 118875 124223 130301 137224 145183 154343 164394 174440 183698 192271 200935 210155
65565 210155 219523 228069 234833 239180 241014 240819 239248 236547 232480 226746 219194 209796 198895 187454
65551 187454 176538 166397 156570 147025 138598 131953 126651 121765 117004 112723 109113 106027 103550 102172
65537 102172 102237 103497 105245 106704 107455 107723 108190 109259 110579 111429 111403 110547 109151 107701 106716 106234 105658
65520 105658 104560 103349 102665 102300 101355 99422 97003 94789 93089 92045 91754 91973 92202 92298 92567 93094 93506
65503 93506 93652 94006 95012 96358 97240 97131 96079 94594 93467 93331 94060 94910 95539 96495 98348 100790 103138
65486 103138 105324 107712 110106 111747 112419 112852 113792 115081 115965 116007 115447 114880 114765 115048 115098 114182 112135
65469 112135 109507 107004 104961 103351 102020 100798 99624 98724 98448 98739 99016 98811 98287 97868 97510 96768
65453 96768 95568 94462 93990 94066 94241 94340 94524 94801 94828 94366 93708 93435 93821 94652 95600 96603 97803 99321
65435 99321 101215 103525 106131 108631 110497 111442 111585 111361 111330 111854 112686 112961 112028 110301 108907 108300 107739
65418 107739 106455 104909 104233 104576 104732 103626 101640 100156 100141 101560 103818 106307 108517 110065 110768 110642
65402 110642 109861 108861 108317 108696 109824 111130 112313 113532 114954 116466 117957 119529 121164 122390 122712
65387 122712 122313 122019 122360 122910 122724 121341 119181 117009 115264 114025 113369 113416 114017 114744 115387 116218 117483
65370 117483 118773 119344 119119 119038 120138 122497 125224 127395 128805 129988 131712 134423 137939 141675 145331
65355 145331 149349 154491 160908 167790 174005 178976 182889 186224 189252 191843 193539 193778 192301 189461
65341 189461 186088 182909 180120 177481 174669 171430 167589 163198 158680 154515 150750 147048 143272 139650
65327 139650 136197 132442 128201 124371 122253 122036 122461 122186 121031 119678 118631 117873 117203 116399 115209 113659
65311 113659 112350 111964 112405 112758 112241 110929 109412 108057 106866 105872 105319 105366 105768 106105 106351 107084 108835
65294 108835 111225 113121 113902 114215 115090 116496 117392 117125 116093 114834 113251 111313 109909 110135 111803 113447
65278 113447 113949 113596 113376 113789 114663 115607 116219 116159 115506 114870 114734 114792 114314 113125 111784 110822 110165 109390 108254
65259 108254 106866 105582 104840 104846 105352 105916 106372 106846 107367 107803 108205 108757 109316 109442 109077 108791 109064 109698 110201
65240 110201 110358 110127 109422 108416 107660 107384 107050 106143 105050 104538 104652 104939 105470 106664 108116 108621 107644
65223 107644 105925 104272 102650 100889 99435 98661 98069 97004 95781 95279 95667 96270 96605 96852 97314 98016
65207 98016 98913 99971 100918 101368 101275 100965 100624 100157 99566 99125 99011 99131 99399 99902 100604 101198 101440 101442 101417 101327
65187 101327 101038 100732 100877 101728 103072 104594 106318 108419 110645 112341 113245 113935 115091 116495 117235 116819
65171 116819 115574 113974 112184 110481 109464 109456 110112 111001 112093 113314 114168 114414 114697 115809 117620 119459
65155 119459 121264 123437 125643 126816 126748 126817 128555 131983 135892 139425 142803 146661 151246 156387 161926
65140 161926 167898 174381 181296 188414 195491 202279 208454 213768 218409 222997 228020 233283 238031 241459
65126 241459 243053 242799 241292 239354 237236 234397 230405 225751 221318 217296 213188 208783 204487 200612
65112 200612 196852 192675 187912 182814 177754 172947 168323 163688 159163 155138 151576 147747 143200 138651
65098 138651 135200 132819 130410 127293 123837 120558 117499 114799 113077 112720 113328 114262 115344 116647 118050
65083 118050 119355 120503 121379 121719 121485 121018 120647 120485 120660 121241 121833 121864 121536 121819 123113 124545 125081 124770
65065 124770 124298 123880 123297 122680 122506 122931 123732 124782 126087 127434 128491 129167 129490 129281 128367 127002 125620
65048 125620 124278 122775 121295 120459 120621 121425 122189 122560 122681 122801 122823 122386 121452 120544 120088 119677 118530 116603
65030 116603 114629 112979 111229 109083 106958 105272 103843 102508 101701 101819 102524 103237 103813 104184 103955 103073
65014 103073 102341 102458 102956 102952 102521 102500 103225 104375 105780 107440 108986 110097 111335 113544 116417 118651 119626
64997 119626 120030 120693 121694 122790 123865 124741 125236 125622 126332 127162 127539 127620 128229 129589 131038 132216 133516
64980 133516 135087 136453 137549 139088 141218 142779 142628 140989 138801 136489 134151 132178 130709 128999
64966 128999 126304 123077 120488 119070 118618 119014 120182 121426 121786 121123 120188 119613 119434 119498 119674 119657 119174
64949 119174 118407 117657 116720 115247 113664 112927 113248 113740 113600 113026 112675 112768 113103 113539 114075 114657 115201 115591
64931 115591 115525 114666 113158 111742 111094 111180 111418 111300 110685 109716 108747 108208 108316 108853 109378 109634 109694 109742 109819 109831
64911 109831 109762 109820 110293 111228 112367 113430 114331 115036 115427 115527 115742 116634 118485 121276 124954 129422 134282
64894 134282 138915 142982 146638 150176 153648 156959 160141 163342 166621 169869 172899 175510 177500 178759
64880 178759 179415 179859 180477 181241 181594 180951 179340 177349 175367 173149 170336 167179 164376 162331 160927 159980
64864 159980 159439 159053 158336 157140 155949 155209 154521 152941 150082 146558 143237 140422 138026 136225 135387 135288
64848 135288 134912 133402 130986 128619 126852 125453 124096 122877 121961 121176 120292 119423 118769 118180 117392 116597
64832 116597 116371 116953 117876 118409 118206 117571 117260 117901 119375 120811 121473 121549 121795 122538 123538 124735 126550
64815 126550 129190 132214 135189 138344 142142 146450 150658 154519 158369 162497 166684 170504 173751 176433
64801 176433 178556 180074 180916 180933 179934 177906 175136 172038 168920 165924 163077 160294 157435 154476 151586
64786 151586 148950 146539 144155 141762 139691 138458 138321 139012 139957 140739 141349 141988 142782 143736 144818 145911
64770 145911 146809 147525 148593 150758 154243 158559 163104 167717 172434 177000 180994 184326 187273 190106 192946
64755 192946 195943 199164 202338 205104 207621 210503 213962 217421 220220 222308 223924 224969 225159 224514 223192
64740 223192 221010 217677 213416 208802 203972 198561 192551 186609 181350 176743 172562 169015 166499 165018
64726 165018 164222 163855 163821 163954 164103 164376 165055 166271 167927 169768 171382 172398 173052 174295 176893 180494
64710 180494 184011 186848 189230 191340 192748 192932 191878 189865 187062 183711 180345 177369 174616 171712
64696 171712 168703 165898 163281 160641 158205 156542 155678 154836 153362 151469 149751 148359 147115 146169 146020
64681 146020 146900 148516 150374 152044 153194 153851 154639 156332 159052 162244 165511 169072 173255 177955 182844
64666 182844 187707 192257 195922 198206 199088 198790 197434 195198 192552 189850 186931 183545 180046 177133 174985
64651 174985 173134 171187 169160 167082 164835 162596 160975 160458 161025 162488 164839 167993 171522 174975 178322
64636 178322 181853 185792 190266 195461 201545 208373 215390 221891 227480 232369 237062 241533 244833 245876
64622 245876 244552 241746 238328 234597 230633 226477 221760 215854 208900 202203 197107 193823 191771 190624
64608 190624 190371 190698 191080 191459 192194 193262 194092 194341 194319 194421 194552 194371 193791 192931 191792 190301 188643 187295
64590 187295 186622 186463 186171 185181 183617 182274 181882 182447 183406 184322 185203 186192 187242 188274 189526 191503 194502
64573 194502 198260 202135 205604 208488 210785 212531 213945 215341 216520 216483 214211 209717 203903 197491 190707
64558 190707 184031 178422 174308 170951 167382 163592 160331 158067 156707 156048 155850 155617 154901 153869 153166
64543 153166 153265 154257 156055 158361 160631 162589 164645 167199 169684 170943 170573 169258 167703 165926 163823
64528 163823 161780 160274 159251 158321 157348 156576 156300 156615 157367 158237 158991 159644 160267 160747 160952 160964 160860 160454
64510 160454 159681 159034 159091 159747 160519 161500 163213 165555 167771 169772 172569 176907 182171 187220 191726 196043
64494 196043 200259 204106 207484 210363 212398 213254 213243 213013 212642 211553 209355 206360 203283 200772 199192
64479 199192 198453 197992 197201 195905 194280 192456 190487 188560 186854 185229 183362 181194 179039 177313 176370
64464 176370 176398 177205 178264 179326 180784 183072 185814 188034 189156 189364 189047 188382 187562 186968 186920 187476 188491
64447 188491 189654 190536 191060 191940 194178 197966 202471 206797 210761 214620 218532 222561 226742 230817 234341
64432 234341 237495 241498 247732 256612 267744 280978 296694 315079 335750 358465 383897 413434
64420 413434 448356 489458 537272 592269 654581 723531 797486 874145 950916 1025170 1094566
64409 1094566 1157612 1213983 1263896 1306878 1341295 1365221 1377492 1377734 1365888 1342501 1309399 1269093
64397 1269093 1222867 1169864 1108611 1039325 964418 887090 810118 735833 666306 602929 546157
64386 546157 496047 452814 416497 386326 360935 339243 320767 305116 291620 279665 269133
64375 269133 260216 252881 246722 241309 236523 232495 229206 226228 222905 218825 214079 209054 204094 199398
64361 199398 195085 191165 187524 184107 181069 178551 176392 174313 172406 171209 171203 172378 174329 176664 179264
64346 179264 182274 185824 189621 192911 195078 196218 196801 196773 195450 192494 188669 185308 183193 182162 181600
64331 181600 181008 180222 179417 178944 178999 179380 179622 179403 178842 178545 179256 181145 183331 184508 184283 183667 183909 185109
64313 185109 186316 186795 186690 186527 186531 186582 186400 185584 183749 180882 177444 173965 170625 167370 164312 161783 160000
64296 160000 158746 157459 155724 153716 152122 151473 151582 151766 151680 151732 152526 153996 155318 155792 155677 155939 157197
64279 157197 159131 161083 163046 165751 169794 174972 180526 185784 190497 194846 199302 204173 209022 212761
64265 212761 214579 214641 213661 212099 210164 208365 207443 207654 208526 209508 210528 211691 212669 212637 210841 207176 202280
64248 202280 197047 192008 187208 182702 178813 175608 172454 168696 164736 161795 160429 159861 159134 158459 158788
64233 158788 160360 162235 163352 163584 163623 164127 165140 166170 166670 166464 165788 164907 163782 162264 160557 159268
64217 159268 158850 159064 159133 158462 157178 155912 155125 154724 154341 153804 153140 152310 151234 150169 149740 150378 151841
64200 151841 153426 154524 154888 154616 154188 154371 155714 158067 160774 163396 166054 169106 172829 177505 183465
64185 183465 190772 199015 207677 216569 225577 234087 241008 245535 247592 247426 245058 240462 234072 226711
64171 226711 218998 211165 203531 196744 191238 186661 182169 177311 172357 167851 164047 160843 157954 155110
64157 155110 152317 150012 148744 148543 148863 149336 150320 152371 155375 158665 161957 165605 169699 173415 175726
64142 175726 176595 177039 178098 180058 182640 185383 187661 188758 188337 186728 184556 182243 180069 178406 177389
64127 177389 176457 174789 172458 170764 171048 173317 176321 178940 181164 183680 186823 190208 193333 196234 199404
64112 199404 203254 207895 213368 219703 226626 233501 239856 245727 251129 255453 257967 258970 259887 261948
64098 261948 265192 269038 273390 278693 285148 292429 300085 307723 314680 319971 322818 323071 320999 316907
64084 316907 311162 304379 297304 290392 283652 276960 270467 264506 259058 253536 247409 240996 235330 231121
64070 231121 228149 225779 223674 221723 219688 217501 215739 215163 215663 216166 215776 214662 213655 213414 214291 216604
64054 216604 220423 225149 229717 233413 236266 238635 240727 242729 245178 248762 253669 259456 265803 273196
64040 273196 282466 293637 305667 317481 328959 340563 352193 362749 370746 375180 375973 373953 370340
64027 370340 365984 360990 355160 348609 341749 334971 328764 323937 321084 319846 319148 318213 316823 314613 310849
64012 310849 305230 298361 291076 283766 276729 270677 266293 263526 261719 260236 258663 256752 254660 252990
63998 252990 252115 251632 250889 249795 248655 247545 246542 246289 247504 249891 252311 254170 255975 258344 261199
63983 261199 264261 267691 271788 276578 282138 288771 296340 303895 310625 316925 323883 331888 340371 348835
63969 348835 357508 366923 377425 389216 402350 416424 430716 444943 459697 475901 494059 514210
63957 514210 536397 560977 588581 620005 656181 698143 747026 804016 870198 946425 1033434
63946 1033434 1132031 1243095 1367449 1505797 1658450 1824669 2002365 2188847 2381857 2579393
63936 2579393 2778488 2974723 3163115 3338974 3497743 3634904 3746973 3832370 3890707 3921345
63926 3921345 3923235 3895940 3840040 3756505 3646461 3512018 3356869 3185764 3003642 2815304
63916 2815304 2625295 2437448 2254604 2079066 1913125 1758829 1617323 1488701 1372560
63907 1372560 1268585 1176681 1096657 1027735 968374 916715 871295 831205 795693 764068 736075
63896 736075 711864 691166 672854 655732 639570 624811 611434 598685 586007 573652 562122
63885 562122 551495 541706 533210 526859 523143 521929 522947 526153 531417 538201 545968 554885 565790 579347
63871 579347 595457 613565 633280 654493 677116 700975 725759 750766 774873 797196 817655
63860 817655 836489 853346 867484 878883 888336 896081 900997 901788 898562 892589 884786 875065 863004
63847 863004 848455 831442 812010 790400 767021 742184 716110 689216 662021 634780 607489
63836 607489 580326 553712 528003 503463 480531 459632 440521 422222 403936 385821 368726
63825 368726 353359 339851 327868 316868 306358 296130 286343 277350 269414 262448 255949 249361 242701
63812 242701 236639 231761 227948 224806 222404 221027 220309 219311 217572 215460 213325 210960 208266 205859 204475
63797 204475 204010 203600 202477 200471 197943 195575 193979 193155 192429 191205 189581 187991 186537 185062 183629
63782 183629 182455 181476 180452 179441 178780 178528 178335 177909 177335 176864 176644 176713 176983 177152 176842 175923 174597 173142
63764 173142 171803 170960 171136 172541 174603 176165 176369 175424 174457 174433 175293 176275 176950 177511 178056 178205 177830 177714
63746 177714 178808 180986 183091 184279 184803 185381 186260 187156 187793 188229 188831 190055 192072 194509 196794 198841
63730 198841 201075 203622 205841 207096 207726 208815 210995 213934 217092 220533 224688 229550 234524 239096
63716 239096 243289 247303 250929 253608 255039 255442 255138 254053 251874 248605 244745 240857 237131 233483 229962
63701 229962 226893 224644 223399 223171 223902 225453 227601 230116 232773 235249 237163 238477 239775 241853 244944
63686 244944 248481 251696 254235 256155 257604 258709 259564 260095 260130 259794 259580 259729 259774 259171 258257 258073 259187
63669 259187 261115 262986 264390 265436 266397 267560 269135 271036 272781 273717 273272 271179 267758 263889 260236
63654 260236 256433 251554 245532 239598 235076 232246 230622 229746 229114 227858 225329 222025 219351 218326 218791
63639 218791 219804 220533 220793 221082 222172 224479 227811 231766 236124 240729 245290 249590 253670 257546 261056
63624 261056 264385 268432 274146 281584 290097 299334 309614 321374 334710 349453 365291 381851 399063
63611 399063 417404 437418 459105 482142 506527 532367 559085 585440 610297 632717 651312
63600 651312 664418 671347 672851 670063 663674 654632 644897 636497 629959 624310 618489 612133 604978 596144
63586 596144 584416 569070 550365 529378 507469 485721 464796 445180 427336 411508 397581
63575 397581 385414 375194 367267 361704 358218 356375 355685 355656 356116 357478 360360 364856 370427 376557 383291
63560 383291 391044 400094 410404 421719 433637 445698 457736 470241 484241 500697 519975 541928
63548 541928 566435 593845 624904 660013 698119 736037 769167 793550 807712 812626 810064 801361
63536 801361 787759 771238 754299 738936 726169 716441 709868 705888 702998 699116 692270 681101 665163
63523 665163 644941 621418 595498 567911 539566 511607 484959 460059 437102 416222 397241
63512 397241 379638 363140 348172 335366 324736 315632 307475 300221 294086 289090 285003 281531 278421
63499 278421 275464 272517 269540 266607 263913 261708 260170 259286 258885 258766 258792 258905 259073 259240 259372 259619 260375
63482 260375 262030 264659 268049 271998 276407 281040 285526 289756 294044 298542 302597 305031 305211 303608
63468 303608 301232 298664 295801 292371 288424 284263 280136 276087 272070 268119 264452 261427 259283 257874
63454 257874 256755 255660 254853 254869 255953 257909 260442 263465 267133 271819 278027 286021 295407 305366 315566
63439 315566 326679 339891 356068 375521 398259 424054 452206 481340 509402 533916 552718
63428 552718 564880 570957 572305 570428 567105 564604 565127 569950 579338 593134 611136 633118 658896
63415 658896 688264 720503 754008 786714 816713 842160 861014 871723 874313 870362 861902 850786
63403 850786 838802 827448 817189 807464 797588 787133 775292 760707 742439 720701 696267 669621
63391 669621 641108 611488 581834 553137 526323 502214 480998 462031 444696 429243 416356
63380 416356 406113 397837 390839 384855 379902 376186 374192 374430 376987 381419 387049 393275 399897 407418
63366 407418 416760 428326 441563 455832 471490 489595 510663 534196 559465 586283 614916 645536
63354 645536 677841 710901 743283 773492 800275 822404 838455 847350 849175 845123 836596 824725
63342 824725 810806 796671 784189 774290 766414 758729 749006 735722 718678 698546 675929 651101
63330 651101 624603 597634 571546 547120 524634 504487 487424 474060 464431 458231 455279 455255 456731
63317 456731 456868 452725 443073 428790 411620 393046 374399 357179 342545 330633 320822 312536 305439
63304 305439 299134 293276 287965 283536 279923 276620 273322 270221 267647 265760 264608 264065 263671 262933 261909
63289 261909 261071 260495 259592 257878 255601 253385 251612 250469 250233 251015 252336 253352 253588 253215 252658 252197
63273 252197 251969 252065 252453 252842 252800 252118 251087 250374 250522 251594 253349 255674 258640 262151 265788 269121 272004
63256 272004 274491 276655 278720 281238 284808 289526 294820 299945 304648 309372 314825 321355 328783 336864
63242 336864 345813 356158 368050 381004 394559 409051 425380 444040 464698 486776 510043 534411
63230 534411 559562 585193 611358 637988 664229 689031 712520 735995 760178 784158 806742
63219 806742 828241 850092 873091 896916 921178 945799 970167 992819 1012316 1027715 1038030
63208 1038030 1042212 1040113 1032594 1020059 1001686 976859 946712 913406 878453 842646 807114 773250
63196 773250 741679 712316 685463 662043 642711 627562 616699 610284 607860 608456 611566 617415 626133
63183 626133 637456 651373 668222 687733 708696 729978 751268 772424 792797 811844 829974
63172 829974 848156 866953 886320 905979 925413 943715 959971 973670 984427 991444 993626 990108
63160 990108 980416 964371 942232 914884 883597 849629 814106 777989 741885 706110 671230 638334
63148 638334 608554 582380 559578 539485 521240 504095 487861 472916 459670 448266 438837 431469
63136 431469 425645 420303 414962 410319 407168 405101 402989 400442 398059 396328 395051 393883 392865 392325
63122 392325 392730 394565 397783 401437 404476 407001 410000 413806 417592 420655 423357 426285 429237 431745
63108 431745 434047 436693 439468 441558 442771 443832 445387 447316 449219 450979 452588 453832 454542 454846 454838
63093 454838 454223 452656 450375 448187 446824 446459 446779 447308 447716 448069 448797 450291 452551 455350 458653 462581
63077 462581 467013 471611 476370 481850 488589 496509 505127 514123 523399 532732 541847 550967 560979 572837
63063 572837 586886 602841 620287 639059 659269 681153 705050 731547 761497 795639 834072
63052 834072 876249 921630 970176 1022057 1077058 1134533 1193809 1254250 1315073 1375523 1435328
63041 1435328 1494578 1553040 1610016 1665109 1718825 1772143 1825746 1879863 1934533 1989493 2043829
63030 2043829 2096090 2144761 2188362 2225025 2252237 2267312 2268268 2254400 2226159 2184604 2131007 2066995
63018 2066995 1994846 1917311 1837009 1756107 1676566 1600416 1529573 1465431 1408789 1360116 1319795
63007 1319795 1288081 1264837 1249352 1240667 1238330 1242683 1254036 1271649 1294011 1320164 1350170 1384059
62995 1384059 1420866 1459138 1497965 1536981 1575708 1613583 1650510 1686821 1722586 1757363 1790555
62984 1790555 1821463 1848885 1871089 1886415 1893728 1892342 1881846 1862086 1832972 1794254 1745882 1688780
62972 1688780 1624968 1556742 1485989 1414254 1343034 1273683 1207344 1145130 1087997 1036128 988823
62961 988823 945375 905829 870411 838577 809254 782003 757237 735141 714953 695697 677196
62950 677196 659887 643843 628445 613029 597488 582175 567487 553683 540921 529233 518420
62939 518420 508090 497923 487971 478660 470388 463080 456264 449610 443250 437514 432598 428616 425716 423812
62925 423812 422432 421200 420342 420225 420458 420042 418577 416772 415504 414814 414226 413539 412771 411698 410092 408266
62909 408266 406707 405226 403035 399773 395954 392322 389218 386682 384676 382992 381314 379612 378156 377055
62895 377055 376144 375496 375575 376549 377797 378446 378223 377569 377077 377016 377200 377184 376844 376818 377979 380265 382487 383597
62877 383597 383775 383912 384427 385055 385448 385409 384784 383706 382839 382826 383494 384044 383985 383430 382638 381797 381198 380995 380767
62858 380767 379957 378871 378561 379381 380294 380128 379072 378410 379027 380759 383033 385510 387959 389999 391313 391958
62842 391958 392248 392405 392441 392353 392222 392092 391828 391233 390331 389420 388760 388283 387728 386986 386226 385693 385551 385901 386797
62823 386797 388161 389768 391371 392857 394368 396312 399133 402858 406939 410729 414079 417311 420690 424210
62809 424210 427922 432135 437114 442735 448582 454315 459972 466085 473476 482612 493044 503791 514437
62796 514437 525583 537986 551655 566188 581713 598946 618405 640191 664602 692372 724012
62785 724012 759462 798846 843224 893964 951481 1015109 1084215 1158945 1239755 1326704 1419438
62774 1419438 1517416 1619630 1724182 1828398 1929291 2023776 2108711 2181232 2239159 2280950
62764 2280950 2305340 2311292 2298409 2267269 2219486 2157584 2084578 2003230 1915588 1823371 1728614
62753 1728614 1633501 1539574 1447612 1358420 1273293 1193440 1119311 1050785 987730 930081 877620
62742 877620 830052 787248 749156 715550 686081 660380 637867 617667 599105 582245 567619
62731 567619 555399 545129 536257 528594 522130 516713 512170 508629 506436 505725 506167 507237 508673 510649
62717 510649 513525 517548 522815 529426 537510 547177 558567 571947 587617 605787 626647 650427 677154
62704 677154 706499 738341 773557 813784 860142 912457 969954 1032345 1099860 1172436 1249337
62693 1249337 1329523 1411960 1495413 1578207 1658316 1733622 1801902 1860621 1906884 1937979 1952292
62682 1952292 1949756 1931319 1898069 1851076 1791929 1722934 1646638 1565456 1481783 1397943 1315648
62671 1315648 1235780 1158929 1085953 1017811 955080 897875 846074 799451 757729 720552 687258
62660 687258 656892 628900 603702 581867 562757 544932 528108 513571 501956 491672 480626
62649 480626 468755 457627 447976 439028 430172 421908 414848 408874 403714 399498 396239 393466 390868 388785
62635 388785 387638 387290 387251 387119 386581 385386 383650 381809 380078 378266 376312 374599 373506 373018 372974 373337
62619 373337 374048 374990 376352 378659 382148 386359 390592 394584 398559 402855 407688 413159 419393 426727 435633
62604 435633 446215 458003 470614 484473 500403 518689 539176 562226 588774 619367 653851
62593 653851 692193 734759 781384 830860 881753 933113 983949 1032625 1077365 1116863 1149892
62582 1149892 1174857 1190403 1196135 1192230 1178852 1156544 1126797 1091367 1051255 1007102 960392 913395
62570 913395 867704 823455 780159 737868 697353 659515 624875 593416 564857 539137 516564
62559 516564 497288 480860 466609 454274 443825 434776 426243 417791 409780 402654 396316 390481 385382
62546 385382 381698 379773 379212 379320 379704 380265 380848 381320 381989 383410 385455 387032 387254 386687 386804 388287 390549
62529 390549 392913 395525 398852 402982 407864 413790 421237 430556 442113 456263 472930 491730 512840
62516 512840 537212 565454 597055 631245 668141 708298 751517 796798 843221 890074 936286
62505 936286 980452 1021440 1058328 1089706 1113710 1128907 1134846 1131774 1120292 1101388 1076411 1046902
62493 1046902 1014622 981424 948648 916760 886072 857612 832785 812343 796323 784844 778224
62482 778224 776268 778258 783835 793228 806283 821904 838769 856058 873012 888200 899845 906859
62470 906859 909344 908100 903655 895518 882293 862843 837512 808089 776535 743984 710841 677357
62458 677357 643986 611609 581550 554917 531660 510677 491095 473125 457523 444721 434819 427889
62446 427889 423615 420914 418602 416505 415398 415777 417152 418785 420751 423860 428573 434245 439617 443910
62432 443910 447293 450264 452806 454294 454036 451596 446724 439456 430472 420967 411822 403033 394236 385666
62418 385666 378181 372253 367277 362183 356647 351408 347283 344138 341064 337425 333363 329330 325616 322516
62404 322516 320461 319490 318870 317791 316380 315519 315642 316220 316580 316780 317372 318678 320566 322778 325107 327322
62388 327322 329215 330825 332477 334515 336987 339666 342459 345716 349886 354767 359455 363377 367148 371989
62374 371989 378398 385853 393769 402104 410851 419581 427997 436591 446214 457123 468939 481532 495537
62361 495537 511896 531274 554089 580807 611796 646863 685304 726583 770777 818048 867644
62350 867644 917617 965550 1009360 1047390 1078231 1100915 1115297 1122014 1122056 1116412 1105865 1090731
62338 1090731 1070835 1046020 1016704 983912 948914 913057 877647 843572 811127 780569 752687
62327 752687 728355 707606 689686 674046 660720 649604 639879 630394 620228 608725 595513 580816
62315 580816 565310 549321 532536 514900 497346 481091 466453 452935 440342 429154 419737 411748
62303 411748 404616 398209 392735 388199 384313 380869 377918 375530 373581 371931 370656 369923 369704 369854 370467
62288 370467 371843 373984 376450 378989 381985 385852 390213 394242 397740 401264 405105 408822 412080 415369
62274 415369 419394 424174 429267 434585 440454 447009 454108 461873 470841 481527 494217 509295 527350
62261 527350 548731 573243 600609 631182 665975 705885 750935 800335 853247 909314 968210
62250 968210 1028691 1088319 1144216 1193893 1235351 1266927 1287631 1297718 1298556 1291778 1278534 1259316
62238 1259316 1234079 1202450 1164202 1119894 1070994 1019217 965811 911578 857521 805228 756468
62227 756468 712451 673493 639312 609442 583339 560298 539641 521099 504865 491158 479808
62216 479808 470307 462105 454766 448021 441933 436924 433320 430783 428441 425711 422802 420257 418185 416252
62202 416252 414345 412852 412094 411759 411264 410647 410807 412708 416450 421200 426027 430837 436520 444116 453687
62187 453687 464106 474079 483329 492578 502517 513121 523916 534388 543935 551917 558177 563251 567775
62174 567775 571870 575476 578988 583143 588445 595188 603993 615840 631497 651275 675343 703830 736410
62161 736410 772044 809307 846757 883024 916803 946855 971833 990227 1001027 1004646 1002856 997478
62149 997478 989206 977724 962610 943861 921782 896788 869452 840687 811865 784599 760154 738875
62137 738875 720268 703744 689299 677509 668983 663730 660974 659600 658918 658864 659443 660295 661170 662621 665710
62122 665710 671036 678400 687369 697551 708091 717408 723921 727032 727311 725916 723973 722257 721067 720159
62108 720159 718683 715309 708785 698728 685795 670999 655179 639384 625233 614097 606038 600228
62096 600228 596349 594871 595957 598970 603324 608976 615708 622657 629151 635442 642016 648701 655082 661364
62082 661364 668115 675363 682678 690097 698371 708293 720183 733984 749383 765821 782790 800231 818379
62069 818379 837152 855970 874270 892025 909698 927803 946585 966060 986317 1007651 1030129
62058 1030129 1053050 1075029 1094693 1111078 1123470 1131378 1134861 1134502 1130782 1123796 1113708 1100977
62046 1100977 1085668 1066935 1043699 1015815 984295 950543 915590 879872 843457 806589 770150
62035 770150 735357 702888 672694 644731 619317 596436 575312 555317 536890 520880 507287
62024 507287 495317 484533 475198 467461 460807 454403 447558 439834 431178 422054 413132 404804 397247 390797
62010 390797 385848 382394 380044 378456 377482 376996 376990 377792 379817 383176 387804 393748 400849 408277 414991 420650
61994 420650 425547 429679 432493 433704 433723 432990 431380 428602 424835 420519 415763 410318 404071 397311 390492
61979 390492 383873 377392 370894 364473 358534 353458 349259 345655 342390 339365 336627 334345 332677 331508
61965 331508 330467 329321 328118 326792 325039 322894 321116 320556 321344 323051 325301 327737 329776 331123 332408
61950 332408 334628 337995 341980 346472 352110 359312 367608 376235 384879 393718 403275 414437 428021 443985
61936 443985 461463 479730 498596 517669 535998 553024 569354 585862 602237 617055 629178
61925 629178 638526 645539 650505 653591 655009 654731 652190 646724 638531 629059 620241 613245 608035 604148
61911 604148 601711 601544 604421 610493 619395 630648 643882 658742 674619 690476 705153 717957 728700
61898 728700 736939 741510 741258 736103 727019 715109 701120 685659 669225 651955 633802 615105 596616
61885 596616 578994 562700 548322 536326 526278 516919 507329 497583 488038 478554 468840 459186 450329
61872 450329 442754 436451 431180 426715 422998 420281 418884 418628 418772 418901 419623 422044 426648 432979 440304
61857 440304 448308 457233 467679 480317 495543 513296 533246 555133 578935 604755 632588 662083
61845 662083 692548 723308 753900 783690 811403 835515 855195 870417 880969 885908 884546 877683
61833 877683 867298 855040 841514 827140 813186 801515 793455 789288 788914 792605 800782 813120 828273
61820 828273 844527 860431 874651 885645 891914 892482 886902 875003 857044 834013 807303 778080
61808 778080 747231 715746 684680 654705 626102 599263 574814 553171 534294 517887 503510
61797 503510 490530 478430 467273 457476 449035 441414 434318 428134 423350 419910 417323 415102 412923
61784 412923 410635 408324 406141 404008 401747 399543 397851 396757 395793 394539 393023 391433 389819 388247
61770 388247 386843 385490 383881 382089 380703 380110 379976 379717 379184 378602 378122 377743 377576 378002 379542 382446
61754 382446 386130 389249 390819 391211 391547 392191 392503 392061 391259 390418 389148 387070 384562 382254 380252 378322
61738 378322 376425 374696 373286 372485 372514 372925 372880 372331 372216 373084 374344 375468 376971 379360 381962 383906
61722 383906 385618 388072 390996 393183 394427 395797 397909 400209 402270 404550 407299 409775 411286 412275
61708 412275 413549 414932 415435 414507 412401 409469 405769 401474 397134 393232 389672 385965 381893 377802 374199
61693 374199 371176 368358 365307 361823 357926 353862 350152 347300 345232 343282 340841 337848 334623 331570
61679 331570 329105 327386 325841 323471 320002 316357 313652 312150 311504 311490 311901 312188 311834 310855 309456 307580
61663 307580 305414 303890 303886 305117 306543 307650 308617 309487 310069 310548 311237 311790 311587 311024 311469 313660 316939
61646 316939 320335 323588 326784 329815 332709 335860 339413 342876 345737 347960 349540 350157 349744 348864 347971
61631 347971 346730 344539 341395 337721 333730 329492 325330 321567 318134 314888 312112 310145 308752 307505
61617 307505 306661 306993 308665 310847 312582 313538 313779 313378 312515 311487 310124 307554 303069 297151 291129 285843
61601 285843 281084 276466 272243 268897 266322 263991 261742 259779 257901 255450 252309 249388 247609 246741
61587 246741 245749 244136 242425 241295 240689 239900 238390 236439 235036 234998 236062 237045 237013 236041 234704 233283
61571 233283 231875 230854 230590 230848 231083 231260 231874 233186 234955 236901 238898 240620 241578 241725 241623 241855
61555 241855 242525 243353 243919 243811 243026 242244 242320 243401 244934 246482 248026 249492 250618 251399 252089 252539 252197
61538 252197 251048 249943 249627 249963 250513 251306 252510 253835 254930 256056 257704 259726 261493 262799 263975
61523 263975 265068 265482 264743 263249 261956 261450 261455 261190 260107 258376 256654 255427 254646 254017 253482 253244 253469
61506 253469 254137 255161 256432 257711 258589 258673 257854 256430 254929 253757 253014 252653 252674 253058 253635 254206 254700
61489 254700 255023 254872 254036 252863 252078 252037 252345 252336 251808 251243 251425 252742 254689 256191 256695 256809 257550 259063
61471 259063 260528 261265 261441 261601 261988 262476 262747 262401 261352 260252 260025 260770 261580 261775 261766 262265 263174 263875
61453 263875 264313 265039 266213 267306 267983 268745 270298 272556 274626 275700 275667 274923 273926 273136 273085 274101 275922
61436 275922 277915 279804 281886 284412 287122 289658 292091 294625 297079 299148 300938 302715 304247 304977
61422 304977 304829 304282 303720 303345 303681 305329 307978 310402 311799 312575 313421 314202 314241 313303 311783 310190 308795
61405 308795 307509 305833 303284 300186 297689 296646 296707 296777 296040 294329 292025 290001 289209 289774 290745 291117
61389 291117 290768 290056 289050 287830 287060 287389 288379 288828 288251 287388 287188 287866 289119 290653 292181 293328 293981
61372 293981 294569 295733 297704 300151 302594 304843 306983 308932 310241 310619 310579 311133 312674 314564 316060
61357 316060 317242 318656 320419 322304 324564 328094 333612 340998 349473 358182 366599 374580 382023 388509
61343 388509 393525 397249 400690 404604 408542 411529 413515 415528 418363 421753 424971 427689 429866 431222
61329 431222 431281 429882 427368 424328 421245 418297 415359 412267 409159 406473 404488 402998 401593 400217 399288
61314 399288 399214 399977 401339 403366 406417 410521 415081 419522 424122 429834 437301 446381 456584 467456
61300 467456 478332 488124 495787 500987 504168 506117 507476 508357 508230 506424 502920 498480 493894 489359
61286 489359 484752 480064 475233 469891 463758 457256 451325 446563 442819 439700 437276 436084 436415 437714
61272 437714 438967 439758 440640 442200 444132 445739 447076 448854 451254 453654 455703 457927 461026 465319 471164
61257 471164 478967 488082 496472 502371 505932 508610 511352 514165 516930 519629 521820 522880 522942 522916 523292
61242 523292 523411 522129 518963 514525 510026 506350 503414 500513 497286 493969 490558 486384 481097 475674
61228 475674 471749 470127 470434 471944 474158 476759 479630 482916 486662 490534 494262 498053 502131 506292
61214 506292 510513 515487 521773 528739 535199 540822 546025 550681 554060 556141 557909 560110 562602 565224
61200 565224 568486 572979 578697 585281 592505 600395 609376 620309 633683 648600 663226 676354 687845
61187 687845 697593 705102 710479 714808 718873 722236 724144 724677 724292 722880 720140 716513 712848 709266 705011
61172 705011 699417 692477 684544 676062 667658 659909 652692 645037 635992 625626 615003 605009 595330 584831
61158 584831 573012 560735 549288 539164 530201 522574 516826 512886 509828 506931 504460 503068 502814
61145 502814 503006 502691 500993 497291 491478 484087 476081 468463 461824 455989 450359 444963 440929 439346 439842
61130 439842 440958 441878 443104 445427 449076 454055 460508 468346 477134 486702 497395 509468 522811 537517
61116 537517 554095 572729 592873 613905 635633 657842 679985 701784 723572 745523 766987
61105 766987 787040 805293 821765 836407 849181 860069 868511 873342 873878 870725 865026 857314 847621
61092 847621 836223 823511 809386 793513 776114 757967 739682 721382 703053 684779 666774
61081 666774 649446 633322 618641 605208 592808 581457 571094 561491 552786 545571 540051 535641
61069 535641 531901 529319 528470 528861 529426 529950 531241 533983 538094 543198 549076 555601 562637 570102 577820
61054 577820 585533 593397 602269 612999 625600 639505 654416 670421 687545 705811 725588 747259
61042 747259 770574 794928 820305 847472 877142 909338 943571 979330 1016393 1055012 1095754
61031 1095754 1138876 1183898 1229861 1275882 1321431 1366589 1412345 1460210 1511285 1566203 1626190
61020 1626190 1693308 1769055 1853471 1946318 2048485 2161732 2288460 2433224 2603864 2809893
61010 2809893 3060562 3365833 3738092 4191027 4738200 5395705 6185700 7135010 8272108
61001 8272108 9627241 11222223 13028897 14912244 16622814 17886148 18544792 18640796 18374254
60992 18374254 17989791 17691378 17617278 17823868 18242638 18657578 18772397 18353282 17344489
60983 17344489 15871610 14149203 12378738 10699092 9186783 7873052 6758981 5828105
60975 5828105 5057086 4421777 3899116 3468337 3112259 2817110 2571223 2364490 2188556
60966 2188556 2036565 1902811 1783182 1675462 1578325 1490166 1409543 1336328 1271368 1214896
60956 1214896 1165907 1123039 1085260 1051514 1020355 990367 960770 931517 903007 875748 850065
60945 850065 826051 803856 783832 766195 750688 736765 723882 711372 698398 684517 670148
60934 670148 656049 642381 628688 614657 600464 586426 572767 559714 547455 535983 525370
60923 525370 516129 508805 503134 498067 492794 487387 482370 478130 474926 472940 471872 470887 469421 467867
60909 467867 467053 467189 467782 468569 469991 472520 475826 478954 481229 482766 484081 485448 486750 487887 489038
60894 489038 490313 491237 490907 488932 486078 483724 482558 481943 480623 477800 473361 467350 459780 451084 442290
60879 442290 434269 426962 419780 412686 406386 401311 396935 392501 387998 383917 380257 376422 372155 367998
60865 367998 364644 362338 361184 361485 363244 365595 367296 367736 367092 365727 364068 363000 363551 365761 368396
60850 368396 370250 371430 372994 375598 378949 382347 385299 387676 389725 391876 394215 396174 397071 396869 396044
60835 396044 394887 393407 391818 390436 389048 387017 384288 381697 379976 378928 377995 377136 376618 376253 375472
60820 375472 374056 372332 370690 369259 368016 366834 365374 363239 360297 356796 353203 349967 347240 344647
60806 344647 341566 337837 333939 330347 327017 323827 321060 318902 316780 313890 310342 307239 305547 305284
60792 305284 305749 306051 305454 303804 301754 300116 298896 297428 295551 294041 293628 294129 294931 295850 297019 298206
60776 298206 298832 298693 298308 298518 299888 302406 305548 308678 311559 314471 317721 321173 324392 327159 329642
60761 329642 332084 334501 336732 338629 340140 341210 341745 341731 341350 340802 339987 338571 336549 334547 333271 332743
60745 332743 332405 331956 331718 332043 332654 332746 331593 328911 324798 319575 313685 307627 301889 296776 292264 288124
60729 288124 284308 281068 278513 276284 273968 271706 269969 268804 267763 266633 265773 265567 265934 266569 267279
60714 267279 267875 268143 268235 268759 269999 271269 271501 270451 268965 268052 268053 268790 270174 272316 275149 278217 281020
60697 281020 283513 286078 288908 291608 293649 295184 297078 299982 303579 306942 309439 311132 312469 313891
60683 313891 315751 318233 321110 323641 325028 325174 324969 325588 327362 329366 330215 329227 326813 323991 321677
60668 321677 320217 319175 317616 314865 311108 307124 303530 300557 298370 297100 296446 295693 294379 292725 291262
60653 291262 290364 290317 291512 294139 297782 301611 305008 307911 310635 313460 316271 318458 319259 318375 316164
60638 316164 313182 309686 305716 301533 297697 294661 292410 290547 288772 287256 286491 286698 287503 288336 289029
60623 289029 289773 290557 291017 290928 290608 290640 291337 292508 293583 293915 293250 291969 290718 289805 289203 289056 289633 290653
60605 290653 291207 290786 290065 290194 291505 293351 295034 296379 297371 297732 297156 295805 294429 293994 295085 297445
60589 297445 300052 301879 302741 303342 304404 305854 306931 307041 306354 305499 304828 304191 303490 303166 303887 305847 308695
60572 308695 312117 316248 321427 327832 335435 344084 353478 363216 372998 382666 391983 400505 407728 413208
60558 413208 416555 417553 416338 413250 408528 402458 395818 389702 384724 380799 377951 376866 378197 381630
60544 381630 386145 391061 396470 402826 410568 420043 431289 443819 457009 470710 485059 499604 513046
60531 513046 524077 532187 537458 539937 539568 536566 531491 524959 517573 510081 503260 497438 492327 487497
60517 487497 482889 478704 474946 471414 468213 465941 465158 465789 467263 469172 471637 475137 480227 487418 497056
60502 497056 509197 523712 540657 560531 584136 612117 644488 680482 718970 759165 800831
60491 800831 843557 885831 924990 958128 983032 998397 1003450 997565 980360 952324 915323 872171
60479 872171 825529 777365 729489 684028 642795 606349 574100 545225 519182 495651 474600
60468 474600 456327 440881 427535 415379 404317 394905 387244 380738 374941 369856 365233 360434 355356
60455 355356 350820 347529 345155 342892 340474 338215 336445 335263 334486 333519 331651 328857 325993 323940 322882
60440 322882 322557 322672 322818 322605 322222 322293 322764 322590 321015 318547 316105 313797 311258 308625 306346 304451
60424 304451 302861 302071 302672 304363 306251 307931 309553 311055 312221 313424 315349 317883 320034 321168 321698
60409 321698 322414 323671 325352 327050 328185 328420 328100 327915 328151 328656 329357 330256 331064 331529 332089 333535 335976
60392 335976 338798 341612 344504 347339 349629 351285 352787 354371 355785 357003 358453 360194 361686 362742
60378 362742 363970 365796 367764 369358 370890 372890 375125 376938 378201 379250 380177 380880 381644 383031 385197
60363 385197 387779 390388 392842 395079 397273 399862 403009 406166 408762 411339 415423 422190 431592 442815
60349 442815 454927 466792 476924 484159 488462 490600 490940 488938 484060 476869 468751 460663 452644 444672
60335 444672 437434 431758 427603 424122 420679 417268 414025 410835 407583 404339 401123 397837 394536 391361
60321 391361 388153 384619 381125 378800 378467 379867 382309 385663 390208 395852 402186 409261 417749 428259
60307 428259 440839 455150 470703 486867 502982 518542 532982 545263 554100 558808 559665 557194
60295 557194 551351 541741 528482 512510 494974 476707 458484 441493 427059 415746 407029 400102
60283 400102 394797 391392 389652 388576 387240 385528 383746 381898 379742 377387 375160 372845 369658 365410
60269 365410 361283 358857 358427 358760 358546 357567 356299 355015 353758 352785 352333 352137 351844 351831 352837 354625 355846
60252 355846 355725 355211 355789 357549 359195 359747 359486 359251 359540 360527 362312 364713 366987 368228 368100 367190 366588
60235 366588 367022 368285 369574 370411 371002 371663 372399 373350 375148 378128 381429 383659 384511 385059 386293 387927
60219 387927 388953 388917 388317 388049 388751 390539 393137 396270 399952 404304 409188 414299 419524 424970 430653
60204 430653 436429 442136 447560 452425 456801 461296 466337 471379 475395 478084 479989 481487 482431 482890 483365
60189 483365 483980 484135 483426 482283 481261 480258 478952 477512 476226 474782 472504 469183 465213 461085 457144
60174 457144 453665 450722 448086 445556 443292 441579 440415 439612 439057 438591 437838 436525 434859 433332 432281
60159 432281 431789 431752 431827 431623 431265 431458 432609 434173 435295 435888 436555 437601 438694 439510 440191 440969 441718 442179
60141 442179 442505 443325 445202 448036 451143 454059 457186 461424 467175 473935 480796 486965 491895 495556 498741
60126 498741 502371 506146 508519 508550 507214 506197 505941 505694 505117 504714 504664 504267 502935 501028 499297 498029
60110 498029 497124 496561 496300 496007 495286 494089 492638 491053 489339 487587 485913 484181 482032 479285 476196
60095 476196 473255 470796 468918 467761 467634 468668 470450 472288 473880 475438 477092 478497 479241 479398 479437
60080 479437 479775 480605 481852 483050 483545 483256 482986 483490 484333 484188 482246 478824 474544 469470 463407 456620
60064 456620 449835 443616 438063 433044 428488 424391 420699 417235 413754 410088 406295 402673 399631 397482
60050 397482 396298 395922 396127 396801 397964 399651 401847 404477 407301 409855 411782 413316 415191 417928 421349
60035 421349 424933 428363 431508 434091 435753 436427 436366 435784 434715 433172 431232 428865 425932 422436 418610
60020 418610 414635 410396 405709 400674 395542 390158 383895 376483 368844 362631 358732 356460 354413 351830
60006 351830 348884 345995 343375 341068 338944 336737 334504 332936 332650 333241 333705 333795 334223 335356 336531 337132
59990 337132 337693 339304 342246 345702 348572 350263 351020 351805 353505 355964 358167 359617 360922 362615 364045
59975 364045 364148 362859 361029 359283 357737 356588 356105 356053 355832 355239 354527 353825 353191 353161 354435 356814 359183
59958 359183 360860 362370 364572 367505 370532 373147 375138 376193 375925 374410 372385 370763 369924 369491 368745
59943 368745 367233 364994 362365 359736 357464 355706 354251 352735 351129 349772 348886 348406 348367 348935 349831 350324
59927 350324 350257 350588 352358 355482 359053 362498 365848 369272 373040 377646 383131 388370 391778 392766 391944
59912 391944 390128 387930 386176 385740 386702 388370 390311 392715 395661 398798 402036 405731 409836 413518 416114
59897 416114 417884 419377 420565 421124 421189 421301 421885 423197 425496 428794 432647 436558 440470 444551 448706
59882 448706 452662 456368 460006 463710 467580 471837 476653 481822 486819 491095 494165 495560 495070 493099
59868 493099 490528 488062 485726 483098 480007 476851 474153 471975 470051 468498 467969 468868 470758 472896 475115
59853 475115 477823 481401 486046 492012 499324 507149 513907 518248 519711 518543 515405 511338 507599 505166
59839 505166 504450 505289 506858 507645 506168 502035 496137 489774 483781 478444 473789 469775 466407 463739 461628
59824 461628 459655 457589 455762 454556 453647 452322 450451 448517 446636 444160 440485 435806 430898 426497
59810 426497 422990 420216 417496 414249 410741 407785 405711 404083 402446 400800 399319 398244 398119 399323
59796 399323 401147 402041 401200 399341 397593 396270 395126 394155 393505 393028 392484 391935 391545 391293 391220 391586 392425
59779 392425 393292 393764 393855 393705 393303 392859 392905 393630 394567 395319 396044 396862 397430 397720 398569 400686 403532 406055
59761 406055 408200 410826 414275 417857 420754 422772 424258 425989 429086 434240 440784 447137 452366 456879
59747 456879 461516 466561 471906 477566 483619 489938 496342 502785 509089 514672 518948 521993 524587 527453
59733 527453 530582 533375 535338 536437 536765 536200 534668 532620 530838 529735 529081 528404 527298 525422 522728
59718 522728 519813 517515 515922 514208 511711 508669 505604 502525 499252 496121 493749 492266 491198 490016
59704 490016 488457 486544 484595 482936 481376 479360 476986 475312 475087 475621 475709 475308 475422 476419 477342 477040
59688 477040 475320 472863 470617 469389 469368 469789 469552 468426 467216 466619 466421 466007 465104 463613 461200 457597
59672 457597 453088 448246 443308 438180 432999 428305 424573 421785 419554 417578 415879 414638 413883 413370 412866
59657 412866 412480 412584 413360 414544 415696 416669 417645 418714 419651 420262 420832 421871 423345 424553 424972 424863 424665
59640 424665 424118 422618 420245 417705 415285 412680 410070 408455 408400 409176 409846 410570 411932 413379 413433 411521
59624 411521 408739 406521 405162 403941 402161 399716 396960 394311 391862 389239 386077 382708 380098 378817
59610 378817 378290 377393 375756 374204 373823 374779 376313 377795 379388 381437 383558 384859 385053 384887 385314 386598
59594 386598 388320 389877 390869 391358 391943 393209 394961 396388 397114 397569 398075 398206 397522 396384 395471 394815 393916
59577 393916 392543 390872 389083 387373 386143 385600 385323 384775 384095 383850 384110 384316 384001 383195 382231 381577 381714
59560 381714 382618 383506 383618 383137 382790 382776 382731 382605 382792 383382 384107 385101 386888 389399 391869 394064 396850 401006
59542 401006 406184 411746 418029 425996 436034 448206 463529 483532 507444 530377 545599 549290
59530 549290 542995 531496 518935 507213 497083 489230 484004 481043 479861 480264 481786 483388 484401
59517 484401 485300 486763 488258 488456 486884 484273 481129 476840 470575 462505 453702 445165 437319 430184 423694
59502 423694 417849 412726 408331 404514 401162 398387 396342 394872 393501 391779 389543 386988 384591 382815
59488 382815 381705 380943 380422 380493 381470 383177 385193 387204 388946 390233 391340 392840 394717 396251 397284
59473 397284 398926 402235 406694 410843 413983 416379 418211 419472 420730 422788 425501 427913 429682 431417
59459 431417 433475 435466 437227 439327 442158 445441 449113 453967 460718 468916 477265 484717 490913 495986
59445 495986 500204 503492 505169 504585 502047 498496 494207 488547 481328 473662 467004 461899 458079 455251
59431 455251 453297 452096 451627 452024 453281 455171 457607 460745 464637 469263 475013 482567 492077 503041
59417 503041 515270 529407 546147 565447 586920 610697 637452 667359 698577 726318 744161
59406 744161 747863 738533 721548 702305 683726 667397 655244 649251 650608 659567 674530 690276
59394 690276 698806 694144 676507 651124 623755 598153 576356 558993 545062 533003 522494 514378
59382 514378 508911 505193 502359 500224 498671 497418 496648 496874 497921 498909 499443 499923 500438 500407 499771 499580 500758
59365 500758 502983 505420 507846 510373 512721 514650 516769 520017 524461 529337 534251 539645 545982 553099
59351 553099 560605 568495 577012 586202 595950 606372 617870 630696 644539 658586 671945 684020
59339 684020 694569 703577 711126 717311 722039 724836 724957 721890 715850 707721 698471 688586 678055 666788
59325 666788 654928 642768 630533 618362 606442 595025 584296 574275 564848 555882 547405 539710
59313 539710 533260 528439 525448 524305 524722 526014 527595 529803 533936 541139 551361 563375 575232 584348
59299 584348 587926 584436 574800 561561 546831 531484 515995 501050 487206 474790 464449 456997
59287 456997 452297 449022 446114 443946 443451 444571 446261 447774 449278 451290 454098 457742 462134 467052
59273 467052 472302 478008 484655 492821 502856 514598 527266 539801 551488 562181 571926 580580 587846
59260 587846 593428 597113 598928 599249 598431 596311 592403 586682 579794 572396 564745 557077 549989 544146 539905
59245 539905 537345 536317 536319 536718 537321 538430 540224 542535 545398 549295 554511 560609 566855 572828 578405
59230 578405 583431 587641 590621 591734 590513 587231 582648 577139 570626 563445 556353 549348 541350 531759
59216 531759 521647 512652 505130 498143 491006 484064 478007 473002 468590 464189 459782 456188 454308 453931
59202 453931 453720 452632 450886 449325 448446 448412 449322 450827 452002 452237 451905 451704 451843 452426 454033 457161 461409
59185 461409 465930 470358 474723 478847 482528 486011 489582 492986 495859 498441 501179 503999 506681 509611
59171 509611 513329 517512 521212 524075 526658 529675 533531 538384 543895 549005 552612 554523 555301 555379 554870
59156 554870 553942 552582 550080 545451 538455 529813 520593 511782 504115 497698 491989 486596 481658 477020
59142 477020 471795 465647 459756 455341 451759 447470 442569 438777 436872 435668 433920 431828 430083 428584
59128 428584 426939 425345 424213 423528 423201 423541 424875 427141 430247 434401 439742 446083 453200 461007 469308
59113 469308 477947 487237 497522 508164 517770 525794 533113 540665 548233 555071 560967 566079 570331 573671
59099 573671 576481 579018 580753 580964 579803 578209 576869 575734 574450 572834 570967 569218 568175 568196 568951
59084 568951 569582 569368 568100 565886 562799 558800 553926 548446 542770 537218 531938 526979 522213 517187 511479
59069 511479 505388 499929 495774 492500 489210 485620 482084 478830 475688 472477 469189 465905 462856 460356
59055 460356 458304 456075 453350 450712 448874 447705 446691 445931 445804 445938 445515 444505 443609 442975 442010 440672
59039 440672 439930 440554 442199 443982 445266 445595 444732 443273 442566 443503 445805 448856 452694 457736 463938 470728
59023 470728 477583 484479 491987 501003 512057 524684 537776 550539 562777 574294 584485 592563
59011 592563 597772 599500 597702 593266 587508 581358 575445 570590 567428 565620 564308 563355 563403 564782 567190
58996 567190 570378 574218 578053 581056 583316 585568 587680 588578 587959 586861 586001 584683 582023 578245 573997
58981 573997 569400 564635 560698 558569 558136 558755 560374 563346 567585 572734 578864 586311 595030 604608 614633
58966 614633 624643 634106 642969 651859 661282 670976 680396 689336 697608 704680 710220 714579 718067 720062
58952 720062 719397 715423 708293 698507 686651 673364 659172 644505 630025 616566 604536 593839
58940 593839 584578 577179 571515 566564 561455 556316 551680 547638 544100 541249 539104 537133 534967 533073
58926 533073 532076 531858 531944 532382 533469 534885 535815 535856 535253 534376 533465 532732 532246 531752 530962 529932 528922 528063
58908 528063 527384 526977 527027 527916 530326 534768 540935 548033 555861 564914 575255 586029 596434 606424 616084
58893 616084 625091 633395 641812 651360 662535 675567 690632 707261 724300 741119 758158 775562
58881 775562 791986 805581 815645 822569 826732 828385 828075 826162 822100 815075 805188 793352 780270
58868 780270 766305 752135 738738 726701 716077 706854 699156 693089 688689 685684 683100 679649 674957
58855 674957 669846 664914 659551 652980 645550 638139 630824 623089 614962 607021 599588 592726 586779 582038
58841 582038 578012 573784 568897 563290 556717 549052 540934 533340 526615 520543 515084 510270 505649 500675
58827 500675 495576 491149 487758 485166 483217 482079 481894 482740 484768 487861 491380 494826 498477 502856 507803
58812 507803 512627 516906 520599 523751 526646 529861 533457 536459 537807 537525 536355 534651 532314 529432
58798 529432 526190 522481 518295 514214 510736 507447 503567 498974 493958 488413 482190 475962 470821 467114
58784 467114 464418 462506 461644 462058 463674 466168 468841 470945 472638 475055 478796 483003 486514 489042 490345
58769 490345 489297 485134 478934 472499 466386 460384 455209 451982 450303 448625 446577 445374 445843 447447
58755 447447 449422 451574 453775 455917 458510 462186 466465 470140 472871 475231 477285 478523 479230 480429
58741 480429 482163 483298 483423 483659 485145 487872 491430 495673 500208 504393 508392 513229 519322 525925 532338
58726 532338 538606 544660 549896 554134 557947 561606 564662 567063 569600 572807 576459 580664 586321 593795
58712 593795 602094 610085 617609 624777 631107 636157 640174 643306 644793 643713 639973 633974 625888 615906
58698 615906 604584 592306 578915 564414 549542 535088 521118 507464 494557 483185 473731 466059
58686 466059 459868 454747 450102 445405 440466 435451 430883 427434 425273 423735 422134 420691 420032 420060 420233
58671 420233 420778 422568 425723 429428 433246 437643 443042 449438 457142 466793 478271 490494 502501 513663
58657 513663 522575 527147 526500 521868 515100 507214 498863 490948 483868 477058 470101 463574 458081 453217
58643 453217 448337 443703 440105 437866 436903 437218 438618 440402 442022 443826 446606 450627 455344 459729 462744
58628 462744 464050 464464 465225 466671 468267 470019 472934 477780 484145 491080 497935 504246 509601 514038 517932
58613 517932 521185 523138 523426 522184 519379 515000 510098 506445 504676 503728 502548 501284 500306 499235 497737
58598 497737 496312 495441 494673 493328 491451 489401 487102 484321 481196 478089 475493 474339 475602 479182 483912
58583 483912 489012 494737 501366 508587 516272 524789 534021 543033 551245 559039 566712 573853 580292 586616
58569 586616 593182 599591 605766 612536 620624 630081 641211 654879 671215 689168 708037 728248 749815
58556 749815 771287 791105 808834 824104 835651 842595 845687 846146 844208 839912 834240 828222 821745
58543 821745 814473 807123 800600 794535 787834 779942 770488 758525 743526 726708 710133 694844 680764
58530 680764 667779 655918 645055 635502 628383 624379 622585 621585 621070 621364 621948 621681 620206 618143
58516 618143 616074 614065 611832 608793 604443 599261 594606 591166 588249 585172 582371 580313 578426 576125
58502 576125 574001 572817 572126 571096 570003 569674 569972 569957 569172 567795 566034 564292 563452 564108 565892 568182
58486 568182 570912 574059 577147 580011 583272 587407 592206 597808 605215 614969 626345 638576 651645
58473 651645 664988 676866 686189 693611 699564 702611 701302 696467 690074 682912 675027 667354 661062 656066
58459 656066 651911 649377 649472 651559 654225 657485 662449 669262 677015 685283 694183 703139 710899 716484 719203
58444 719203 718473 714782 710025 705624 701110 695692 690132 685692 682358 679684 678274 678662 679782 680460 681485
58429 681485 684251 688231 691819 694934 698740 703450 708455 713987 720591 727435 733198 738144 743291 747993
58415 747993 750437 750199 748318 745177 740316 734049 727334 720336 712912 706009 700629 695933 690473 684895
58401 684895 681276 680103 680049 680381 681407 682815 683919 685517 689272 695103 701193 706611 711988 717633 722885
58386 722885 727389 731252 734102 735840 738129 743193 751213 760581 770310 780372 790180 798875 806836 814872
58372 814872 822308 827951 832442 837449 842981 847881 852549 858627 866150 873509 880163 886958 893922 900176
58358 900176 906022 912759 920450 928113 935895 944624 953438 960388 965213 969115 972162 973714 975114 978888
58344 978888 985075 991227 996267 1001648 1008450 1016159 1024638 1034650 1046028 1057696 1069680 1082687 1095905
58331 1095905 1107905 1119511 1132887 1147834 1161991 1174621 1187053 1199378 1209998 1218665 1226707 1233976
58319 1233976 1238933 1242148 1246348 1252418 1258582 1264064 1270299 1277979 1286138 1294818 1305429 1317869 1330340
58306 1330340 1342547 1355951 1370565 1384733 1398407 1413242 1429188 1444427 1458935 1474464 1490832
58295 1490832 1506066 1520418 1536214 1553470 1569899 1585622 1603398 1623657 1643917 1663818 1685895
58284 1685895 1710471 1734665 1757669 1782088 1808720 1835006 1860271 1887503 1918108 1949717 1981144
58273 1981144 2014810 2052201 2091441 2131259 2172899 2216399 2259655 2302919 2349459 2400094 2451998
58262 2451998 2504506 2560739 2621649 2684001 2746364 2811544 2880802 2951189 3020943 3091925 3164461
58251 3164461 3235640 3305212 3377281 3453711 3531870 3611263 3695927 3787656 3883546 3983012 4090339
58240 4090339 4207305 4330430 4458525 4595491 4742472 4895235 5053041 5221860 5404768
58231 5404768 5597574 5798238 6011959 6242378 6486776 6745049 7024157 7328197 7653420
58222 7653420 7998682 8371149 8775948 9210597 9676160 10183312 10740673 11348265 12009598
58213 12009598 12738570 13547086 14438555 15421823 16518275 17746448 19114061 20635613 22344649
58204 22344649 24281326 26487054 29024583 31987226 35478402 39604295 44502459 50359869
58196 50359869 57395654 65858821 76061148 88379251 103204170 120928908 142011980
58189 142011980 167007710 196491215 230928935 270397076 313844031 358016391 397072453
58182 397072453 423982044 433375993 423929176 398562424 362617610 321621494 279958856
58175 279958856 240561262 205078030 174174658 147869721 125828608 107539453 92414363
58168 92414363 79886175 69476502 60793598 53504115 47335345 42084106 37593053 33723056
58160 33723056 30359587 27426007 24866602 22623261 20641464 18885815 17332076 15951646
58152 15951646 14716996 13613248 12630546 11751838 10959476 10246184 9608072 9033469 8508992
58143 8508992 8029820 7593683 7190965 6810930 6452427 6119159 5809311 5518374 5247039
58134 5247039 4997483 4766050 4547530 4342642 4153960 3978552 3811828 3654648 3509700
58125 3509700 3374574 3245060 3121692 3006666 2897900 2792337 2691643 2598565 2511076 2426110
58115 2426110 2345710 2273389 2207436 2143762 2082550 2026281 1973731 1921608 1869903 1820333 1771673
58104 1771673 1721799 1672329 1626376 1583533 1541516 1500703 1462640 1426252 1390020 1355834 1326315
58093 1326315 1300200 1274507 1249229 1225804 1203075 1179086 1155007 1133165 1112983 1092856 1074077
58082 1074077 1058667 1044999 1029760 1012757 995858 978746 959775 939703 920687 902681 884390
58071 884390 866462 850190 834390 817187 799596 783794 769172 753724 738132 724787 713752
58060 713752 703308 693588 686150 680582 674840 668318 661568 653779 643659 632183 621582 612202 603050
58047 603050 594519 587741 582049 575848 569226 563128 556940 549555 541846 535386 529680 523304 516694 511136
58033 511136 506114 500479 495029 490963 486888 480450 471985 463540 455254 445939 436408 428857 423356 418064
58019 418064 412563 408052 404637 401305 398208 396132 394201 391004 387614 386485 387595 388608 388625 388836 389557
58004 389557 389590 388704 388083 388155 388369 389069 391049 393321 393903 392839 391970 391776 390979 389193 387188 384293 378223
57987 378223 368078 355442 342237 329617 318898 311107 305239 299164 292554 286900 282646 278580 274219
57974 274219 270529 267938 265773 263909 262900 262321 261077 259520 259113 259837 260161 259794 260181 261919 263978 265924
57958 265924 268667 272367 275674 277797 279440 281080 282059 281955 281174 279716 276996 273298 269800 266899 264104
57943 264104 261741 260934 261733 263069 264754 267646 271713 275956 280516 286675 294367 301830 308274 314816 322103
57928 322103 328972 334158 337443 338559 336911 333137 328943 324609 318501 309877 300303 291461 283445 276169
57914 276169 270446 266396 262486 257565 252563 249018 247121 246284 246409 247525 249193 251148 253569 256044 257422
57899 257422 257391 257054 257323 257919 258513 259535 261177 262967 264999 268203 272610 276743 279622 282080 285089 288083
57883 288083 289997 290892 291456 291751 291428 290359 288284 284621 279348 273288 266974 260121 252747 245826 240198
57868 240198 235792 232414 230247 229029 227869 226517 225766 226018 226619 227246 228763 231909 236192 240826 245699
57853 245699 250699 255179 258963 262896 267576 272398 276591 280192 283253 285107 285370 284884 284848 285665 287132
57838 287132 288843 289771 288567 285122 281059 277913 275549 272921 269477 265203 260335 255763 252786 251701
57824 251701 251388 250862 250336 250180 249990 249491 249302 249886 250620 250731 250267 249253 246864 242434 236568 230311 223858
57807 223858 216925 209743 202819 196236 189891 183923 178344 172892 167737 163634 160896 158969 157423 156489
57793 156489 156211 156142 156348 157501 159349 160347 159678 158499 158317 159284 161015 163821 167860 172127 175654 179026
57777 179026 183522 189411 196114 203260 210460 216763 221484 225084 228311 231100 233211 235083 236948 237876
57763 237876 236913 234584 232142 229866 227209 224122 221168 218782 217397 217803 220452 224958 231059 239269 249476
57748 249476 259673 267377 271830 273769 273724 271918 269246 266778 264350 260867 256003 250645 245790 241893
57734 241893 239044 236925 234871 232745 231380 231436 232376 233392 234635 236515 238481 239731 240525 241504 242216 241693
57718 241693 240147 238696 237599 236108 233944 231655 229534 227320 224938 222490 219662 216179 212671 209959
57704 209959 207694 204911 201687 198979 196901 194531 191514 188520 185936 183345 180629 178393 176897 175565
57690 175565 173931 172177 170426 168411 166159 164212 162790 161474 160036 158908 158521 158794 159594 161232 164327
57675 164327 169597 177790 189376 204254 222193 243483 268768 298578 333647 375348 424664 480060
57663 480060 536189 584394 614912 620625 600854 561822 512589 460336 409336 362589 322217 288462
57651 288462 260155 236559 217675 202881 190777 180662 172885 167417 163328 159969 157481 155766 154129
57638 154129 152429 151489 151776 152569 152943 152810 152509 152148 151785 151553 151290 150717 150137 150112 150318 149759 148368 147261
57620 147261 146906 146196 144061 141079 138631 137183 136160 134978 133472 131766 130297 129573 129455 129131 128223 127337
57604 127337 127091 127212 127148 127038 127388 128131 128566 128005 126176 123350 120309 117757 115421 112262 107874 103133
57588 103133 99049 95623 92310 89036 86066 83329 80594 78120 76523 76022 76181 76228 75493 73848 71983
57573 71983 70845 70418 69568 67540 65175 63961 64166 64625 64272 63180 61932 60653 59123 57504 56409 56074
57557 56074 55796 54564 52221 49680 47791 46353 44560 42167 39732 37849 36603 35747 34928 33706 31855
57542 31855 29778 28282 27840 28310 29357 30806 32641 35053 38444 42950 48012 52845 57286 61810 66903
57527 66903 73027 80953 91293 103582 116604 129886 144213 160399 178151 196363 213993 230336
57515 230336 245010 258103 269973 280654 289667 296502 300897 302611 301501 297868 292269 284843 275435
57502 275435 264400 252607 240476 227774 214657 202139 191028 181000 171229 161499 152253 143995
57490 143995 137084 131728 127757 124646 122033 119834 117726 115053 111619 108016 104745 101527 97982 94547
57476 94547 92132 91041 90716 90346 89401 87784 85876 84248 83003 81542 79215 76072 72793 70051 68095
57461 68095 66687 65293 63640 62179 61703 62349 63384 64102 64526 64989 65490 65776 65751 65471 64975 64394 63938 63616
57443 63616 63279 63094 63555 64715 65765 65755 64546 62824 61368 60536 60248 60170 59984 59619 59238 59119 59666 61264
57425 61264 63721 66018 67090 66804 65780 64460 62926 61497 60683 60462 60260 59769 59190 58623 57889 57038 56403
57408 56403 56043 55824 55995 56891 57987 58241 57498 56633 56110 55520 54865 55013 56265 57597 58178 58609 59743 61174
57390 61174 61947 62065 62168 62275 61962 61436 61402 62062 63097 64386 65923 67195 67521 66949 66174 65640 65273 64918
57372 64918 64418 63519 62311 61563 61958 63082 63713 63026 61112 58585 56228 54759 54366 54578 54986 55742 56917
57355 56917 57885 58046 57839 58241 59473 60923 62136 63132 63847 64038 63779 63402 62917 62110 61182 60682 60714 60790 60559
57336 60559 60190 59966 59884 59811 59750 59911 60684 62366 64621 66397 66759 65648 63688 61570 59933 59327 59640 59831
57318 59831 58855 56753 54414 52549 51434 51281 52072 53138 53623 53410 53061 52882 52599 51953 51093 50352 50041
57301 50041 50407 51306 52042 51955 51108 49960 48610 46897 45060 43620 42676 41986 41715 42355 43753 44940 45279
57284 45279 45328 46279 48800 52676 57359 62619 68637 75483 82625 89295 95453 101888 108974 115821 121288
57269 121288 125500 129555 133829 137411 139422 140215 140860 141763 142156 140896 137666 133428 129635 126962 125004
57254 125004 123215 121686 120716 120092 119314 118243 117006 115521 113675 111847 110653 110158 109769 108932 107634 106302
57238 106302 105463 105385 105773 106016 105932 105947 106305 106591 106488 106454 107012 107775 107894 107271 106663 106726 107538 108869 110363 111604
57218 111604 112608 114046 116416 119221 121542 123163 124467 125526 126079 126318 126849 127899 129230 130843 133056
57203 133056 135864 138829 141664 144371 146808 148717 150188 151628 153291 155254 157654 160447 163115 165191
57189 165191 166867 168565 170295 172054 174377 177526 180460 181785 181666 181694 182765 184143 184915 185347 186372
57174 186372 188479 191565 195317 199375 203581 208257 213813 220054 226408 232845 239886 247597 255343 262757
57160 262757 270395 279209 289834 302463 316787 331901 346847 361503 376534 392478 409405 427448
57148 427448 446927 467794 489508 511683 534365 557599 581225 605199 629654 654706 680699
57137 680699 708501 738836 771304 804725 838530 873154 909048 946048 983934 1022953 1063516
57126 1063516 1105812 1149829 1195399 1242171 1289963 1339064 1389888 1442622 1497690 1556156 1619002
57115 1619002 1686365 1758316 1836107 1921720 2016411 2120694 2235689 2363523 2506389 2666235
57105 2666235 2845683 3048628 3279924 3545209 3851453 4207561 4624897 5117745 5703105
57096 5703105 6399813 7228351 8211481 9373590 10738117 12325378 14151309 16224425 18541292
57087 18541292 21085320 23829088 26734152 29749801 32823288 35921338 39034923 42143419
57079 42143419 45161627 47924953 50234399 51922115 52886187 53086771 52530892 51263803
57071 51263803 49362299 46925030 44064724 40904577 37572864 34192826 30872782 27700397
57063 27700397 24739557 22029168 19586024 17410875 15493304 13814243 12349129 11072241
57055 11072241 9959179 8986864 8133982 7382709 6719264 6132654 5613805 5155490 4751321
57046 4751321 4394203 4076733 3793109 3539512 3312675 3109459 2927926 2767312 2626453
57037 2626453 2503337 2396493 2305664 2230588 2170163 2123514 2091178 2074181 2071175 2075491 2074623 2054210
57025 2054210 2005229 1928744 1833705 1730421 1626275 1525952 1432866 1349218 1275718 1211980 1156820
57014 1156820 1108296 1064496 1024647 988932 957245 928829 902959 879129 856696 835230 815071
57003 815071 796590 779046 761153 742747 724753 707569 690604 673572 657111 641889 628066
56992 628066 615822 605481 596881 589549 583716 580226 579279 580187 582679 587473 595178 605176 615667 624021
56978 624021 627146 622749 610891 593770 573840 552677 531468 511377 493106 477021 463941 454818
56966 454818 449385 446180 444364 444630 447875 453908 462072 472332 485174 501054 520312 542723 566265
56953 566265 586822 599908 602789 595101 578291 555065 528730 502181 477275 455092 436322 421188
56941 421188 409446 400809 395215 392741 393606 398222 406820 419155 435117 455493 481359 512604 547405
56928 547405 582685 614191 636544 644970 637986 618001 589160 555273 519671 485515 455109 429217
56916 429217 407499 389245 373590 359789 347827 338314 331543 327078 324265 322490 320869 318630 316151
56903 316151 314853 315597 317773 320311 322877 325741 329092 332988 337440 342191 346872 351661 357281 364143
56889 364143 372046 380845 390775 401870 413800 426401 439477 451584 459716 460786 453143 436802 413282
56876 413282 385745 358308 334182 314554 299411 288818 283028 282037 285671 293812 306340 323331
56864 323331 345538 374032 409151 450465 497995 552462 613545 678025 739686 790515 822541
56853 822541 830645 815277 782262 739297 692601 646494 604457 569152 541884 522943 512362 509961
56841 509961 515278 528141 549006 578392 616555 664127 722372 792256 873733 965826 1065492 1164750
56829 1164750 1249795 1305352 1321529 1297487 1240083 1160258 1069696 978199 892158 814873 748002
56818 748002 692539 648862 616780 595799 585223 584182 591938 608145 632650 665368 706626 757296
56806 757296 817877 886809 958862 1024484 1071382 1088968 1073409 1029105 965390 891861 816035
56795 816035 743244 676834 618385 568455 527253 494524 469386 450875 438396 431493 429813 433737
56783 433737 444347 462208 486715 517009 552456 590932 627052 653412 664113 657158 634221 599210
56771 599210 556887 511704 467045 425225 387713 355125 327299 303793 284125 267511 252974
56760 252974 240120 229262 220436 212835 205642 198837 192702 187154 182109 177824 174234 170540 166190 161744
56746 161744 158060 155154 152631 150658 149569 148943 147995 146659 145384 144144 142539 140713 139333 138710 138726
56731 138726 139470 141115 143161 144649 145298 145830 146971 148560 149751 149807 148747 147502 147263 148378 149994 151039
56715 151039 151248 151017 150733 150631 150911 151506 152129 152837 154048 155687 156993 157708 158658 160451 162325 163206 163243
56698 163243 163261 163209 162419 161164 160673 161410 162370 162305 160927 158742 156379 154327 152810 151599 150214 148330 145951
56681 145951 143414 141351 140183 139376 137776 135142 132728 131780 132075 132609 133058 133654 134179 134059 133227 132034
56665 132034 130580 128859 127186 125680 123734 120823 117384 113955 110014 104813 99001 94130 90660 87694
56651 87694 84624 81837 79678 77974 76900 77376 80217 85546 93204 102929 113992 125353 136376 146840
56637 146840 156380 164625 171860 178731 185270 190982 195906 200778 206055 211496 216720 221487 225424 228235
56623 228235 230191 231739 232668 232445 231287 230052 229081 227984 226524 224823 222645 219478 215483 211542 208180
56608 208180 205205 202486 200196 198055 195273 191615 187925 185240 183876 183438 183150 182173 180268 178251 177194
56593 177194 177205 177563 177884 178357 178987 179550 180231 181327 182280 182136 181166 180965 182488 184909 186778 187513 187340 186637
56575 186637 185921 185827 186524 187515 188337 189088 190074 191418 193187 195389 197682 199608 201272 203358 206349 210181
56559 210181 214690 219901 225792 232112 238354 243612 246903 248247 249069 250736 253001 254693 255474 255874 255926
56544 255926 255115 253625 252348 251543 250671 249668 249102 248812 247716 245401 242824 240873 239258 237307 234973
56529 234973 232485 229851 227245 225215 224076 223712 224186 225724 227845 229366 229711 229504 229563 230043 230764 231554
56513 231554 231945 231436 230392 229831 230006 230037 229280 228136 227111 226005 224587 223247 222413 221948 221595 221342 220991
56496 220991 220012 218224 216048 213861 211773 210204 209779 210290 210589 209973 209040 208765 209401 210549 211669 212268
56480 212268 212192 211964 212230 212813 213019 212848 213046 213955 215192 216476 217772 218666 218727 218509 218976 219880 220062 219477
56462 219477 219397 220327 221309 221740 222254 223099 223269 222242 221170 221232 221975 222383 222562 223211 224239 224965 225138 224947
56444 224947 224587 224398 224780 225477 225731 225473 225427 225704 225520 224802 224755 226131 228167 230029 231977 234232 235964
56427 235964 236531 236655 237252 238094 238667 239377 240740 242219 242980 243078 242882 242121 240464 238372 236470 234714 232955
56410 232955 231570 230775 230099 229266 228694 228492 228011 227061 226418 226281 225575 223836 222500 223042 224961 226928 228813
56393 228813 231191 233787 235914 237642 239167 239768 238805 237065 235792 235034 234202 233625 234198 236104 239111 243500
56377 243500 249412 255881 261791 267201 272513 276992 279410 279708 278784 277137 274906 272660 270955 269561 268206
56362 268206 267484 267972 269074 269883 270488 271363 272229 272779 273711 275722 278150 279931 281214 282746 284398 285666
56346 285666 286863 288380 289450 289193 288263 287982 288457 289036 289945 291858 294345 296424 298215 300540 303248 305470
56330 305470 307050 308292 308812 308215 307435 307780 309110 310488 312101 314755 317918 320145 321206 322065 323020 323643
56314 323643 324389 326288 328978 330799 331150 331226 332196 333942 335786 337299 338299 339054 340343 342463 344640 346451
56298 346451 349000 353324 358436 362629 366055 370179 375235 380189 384811 389735 394644 398499 401581 405369
56284 405369 410298 415476 420696 426831 434028 441304 448258 455597 463672 471961 480315 489305 499163 509629
56270 509629 520853 533179 546205 559354 573154 588562 605383 622884 641523 662407 685445
56259 685445 709857 736151 765693 798696 834708 874769 920912 973700 1032484 1098020 1172409
56248 1172409 1256294 1348413 1448204 1556494 1673254 1796928 1926391 2061195 2199182 2336029
56238 2336029 2467965 2593031 2708922 2811574 2896757 2961496 3003455 3020870 3013921 2984628 2934838
56227 2934838 2865864 2780378 2682639 2576187 2462919 2344882 2225044 2105730 1988086 1873702
56217 1873702 1764862 1662543 1565989 1474978 1390743 1313969 1243656 1178784 1119507 1065959 1017388
56206 1017388 973138 933037 896399 862243 830827 803295 779426 757492 736679 717778 701137
56195 701137 685913 671899 660081 650745 642812 635577 629276 623551 617396 611147 606375 603254 600142
56182 600142 596410 593503 592383 591994 591167 590095 589158 588183 587549 588139 589571 590423 590703 592023 594940 598383
56166 598383 602134 607346 613919 619967 624760 629677 635473 641188 646725 653708 662646 671889 680703 690761
56152 690761 703242 717050 731326 747282 766042 787120 810534 837993 870514 907272 948362
56141 948362 996255 1052925 1117850 1190259 1270575 1357580 1446437 1531536 1609378 1677432 1733130
56130 1733130 1776515 1811873 1844399 1876468 1908093 1938399 1964743 1982807 1990072 1987896 1978961 1964798
56118 1964798 1947074 1928330 1908898 1884814 1850791 1803944 1743895 1672009 1592321 1510803 1431671
56107 1431671 1356218 1286135 1224969 1174609 1133255 1098769 1071199 1050170 1032959 1017590 1005072
56096 1005072 996344 989778 983978 980038 978629 977829 976488 976747 980446 985941 991330 997862 1006992 1016805
56082 1016805 1024723 1031414 1038917 1047214 1055663 1065370 1077060 1088841 1099026 1108976 1120503 1133010 1145808
56069 1145808 1160292 1176795 1192345 1204909 1216938 1231335 1246809 1260836 1274310 1289399 1305474
56058 1305474 1321022 1337147 1355356 1374362 1392648 1411600 1432413 1452764 1470457 1487501 1506571
56047 1506571 1526387 1544797 1563449 1584794 1607255 1628131 1648737 1671957 1697097 1721865 1747068
56036 1747068 1774639 1803453 1831801 1861689 1895973 1933585 1972152 2012689 2056903 2102574 2146663
56025 2146663 2190433 2236534 2283724 2329584 2375668 2424662 2475291 2525410 2577255 2634095 2694548
56014 2694548 2755774 2819199 2887366 2958365 3029416 3102784 3182045 3265870 3351700 3441840 3539234
56003 3539234 3641085 3743821 3850617 3966550 4090094 4217196 4349893 4492657 4643904
55994 4643904 4799663 4962117 5135998 5320299 5512274 5715710 5936136 6171982 6419882
55985 6419882 6684158 6971182 7279288 7604974 7954023 8335055 8747356 9187356 9661965
55976 9661965 10182536 10751051 11366122 12037286 12778872 13595573 14489907 15478500 16585044
55967 16585044 17823875 19208603 20770950 22553564 24593697 26936722 29659254 32858167
55959 32858167 36628664 41081886 46378056 52719816 60331857 69483852 80518118 93813403
55951 93813403 109738864 128692693 151164623 177692414 208735145 244497921 284467079
55944 284467079 326473655 365900783 396258650 411518573 408833247 389624769 358408476
55937 358408476 320581974 280771714 242253023 207009893 175980442 149365037 126940313
55930 126940313 108271905 92819634 80025589 69400600 60547854 53131981 46867849
55923 46867849 41537733 36982788 33068724 29677455 26724611 24154806 21914586 19947755
55915 19947755 18213840 16688355 15343253 14145236 13072907 12117498 11265773 10498029
55907 10498029 9802723 9177186 8613167 8096048 7618695 7182384 6783632 6413139 6067922
55898 6067922 5751649 5462289 5191433 4936495 4701958 4487698 4287162 4098026 3924120
55889 3924120 3765803 3618441 3481178 3357086 3243385 3131142 3016265 2902207 2790868
55880 2790868 2679699 2569153 2464273 2367066 2274985 2188257 2110886 2042865 1978837 1916026 1856514
55869 1856514 1800443 1744222 1687166 1633112 1583655 1536087 1489539 1446889 1408912 1372456 1336036
55858 1336036 1301674 1269873 1238355 1207061 1178906 1154220 1129835 1104932 1082386 1062932 1043297
55847 1043297 1021534 999178 976788 952495 926499 902064 880425 859290 837743 817906 800281
55836 800281 782195 762625 744193 728600 714154 699435 685435 672534 659228 645365 632948
55825 632948 622454 611972 601068 591699 584177 576059 566157 555876 545545 533474 519902 507889
55813 507889 498805 490701 482440 475589 470736 465876 460110 455278 452285 449454 446211 444744 446162 448563
55799 448563 450785 454589 461033 468020 473627 478747 484299 488791 490944 491970 492975 492613 489532 484932
55785 484932 480735 477237 474057 470964 466199 456599 441376 423626 406552 390596 375802 364098 356895
55772 356895 352746 349830 348912 351625 357287 363251 367048 366789 361312 351683 341083 331781 323534 315792
55758 315792 309335 304471 299878 294853 290708 288248 285777 281383 275387 268811 261218 252018 242386 233967
55744 233967 226893 220688 215773 212428 209593 206374 203654 202609 202673 202419 201463 200201 198623 196717 195160
55729 195160 194497 194386 194383 194433 193955 191876 188340 184898 182143 178810 174197 169732 166913 165351 164222 164086
55713 164086 165676 168227 170635 173180 176638 180609 184106 186896 189093 190353 190623 190764 191293 191321 189697
55698 189697 186335 181713 176156 170427 165715 162101 158256 153619 149560 147296 146012 144316 142404 141421
55684 141421 141606 142346 143344 144657 146230 148235 151137 154812 158464 161868 165497 168927 170626 170116 168850
55669 168850 168044 167062 164981 162242 159636 157041 154394 152578 152119 152260 152470 153565 156075 158914 161032
55654 161032 163098 166080 169359 171821 173769 176201 179083 181747 184139 186281 187357 186712 185019 183197
55640 183197 180995 177814 174009 170128 165752 160359 154489 148838 143096 136939 131180 126659 122948 119445
55626 119445 116722 115367 114496 112945 111017 109567 108308 106649 105271 105030 105070 103898 101747 100049 99004
55611 99004 97611 95791 94584 94205 93608 92119 90148 88181 86265 84535 83106 81531 79398 77277 76017
55596 76017 75391 74531 73412 72725 72560 72428 72388 72925 73842 74431 74628 74904 75143 74730 73682 72670 72029 71664
55578 71664 71711 72288 72827 72749 72672 73809 76213 78687 80417 81774 83485 85910 89042 92372 94801 95511 94848
55561 94848 93602 91697 88505 84256 80110 76861 74468 72798 71892 71463 70980 70385 70084 70181 70289 70056 69387
55544 69387 68327 67265 66975 67812 69124 70061 70694 71640 72938 74023 74626 74961 75174 75196 75015 74653 74091 73623
55526 73623 73829 74737 75469 75219 74092 72615 71050 69703 69018 68704 67649 65502 63480 62749 62984 63643 65640
55509 65640 70193 76550 82368 86058 87573 87330 85830 84150 83360 83268 82743 81300 79502 77984 76966 76544
55493 76544 76598 76605 76379 76643 77995 79780 80937 81451 81881 82014 81285 80111 79446 79207 78462 76967 75222 73214
55475 73214 70548 67767 66059 65503 64883 63465 61745 60249 58723 56814 54600 52226 49907 48367 48309
55460 48309 49384 50561 51431 52235 52852 52966 53121 54234 55994 57053 57008 56893 57407 58001 58147 58279 58834 59419
55442 59419 59567 59415 59095 58289 57030 56216 56673 58187 59876 61051 61385 60850 59878 59139 58843 58624 58262 58069
55424 58069 58419 59323 60611 62129 63684 65074 66166 66740 66615 66271 66800 68593 70524 71164 70347 68792
55408 68792 66831 64565 62753 62203 62437 62211 61223 60183 59334 58226 56904 56026 55683 55305 54839 54831 55264 55568
55390 55568 55827 56678 57814 58060 57261 56712 57189 57821 57590 56798 56404 56816 57960 59638 61261 62065 62087 62128
55372 62128 62383 62006 60459 58415 56876 56247 56620 58063 60170 62208 64087 66319 68702 70108 70034 69306
55356 69306 68765 68322 67879 67994 68811 69288 68405 66481 64589 63395 63135 63819 64717 64457 62517 60028 58447
55339 58447 58076 58433 59179 59945 60122 59784 60051 61520 62960 62641 60566 58374 57369 57542 58262 58969 59256
55322 59256 59098 59052 59691 60926 62306 63679 64983 65627 64836 62697 60352 59025 59069 59908 60705 61101 61330
55305 61330 61588 61567 61044 60621 61115 62239 62790 62396 62074 62649 63519 63601 62784 61714 60705 59656 58680 58116
55287 58116 58125 58636 59499 60365 60755 60543 60014 59287 58212 57017 56348 56302 56112 55269 54348 54224 55045 56489 58412
55268 58412 60654 62706 64174 65155 65720 65559 64675 63829 63687 63940 63896 63457 62977 62560 62177 62094 62548 63271 63885
55249 63885 64499 65385 66396 67174 67676 68025 68135 67906 67497 67031 66365 65527 64931 64726 64358 63240 61548 59968
55231 59968 59011 58934 59812 61238 62407 62959 63361 64057 64796 65224 65528 65886 65878 65132 64117 63553 63409 63218 63052
55212 63052 63344 63885 63755 62413 60387 58810 58557 59725 61695 63660 65133 65877 65577 64193 62593 62064
55196 62064 62947 64326 65323 65977 66598 67080 67263 67279 67087 66409 65501 65159 65488 65531 64739 63872 63788 64186 64419 64645
55176 64645 65223 65728 65635 65430 65944 67123 68377 69649 71127 72422 73079 73515 74403 75452 75793 75305 74647
55159 74647 74268 74255 74682 75154 74546 72379 70086 69633 71102 72833 73745 74178 74525 74473 73833 72960 72022 70874
55141 70874 69881 69853 70828 71801 71976 71547 71032 70629 70448 70647 71110 71656 72552 74024 75255 74898 72861 70620
55123 70620 69416 69035 68756 68609 69007 69841 70655 71381 72314 73583 74985 76173 76804 76750 76269 75719 75098 74241
55105 74241 73395 73094 73378 73697 73684 73535 73498 73505 73532 73804 74384 74939 75146 75118 75247 75869 77061 78519 79653 80175
55085 80175 80517 81283 82393 83231 83591 83900 84418 84761 84432 83493 82491 81952 82007 82349 82571 82625 82783 83077 83136
55066 83136 82849 82699 83013 83315 82954 81942 80598 78892 76871 75322 75053 75726 76305 76482 76748 77212 77384
55049 77384 77163 77056 77255 77377 77300 77401 77751 77825 77321 76583 76037 75786 75883 76386 77089 77846 79095 81225 83444
55030 83444 84285 83436 82175 81646 81637 81382 80712 79914 79240 78985 79335 79731 79116 77350 75689 75382 76316 77542
55012 77542 78469 79023 79194 79079 78971 78975 78900 78882 79544 81034 82448 82839 82448 82332 83013 84059 84827 85128 85139 85001
54992 85001 84607 83790 82831 82602 83778 85918 87786 88601 88524 87987 87267 86780 86981 87658 87987 87653 87336 87748
54974 87748 88795 89992 91034 91609 91362 90520 89881 89674 89118 87674 86046 85171 84821 84115 83000 82278 82389
54957 82389 83027 83944 85300 87102 88925 90424 91731 93133 94595 95715 96011 95282 93851 92410 91497 91126
54941 91126 90845 90054 88413 86362 85113 85604 87343 88861 89417 89611 90175 90947 91475 91915 92635 93541 94481
54924 94481 95909 98352 101497 104545 107282 110147 113390 116923 121003 126260 132760 139487 145080 148881
54910 148881 151065 151896 151118 148250 143511 138193 133682 130142 126594 122335 117718 113370 109381 105761 103053
54895 103053 101769 101528 101417 101016 100469 99844 99094 98585 98868 99831 100691 101011 101233 101976 103238 104596 105881
54878 105881 107343 109268 111743 114800 118574 123157 128272 133296 137734 141633 145277 148488 150549 150900
54864 150900 149647 147211 143745 139205 133843 128348 123431 119323 115651 111888 108016 104676 102451 101120
54850 101120 99928 98466 96848 95099 92976 90561 88496 87274 86667 86144 85556 85171 85266 85839 86494 86532 85529
54833 85529 83998 83111 83583 85061 86602 87383 87044 85936 85118 85472 86657 87558 87796 87994 88368 88180 87155
54816 87155 86425 87139 88773 89808 89626 88848 88118 87544 87189 87301 87950 89029 90534 92323 93737 94074 93412
54799 93412 92550 92159 92345 92823 93111 92771 91878 91070 90753 90604 90280 90157 90778 91955 93123 94256 95643 97031
54781 97031 97854 98214 98804 99935 101319 102748 104208 105380 105921 106313 107541 109743 112006 113785 115684 118447
54765 118447 121969 125838 130233 135558 141538 147352 152508 157072 161065 164022 165262 164391 161495 156992
54751 156992 151395 145244 139187 133874 129529 125829 122473 119691 117826 116544 114932 112500 109704 107349
54737 107349 105717 104398 102780 100685 98659 97562 97655 98266 98665 99079 100366 102762 105471 107657 109368
54722 109368 111302 114027 117634 121863 126258 130400 134192 137861 141554 145005 147570 148534 147494 144720
54708 144720 141097 137471 133972 130194 125968 121718 118056 115315 113528 112548 112053 111619 110955 110043 109010
54693 109010 107948 106856 105685 104462 103381 102640 102115 101332 99930 98006 96006 94470 93975 94903 96935
54678 96935 98991 99990 99630 98308 96609 95039 93909 93073 92114 91122 90908 91993 93766 95178 95882 96110
54662 96110 95810 94800 93579 93033 93267 93550 93583 93972 95126 96472 97202 97233 96963 96590 96132 95683 95175 94219
54644 94219 92687 91187 90468 90532 90862 91395 92605 94504 96101 96349 95415 94561 94695 95377 95455 94412 92768
54627 92768 91329 90516 90482 91280 92611 93769 94259 94312 94527 95195 96184 97162 97670 97288 96188 95236 95105 95507
54609 95507 95732 95657 95654 95705 95349 94479 93566 93044 92966 93327 94146 95164 95961 96475 96941 97262 97020 96242 95573 95425
54589 95425 95447 95127 94508 93972 93641 93381 93183 93158 93233 93140 92800 92626 93250 94761 96297 96791 96277 95986 96832 98262
54569 98262 99133 99251 99267 99422 99360 99118 99283 99925 100262 99720 98627 97537 96565 95804 95727 96612 98005 99236 100150
54550 100150 100942 101684 102408 103329 104545 105767 106710 107454 108171 108772 109154 109466 109811 109977 109770 109321 108738 107818
54532 107818 106507 105355 104989 105297 105580 105464 105280 105542 106301 107022 106947 105766 104139 103349 104065 105526 106214
54515 106214 105319 103322 101293 99874 99004 98345 97848 97848 98590 99706 100430 100450 100281 100548 101069 101047 100153 99052
54497 99052 98657 99073 99589 99668 99571 99818 100349 100665 100712 101067 102007 102945 103172 102838 102694 103079 103727 104444 105340 106369
54477 106369 107198 107752 108473 109747 111303 112364 112318 111237 109865 109090 109265 110108 111313 112926 114905 116728
54461 116728 117909 118656 119441 120146 120267 119811 119316 119040 118755 118399 118194 118063 117546 116495 115335 114465 113907 113617
54443 113617 113574 113509 113157 112839 113150 113901 114113 113302 112153 111617 111884 112512 112954 112751 111777 110618 110142 110470 110908
54424 110908 111048 111248 111813 112527 113353 114751 116731 118296 118510 117642 116763 116690 117687 119532 121344 121975 121217
54407 121217 120092 119481 119141 118656 118573 119658 121567 123197 123985 124072 123580 122682 122115 122623 123951 125180 125968
54390 125968 126689 127423 127641 126997 125758 124357 123115 122472 122849 124080 125393 126111 126088 125572 125008 124916 125522 126492
54372 126492 127340 128030 128813 129710 130615 131758 133445 135383 136817 137468 137913 138897 140607 142716 144876 147049
54356 147049 149470 152288 155143 157247 158004 157429 155852 153572 150950 148439 146183 143901 141463 139194 137299
54341 137299 135422 133261 131201 129747 128653 127190 125131 122945 121193 120213 120129 120645 121017 120743 120139 119821
54325 119821 119908 120164 120556 121099 121457 121381 121275 121659 122300 122563 122443 122492 122832 123029 122903 122764 122795 122872 122984 123210
54305 123210 123307 122964 122482 122526 123173 123793 123933 123692 123200 122436 121696 121577 122226 123088 123567 123543 123216 122900 123015 123740
54285 123740 124648 125152 125328 125794 126811 128020 128997 129471 129072 127633 125775 124475 123942 123553 123005 122745 123102
54268 123102 123727 124229 124728 125463 126345 127189 127885 128191 127916 127455 127539 128253 128975 129531 130662 132862 135363 136831
54250 136831 136738 135674 134640 134319 134694 135043 134604 133424 132203 131248 130157 128758 127668 127496 127997 128522 128901
54233 128901 129369 129946 130372 130497 130368 130085 129768 129552 129442 129344 129301 129443 129704 129946 130349 131169 132070 132268 131514
54214 131514 130408 129546 128923 128395 128107 128104 128039 127656 127118 126559 125776 124783 124156 124398 125252 125998 126107 125378 123932
54195 123932 122424 121825 122585 124236 125962 127115 127159 125878 123988 122776 122663 122830 122715 123001 124341 125970
54179 125970 126672 126582 126841 127673 128021 127140 125574 124328 123829 123931 124291 124500 124327 124040 124081 124370 124306 123537 122326
54160 122326 121132 120248 119829 119831 119894 119696 119541 120121 121607 123325 124515 125098 125541 126195 126904 127143 126518 125257
54142 125257 124103 123583 123496 123372 123203 123383 124034 124894 125841 127104 128848 130874 132792 134209 134764 134325 133244
54125 133244 132129 131302 130698 130262 130079 130093 130102 130154 130649 131835 133442 134917 135831 135990 135501 134949 135174 136540
54107 136540 138551 140396 141798 143062 144443 145845 147174 148575 150112 151438 152108 152140 152036 152277 153129 154882
54091 154882 157872 162045 166793 171564 176381 181418 186305 190246 192726 193610 192703 189774 185153 179769 174400
54076 174400 169322 164812 161413 159271 157677 155835 153888 152686 152636 153219 153674 153779 153824 154035 154226 153987 153221
54059 153221 152484 152717 154559 157830 161677 165228 168261 171269 174783 178630 182214 185587 189622 194697 199767
54044 199767 203514 206011 208284 210492 211812 212243 213253 215983 219800 223418 226613 230016 233844 237770
54030 237770 241619 245324 248457 250600 252027 253329 254556 255333 255669 255952 256294 256503 256553 256470 255868 254280 251924
54013 251924 249485 247079 244035 239783 234498 228774 223092 217679 212512 207377 202235 197467 193482 190218
53999 190218 187381 185013 183403 182556 182177 181992 181663 180646 178786 176822 175607 174919 173840 172272 171206
53984 171206 171242 171670 171470 170580 169694 169219 168955 168568 167958 167267 166756 166574 166546 166361 166019 165862 166092 166506 166846
53965 166846 167169 167765 168923 170840 173495 176517 179377 181853 184239 187121 191057 196348 202851 210125 218041
53950 218041 227160 238179 250917 264016 275482 283343 286218 283983 277989 270181 261905 253789 246541
53937 246541 241171 238267 237520 238172 239638 241637 244116 247150 250660 254266 257682 261111 264852 268713 272344
53922 272344 275941 279900 283899 287250 290254 294178 299527 305254 310303 315088 320687 327162 333597 339385
53908 339385 344542 348856 351572 352121 350623 347568 343490 339109 335321 332703 331089 329731 327772 324617
53894 324617 320161 314771 308956 302935 296531 289551 282227 275236 269182 264010 259066 253812 248376 243231
53880 243231 238589 234437 230995 228585 226950 225212 222723 219613 216273 212705 208704 204416 200314 196709
53866 196709 193561 190701 188055 185704 183882 182795 182362 182200 181929 181362 180431 179129 177555 175809 173831
53851 173831 171641 169695 168581 168258 168106 167889 168136 169237 170668 171651 172188 172848 173743 174423 174752 175211 176073
53834 176073 176840 176846 176187 175606 175528 175484 174651 172853 170927 170080 170885 172871 174987 176394 176907 176872 176770 176855 177105
53815 177105 177426 177877 178690 180111 182263 185042 188132 191217 194286 197571 201134 204748 208318 212138 216427
53800 216427 220853 224831 228149 230958 233367 235551 238042 241404 245542 249806 253716 257128 259812 261528
53786 261528 262566 263473 264077 263465 261275 258363 255738 253347 250425 246630 242265 237634 232731 227498 222073
53771 222073 216794 212141 208484 205736 203468 201423 199592 197788 195691 193519 191988 191221 190292 188405 186027
53756 186027 184187 183039 181856 180197 178332 176642 175290 174535 174681 175548 176458 176875 176755 176260 175553 174903
53740 174903 174582 174527 174391 173992 173482 173152 173322 174277 175909 177515 178452 178976 179970 181804 183928 185664 186875
53723 186875 187665 187957 187765 187547 187916 189109 190973 193230 195499 197325 198543 199580 201051 203042 205005
53708 205005 206387 207160 207690 208307 209241 210821 213367 216679 219874 222082 223399 224944 227796 231957 236438
53693 236438 240256 243196 245705 248168 250380 251757 252036 251625 251133 250769 250427 250195 250266 250396 250014 249090 248315
53676 248315 248082 247795 246729 245207 244340 244695 245774 246722 247084 246857 246225 245366 244310 243033 241868 241501 242154
53659 242154 243016 243028 242155 241314 241126 241363 241682 242136 242647 242677 241975 241238 241455 242765 244388 245562 246175 246527
53641 246527 246938 247624 248693 250099 251691 253353 255009 256576 258032 259537 261321 263384 265433 267243 269092
53626 269092 271667 275403 279954 284542 288904 293630 299343 305707 311569 316048 319163 321443 323293 324896
53612 324896 326343 327590 328482 329082 329837 331197 333171 335521 338208 341369 344856 348147 350830 352942 354749
53597 354749 356372 357780 358936 359768 360134 360046 359911 360262 361198 362249 362856 362845 362385 361676 360837 359950 359027 357976
53579 357976 356715 355303 353835 352286 350573 348727 346849 344988 343175 341553 340299 339409 338628 337591 336066
53564 336066 334194 332577 331916 332390 333535 334837 336198 337629 338855 339643 340286 341239 342359 342984 342762 341955
53548 341955 340960 339993 339285 339097 339468 340319 341819 344161 346979 349550 351727 354135 357292 361021 364882 368659
53532 368659 372241 375592 379108 383514 389198 396090 404265 413953 424753 435626 446106 456784 468151
53519 468151 479790 491237 502879 515216 527979 540858 554496 569789 586661 604483 623335
53508 623335 643786 665646 687941 710068 732065 753817 774883 795165 814966 834389 853416
53497 853416 872503 892155 911865 930333 946975 962498 977845 993295 1008766 1024288 1039853
53486 1039853 1055329 1070714 1086095 1101423 1116787 1132766 1149809 1167415 1184680 1201484 1218173
53475 1218173 1234174 1248106 1259432 1268902 1277021 1283172 1286732 1287984 1287295 1284384 1279114 1272169 1264143
53462 1264143 1254663 1243272 1230640 1218066 1206148 1194637 1183163 1171419 1158953 1145433 1130922
53451 1130922 1115433 1098644 1080552 1062037 1044112 1026944 1010100 993416 977078 961278 946374
53440 946374 933036 921694 912147 904220 898235 894165 890894 887231 883346 880285 878349 876960 876060 876559
53426 876559 879139 883404 888481 893850 899459 905587 912841 921797 932492 944593 958056 973096 989535
53413 989535 1006788 1024616 1043386 1063440 1084651 1106725 1129563 1153277 1178262 1205234 1234688
53402 1234688 1266278 1299259 1333546 1369696 1407783 1447096 1487286 1529053 1573112 1619023 1665670
53391 1665670 1712620 1760375 1809441 1859611 1910102 1959972 2008397 2054943 2099692 2142959 2184843
53380 2184843 2225142 2263577 2299926 2333961 2365340 2393526 2417852 2437905 2453994 2466959 2477254
53369 2477254 2484254 2486638 2483272 2473492 2456861 2433298 2403569 2369183 2331449 2290887 2247893 2203627
53357 2203627 2159633 2116516 2073621 2030279 1986905 1944540 1903861 1865218 1829173 1795999 1764646
53346 1764646 1733160 1700440 1666875 1632943 1598160 1562126 1525931 1491501 1459809 1430517 1403165
53335 1403165 1377815 1354541 1333144 1313642 1296456 1281928 1270003 1260348 1252160 1243899 1233971 1221966
53323 1221966 1208658 1194708 1180062 1164854 1149987 1136234 1123353 1110755 1098495 1086983 1076177
53312 1076177 1065900 1056653 1049259 1043724 1039211 1035210 1032011 1029898 1028650 1028203 1029262 1032731 1038800 1046955
53298 1046955 1056626 1067522 1079515 1092626 1107088 1123180 1141018 1160601 1181879 1204557 1227953
53287 1227953 1251329 1274275 1296542 1317671 1337216 1355269 1372346 1388600 1403531 1416597 1427707
53276 1427707 1436772 1443091 1445647 1444024 1438789 1431074 1421963 1412076 1401285 1388798 1373863 1356452 1337119
53263 1337119 1316349 1294437 1271896 1249388 1227046 1204323 1180790 1156765 1132901 1109453 1086254
53252 1086254 1063228 1040563 1018542 997416 977313 958062 939172 920132 900620 880398 859372
53241 859372 837923 816871 796825 777806 759674 742533 726444 711132 696442 682727 670383
53230 670383 659279 649181 640340 633034 626713 620333 613414 606107 598335 589656 580013 569774 558830
53217 558830 546419 532210 516940 501651 486880 472908 460146 448750 438349 428664 419977 412511
53205 412511 405729 398801 391465 383947 376356 368705 361209 353962 346518 338472 330274 322831 316305 309986
53191 309986 303406 296938 291128 286017 281416 277298 273541 269638 265228 260759 257275 255418 254736 253964 252034
53176 252034 248945 245701 243270 241668 240270 238830 237726 237127 236473 235102 233028 230735 228486 226283 224270
53161 224270 222736 221745 221181 221086 221506 222011 221893 221014 220035 219549 219403 219173 218910 218917 219033 218711 217815 216819 216128
53142 216128 215622 215072 214560 214244 214021 213804 213898 214665 215905 216934 217326 217283 217213 217230 217202 217100 217163 217725 218889 220295
53122 220295 221334 221777 222096 222886 224042 224954 225545 226586 228629 231075 232767 233252 232888 231922 230237 228159
53106 228159 226679 226342 226366 225523 223674 221767 220444 219356 218048 216797 216077 215654 214831 213428 211929 210718
53090 210718 209688 208712 207975 207611 207362 206936 206465 206275 206339 206235 205644 204736 204044 204084 204954 206217 207284 207955
53072 207955 208428 208792 208819 208418 207885 207369 206464 204856 203144 202369 202743 203469 203888 204153 204542 204772 204509 204110
53054 204110 204226 204923 205734 206439 207168 207749 207616 206619 205448 204941 205222 205788 206158 206148 205725 204958 204045 203119 202131
53035 202131 201098 200348 200186 200434 200700 201001 201671 202562 202962 202549 201945 201877 202194 202309 202294 202837 204111 205440
53017 205440 206246 206813 207762 209228 210878 212425 213786 214943 215943 216840 217432 217290 216346 215196 214472 214119
53001 214119 213701 213272 213418 214373 215469 215705 214727 213165 212055 211909 212281 212309 211729 211160 211289 212039 212785 213175
52983 213175 213392 213765 214448 215398 216364 217027 217410 217966 218893 219613 219525 219110 219556 221208 223096 224272 224931 225758
52965 225758 226767 227441 227739 228239 229292 230485 231066 230571 229061 227023 225142 223907 223240 222601 221505 219968
52949 219968 218471 217547 217344 217501 217480 217005 216163 215119 213945 212752 211803 211282 211086 210996 210977 211087 211154 210724 209453
52930 209453 207548 205789 205067 205716 207218 208597 209172 208921 208154 207078 205792 204599 204024 204402 205496 206643
52914 206643 207315 207537 207710 208038 208227 207789 206574 204947 203556 202994 203455 204485 205172 204893 203916 203104 203054 203677
52896 203677 204535 205262 205620 205433 204676 203601 202712 202672 204000 206581 209514 211744 212945 213570 214094 214542 214781
52879 214781 214865 214932 215072 215440 216204 217156 217638 217144 215915 214803 214662 215863 218134 220661 222601 223650 224052
52862 224052 224061 223679 222964 222178 221406 220378 218951 217448 216188 214952 213254 210972 208402 205876 203668 202017
52846 202017 200801 199355 197131 194537 192666 192111 192384 192575 192219 191386 190334 189384 188912 189130 189853 190646 191263
52829 191263 191858 192766 194087 195544 196747 197534 197901 197663 196445 194213 191642 189709 188944 189219 190147 191434
52813 191434 192879 194283 195521 196643 197876 199555 201945 204888 207585 208905 208181 205792 202968 200907
52799 200907 199916 199350 198398 196963 195727 195359 195769 196206 196005 195160 194215 193659 193440 193107 192434 191784 191677 192088
52781 192088 192444 192363 192140 192361 193184 194216 195016 195538 196057 196733 197308 197335 196700 195744 194776 193691 192276 190648
52763 190648 189050 187404 185527 183759 182837 183126 184363 186154 188180 189839 190349 189575 188342 187629 187820 188877
52747 188877 190689 192840 194604 195714 196835 198747 201298 203637 205249 206360 207520 209175 211455 213969
52733 213969 216027 217412 218721 220551 222664 224377 225500 226351 227060 227448 227527 227560 227581 227224 226029 223718 220392
52716 220392 216778 213916 212162 210830 209283 207936 207485 207589 207283 206525 206280 206940 207644 207485 206614 205753 205262
52699 205262 205120 205331 205936 206904 208214 209696 210769 210854 210188 209677 209778 210101 210264 210492 211009 211505 211677 211799
52681 211799 212191 212506 212078 210777 209099 207593 206508 205806 205200 204407 203569 203199 203548 204332 205248 206271 207126
52664 207126 207041 205647 203842 203196 204480 207125 209949 212110 213563 215005 217285 220552 223986 226598 228088
52649 228088 228757 228920 228768 228523 228267 227737 226697 225358 224102 222960 221769 220675 219975 219537 218925 218143 217758
52632 217758 218125 218893 219531 220072 221111 223176 226242 229713 232745 234646 235156 234461 233014 231345 229864 228679
52616 228679 227553 226104 224097 221632 219201 217495 216876 217002 217189 217228 217528 218356 219346 220084 220821 222104 223837
52599 223837 225178 225446 224818 224044 223708 223856 224176 224444 224741 225213 225700 225852 225671 225652 226134 226810 227147 227097 227016
52580 227016 227082 227219 227551 228453 229962 231436 232041 231531 230456 229669 229612 229991 230107 229477 228120 226330 224433
52563 224433 222811 221846 221621 221810 222039 222234 222499 222871 223319 223763 223928 223547 222929 222921 223856 224871 224813 223669 222530
52544 222530 222199 222488 222918 223514 224551 225922 227125 227753 227795 227605 227717 228482 229700 230680 230841 230233 229474 229215
52526 229215 229664 230477 231089 231185 230880 230434 229902 229138 228084 226958 226254 226528 227960 229952 231463 231988 232052 232550
52508 232550 233850 235784 238106 240488 242325 243168 243304 243346 243303 242682 241537 240661 240431 240077 238596 236022 233358
52491 233358 231476 230503 230085 229843 229544 229147 228757 228396 227859 226941 225781 224905 224916 226111 228200 230370 231828
52474 231828 232407 232529 232567 232502 232299 232292 232848 233764 234379 234345 234081 234374 235655 237701 239947 241966 243702 245332
52456 245332 246962 248404 249210 248950 247583 245539 243355 241200 238891 236372 233936 231912 230357 229237 228642
52441 228642 228574 228690 228568 228114 227494 226829 226249 226072 226513 227320 228026 228537 229032 229406 229289 228687 228170 228318 229265
52422 229265 230752 232206 232872 232519 232055 232812 235004 237533 239540 241461 244174 247818 252098 257148 263342
52407 263342 270639 278909 288622 300254 312966 324526 332689 336207 334708 328559 319149 308585 298489
52394 298489 289318 281056 274116 269129 266128 264409 263119 261749 260225 258886 258267 258594 259441 260087 260260
52379 260260 260320 260721 261505 262432 263419 264668 266441 268878 272061 276009 280454 284778 288431 291459 294409 297673
52363 297673 301119 304383 307256 309555 310917 311177 310902 311147 312469 314395 315994 316849 317340 318106 319405 321040
52347 321040 322795 324841 327578 331081 334918 338639 342303 346264 350569 355007 359796 365769 373554 382854
52333 382854 392862 403188 414008 425447 437353 449839 463584 479240 496708 515343 534804
52322 534804 555385 577447 600758 624544 648091 671159 693886 716371 738425 759712 780091
52311 780091 799687 818588 836627 853625 869714 885112 899594 912553 923743 933619 942726 951000
52299 951000 957964 963376 967354 970004 971355 971542 970663 968488 964611 958881 951386 942145 931346 919822
52285 919822 908702 898447 888822 880022 873169 869293 868327 869613 872921 878381 885794 894699 904895 916274
52271 916274 928371 940767 953790 968012 983105 998046 1012522 1027210 1042347 1056980 1070254
52260 1070254 1082664 1095222 1107891 1119740 1130305 1139899 1148653 1156179 1162349 1167625 1172231 1175576 1176888
52247 1176888 1176012 1173213 1168507 1161659 1152664 1141858 1129594 1116109 1101717 1086921 1072279 1058187
52235 1058187 1044736 1031686 1018738 1005902 993525 981972 971495 962469 955375 950276 946604 943743
52223 943743 941639 940459 939983 939863 940367 942167 945303 948978 952638 956618 961307 966201 970494 974313 978671
52208 978671 984151 990245 996050 1001162 1005668 1009733 1013484 1017071 1020508 1023582 1026137 1028396 1030860 1033959
52194 1033959 1037843 1042357 1047085 1051537 1055486 1059076 1062485 1065481 1067460 1067957 1067137 1065639 1063810 1061045
52180 1061045 1056143 1048568 1039269 1029915 1021355 1013180 1004767 996331 988720 982605 978119 974952 972465 969980
52166 969980 967438 965606 965296 966468 968466 970877 973623 976285 978058 978679 978902 979676 981166 982920 984716
52151 984716 986748 988973 990735 991302 990741 990160 990918 993487 997043 1000258 1002475 1003990 1005344 1006704 1008091
52136 1008091 1009760 1012038 1014988 1018582 1023078 1028900 1036269 1045285 1056292 1069772 1085853 1104330 1125247
52123 1125247 1149013 1175695 1204535 1234503 1265076 1296166 1327497 1358500 1388734 1417950 1445644
52112 1445644 1470990 1493456 1513236 1530774 1546044 1558584 1568158 1575049 1579684 1582311 1583196 1582808 1581494
52099 1581494 1579020 1574751 1568378 1560301 1551223 1541547 1531209 1519834 1506864 1491760 1474427 1455517
52087 1455517 1436080 1416981 1398842 1382414 1368520 1357437 1348750 1342094 1337821 1336603 1338588 1343325
52075 1343325 1350407 1359784 1371368 1384701 1399206 1414654 1431264 1449365 1468886 1489081 1508883 1527682
52063 1527682 1545560 1562577 1578150 1591597 1603071 1613260 1622189 1629057 1633535 1636450 1638681 1639875
52051 1639875 1638834 1634842 1628000 1618480 1606144 1590868 1572728 1551837 1528463 1503361 1477596 1451897
52039 1451897 1426413 1401040 1375688 1350337 1325330 1301634 1280388 1262037 1246209 1232338 1219955
52028 1219955 1208308 1196403 1183785 1170898 1158312 1145916 1133260 1120396 1107908 1096202 1085150
52017 1085150 1074383 1063557 1052336 1040500 1028276 1016355 1005279 994723 983551 970787 956559
52006 956559 941942 927757 913739 899029 883246 866697 849722 832321 814511 796599 779004
51995 779004 762201 746954 734116 723831 715182 706897 698229 689009 679275 669204 659170 649451 639990
51982 639990 630643 621434 612217 602296 590851 577747 563648 549421 535735 523184 512418 503918
51970 503918 497695 493283 490103 488010 487523 489244 492908 497297 501328 504987 508898 513249 517548 521217
51956 521217 523938 525420 525298 523396 519871 515045 509331 503248 497262 491554 486161 481325 477578 475517
51942 475517 475666 478391 483657 490934 499567 509200 519759 531252 543792 557483 571879 585869 598616
51929 598616 610387 621882 632964 642863 651584 660145 668882 676068 678668 674281 662232 643420 619655
51916 619655 592945 565011 537396 511826 489835 471719 456415 442844 431118 422030 415743 411574
51904 411574 408902 407732 408279 410372 413437 416867 420325 423711 426741 428577 428205 425343 420708 415122 408636
51889 408636 400883 392053 383075 374946 368299 363507 360700 359604 359742 360932 363324 366935 371462 376682
51875 376682 382678 389459 396621 403617 410209 416401 421967 426281 428688 428954 427310 424135 419717 414352
51861 414352 408501 402622 396898 391371 386455 383018 381772 382771 385655 390065 395442 400642 404325 405889
51847 405889 405743 404594 402748 400176 396901 393080 388913 384659 380591 376753 372902 368884 365021 361914
51833 361914 359915 358869 358413 358408 359057 360619 362995 365592 367625 368576 368329 366987 364706 361769 358650 355852
51817 355852 353632 351892 350388 349083 348290 348330 349035 349845 350560 351741 353943 356651 358491 358626 357554 356356
51801 356356 355575 355100 354730 354368 353815 352863 351552 349992 347991 345255 341908 338459 335234 332287 329945 328832
51785 328832 329032 329648 329681 329157 328947 329571 330665 331646 332466 333492 334944 336728 338718 340987 343773 347297
51769 347297 351601 356499 361747 367331 373529 380590 388316 395960 402516 407170 409593 409826 407929 403795
51755 403795 397437 389432 380877 372771 365453 358682 352190 346076 340685 336204 332446 329118 326275 324378
51741 324378 323798 324403 325866 328267 332049 337293 343388 349641 355995 362755 369632 375404 378689 379049 377348
51726 377348 375172 373927 374270 375984 378102 379235 378249 375033 370567 366094 362303 359428 357716 357228 357274
51711 357274 356791 355500 354168 353480 353259 353194 353758 355791 359495 364370 369740 374645 377659 377838 375957 373995
51695 373995 373224 373439 374106 375346 377369 379663 381317 381745 380657 377846 373579 368821 364461 360444 356146
51680 356146 351465 347077 343716 341641 340824 341279 343080 346207 350310 354535 357805 359676 360932 363170 367676
51665 367676 374647 383192 391900 399554 405530 409515 410983 409414 405158 399629 394333 390070 387321 386814
51651 386814 389127 393994 400501 407632 414085 417998 417835 413615 406670 398201 388661 378427 368212 358609
51637 358609 349881 342431 336788 332865 329855 327228 325405 325093 326437 329116 332785 336990 341022 344291
51623 344291 346537 347418 346390 343432 339500 335698 332270 328866 325492 322622 320544 319159 318300 317684 316633
51608 316633 314424 311110 307631 305060 303971 304445 306258 308987 312302 316215 320899 326400 332859 340805
51594 340805 350648 361709 372162 380061 384257 384466 381049 374962 367556 360069 353370 348085 344612 342945
51580 342945 342879 344561 348508 354931 363402 373379 384738 397535 411461 425816 439945 453610 467061
51567 467061 480734 494511 507203 517189 523938 528768 534053 542001 554251 571969 595564 624278
51555 624278 656390 689776 722229 751643 776411 795657 808888 815626 815634 809223 796947 779131 756102
51542 756102 728747 698431 666426 633799 601748 571593 544268 520082 498964 480706 465010
51531 465010 451633 440529 431769 425425 421669 420607 421663 423431 424567 424543 423089 419457 413198 405457
51517 405457 398352 392829 387929 382396 376124 369718 363564 357914 353145 349237 345579 341909 338838 336826
51503 336826 335230 333096 330412 327759 325198 322510 320223 319333 320006 321373 322632 323594 324182 324327 324436 325094
51487 325094 326088 326596 326580 327023 328297 329203 328405 326164 323817 321932 319925 317358 314699 312579 310926 309208
51471 309208 307223 305228 303398 301461 299020 296093 293195 290798 288935 287467 286551 286501 287216 288069 288476 288384
51455 288384 288164 288247 288886 290013 291352 292918 295342 299366 304981 311491 318453 326235 335603 347088 360653
51440 360653 375307 388859 398784 403896 404921 403309 400128 396404 393673 393051 393865 393975 391603 386481
51426 386481 379445 371635 364236 358278 354130 351267 348773 346134 343508 341304 339545 337739 335507 333257
51412 333257 331898 331758 332121 332073 331478 330877 330736 331156 332035 333050 333702 333840 334057 335088 336886 338709 340084
51395 340084 341210 342376 343521 344590 345997 348479 352571 358243 364973 372223 380075 389342 400914 415201
51381 415201 432446 453221 478063 506784 538831 574478 614963 660917 710690 760410 805625
51370 805625 843138 871889 892484 905852 912215 911284 903102 888199 867009 839690 806756 769447
51358 769447 729187 686985 643674 600551 559495 522388 490351 463293 440132 419734 401782
51347 401782 386573 374065 363525 354208 345983 339073 333503 329063 325534 322678 320246 318279 317147
51334 317147 316959 317088 316620 315292 313709 312687 312589 313284 314492 316012 317674 319177 320140 320484 320693 321446 322829
51317 322829 324079 324234 322915 320457 317524 314849 313097 312560 312796 312727 311313 308243 304116 300039 297060
51302 297060 295794 296246 297701 298896 298785 297412 295842 294954 294507 293636 291982 289955 288155 287047 287033 288201
51286 288201 289963 291532 292902 294867 298005 302225 307388 313616 320583 327121 332080 335191 336771 337090
51272 337090 336530 335883 335842 336398 337189 338181 339529 341152 342990 345357 348324 351004 352249 351960 350962 349607
51256 349607 347356 343958 340168 336825 333828 330555 326906 323363 320232 317392 314778 312692 311510 311244
51242 311244 311487 311709 311597 311099 310245 309026 307563 306219 305291 304707 304281 304193 304789 305904 306857 307360 308027 309642
51224 309642 312118 314568 316301 317434 318513 319770 320834 321064 320214 318853 318020 318248 318966 319070 318136 316955
51208 316955 316772 318132 320472 322712 324124 324822 325606 327339 330236 333604 336341 337750 337839 336939 335363 333603
51192 333603 332492 332639 333714 334671 334836 334477 334201 334143 334039 333845 333877 334375 335255 336333 337561 338953 340366
51175 340366 341474 341990 341951 341684 341353 340619 339029 336783 334804 333930 334350 335961 338791 342690 346962 350875
51159 350875 354292 357269 359169 358914 356331 352637 349251 346439 343443 339682 335479 331632 328547 325926
51145 325926 323284 320734 318997 318518 318727 318558 317611 316413 315511 314793 313931 313088 312824 313473 314953 317018 319414
51128 319414 321822 323975 325981 328396 331813 336283 341055 344941 347138 347807 347838 348005 348488 349142 349969 351078
51112 351078 352323 353282 353701 353862 354377 355591 357251 358856 360290 361886 363775 365450 366227 366044 365495 365160
51096 365160 365155 365270 365234 364891 364475 364688 366076 368214 369980 370825 371291 372030 372801 372931 372411 371869 371610 371313 370789
51077 370789 370486 370980 372313 374094 376037 378096 380194 382104 383614 384778 385991 387924 391293 396528 403547
51062 403547 411868 421065 431321 443525 458575 476194 494360 510198 521832 529559 535370 541534
51050 541534 549599 560235 573203 587131 599798 609367 615519 619062 620328 618351 611919 601159 587731
51037 587731 573752 561007 550918 544261 540391 537166 532272 524724 515070 504489 494066 484618 476549
51024 476549 469706 463679 458387 454120 450993 448796 447570 448040 450984 456163 462160 467488 471816 476132
51010 476132 481790 489475 498945 509569 520955 533126 546264 560384 575118 589651 602899 614042
50998 614042 623023 630444 636848 642195 646191 648983 651221 653341 655046 655695 655150 654023 653174 653171 654304 656949
50982 656949 661790 669555 680420 693513 707140 719816 731276 742536 755100 770287 789104 812210
50970 812210 839738 871458 907416 948262 994646 1046477 1103084 1163941 1228890 1297618 1369313
50959 1369313 1442922 1517540 1592419 1666768 1739600 1809635 1875253 1934684 1986389 2029462 2063917
50948 2063917 2090700 2111106 2125842 2134777 2137897 2136431 2132674 2128630 2124973 2121059 2115488 2106789 2094299
50935 2094299 2078697 2061364 2043050 2023557 2002743 1981046 1958464 1933506 1903928 1868505 1827668
50924 1827668 1782491 1733566 1680913 1624512 1564733 1502486 1439160 1376296 1315228 1257013 1202511
50913 1202511 1152276 1106389 1064649 1026974 993355 963430 936397 911548 888734 868128 849640
50902 849640 832829 817426 803761 792407 783381 775832 768689 761555 754830 749028 744233 740297 737310
50889 737310 735632 735449 736460 737962 739261 740087 740769 741993 744370 748231 753664 760528 768416 776865 785747
50874 785747 795316 805852 817443 830121 843932 858734 874232 890437 907874 927096 948167 970882
50862 970882 995352 1022185 1052197 1086132 1124510 1167557 1215417 1268647 1328287 1395348 1470514
50851 1470514 1554617 1648866 1754035 1869611 1994420 2127988 2270626 2422103 2580886 2744953
50841 2744953 2912711 3082683 3252606 3419230 3578688 3726650 3858426 3969627 4057177 4119830
50831 4119830 4157937 4172919 4166891 4142562 4103355 4053468 3997566 3940164 3885272 3836406 3796508
50820 3796508 3767494 3749856 3742598 3743228 3747685 3750773 3747261 3732849 3704337 3659508 3597409 3518556
50808 3518556 3424264 3315583 3193213 3058497 2914161 2763950 2611759 2461125 2315091 2176156
50798 2176156 2046403 1927741 1821718 1728847 1648356 1578968 1519830 1470475 1430106 1397473 1371491
50787 1371491 1351500 1336759 1326144 1318658 1313835 1311201 1309535 1307255 1303519 1298553 1292836 1286358 1278860
50774 1278860 1270338 1260908 1250359 1238272 1224607 1209897 1194660 1178737 1161391 1142086 1121058 1099040
50762 1099040 1076549 1053751 1031113 1009800 991029 975139 961621 950002 940277 932544 926759 923080
50750 923080 921945 923483 927272 933073 941534 953650 969650 988865 1010716 1035512 1064247 1097878
50738 1097878 1136832 1181014 1230170 1284295 1343595 1408020 1477056 1550091 1626745 1706671 1789364
50727 1789364 1874419 1961550 2049891 2137615 2222937 2305271 2384664 2460078 2528931 2588412 2636438
50716 2636438 2671068 2689893 2690910 2673912 2640755 2594734 2540194 2482328 2426329 2376175 2334066
50705 2334066 2300742 2276002 2259116 2249293 2245970 2248516 2255580 2264748 2272720 2275710 2269969 2252435 2221273
50692 2221273 2176002 2117394 2047370 1968724 1884575 1797979 1711990 1629663 1553504 1484819 1423845
50681 1423845 1370521 1325017 1287678 1258761 1238324 1226119 1221583 1224043 1232991 1247979 1268325 1293140
50669 1293140 1321604 1352866 1385594 1417932 1448207 1475587 1499926 1521164 1539122 1553805 1565595
50658 1565595 1575114 1583047 1590120 1596908 1603453 1609222 1613649 1616723 1618914 1620718 1622626 1625528 1630717 1639186
50644 1639186 1651081 1666072 1684107 1705532 1730562 1758937 1790081 1823385 1858380 1894794 1932378
50633 1932378 1970507 2008190 2044840 2080958 2117602 2155312 2194035 2233852 2274352 2312301 2340449
50622 2340449 2350064 2335716 2298274 2244115 2181975 2119816 2063000 2014103 1974056 1943403 1922458
50611 1922458 1910579 1905968 1906551 1910879 1918038 1926895 1935642 1941997 1943800 1939502 1928189 1909054 1880966
50598 1880966 1842941 1795220 1739735 1679338 1616672 1553784 1492330 1433551 1377986 1325578 1276277
50587 1276277 1230355 1187938 1148475 1111078 1075434 1042195 1012276 985966 962845 942491 925000
50576 925000 910845 900356 893358 889124 886724 885626 886022 888401 892880 899267 907774 919075 933323
50563 933323 949497 966263 983293 1001269 1020801 1041973 1065010 1090640 1119394 1150842 1183859
50552 1183859 1217435 1250974 1284056 1316178 1346646 1374629 1399605 1421977 1443031 1463939 1484973
50541 1484973 1505979 1527491 1550990 1578065 1609596 1645730 1686305 1731161 1780294 1833793 1891583
50530 1891583 1953330 2018897 2088861 2164265 2245767 2333291 2426473 2524828 2627101 2730846 2833223
50519 2833223 2932164 3026375 3114348 3193871 3262563 3318373 3359423 3383865 3390393 3378736 3349352
50508 3349352 3302895 3240358 3163662 3075673 2979592 2878683 2776622 2677595 2585579 2503522 2433435
50497 2433435 2377115 2336384 2312458 2305269 2313614 2335938 2370743 2416174 2469248 2525612 2579940 2626422
50485 2626422 2659071 2672331 2662204 2627265 2568741 2489808 2394858 2288982 2177259 2063936 1952132
50474 1952132 1844235 1742227 1647462 1560467 1481417 1410798 1349321 1297060 1252864 1214679 1180341
50463 1180341 1148111 1116825 1086002 1056049 1028213 1003976 984189 968712 956909 948398 943204 941232
50451 941232 941893 944386 948253 953532 960425 968941 978876 990066 1002589 1016563 1031694 1047110 1061797
50438 1061797 1075135 1086941 1097189 1106024 1113892 1121220 1127958 1133839 1139079 1144276 1149508 1154200 1158143
50425 1158143 1161994 1166261 1170539 1174556 1179479 1187111 1197955 1211097 1226098 1243983 1266044 1292545
50413 1292545 1323163 1358003 1397481 1441587 1489882 1541898 1596984 1653906 1711089 1767196 1821212
50402 1821212 1872221 1919460 1962407 2000407 2032373 2057133 2073771 2081226 2077884 2062263 2034057 1994193
50390 1994193 1944138 1885777 1821688 1754578 1686318 1618285 1552790 1493196 1442037 1399610 1365059
50379 1365059 1338372 1320729 1313155 1315456 1326252 1343489 1364983 1389003 1414280 1439086 1460514 1475186
50367 1475186 1480623 1475581 1459462 1432325 1395609 1351976 1303965 1253259 1201494 1151044 1104295 1062344
50355 1062344 1024894 991166 960541 932619 907466 885971 869514 859003 854306 854477 858144 863578
50343 863578 868671 871024 868310 859099 843888 825211 806202 788815 773598 760868 751358 745535 742907
50330 742907 742486 743643 746181 749948 754750 760489 766965 773674 780149 786464 793100 800278 807619 814417
50316 814417 820107 824499 827797 830359 832357 833718 834413 834625 834526 834156 833688 833610 834359 836008 838498 841850
50300 841850 845747 849328 852056 854662 858518 864028 870319 876638 883258 890571 898028 904722 910687 916821
50286 916821 923544 930218 936020 940911 945424 949812 953715 956616 958374 959312 959848 960086 959802 958846 957499
50271 957499 956287 955437 954684 953718 952676 952004 951813 951628 951008 950324 950663 952937 957429 964404 974779 989650
50255 989650 1009177 1032385 1058148 1085957 1115566 1146272 1176945 1206548 1234407 1260241 1284381
50244 1284381 1307893 1331980 1357039 1382317 1406377 1427617 1444358 1454790 1457192 1450329 1433864 1408648
50232 1408648 1376671 1340526 1302680 1265177 1229765 1197966 1170807 1148510 1130315 1114280 1097264
50221 1097264 1075725 1047381 1012544 973793 934286 896313 861153 829624 802195 778681 758397
50210 758397 740874 726146 714146 704150 695294 687485 681267 676757 673197 669760 666357 663324 660612
50197 660612 657771 654548 651113 647737 644558 641615 638784 635652 631833 627396 622718 617882 612595 606813
50183 606813 601066 595937 591487 587435 583670 580268 577176 574281 571799 570288 570068 570772 571638 572221 572770
50168 572770 573862 575739 578113 580602 583249 586422 590319 594784 599620 604857 610651 617140 624547 633180
50154 633180 643155 654260 666324 679530 694040 709418 724777 739627 754263 769260 784898 801310
50142 801310 818971 838694 861259 887423 918327 955440 999628 1050206 1105077 1161826 1218565
50131 1218565 1273940 1326941 1377275 1425812 1474173 1523598 1574179 1624928 1673942 1718228 1753868
50120 1753868 1777116 1785663 1778928 1757439 1722375 1675599 1619640 1557320 1491428 1424573 1358970 1296214
50108 1296214 1237507 1184057 1136850 1095840 1059742 1026975 996637 968410 941919 916664 892457
50097 892457 869615 848759 830657 816020 805028 797119 791637 788615 788475 790995 795112 799855 805023
50084 805023 810786 817153 824110 831794 840013 847888 854388 859135 862358 864253 864861 864415 863324 861644 858861
50069 858861 854372 848096 840717 833459 827436 822827 818617 813437 806784 799409 792610 787282 783427 780280
50055 780280 776966 773338 770142 768149 767334 767302 768313 771251 776488 783349 790956 799086 807977 817776 828555
50040 828555 840436 853176 865876 877557 887985 897680 907277 917128 927174 936765 944855 950888 955452
50027 955452 959659 963961 968054 971859 976015 981231 987706 995532 1005263 1017631 1032849 1050542 1070340
50014 1070340 1092203 1115935 1140566 1164463 1186299 1205909 1224120 1241779 1259191 1276480 1293994
50003 1293994 1311796 1328746 1342420 1350038 1349450 1339538 1320196 1292172 1256759 1215581 1170679 1124480
49991 1124480 1079173 1036033 995655 958695 925822 896864 870606 845856 822304 800043 778708
49980 778708 757688 737021 717476 699738 683881 669704 657125 646077 636274 627355 619186 611873
49968 611873 605503 599961 594938 590060 585052 579924 575136 571474 569531 569058 568977 568366 567516 567771 570208 574750
49952 574750 580757 588144 597396 608478 620211 631090 640552 649075 657082 664086 669194 672225 673877
49939 673877 674812 674976 674036 671919 668405 662443 652633 638642 621775 604078 587176 571959 558735
49926 558735 547309 537218 528198 520282 513433 507554 503045 500738 500887 502689 505287 508712 513178 517878
49912 517878 521384 523228 524345 525886 528230 531257 534912 539228 544295 550450 558135 567389 577856 589357
49898 589357 601858 614688 626320 635379 641587 645463 647499 647974 647153 645162 641740 636490 629361 620727
49884 620727 611172 601298 591493 581613 571111 559718 547852 536256 525506 516040 508189 501786 496064
49871 496064 490404 485051 480734 477804 476168 475762 476574 478259 480342 482803 486016 490107 494906 500612 507930
49856 507930 517227 527929 539042 550018 560848 571560 581964 591754 600546 607798 612975 615936 617134
49843 617134 617261 616670 615165 612396 608266 602694 595177 585197 573312 561340 551020 542729 535901 530295
49829 530295 526165 523390 521255 519288 517801 517465 518796 522085 527218 533412 539720 546104 553531 562731
49815 562731 573335 584556 596130 608024 619609 629747 637598 643008 646388 648672 651048 654021 656659
49802 656659 657216 654582 648951 641296 632641 623718 614804 605735 596341 586853 577670 568929 560707 553442
49788 553442 547592 542908 538632 534503 531039 528682 527187 526068 525057 523813 521753 518756 515676 513558
49774 513558 512512 511939 511754 512722 515400 519342 523748 528533 534233 540857 547330 552362 555690 558132 560466
49759 560466 562601 564019 564685 565032 565080 564004 560800 555166 547539 538566 528831 519009 509859 501846 494847
49744 494847 488399 482262 476783 472679 470429 469835 470122 470374 469865 468215 465587 462806 461006 460896 462348
49729 462348 464696 467320 469979 472866 476510 481425 487643 494639 501883 509335 517269 525733 534436 543005
49715 543005 551116 558396 564553 569580 573555 576146 576663 574761 570916 566054 560901 555796 550809 545689
49701 545689 539882 533086 525821 519127 513564 508918 504988 502204 501014 500975 501181 501666 503630 507839 513256
49686 513256 517910 521049 523835 527881 533592 540160 546739 553155 559717 566775 574607 583488 593727 605547
49672 605547 618675 631904 643277 651114 654962 655550 653978 651230 648244 645890 644611 644349 644976 646577
49658 646577 649016 651386 652078 649434 642438 631189 617042 602123 588213 575952 565135 555576 547400
49645 547400 540606 534879 530069 526578 525014 525484 527363 529693 531804 533704 535869 538379 540205 539770 536566
49630 536566 531969 527992 525303 522878 519522 515161 510488 505945 501531 497300 493473 490083 486958 484134
49616 484134 481991 480860 480752 481526 482996 484685 485785 485786 485093 484691 485085 485851 486299 486317 486304 486531 486925 487447
49598 487447 488301 489607 491148 492628 493977 495197 496124 496600 496810 497166 497932 499122 500642 502228 503416 503967
49582 503967 504327 505130 506252 506853 506581 506154 506422 507330 508281 509166 510336 511837 513403 515267 518278 522947
49566 522947 528803 535037 541433 548366 556058 564126 571817 578501 583958 588284 591528 593508 594067 593377 591750
49551 591750 589215 585639 581380 577429 574667 573153 572382 572050 572286 573188 574428 575407 575714 575381 574795 574389
49535 574389 574406 574945 576162 578322 581649 586237 592101 599297 607932 618090 629750 642855 657482 673820
49521 673820 691576 709311 724775 736300 743741 747910 749489 748926 747009 744737 742692 741204 741183 743911
49507 743911 749573 756550 762571 766220 767092 765085 760106 752181 741555 728895 715573 703133 692060
49494 692060 681615 671348 662112 654864 649112 643634 638391 634553 632592 631569 630643 630198 630811 631953
49480 631953 632620 632791 633394 634949 636987 638848 640446 641987 643357 644163 644289 644158 644372 645220 646569 648142
49464 648142 649709 651025 651894 652438 653024 653702 653966 653464 652665 652281 652119 651191 649069 646478 644247 642211 639586
49447 639586 635999 631699 627064 622465 618480 615632 613893 612809 612166 612264 613507 616065 620020 625522 632628
49432 632628 641040 650071 658848 666664 673434 679828 686775 694672 703112 711348 719008 726444 734483 743602
49418 743602 752963 760329 763361 761246 754985 746227 736275 726318 717905 712445 710286 710833 713599 718683
49404 718683 726115 735315 745593 756864 769388 782993 796967 810750 824336 837947 851641 865234
49392 865234 878316 890250 900530 909249 916864 923392 928195 930750 931131 929441 925296 918477 909770 900440
49378 900440 891006 881256 871478 862829 856133 850964 846467 842653 840316 839900 841018 843020 845530 848302
49364 848302 851001 853349 855257 856571 856823 855490 852550 848542 843975 838757 832409 824821 816626 808787
49350 808787 802042 796815 793356 791638 791195 791392 791897 792733 793964 795575 797561 799799 801752 802628 801975 800003
49334 800003 797304 794494 792128 790635 790195 790815 792599 795663 799845 804745 810112 815894 821955 828216 835139
49319 835139 843590 854003 866186 880205 896802 916259 936985 955735 969175 975156 973102 964104
49307 964104 950695 935793 921301 907630 894404 881278 868218 855449 843349 832125 821590
49296 821590 811527 802330 794938 789995 787270 785926 785094 784133 782678 780754 778716 776877 775176 773267
49282 773267 770920 768291 765847 763994 762734 761745 760922 760773 762120 765425 770500 776840 784029 791721 799375
49267 799375 806217 811577 815388 818248 820791 822968 824171 824125 823310 822394 821765 822142 825215 832756 844910
49252 844910 859967 876093 892808 910347 927857 942768 952038 953900 948557 937561 922804 905995
49240 905995 888728 872459 858084 845693 835025 826064 818929 813380 809022 806043 805238 806978 810560
49227 810560 814890 819547 824844 831083 838239 846310 855503 865726 876113 885338 892575 898179 903376 909263
49213 909263 916058 923212 930051 936207 941698 946940 952719 959858 968832 979780 992777 1007772 1024290
49200 1024290 1041582 1059270 1077522 1096423 1115433 1133720 1150876 1167092 1182749 1198070 1213055
49189 1213055 1227533 1241261 1254060 1265924 1277066 1287960 1299176 1310925 1322816 1334422 1346097
49178 1346097 1358935 1373892 1391350 1411546 1434894 1461669 1492007 1526509 1566177 1610878 1657875
49167 1657875 1702230 1738602 1762832 1772985 1770259 1758914 1744303 1730441 1719435 1712506 1710272 1711940
49155 1711940 1715469 1719379 1723855 1729638 1736506 1743580 1750655 1758396 1767372 1777582 1788908 1801410 1815065
49142 1815065 1829688 1845235 1861803 1879244 1897091 1915017 1933059 1951341 1969835 1988581 2007824
49131 2007824 2027727 2048043 2068209 2087647 2105954 2123064 2139392 2155597 2171981 2188208 2203792
49120 2203792 2218710 2233312 2247796 2262170 2276686 2291933 2308427 2326530 2347064 2371599 2401691
49109 2401691 2438131 2481628 2534246 2599098 2677336 2764833 2852372 2930574 2996595 3056913 3122203
49098 3122203 3196474 3269261 3319381 3329176 3297431 3239451 3174655 3113414 3053758 2988074 2911825
49087 2911825 2827265 2741256 2660824 2590263 2531045 2483100 2445576 2416808 2394580 2376974 2362922
49076 2362922 2351894 2343421 2336995 2332033 2327660 2322895 2317359 2311495 2305862 2300499 2295262 2290302 2285707 2280969
49062 2280969 2275409 2269037 2262529 2256435 2250828 2245674 2241047 2236920 2233098 2229401 2225750 2222213 2219180 2217192
49048 2217192 2216192 2215319 2214037 2213194 2214238 2217584 2222598 2228998 2236983 2245573 2251943 2253343 2249243 2241089
49034 2241089 2230601 2219041 2207602 2197471 2189381 2183544 2179881 2177846 2176287 2174150 2171331 2168408 2165666
49021 2165666 2162919 2160178 2157872 2156247 2154992 2153697 2152396 2151583 2151945 2154033 2157883 2162942 2168590 2174767
49007 2174767 2181812 2189827 2198581 2207920 2217782 2227746 2237086 2245444 2253020 2259903 2265658 2269875 2272814 2275077
48993 2275077 2276772 2277299 2275907 2272261 2266612 2259647 2252139 2244560 2236985 2229469 2222401 2216242 2210936 2205792
48979 2205792 2200169 2194254 2189015 2185297 2183033 2181439 2179882 2178371 2177186 2176297 2175311 2173824 2171644 2168820
48965 2168820 2165671 2162750 2160606 2159557 2159726 2161153 2163774 2167401 2171825 2176813 2182001 2187086 2192290 2198296
48951 2198296 2205546 2213906 2223228 2233811 2245925 2259369 2274073 2290734 2310040 2331434 2353523 2375813
48939 2375813 2399299 2425111 2453289 2483266 2514979 2549003 2585940 2626015 2669026 2714371 2761362
48928 2761362 2809770 2859924 2912131 2966216 3021724 3078276 3135549 3193269 3251439 3310291 3369783
48917 3369783 3429237 3487634 3544063 3597964 3649271 3698391 3745689 3790985 3833930 3874842 3914471
48906 3914471 3952738 3988496 4020988 4050929 4079538 4107068 4133031 4157476 4181216 4204855 4228340
48895 4228340 4251429 4273805 4294469 4311677 4323962 4331062 4333691 4332707 4328716 4322193 4313579 4303152 4290949
48882 4290949 4276851 4260730 4242525 4222285 4200186 4176440 4150984 4123153 4091896 4056532 4017150
48871 4017150 3974105 3927422 3877179 3824276 3770109 3715411 3660097 3604536 3550267 3498852 3450378
48860 3450378 3403694 3358000 3313758 3272109 3233771 3198527 3165618 3134650 3106130 3080875 3058918
48849 3058918 3039457 3022003 3007060 2995357 2986910 2981280 2978320 2978009 2979858 2983110 2987533 2993567 3001697
48836 3001697 3012027 3024412 3038666 3054612 3072048 3090557 3109309 3127425 3144678 3161392 3177429
48825 3177429 3191914 3204451 3216051 3228181 3241316 3255098 3269475 3284766 3300734 3316520 3331637
48814 3331637 3346367 3361100 3375855 3390550 3405236 3419931 3434705 3449908 3465919 3482703 3500089
48803 3500089 3518381 3538116 3559232 3581063 3603200 3625839 3649229 3673281 3697743 3722192 3745763
48792 3745763 3767406 3786557 3803229 3817519 3829630 3840330 3850658 3860933 3870602 3879115 3886338 3891872
48780 3891872 3894575 3893087 3886431 3874031 3855772 3832392 3805334 3775845 3744402 3711065 3675878 3638739
48768 3638739 3599385 3557865 3514717 3470567 3425971 3381671 3338350 3295827 3253116 3209716 3166447
48757 3166447 3124711 3085386 3048799 3015217 2984771 2957204 2932149 2909509 2889176 2870663 2853471
48746 2853471 2837654 2823662 2811769 2801961 2794296 2789003 2786290 2786177 2788473 2792717 2798238 2804310 2810164
48733 2810164 2814930 2817954 2819325 2819839 2820332 2821242 2822722 2824769 2827142 2829613 2832399 2835883 2839770 2843035 2844880
48718 2844880 2845259 2844284 2841826 2838152 2834278 2830948 2827620 2823251 2817954 2813161 2810035 2808242 2806542 2804251
48704 2804251 2801885 2800515 2800602 2801487 2801917 2801067 2799040 2796547 2794323 2792747 2791749 2791069 2790786 2791476 2793540 2796455
48688 2796455 2799034 2800359 2800070 2797988 2794195 2789578 2785563 2782985 2781699 2781418 2782209 2783791 2785068 2785010 2783549
48673 2783549 2781022 2777106 2770961 2762318 2751831 2740293 2727856 2714082 2698654 2682000 2665129 2648599
48661 2648599 2631767 2613565 2594005 2574227 2554739 2534180 2510306 2481869 2449266 2413950 2377813
$$ [...]
##END NTUPLES=NMR SPECTRUM
##END=
