
##TITLE=AC1170_Tolima-ibage-TCHAH12003_7165981_4IImdzvc76
##JCAMPDX= 6.0         $$ Bruker NMR JCAMP-DX V2.0
##DATA TYPE= NMR SPECTRUM
##DATA CLASS= NTUPLES
##ORIGIN= BRUKER
##OWNER= Administrator
$$ 1.72 TOPSPIN		Version 2.1
$$ 2012-12-02 00:52:56.175 -0500  Administrator@X
$$ Compression mode = diff/dup
##.OBSERVE FREQUENCY= 400.02188249412
##.OBSERVE NUCLEUS= ^1H
##.ACQUISITION MODE= SIMULTANEOUS (DQD)
##.ACQUISITION SCHEME= undefined
##.AVERAGES= 8
##.DIGITISER RES= 22
##SPECTROMETER/DATA SYSTEM= spect
##.PULSE SEQUENCE= zg30
##.SOLVENT NAME= COFFEE_meoh
##.SHIFT REFERENCE= INTERNAL, COFFEE_meoh, 1, 14.98509
##AUDIT TRAIL= $$ (NUMBER, WHEN, WHO, WHERE, PROCESS, VERSION, WHAT)
$$ ##TITLE= Audit trail, TOPSPIN		Version 2.1
$$ ##JCAMPDX= 5.01
$$ ##ORIGIN= Bruker BioSpin GmbH
$$ ##OWNER= Administrator
$$ $$ E:\/data/COFFEE/nmr/AC1170_Tolima-ibage-TCHAH12003_7165981_4IImdzvc76/10/pdata/1/auditp.txt
$$ ##AUDIT TRAIL=  $$ (NUMBER, WHEN, WHO, WHERE, PROCESS, VERSION, WHAT)
(   1,<2012-12-02 00:52:47.909 -0500>,<Administrator>,<X>,<go>,<TOPSPIN 2.1>,
      <created by zg
	started at 2012-12-02 00:51:41.737 -0500,
	POWCHK enabled, PULCHK disabled,
       configuration hash MD5:
       86 BA 57 50 F2 9D 5C 9B 26 00 A9 28 5F 66 2E 89
       data hash MD5: 64K
       72 2F F8 E9 AB D7 02 61 BA 30 7D D0 66 AE A9 F6>)
(   2,<2012-12-02 00:52:51.050 -0500>,<Administrator>,<X>,<proc1d>,<TOPSPIN 2.1>,
      <Start of raw data processing
       efp LB = 0 FT_mod = 6 PKNL = 1 PHC0 = 0 PHC1 = 0 SI = 32K 
       data hash MD5: 32K
       E0 9F A3 AC BE 10 F0 57 33 B8 BC B2 12 E5 ED B1>)
(   3,<2012-12-02 00:52:51.519 -0500>,<Administrator>,<X>,<proc1d>,<TOPSPIN 2.1>,
      <pk PHC0 = 97.08618 PHC1 = 0 
       data hash MD5: 32K
       35 5C F0 22 F8 40 B3 17 BE 57 41 F0 2C B4 F1 5B>)
(   4,<2012-12-02 00:52:51.737 -0500>,<Administrator>,<X>,<proc1d>,<TOPSPIN 2.1>,
      <abs ABSG = 1 
       data hash MD5: 32K
       C0 D9 5A 5C 63 DF C7 B8 9B 6A BD B3 19 EF 47 B3>)
(   5,<2012-12-02 00:52:51.894 -0500>,<Administrator>,<X>,<proc1d>,<TOPSPIN 2.1>,
      <abs ABSG = 2 
       data hash MD5: 32K
       72 11 CA 27 36 A2 0F C6 19 EA D7 E1 CE 44 E2 1C>)
(   6,<2012-12-02 00:52:52.065 -0500>,<Administrator>,<X>,<proc1d>,<TOPSPIN 2.1>,
      <abs ABSG = 3 
       data hash MD5: 32K
       37 78 04 85 FA 9E 4D 29 FF C1 5D 99 95 C0 EF FE>)
(   7,<2012-12-02 00:52:52.206 -0500>,<Administrator>,<X>,<proc1d>,<TOPSPIN 2.1>,
      <abs ABSG = 4 
       data hash MD5: 32K
       2F B2 F9 35 30 D4 51 7C 67 CA A6 BA 08 2E 63 28>)
(   8,<2012-12-02 00:52:52.362 -0500>,<Administrator>,<X>,<proc1d>,<TOPSPIN 2.1>,
      <abs ABSG = 5 
       data hash MD5: 32K
       21 35 77 38 4F 05 15 57 FD F0 AF AC 05 C6 5B B4>)
$$ ##END=
$$ 
$$ $$ hash MD5
$$ $$ ED 06 30 9E B7 8F 73 13 9D 8A AD 2C 9C 2A 10 F8
##$RELAX= 
##$RELAX= 
##$RELAX= 
##$RELAX= 
##$RELAX= 
##$RELAX= 
##$RELAX= 
$$ Bruker specific parameters
$$ --------------------------
##$DU= <E:\>
##$EXPNO= 10
$$ [...]
##$TP= (0..7)
150 150 150 150 150 150 150 150
##$TP07= 0
##$TPNAME0= <>
##$TPNAME1= <>
##$TPNAME2= <>
##$TPNAME3= <>
##$TPNAME4= <>
##$TPNAME5= <>
##$TPNAME6= <>
##$TPNAME7= <>
##$TPOAL= (0..7)
0.5 0.5 0.5 0.5 0.5 0.5 0.5 0.5
##$TPOFFS= (0..7)
0 0 0 0 0 0 0 0
##$TUNHIN= 0
##$TUNHOUT= 0
##$TUNXOUT= 0
##$USERA1= <user>
##$USERA2= <user>
##$USERA3= <user>
##$USERA4= <user>
##$USERA5= <user>
##$V9= 5
##$VALIST= <valist>
##$VCLIST= <CCCCCCCCCCCCCCC>
##$VD= 0
##$VDLIST= <DDDDDDDDDDDDDDD>
##$VPLIST= <PPPPPPPPPPPPPPP>
##$VTLIST= <TTTTTTTTTTTTTTT>
##$WBST= 1024
##$WBSW= 4
##$XGAIN= (0..3)
0 0 0 0
##$XL= 0
##$YL= 0
##$YMAX_a= 566680
##$YMIN_a= -478668
##$ZGOPTNS= <>
##$ZL1= 120
##$ZL2= 120
##$ZL3= 120
##$ZL4= 120
##$ABSF1= 14.98509
##$ABSF2= -5.573092
##$ABSG= 5
##$ABSL= 3
##$ALPHA= 0
##$AQORDER= 0
##$ASSFAC= 0
##$ASSFACI= 0
##$ASSFACX= 0
##$ASSWID= 0
##$AUNMP= <proc_prof1d_extract_pilot.lims>
##$AXLEFT= 0
##$AXNAME= <>
##$AXNUC= <1H>
##$AXRIGHT= 0
##$AXTYPE= 0
##$AXUNIT= <>
##$AZFE= 0.1
##$AZFW= 0.1
##$BCFW= 0
##$BC_mod= 0
##$BYTORDP= 0
##$COROFFS= 0
##$CY= 15
##$DATMOD= 1
##$DC= 0
##$DFILT= <>
##$DTYPP= 0
##$F1P= 0
##$F2P= 0
##$FCOR= 0.5
##$FTSIZE= 32768
##$FT_mod= 6
##$GAMMA= 0
##$GB= 0
##$INTBC= 1
##$INTSCL= 1
##$ISEN= 128
##$LB= 0
##$LEV0= 0
##$LPBIN= 0
##$MAXI= 10000
##$MC2= 0
##$MEAN= 0
##$ME_mod= 0
##$MI= 0
##$NCOEF= 0
##$NC_proc= -8
##$NLEV= 6
##$NOISF1= 0
##$NOISF2= 0
##$NSP= 0
##$NTH_PI= 0
##$NZP= 0
##$OFFSET= 14.98509
##$PC= 1
##$PHC0= 97.08618
##$PHC1= 0
##$PH_mod= 1
##$PKNL= yes
##$PPARMOD= 0
##$PPDIAG= 0
##$PPIPTYP= 0
##$PPMPNUM= 2147483647
##$PPRESOL= 1
##$PSCAL= 4
##$PSIGN= 0
##$PYNMP= <proc.py>
##$REVERSE= no
##$SF= 400.02
##$SI= 32768
##$SIGF1= 0
##$SIGF2= 0
##$SINO= 400
##$SIOLD= 32768
##$SPECTYP= <>
##$SREGLST= <1H.CDCl3>
##$SSB= 0
##$STSI= 32768
##$STSR= 0
##$SW_p= 8223.68421052631
##$SYMM= 0
##$S_DEV= 0
##$TDeff= 65536
##$TDoff= 0
##$TI= <>
##$TILT= no
##$TM1= 0
##$TM2= 0
##$TOPLEV= 0
##$USERP1= <user>
##$USERP2= <user>
##$USERP3= <user>
##$USERP4= <user>
##$USERP5= <user>
##$WDW= 1
##$XDIM= 32768
##$YMAX_p= 431529187
##$YMIN_p= -670177
##$CURPLOT= <Network HP LaserJet P1505>
##$CURPRIN= <$Network HP LaserJet P1505>
##$DFORMAT= <normdp>
##$LAYOUT= <+/1D_H.xwp>
##$LFORMAT= <normlp>
##$PFORMAT= <normpl>
##$SURQMSG= 1
$$ End of Bruker specific parameters
$$ ---------------------------------
##NTUPLES= NMR SPECTRUM
##VAR_NAME=  FREQUENCY,     SPECTRUM/REAL,   SPECTRUM/IMAG
##SYMBOL=    X,             R,               I
##VAR_TYPE=  INDEPENDENT,   DEPENDENT,       DEPENDENT
##VAR_FORM=  AFFN,          ASDF,            ASDF
##VAR_DIM=   32768,         32768,           32768
##UNITS=     HZ,            ARBITRARY UNITS, ARBITRARY UNITS
##FACTOR=    0.250966925370066, 1,           1
##FIRST=     8223.43324360094, 41396,        68383
##LAST=      0,             105341,          52049
##MIN=       0,             -670177,         0
##MAX=       8223.43324360094, 431529187,    0
$$ Real data points
##PAGE= N=1
##DATA TABLE= (X++(R..R)), XYDATA
$$ [...]
19493a41102k15613J63635a7066p5896A89767b70748g0075j51769C6494e94083
$$ -141102 -356715 -193080 -17066 -92962 189767 -270748 -70075 -221844 36494 -594083
19482a56271B57589c19994C18125b81175k3710k2957a58031j10676h3379B04855
$$ -156271 257589 -319994 318125 -281175 -304885 -327842 -158031 -268707 -83379 204855
19471b89275E3194a56934j10460f4807b3401j9726A49967a11568r1879g0734k05765
$$ -289275 53194 -156934 -267394 -64807 -23401 -43127 149967 -111568 -203447 -70734 -276499
19460b76499G5241J06053c30020A76475a30179J2581n5626M1857d5491m4691a8911
$$ -276499 75241 181294 -330020 176475 -130179 -117598 -173224 -131367 -45491 -90182 -18911
19448b12348B01880d02274a00408q4732k4213g049j58970j04751A8720M2604K562
$$ -212348 201880 -402274 -100408 -185140 -209353 -7049 -166019 -270770 18720 61324 63886
19437F3886J80464P7442B9660b02893a5097q490j24681M6076j3834j12530a03306
$$ 63886 244350 321792 29660 -202893 -15097 -23587 -148268 -102192 -116026 -228556 -103306
19425A27594a29261A56730D0560L2540b91266i5067d371j68870j99821e6933H2199
$$ 127594 -129261 156730 40560 73100 -291266 -95067 -4371 -173241 -373062 -56933 82199
19413a8177j68777I5283a45130A65989a26164B35233b73311g9936H7371d8999
$$ -18177 -186954 95283 -145130 165989 -126164 235233 -273311 -79936 87371 -48999
19402c23485j7710h9392C2258a31546L5208n8087e3980J0089C0252A0357e2726
$$ -323485 -341195 -89392 32258 -131546 -96338 -154425 -53980 -43891 30252 10357 -52726
19390A91926h3451k09905A68127G6943K4288k8220J62458b28640A5734b61313
$$ 191926 -83451 -293356 168127 76943 101231 73011 235469 -228640 15734 -261313
19379A05917a38319e9518j13289n6214d4940d696k68141c2748m23904A09546a40527
$$ 105917 -138319 -59518 -172807 -229021 -44940 -4696 -272837 -32748 -456652 109546 -140527
19367f2154k68541a27568H804a77050e3299L114B34138h8502k17705E4153J11855
$$ -62154 -330695 -127568 8804 -177050 -53299 -50185 234138 -88502 -306207 54153 166008
19356A66008a1734k8700A58707a01058K1963B6499c39401J50463I433a12390p7314
$$ 166008 -11734 -40434 158707 -101058 -79095 26499 -339401 -188938 9433 -112390 -189704
19345a89704A33103c5014k50717L9150a05802k67260i6402A94658a71080q8441
$$ -189704 133103 -35014 -285731 -246581 -105802 -373062 -96402 194658 -171080 -259521
19335b59521G4573g030j59263j38461B94124a07859A27536m2732c52494a35700
$$ -259521 74573 -7030 -166293 -304754 294124 -107859 127536 84804 -352494 -135700
19324a42954k4596a6721j88415J983f2705k75232h8928A85568a98963n2928r6073
$$ -142954 -167550 -16721 -205136 -203153 -62705 -337937 -88928 185568 -198963 -251891 -347964
19313c47964a6539m57063e1871l53325J37410d0136o5532l0881o5338R6887J7929
$$ -347964 -16539 -473602 -51871 -405196 -267786 -40136 -105668 -136549 -201887 -105000 -87071
19302h7071j09071E4493a68005K4832J6926B83324H1702k1454a71780A5927a07798
$$ -87071 -196142 54493 -168005 -143173 -126247 283324 81702 60248 -171780 15927 -107798
19290a41233q0187A14003c68205B67970A32324c37181E0163a01999J0113D6523
$$ -141233 -221420 114003 -368205 267970 132324 -337181 50163 -101999 -91886 46523
19279a21482k41182a10335C0970a35507j58641A21798d9244C19616c28730a1393
$$ -121482 -362664 -110335 30970 -135507 -294148 121798 -49244 319616 -328730 -11393
19268c95131a89265j14719k2725D4269L4099e5691j04419C23666d201q5204p2514
$$ -395131 -189265 -303984 -326709 44269 78368 -55691 -160110 323666 -4201 -89405 -161919
19257a61919I5308f8141D4760e10697a52274B14180a51676j08547f4960A54328
$$ -161919 95308 -68141 44760 -510697 -152274 214180 -151676 -260223 -64960 154328
19246F9938n723d90957d3309j0720g980l723A56877a65395G7366a16701k23593
$$ 69938 64215 -490957 -43309 -54029 -7980 -11703 156877 -165395 77366 -116701 -340294
19235c40294h9056K3687C125e2547j25149d4205G2851a08089L6417G9840N4503
$$ -340294 -89056 -65369 3125 -52547 -177696 -44205 72851 -108089 -71672 79840 134343
19224A34343e7574A06454A81J09220a38323K120A6023c6581j4065J4039k68727
$$ 134343 -57574 106454 181 109401 -138323 -136203 16023 -36581 -50646 -36607 -305334
19213c05334L4929A22201K127a59E2203B2001R8252g7559j43231O2130B1826K44361
$$ -305334 -270405 122201 124328 -159 52203 22001 120253 -77559 -220790 -158660 21826 266187
19201B66187B3382g2423E5051P0099a8223A3334a00489j82002D2659B697b32782
$$ 266187 23382 -72423 55051 125150 -18223 13334 -100489 -282491 42659 2697 -232782
19189c84572J54576A4578b06053Q1546p556k49784A95J36360c75781a16846n4697
$$ -384572 -229996 14578 -206053 -124507 -132063 -381847 195 136555 -375781 -116846 -171543
19178a71543j53072Q2286P251A88492n1535c10753M8306E4585a10387C21432E8712
$$ -171543 -324615 -242329 -235078 188492 136957 -310753 -262447 54585 -110387 321432 58712
19166B06525f7095j42655R3817q4461e8760b8516r7246N2777A50438a73659c2344
$$ 206525 -67095 -209750 -115933 -200394 -58760 -28516 -125762 -72985 150438 -173659 -32344
19154c64363J40211f7073p9196P2051k99146J85242a0306A36928a68391K6959
$$ -364363 -224152 -67073 -146269 -74218 -373364 -188122 -10306 136928 -168391 -141432
19144a41432C90268D1018a28644G2887c02428a26285C32235F0107a76154b531
$$ -141432 390268 41018 -128644 72887 -302428 -126285 332235 60107 -176154 -2531
19133A6695a70641d2038j43776o8996i3212H6088O6270d35751A06238c56060F6387
$$ 16695 -170641 -42038 -185814 -254810 -93212 86088 152358 -435751 106238 -356060 66387
19121h0633L7625J6894k43447B62543p3635b44585g9975A3434a38764a6400j66264
$$ -80633 -43008 -26114 -269561 262543 188908 -244585 -79975 13434 -138764 -16400 -182664
19110a82664h9109l65680A36520a82534A2631a69284a8680m7632b5497j09912
$$ -182664 -89109 -454789 136520 -182534 12631 -169284 -18680 -66312 -25497 -135409
19100a35409e7868p9274d7815n7059p7245G4289k8449A0212O3327k3296a54694
$$ -135409 -57868 -137142 -47815 -104874 -182119 74289 45840 10212 73539 50243 -154694
19088b32624R421R8685D917a34290n4821p2803A04941k4253e6865I3663a32186
$$ -232624 -223203 -124518 4917 -134290 -189111 -261914 104941 80688 -56865 93663 -132186
19076A28019g4936k66349g6277A66954D3337A3265J86456g6843k53832A56928
$$ 128019 -74936 -341285 -76277 166954 43337 13265 199721 -76843 -330675 156928
19065a45044L375A70631a19438c5181j53708J1183I7115a47497B71062a21572
$$ -145044 -141669 170631 -119438 -35181 -188889 -177706 97115 -147497 271062 -121572
19054f4547n3847N2531D9118b18562a2015j22680I2585L8506e8081A2119L4096
$$ -64547 -118394 -65863 49118 -218562 -12015 -134695 92585 131091 -58081 12119 46215
19043D6215h0722J545n5174A28686a47753A44036b64454E8821J10977d7012j6408
$$ 46215 -80722 -79177 -134351 128686 -147753 144036 -264454 58821 169798 -47012 -63420
19032f3420A00298D3987g4227A56941E9602c53389e5639A21623g2291A90058A2242
$$ -63420 100298 43987 -74227 156941 59602 -353389 -55639 121623 -72291 190058 12242
19020A24054b4904B10992b25971n2033E968b39835G4946l3311N337a58552d6077
$$ 124054 -24904 210992 -225971 -278004 5968 -239835 74946 41635 46972 -158552 -46077
19008D76959c80886f2374J044I7429r433g6864j81374J17067k47368A81952d2393
$$ 476959 -380886 -62374 -61330 97429 87996 -76864 -258238 -141171 -388539 181952 -42393
18996f5801C61965a4228o1295E6411J50824g0427m3495E4775j9819b2527A68369
$$ -65801 361965 -14228 -75523 56411 207235 -70427 -113922 54775 34956 -22527 168369
18984b74809a07582A10908a0210k68998C19762a6662H5499n587g1353o4961D3496
$$ -274809 -107582 110908 -10210 -279208 319762 -16662 85499 79912 -71353 -136314 43496
18972i5455M5525A48878O57917B42880H7236R5904c92912H2286b90162A1297Q7496
$$ -95455 -49930 148878 806795 242880 87236 183140 -392912 82286 -290162 11297 98793
18961I8793k5572b7227j45623c704k38411N3006j81715a65636A64502E4173A909
$$ 98793 73221 -27227 -172850 -3704 -242115 -189109 -370824 -165636 164502 54173 1909
18949F7766n444K51461d9073H5516R0604a91089J7221d6298A22679a02215j5574
$$ 67766 62322 313783 -49073 85516 176120 -191089 -173868 -46298 122679 -102215 -117789
18938a17789d0455A35124b14403B48078f8551l09538g2076b6232F3267K90566
$$ -117789 -40455 135124 -214403 248078 -68551 -378089 -72076 -26232 63267 353833
18928C53833a87674k8323D1263K16733H2582l7185a29505B3403c02776e9673A17418
$$ 353833 -187674 -215997 41263 257996 82582 45397 -129505 23403 -302776 -59673 117418
18916E9704M46329C5308K07597J43637a76047G9621K35679b93009I8433M86635
$$ 59704 506033 35308 242905 386542 -176047 79621 315300 -293009 98433 585068
18906E85068k15334q2589b12327E5640a60729M1079p7416j3636a0115l3629A66045
$$ 585068 369734 287145 -212327 55640 -160729 -119650 -197066 -210702 -10115 -43744 166045
18894B150f8233E7215c5536j48417h0021l62700a20103k22125A8150a26464M3563
$$ 2150 -68233 57215 -35536 -183953 -80021 -442721 -120103 -342228 18150 -126464 -82901
18883h2901r5858k08380J07895c1769k94695k0235B36268a88403H727b4330A34848
$$ -82901 -178759 -387139 -279244 -31769 -326464 -346699 236268 -188403 8727 -24330 134848
18871H3299a57843D0318g9949k3247A08029a8668k8734a080k77494e8075p0623
$$ 83299 -157843 40318 -79949 -103196 108029 -18668 -47402 -1080 -278574 -58075 -128698
18860a28698m9674B42107N8009a57730g4358K7300A91234A6552N2024i6176k819
$$ -128698 -178372 242107 300116 -157730 -74358 -47058 191234 16552 68576 -96176 -98995
18849i8995J5925E8555K04965b4047A56105R7348c16541B01606J95636A65264
$$ -98995 -83070 58555 263520 -24047 156105 253453 -316541 201606 397242 165264
18838a51617q2151B26485a39215k3092D0885J20810a28359j1528H9884A0004J47905
$$ -151617 -233768 226485 -139215 -162307 40885 161695 -128359 -139887 89884 10004 157909
18827A57909O3807c01457B45060a78249B61143F1474c67971A68830c37486a7946
$$ 157909 221716 -301457 245060 -178249 261143 61474 -367971 168830 -337486 -17946
18816a03164A0868K36281r0581j7624a89642o9326a04400D38879j54127e3348
$$ -103164 10868 247149 156568 138944 -189642 -258968 -104400 438879 284752 -53348
18805A09144a86341c3518A04982N6853F7159K1208J86327c67998M8512C99693
$$ 109144 -186341 -33518 104982 161835 67159 88367 274694 -367998 -319486 399693
18794a5310j72999k20861E2995b10798R5380M7651B96844A06635E812J04471D3553
$$ -15310 -188309 -409170 52995 -210798 -115418 -67767 296844 106635 5812 110283 43553
18782a91904A17657h5817l61698A50311b42410E0942H13M6506g5246n1550L7262
$$ -191904 117657 -85817 -447515 150311 -242410 50942 813 47319 -75246 -126796 -89534
18771h9534E3171P3079l2157a93302m6362O0558j85759h3226j42447A39113b6728
$$ -89534 53171 126250 94093 -193302 -239664 -179106 -364865 -83226 -225673 139113 -26728
18759b16676P9814e6354o9900k18916d8276j78410A10780a64682p9847A14290
$$ -216676 -136862 -56354 -126254 -345170 -48276 -226686 110780 -164682 -244529 114290
18748b01073I3396a57983j7218B14405h1779l3195k03551n7438a55181B15406
$$ -201073 93396 -157983 -175201 214405 -81779 -114974 -318525 -375963 -155181 215406
18737e8643A01829a07334l05052E3877a98514O6656E8044L6934K5769E1922a4619
$$ -58643 101829 -107334 -412386 53877 -198514 -131858 58044 94978 120747 51922 -14619
18725b52965j9671A25834a73924m6517l17335a6234k17644B30075H201a90305
$$ -252965 -272636 125834 -173924 -220441 -537776 -16234 -233878 230075 8201 -190305
18714B55666a24841E8591j0403h5367j67605k105P7313A3221d46558D7311a78039
$$ 255666 -124841 58591 48188 -85367 -252972 -255077 -177764 13221 -446558 47311 -178039
18702a0434k11042i9738j97383F207P6519b10560j3441f328A24956l4157d4913
$$ -10434 -221476 -99738 -297121 6207 82726 -210560 -224001 -6328 124956 90799 -44913
18690A27047h1235j08915D69650b47837a12462e402j94123j36758A08144k6816
$$ 127047 -81235 -190150 469650 -247837 -112462 -5402 -199525 -336283 108144 81328
18680H1328K4115c34612a59350o4129f1546A3174b61087E5713M7057a8879o4555
$$ 81328 105443 -334612 -159350 -223479 -61546 13174 -261087 55713 102770 -18879 -83434
18669h3434M477k0775B36446a39686a4267B0648a09335L4095k13634E7278J93479
$$ -83434 -78957 -99732 236446 -139686 -14267 20648 -109335 -75240 -288874 57278 250757
18658B50757f226m2661c822A83874a11656j3493B5775a97779f8026h092A8216
$$ 250757 -6226 -48887 -3822 183874 -111656 -125149 25775 -197779 -68026 -8092 18216
18646c7273A25089A8770F434b41188d2673F2461a41913b389k47000b5785A99697
$$ -37273 125089 18770 6434 -241188 -42673 62461 -141913 -2389 -249389 -25785 199697
18634b60084B90208d363j5690G5315b95171I1240b3234A41464a99291F923J30888
$$ -260084 290208 -4363 -20053 75315 -295171 91240 -23234 141464 -199291 6923 137811
18623A37811C6296a12529B73084a25037J3143B26965H5558A7828J39593a23245
$$ 137811 36296 -112529 273084 -125037 -111894 226965 85558 17828 157421 -123245
18612c15058g7592A96047c93944i3063j03059C8344A1990a85045j08153J44228
$$ -315058 -77592 196047 -393944 -93063 -196122 38344 11990 -185045 -293198 -148970
18602a48970E4032a63185A51290D3641p508e6490H9194l5031a74452I1003a07688
$$ -148970 54032 -163185 151290 43641 36133 -56490 89194 54163 -174452 91003 -107688
18590e49662a58799A08819d03001e9022m0909A14552f3615A18781f0188k20303
$$ -549662 -158799 108819 -403001 -59022 -99931 114552 -63615 118781 -60188 -280491
18580b80491J04217L668j18300R7270g9616j37036N1888A34441E8325O0854C0441
$$ -280491 -176274 -172606 -290906 -193636 -79616 -216652 -164764 134441 58325 119179 30441
18568B97023A46036c41981J10924O1011L0462A96102a28941N5683A21843n9132
$$ 297023 146036 -341981 -231057 -170046 -139584 196102 -128941 -73258 121843 62711
18558F2711M22722d3904j22504A1502J271b67026E2925c3300o5658b1797q8085
$$ 62711 485433 -43904 -166408 11502 12773 -267026 52925 -33300 -98958 -21797 -109882
18547a09882B36318q4449h652o6066I3443b70914a13883c0408n6300M3301r0279
$$ -109882 236318 151869 -8652 -74718 93443 -270914 -113883 -30408 -86708 -43407 -133686
18536a33686j019j05969j7190j8299A5222J35781b8297j79446l8335I8301b04602
$$ -133686 -134705 -240674 -257864 -276163 15222 151003 -28297 -207743 -246078 98301 -204602
18524G1966l4319h2032K4729a5085B89594j07832b24332a01948F977g5477k60228
$$ 71966 37647 -82032 -57303 -15085 289594 181762 -224332 -101948 6977 -75477 -335705
18513c35705J10160j16839a46943a5703n7042l262L6344j86614a3738D5881K0229
$$ -335705 -225545 -342384 -146943 -15703 -72745 -76007 -39663 -226277 -13738 45881 66110
18502F6110A0664a5786j72662F0065O6486a42032D1032h6562A44298c26884c2378
$$ 66110 10664 -15786 -188448 60065 126551 -142032 41032 -86562 144298 -326884 -32378
18490a37521M8644c2877l7409L233k74854I057a43411B1305b5437q724G8086P0601
$$ -137521 -88877 -32877 -70286 -67053 -341907 9057 -143411 21305 -25437 -34161 78086 148687
18478A48687a95271A2104a05389A09015J5907D6002a14207h641r1804C694b5535
$$ 148687 -195271 12104 -105389 109015 124922 46002 -114207 -8641 -100445 3694 -25535
18466A85045o3130D8222e04218a89460C3120K05761a82802H6503O515Q1191J19961
$$ 185045 121915 48222 -504218 -189460 33120 238881 -182802 86503 93018 174209 294170
18455B94170b96604h6015B47842R499a02173B9765a57A60527E2502b6543l07819
$$ 294170 -296604 -86015 247842 257341 -102173 29765 -157 160527 52502 -26543 -334362
18444c34362k22467b72507d0508l64889a34068k36008B74329a24118j12250D19151
$$ -334362 -556829 -272507 -40508 -405397 -134068 -370076 274329 -124118 -236368 419151
18433a06034d451o51A6529Q2759N4670a53781A33326a34813D362c56794A33054
$$ -106034 -4451 -5102 16529 99288 153958 -153781 133326 -134813 4362 -356794 133054
18421I0886h6903D7740b67521P5231B40697K08108a10964j25904Q2749L7339D180
$$ 90886 -86903 47740 -267521 -192290 240697 448805 -110964 -236868 -154119 -116780 4180
18409E1531i3280A23332b75565K4922a02752j26764I3746J36068p2511N8074p9124
$$ 51531 -93280 123332 -275565 -250643 -102752 -229516 93746 229814 157303 215377 136253
18398A36253a51990j49832j7648F0224o346d41548f2542j90032i2527q3589b8494
$$ 136253 -151990 -301822 -319470 60224 53878 -441548 -62542 -252574 -92527 -176116 -28494
18386B6542d9116G4304A6111a69651B24906F7369m986c1971l96170a39462A4421
$$ 26542 -49116 74304 16111 -169651 224906 67369 62383 -31971 -428141 -139462 14421
18374c9373H2990a11343j8128A48447J99720b8397k11521C02909d6603j34599
$$ -39373 82990 -111343 -129471 148447 348167 -28397 -239918 302909 -46603 -181202
18364a81202J4973A54038d4019k9978A74933k8527B364g4243j70138f1108A80795
$$ -181202 -166229 154038 -44019 -73997 174933 146406 2364 -74243 -244381 -61108 180795
18352A81191D6592R1359g6089r7414D8302e2040p2086k10860A47659a64813l4601
$$ 181191 46592 137951 -76089 -173503 48302 -52040 -124126 -334986 147659 -164813 -199414
18341a99414G9899M8747a67153f7228A38616P3749b0977m4972n4101c080A03173
$$ -199414 79899 128646 -167153 -67228 138616 212365 -20977 -65949 -120050 -3080 103173
18329a0157j52983O3643j25217b4738B36561L2205a68287a1675j70689L4260O5781
$$ -10157 -163140 -99497 -224714 -24738 236561 268766 -168287 -11675 -182364 -148104 -82323
18318h2323j31433A99647B7518R5382a03086A77387L913c25746C2630k604K08882
$$ -82323 -213756 199647 27518 122900 -103086 177387 181300 -325746 32630 30026 238908
18307B38908C7713c51929I445L541g5918K1108N464k26539A17047c99368e0785
$$ 238908 37713 -351929 9445 12986 -75918 -54810 -49346 -275885 117047 -399368 -50785
18295c5592j45143B29898a09905p3859a7104A71960b62963A1560Q234b75742p2262
$$ -35592 -180735 229898 -109905 -183764 -17104 171960 -262963 11560 19794 -275742 -348004
18284c48004A71328D4718e5561q7655g1291B04920c8759n3800o0146E7594b68883
$$ -348004 171328 44718 -55561 -143216 -71291 204920 -38759 -92559 -152705 57594 -268883
18272B56825a26410J7505c6077p2720h111n6346A00609J47197I4511b83348J6182
$$ 256825 -126410 -108905 -36077 -108797 -8111 -64457 100609 247806 94511 -283348 -267166
18261b67166a00129E7521a24106A14749a39209B54417b77073i3763j55514D59055
$$ -267166 -100129 57521 -124106 114749 -139209 254417 -277073 -93763 -249277 459055
18250a38265A94690m0196b02215G2092a84230Q1132E7023K6292b57407b4366G1450
$$ -138265 194690 154494 -202215 72092 -184230 -103098 57023 83315 -257407 -24366 71450
18238a38229A5480Q6828b23591C3235J30356F710a90794k64237A49619F0140b40675
$$ -138229 15480 102308 -223591 33235 163591 6710 -190794 -455031 149619 60140 -240675
18226b16717a6770k17565E5392A8503c57788e6747n6128O336J2136n8160A35334
$$ -216717 -16770 -234335 55392 18503 -357788 -56747 -112875 -106539 -94403 -152563 135334
18214A99768p1410c67315a39693M3655B99701B8794J25941a9135F4955c87881
$$ 199768 128358 -367315 -139693 -96038 299701 28794 154735 -19135 64955 -387881
18203a88376A90182b48864g334q6611L241M0985l2208c2336k92219A35861e6559
$$ -188376 190182 -248864 -7334 -93945 -90704 -49719 -81927 -32336 -324555 135861 -56559
18191a15857E0421a18435j75998A97027K33726a06635J6631A6429a98708o5146
$$ -115857 50421 -118435 -294433 197027 430753 -106635 -90004 16429 -198708 -263854
18181b63854B65627M3764E8813c3197B96295a39683A31266k2143a67197c6211
$$ -263854 265627 309391 58813 -33197 296295 -139683 131266 109123 -167197 -36211
18170G7527c1403A15868h8742c8439A9463b01868J7184D3679e1323n9628k04198
$$ 77527 -31403 115868 -88742 -38439 19463 -201868 -184684 43679 -51323 -110951 -315149
18159c15149E435d7706j74873R2168B14539a94798Q6440A3063g7351p4245j4343
$$ -315149 5435 -47706 -222579 -130411 214539 -194798 -108358 13063 -77351 -151596 -165939
18148a65939o4933A34791b08824h3866B78498i5622B68535G0899a55447A73537
$$ -165939 -230872 134791 -208824 -83866 278498 -95622 268535 70899 -155447 173537
18137A63952a28754K3470d0543p3384A8196d9076K1517B43435f3609G889J93515
$$ 163952 -128754 -105284 -40543 -113927 18196 -49076 -27559 243435 -63609 7889 201404
18126B01404g1565n09632K63819J46639B76132n6755f3166j11010Q1439m6317
$$ 201404 -71565 -581197 -317378 -170739 276132 219377 -63166 -174176 -92737 -139054
18116a39054i965C8847c6709l52729d139j06051f036r295l42661J48447e8382
$$ -139054 -9965 38847 -36709 -389438 -4139 -110190 -6036 -15331 -357992 -209545 -58382
18104A40397O5845a06498F721P7075h641l9079A92300a11262n7758M8532j8826
$$ 140397 206242 -106498 6721 83796 -8641 -47720 192300 -111262 -169020 -120488 -139314
18093a39314O5387c2075j98166A35507C3078e9527j89895d6665n7564A45602a7818
$$ -139314 -73927 -32075 -230241 135507 33078 -59527 -249422 -46665 -104229 145602 -17818
18081a4764C4119b67327J08070d3032B31962f5967q5817A36157m6037d0254H7091
$$ -14764 34119 -267327 -159257 -43032 231962 -65967 -151784 136157 90120 -40254 87091
18069a7660n17d576H5686J23233q2665o1344h7366B42209C7836e923j86382F6084
$$ -17660 -18177 -4576 85686 208919 126254 64910 -87366 242209 37836 -5923 -192305 66084
18056b280B38823a36729G3191K29310a34019A99555a8970l66907A84302R0909
$$ -2280 238823 -136729 73191 302501 -134019 199555 -18970 -385877 184302 275211
18046B75211H1138h550A20R625a57448r3423d8440A2631f3133C10992a4152A05022
$$ 275211 81138 -8550 120 9745 -157448 -250871 -48440 12631 -63133 310992 -14152 105022
18033A10913c09768J39961j37402a7815j71251A06719J33925a23098a7202C6583
$$ 110913 -309768 -169807 -307209 -17815 -189066 106719 240644 -123098 -17202 36583
18022f8098c3336A08630b74478A04698a29420I3091B2950J69120a05091b3685
$$ -68098 -33336 108630 -274478 104698 -129420 93091 22950 192070 -105091 -23685
18011A150J82480E8030d890m7137A48776P0063g5057j8619m7406e6653n5966G8899
$$ 1150 183630 58030 -4890 -52027 148776 218839 -75057 -93676 -141082 -56653 -112619 78899
17998A37341b01001b3839R677k0740H8679O9332a39582c6758B21807a60112p638
$$ 137341 -201001 -23839 -14162 -34902 88679 158011 -139582 -36758 221807 -160112 -167750
17987a67750p5123C12545h9247D0408N0764a70655l4764l9763G4371a26729k21305
$$ -167750 -242873 312545 -89247 40408 91172 -170655 -205419 -245182 74371 -126729 -348034
17976c48034A07598E3178b92145B02876N129a90141B5297P7152m645a10133l836
$$ -348034 107598 53178 -292145 202876 208005 -190141 25297 102449 97804 -110133 -113969
17965a13969k7511A63371B6310J94127g7517j54129d5152E6241a46060M1330A90447
$$ -113969 -141480 163371 26310 220437 -77517 -231646 -45152 56241 -146060 -104730 190447
17953B57194a9142r6539o0549A84781j9758M1069I668a18736A05569a49877c1089
$$ 257194 -19142 -115681 -176230 184781 165023 206092 9668 -118736 105569 -149877 -31089
17941e0272k81340a2875C14199a83944B48156F557L2491K03502o1287c9766j81127
$$ -50272 -331612 -12875 314199 -183944 248156 6557 39048 242550 181263 -39766 -220893
17930b20893A30755d6470j07373a1719I0746l0810B8668c64317A84852i4804F8662
$$ -220893 130755 -46470 -153843 -11719 90746 59936 28668 -364317 184852 -94804 68662
17918A68591p0514O2923l4886b14236g2905A11052a60747A73695o2275e3229k43428
$$ 168591 98077 161000 126114 -214236 -72905 111052 -160747 173695 111420 -53229 -296657
17907b96657A12639a68752B78809a24183A69392k5280i0475c7669B42102c2157
$$ -296657 112639 -168752 278809 -124183 169392 144112 -90475 -37669 242102 -32157
17896a67241A5166b68236A07610f2213k42017A04493D1895j3601g3297A57521
$$ -167241 15166 -268236 107610 -62213 -304230 104493 41895 28294 -73297 157521
17885G6476R833J67337C3530e2104E5885e4641j26386A72220D5107N8357N6907
$$ 76476 86309 253646 33530 -52104 55885 -54641 -181027 172220 45107 103464 160371
17874A60371K382N8977k6241o5932h0671q8315k8199A41466n0293g3716r3021
$$ 160371 162753 221730 195489 129557 -80671 -168986 -197185 141466 91173 -73716 -166737
17863a66737g8012D5608J79623j12503b3755D15015e6059C6748L23002j65604
$$ -166737 -78012 45608 225231 112728 -23755 415015 -56059 36748 359750 194146
17853A94146a11305n9395B95819a58181F0579a30925O0515j15512e8419D9777
$$ 194146 -111305 -170700 295819 -158181 60579 -130925 -70410 -185922 -58419 49777
17842H5178b16527D42876j38292d5709j54769B67039d59995I7813a35434A56855
$$ 85178 -216527 442876 304584 -45709 -200478 267039 -459995 97813 -135434 156855
17831F5951a08192A47133a23419a4360g177F3067e4633j11865f7818k11667C3131
$$ 65951 -108192 147133 -123419 -14360 -7177 63067 -54633 -166498 -67818 -279485 33131
17819G7853A6485g2455C50908F1466a3317k05115B1619J58982a00828H2225C0630
$$ 77853 16485 -72455 350908 61466 -13317 -218432 21619 180601 -100828 82225 30630
17807A89596D0766N5601J42174a8541A61760J31442O6130H5183d8004B792K75874
$$ 189596 40766 96367 238541 -18541 161760 293202 359332 85183 -48004 2792 278666
17796B78666b60588F4159b24205e3911A60550P9778e0793A62184f4038B73739
$$ 278666 -260588 64159 -224205 -53911 160550 240328 -50793 162184 -64038 273739
17785A48778k9786l1619K07210d69633a07585B69671F3096k502a28900A26875
$$ 148778 118992 87373 294583 -469633 -107585 269671 63096 60594 -128900 126875
17774a63986j05910J0519a23583A0634a00221D12565r9454C8509J29106a82484
$$ -163986 -269896 -259377 -123583 10634 -100221 412565 313111 38509 167615 -182484
17763B129b12615a051F8874Q1086a63014b783C9625J47408l3464J3665D5090b25936
$$ 2129 -212615 -1051 68874 149960 -163014 -2783 39625 187033 153569 167234 45090 -225936
17750A92424p926b75811d8469B3114O2351j0128J43872B36K92199J121g765B85643
$$ 192424 184498 -275811 -48469 23114 85465 75337 219209 236 292435 293556 -7765 285643
17737F4661a08310H9494a50113G4803P8254b41416d0118o8017G2535J85729J12469
$$ 64661 -108310 89494 -150113 74803 153057 -241416 -40118 -108135 72535 258264 370733
17726C70733A64321e0941I1651B7134J74013E2425k2824O3234A393K28043i1116
$$ 370733 164321 -50941 91651 27134 201147 52425 29601 92835 1393 229436 -91116
17714B11935M8725a10053n9842b9744A95297M3863I4243j3404R0373O586f2817
$$ 211935 260660 -110053 -169895 -29744 195297 239160 94243 80839 171212 177798 -62817
17702I772i9314I8787d4617e551A43122D7549b00752f6014A03291b15522r318
$$ 9772 -99314 98787 -44617 -5551 143122 47549 -200752 -66014 103291 -215522 -224840
17691b24840A82809J63308a40067k8146c9553A41392A16a38634I3041j8043a92210
$$ -224840 182809 346117 -140067 -168213 -39553 141392 116 -138634 93041 74998 -192210
17679d5683D8043L49796A77134a35873k55239A72214N6122a0135r0252b7602A49838
$$ -45683 48043 397839 177134 -135873 -391112 172214 228336 -10135 -100387 -27602 149838
17667c7529B12643g6237J1184A94763I1984c79644g5741m7744C46289A8646K08977
$$ -37529 212643 -76237 -65053 194763 91984 -379644 -75741 -123485 346289 18646 227623
17656B27623J21373d9450A23801c3365Q901B73905c7310B52465d7052b3234o4957
$$ 227623 348996 -49450 123801 -33365 -24464 273905 -37310 252465 -47052 -23234 -88191
17645h8191B9561B747Q0462a76505E7264N642b02752D19381g6472B49103A035
$$ -88191 29561 2747 83209 -176505 57264 62906 -202752 419381 -76472 249103 1035
17633H4558f271o0419B2648i9258D46362a07034q690D50553i3335O134B05836
$$ 84558 -6271 -66690 22648 -99258 446362 -107034 -115724 450553 -93335 -87201 205836
17621A03571a14216B32365a43704B26021J37516j04561r6861Q518m4693c3661
$$ 103571 -114216 232365 -143704 226021 363537 258976 162115 170633 125940 -33661
17610B43751k0861f9338A32038P8622r4535a16007A97559d13876I9683a67750
$$ 243751 222890 -69338 132038 210660 116125 -116007 197559 -413876 99683 -167750
17599C32343j06144K71364C8866e1594A2733J49266E1406N6520O1717j5747A2992
$$ 332343 226199 497563 38866 -51594 12733 161999 51406 107926 169643 153896 12992
17587A04326a8982m6689D9488a05421A32934K10521b33283G1264O2688J0446o6256
$$ 104326 -18982 -65671 49488 -105421 132934 343455 -233283 71264 133952 144398 78142
17576G8142R2246b7962n4036A55965M6965K1299N390e8355B5567M6528M7980P8942
$$ 78142 170388 -27962 -81998 155965 202930 224229 229619 -58355 25567 72095 120075 199017
17564A99017Q8573K0375L3Q7119E6544L0393J80357C4134J79916D9731B2602a0249
$$ 199017 287590 307965 307998 395117 56544 86937 267294 34134 214050 49731 22602 -10249
17551A02804i8990B39396L28442A20576c6134B28180H8972J90605q7215I3265
$$ 102804 -98990 239396 567838 120576 -36134 228180 88972 279577 192362 93265
17540A74664K32302n5738A67424p159i592k0600A06391J62365m9226R2743J46148
$$ 174664 406966 351228 167424 160265 -9592 -30192 106391 268756 219530 312273 458421
17529D58421j07305P3113J84449k46378L06952L42258K35007m73370J5330K6158
$$ 458421 351116 424229 608678 362300 669252 1011510 1246517 773147 788477 814635
17519H14635k30704l7963j98276J1917j41503R6340M8057J80764P4189M4246J64997
$$ 814635 583931 545968 347692 359609 218106 314446 362503 543267 617456 661702 826699
17508H26699j56476M17133k37087m12626K0744r8620j66737K12783E0952P7479
$$ 826699 670223 1087356 850269 437643 458387 359767 193030 405813 50952 128431
17498A28431L33436j98980E1688J83641d020B27428j8193c18370A05898j2609
$$ 128431 461867 262887 51688 235329 -4020 227428 209235 -318370 105898 93289
17488I3289K06893K99356A8849K47731Q5967I1344C1580M59230k8469A14150M1776
$$ 93289 300182 599538 18849 266580 352547 91344 31580 490810 462341 114150 155926
17477A55926K07803L7011C2112L32267n4643j02017L25814j29242m9370C1772
$$ 155926 363729 400740 32112 364379 309736 207719 533533 404291 354921 31772
17466A56582R7978a70980D22436j78979j01157A8174K09999A05515M11806A38243
$$ 156582 254560 -170980 422436 243457 142300 18174 228173 105515 517321 138243
17455B87335N761A35951J06012H5063L47315A46597J35341P3771K0568M2995j00384
$$ 287335 293096 135951 241963 85063 432378 146597 281938 355709 376277 419272 318888
17444C18888J06667K28843E8271J68700J12152p9968a37523A43768M9409L07642
$$ 318888 425555 654398 58271 226971 339123 259155 -137523 143768 193177 500819
17434E00819j82262J5199K3868j33000m8042J79835J08724A75228p1467b33985
$$ 500819 318557 333756 357624 224624 176582 356417 465141 175228 103761 -233985
17423C24997A41236J40698j1304K93040B69294N9961R1653o8312p422j33415K50916
$$ 324997 141236 281934 270630 563670 269294 329255 420908 352596 345174 211759 462675
17412D62675m2926R0514D2264g9812B35733M5608J04345A43950H551J182a2097
$$ 462675 419749 510263 42264 -79812 235733 281341 385686 143950 8551 9733 -12097
17400B77939j5584m3439J01367o4391A02752M77969i4253k38757D3451J54840
$$ 277939 262355 218916 320283 255892 102752 580721 -94253 -333010 43451 198291
17390A98291f0120B76947q074K195I6494L66936o1074B4392L24633G3970K00539
$$ 198291 -60120 276947 268873 271068 96494 463430 402356 24392 349025 73970 274509
17379B74509L2833E6334K31262h211E77425a5712C66387k172p4231j13025O812
$$ 274509 307342 56334 287596 -8211 577425 -15712 366387 364215 289984 176959 183771
17368A83771o697J12994k9326m2632k5323a41480A77279J21129K25357B3135c2095
$$ 183771 177074 290068 260742 218110 192787 -141480 177279 298408 523765 23135 -32095
17356F0338K64004A8983g1027A84964g8846B15358K61627k26784I453d9772B67071
$$ 60338 324342 18983 -71027 184964 -78846 215358 476985 250201 9453 -49772 267071
17344B18315J32541G7134a18694A3550M827O3591J6717M64723k42023n601A53919
$$ 218315 350856 77134 -118694 13550 18377 81968 98685 563408 321385 315784 153919
17332A56778J8881L3857a20617B37631K1456P1906c67064i5741E90736k57938
$$ 156778 175659 209516 -120617 237631 259087 330993 -367064 -95741 590736 332798
17322C32798j23574L50863B5218J96072a17401E34135j50211o4612A32120F2248
$$ 332798 209224 560087 25218 221290 -117401 534135 383924 319312 132120 62248
17311A26603D4091L63608A84126c1995C42447E1652M35961b05273D07797G3423
$$ 126603 44091 407699 184126 -31995 342447 51652 487613 -205273 407797 73423
17300b04401B55312g0381A17318O1046J84264A23382f623E28957B62097N1071
$$ -204401 255312 -70381 117318 178364 362628 123382 -6623 528957 262097 313168
17290C13168N6872A54150L68434B25051R3260G1312K29382j106E2776M07257B18613
$$ 313168 370040 154150 522584 225051 318311 71312 300694 299588 52776 460033 218613
17278B48033J78943a43265D37711A76203K40754j59591o6908G0701M7102L36259
$$ 248033 426976 -143265 437711 176203 416957 257366 190458 70701 117803 454062
17268D54062q3291a3376E92352a60047B47529l7732j01934R3436p390L99583B5409
$$ 454062 370771 -13376 592352 -160047 247529 209797 107863 201299 193909 593492 25409
17256G8777K79446J2110a61753d5381D48492O1164H7095K37309G7012P6291J78591
$$ 78777 358223 370333 -161753 -45381 448492 509656 87095 324404 77012 153303 331894
17245C31894l4799D8459J00091J90801G7866L02885O7050B19259K51987m1256
$$ 331894 297095 48459 148550 339351 77866 380751 447801 219259 471246 429990
17235D29990j73451j04536K5676N48857C30675R3553o6058j37424M0843N1530
$$ 429990 256539 152003 177679 726536 330675 424228 358170 220746 261589 313119
17225C13119J53725p4672E9045J25498E6150J75057o4538J22548J3581I2223L23857
$$ 313119 466844 392172 59045 184543 56150 231207 166669 289217 302798 92223 416080
17214D16080L50153g1816G94193C02615L5078L13818B43197K93496L7079B61945
$$ 416080 766233 -71816 794193 302615 337693 651511 243197 536693 573772 261945
17203C56288K05298k44973l6164K21440j54683j17797K71383j90210j29463L71363
$$ 356288 561586 316613 280449 501889 347206 229409 500792 310582 181119 552482
17193E52482j71954G1410J89260R7282m2369N9513L0479l4419j22650J22319J7388
$$ 552482 380528 71410 260670 357952 315583 375096 405575 371156 248506 370825 388213
17182C88213K57882l12511J52860n2476L4884k06565K33663p6619q0914j12470
$$ 388213 646095 333584 486444 433968 468852 262287 495950 419331 338417 225947
17172B25947J83588K11966k75186J21835j21619j31382I0068L79300j17676k5310
$$ 225947 409535 621501 346315 468150 346531 215149 90068 469368 351692 326382
17162C26382J95163j08962A47174L13571j38720L063L47102k65269o2456P8111
$$ 326382 521545 412583 147174 460745 322025 325088 672190 406921 344465 422576
17152D22576j597J62650j02018J81038j91453J80317j46768K78051A86995K91865
$$ 422576 420979 583629 481611 662649 471196 651513 504745 782796 186995 478860
17142D78860J72276k60774A34099J53582K74699F0456J79541L47531B68749Q3422
$$ 478860 651136 390362 134099 287681 562380 60456 239997 587528 268749 352171
17132C52171K40662A36960L70990k10417M5714L10450r4333M5717M0016Q8728
$$ 352171 592833 136960 507950 297533 343247 653697 559364 605081 645097 733825
17122G33825j88098k21056j05922J54583m2981O42475m81137o9206A56815M17136
$$ 733825 545727 324671 218749 373332 330351 972826 491689 422483 156815 573951
17112E73951j05714P3399L4603m6551A61675J63573J62338j46160j60731J57431
$$ 573951 468237 541636 576239 529688 161675 325248 487586 341426 180695 338126
17102C38126L20276J6355L64334C09273N38734l56465o7177M36884o8508k71545
$$ 338126 658402 674757 1039091 309273 848007 491542 424365 861249 792741 521196
17092E21196J78277k03629k47314L95284k02997L2083K8711j88199K86109o705
$$ 521196 699473 495844 248530 643814 440817 472900 501611 313412 599521 592816
17082E92816J06617J19507C81676K34294K7385P8416l05937K32824K77625l26429
$$ 592816 699433 818940 381676 615970 643355 721771 415834 648658 926283 599854
17072E99854k02369M47599j70809L6174j71853K40290j31693j43536J01731Q4038
$$ 599854 397485 845084 674275 710449 538596 778886 647193 503657 605388 689426
17062F89426C32833L94949k80566L67845o7863C60409M76120j25601j09833k1007
$$ 689426 332833 727782 447216 815061 747198 360409 836529 710928 601095 580088
17052E80088K97986j74170R052j37873K14944J1742K09663j66321L9535K58854
$$ 580088 878074 703904 712956 575083 790027 801769 1011432 845111 884646 1143500
17042A143500l94733q1218k1039J72966l2736K44024J6001m50192M867j41727
$$ 1143500 748767 667549 646510 819476 786740 1030764 1046765 596573 601440 459713
17032D59713L91906J07563J24034m91621J98878J87435l25795K9066j2186o9588
$$ 459713 851619 959182 1083216 591595 790473 977908 652113 681179 668993 599405
17022E99405L7520M26208p7962o1771J44947j21579q9443L51844m32446K2990
$$ 599405 636925 1063133 985171 923400 1068347 946768 857325 1209169 776723 799713
17012G99713K66281l85560J87081K44549R4612k80034N9982Q6476Q5850o9217
$$ 799713 1065994 680434 867515 1112064 1206676 926642 986624 1073100 1158950 1089733
17002A089733m36238L20592O4392L45P701J8320l76576M43488j60989J31855j65343
$$ 1089733 653495 974087 1038479 1038824 1046525 1064845 688269 1131757 970768 1102623 937280
16991I37280O8120J91828l0038q6324m236n3544k8349j4948J58566R0437j23147
$$ 937280 1005400 1197228 1167190 1080866 1076630 1023086 994737 979789 1138355 1228792 1105645
16980A105645l49920L71111L5051L12521j83330R1230l92324L74875j08313m49304
$$ 1105645 755725 1126836 1161887 1474408 1291078 1382308 989984 1364859 1256546 807242
16970H07242J15822K27042j06995n3916K09542J61130K1482j13045l08917N52311
$$ 807242 923064 1150106 1043111 989195 1198737 1359867 1381349 1268304 959387 1511698
16960A511698j72800l0734m3287J76249J15205j42485l6168J44432n13999Q65327
$$ 1511698 1338898 1308164 1264877 1441126 1556331 1413846 1377678 1522110 1008111 1873438
16950A873438m58878j13971J60694j36876N5497M77795l26858N683l01311K00252
$$ 1873438 1414560 1300589 1461283 1324407 1379904 1857699 1530841 1536524 1235213 1435465
16940A435465P319j2168M04923o77050N76221k46756J20309J86645j79771J61601
$$ 1435465 1442784 1430616 1835539 1158489 1734710 1487954 1608263 1794908 1615137 1776738
16930A776738K85210j31891j60489M6911L99407m43735J13652l13570M63570n2126
$$ 1776738 2061948 1930057 1769568 1816479 2215886 1772151 1885803 1572233 2035803 1983677
16920A983677K7242k66489K90862J96533n67185M60900j87059K5066L74957l6538
$$ 1983677 2010919 1744430 2035292 2231825 1664640 2125540 1938481 1963547 2338504 2301966
16910B301966J0764m08603M65280P7229n80906N48430p2889n4802J17424q2677
$$ 2301966 2312730 1904127 2369407 2446636 1865730 2414160 2341271 2286469 2403893 2321216
16900B321216J62335j73563L53452k18833j3813Q201J95820M3464k25790K25160
$$ 2321216 2483551 2309988 2663440 2444607 2430794 2438995 2634815 2678279 2452489 2677649
16890B677649J99354n49128M60045j36869m3347j34617M54798j30584J28854m5739
$$ 2677649 2877003 2327875 2787920 2651051 2607704 2473087 2927885 2797301 2926155 2880416
16880B880416J20223L09684K3258m48832K15062J95385j88364K06960k04963J31078
$$ 2880416 3000639 3310323 3333581 2884749 3099811 3295196 3106832 3313792 3108829 3239907
16870C239907J83189k79000N24131r2373K7505J83645n76468O12689K82071l65866
$$ 3239907 3423096 3144096 3668227 3575854 3603359 3787004 3210536 3823225 4105296 3739430
16860C739430p1413L31751K07575l31597j6834L93090O5477O6241k08107N76269
$$ 3739430 3668017 3999768 4207343 3875746 3858912 4252002 4317479 4383720 4175613 4751882
16850D751882k13114q8844L2373J71646K95170k78072J26201L16043j70617M18486
$$ 4751882 4538768 4449924 4482297 4653943 4949113 4671041 4797242 5113285 4942668 5361154
16840E361154l02506M34697P3501K2268J81445j22516K30227q8134N0746M07348
$$ 5361154 5058648 5493345 5566846 5589114 5770559 5648043 5878270 5790136 5840882 6248230
16830F248230q3865J31200J41142k99089K68194N31936K09481l84422M14382m4388
$$ 6248230 6164365 6295565 6436707 6137618 6405812 6937748 7147229 6762807 7177189 7132801
16820G132801K90222N9898K83951L842J67129L1118M08952k65538N77596J04083
$$ 7132801 7423023 7482921 7766872 7770714 7937843 7968961 8377913 8112375 8689971 8794054
16810H794054J31571K57363L42981j62663M66634K41989K90545j04754K98996
$$ 8794054 8925625 9182988 9525969 9363306 9829940 10071929 10362474 10257720 10556716
16801A0556716M44156J72029L2470P63080j38308J65700N04517M92002j10701
$$ 10556716 11000872 11172901 11205371 11968451 11830143 11995843 12500360 12992362 12881661
16792A2881661O31710K75978N43330L42348J99543M72819J59030R50638O7430
$$ 12881661 13513371 13789349 14332679 14675027 14874570 15347389 15506419 16457057 16524487
16783A6524487M07505K95970P04356P41586M58124L96403O71815L29709L75840
$$ 16524487 16931992 17227962 17932318 18673904 19132028 19528431 20200246 20529955 20905795
16774B0905795J066213N23991J180491M08075Q48620O69331P37728J337642M43295
$$ 20905795 21972008 22495999 23676490 24084565 24933185 25602516 26340244 27677886 28121181
16765B8121181J313093O64156J194499J007046R47356J470933J221735J717060
$$ 28121181 29434274 30098430 31292929 32299975 33247331 34718264 35939999 37657059
16757C7657059J192659J159276J633426J619795J093712J928090J954302J659729
$$ 37657059 38849718 40008994 41642420 43262215 44355927 46284017 48238319 49898048
16749D9898048K259527K046602K324740J660223K017734K533665K335908K712714
$$ 49898048 52157575 54204177 56528917 58189140 60206874 62740539 65076447 67789161
16741F7789161K798322K406744K479317L085242K540866K777343K615736K759137
$$ 67789161 70587483 72994227 75473544 78558786 81099652 83876995 86492731 89251868
16733H9251868K746035K540095K642875K199541K219778K180708J647675J729701
$$ 89251868 91997903 94537998 97180873 99380414 101600192 103780900 105428575 107158276
16725A07158276J481550P10834J104358L04132j01359l636n29306q54111j440685
$$ 107158276 108639826 109350660 110455018 110759150 110657791 110654155 110124849 109270738 107830053
16716A07830053j309371j503638j853808k328312k084561k350149k774512k546155
$$ 107830053 106520682 105017044 103163236 100834924 98750363 96400214 93625702 91079547
16708I1079547k923933k626370k699904l015461k797487k560021k658542k685988
$$ 91079547 88155614 85529244 82829340 79813879 77016392 74456371 71797829 69111841
16700F9111841k836145k011212k664134k631767j858097k442339j981898j849558
$$ 69111841 66275696 64264484 61600350 58968583 57110486 54668147 52686249 50836691
16692E0836691k277351j940756j399196k026090j508623j585289j554267j228543
$$ 50836691 48559340 46618584 45219388 43193298 41684675 40099386 38545119 37316576
16684C7316576j861472j040057j056591r58389j273176j342270o11294j254803
$$ 37316576 35455104 34415047 33358456 32400067 31126891 29784621 29173327 27918524
16676B7918524r36109q69302j036600n30347j161162o20872n74704j058479o85517
$$ 27918524 26982415 26113113 25076513 24546166 23385004 22764132 22189428 21130949 20445432
16667B0445432m62267n66989k03309j001022j85834m94544p96959j44810o81037
$$ 20445432 19983165 19416176 19212867 18211845 18026011 17531467 16734508 16589698 15908661
16658A5908661j38382p04969l19804n29235J3861o64735m66538l81008j08285
$$ 15908661 15770279 15065310 14745506 14216271 14230132 13565397 13098859 12717851 12609566
16649A2609566j94371m00857k94894j88718m70527k95750l97066K7966m69246
$$ 12609566 12415195 12014338 11719444 11530726 11060199 10764449 10367383 10395349 9926103
16640I926103O0415q6221n60822k9222j59566k58368j42597k66038k46188k71996
$$ 9926103 9986518 9900297 9339475 9310253 9150687 8892319 8749722 8483684 8237496 7965500
16630G965500P3327n87247L60775k13349k81213l11917j926J32653k38826m85376
$$ 7965500 8038827 7451580 7812355 7599006 7317793 7005876 7003950 7136603 6897777 6412401
16620F412401P7856j21244k49835J4707p4487l17740J1341J32901m53899j42565
$$ 6412401 6490257 6369013 6119178 6133885 6059398 5741658 5752999 5885900 5432001 5289436
16610E289436J62813l20739J93553j56690J83410j52857m07637M69350o26637
$$ 5289436 5452249 5131510 5325063 5168373 5351783 5198926 4791289 5260639 4634002
16601D634002j68657K4612K9939J41463l65716L45764l79691j66550o068R8516
$$ 4634002 4465345 4489957 4519896 4661359 4295643 4641407 4261716 4095166 4089098 4187614
16591D187614j28424j28659k63781K9641N8203M9216j04370j53586Q0292k11759
$$ 4187614 4059190 3930531 3666750 3696391 3754594 3803810 3699440 3545854 3626146 3414387
16581C414387o821k9386j6813Q3524k1321j57866j76624o0954L7291m8217P8406
$$ 3414387 3407566 3378180 3361367 3444891 3423570 3265704 3089080 3028126 3065417 3017200 3095606
16570C095606j06826M6677J24343r9827n13070L75997l658k55940Q7180k8879
$$ 3095606 2988780 3035457 3159800 3059973 2546903 2922900 2919242 2663302 2750482 2721603
16560B721603k67974J80781J23676l12498J91929n9248L5888m70765L62915j52139
$$ 2721603 2453629 2634410 2758086 2445588 2637517 2578269 2614157 2143392 2506307 2354168
16550B354168P8298j99624M16915l87722l1064J31940m37189l8376K0193J19422
$$ 2354168 2432466 2232842 2649757 2262035 2230971 2362911 1925722 1887346 1907539 2026961
16540B026961o406j75400K56005j49493J7551j84184M53793m12015o062j58039
$$ 2026961 2020555 1845155 2101160 1951667 1969218 1785034 2238827 1826812 1820750 1662711
16530A662711q8276M98422m65547j13642j59251O71741l76670l9353J87329j96388
$$ 1662711 1574435 2072857 1607310 1493668 1334417 2006158 1629488 1590135 1777464 1581076
16520A581076K34781k76177k59243J36872J81760m7591o5063J03863k37896q368
$$ 1581076 1815857 1539680 1280437 1417309 1599069 1551478 1486415 1590278 1352382 1344014
16510A344014K03943M0281m7110Q6456k08029o9613L69268k18930n3366J82397
$$ 1344014 1547957 1588238 1541128 1627584 1419555 1349942 1719210 1500280 1446914 1629311
16500A629311o33339J56896J97637q9739J33466k68763j56436J90826J61426q270
$$ 1629311 995972 1152868 1350505 1260766 1394232 1125469 969033 1159859 1321285 1313015
16490A313015l49904L11294R5060k81713L2122J35506J37237k06760J87829k70353
$$ 1313015 963111 1274405 1369465 1087752 1119874 1255380 1392617 1185857 1373686 1103333
16480A103333k31993K3889J14195K29895j77112K33288j62466j70866q6024n2113
$$ 1103333 871340 895229 1009424 1239319 1062207 1295495 1133029 962163 876139 824026
16470H24026K61593r777p519J59757j71522k79795r2267J77363K80592J01839
$$ 824026 1085619 1075842 1068323 1228080 1056558 776763 684496 861859 1142451 1244290
16460A244290j93038J04899m6284l19900J1446j64906K93738N7286m7791k3357
$$ 1244290 1051252 1156151 1109867 789967 801413 636507 930245 987531 939740 916383
16450I16383q2934K29405l20284J26431j33795O8172J29477l23032J13761j19116
$$ 916383 833449 1062854 742570 869001 735206 803378 932855 609823 723584 604468
16440F04468J44021J64307k52802J02274j81249j18681M39358j68560Q4675p5238
$$ 604468 748489 912796 659994 762268 581019 462338 901696 733136 817811 742573
16430G42573N9046l06695M42753D43035J09966K74015l87122J94284P1966k29250
$$ 742573 801619 494924 937677 443035 553001 827016 439894 634178 706144 476894
16420D76894N9430N629J42982j08352l511K72399j01180l0551j27649N3490P7584
$$ 476894 536324 541953 684935 576583 573072 845471 744291 713740 586091 639581 717165
16409G17165j22250j15736J30829n3401J04154J40684l13752q6258J06690J21524
$$ 717165 594915 479179 610008 556607 660761 801445 487693 401435 508125 629649
16399F29649r8586K2861o402L7034l8058J5212q8546J36386M9299L25278D03491
$$ 629649 531063 553924 547522 584556 546498 561710 473164 609550 658849 984127 403491
16387E18422P725K4312B24514M14233J27829o8745J63595D10238A29300N33781
$$ 518422 526147 550459 224514 638747 766576 697831 861426 410238 129300 663081
16377F63081N9453l20930J84927j39898K507J89091j08839K22687r9282M6311
$$ 663081 722534 401604 586531 446633 449140 638231 529392 752079 652797 699108
16367F99108k16568r0539K54700p9711k5766B61373N67662C86088o3429m0959
$$ 699108 482540 392001 646701 566990 541224 261373 829035 386088 322659 281700
16357B81700Q092J70916j20748L40803k83298J0395A96033M74734B21715J50383
$$ 281700 289792 460708 339960 680763 397465 407860 196033 670767 221715 372098
16347C72098O6577J05749A94135L29875j34298m673A88622N4758K25772j6697
$$ 372098 438675 544424 194135 524010 389712 385039 188622 243380 469152 452455
16337D52455j956k8170a74742B01436l9009K79663K3345j85722P0905N2315e9290
$$ 452455 450499 422329 -174742 201436 162427 442090 465435 279713 350618 402933 -59290
16325C96484K82466B74718m4270o3571L18490A01706J5006M02741j24484Q0788
$$ 396484 678950 274718 230448 166877 485367 101706 116712 519453 394969 475757
16315D75757m706j28130j269l4112o4842J56727A27334L67295n1137k19115Q7123
$$ 475757 471051 342921 341652 307540 242698 399425 127334 494629 443492 224377 311500
16304C11500L0614j625K2980M001P6336j27056H3175J14784J71201o3751J4003
$$ 311500 342114 340489 363469 367470 443806 316750 83175 197959 369160 305409 319412
16293C19412H9342M46056E4059K82566m3575k5820r492P5994l0929K33128j96596
$$ 319412 89342 535398 54059 336625 293050 267230 257738 333732 302803 535931 339335
16282C39335J82357I4011J14829Q8909Q6460K80950A07548m3160K19759r2197
$$ 339335 521692 94011 208840 297749 384209 665159 107548 64388 284147 191950
16272A91950q4840P8513J62750l6050A0702K83096J87873A83989K78401k18881
$$ 191950 107110 185623 348373 312323 10702 293798 481671 183989 462390 243509
16262B43509J20501A18401Q2293O3404H223M50722j53804P1555A49918Q740J54099
$$ 243509 364010 118401 200694 264098 8223 458945 305141 376696 149918 158658 312757
16251C12757q8964J17975A26618J01599K50846k37341J7584J02821D4230M15617
$$ 312757 223793 341768 126618 228217 479063 241722 259306 362127 44230 459847
16241D59847j22780D5338K91952J46955a8800B27270L1880C5157P3761b66269
$$ 459847 337067 45338 337290 484245 -18800 227270 259150 35157 108918 -266269
16230A74279H2349j2859J24106F350f0717g260C57861A353N4036K33811l4303
$$ 174279 82349 69490 193596 6350 -60717 -7260 357861 1353 55389 289200 254897
16219B54897J73779f017A88585L38832B15571J05915a30573B07497l5474j5025
$$ 254897 428676 -6017 188585 527417 215571 321486 -130573 207497 172023 156998
16209A56998a26664E4712M80439A89410k5455j2678o8302J91905J96759f5775
$$ 156998 -126664 54712 535151 189410 163955 151277 82975 274880 471639 -65775
16198B49973O5624E0739a95276H9354a38999L7387m7560A28414l9925b5723o5850
$$ 249973 315597 50739 -195276 89354 -138999 -101612 -149172 128414 88489 -25723 -91573
16187i1573B40018a6060C32159g4850C71736I3704R0399d6786A65140J85755j42393
$$ -91573 240018 -16060 332159 -74850 371736 93704 184103 -46786 165140 350895 208502
16176B08502g1804B53838M7667j39339K26738A47654j261h1747B05543M0197a32427
$$ 208502 -71804 253838 301505 162166 388904 147654 146393 -81747 205543 245740 -132427
16164f6289A18017L3046R693k9416m9668b8027A9440J50422b18489P1327O5647
$$ -66289 118017 151063 160756 131340 81672 -28027 19440 169862 -218489 -147162 -81515
16153h1515E1661K06037c39245f0277B91369J03291A14135J37834R0801a06569
$$ -81515 51661 257698 -339245 -60277 291369 394660 114135 251969 342770 -106569
16142A39215f757G5975Q6383m0658f462I8201Q3600F8069B14K33883j11740O720
$$ 139215 -6757 75975 162358 121700 -6462 98201 181801 68069 214 234097 122357 129077
16130A29077K98710a72627A66174a4715H3218J00852a34284B65397O0757A17182
$$ 129077 427787 -172627 166174 -14715 83218 184070 -134284 265397 326154 117182
16119c4623o805m5147a3699A04591J4878a72263H6232a99732i8859o9718C65488
$$ -34623 -41428 -86575 -13699 104591 119469 -172263 86232 -199732 -98859 -168577 365488
16107C35750a22540a1784D56639G4443L5546K12265a20963B39621f5063B93207
$$ 335750 -122540 -11784 456639 74443 109989 322254 -120963 239621 -65063 293207
16096A43155E658e577B20505a16270F8488C400K15645p8719a62090D6697j8368
$$ 143155 5658 -5577 220505 -116270 68488 3400 219045 140326 -162090 46697 28329
16085B8329e7609C04809h883A76562g7391B1922f2843B77609J64210i5122D752
$$ 28329 -57609 304809 -8883 176562 -77391 21922 -62843 277609 441819 -95122 4752
16073A1168a83782p6458a9654j07779E4352a00677B60956d1923o1812F8111a39596
$$ 11168 -183782 -260240 -19654 -127433 54352 -100677 260956 -41923 -103735 68111 -139596
16061b15954e3950A39307J24626A8972b73067a09433A96132g2600c0230k04963
$$ -215954 -53950 139307 263933 18972 -273067 -109433 196132 -72600 -30230 -235193
16051b35193D6693a63893g0838A39978P2389a81438n84K3983A02358m0662h8302
$$ -235193 46693 -163893 -70838 139978 212367 -181438 -182022 -158039 102358 61696 -88302
16039E0655A7525a53761A43076C3326b38150e1488n3840b9049A4917K14155b24563
$$ 50655 17525 -153761 143076 33326 -238150 -51488 -105328 -29049 14917 229072 -224563
16027A08153a2952A97137a58535B68628a44985p5443A34486Q0205D7614K07288
$$ 108153 -12952 197137 -158535 268628 -144985 -220428 134486 214691 47614 254902
16017B54902d703k05345C036c58334B40480c648A23133L0706K5578L9284r9115
$$ 254902 -4703 -210048 3036 -358334 240480 -3648 123133 153839 179417 218701 119586
16006A19586L84827H3649b0784Q867r0052A49406a10239A26583J66149b17054
$$ 119586 504413 83649 -20784 -11917 -101969 149406 -110239 126583 292732 -217054
15995C5501M4119J32040o0414N0413f5529m4142E9570Q6187N49706k07128Q94429
$$ 35501 79620 211660 151246 201659 -65529 -109671 59570 145757 695463 488335 1382764
15984A382764k50137L03867o80439K47063D79808k37515R5584b10368F9831J60853
$$ 1382764 1132627 1436494 756055 1003118 479808 242293 337877 -210368 69831 230684
15974B30684j7752B4867L3642a16720d2608C73872j55249r2740n6791a07747g069
$$ 230684 212932 24867 58509 -116720 -42608 373872 218623 125883 69092 -107747 -7069
15962b7772k61769i1286j61534E3300b48991a07528o1177C6116J63129P1493r4562
$$ -27772 -289541 -91286 -252820 53300 -248991 -107528 -168705 36116 199245 270738 176176
15951A76176b720l25447e9526k8628j95951R3511d2172F0383j6125a02518G8876
$$ 176176 -2720 -328167 -59526 -88154 -284105 -190594 -42172 60383 44258 -102518 78876
15939A46975l6872m6153o321b03153A35846f5729O807j38218h6715J9152b8835
$$ 146975 110103 63950 57629 -203153 135846 -65729 -58922 -197140 -86715 -67563 -28835
15927C5085m202K15351c63341a62755O14l19286b05626A67643J41427F7952g353
$$ 35085 30883 246234 -363341 -162755 -162141 -481427 -205626 167643 309070 67952 -7353
15915b87952A54519a60917E5442a92040h0274k08288A43819a70062C8171b074
$$ -287952 154519 -160917 55442 -192040 -80274 -288562 143819 -170062 38171 -2074
15904C18555C0890M6504b52852n6675A21737b9852B1607J12985a3906l6792k65115
$$ 318555 30890 77394 -252852 -309527 121737 -29852 21607 134592 -13906 -50698 -315813
15893c15813A83926K5007b87013d3105l5421B3797a9829C2878M177J1361B3856
$$ -315813 183926 208933 -287013 -43105 -78526 23797 -19829 32878 37055 48416 23856
15881C0240i9054A16872c41050a31910j0299A26552a26087G0497A4734h1635q1842
$$ 30240 -99054 116872 -341050 -131910 -142209 126552 -126087 70497 14734 -81635 -163477
15870a63477B27471m5831b48554A44365n9869i1890n1494B9096h3063q1528j28606
$$ -163477 227471 181640 -248554 144365 84496 -91890 -143384 29096 -83063 -164591 -293197
15859b93197K3046B03407a18349j13711k05207J41103B84010a36083b954k69291
$$ -293197 -270151 203407 -118349 -232060 -437267 -296164 284010 -136083 -2954 -272245
15849b72245E0480a39382p5897A30431A1625L1875f8737C0376d4401o7938o2464
$$ -272245 50480 -139382 -215279 130431 11625 43500 -68737 30376 -44401 -112339 -174803
15838a74803g2374k65031a4487A30060J17652a30028L1459E0698P1180a10501
$$ -174803 -72374 -337405 -14487 130060 247712 -130028 -98569 50698 121878 -110501
15827E5606b62552a2118H8266l5631a39742B4770a22928B465a80811I3618R0497
$$ 55606 -262552 -12118 88266 52635 -139742 24770 -122928 2465 -180811 93618 184115
15816A84115J4764h7731m21174O1937a26817A97522d23513C21986b65561a12145
$$ 184115 198879 -87731 -508905 -446968 -126817 197522 -423513 321986 -265561 -112145
15805a96072i2738E4347a45909K7553O92B28261A0738g6782F4205N387B2410M672
$$ -196072 -92738 54347 -145909 -118356 -117664 228261 10738 -76782 64205 69592 22410 27082
15793B7082c00776C45921a45881d3114k80276b7823C0204i81A5917M8413c08089
$$ 27082 -300776 345921 -145881 -43114 -323390 -27823 30204 -981 15917 64330 -308089
15781H8789M8638C2064K67225h5577q6338d3221I102c605n9775o3178N8156b9683
$$ 88789 137427 32064 299289 -85577 -171915 -43221 9102 -3605 -63380 -126558 -68402 -29683
15768a9138G8901R5823i0025j89219b0803B8237b9090A22325a2145j78913O8590
$$ -19138 78901 174724 -90025 -279244 -20803 28237 -29090 122325 -12145 -191058 -122468
15757a22468b3806C63038b00518K3337c2999B76070E0569h6461D9640a47722A22843
$$ -122468 -23806 363038 -200518 -177181 -32999 276070 50569 -86461 49640 -147722 122843
15745C7397j4434N0589J07728b63014A86494C2554K00392a63207A18212g5578
$$ 37397 22963 73552 181280 -263014 186494 32554 232946 -163207 118212 -75578
15734A66268F0388b60396A76175m3123L091C438O4062l568e35885a43801B7852
$$ 166268 60388 -260396 176175 133052 136143 3438 67500 63932 -535885 -143801 27852
15722h2590j78951o9258l1962G6541c68600J51714j9484e1822A80596B004K02492
$$ -82590 -261541 -330799 -362761 76541 -368600 -216886 -236370 -51822 180596 2004 204496
15711B04496c1096A43a98774a6495G0538c17215A09743c28543B27948d4774j56993
$$ 204496 -31096 143 -198774 -16495 70538 -317215 109743 -328543 227948 -44774 -201767
15700b01767M7981b3411k9594j4962k30077J19780k38774B4359i3887j35903A38281
$$ -201767 -153786 -23411 -53005 -67967 -298044 -178264 -417038 24359 -93887 -229790 138281
15688h3765A58366J13866A13986d4493J5649q6041A28766D8180j893a6504B2241
$$ -83765 158366 272232 113986 -44493 -28844 -114885 128766 48180 46287 -16504 22241
15676c08746B8227c33999A01353d8426r0612G9638b4244n0897C3376a32923A41984
$$ -308746 28227 -333999 101353 -48426 -139038 79638 -24244 -75141 33376 -132923 141984
15664d65357a50621o3384E0204J60107D7444f0718R906d844l01216A13933k9617
$$ -465357 -150621 -214005 50204 210311 47444 -60718 -50812 -4844 -306060 113933 84316
15653H4316a38531M8304k16128G039b84814L3309G6037B1092R5541J40279k1630
$$ 84316 -138531 -90227 -306355 7039 -284814 -251505 76037 21092 116633 256912 235282
15642B35282F3165i7669K0714A29220L1923D8469b16326B19879c04657f8244A68478
$$ 235282 63165 -97669 -76955 129220 161143 48469 -216326 219879 -304657 -68244 168478
15630a1440J055k7540j4505n7943j0866L1756b1926g014B3860M1913J34551a33281
$$ -11440 -10385 -37925 -52430 -110373 -121239 -89483 -21926 -7014 23860 65773 200324 -133281
15617A05818e3787j70836a01141A57482B5390N21J03764k9759b85978C31556h8113
$$ 105818 -53787 -224623 -101141 157482 25390 25911 129675 99916 -285978 331556 -88113
15605B94948a28411e8738k45201A10618J03917b15790i3316k4042j19966C1991
$$ 294948 -128411 -58738 -303939 110618 214535 -215790 -93316 -117358 -237324 31991
15594a38410c1950F3703a25492a7169p0040k45714f0143A81476G5698f58D67d5570
$$ -138410 -31950 63703 -125492 -17169 -87209 -332923 -60143 181476 75698 -658 467 -45570
15581A79841B9897j0023K685h5966k44247B7107b93904A69078J6489J01265b33015
$$ 179841 29897 19874 22559 -85966 -330213 27107 -293904 169078 185567 286832 -233015
15569h8765G6886b93411a11662n6870C40644d2652k2046k44566J53582B37544
$$ -88765 76886 -293411 -111662 -168532 340644 -42652 -64698 -309264 -155682 237544
15558d8652B21251h5714A984a35009K1142B05817a03212D5725h285F0185a28325
$$ -48652 221251 -85714 1984 -135009 -113867 205817 -103212 45725 -8285 60185 -128325
15546b385E323J6014o493a65114o9897c8307B54473A18548E1390a94586B01273
$$ -2385 5323 21337 14844 -165114 -235011 -38307 254473 118548 51390 -194586 201273
15534g7499B1738J93587b41624A543K61957a63395A41069a95144M1599A93540
$$ -77499 21738 215325 -241624 1543 263500 -163395 141069 -195144 -153545 193540
15523A75867C9172j4943K19702b71102C30903c1961r1932d7368C19607j00856
$$ 175867 39172 24229 243931 -271102 330903 -31961 -123893 -47368 319607 218751
15513B18751K53523G0928O4489J70559O1421G8114c619A71634k3086c426C57356
$$ 218751 472274 70928 135417 305976 367397 78114 -3619 171634 148548 -3426 357356
15501B09999L3182c47714e2494o6905d1178l31870I239L14356f5323B29529j06510
$$ 209999 243181 -347714 -52494 -119399 -41178 -373048 9239 323595 -65323 229529 123019
15490A23019k3692Q5441c4500i580A45663L8631M2262b54572A90260k303c11198
$$ 123019 99327 184768 -34500 -9580 145663 184294 226556 -254572 190260 187957 -311198
15478A07303K92259a32998A38568J25361M44147q5408k57026O1703J48047j32654
$$ 107303 399562 -132998 138568 263929 708076 622668 365642 427345 575392 442738
15468D42738h2659J5030B2483H680K28662a75589h3836C7942R027K37182f9369
$$ 442738 -82659 -67629 22483 8680 237342 -175589 -83836 37942 46969 284151 -69369
15456B69676B7866J90017a47298K0302j27450C43526j60209i6340h557E7910A2532
$$ 269676 27866 217883 -147298 -126996 -254446 343526 183317 -96340 -8557 57910 12532
15444B18884k7804g2499E59151k11836R89992j5386k82602D13913a75293B82785
$$ 218884 191080 -72499 559151 347315 1337307 1321921 1039319 413913 -175293 282785
15433B67998A2598J8903e3125j54426g8819A38074b6919h10I8913O832q297k4493
$$ 267998 12598 31501 -53125 -207551 -78819 138074 -26919 -810 98913 105745 97448 72955
15421G2955k4034d07735h4303k9791C24155b9247k49262A95844n4820a20625q4548
$$ 72955 48921 -407735 -84303 -114094 324155 -29247 -278509 195844 141024 -120625 -205173
15410b05173f041F9197a07858F6929M3721Q3038b26645G2234c3777H5049b35182
$$ -205173 -6041 69197 -107858 66929 110650 193688 -226645 72234 -33777 85049 -235182
15398b42051B5054J20624c14887H0067a34872j59923B93088b7028A54815a00425
$$ -242051 25054 145678 -314887 80067 -134872 -294795 293088 -27028 154815 -100425
15387a88460B10407i494o611r6909B1263J6328C077c03619J2269B4212b5952H5581
$$ -188460 210407 -9494 -16105 -113014 21263 37591 3077 -303619 -291350 24212 -25952 85581
15374H279K00841g3144B19197K4066L8936a46967H7235b4280A74816D7532L4086
$$ 8279 209120 -73144 219197 243263 282199 -146967 87235 -24280 174816 47532 81618
15363H1618a27787J4039C27738C9880M14126j83424E5219M96043B14382A02014
$$ 81618 -127787 -113748 327738 39880 454006 270582 55219 551262 214382 102014
15352B16988G8491K56891o3204A15912i125A93190r6211P1248M972A0687M30355
$$ 216988 78491 335382 272178 115912 -9125 193190 96979 168227 173199 10687 441042
15341D41042j04292K345A58698L818p1701h5180l2626j50967B09131a22614B27007
$$ 441042 336750 339095 158698 162516 90815 -85180 -117806 -268773 209131 -122614 227007
15329f5126f389m6851A67675M74720i3894B49266j22359b2533G7051r198K38049
$$ -65126 -6389 -53240 167675 642395 -93894 249266 126907 -22533 77051 67853 305902
15318C05902m7842i9033J2376E380J54108A1393J89465R7722j30785M7515I6257
$$ 305902 258060 -99033 -86657 5380 159488 11393 200858 298580 167795 215310 96257
15306A8780N5995h1888A53885J81082A591K73942A0565K14930E4260b050r2854
$$ 18780 74775 -81888 153885 334967 1591 275533 10565 225495 54260 -2050 -94904
15295i4904b4149q7445A17257L9165k8780b31507H4514a38650I6561k4996b16512
$$ -94904 -24149 -111594 117257 156422 127642 -231507 84514 -138650 96561 71565 -216512
15283B06042I4135b30334A21406D7737d3424j24013A15975J06423A08745d9544
$$ 206042 94135 -230334 121406 47737 -43424 -167437 115975 222398 108745 -49544
15272E5550L58120j37790H3180j5886J28110E9747a34022n459f715j13373c4069
$$ 55550 413670 275880 83180 67294 195404 59747 -134022 -139481 -6715 -120088 -34069
15260h3888f689k75578b7975J0077A52284b66764B50238A9797K9360a64517m6156
$$ -83888 -6689 -282267 -27975 -17898 152284 -266764 250238 19797 49157 -164517 -210673
15249b10673A05783d2669I7487a26223a4892C38030J64770Q29662L56345o39802
$$ -210673 105783 -42669 97487 -126223 -14892 338030 502800 1332462 1688807 1049005
15239A049005N35198k43009B67486m6649D9754c110B65089j24357K16055r0796
$$ 1049005 1584203 1341194 267486 220837 49754 -3110 265089 140732 356787 265991
15229B65991r8408e4396I3797B4706c1047B75569h2876j72650A20735f6895b7299
$$ 265991 167583 -54396 93797 24706 -31047 275569 -82876 -255526 120735 -66895 -27299
15217A47061C1770K62884n2115a09849A293a61784c5824I7025b153A0694k680
$$ 147061 31770 294654 242539 -109849 1293 -161784 -35824 97025 -2153 10694 8014
15206H014K18127b85209J39080A67366a13641F0158M20673b4076l01873a14511
$$ 8014 226141 -285209 -146129 167366 -113641 60158 480831 -24076 -325949 -114511
15195B41538Q7594a41709K7285q0742C1111K19885d4891j91081I4904J2671A0019
$$ 241538 329132 -141709 -114424 -195166 31111 250996 -44891 -235972 94904 107575 10019
15183B58473c24616A0997c28661B81361m0006n6951E5928K06082a34490B9199
$$ 258473 -324616 10997 -328661 281361 241355 184404 55928 262010 -134490 29199
15172E3496B4028i7831K4800B08131q7238a61429D29Q1232b2969k52601D69872
$$ 53496 24028 -97831 -73031 208131 120893 -161429 429 81661 -22969 -275570 469872
15160e7336B26868a26543A00477b5836j72793A81308m0318a04992b6930C6516
$$ -57336 226868 -126543 100477 -25836 -198629 181308 140990 -104992 -26930 36516
15149i0955I3394P7187D0764d8753r3815F2332b75167b7987o9282D24721C476
$$ -90955 93394 170581 40764 -48753 -142568 62332 -275167 -27987 -97269 424721 3476
15137B31378K91350g2125j87340g7578D4151J43527D4268O3118J02999g3155o4000
$$ 231378 522728 -72125 -259465 -77578 44151 187678 44268 107386 210385 -73155 -137155
15126a37155C09016G8201B4430e3024d396j34336A54434Q3448L55755j44816i5849
$$ -137155 309016 78201 24430 -53024 -4396 -138732 154434 237882 593637 448821 -95849
15114B61949j04414Q9590C5874h6261A77781b08892M9742B35250L936r6528m0432
$$ 261949 157535 247125 35874 -86261 177781 -208892 -159150 235250 239186 142658 102226
15103A02226K9334e5444B22385J08345a11190p1051A31464F1629J01286m0813
$$ 102226 131560 -55444 222385 330730 -111190 -182241 131464 61629 162915 122102
15093A22102K7724G1411A4288L9343Q6397L5387q5118M6926O6939a10878m181
$$ 122102 149826 71411 14288 53631 140028 175415 90297 137223 204162 -110878 -115059
15082a15059c2467j09444C45598a09021A90896F4775G166L3413K42383G0535J25866
$$ -115059 -32467 -141911 345598 -109021 190896 64775 7166 40579 282962 70535 196401
15071A96401J02114A35946B8076L21033a31069A96603a17139D28486e676j1666
$$ 196401 298515 135946 28076 349109 -131069 196603 -117139 428486 -5676 -17342
15061a7342A02159B3317K38977J45587j66656k083I7419N4498A128K09540R5515
$$ -17342 102159 23317 262294 407881 241225 239142 97419 151917 1128 210668 306183
15050C06183o3037L17124H3833J26783K34237K39232C07496B3834J72711o5051
$$ 306183 243146 560270 83833 210616 444853 684085 307496 23834 196545 131494
15040A31494K89067j91688A13781M05219j78809j21537M66185B96728q9350p0125
$$ 131494 420561 228873 113781 519000 340191 218654 684839 296728 207378 137253
15030A37253R2546K4527N63359o1133l14498Q6454A03495L79871A83938j1662
$$ 137253 229799 254326 817685 756552 442054 528508 103495 483366 183938 172276
15020A72276M3196l5111L66191B52034J83203q722J68459j96805K18151j01206
$$ 172276 215472 180361 546552 252034 435237 426515 594974 398169 616320 515114
15010E15114M6714B65684k2401L22055o8297A75434J86870A2869L06314L2423
$$ 515114 561828 265684 243283 565338 497041 175434 362304 12869 319183 351606
15000C51606j33022K98087B36556K17670j26232j27005M09747A86294m9164Q0526
$$ 351606 218584 516671 236556 454226 327994 200989 610736 186294 137130 217656
14990B17656R6918K32615K178B40607R0226Q0858q5915q1397K56102K16792q717
$$ 217656 314574 547189 549367 240607 330833 411691 325776 244379 500481 717273 708556
14979G08556q5195j28138O7732J61754C57664J85431k40948A08395N04042K06351
$$ 708556 623361 495223 562955 724709 357664 543095 302147 108395 612437 818788
14969H18788k09004j78015R8240L253o4071j74988J57131j55106J91010k15477
$$ 818788 609784 431769 530009 533262 469191 294203 451334 296228 487238 271761
14959B71761J98608j51867K0563a01963D09897j44924j31787L72270D3527k0002
$$ 271761 470369 318502 339065 -101963 409897 264973 133186 505456 43527 23525
14949B3525J54492J87315A81546P2223r5242J97104J77900M70422C14538M69423
$$ 23525 178017 365332 181546 253769 158527 355631 533531 1003953 314538 783961
14939G83961k04282k69242N7319F2791K99915K60177B26086J17170K1144O07572
$$ 783961 579679 310437 367756 62791 362706 622883 226086 343256 364400 971972
14929I71972j02457J22912J4010O6820L34777K9044j1955k50497M70830l81889
$$ 971972 869515 992427 1006437 1073257 1408034 1437078 1425123 1174626 1645456 1263567
14919A263567k74286L83066J40510N31852k5953k85290m31798L29457n36920j89450
$$ 1263567 989281 1372347 1512857 2044709 2018756 1733466 1301668 1631125 1094205 904755
14909I04755m36504q4957m4680L21446A77477L25158B29026J81883J75628k61403
$$ 904755 468251 383294 338614 660060 177477 502635 229026 410909 586537 325134
14899C25134j19669L24988B31903K60197k42365B2533Q3298K75347M6237P4692
$$ 325134 205465 530453 231903 492100 249735 22533 105831 381178 427415 502107
14889E02107j41199A14024L52195p8851J39301R9116L3327l8034R7488K33469
$$ 502107 360908 114024 466219 387368 526669 625785 659112 621078 718566 952035
14879I52035j6969M4100m32243K14833j55137n1139B72742K70514g7067B17597
$$ 952035 935066 979166 546923 761756 606619 555480 272742 543256 -77067 217597
14868F43009j0906k70743L17426j16676L8570r6491K3780j39281A87820D8865
$$ 643009 632103 361360 678786 562110 600680 504189 527969 388688 187820 48865
14857B01635J53489R934o8074a3192A07093D3794M2729J76148J63566n5151j06518
$$ 201635 355124 365058 296984 -13192 107093 43794 86523 262671 426237 371086 264568
14846B64568O2943M05802j84875N6239J39663J33658j77620J82534j05219l4668
$$ 264568 327511 733313 548438 604677 744340 877998 700378 882912 777693 743025
14836G43025r7913j5683J05868j51099M9287A12409M23768j39334L3643A59027
$$ 743025 645112 629429 735297 584198 633485 112409 536177 396843 430486 159027
14825B59778P8868K19790l4433l7240j35734q8416K79449K3132J77821l67519
$$ 259778 338646 558436 524003 486763 351029 262613 542062 565194 743015 375496
14815C75496J07181L31856J01396k45474k48665P679J46481P3711j37936N04111
$$ 375496 482677 814533 915929 670455 421790 429469 575950 649661 511725 1015836
14805A015836l63746L81964j17442N5054k11029l51140p356M1352K82260l32059
$$ 1015836 652090 1034054 916612 971666 760637 409497 402141 443493 725753 393694
14795C93694j0997k0951R5959J64393A12973K15779J58887Q3022k26126J26741
$$ 393694 382697 361746 457705 622098 112973 328752 487639 570661 344535 471276
14785D71276m6865C8870N41293j3819k69041M12376J2583l7384j10734p8520L91877
$$ 471276 424411 38870 580163 566344 297303 709679 722262 684878 574144 495624 887501
14774H87501P3040m63317L32116j00005o5098q7250m2465n3249J0776r0032R0650
$$ 887501 960541 497224 829340 729335 664237 576987 534522 481273 492049 402017 492667
14763D92667J08601j54666K9509K91319j02874j40683J33190k83838j06738K40796
$$ 492667 601268 446602 476111 767430 664556 523873 657063 373225 266487 507283
14753E07283K76923l06326N986q1158K09450p2275j30871M29127l07188j9549
$$ 507283 784206 477880 483866 402708 612158 539883 409012 838139 530951 511402
14743E11402B39823L54029J87883A41401M14281O9168j03558K37568j42727K36977
$$ 511402 239823 593852 781735 141401 555682 624850 521292 758860 616133 853110
14733H53110p8389q9513J35103k23934K48204K26272J35196M73444j76003j96772
$$ 853110 774721 685208 820311 596377 844581 1070853 1206049 1679493 1503490 1306718
14723A306718j58966p6382l00675L37244n28601o3973K94868j72934j66830K27248
$$ 1306718 1147752 1071370 770695 1107939 579338 515365 810233 637299 470469 697717
14713F97717l1251o2295L71674l95127K12675m7583O0309n0949C37517N38933
$$ 697717 666466 604171 975845 580718 793393 745810 806119 755170 337517 876450
14703H76450K69789L82298m36625Q26354m81268l2754k42684k2094n26362J49635
$$ 876450 1146239 1528537 1091912 1918266 1436998 1404244 1161560 1139466 613104 762739
14693G62739L83254j53157K39108D46028L88415k42461j1602M40713q0411j54967
$$ 762739 1145993 992836 1231944 446028 834443 591982 580380 1021093 940682 785715
14683G85715J59297k71335n2570K24262O0763k10575k32965J78342p8898L2720
$$ 785715 945012 673677 621107 845369 906132 695557 462592 640934 562036 594756
14673E94756M83862k72458k50440K04566K27767m40532K36103K8669j29920j53351
$$ 594756 1078618 806160 555720 760286 988053 547521 783624 812293 682373 529022
14663E29022L41192o6195J5194j8780K70343k32816J8484j5483m6149K50608J18508
$$ 529022 870214 804019 819213 800433 1070776 837960 856444 840961 794812 1045420 1163928
14652A163928k28590Q1790J8796M20423m40721j78527Q2960L78732n25986K58798
$$ 1163928 935338 1017128 1035924 1456347 1015626 837099 920059 1298791 772805 1031603
14642A031603q7657r3941L59371j89768l314l24317K88380j39563k84418K91458
$$ 1031603 943946 850005 1209376 1019608 1016294 691977 980357 840794 556376 847834
14632H47834J20425L28907k1042r4683M708n6785l18426M03721L7195K8463k60954
$$ 847834 968259 1297166 1276124 1181441 1186149 1129364 810938 1214659 1251854 1280317 1019363
14621A019363M42111l63022l12022M94889j55868l7900k19254K77973j73502L17880
$$ 1019363 1461474 1098452 786430 1281319 1125451 1087551 868297 1146270 972768 1290648
14611A290648k33414K58519k53483k98730O50576J53128k15542J63739j32059
$$ 1290648 1057234 1315753 1062270 763540 1414116 1567244 1351702 1515441 1383382
14602A383382j40239k01237N0728K56589o4578j77564L6905K36795k80197L67764
$$ 1383382 1243143 1041906 1092634 1349223 1284645 1107081 1143986 1380781 1100584 1468348
14592A468348j14466L8420M9613M7281l11145o7181K67012M9759j7702k5807J01890
$$ 1468348 1353882 1392302 1441915 1489196 1178051 1110870 1377882 1427641 1409939 1384132 1486022
14581A486022r7491M0849K64387j9482j7178O715k72810J91434j67992j35061
$$ 1486022 1388531 1429380 1693767 1674285 1657107 1663822 1391012 1582446 1414454 1279393
14571A279393K14916J7911p1219K83478j83843O51613j78467p92893Q45657j67529
$$ 1279393 1494309 1512220 1441001 1724479 1540636 2192249 2013782 1220889 2066546 1899017
14561A899017j28401L37512J08130L743K61936o9631j29100K79905L03208l2063
$$ 1899017 1770616 2108128 2216258 2220001 2481937 2412306 2283206 2563111 2866319 2834256
14551B834256Q21086N64996J175098L168757P408808J5691278J3270162A9986057
$$ 2834256 3655342 4220338 5395436 8564193 15973001 31664279 44934441 19986057
14542F694294k920936j522735j31140j12598R30592J490157j485723r70256k82723
$$ 6694294 3773358 2250623 2119483 2006885 2937477 4427634 2941911 1971655 1688932
14533A688932j44156k37287L14644K30775j75996k09997L91636n86422M24100
$$ 1688932 1544776 1307489 1622133 1852908 1676912 1466915 1858551 1272129 1696229
14524A696229J76283K19231j40994Q5580k129K6678k16306J87743P316j01738
$$ 1696229 1872512 2091743 1950749 2036329 2034200 2060878 1844572 2032315 2039631 1937893
14514A937893j18587j21018L55705J17486j14676J37766j31670K49878j19589
$$ 1937893 1819306 1698288 2053993 2171479 2056803 2194569 2062899 2312777 2193188
14505B193188p4733r4581K46848j2561J43151J36833P7317N3084K15184k60692
$$ 2193188 2118455 2023874 2270722 2258161 2401312 2538145 2615462 2668546 2883730 2623038
14495B623038K94487m47986K56130K2548k57750K21154K5246m8275j09267J72088
$$ 2623038 2917525 2469539 2725669 2748217 2490467 2711621 2736867 2688592 2579325 2751413
14485B751413J32125L44313n05208K09246N6135J67418j17920j12623m4893M66490
$$ 2751413 2883538 3227851 2722643 2931889 2988024 3155442 3037522 2924899 2880006 3346496
14475C346496j80904k6797J572R789N1340M7063L3038N24024k67885K16940k00693
$$ 3346496 3165592 3138795 3140367 3150156 3201496 3248559 3281597 3805621 3537736 3754676 3553983
14464C553983O1518p937p6690K34915l29582O31698j58632j13676L78421J62226
$$ 3553983 3615501 3607564 3530874 3765789 3436207 4067905 3909273 3795597 4174018 4336244
14454D336244q5405j27313L0890K88914m6661l32516p097R9081J64103M30897
$$ 4336244 4250839 4123526 4154416 4443330 4396669 4064153 4057056 4156137 4320240 4751137
14444D751137p3478l41226K27879j29552M55645n7182M668N7909M97930m32550
$$ 4751137 4677659 4336433 4564312 4434760 4890405 4833223 4837891 4895800 5393730 4961180
14434D961180J73343J21722m4796J38466J37168k3658r929N65698l0251J99348
$$ 4961180 5134523 5256245 5211449 5349915 5487083 5463425 5453496 6019194 5988943 6188291
14424F188291l46253K19782o2590L82570l67178P40853J37425k17613K02995K03100
$$ 6188291 5842038 6061820 5999230 6381800 6014622 6755475 6892900 6675287 6878282 7081382
14414G081382m33277M66175j50347J42153J42731J94331j22993L37824k24811
$$ 7081382 6648105 7114280 6963933 7106086 7248817 7443148 7320155 7657979 7433168
14405G433168O49377r886L12335J4345r8052J6384L27555k00353K63105L75406
$$ 7433168 8082545 8072659 8384994 8399339 8301287 8317671 8645226 8444873 8707978 9083384
14395I083384r246N09232N8409j32889K2533L76418K7539L93875L57981O4468
$$ 9083384 9074138 9583370 9641779 9508890 9531423 9907841 9935380 10329255 10687236 10751704
14385A0751704l2270N11411N7088L08838L7354N51323L08560k24770P03722k60786
$$ 10751704 10719434 11230845 11287933 11596771 11634125 12185448 12494008 12269238 12972960 12712174
14375A2712174L67272o0117P58835p9522M92461j93133M15313N77017K53516O88856
$$ 12712174 13079446 13019329 13778164 13698642 14191103 13997970 14413283 14990300 15243816 15932672
14365A5932672M08248J91326K62604K43920n7709L78520Q05602j42805Q29372
$$ 15932672 16340920 16532246 16794850 17038770 16981061 17359581 18165183 18022378 18851750
14356A8851750J30001Q21565J94218N47816N06514N16168O81080M98413N47584
$$ 18851750 18981751 19803316 19997534 20545350 21051864 21568032 22249112 22747525 23295109
14347B3295109M64341N23331M94830J293139L50997N77413O31562J025325M91700
$$ 23295109 23759450 24282781 24777611 26070750 26421747 26999160 27630722 28656047 29147747
14338B9147747P79496P85798J217063J058966R41710P14258J239361J103966J045731
$$ 29147747 29927243 30713041 31930104 32989070 33930780 34645038 35884399 36988365 38034096
14329C8034096J399071J005216J465467J136123J411496K033376J485373J723260
$$ 38034096 39433167 40438383 41903850 43039973 44451469 46484845 47970218 49693478
14321D9693478J797311K057132K257547J985214J778815K398590K103876K608735
$$ 49693478 51490789 53547921 55805468 57790682 59569497 61968087 64071963 66680698
14313F6680698K529658K746122L276772K909208L294220L819703L810120L826047
$$ 66680698 69210356 71956478 75233250 78142458 81436678 85256381 89066501 92892548
14305I2892548M495495M183064N157841N393505N076020O091188N794453O815190
$$ 92892548 97388043 101571107 106728948 112122453 117198473 123289661 129084114 135899304
14297A35899304P275518P311571Q124284Q245825R054584R839727J0341958J0805696
$$ 135899304 143174822 150486393 158610677 166856502 175911086 185750813 196092771 206898467
14289B06898467J1523393J2629761J2338158J3614090J4054530J4643673J5161052
$$ 206898467 218421860 231051621 243389779 257003869 271058399 285702072 300863124
14282C00863124J5286480J5349782J5533568J5349784J4161721J3902263J2537432
$$ 300863124 316149604 331499386 347032954 362382738 376544459 390446722 402984154
14275D02984154J0970621R375254O419182J779976k294477j872823K05422k776846
$$ 402984154 413954775 423330029 429749211 431529187 429234710 427361887 427567309 424790463
14267D24790463m024420q194641r572066j0672554j2598144j4238283j4968127
$$ 424790463 420766043 412571402 402999336 392326782 379728638 365490355 350522228
14260C50522228j5631679j5595832j5580428j5306144j4549938j4172286j3763050
$$ 350522228 334890549 319294717 303714289 288408145 273858207 259685921 245922871
14253B45922871j3221633j2215793j2133986j0968111j1091196q364294q725293
$$ 245922871 232701238 220485445 208351459 197383348 186292152 177927858 169202565
14246A69202565r021056q270433p427031p245734o996251o319477n721307n624983
$$ 169202565 160181509 151911076 144484045 137238311 130242060 123922583 118201276 112576293
14238A12576293n084738m646591m771975m408546m134714l916403l684406k925651
$$ 112576293 107491555 102844964 98072989 93664443 89529729 85613326 81928920 79003269
14230G9003269l398682k853556l130001k582797k831198k344258k311359k247365
$$ 79003269 75604587 72751031 69621030 67038233 64207035 61862777 59551418 57304053
14222E7304053k196549j684913j689824k048636j568645j829480j432654j318276
$$ 57304053 55107504 53422591 51732767 49684131 48115486 46286006 44853352 43535076
14214D3535076j020655j118307j363732j498311j221760j114052q43818o69614
$$ 43535076 42514421 41396114 40032382 38534071 37312311 36198259 35354441 34684827
14206C4684827q86390j676784o54997j168010j003080k00099o28867r19530r48546
$$ 34684827 33798437 32121653 31466656 30298646 29295566 29095467 28466600 27547070 26598524
14197B6598524o24379o19496r20595k66862p27367m88012o73792k88008n73229
$$ 26598524 25974145 25354649 24434054 24167192 23439825 22951813 22278021 21990013 21416784
14188B1416784p43882j47128n61258k48502o69664l53106p52639Q5255r09863
$$ 21416784 20672902 20525774 19964516 19716014 19046350 18693244 17940605 18025860 17115997
14179A7115997k6749o13270m10906j8517k90292p20229R0827n47454J70068m04781
$$ 17115997 17089248 16475978 16065072 16046555 15756263 15036034 15126861 14579407 14749475 14344694
14169A4344694l14830m59242j21669j87045l05356n61225K03463n41268k74542
$$ 14344694 14029864 13570622 13448953 13261908 12956552 12395327 12598790 12057522 11782980
14160A1782980k96129K13499j30922o05872K15391m17576m14038L1203k84943
$$ 11782980 11486851 11700350 11569428 10963556 11178947 10761371 10347333 10378536 10093593
14151A0093593L5470k78157l76322L57234m04360l51896R5148l00849k53600K57137
$$ 10093593 10129063 9850906 9474584 9831818 9427458 9075562 9170710 8869861 8616261 8873398
14141H873398k67405k34593l3154L9149l72797j09199l29053J08141R1514n8663
$$ 8873398 8605993 8371400 8338246 8377395 8004598 7895399 7566346 7674487 7766001 7707338
14131G707338q9101m34222k57152O8742k26033L11969j50275q6367j02231j68218
$$ 7707338 7618237 7184015 6926863 6995605 6769572 7081541 6931266 6844899 6742668 6574450
14121F574450R3974j39910j12504j16846N5550O474l10598l44873J77159j99262
$$ 6574450 6668424 6528514 6416010 6299164 6354714 6361188 6050590 5705717 5882876 5683614
14111E683614K97636k23613l65731m8238K08296Q4172l38530l3116M8667o5595
$$ 5683614 5981250 5757637 5391906 5343668 5551964 5636136 5297606 5264490 5313157 5247562
14101E247562j19811j81372J89765l31606O6322o6585k88101R450J59381j67892
$$ 5247562 5127751 4946379 5136144 4804538 4870860 4804275 4516174 4525624 4685005 4517113
14091D517113R3055j09652k27722P4797K52306j81579k05199J39073l86301K6904
$$ 4517113 4610168 4500516 4272794 4347591 4599897 4418318 4213119 4352192 3965891 3992795
14081C992795n6083J21333k26893k6905Q3194k14710J18515J59495o31550N32170
$$ 3992795 3936712 4058045 3831152 3804247 3887441 3672731 3791246 3950741 3319191 3851361
14071C851361j21611J53847l38686p7456n351l0411M512p7578L15744r2116j16760
$$ 3851361 3729750 3883597 3544911 3467455 3462104 3431693 3436205 3358627 3674371 3582255 3465495
14060C465495j52321L02456l68961J45012l57933M3387k37494N38052L8161o10252
$$ 3465495 3313174 3615630 3246669 3391681 3033748 3077135 2839641 3377693 3415854 2805602
14050B805602M09320k00896j55068p0476J77887m3734Q00o1203k39464J65011
$$ 2805602 3214922 3014026 2858958 2788482 2966369 2922635 2923435 2862232 2622768 2787779
14040B787779o9320p1067J25957k7875j62135o4255L07893m57898L99582m04720
$$ 2787779 2718459 2647392 2773349 2745474 2583339 2519084 2826977 2369079 2768661 2363941
14030B363941M55214l42742k18955r060M10480m43064O1341K3481j1830K745j03682
$$ 2363941 2819155 2476413 2257458 2248398 2658878 2215814 2277155 2300636 2288806 2291551 2187869
14019B187869M0433p1123q6768O8263j66094O51103l31033k8261k83149r2429
$$ 2187869 2228302 2157179 2070411 2138674 1972580 2623683 2292650 2264389 1981240 1888811
14009A888811L73086o031l51467l7232M31911l99106j26274j69740K17946J4165
$$ 1888811 2261897 2255866 1904399 1867167 2299078 1899972 1773698 1603958 1821904 1836069
13999A836069k12422J44090l05906j11597M17181K37893k81019j11778p5038K92057
$$ 1836069 1623647 1767737 1461831 1350234 1767415 2005308 1724289 1612511 1537473 1829530
13989A829530L17424K229523N872152J3663909K1940795j8683429A2375479n147998
$$ 1829530 2146954 4376477 10248629 23912538 45853333 27169904 12375479 7227481
13981G227481j746622j344247n62413n82660q3245l95893j08402j72453J13338
$$ 7227481 5480859 4136612 3574199 2991539 2908294 2512401 2403999 2231546 2344884
13972B344884j22741m8713j65287j82842k94234M11026J20920j03774k49121J50063
$$ 2344884 2222143 2173430 2008143 1825301 1531067 1942093 2063013 1959239 1710118 1860181
13962A860181k24259q8508M72852j14762l70248K46172M6412j23103N482o2954
$$ 1860181 1635922 1547414 2020266 1905504 1535256 1781428 1827840 1704737 1710219 1647265
13952A647265R8162j0152L7329k70703L99425k27091k75970J03729k99829M19001
$$ 1647265 1745427 1735275 1772604 1501901 1901326 1674235 1398265 1501994 1202165 1621166
13942A621166j85474K5269k6848k69347K51837K34892l70333N3581J74769N5227
$$ 1621166 1435692 1460961 1434113 1164766 1416603 1651495 1281162 1334743 1509512 1564739
13932A564739j21369J25073k19029M0603J03947j90672o0577J92275N51835n43964
$$ 1564739 1443370 1568443 1349414 1390017 1493964 1303292 1242715 1434990 1986825 1442861
13922A442861m32593P7017K88545j80229J48810J2158j24659q2828j84205M54651
$$ 1442861 1010268 1087285 1375830 1195601 1344411 1356569 1231910 1149082 964877 1419528
13912A419528j95006j04823M82048k78506R1086m19225R1787m5999j30233N5657
$$ 1419528 1224522 1119699 1601747 1323241 1414327 995102 1086889 1040890 910657 966314
13902I66314N5711R8340J97048k37832M39380G27041N7404M96794l38382J37985
$$ 966314 1022025 1120365 1317413 1079581 1518961 727041 784445 1281239 942857 1080842
13892A080842l33261K00105L08728J37091F27516M06090o3294m30838P52325m94668
$$ 1080842 747581 947686 1256414 1393505 627516 1033606 970312 539474 1291799 797131
13882G97131M75975j19016o3030K1929j72833M0820k14676N40127l60474L4804
$$ 797131 1273106 1154090 1091060 1112989 940156 980976 766300 1306427 945953 980757
13872I80757J35194l4966l6396k81046j3435M4182r9053J2579K03660m11009M95246
$$ 980757 1115951 1080985 1044589 763543 750108 794290 695237 707816 911476 500467 995713
13861I95713l65886J28756R0528R9760K560k94904J04419J2409J06401k36674
$$ 995713 629827 758583 849111 948871 951431 656527 760946 773355 879756 643082
13851F43082J14714J68251l44536O5842K99747j83763R3671j84057K13857j80822
$$ 643082 757796 926047 581511 647353 947100 763337 857008 672951 886808 705986
13841G05986K22204k1484o3428k75991L18304P9061L0809n7352P6538k70552j31678
$$ 705986 928190 906706 843278 567287 885591 964652 995461 938109 1014647 744095 612417
13830F12417J41351k13004K04074j84818J59005J98903J26890D22017L45992J2658
$$ 612417 753768 540764 744838 560020 719025 917928 1044818 422017 768009 780667
13820G80667O6525J42797l16827L39602R4964k84731l25197J9352L28138j47969
$$ 780667 847192 989989 673162 1012764 1107728 822997 497800 517152 845290 697321
13810F97321l6364k43143K44505l9879r5722J49166j08724j10453n1131J91214
$$ 697321 660957 417814 662319 622440 526718 675884 567160 456707 405576 596790
13800E96790B05687K77606K78829C49632J61184l9546J87153q5605j19511L09091
$$ 596790 205687 483293 762122 349632 510816 471270 658423 572818 453307 762398
13790G62398n3411k05525J98926k41853N5689n9721J44821L0434R7749m2644k26125
$$ 762398 708987 503462 702388 460535 516224 456503 601324 631758 729507 686863 460738
13779D60738M57680D08307K61549j41607J10176J55726l22305K71906B51543M38337
$$ 460738 918418 408307 669856 528249 638425 794151 471846 743752 251543 689880
13769F89880J6651B82093L18422J1514k27130N36790p7936k10634o9725M4170
$$ 689880 706531 282093 600515 612029 384899 921689 843753 633119 563394 607564
13759F07564K14243k24807j21645M59055J153k44074q6993o9667J28349n6419
$$ 607564 821807 597000 475355 934410 935563 691489 604496 534829 663178 606759
13749F06759k9637J49272k30312P1617I4396O44125l31555J07098q9299l9171
$$ 606759 577122 726394 496082 567699 94396 738521 406966 514064 424765 385594
13739C85594K35056J95770B80072P89334m57269k26202K30992j98868o0489N2793
$$ 385594 620650 816420 280072 1069406 612137 385935 616927 418059 357570 410363
13729D10363K89148B81924q06J10508j83851J87456L25163j64359A72572R3373
$$ 410363 699511 281924 281118 391626 207775 395231 720394 556035 172572 265945
13719B65945K5996P9456m9310K03396k16297Q2725J94429M4093k21738m8601J02560
$$ 265945 291941 371397 322087 525483 309186 391911 586340 630433 408695 360094 462654
13708D62654J0987I5677L75558L02539B19637L14752j50466A26402M00823r6985
$$ 462654 473641 95677 471235 773774 219637 534389 383923 126402 527225 430240
13698D30240j85174n4199L66474k25082l9425K4579K616J04794J5262j75013J27260
$$ 430240 245066 190867 557341 332259 292834 317413 320029 424823 440085 265072 392332
13687C92332O0016A64191R5749J42865J79760B74006P0764J19420j3064j50681
$$ 392332 452348 164191 259940 402805 582565 274006 344770 464190 451126 300445
13677C00445j1480Q8222G6225K05873J48481L8073k14974K68621A82043E5346
$$ 300445 288965 377187 76225 282098 430579 468652 253678 522299 182043 55346
13666B14501J07661M6332j16003K89677B36295K83731N3203k27850q6157K99368
$$ 214501 322162 368494 252491 542168 236295 520026 573229 345379 259222 558590
13656E58590J33883e0412C25881A01252K22390m1233K91979q3491N5464k42347
$$ 558590 692473 -50412 325881 101252 323642 282409 574388 490897 546361 304014
13646C04014A42585J28339J66910m7743K4784B7547L99713O0681p7524O4755k00822
$$ 304014 142585 270924 437834 390091 414875 27547 427260 487941 410417 475172 274350
13635B74350K7649O5998G3523K72089J03921B22474L13477j64275M5055A77476
$$ 274350 301999 367997 73523 345612 449533 222474 535951 371676 416731 177476
13624D16817p211A87085k2167R0109G6683J58867O432A8054K52449J27734K3718
$$ 416817 409606 187085 164918 255027 76683 235550 241982 18054 270503 398237 421955
13613D21955A27630M6970R7807l559A04886J71488K58537j09923B04067Q9990
$$ 421955 127630 174600 272407 268848 104886 276374 534911 424988 204067 294057
13603B94057r370J5508F5946M51567k19368A23819K01746A34856K56105K404k1890
$$ 294057 284687 300195 65946 517513 298145 123819 325565 134856 390961 393365 371475
13592C71475k0266A25293D956M84713A95780J12154o7563E9549K37190j43597
$$ 371475 351209 125293 4956 489669 195780 307934 240371 59549 296739 153142
13582A53142P9242J01444J0841p8100P6173L4052Q4242j03196j39160K82379k47151
$$ 153142 232384 333828 344669 266569 342742 376794 461036 357840 218680 501059 253908
13571B53908r6487D6363J74641L80681B05615C6738K99643j00878J92279A44178
$$ 253908 157421 46363 221004 601685 205615 36738 336381 235503 427782 144178
13560B37834K31561I5003J69757K5045j42564J83521A12610Q6319J77151J49335
$$ 237834 469395 95003 264760 289805 147241 330762 112610 198929 376080 525415
13550E25415B60910o5132q4639G034J36316E38K16508l3777P2139p4669d5611
$$ 525415 260910 195778 111139 7034 143350 538 217046 183269 255408 180739 -45611
13538C64043J04526A50320K36189A72151L36691n4018j56540A47136L33615j84049
$$ 364043 468569 150320 386509 172151 508842 454824 298284 147136 480751 296702
13528B96702A10021f822C6672i9335B76189H8823K98516h5011A54408J97465J09917
$$ 296702 110021 -6822 36672 -99335 276189 88823 387339 -85011 154408 351873 461790
13517D61790j49578k5810o7767O1153R4317A73499m5129K8587L8291L3254d3836
$$ 461790 312212 286402 218635 279788 374105 173499 128370 156957 195248 228502 -43836
13505F4991J53896Q2708M0314a57444L8568I4112N2266N3761P1900b29392Q5506
$$ 64991 218887 301595 341909 -157444 -118876 94112 146378 200139 272039 -229392 -143886
13494a43886N9781b6231H818L00391j06126q3440K88853j19450h081D55733A21321
$$ -143886 -84105 -26231 8818 309209 203083 119643 408496 289046 -8081 455733 121321
13482D05524A74482j0916J07771r3681G8536J53409L1179O5600n6770j33746Q0366
$$ 405524 174482 163566 271337 177656 78536 231945 263124 328724 271954 138208 218574
13471B18574I0781M17082j66996r6119H7287R5189J99568p4078I930L95649j88527
$$ 218574 90781 507863 340867 244748 87287 182476 382044 307966 9930 405579 217052
13460B17052J34327j58341a72128D2101R1125j6924N3694Q9755E3611K52562j50005
$$ 217052 351379 193038 -172128 42101 133226 116302 169996 259751 53611 306173 156168
13449A56168J09025n9771A2378a05317C00177A4980M49202K0439b192B88729A4080
$$ 156168 265193 205422 12378 -105317 300177 14980 464182 484621 -2192 288729 14080
13437E5949c60373I0944b18718C80813g3664A02122I036K4856O2256a27066A30953
$$ 55949 -360373 90944 -218718 380813 -73664 102122 9036 33892 96148 -127066 130953
13425B08929a03473A14046e510H5164J61498J8998b0516L884C03787b18970C12574
$$ 208929 -103473 114046 -5510 85164 246662 265660 -20516 -16632 303787 -218970 312574
13413B74920J9032j38250Q419o6155g4080c4567I0709K9392J04061f5549A15470
$$ 274920 293952 155702 164121 97966 -74080 -34567 90709 120101 224162 -65549 115470
13401B81031r9253K27445o5071j56270A8588J0531Q5243b04137H114a85392A23300
$$ 281031 181778 409223 344152 187882 18588 29119 114362 -204137 8114 -185392 123300
13389B84092B6489e730C2111J8279L58840I8214K99747a67032A29475a00714D1782
$$ 284092 26489 -5730 32111 50390 409230 98214 397961 -167032 129475 -100714 41782
13377A14088P1834J0687g1302A18544K11073a24179B84189B9799K18847A03716
$$ 114088 185922 196609 -71302 118544 329617 -124179 284189 29799 248646 103716
13366B13523D9418K02652R5680k0829j09631K02590k8911q3210n5262L422j5887
$$ 213523 49418 252070 347750 326921 217290 419880 390969 307759 252497 255919 240032
13355B40032a3431G6906J98668F7106a6209C69854L8641A96641K8586J14986e040
$$ 240032 -13431 76906 275574 67106 -16209 369854 408495 196641 225227 340213 -5040
13343A42874L56120D749K11847Q6546a29690A83989J8005J28386j25330j1712
$$ 142874 498994 4749 216596 303142 -129690 183989 201994 330380 205050 193338
13333A93338o1726J05257j14596J13266a18391K6501D56987D5753e4562b1193
$$ 193338 131612 236869 122273 235539 -118391 -91890 456987 45753 -54562 -21193
13322D87185a59365B81148n5264J03679C4309J78074h954B87148A240J09469o631
$$ 487185 -159365 281148 225884 329563 34309 212383 -8954 287148 1240 110709 104078
13311A04078M48688C705K29968L8764H5255C4029L73379j33594C1491b03375A69160
$$ 104078 552766 3705 233673 272437 85255 34029 407408 273814 31491 -203375 169160
13299a0592B13368B7118M44099j30981P3733A06564e4802A46506J04542d6185
$$ -10592 213368 27118 471217 340236 413969 106564 -54802 146506 251048 -46185
13288A68717E708L36081j66276p0050h8824A57139o4578R1937J08716b09009A0018
$$ 168717 5708 341789 175513 105463 -88824 157139 92561 184498 293214 -209009 10018
13276F18516c0153D8783K13389q1075k2742l8683J5646M67375A05266L5340J10718
$$ 618516 -30153 48783 262172 181097 158355 119672 135318 602693 105266 140606 251324
13265B51324B9315O1834A0067a59931B83602h6800B8713a25555A50488d2663B16794
$$ 251324 29315 91149 10067 -159931 283602 -86800 28713 -125555 150488 -42663 216794
13253h9866j12118i618H1471K26705j33615O2474j11289a79200A17064c6791A06371
$$ -89866 -201984 -9618 81471 308176 174561 237035 125746 -179200 117064 -36791 106371
13241I5637B3966c19703B27565a46562C2813f3194A53318c6667k84995C28995
$$ 95637 23966 -319703 227565 -146562 32813 -63194 153318 -36667 -321662 328995
13230b28114C32973q1706n7050J52210A11511a42828j33547B82476j03412C1240
$$ -228114 332973 251267 194217 346427 111511 -142828 -276375 282476 179064 31240
13219a198k52067B13820J30968O1196G1371a51392B6920M38945c3620J5680q3593
$$ -1198 -253265 213820 344788 405984 71371 -151392 26920 465865 -33620 -17940 -101533
13208a01533A33799P4834b27863B02907r3346N8653F6664j8208J55640A01827
$$ -101533 133799 208633 -227863 202907 109561 168214 66664 48456 204096 101827
13197I5805A4136J25154m1312a45562J8769j38867J04792P3533j5828B85059j38374
$$ 95805 14136 139290 97978 -145562 -126793 -265660 -160868 -87335 -103163 285059 146685
13186A46685h4236j22207a1693G9312b17816G1021d1077D53719I2675K51590a47945
$$ 146685 -84236 -206443 -11693 79312 -217816 71021 -41077 453719 92675 344265 -147945
13174a25389A89274B5818i2358F3172b48024D42162b7441B32922c87309A58569
$$ -125389 189274 25818 -92358 63172 -248024 442162 -27441 232922 -387309 158569
13163C15029c9611j21101Q657K3463A72969j491a61196e9093n434A25107C7904
$$ 315029 -39611 -160712 -152055 -128592 172969 171478 -161196 -59093 -64527 125107 37904
13151e1200q5238e4171E8793J02454B9922J91855Q7891A38786b55764M4165g7058
$$ -51200 -136438 -54171 58793 161247 29922 221777 309668 138786 -255764 -211599 -77058
13139e9108j16767H9227k1623a20281A9865J61205b04178c619D1654g2205c2206
$$ -59108 -175875 89227 67604 -120281 19865 181070 -204178 -3619 41654 -72205 -32206
13127A9866d3337r6959c8637n1637A40824N9085k58o8571a7485B6020c2275m4447
$$ 19866 -43337 -140296 -38637 -90274 140824 199909 199651 131080 -17485 26020 -32275 -76722
13115g6722p230A17184a09636p2760B11303p3658a20105L7731F6853f5904G2689
$$ -76722 -83952 117184 -109636 -182396 211303 137645 -120105 -82374 66853 -65904 72689
13103G3490K20203j40600F2233N3463b9830C78538g4285C79059G4886K66976J3887
$$ 73490 293693 153093 62233 115696 -29830 378538 -74285 379059 74886 341862 355749
13092C55749H1141J19089J34949g9766A95885b631k33228c2384B3373a01324C80333
$$ 355749 81141 200230 335179 -79766 195885 -2631 -235859 -32384 23373 -101324 380333
13080B43509f5711A5644a41855A30639J45737A9813L38506a75170j0200D11638
$$ 243509 -65711 15644 -141855 130639 276376 19813 358319 -175170 -185370 411638
13069a33369B54167L9705j38072n5571P8365b41019A31064a37857b6960B40625
$$ -133369 254167 293872 155800 100229 178594 -241019 131064 -137857 -26960 240625
13058b95110F1835a42182A11414K69387a4619B62163A4401a50595k8670Q3534
$$ -295110 61835 -142182 111414 380801 -14619 262163 14401 -150595 -179265 -95731
13048i5731I4648M3105l9286J09299l7220K7650o7426a4578J182A16844n663L4932
$$ -95731 94648 137753 98467 207766 170546 198196 130770 -14578 -13396 116844 111181 146113
13036A46113h8067J7385C07721I5296J31316a20812L5059j6251A46638a13159
$$ 146113 -88067 -70682 307721 95296 226612 -120812 -85753 -102004 146638 -113159
13025A91270J46483a23550A08513C7639O2580J10654J53007f3618C4419J80799
$$ 191270 337753 -123550 108513 37639 100219 210873 363880 -63618 34419 215218
13015B15218I2737d3237H3471G667K63025j30024H17L9139K01905i2350A63748
$$ 215218 92737 -43237 83471 7667 270692 140668 817 39956 241861 -92350 163748
13003B60170d02246F0143a78129A06400j974b61912c1453p635A32903n3068b55076
$$ 260170 -402246 60143 -178129 106400 104426 -261912 -31453 -39088 132903 79835 -255076
12991a70025B15592K7493b5402A0950J2216b40990D4085J09805Q499b28495b4550
$$ -170025 215592 243085 -25402 10950 23166 -240990 44085 153890 162389 -228495 -24550
12979i0869D4144c0377n3491A50950i3388C56527G3816q41R006C7520K11397g6916
$$ -90869 44144 -30377 -83868 150950 -93388 356527 73816 72975 81981 37520 248917 -76916
12966a47204M4472F3397J29314I24d61100i9685D6615c2593A81724J41441g8375
$$ -147204 -102732 63397 192711 924 -461100 -99685 46615 -32593 181724 323165 -78375
12954b9345A7124J23865b61758g8265j54501A02045H592L29091j61856e9753A71800
$$ -29345 17124 140989 -261758 -78265 -232766 102045 8592 337683 175827 -59753 171800
12942a31136j25150h5068A5702a09104j02783C40496b0808r2863j68275J09269
$$ -131136 -256286 -85068 15702 -109104 -211887 340496 -20808 -113671 -281946 -172677
12932a72677A82272M797e5815m79177G8994J66256j17446k5849K94175C3841a62250
$$ -172677 182272 187069 -55815 -534992 78994 245250 127804 101955 396130 33841 -162250
12920d45223b1096c351D1743a10690b8681H0894A1017O2879a76752A4152R2872
$$ -445223 -21096 -3351 41743 -110690 -28681 80894 11017 73896 -176752 14152 107024
12909A07024K3821n3170J47242g8031K1018A9296J18196h6672m5294G2318R3274
$$ 107024 130845 77675 224917 -78031 -57013 19296 137492 -86672 -131966 72318 165592
12898A65592a69870L3940B34036A10241h0688r7644N4891j8930r88C4794J07325
$$ 165592 -169870 -135930 234036 110241 -80688 -178332 -123441 -142371 -143359 34794 142119
12887A42119l9223K37747D5143J21605p0561i2807B30682g8068l4505p2667B75709
$$ 142119 102896 340643 45143 166748 96187 -92807 230682 -78068 -112573 -185240 275709
12875A77614q7152b147A75985m0723K2501K2180j9230b19078f9987n0531N6209
$$ 177614 90462 -2147 175985 135262 157763 179943 160713 -219078 -69987 -120518 -64309
12864f4309E2543j273a41019j14505A16080a1881l13064E668M0523l393J71861
$$ -64309 52543 51270 -141019 -255524 116080 -11881 -324945 5668 46191 42798 214659
12853B14659B5930g1593J0957j17454h1143p6834A36981a56864C16469I0567d830
$$ 214659 25930 -71593 -60636 -178090 -81143 -157977 136981 -156864 316469 90567 -4830
12841a03185m595l267N3144A96358J96197c51507B98890e6544k6997J7359m0431
$$ -103185 -107780 -111047 -57903 196358 392555 -351507 298890 -56544 -83541 -66182 -106613
12830a06613B30296C9066b10895I7382b07558B84364r6877a29924l977L9108A00386
$$ -106613 230296 39066 -210895 97382 -207558 284364 187487 -129924 -133901 -94793 100386
12818I8836c42692j66312A01408L9069b25145g4498A70346k1885d03043G8384
$$ 98836 -342692 -509004 101408 140477 -225145 -74498 170346 148461 -403043 78384
12807B37409B7603K12667i5037n8385j76787A7195b3441H7291b1331E6409K31483
$$ 237409 27603 240270 -95037 -153422 -330209 17195 -23441 87291 -21331 56409 287892
12796B87892f6419A94431b68992Q794N5498j27674A44246c98916a17603H8231
$$ 287892 -66419 194431 -268992 -260198 -204700 -332374 144246 -398916 -117603 88231
12785A26607f9775k2780B35821I5283N1186a38653A04421N4787m1595B0131a4132
$$ 126607 -69775 -92555 235821 95283 146469 -138653 104421 159208 117613 20131 -14132
12773f5605h405B29457i6292A6547k595K9751i6978A523O3270J69670c89920e5835
$$ -65605 -8405 229457 -96292 16547 13952 43703 -96978 1523 64793 234463 -389920 -55835
12760F6399j9919J66201P1363b17863q0103I3814j7441g7404j89854h5455c3060
$$ 66399 46480 212681 284044 -217863 -297966 93814 76373 -77404 -267258 -85455 -33060
12748b53893E2585f3217A14870B3180i5382j18285k9691C2840a32718B30753a14168
$$ -253893 52585 -63217 114870 23180 -95382 -213667 -243358 32840 -132718 230753 -114168
12736a54111B24607q5586D8633d971A30022b305j74566A72526N6914c6901D5896
$$ -154111 224607 139021 48633 -4971 130022 -2305 -176871 172526 229440 -36901 45896
12724a40012H932c04772B30028D5165M3401j4322M322g1222A57041M7428b42731
$$ -140012 8932 -304772 230028 45165 88566 74244 78566 -71222 157041 204469 -242731
12712H1895a71226C0961L14504j35133n073J51900B4419J31529n2571j6192J71726
$$ 81895 -171226 30961 345465 210332 205259 357159 24419 155948 103377 87185 258911
12701B58911r1829L055O8312c17414C60688a78987D5511d2900A13107r831D4597
$$ 258911 167082 170137 238449 -317414 360688 -178987 45511 -42900 113107 103276 44597
12689C9847J977b17892h3078r2955A12199g3992A18072b15126B5231g2702G3714
$$ 39847 41824 -217892 -83078 -176033 112199 -73992 118072 -215126 25231 -72702 73714
12677A13657i6114B76940H6115e7414E9021P7003k2271l0186c2609A43106l8505
$$ 113657 -96114 276940 86115 -57414 59021 136024 113753 83567 -32609 143106 104601
12666A04601B2032a98506C36797f1256q3088G5133J2185b25804A75575b6487C99246
$$ 104601 22032 -198506 336797 -61256 -144344 75133 87318 -225804 175575 -26487 399246
12654E62093B00623I2724a27245O3412m4263G7980a10477A86003E1165A5966K4605
$$ 562093 200623 92724 -127245 -63833 -108096 77980 -110477 186003 51165 15966 40571
12643D0571i6667q0668A72494i4650g295j42492C44044m8667m048j34400j5772
$$ 40571 -96667 -177335 172494 -94650 -7295 -149787 344044 295377 291329 156929 141157
12632A41157M7199a37163d2092A34560M0740a9722A37198m5620O7065a71581D71047
$$ 141157 188356 -137163 -42092 134560 175300 -19722 137198 91578 158643 -171581 471047
12620C80389A26904a32555B23810h0228J7413D6933e9954j0045n6752A87311H2115
$$ 380389 126904 -132555 223810 -80228 -62815 46933 -59954 -69999 -126751 187311 82115
12608A04323P0145c0689G4423e470D2482J97655B8992L35718h0500B72628E6219
$$ 104323 174468 -30689 74423 -5470 42482 240137 28992 364710 -80500 272628 56219
12596C7995D534O3809L7211i3528M5098A1462d6991q0558n669b176l9161k05538
$$ 37995 4534 68343 105554 -93528 -48430 11462 -46991 -127549 -133218 -2176 -41337 -246875
12584b46875P1064Q1237j45403l4596A18800e1791B00370d11066J67417H5125
$$ -246875 -175811 -94574 -239977 -274573 118800 -51791 200370 -411066 -243649 85125
12573B34247E533Q513a12044H9838p479b58956G0639b94912g5372B18647a37092
$$ 234247 5533 14046 -112044 89838 82359 -258956 70639 -294912 -75372 218647 -137092
12561E4808Q1815J27560a72683l7835k04567c9676j47221A88129b51334R7572
$$ 54808 136623 264183 -172683 -210518 -415085 -39676 -186897 188129 -251334 -153762
12551a53762g2571j58770j50533A82581a22041L1408A13044b01655B39771c29871
$$ -153762 -72571 -231341 -381874 182581 -122041 -90633 113044 -201655 239771 -329871
12540b5112k33166c4683k19A96390j2772J29223K1466b93109L5611e6096C6634
$$ -25112 -258278 -34683 -34902 196390 183618 312841 334307 -293109 -257498 -56096 36634
12528b07879P0867e5205j17024e4964P145R11a9517n4563c5796H7321a86344g6379
$$ -207879 -137012 -55205 -172229 -54964 -47819 -46908 -19517 -74080 -35796 87321 -186344 -76379
12515C03712b21581A65103G5138b21150a3416p9007j0012C03297A4396L42743
$$ 303712 -221581 165103 75138 -221150 -13416 -92423 -102435 303297 14396 357139
12505C57139M1692A14084A7850L4336K77204B6451K61734H0803a12288d6761A23371
$$ 357139 398831 114084 17850 52186 329390 26451 288185 80803 -112288 -46761 123371
12493A06180J11027a47222m04727E3836h0090k00486B36214E9121K01740a13996
$$ 106180 217207 -147222 -551949 53836 -80090 -280576 236214 59121 260861 -113996
12482A31139d2525D7804J36171J81215H6658E414a6793B95070A37104d4308j86982
$$ 131139 -42525 47804 183975 365190 86658 5414 -16793 295070 137104 -44308 -231290
12471b31290A51045i2035c0910j27635M6782H2534P0290f6018o5297b050B813
$$ -231290 151045 -92035 -30910 -158545 -111763 82534 152824 -66018 -131315 -2050 2813
12459A63383a35922B4188g1892A76600B5973c9928j25659j86576f1431D5974J31866
$$ 163383 -135922 24188 -71892 176600 25973 -39928 -165587 -352163 -61431 45974 177840
12448A77840J6286h2022B03068A1944d8547k4352E2417H588M0176P0056b57572
$$ 177840 194126 -82022 203068 11944 -48547 -72899 52417 8588 48764 118820 -257572
12436a78556d8588A34991a52436C2574h2241A89200B2322a31561N2995B38517
$$ -178556 -48588 134991 -152436 32574 -82241 189200 22322 -131561 -78566 238517
12425G8283a64991M6280p986A01019b55759O7696P2469A72049f7458A84628n7835
$$ 78283 -164991 -118711 -126697 101019 -255759 -188063 -115594 172049 -67458 184628 126793
12414A26793b18351B23949G5932i8295p647M0832q8983o996B47398a26481D7950
$$ 126793 -218351 223949 75932 -98295 -105942 -65110 -154093 -161089 247398 -126481 47950
12402b87520g0321E8697b9380J2086m2099P604m289A21015J67900p414b087A68695
$$ -287520 -70321 58697 -29380 -17294 -59393 -51789 -56078 121015 288915 281501 -2087 168695
12389e744H0975K5402D2158F609M45775k07038j19987E9388d4662a466C4405C474
$$ -5744 80975 106377 42158 6609 452384 245346 125359 59388 -44662 -1466 34405 3474
12376D09479g5596A68478O8599q7332m2052c44189a1152C82533H8300B1303a9465
$$ 409479 -75596 168478 237077 149745 107693 -344189 -11152 382533 88300 21303 -19465
12364A34301b75378P2977k20829J10808E9182a92712A45506b5746p2591c4959
$$ 134301 -275378 -202401 -423230 -312422 59182 -192712 145506 -25746 -98337 -34959
12353b86736A87830c2112A14869H532a02473o6633g605D482J10017a54494j89730
$$ -286736 187830 -32112 114869 8532 -102473 -169106 -7605 4482 114499 -154494 -344224
12342c44224E3994Q0886a88275D778J56527c3140B98136h2259J378o4338A55308
$$ -344224 53994 134880 -188275 4778 161305 -33140 298136 -82259 -80881 -145219 155308
12330A87221d5254A84299l350a09538C49337a43535F48631d9204G88K92256R6088
$$ 187221 -45254 184299 180949 -109538 349337 -143535 648631 -49204 788 293044 389132
12319C89132f5221O244E14510A32956a53957B79945J20892A50502L8852a09766
$$ 389132 -65221 -58977 514510 132956 -153957 279945 400837 150502 189354 -109766
12308I3674J81706c7716l29760G9836J20384a77695M1012E3680a27287M8787p37
$$ 93674 275380 -37716 -367476 79836 200220 -177695 -136683 53680 -127287 -78500 -79237
12297g9237L7898J1472B11978J7922G290L7448J05419M001O822E887J45557R3254
$$ -79237 -41339 -29867 211978 229900 7290 44738 150157 154158 160980 5887 151444 244698
12285B44698a01152L1949A82231h363r4092B70304B1556J68691G2570K98521j62347
$$ 244698 -101152 -69203 182231 -8363 -102455 270304 21556 190247 72570 371091 208744
12274B08744H1928P8645f032l02967A34382J40619j19683l0001a36401E2419k432
$$ 208744 81928 160573 -6032 -308999 134382 275001 155318 125317 -136401 52419 49987
12263D9987M05263B7027h268k14461A08997l4487J79165e8061j30809B63079j28423
$$ 49987 455250 27027 -8268 -222729 108997 74510 253675 -58061 -188870 263079 134656
12252A34656B2155Q2884h0007K4638C38546c07070h6984Q717K9131l8454I8032
$$ 134656 22155 105039 -80007 -55369 338546 -307070 -86984 -78267 -49136 -87590 98032
12240A53691b40580A08513a581D5746J29852d56769A06986K44214j23825Q1483
$$ 153691 -240580 108513 -1581 45746 175598 -456769 106986 351200 227375 308858
12230C08858A0001K00259k3318m1300K02892A08352J03323Q1354R2427j88476
$$ 308858 10001 210260 186942 145642 348534 108352 211675 293029 385456 196980
12220A96980n5662L43004k06661h2440A84374m801C6456K80342r874d8135C24091
$$ 196980 141318 484322 277661 -82440 184374 179573 36456 316798 306924 -48135 324091
12208B17976i6265B11925p1040J8191o6412M87767A62284K51776C3831K51888
$$ 217976 -96265 211925 140885 159076 92664 580431 162284 414060 33831 285719
12198B85719j27012c2540A29020k36J7413g8716C87186j10515l1868j04667K18297
$$ 285719 158707 -32540 129020 128784 146197 -78716 387186 276671 244803 140136 358433
12187C58433R224J32264k12049e7207m3305C27028q5289r6741J01334p5384J83744
$$ 358433 367657 499921 287872 -57207 -100512 327028 241739 144998 246332 170948 354692
12176C54692r4219A07741B5994K41222g7197C31228A01623m9775L52006A00677
$$ 354692 260473 107741 25994 267216 -77197 331228 101623 51848 403854 100677
12165D90582I3626K40587j19898R0474i0803C67919G9623h4167J9794F0715K37473
$$ 490582 93626 334213 214315 304789 -90803 367919 79623 -84167 -64373 60715 298188
12154B98188H9791K2809b00134A68967i1197C2790K04273K76650B08483b05694
$$ 298188 89791 112600 -200134 168967 -91197 32790 237063 513713 208483 -205694
12143C21837H2053J10345J63813A63775F0842B0717N863J22259g3052G6896J57240
$$ 321837 82053 192398 356211 163775 60842 20717 26580 148839 -73052 76896 234136
12132B34136o9830L638e8894C78516a10066A16481A2175h2363J2403D7771J25589
$$ 234136 164306 167944 -58894 378516 -110066 116481 12175 -82363 -69960 47771 173360
12121A73360a43899C70296j44689p8242F8915A7128J1346b12269A60373M3239
$$ 173360 -143899 370296 225607 147365 68915 17128 28474 -212269 160373 203612
12111B03612a00409A55484P8541H1777a19748M5047H1189h2139b6237A10177L05594
$$ 203612 -100409 155484 234025 81777 -119748 -74701 81189 -82139 -26237 110177 415771
12100D15771j17433a40445C11620b63706A7733b41783B51068J33190j44026R6804
$$ 415771 298338 -140445 311620 -263706 17733 -241783 251068 384258 240232 337036
12090C37036a50254B03037J9296n8514L7456J6620L16046d7941I2789b5629B95269
$$ 337036 -150254 203037 222333 163819 201275 217895 533941 -47941 92789 -25629 295269
12078H9878J85316A5346K37516L7626n8534l8442a31166b970B71784J0529A40202
$$ 89878 275194 15346 252862 290488 231954 193512 -131166 -2970 271784 282313 140202
12066i3253j06918F8312a88478F5347a48868A69206a09495k1812C8279Q9984b84457
$$ -93253 -200171 68312 -188478 65347 -148868 169206 -109495 -131307 38279 128263 -284457
12054F397K48847o6998c83564a05749D0580K16537E0662h3923J4461k57693J43836
$$ 6397 255244 188246 -383564 -105749 40580 257117 50662 -83923 -69462 -327155 -183319
12043a83319B66159A10401J96816i7664r776d4189C75480a2878j28800m344J0533
$$ -183319 266159 110401 307217 -97664 -107440 -44189 375480 -12878 -141678 -146022 -135489
12032a35489p3855q5263B24366i4114K4004k78376h1805a7041l7893A46974c2068
$$ -135489 -209344 -294607 224366 -94114 -70110 -348486 -81805 -17041 -54934 146974 -32068
12020g764l7004j78351L7901q6010C39508g2324B49113e40879g3159Q833o9274
$$ -7764 -44768 -223119 -185218 -271228 339508 -72324 249113 -540879 -73159 -64326 -133600
12009a33600A37275a19622q7921j54452G7014g5843J0668B4471K24537P5936I5045
$$ -133600 137275 -119622 -207543 -361995 77014 -75843 -65175 24471 249008 324944 95045
11997A30387A3154J40395a21585L4881b4951A16356E1470b46123a8424I5111a79933
$$ 130387 13154 153549 -121585 -86704 -24951 116356 51470 -246123 -18424 95111 -179933
11985A48529a42409p9872g1509L4888l8700m7858A42808a77073A75642D3721Q1699
$$ 148529 -142409 -222281 -71509 -36621 -75321 -123179 142808 -177073 175642 43721 125420
11974A25420e1916k46792A17672d1792E2718b43468A86339a13540H9183b84711
$$ 125420 -51916 -298708 117672 -41792 52718 -243468 186339 -113540 89183 -284711
11963h953H3032J59716a59339k20152J26159J21261F6262b665D31508o9910h0386
$$ -8953 83032 242748 -159339 -379491 -253332 -132071 66262 -2665 431508 361598 -80386
11951A25352K38095a36999a0847l8091r8289C0645b4098Q939n2409p088J5504
$$ 125352 363447 -136999 -10847 -48938 -147227 30645 -24098 -15159 -67568 -74656 -59152
11940e9152G9128K72369A06433J95265C6065j5124a30402N4321e520j76272P9247
$$ -59152 79128 351497 106433 301698 36065 20941 -130402 -76081 -5520 -181792 -102545
11929a02545A07093a25644A59325a68802j08817E370b169A49295a93209A18604
$$ -102545 107093 -125644 159325 -168802 -277619 5370 -2169 149295 -193209 118604
11918b57300D3645a43367j8751D71351a93056j11634Q7030C00164r9179J4468
$$ -257300 43645 -143367 -162118 471351 -193056 -304690 -217660 300164 200985 215453
11908B15453a62250C26697b00350E9425A1484J27035b18528B44283I2823h7275
$$ 215453 -162250 326697 -200350 59425 11484 138519 -218528 244283 92823 -87275
11897a48571L4482B4767M0492b50312I3614C9075J65517f6254c792j10270B10743
$$ -148571 -114089 24767 65259 -250312 93614 39075 204592 -66254 -3792 -114062 210743
11885b07768M4072O06J3144B14621b29087j35814g1824J7925B25871D2759b24659
$$ -207768 -163696 -163090 -149946 214621 -229087 -364901 -71824 -53899 225871 42759 -224659
11873a76990a3535D5756a72141d7813j84343j28254D8396A6948J65842B5768a43127
$$ -176990 -13535 45756 -172141 -47813 -232156 -360410 48396 16948 182790 25768 -143127
11861d34733I8319c90872B6161O2544N3601J6401b61570A2935K52364b6592o82
$$ -434733 98319 -390872 26161 88705 142306 158707 -261570 12935 265299 -26592 -27274
11850b7274l5706A77696E9969a87351B55140a4007p4919j02811J6289A27450b6495
$$ -27274 -62980 177696 59969 -187351 255140 -14007 -88926 -191737 -175448 127450 -26495
11838a55766e2115l08765k2849F8488J80397d3567j65145c1522n4257b5268q7455
$$ -155766 -52115 -360880 -383729 68488 248885 -43567 -208712 -31522 -85779 -25268 -112723
11827a12723l14010a36595f5294J476B449J1193J27105n7289c41335F8766a27457
$$ -112723 -426733 -136595 -65294 -63818 2449 13642 140747 83458 -341335 68766 -127457
11815A3068a35522k72084J21849f5586o7483j19563B14587D1734g3752B3927J40557
$$ 13068 -135522 -407606 -285757 -65586 -133069 -252632 214587 41734 -73752 23927 164484
11804A64484b38433F8516J27481o6052e29734a79645B06145a06578J8342A82369
$$ 164484 -238433 68516 195997 129945 -529734 -179645 206145 -106578 -88236 182369
11793A04597A2111c22901J14943R7658j0289f867D4632a49376d4312A79673L6597
$$ 104597 12111 -322901 -207958 -110300 -120589 -6867 44632 -149376 -44312 179673 216270
11782B16270b06924A47990c03814A8616a39200I9416a13977a8910K62k43828c8373
$$ 216270 -206924 147990 -303814 18616 -139200 99416 -113977 -18910 -18648 -262476 -38373
11770B37143j17916b1481j08374m061A62749d12740H7879K11985F084J58069b34118
$$ 237143 119227 -21481 -129855 -133916 162749 -412740 87879 299864 6084 164153 -234118
11758A7620b29950m3378B13649O7265B901a89966K6090C4152O0426D1292L1627
$$ 17620 -229950 -273328 213649 280914 2901 -189966 -163876 34152 94578 41292 72919
11747G2919j5015i171B13607q8231d8952D7657a10557b4846l03458C20500f2217
$$ 72919 57904 -9171 213607 125376 -48952 47657 -110557 -24846 -328304 320500 -62217
11735G5683b28283A48163E5264J92215a70274A7518b85916O1489h2216k79799
$$ 75683 -228283 148163 55264 247479 -170274 17518 -285916 -224427 -82216 -362015
11725c62015J34801I2929J34709L8483e6116l69099a1289G1381N3887l4265A7791
$$ -362015 -227214 92929 227638 266121 -56116 -425215 -11289 71381 125268 91003 17791
11713E1476h3239B2321a82107M9664A43972c47804E4535I186L67728b01694B06300
$$ 51476 -83239 22321 -182107 -132443 143972 -347804 54535 9186 376914 -201694 206300
11701A7129a22660k775M6581c7913I2522O2256K06119d5894J8516G7432K81393
$$ 17129 -122660 -125435 -78854 -37913 92522 154778 360897 -45894 -27378 77432 358825
11690C58825H0830b8463r706C78074A77047d4258D39987a4228F1718b19404c1497
$$ 358825 80830 -28463 -38169 378074 177047 -44258 439987 -14228 61718 -219404 -31497
11678B40419b00666K7192B41278o9131Q576a81890c1259A3392b67373B32430l7526
$$ 240419 -200666 -173474 241278 172147 180723 -181890 -31259 13392 -267373 232430 194904
11667A94904a51087A07830Q7434a03346C27743A26968i6627A22650C6963h4844
$$ 194904 -151087 107830 195264 -103346 327743 126968 -96627 122650 36963 -84844
11656c9819D9913K1304k8379P0617A2937J527J78584O6404i3959A21766J67529
$$ -39819 49913 71217 42838 113455 12937 14464 193048 259452 -93959 121766 289295
11645B89295a36452G3012B2759e2711j62568f5844A99602q7707a37558b3449J1380
$$ 289295 -136452 73012 22759 -52711 -215279 -65844 199602 111895 -137558 -23449 -12069
11634a2069l65860H0489k5272h1535k57717E1402b30073A47374a26295e7025D1802
$$ -12069 -377929 80489 55217 -81535 -339252 51402 -230073 147374 -126295 -57025 41802
11622d42486A86944j3749a76569g7225I1989e5399l4422j29971F8338J70893b43550
$$ -442486 186944 173195 -176569 -77225 91989 -55399 -89821 -219792 68338 239231 -243550
11610b5353B27382m5141i1760n4293A746b59484C10483c05719a6992F3198c6849
$$ -25353 227382 182241 -91760 -146053 1746 -259484 310483 -305719 -16992 63198 -36849
11598A56802D6590a00510k88733Q4590I0334g9560A29073c37546A66263c4002
$$ 156802 46590 -100510 -389243 -304653 90334 -79560 129073 -337546 166263 -34002
11587e8576H9888l265B1026i4787A88776L7013B7510a12999A47875a74903A36435
$$ -58576 89888 86623 21026 -94787 188776 225789 27510 -112999 147875 -174903 136435
11575e2808C20066j48114B4133n862a24258d982A02151M540a61602B9477A0631
$$ -52808 320066 171952 24133 18271 -124258 -4982 102151 106691 -161602 29477 10631
11563G0597J52915D5959N7147O0218b28773B6813L48479B9320K61278c1350i267
$$ 70597 223512 45959 103106 163324 -228773 26813 375292 29320 290598 -31350 -9267
11551D6481J58221c3478A7269C619b57179A34956g2182C77536A883N1543c12560
$$ 46481 204702 -33478 17269 3619 -257179 134956 -72182 377536 1883 53426 -312560
11539b39550J6949B97538d8404j62140B27504m9316A1547L21231a962D2056c6003
$$ -239550 -222601 297538 -48404 -210544 227504 178188 11547 332778 -1962 42056 -36003
11527A27158d9578A26007a85127F4192K0430l2736J23401b30266R6564A43792
$$ 127158 -49578 126007 -185127 64192 84622 51886 175287 -230266 -133702 143792
11516E09179a71592A80414m2605O3972L7911r0418J96924C9586J90746G9167O1880
$$ 509179 -171592 180414 137809 201781 239692 149274 346198 39586 230332 79167 141047
11505A41047L59422A60194g0427K0754F1800B4010Q0128N9668b03391C6220K5486
$$ 141047 500469 160194 -70427 -49673 61800 24010 104138 163806 -203391 36220 61706
11494F1706K4469b60287B97794j14086b94678A71225f2485A55437J50770A40346
$$ 61706 86175 -260287 297794 183708 -294678 171225 -62485 155437 306207 140346
11483E5946J19832Q9943a9671B96407P296k9680M7192D1769i1539A44466n3900
$$ 55946 175778 265721 -19671 296407 303703 274023 321215 41769 -91539 144466 90566
11472I0566N05828B67784l7870H9915b10942A4280b97200J34985f6345A11158
$$ 90566 596394 267784 229914 89915 -210942 14280 -297200 -162215 -66345 111158
11461D46741k22421B0496a16453A84937a13178M8454A90441d3723B11047c8249
$$ 446741 224320 20496 -116453 184937 -113178 -64724 190441 -43723 211047 -38249
11450d2088j1690B72962k9969E3596b17162B69378F9968h4659E3530D848K1029
$$ -42088 -53778 272962 242993 53596 -217162 269378 69968 -84659 53530 4848 25877
11439B5877J09898k5465P9181j1365b10706F1867J26121O8784d7234B28548m3670
$$ 25877 135775 110310 189491 178126 -210706 61867 187988 256772 -47234 228548 184878
11428A84878e3089j17330J2160A10118M5199n9339f6742B03211P2272H247a88123
$$ 184878 -53089 -170419 -158259 110118 155317 95978 -66742 203211 275483 8247 -188123
11416b1950H9918a89277M5642j66434B27720a23105A33820c2827B62503e1700
$$ -21950 89918 -189277 -143635 -310069 227720 -123105 133820 -32827 262503 -51700
11405A75758n3858a60886m9357k4250M7155R1303A74461N3947b14335B86954n9859
$$ 175758 121900 -160886 -210243 -234493 -187338 -96035 174461 228408 -214335 286954 227095
11394B27095J36722D6553Q791a35645o4010B390i5110r7340A46178C2420b25487
$$ 227095 363817 46553 55344 -135645 -199655 2390 -95110 -192450 146178 32420 -225487
11382B8783a98803A67669a82308b607j95620J0220a9024A75310a47570j9459D33278
$$ 28783 -198803 167669 -182308 -2607 -198227 -188007 -19024 175310 -147570 -167029 433278
11370B01005a54805A77669q8322B9466a603E6658e69352b56303f0816B71950F6290
$$ 201005 -154805 177669 89347 29466 -1603 56658 -569352 -256303 -60816 271950 66290
11358d4085k00234E6853J13695c9728n3165J5091j91521A86121a98635A54349
$$ -44085 -244319 56853 170548 -39728 -92893 -77802 -269323 186121 -198635 154349
11347a01323B79055r5335O9866A09986a97699h2628B02707a32736a0937j74788
$$ -101323 279055 183720 253586 109986 -197699 -82628 202707 -132736 -10937 -185725
11337a85725f8132c3782k35672E0062i6579q5436D36662b05973F6092a85477e1851
$$ -185725 -68132 -33782 -269454 50062 -96579 -182015 436662 -205973 66092 -185477 -51851
11325C1336g1630B05935a54301N5742j7052k1808A62705L1792a9509A01760c10547
$$ 31336 -71630 205935 -154301 -98559 -115611 -137419 162705 194497 -19509 101760 -310547
11313C6975c44223C40032h4398E5472M2855a955C6133R7003b16044p7963H8355
$$ 36975 -344223 340032 -84398 55472 98327 -1955 36133 133136 -216044 -294007 88355
11301b8854k6891A94851d8536j36600G0030r961f5504r6934D7345a93453E2406
$$ -28854 -55745 194851 -48536 -185136 70030 60069 -65504 -162438 47345 -193453 52406
11289E1824a44837j52332D5505N2436a57568e2197F0052c2287B10065c0790A60716
$$ 51824 -144837 -297169 45505 97941 -157568 -52197 60052 -32287 210065 -30790 160716
11277b82635D6907Q0698c5974B19715b2503C0993c4269J212E5331O0645L2030
$$ -282635 46907 127605 -35974 219715 -22503 30993 -34269 -33057 55331 115976 148006
11266A48006b37559a5777B50686a44866H9619r470a50635A8334b78304I1195b03629
$$ 148006 -237559 -15777 250686 -144866 89619 80149 -150635 18334 -278304 91195 -203629
11254b47913H104K07907G4967b9788n05995G6353b4508a1966A35678c44844b454
$$ -247913 8104 216011 74967 -29788 -535783 76353 -24508 -11966 135678 -344844 -2454
11242A01088a07982j95593j11151b02258G2128K01740a09497A63555b30880A71583
$$ 101088 -107982 -303575 -414726 -202258 72128 273868 -109497 163555 -230880 171583
11231d0372j63182j25756A25010b11078D77372a47097k66808q805A83247p3376
$$ -40372 -203554 -329310 125010 -211078 477372 -147097 -413905 -422710 183247 109871
11221A09871e78599a47132J5363r6842M4202A48713c4662F396a43830n9276j74070
$$ 109871 -578599 -147132 -131769 -228611 -184409 148713 -34662 6396 -143830 -203106 -377176
11210c77176a0026j90268C35824j65416J2578a12527a3547B42117c53662C1479
$$ -377176 -10026 -200294 335824 170408 182986 -112527 -13547 242117 -353662 31479
11199B5230K2885a83754n0682A76338a09075b8445k34475p7700e1502a3429m07134
$$ 25230 48115 -183754 -234436 176338 -109075 -28445 -262920 -340620 -51502 -13429 -420563
11188d20563J33077G8009e5200B22904c89531E7028k3812O7186d6897F3634h7065
$$ -420563 -287486 78009 -55200 222904 -389531 57028 33216 100402 -46897 63634 -87065
11176D00457j99763B1223A89R9674c17715J06484G4925a02530k39888a05018k57631
$$ 400457 200694 21223 189 99863 -317715 -211231 74925 -102530 -342418 -105018 -362649
11165c62649E5650e8653j57406C216K1668R3937a5663o148A9121a04528j37390
$$ -362649 55650 -58653 -216059 3216 24884 118821 -15663 -21811 19121 -104528 -241918
11154b41918J14445r0743f6092A00033c20794a28087B76117E061b62751j23462
$$ -241918 -127473 -218216 -66092 100033 -320794 -128087 276117 5061 -262751 -386213
11144c86213J19043A14201a66816j10488i4263J323F5975f6855j31610C26833
$$ -386213 -267170 114201 -166816 -277304 -94263 -92940 65975 -66855 -198465 326833
11133F1347b99912a17739p8845L2709q2135F8666i3590B4391g7807B4420O4139
$$ 61347 -299912 -117739 -196584 -163875 -246010 68666 -93590 24391 -77807 24420 88559
11122H8559N330J11453b6051A48819p1160M3055a09374A67063l5815a2887A07673
$$ 88559 93889 205342 -26051 148819 77659 120714 -109374 167063 131248 -12887 107673
11110A12802a54260a8432k78940C34974a92088B31497b01944O299b7138A62049
$$ 112802 -154260 -18432 -297372 334974 -192088 231497 -201944 -195645 -27138 162049
11099C02571R728j17233c5769q244C86712b2765B40303b52994B48718G4168a05768
$$ 302571 312299 195066 -35769 -44013 386712 -22765 240303 -252994 248718 74168 -105768
11087C05572E159L06813k8264G6826H165N39092j29888j13156A9085J37789L37555
$$ 305572 5159 311972 283708 76826 8165 547257 417369 304213 19085 156874 494429
11076D94429j08136J16985j48664j50806l8855J9990J61459K7753J04537G7120
$$ 494429 386293 503278 354614 203808 164953 184943 346402 374155 478692 77120
11065E45710n3344B21870J37411m1790J35002j27738L59090r8348q3352K47204
$$ 545710 492366 221870 359281 317491 452493 324755 683845 585497 502145 749349
11055G49349A00968K95348M51325j65345j30310J85838B92779M21038J47502o3254
$$ 749349 100968 396316 847641 682296 551986 737824 292779 713817 861319 798065
11045G98065l29285N25280q0180Q6764P2188k59939j59943J19592L9113A96717
$$ 798065 468780 994060 913880 1000644 1072832 812893 652950 772542 811655 196717
11034G03510J51093j72799j42884N5033R3527J68854k8947l40050p4174K85231
$$ 703510 854603 681804 538920 593953 687480 856334 827387 487337 413163 698394
11024F98394j115k75195K63788R2142L90639l04984k07298l0180l3455j24159
$$ 698394 697279 422084 685872 778014 1168653 863669 656371 626191 592736 468577
11014D68577K04551j76635K44985j32360A85129O13617j81167n2557J99202l28657
$$ 468577 673128 496493 741478 609118 185129 798746 617579 565022 764224 435567
11004D35567M7443K61602C31377L94801J92722D59023L21679j97527j31555J93794
$$ 435567 483010 744612 331377 726178 918900 459023 780702 583175 451620 645414
10994F45414k77503M62743C28115L30077k7408J05101K13461C49361M37698l40106
$$ 645414 367911 830654 328115 658192 630784 735885 949346 349361 787059 446953
10984D46953L81065M38408m89424Q0446L51620j61112j37126k86349O41942J00329
$$ 446953 828018 1266426 777002 857448 1209068 1047956 910830 624481 1266423 1366752
10974A366752J71855J50877K08814M51708j27132L66211q1373J42555L72140m27630
$$ 1366752 1538607 1689484 1898298 2350006 2222874 2589085 2507712 2650267 3022407 2594777
10964B594777K0591k41147J03517p93228L29777l98034r8655l59609K00122R6003
$$ 2594777 2615368 2374221 2477738 1684510 2014287 1616253 1517598 1157989 1358111 1454114
10954A454114K57317m5802K6401m20137o8933r1559J54603l67928k75696Q18A90322
$$ 1454114 1711431 1665629 1692030 1271893 1202960 1111401 1266004 898076 622380 623198 190322
10942D91580j89408K6651L0538c7519C36008j66681J1540J4518A2762J83049p436
$$ 491580 302172 328823 359361 -37519 336008 169327 180867 195385 12762 195811 188375
10931A88375p4737b5813A25650h9845j40007A24296R2370F0423f8909G0115c1313
$$ 188375 113638 -25813 125650 -89845 -229852 124296 216666 60423 -68909 70115 -31313
10919A81052K5776a9714n9917k15993B03949E9892d8191A08263c97443B19622
$$ 181052 206828 -19714 -79631 -295624 203949 59892 -48191 108263 -397443 219622
10908B86073p4087E0305P5066b7863F3632k3504J26557c5693k80717e3030B00466
$$ 286073 211986 50305 125371 -27863 63632 40128 166685 -35693 -316410 -53030 200466
10896c27997J15255B27538m2464F2523c29945a4360k7669A22037j5573D4731J75401
$$ -327997 -212742 227538 185074 62523 -329945 -14360 -42029 122037 106464 44731 220132
10885B20132g821B40537b48673d5600I9754J57648B2904a09105A72563K6077c1664
$$ 220132 -7821 240537 -248673 -45600 99754 257402 22904 -109105 172563 198640 -31664
10873C7594K51497I3062b90406l4622g1008A6345a20048j61031A37242a39500
$$ 37594 289091 93062 -290406 -325028 -71008 16345 -120048 -281079 137242 -139500
10862A283K51376j8791a38040B32589b49253a0596j05863l33257a00999F1256
$$ 1283 252659 233868 -138040 232589 -249253 -10596 -116459 -449716 -100999 61256
10851C8316j8180R6279d3756q1448m255L8477J2680A64547c5482m60687a88574
$$ 38316 20136 116415 -43756 -125204 -129459 -90982 -78302 164547 -35482 -496169 -188574
10839E816J29416b60748A22743e0368A24280I762J20895b25868q365l1666C1604
$$ 5816 135232 -260748 122743 -50368 124280 9762 130657 -225868 -234233 -265899 31604
10827c4160A91723b57801h4656j9593A40276b18380A4107K53133e818k41488j89845
$$ -34160 191723 -257801 -84656 -104249 140276 -218380 14107 267240 -5818 -247306 -437151
10816d37151G2294a53154c8592J4720j96742M0348N1348C31632e1642k656j02852
$$ -437151 72294 -153154 -38592 -23872 -220614 -180266 -128918 331632 -51642 -54298 -157150
10805a57150d3223B3310J31019j3594C8409p141K5281c52658A3874i6011l0577
$$ -157150 -43223 23310 154329 140735 38409 31268 56549 -352658 13874 -96011 -126588
10794a26588A13433l7650h9345D3269j3986c8141j51902q8405A18936e5161k65456
$$ -126588 113433 75783 -89345 43269 29283 -38141 -190043 -278448 118936 -55161 -320617
10783c20617B67621b04152Q0833j78707b2824A2517b2713m6461A3983K20602b95953
$$ -320617 267621 -204152 -123319 -302026 -22824 12517 -22713 -69174 13983 234585 -295953
10771B01852b99491A8851i1012l61955F1810b62645A61508C4945c10491B37078
$$ 201852 -299491 18851 -91012 -452967 61810 -262645 161508 34945 -310491 237078
10760A08975A0165e4481E3004J2662a53156O9174B39467a27523l8858o1873D58598
$$ 108975 10165 -54481 53004 65666 -153156 -83982 239467 -127523 -166381 -228254 458598
10748a78778d4549j27962N2708m4744B1238J34441c73499H9044R707a96502B36995
$$ -178778 -44549 -172511 -119803 -164547 21238 155679 -373499 89044 98751 -196502 236995
10736C15079E9593a04908J2002Q908B66102A9463a09723B12158j03577P8783D2892
$$ 315079 59593 -104908 -92906 -83998 266102 19463 -109723 212158 108581 187364 42892
10724A96304c41631h1213m0035D6673d17034a05127k7962j26403I7270J81705
$$ 196304 -341631 -81213 -121248 46673 -417034 -105127 -133089 -259492 97270 278975
10714B78975A10004b4019n0381k3542m2265c4227B04797H2280f1907F8537b3548
$$ 278975 110004 -24019 -74400 -97942 -140207 -34227 204797 82280 -61907 68537 -23548
10702E5336L23064A28936b60802j72759C30814C4270a82731N9558a1426j86855
$$ 55336 378400 128936 -260802 -433561 330814 34270 -182731 -123173 -11426 -198281
10692a98281A1726J17525c37165J35867j13754a39567q722C386d23686a91407
$$ -198281 11726 129251 -337165 -201298 -315052 -139567 -148289 3386 -423686 -191407
10681e2080J9134B3013G169b03331O40B0829b07124H1688b08599B12281I3592
$$ -52080 -32946 23013 7169 -203331 -202691 20829 -207124 81688 -208599 212281 93592
10669A37882n2818f0150J7738j7947J8093o285D4845Db13435l3759h1467B63488
$$ 137882 85064 -60150 -42412 -60359 -42266 -48551 44845 4 -213435 -247194 -81467 263488
10656C8167M4065c4298A03726J83384a41946O9388j41333B82801b63633l1761
$$ 38167 82232 -34298 103726 287110 -141946 -72558 -213891 282801 -263633 -295394
10646b95394M7786A67331b18434M5698i281j11089B02856f3199K1055k5822D42881
$$ -295394 -247608 167331 -218434 -172736 -9281 -120370 202856 -63199 -42144 -67966 442881
10634b01728B15355c47600d6638q3986p5629c3632E2408c0206G4425b06624K8244
$$ -201728 215355 -347600 -46638 -130624 -206253 -33632 52408 -30206 74425 -206624 -178380
10623a78380H012b1703k90080c2726r0498n7134B8528a64832L0440A14705a97364
$$ -178380 8012 -21703 -311783 -32726 -123224 -180358 28528 -164832 -134392 114705 -197364
10611i9875j21605P2264K126b0652j45633B06721a56260I5901a57095G0080a36495
$$ -99875 -221480 -149216 -147090 -20652 -166285 206721 -156260 95901 -157095 70080 -136495
10599C55613j44718a43845K4421C887N7225K31860b5202N206B25739d2412k36995
$$ 355613 210895 -143845 -119424 3887 61112 292972 -25202 -19996 225739 -42412 -279407
10588b79407Q389d7549A46405a25032A91856c68564a57332j74589H4284a72169
$$ -279407 -271018 -47549 146405 -125032 191856 -368564 -157332 -331921 84284 -172169
10577e4182B48610C3891b81365j88679K23373a15768D0431g8664j31739B3360
$$ -54182 248610 33891 -281365 -470044 -246671 -115768 40431 -78664 -210403 23360
10566b43730n210A40815a75215A63915d6682C6226h701j07648j46630C88927a24550
$$ -243730 -248940 140815 -175215 163915 -46682 36226 -8701 -116349 -262979 388927 -124550
10554d5997A06177c07316a11319a2770A27422b48375B19099B44a18113f052A90568
$$ -45997 106177 -307316 -111319 -12770 127422 -248375 219099 244 -118113 -6052 190568
10542b63140C6295a24397H7590a34043m2445l6308C45685A19135a51347m9459
$$ -263140 36295 -124397 87590 -134043 -176488 -212796 345685 119135 -151347 -200806
10532b00806B37478d81878J79943B89332c2597k93279d8086A24490M1841b7566
$$ -200806 237478 -481878 -301935 289332 -32597 -325876 -48086 124490 166331 -27566
10521a00163C24571b39712h6447E2638R135d2389j48406O9462j03627J3771F6235
$$ -100163 324571 -239712 -86447 52638 61773 -42389 -190795 -121333 -224960 -211189 66235
10509F4978b82811f7901H7070a54463P3566B91747A21171a8017C53376c6533m0978
$$ 64978 -282811 -67901 87070 -154463 -80897 291747 121171 -18017 353376 -36533 -77511
10498g7511A7173a77375d9738p7628E2712f6956k57421d3824a0681l2533l60290
$$ -77511 17173 -177375 -49738 -127366 52712 -66956 -324377 -43824 -10681 -43214 -403504
10487d03504B27973i8205j05346c672l32815i2535A88683F1765i6029C84842j70807
$$ -403504 227973 -98205 -203551 -3672 -336487 -92535 188683 61765 -96029 384842 214035
10476B14035J3472M40435l21690J66049A36827D2732J31792B2273J24641k2459
$$ 214035 227507 667942 346252 512301 136827 42732 174524 22273 146914 124455
10466A24455B187a55877e855A714c72328J19677i0537A07172a94469A43122j9406
$$ 124455 2187 -155877 -5855 1714 -372328 -252651 -90537 107172 -194469 143122 123716
10455A23716d2671m2434p0056c576D51669a37380O4631m5297a719D446d9968A00600
$$ 123716 -42671 -85105 -155161 -3576 451669 -137380 -72749 -118046 -1719 4446 -49968 100600
10442g2359I4965K09O1771A6401b8390j58215k5775D4733K591a15523G2256b94666
$$ -72359 94965 95174 156945 16401 -28390 -186605 -212380 44733 47324 -115523 72256 -294666
10429h5817j43315D26263A76808i7448r3636I4116b18485j40251H1165e4100j73190
$$ -85817 -229132 426263 176808 -97448 -191084 94116 -218485 -358736 81165 -54100 -227290
10418b27290B25084f6620o3648I9605K4424D5257M2196F684c1186k06971A3510
$$ -227290 225084 -66620 -130268 99605 124029 45257 87453 6684 -31186 -238157 13510
10406F7169b18905A1863K53515a34673D5132i4076E1825e5864A891i6641j66860
$$ 67169 -218905 11863 265378 -134673 45132 -94076 51825 -55864 1891 -96641 -263501
10395b63501J12783A60365J86808b4804I8821a5600k09341A90892e7728D8611
$$ -263501 -150718 160365 347173 -24804 98821 -15600 -224941 190892 -57728 48611
10384A28509e7821C00694c32519k1990G4780K256j0399O8072O9760L14375B24110
$$ 128509 -57821 300694 -332519 -354509 74780 77036 66637 134709 204469 518844 224110
10372D51792A55745a3696F045J02159L9570K73491m0281l1782H0149N03059J9736
$$ 451792 155745 -13696 6045 108204 147774 421265 380984 349202 80149 583208 602944
10361F02944B70875M07640B3058K83759k7060p5624r0883R6119O6427e5302B55478
$$ 602944 270875 678515 23058 306817 279757 204133 113250 209369 275796 -55302 255478
10349F34572j90427l0559N9327m4679l1121G0582L14741M0200o6580r9199M6806
$$ 634572 444145 413586 472913 428234 397113 70582 385323 425523 358943 259744 306550
10338C06550b4229A87230J68118Q0072m8583J23701j82355E2883O6407c24748
$$ 306550 -24229 187230 355348 435420 386837 510538 328183 52883 119290 -324748
10327a25307A97931H1797b28117c5099C3275K35676I3661J16621K7343Q9089a27848
$$ -125307 197931 81797 -228117 -35099 33275 268951 93661 210282 237625 326714 -127848
10315D140J51944O9840I5902A1684b2377B4874d9579h216k3200G784R6261a41373
$$ 4140 156084 225924 95902 11684 -22377 24874 -49579 -8216 -31416 7784 104045 -141373
10302a21994C21282j16596Q9990A07728c5958M414B13076a40873K7816C13753
$$ -121994 321282 204686 294676 107728 -35958 -31544 213076 -140873 -113057 313753
10291g1051J9405k37140J4147A31235a48902J2004r0216j33316J15074A44821
$$ -71051 -51646 -288786 -274639 131235 -148902 -136898 -227114 -360430 -245356 144821
10280b02045L952F7943e3412j73426J05106H6193c2395j5534o2334j94755b4951
$$ -202045 -198093 67943 -53412 -226838 -121732 86193 -32395 -47929 -110263 -305018 -24951
10268b23456b9325k80790D3310b1166B52469e7270B4651C734b02169l9989K5960
$$ -223456 -29325 -310115 43310 -21166 252469 -57270 24651 3734 -202169 -242158 -216198
10257b16198A01299b85593B0341L67500j70216g615A18215E3712K57952a3244
$$ -216198 101299 -285593 20341 387841 217625 -7615 118215 53712 311664 -13244
10246A03835L3921D9841a88859b2702m7298L994j96722a15222K0444k54263J01775
$$ 103835 137756 49841 -188859 -22702 -70000 -66006 -262728 -115222 -94778 -349041 -247266
10235b47266d1810l53880B86423n3117C5532b55617C0726b10755c8249p0391A49913
$$ -247266 -41810 -395690 286423 233306 35532 -255617 30726 -210755 -38249 -108640 149913
10223i0412j19h331A9525c55624J64739g4003A74177D9686a05949A1777b32543
$$ -90412 -90531 -8331 19525 -355624 -190885 -74003 174177 49686 -105949 11777 -232543
10211a54117B8440L15150a44418J1354c2783E1862K5388J06924a42494O3339A85022
$$ -154117 28440 343590 -144418 -133064 -32783 51862 77250 184174 -142494 -79155 185022
10199A15431a62916J8404b4097F0771g5596l78490a17627k7944F4917a36111d174
$$ 115431 -162916 -144512 -24097 60771 -75596 -454086 -117627 -145571 64917 -136111 -4174
10187D9020K5951l4990R2325b47709B05298a2632j79249q650c4237j8254j2647
$$ 49020 74971 39981 132306 -247709 205298 -12632 -191881 -200531 -34237 -52491 -65138
10176f5138B10237b87055r2668J32684P5840C1179b16161M9089e5136H2008a50685
$$ -65138 210237 -287055 -379723 -247039 -171199 31179 -216161 -167072 -55136 82008 -150685
10164f9410D4028i2405A00984a71302B4998f9548k2973j60132A60226a05058k82321
$$ -69410 44028 -92405 100984 -171302 24998 -69548 -92521 -252653 160226 -105058 -387379
10153c87379n7259g9352C6129c4283r8424I5167O731B2554K15241b82998c0998
$$ -387379 -444638 -79352 36129 -34283 -132707 95167 101898 22554 237795 -282998 -30998
10141C8045c13086A22993J14796b99700D8869J46318M5538H3770b3071A31896
$$ 38045 -313086 122993 237789 -299700 48869 195187 240725 83770 -23071 131896
10130a93732P4322A92205b93655M2501d6459B83050n7454A8365a7330A38540h1148
$$ -193732 -119410 192205 -293655 -251154 -46459 283050 225596 18365 -17330 138540 -81148
10118A91793b43339C23731a45148j11187a22574j27536B6844a08506p9127C1820
$$ 191793 -243339 323731 -145148 -256335 -122574 -250110 26844 -108506 -187633 31820
10107a59264G7291Q2536b61871R2627H8560K0854a37737k85079c6085k28781N5034
$$ -159264 77291 159827 -261871 -169244 88560 109414 -137737 -422816 -36085 -264866 -209832
10096b09832a9041j05679d9206k41666a36255K6075j72966A3818R4137M2424R6160
$$ -209832 -19041 -124720 -49206 -290872 -136255 -110180 -283146 13818 107955 150379 246539
10085B46539p8497h401o7952B8951b13491H0980a58344B26266q5397a47814M1816
$$ 246539 168042 -8401 -76353 28951 -213491 80980 -158344 226266 140869 -147814 -105998
10074a05998B47154b27861j79401A35795b41103B8280c28787N1689A12657b73706
$$ -105998 247154 -227861 -407262 135795 -241103 28280 -328787 -277098 112657 -273706
10063A96622b11937i2147D7364b10458C8804j493K4191a4853j92932m8130g2191
$$ 196622 -211937 -92147 47364 -210458 38804 37311 61502 -14853 -207785 -255915 -72191
10051I2157d18519F648L76956a7807j32699I9432f0858j46399e3782B6238a112
$$ 92157 -418519 6648 383604 -17807 -150506 99432 -60858 -207257 -53782 26238 -1112
10039a6558k54682J08213d293E0679b51654A33027a7760A6595h621k88835R1526
$$ -16558 -271240 -163027 -4293 50679 -251654 133027 -17760 16595 -8621 -297456 -205930
10028b05930f7214C32083g1589j83478I2230b15522g6620A48378f1617j18031
$$ -205930 -67214 332083 -71589 -255067 92230 -215522 -76620 148378 -61617 -179648
10018a79648q5852G7208a12963C23423b02182B26452B3267J87098h1443k80569
$$ -179648 -265500 77208 -112963 323423 -202182 226452 23267 210365 -81443 -362012
10008c62012f1974A0930c5784j5863k45819c6548l64875B30971a69703c4644A6914
$$ -362012 -61974 10930 -35784 -51647 -297466 -36548 -401423 230971 -169703 -34644 16914
9996A60518L1081a99791P5080A03703a00062b5888r4850o8972j24507P2646a9993
$$ 160518 191599 -199791 -124711 103703 -100062 -25888 -120738 -189710 -314217 -241571 -19993
9984A59259a39423C45190A59315a48488A22988b91360h9743K4658n6725j9697
$$ 159259 -139423 345190 159315 -148488 122988 -291360 -89743 -65085 -121810 -141507
9974a41507I2104R9419a0483A6436J18397b46406c9697k90927k16580B17641a57956
$$ -141507 92104 191523 -10483 16436 134833 -246406 -39697 -330624 -547204 217641 -157956
9962G8037B8917J43179c49994J69398k5702k9953B6550d19454C15807g3997F48
$$ 78037 28917 172096 -349994 -180596 -206298 -236251 26550 -419454 315807 -73997 648
9950a85195B8175a39734o7384O9852m1861j87884A25632J31855e4497J7976j4624
$$ -185195 28175 -139734 -207118 -137266 -179127 -367011 125632 257487 -54497 -36521 -51145
9939e1145A12020b29886A98328c36322j56061B92115a22838A410c3822j15681
$$ -51145 112020 -229886 198328 -336322 -492383 292115 -122838 1410 -33822 -149503
9929a49503B23256b37190E769K38456A11102a37649k93999L0991B84311B7439
$$ -149503 223256 -237190 5769 244225 111102 -137649 -431648 -400657 284311 27439
9918b79094b4433j25028J6229M2509J3753B959a44227G9537d10518c6160k41855
$$ -279094 -24433 -149461 -133232 -90723 -76970 2959 -144227 79537 -410518 -36160 -278015
9907b78015h341m1041B02639a71823B16695G145e8092k5077b0995D5756i7562
$$ -278015 -8341 -49382 202639 -171823 216695 7145 -58092 -83169 -20995 45756 -97562
9895I6447g0899a3160n0706j60702r4226g4851j48964B70370b68571A8145c37140
$$ 96447 -70899 -13160 -63866 -224568 -318794 -74851 -223815 270370 -268571 18145 -337140
9883a39112k03142O2796d4051r3738K8413j72634B91686a90218E0828a9525B00884
$$ -139112 -342254 -279458 -44051 -137789 -109376 -282010 291686 -190218 50828 -19525 200884
9871a19256F4975d29741J71150i4022b7766k18987a12917k79965a42785A81031
$$ -119256 64975 -429741 -258591 -94022 -27766 -246753 -112917 -392882 -142785 181031
9860A58092f1935K6282k61182B20468A08719A0786C777a498B03106f2207A18648
$$ 158092 -61935 -35653 -296835 220468 108719 10786 3777 -1498 203106 -62207 118648
9848i4618j47668e0088j19646I773b26878B13111h4588J7198J6878E8521N3540
$$ -94618 -242286 -50088 -169734 9773 -226878 213111 -84588 -67390 -50512 58521 112061
9837A12061a19150B28954d1353H0992b42306g5447a0042m10061F3822j5846a57825
$$ 112061 -119150 228954 -41353 80992 -242306 -75447 -10042 -420103 63822 47976 -157825
9825b08353q2440n4994B5164b10045f5650b3740q5337l09887A8032K9805e14890
$$ -208353 -290793 -345787 25164 -210045 -65650 -23740 -109077 -418964 18032 47837 -514890
9813B34670J23119a09428p3289F8201i414m34882a32262A36328f2406j68543n8994
$$ 234670 357789 -109428 -182717 68201 -9414 -444296 -132262 136328 -62406 -230949 -289943
9802b89943n7217J31338C5694a49892j9992e9861q6592a4455p602A6014L6097
$$ -289943 -347160 -215822 35694 -149892 -169884 -59861 -146453 -14455 -22057 16014 52111
9791E2111b79077J9504j94899B74991j36620J76837c85404J58169M8221C25343
$$ 52111 -279077 -259573 -454472 274991 138371 315208 -385404 -227235 -179014 325343
9780c42455J62145B0342b74225c0468A40123a63244c9792A50841b20225A43348
$$ -342455 -180310 20342 -274225 -30468 140123 -163244 -39792 150841 -220225 143348
9769D4914N317b96014J42828L3388G7196a36234n8168k04315I9492b13896j55761
$$ 44914 50231 -296014 -153186 -119798 77196 -136234 -194402 -398717 99492 -213896 -369657
9758c69657c3621j49564h2976G8105N1321h7538k338C88203a8216H8965J39181
$$ -369657 -33621 -183185 -82976 78105 129426 -87538 -89876 388203 -18216 88965 228146
9747B28146D760a37023B272g5743I5612M5019a65692j16270J16057j24370A36595
$$ 228146 4760 -137023 2272 -75743 95612 140631 -165692 -281962 -165905 -290275 136595
9735e3638r558n253G0706a92997D3928Q7317E5300e41133G4004J82299F6286a32117
$$ -53638 -63196 -68449 70706 -192997 43928 131245 55300 -541133 74004 256303 66286 -132117
9722F0102j8603i2066k27820D0702A2197Q0879d36141d3713j91291n5023A18335
$$ 60102 41499 -92066 -319886 40702 12197 93076 -436141 -43713 -235004 -290027 118335
9710C0437f7301G9967a14097j73100k6906M6609F1503n032a74491k2129h1128
$$ 30437 -67301 79967 -114097 -287197 -314103 -267494 61503 56471 -174491 -196620 -81128
9698a77310C06796a05382N0962p8087r1201p2588o466A87089c33887A2509P5552
$$ -177310 306796 -105382 -54420 -132507 -223708 -296296 -302762 187089 -333887 12509 88061
9687H8061A1809a26985l6738k20862b6529E5843H55a26323A61027a39199f7089
$$ 88061 11809 -126985 -163723 -384585 -26529 55843 855 -126323 161027 -139199 -67089
9675B56428b52985f2899k19177j03418B0402i5944l29599J84114C0318a24388
$$ 256428 -252985 -62899 -282076 -385494 20402 -95944 -425543 -241429 30318 -124388
9664b01618l6133A4946b20225e9756F1331a37937M8318A36076K01829c89432h0092
$$ -201618 -237751 14946 -220225 -59756 61331 -137937 -89619 136076 337905 -389432 -80092
9652c71846C0953p775c04886A8823b20437g3417L5513A01847M4553a55670g1778
$$ -371846 30953 23178 -304886 18823 -220437 -73417 -37904 101847 146400 -155670 -71778
9640B2356a89985J7667E7416a55180e8251J3025l2230J6859G4079b05153A4250
$$ 22356 -189985 -172318 57416 -155180 -58251 -45226 -77456 -60597 74079 -205153 14250
9628A06231N1147a06886K1376b2132m58252A30668a25527C5637P5639a55307f7803
$$ 106231 157378 -106886 -85510 -22132 -480384 130668 -125527 35637 111276 -155307 -67803
9616a14994j438B78727g8337K3491l14848B39386I7119a52254L4347j47984i4299
$$ -114994 -116432 278727 -78337 -54846 -369694 239386 97119 -152254 -117907 -265891 -94299
9604b76510J32822J1386a297l0985D62251I3202e1109A5009a14280l34378a90054
$$ -276510 -143688 -132302 -1297 -32282 462251 93202 -51109 15009 -114280 -448658 -190054
9592h3962k2536M382C9536a80344Q4279b8094j76280e143A02554h8067k6280j6038
$$ -83962 -106498 -102116 39536 -180344 -96065 -28094 -204374 -5143 102554 -88067 -114347 -130385
9580a30385b0796O995r15k15686b399j0365C5108h8691R763j59371e7247E5216
$$ -130385 -20796 -13801 -14716 -230402 -2399 -12764 35108 -88691 -78928 -238299 -57247 55216
9567a48212l0707r9015A04789a19940M3269I3871a61242g2382j37945E2285i0477
$$ -148212 -178919 -277934 104789 -119940 -76671 93871 -161242 -72382 -210327 52285 -90477
9555g7847B31570g4852a7365j1428k9840I1050c60476A27264k7812J34550b40334
$$ -77847 231570 -74852 -17365 -28793 -58633 91050 -360476 127264 99452 234002 -240334
9543g3448l0676j46851g0830F680J37651d0958k43594b2942l8600A18805h2773
$$ -73448 -104124 -250975 -70830 6680 144331 -40958 -284552 -22942 -61542 118805 -82773
9531B0840J25728a47240N3386j19533h5485I4332g8419j96086B36061I7850j5863
$$ 20840 146568 -147240 -93854 -213387 -85485 94332 -78419 -274505 236061 97850 81987
9520H1987a49598B37092a573D0086c218B21656H2110b23030I6590c04884h5103
$$ 81987 -149598 237092 -1573 40086 -3218 221656 82110 -223030 96590 -304884 -85103
9508a40489p9087N87A0218N0376b9258r7537K8221P24k72006F711c7818C01843
$$ -140489 -219576 -218989 10218 60594 -29258 -126795 -98574 -97850 -369856 6711 -37818 301843
9495i7139C9274i0959j67792E7658b352k53662A3315i8663B20227n7189O3994
$$ -97139 39274 -90959 -258751 57658 -2352 -256014 13315 -98663 220227 163038 227032
9484B27032a85628P3706K0371A78860q723d82330a03159j0861K6659C01011A05012
$$ 227032 -185628 -111922 -91551 178860 170137 -482330 -103159 -114020 -87361 301011 105012
9472f4387a1061j48454B99936b92261e5014m03749R5204a02258H2187a17846B80701
$$ -64387 -11061 -159515 299936 -292261 -55014 -458763 -363559 -102258 82187 -117846 280701
9460A38797a07062F7643J56208b73377i2626j16322o9895j4221a22514A03870
$$ 138797 -107062 67643 223851 -273377 -92626 -208948 -278843 -293064 -122514 103870
9449a79410Q7316A71722d7930C2238a96620K7496E7147d8356A78606F3373b2590
$$ -179410 -92094 171722 -47930 32238 -196620 -169124 57147 -48356 178606 63373 -22590
9437c0690A2471a51699L9421A32951F3291a83673k9673O0160K7334C9492c54146
$$ -30690 12471 -151699 -112278 132951 63291 -183673 -213346 -153186 -125852 39492 -354146
9425b39921P5117M655B7088M7926b10563e6032B40454b6557B48558B334b8454
$$ -239921 -164804 -160149 27088 75014 -210563 -56032 240454 -26557 248558 2334 -28454
9413A13583b19601M3576M3910A36927c72060h0388b3298H0549i8072e397j8950
$$ 113583 -219601 -176025 -132115 136927 -372060 -80388 -23298 80549 -98072 -5397 -24347
9402b4347k32952G7539P5512a9722k75050P7943N2660A8300c35749i7580M2199
$$ -24347 -257299 77539 153051 -19722 -294772 -216829 -164169 18300 -335749 -97580 -55381
9391e5381j99753F4743a72022A94022A4041O9102a80580C7885a89207l7058k0492
$$ -55381 -255134 64743 -172022 194022 14041 83143 -180580 37885 -189207 -226265 -246757
9380b46757q206C1326b32833D7753b19106r2594B48303k5477b44897g3789j0283
$$ -246757 -254963 31326 -232833 47753 -219106 -311700 248303 222826 -244897 -73789 -84072
9369h4072j30926L2095F6211h4260B7880L8876A9443a70613e497D0921d8890D7478
$$ -84072 -214998 -182903 66211 -84260 27880 66756 19443 -170613 -5497 40921 -48890 47478
9356b22169R9075H9895J5636c60096g5308k12547g7703I0532J19422a79974F0069
$$ -222169 -123094 89895 105531 -360096 -75308 -287855 -77703 90532 209954 -179974 60069
9344a72897k73619H720J07311e7997A02451c8226F7108L8992K56920a43553L5843
$$ -172897 -446516 8720 116031 -57997 102451 -38226 67108 106100 363020 -143553 -107710
9333a07710C087J27139a03339F6630b43837J12865l58771d4370B62294f6542D8387
$$ -107710 3087 130226 -103339 66630 -243837 -130972 -489743 -44370 262294 -66542 48387
9321b91525F283a05665C7496a38415F23c17021c6749B25828c20160J8203O6828
$$ -291525 6283 -105665 37496 -138415 623 -317021 -36749 225828 -320160 -301957 -235129
9310b35129f5011A05717b28152A37968b89927J23684j96230d426G2790a4786o2236
$$ -235129 -65011 105717 -228152 137968 -289927 -166243 -362473 -4426 72790 -14786 -77022
9299g7022L7059B91880b08129Q8536H7208d17211a2470j43499K5123a6355o8759
$$ -77022 -39963 291880 -208129 -119593 87208 -417211 -12470 -155969 -130846 -16355 -85114
9288h5114D1415a3373j5613j9789I5223j7162O762c65920E7238Q8819a83944D25
$$ -85114 41415 -13373 -28986 -48775 95223 78061 84823 -365920 57238 146057 -183944 425
9275A06227c51538i3516j84694P8851Q1733r405j15639I3436L29854A123L0457
$$ 106227 -351538 -93516 -278210 -199359 -117626 -127031 -242670 93436 423290 1123 31580
9264C1580a4804N39n8976A70289e5999j3352j8404k26532C9150J13289b36110
$$ 31580 -14804 -14265 -73241 170289 -55999 -69351 -87755 -314287 39150 152439 -236110
9252a44397L1760A28177M4368J38858b8171B31024c0546j748o4266A1509J8155
$$ -144397 -112637 128177 172545 311403 -28171 231024 -30546 -32294 -96560 11509 29664
9241B9664L75379b32027R3603a2553A30424C7456c41546A9221G499a19637F6704
$$ 29664 405043 -232027 -138424 -12553 130424 37456 -341546 19221 7499 -119637 66704
9229E2035b08634b0114j00461j13238C8534j3438J42901B0354a4211E3017c2299
$$ 52035 -208634 -20114 -120575 -233813 38534 25096 167997 20354 -14211 53017 -32299
9217A09340n0059e80I4851a47823G0017b09510k02154d9269j20410B10780c48468
$$ 109340 59281 -580 94851 -147823 70017 -209510 -411664 -49269 -169679 210780 -348468
9205B0844e93291A7091a96365a0912j46138N0887A54826i4757l929A51084b45125
$$ 20844 -593291 17091 -196365 -10912 -157050 -106163 154826 -94757 -98686 151084 -245125
9193a80002A94075L1421E4333L4724b43941a00705B68610b08721j5609j10106
$$ -180002 194075 225496 54333 89057 -243941 -100705 268610 -208721 -224330 -334436
9183c34436B57713H158b80608a05803A0340M6185Q60a08F5654b11341Q3953A5919
$$ -334436 257713 8158 -280608 -105803 10340 56525 57385 -108 65654 -211341 -127388 15919
9170b77744A1916a2761k5276j58792g4417n4228e803B90225j37646b23955L7269
$$ -277744 11916 -12761 -38037 -196829 -74417 -128645 -5803 290225 152579 -223955 -186686
9159a86686c3902F4855b08122A87221b7963k76076i86D23141h1314G2970f44966
$$ -186686 -33902 64855 -208122 187221 -27963 -304039 -986 423141 -81314 72970 -644966
9147D8390L90906F2212J35617g1885A68322G1985R1001c94638p914J41534a20556
$$ 48390 439296 62212 197829 -71885 168322 71985 162986 -394638 -402552 -261018 -120556
9135e8521a1424k1976q9039a0813o3068J8599k5590k8324d8824A90187n1710J47361
$$ -58521 -11424 -33400 -122439 -10813 -73881 -55282 -80872 -109196 -48824 190187 138477 285838
9123B85838g7514k69697p652I601a30776M0306F534K30093b07460o2689A09853
$$ 285838 -77514 -347211 -354863 9601 -130776 -90470 6534 236627 -207460 -270149 109853
9111a26931K5928j50235A40918c99554a55090B23543b90704c2252M418j62596
$$ -126931 -101003 -251238 140918 -399554 -155090 223543 -290704 -32252 -27834 -190430
9101a90430B81396h8524E4530a25463M0586r5286b6048I1874J33144r0331K92485
$$ -190430 281396 -88524 54530 -125463 -84877 -180163 -26048 91874 225018 134687 427172
9090D27172c8825B2578L4798f7939n7562A35641F3165L330a75171H7925a87720
$$ 427172 -38825 22578 57376 -67939 -125501 135641 63165 66495 -175171 87925 -187720
9078A00885B6841R2348B4877g174r6896o5762a35l33220J20606n6636a8953j710
$$ 100885 26841 119189 24877 -7174 -104070 -169832 -135 -333355 -212749 -269385 -18953 -20663
9066b0663A08744k1343a20478a6235n9037k13815A76765b09693a9792k83997F1618
$$ -20663 108744 87401 -120478 -16235 -75272 -289087 176765 -209693 -19792 -303789 61618
9054b09305i6607A03031d06119g9036C40346a2102j53777A17576i060l02569K5553
$$ -209305 -96607 103031 -406119 -79036 340346 -12102 -165879 117576 -9060 -311629 -286076
9043b86076J29173E3091b44589f6290b7758k63061g6243C8319d40970A13781J48996
$$ -286076 -156903 53091 -244589 -66290 -27758 -290819 -76243 38319 -440970 113781 262777
9032B62777c7397J0671p2880k53492g3111m28359a84261O768i640j56083O0667
$$ 262777 -37397 -26726 -99606 -353098 -73111 -501470 -184261 -177493 -9640 -165723 -105056
9021a05056k71804D2578a33485C6459i0920q1834a8207C53124j10798F8409c30150
$$ -105056 -376860 42578 -133485 36459 -90920 -172754 -18207 353124 242326 68409 -330150
9009E6156b61543J10862F5911a76256F0446J07847h4345j3775j37145E8797a02079
$$ 56156 -261543 -150681 65911 -176256 60446 168293 -84345 -98120 -235265 58797 -102079
8997a84001b3338M498A29254e6922k44247a21043l49912d9092j8389A7342L0752
$$ -184001 -23338 -18840 129254 -56922 -301169 -121043 -470955 -49092 -67481 17342 48094
8986D8094b35147h1557p0053A57295c04794g874j69227j3702K8010j58436q7000
$$ 48094 -235147 -81557 -151610 157295 -304794 -7874 -177101 -190803 -162793 -321229 -408229
8975d08229D3192G270b28804j30071a16056J0963b4744k42022J10733B5781d7863
$$ -408229 43192 7270 -228804 -358875 -116056 -105093 -24744 -266766 -156033 25781 -47863
8963A46773b54389g9365k29561C43821d9497A26921a34101J0271p834A68427o7011
$$ 146773 -254389 -79365 -308926 343821 -49497 126921 -134101 -123830 -131664 168427 101416
8952A01416e49501A27334a50205A10478h9349A04788l1478J38539D2646N5545
$$ 101416 -549501 127334 -150205 110478 -89349 104788 73310 211849 42646 98191
8942I8191m7577b8755E2245J9892A3986g6277F4785d3105k90536b1783B90761
$$ 98191 50614 -28755 52245 72137 13986 -76277 64785 -43105 -333641 -21783 290761
8930B63745G4799k9992a28186I1106g6219A49190l6886K94621A36172J205711
$$ 263745 74799 44807 -128186 91106 -76219 149190 112304 406925 136172 1341883
8920A341883K823844P973659C991040A166858E20270F1874J33616j845H2148J95434
$$ 1341883 4165727 12139386 3991040 1166858 520270 61874 195490 193645 82148 277582
8910B77582g2331L2033G9278a49852B62975A06479M7229H145a1004k78869B0289
$$ 277582 -72331 -40298 79278 -149852 262975 106479 153708 8145 -11004 -289873 20289
8898g1554k41279m8390J55765d5061I0144d1129k44578M2280i987j11380C69287
$$ -71554 -312833 -361223 -205458 -45061 90144 -41129 -285707 -243427 -9987 -121367 369287
8886F657d3997j73286A63598G743e8888j8733j02211D3738a00791q7150e046m4308
$$ 6657 -43997 -217283 163598 7743 -58888 -77621 -179832 43738 -100791 -187941 -5046 -49354
8874d9354F7253b39127A7414Q8238E0323A1640a66262A7279a20756B3853a4156
$$ -49354 67253 -239127 17414 105652 50323 11640 -166262 17279 -120756 23853 -14156
8862a09329D6034b81571g5083d698j27766d3201C7696K0138c00044f6254p8480
$$ -109329 46034 -281571 -75083 -4698 -132464 -43201 37696 57834 -300044 -66254 -144734
8851a44734e0575j59058e3760B85681A17390E2409J844d2637G622N1255P1343
$$ -144734 -50575 -209633 -53760 285681 117390 52409 54253 -42637 7622 58877 130220
8840A30220a20879c8685q2581k37173m0081a3646q316A07782a35087J7009r235
$$ 130220 -120879 -38685 -121266 -358439 -398520 -13646 -21962 107782 -135087 -118078 -127313
$$ [...]
##END NTUPLES=NMR SPECTRUM
##END=
