
##TITLE=AC1170_Tolima-ibage-TCHAH12003_7165981_4IImdzvc76
##JCAMPDX= 6.0         $$ Bruker NMR JCAMP-DX V2.0
##DATA TYPE= NMR SPECTRUM
##DATA CLASS= NTUPLES
##ORIGIN= BRUKER
##OWNER= Administrator
$$ 1.72 TOPSPIN		Version 2.1
$$ 2012-12-03 14:37:03.525 -0500  Administrator@X
$$ Compression mode = diff/dup
##.OBSERVE FREQUENCY= 400.02188249412
##.OBSERVE NUCLEUS= ^1H
##.ACQUISITION MODE= SIMULTANEOUS (DQD)
##.ACQUISITION SCHEME= undefined
##.AVERAGES= 64
##.DIGITISER RES= 22
##SPECTROMETER/DATA SYSTEM= spect
##.PULSE SEQUENCE= noesygpps1d.comp
##.SOLVENT NAME= COFFEE_meoh
##.SHIFT REFERENCE= INTERNAL, COFFEE_meoh, 1, 14.96246
##AUDIT TRAIL= $$ (NUMBER, WHEN, WHO, WHERE, PROCESS, VERSION, WHAT)
$$ ##TITLE= Audit trail, TOPSPIN		Version 2.1
$$ ##JCAMPDX= 5.01
$$ ##ORIGIN= Bruker BioSpin GmbH
$$ ##OWNER= Administrator
$$ $$ E:\/data/COFFEE/nmr/AC1170_Tolima-ibage-TCHAH12003_7165981_4IImdzvc76/12/pdata/1/auditp.txt
$$ ##AUDIT TRAIL=  $$ (NUMBER, WHEN, WHO, WHERE, PROCESS, VERSION, WHAT)
(   1,<2012-12-02 01:05:53.409 -0500>,<Administrator>,<X>,<go>,<TOPSPIN 2.1>,
      <created by zg
	started at 2012-12-02 00:54:23.144 -0500,
	POWCHK enabled, PULCHK disabled,
       configuration hash MD5:
       86 BA 57 50 F2 9D 5C 9B 26 00 A9 28 5F 66 2E 89
       data hash MD5: 64K
       C6 53 0B 19 D8 53 85 A0 70 1B 28 1A D5 8C 26 AF>)
(   2,<2012-12-02 01:05:56.519 -0500>,<Administrator>,<X>,<proc1d>,<TOPSPIN 2.1>,
      <Start of raw data processing
       efp LB = 0.3 FT_mod = 6 PKNL = 1 PHC0 = 0 PHC1 = 0 SI = 128K 
       data hash MD5: 128K
       91 B8 A9 B5 5E A1 4F 49 4B BA D5 82 36 8C 31 D7>)
(   3,<2012-12-02 01:05:57.597 -0500>,<Administrator>,<X>,<proc1d>,<TOPSPIN 2.1>,
      <pk PHC0 = -80.18921 PHC1 = 0 
       data hash MD5: 128K
       B9 58 2E A6 A8 84 DF 67 CC 25 82 05 16 5F D1 30>)
(   4,<2012-12-02 01:05:58.300 -0500>,<Administrator>,<X>,<proc1d>,<TOPSPIN 2.1>,
      <abs ABSG = 1 
       data hash MD5: 128K
       97 32 91 99 95 9F D9 F6 DA 3B 33 69 0B E6 CB 3B>)
(   5,<2012-12-02 01:05:58.472 -0500>,<Administrator>,<X>,<proc1d>,<TOPSPIN 2.1>,
      <abs ABSG = 2 
       data hash MD5: 128K
       31 62 E2 5D F6 D2 93 53 00 E9 F0 9D 9F 3D FA C6>)
(   6,<2012-12-02 01:05:58.644 -0500>,<Administrator>,<X>,<proc1d>,<TOPSPIN 2.1>,
      <abs ABSG = 3 
       data hash MD5: 128K
       07 9C 90 8D 98 5A 60 7E 42 7D 56 B6 40 7F EE C3>)
(   7,<2012-12-02 01:05:58.847 -0500>,<Administrator>,<X>,<proc1d>,<TOPSPIN 2.1>,
      <abs ABSG = 4 
       data hash MD5: 128K
       4E 29 58 5B 54 E4 FB E4 A1 70 B6 5E 31 CA 59 13>)
(   8,<2012-12-02 01:05:59.034 -0500>,<Administrator>,<X>,<proc1d>,<TOPSPIN 2.1>,
      <abs ABSG = 5 
       data hash MD5: 128K
       54 AD 68 1D 80 31 21 B3 2C A1 F2 10 5C 2D 29 76>)
(   9,<2012-12-02 01:06:05.972 -0500>,<Administrator>,<X>,<audit>,<TOPSPIN 2.1>,
      <user comment:
       ICON-NMR User ID: COFFEE
       data hash MD5: 128K
       54 AD 68 1D 80 31 21 B3 2C A1 F2 10 5C 2D 29 76>)
$$ ##END=
$$ 
$$ $$ hash MD5
$$ [...]
##$TP07= 0
##$TPNAME0= <>
##$TPNAME1= <>
##$TPNAME2= <>
##$TPNAME3= <>
##$TPNAME4= <>
##$TPNAME5= <>
##$TPNAME6= <>
##$TPNAME7= <>
##$TPOAL= (0..7)
0.5 0.5 0.5 0.5 0.5 0.5 0.5 0.5
##$TPOFFS= (0..7)
0 0 0 0 0 0 0 0
##$TUNHIN= 0
##$TUNHOUT= 0
##$TUNXOUT= 0
##$USERA1= <user>
##$USERA2= <user>
##$USERA3= <user>
##$USERA4= <user>
##$USERA5= <user>
##$V9= 5
##$VALIST= <valist>
##$VCLIST= <CCCCCCCCCCCCCCC>
##$VD= 0
##$VDLIST= <DDDDDDDDDDDDDDD>
##$VPLIST= <PPPPPPPPPPPPPPP>
##$VTLIST= <TTTTTTTTTTTTTTT>
##$WBST= 1024
##$WBSW= 4
##$XGAIN= (0..3)
0 0 0 0
##$XL= 0
##$YL= 0
##$YMAX_a= 8154959
##$YMIN_a= -17372454
##$ZGOPTNS= <>
##$ZL1= 120
##$ZL2= 120
##$ZL3= 120
##$ZL4= 120
##$ABSF1= 14.96246
##$ABSF2= -5.595722
##$ABSG= 5
##$ABSL= 3
##$ALPHA= 0
##$AQORDER= 0
##$ASSFAC= 0
##$ASSFACI= 0
##$ASSFACX= 0
##$ASSWID= 0
##$AUNMP= <proc_prof1d_extract.lims>
##$AXLEFT= 0
##$AXNAME= <>
##$AXNUC= <1H>
##$AXRIGHT= 0
##$AXTYPE= 0
##$AXUNIT= <>
##$AZFE= 0.1
##$AZFW= 0.1
##$BCFW= 0
##$BC_mod= 0
##$BYTORDP= 0
##$COROFFS= 0
##$CY= 15
##$DATMOD= 1
##$DC= 0
##$DFILT= <>
##$DTYPP= 0
##$F1P= 0
##$F2P= 0
##$FCOR= 0.5
##$FTSIZE= 131072
##$FT_mod= 6
##$GAMMA= 0
##$GB= 0
##$INTBC= 1
##$INTSCL= 1
##$ISEN= 128
##$LB= 0.3
##$LEV0= 0
##$LPBIN= 0
##$MAXI= 10000
##$MC2= 0
##$MEAN= 0
##$ME_mod= 0
##$MI= 0
##$NCOEF= 0
##$NC_proc= -2
##$NLEV= 6
##$NOISF1= 0
##$NOISF2= 0
##$NSP= 0
##$NTH_PI= 0
##$NZP= 0
##$OFFSET= 14.96246
##$PC= 1
##$PHC0= -80.18921
##$PHC1= 0
##$PH_mod= 1
##$PKNL= yes
##$PPARMOD= 0
##$PPDIAG= 0
##$PPIPTYP= 0
##$PPMPNUM= 2147483647
##$PPRESOL= 1
##$PSCAL= 4
##$PSIGN= 0
##$PYNMP= <proc.py>
##$REVERSE= no
##$SF= 400.020009052452
##$SI= 131072
##$SIGF1= 0
##$SIGF2= 0
##$SINO= 400
##$SIOLD= 131072
##$SPECTYP= <>
##$SREGLST= <1H.CDCl3>
##$SSB= 0
##$STSI= 131072
##$STSR= 0
##$SW_p= 8223.68421052631
##$SYMM= 0
##$S_DEV= 0
##$TDeff= 65536
##$TDoff= 0
##$TI= <>
##$TILT= no
##$TM1= 0
##$TM2= 0
##$TOPLEV= 0
##$USERP1= <user>
##$USERP2= <user>
##$USERP3= <user>
##$USERP4= <user>
##$USERP5= <user>
##$WDW= 1
##$XDIM= 131072
##$YMAX_p= 433590401
##$YMIN_p= -13974
##$CURPLOT= <Network HP LaserJet P1505>
##$CURPRIN= <$Network HP LaserJet P1505>
##$DFORMAT= <normdp>
##$LAYOUT= <+/1D_H.xwp>
##$LFORMAT= <normlp>
##$PFORMAT= <normpl>
##$SURQMSG= 1
$$ End of Bruker specific parameters
$$ ---------------------------------
##NTUPLES= NMR SPECTRUM
##VAR_NAME=  FREQUENCY,     SPECTRUM/REAL,   SPECTRUM/IMAG
##SYMBOL=    X,             R,               I
##VAR_TYPE=  INDEPENDENT,   DEPENDENT,       DEPENDENT
##VAR_FORM=  AFFN,          ASDF,            ASDF
##VAR_DIM=   131072,        131072,          131072
##UNITS=     HZ,            ARBITRARY UNITS, ARBITRARY UNITS
##FACTOR=    0.0627417313425164, 1,          1
##FIRST=     8223.62146879497, 2635,         -63918
##LAST=      0,             5362,            -63610
##MIN=       0,             -13974,          0
##MAX=       8223.62146879497, 433590401,    0
$$ Real data points
##PAGE= N=1
##DATA TABLE= (X++(R..R)), XYDATA
$$ [...]
67467 72935 73714 73951 74029 74428 75239 76248 77318 78410 79307 79701 79600 79349 79179 79036 78939 79061 79265 78994 77958
67448 77958 76605 75518 74712 74005 73744 74486 76041 77503 78308 78718 79142 79541 79754 79912 80158 80261 79881 79056
67430 79056 78141 77411 76957 76910 77501 78838 80667 82411 83490 83724 83407 82997 82768 82772 82914 82940 82610 82090 81896
67411 81896 82207 82472 82091 81198 80316 79461 78235 76663 75334 74675 74708 75467 76908 78279 78426 77160 75687
67394 75687 75259 75925 77033 78332 79930 81580 82724 83114 82874 82168 81284 80869 81477 82866 84181 84851 84971
67377 84971 84845 84584 84218 83889 83804 84115 84800 85567 86026 86150 86343 86780 86958 86305 85094 84268 84306 84705 84705 84174
67357 84174 83579 83379 83699 84448 85467 86500 87192 87309 87039 86907 87216 87623 87546 87018 86810 87543 89004 90611
67339 90611 92257 94239 96479 98295 99074 98887 98263 97570 96840 96084 95530 95381 95443 95190 94351 93267 92471 92077
67321 92077 91875 91902 92458 93529 94654 95550 96403 97349 98110 98451 98582 98696 98502 97750 96957 97003 98085 99598
67303 99598 100981 102159 103134 103684 103713 103541 103584 103911 104226 104151 103548 102768 102491 103065 103984 104336 103839 103166 103185 104089
67283 104089 105408 106555 107183 107128 106353 105017 103517 102328 101753 101830 102479 103632 105076 106308 106896 107016 107302
67266 107302 108033 108839 109356 109738 110176 110342 109879 109194 109129 109898 110914 111714 112557 113924 115868 118023 119938
67249 119938 121264 121883 121984 121817 121330 120350 119138 118334 118239 118496 118685 118921 119571 120641 121720 122442 122747 122757
67231 122757 122619 122485 122533 122917 123623 124325 124578 124418 124630 126035 128447 130712 131950 132393 132821 133563 134436 135304
67213 135304 136184 136902 137175 137147 137404 138321 139662 141023 142327 143646 144821 145681 146483 147638 148935 149544 149055
67196 149055 148181 148034 148872 149965 150602 150766 150812 150953 151271 151852 152620 153248 153546 153740 154207 155092 156359 157991
67178 157991 159830 161448 162503 163108 163571 163883 163846 163610 163665 164263 165233 166463 168114 170067 171535 171730 170936
67161 170936 170495 171440 173385 175054 175870 176572 178089 180239 181991 182796 183081 183488 184234 185402 187234 189726
67145 189726 192349 194572 196344 197716 198369 198038 197167 196649 197004 198149 199738 201337 202503 203224 204138 205843
67129 205843 208115 210271 212065 213672 214998 215740 216108 216748 217858 219021 220036 221239 222763 224159 225180
67114 225180 226422 228709 232124 235922 239176 241337 242554 243647 245406 247647 249334 249871 249871 250420 252004
67099 252004 254509 257770 261542 265203 268145 270455 272819 275670 278727 281340 283063 283948 284490 285297 286640
67084 286640 288337 290120 292041 294411 297450 300999 304510 307374 309545 311788 314957 318972 322899 326137
67070 326137 329021 332050 335048 337514 339374 340906 342288 343728 345751 348722 352152 355028 356845 357944
67056 357944 358911 360155 362037 364834 368408 372289 376248 380460 384924 389097 392371 394753 396897 399579
67042 399579 403213 407664 412348 416631 420287 423567 426803 430117 433538 437267 441628 446786 452542 458410
67028 458410 463899 468805 473210 477195 480713 483891 487337 491720 496976 502235 506731 510615 514640 519204
67014 519204 524063 528943 534010 539514 545253 550780 556052 561460 567138 572604 577445 582143 587844 595254
67000 595254 604053 613361 622450 630908 638510 645320 651796 658530 665789 673450 681311 689351 697710 706518
66986 706518 715732 725092 734262 743072 751591 760002 768580 777764 787923 798764 809241 818434 826540
66973 826540 834623 843355 852406 861276 870257 880053 890618 901042 910779 920460 931068 942632 954342
66960 954342 965845 977714 990416 1003357 1015456 1026429 1037054 1048292 1060500 1073476 1086878
66949 1086878 1100527 1114538 1129130 1144098 1158640 1172088 1184843 1198099 1212526 1227564 1242267
66938 1242267 1256499 1270949 1286166 1301928 1317584 1332737 1347553 1362492 1377836 1393398 1408688
66927 1408688 1423380 1437618 1451899 1466653 1481873 1497146 1512141 1527122 1542786 1559405 1576256
66916 1576256 1592155 1606590 1620115 1633668 1647719 1662088 1676354 1690293 1704005 1717735 1731612
66905 1731612 1745567 1759397 1772723 1785015 1796080 1806586 1817580 1829224 1840532 1850740 1860320
66894 1860320 1869982 1879271 1887122 1893562 1899746 1906321 1912762 1918543 1923973 1929428 1934634 1939198 1943164 1946534
66880 1946534 1948925 1950221 1950979 1951599 1951599 1950334 1947971 1945182 1942302 1939344 1936408 1933392 1929700 1924886 1919358
66865 1919358 1913784 1908018 1901262 1893092 1883815 1874073 1864667 1856421 1849379 1842268 1833509 1822755 1810869
66852 1810869 1798548 1785764 1772506 1759176 1745981 1732614 1718811 1704712 1690479 1676060 1661520
66841 1661520 1647157 1633109 1619285 1605775 1592780 1579923 1566182 1550865 1534289 1517295 1500477
66830 1500477 1484160 1468627 1453905 1439570 1425183 1410781 1396634 1382610 1368058 1352400 1335791
66819 1335791 1319180 1303608 1289212 1274999 1259908 1244068 1228641 1214384 1200806 1186921 1172389
66808 1172389 1157641 1143242 1129517 1116578 1104284 1092219 1079954 1067449 1055079 1043262 1032049
66797 1032049 1021002 1009513 997376 985045 973116 961605 949936 937639 924831 912080 900107
66786 900107 889513 880343 871790 862758 852855 842523 832176 821752 811297 801325 792187 783577 775127
66773 775127 767009 759387 751725 743413 734836 726918 719666 712061 703589 694948 686836 678835 670256 661517
66759 661517 653762 647274 641140 634528 627546 620630 613772 606838 600120 593973 588141 581988 575354 568706
66745 568706 562465 556592 550941 545583 540592 535756 530694 525165 519208 513191 507664 502892 498425 493477
66731 493477 487808 481981 476635 471875 467519 463468 459470 454961 449661 444164 439384 435471 431725 427578
66717 427578 423198 419025 415138 411344 407622 404174 401086 398081 394728 390865 386847 383296 380595 378637
66703 378637 377044 375414 373393 370779 367691 364417 360988 357198 353177 349543 346749 344613 342750 341052
66689 341052 339314 336880 333328 329271 325745 322888 319873 316170 312172 308452 305099 302084 299697 298184
66675 298184 297261 296308 294868 292792 290190 287407 284861 282725 280936 279509 278517 277716 276589 274886 272814
66660 272814 270573 268126 265530 263084 260912 258808 256708 254911 253486 251938 249870 247645 245853 244379
66646 244379 242569 240189 237642 235234 232802 230277 228128 226805 226032 225049 223472 221560 219587 217411 214930
66631 214930 212663 211381 211141 211129 210592 209561 208410 207121 205431 203471 201725 200392 199276 198294 197681 197524
66615 197524 197482 197142 196425 195523 194608 193710 192685 191350 189815 188593 188067 187942 187583 186776 185751 184565 183071
66598 183071 181486 180280 179347 177948 175888 174099 173548 174020 174546 174632 174487 174289 173942 173537 173455 173860 174396 174480
66580 174480 173710 172073 170024 168279 167233 166609 165874 164900 163881 162714 160956 158503 155957 154085 153114
66565 153114 152740 152629 152643 152612 152194 151138 149594 148005 146659 145511 144443 143496 142680 141783 140662 139621 139137
66548 139137 139177 139175 138792 138383 138469 139035 139614 139875 139835 139536 138845 137715 136455 135549 135096 134574 133387 131662 130252
66529 130252 129738 129708 129333 128478 127747 127513 127450 127114 126532 125935 125278 124363 123246 122282 121826 122002 122608 123209 123425
66510 123425 123211 122748 122145 121438 120768 120215 119573 118691 117967 117962 118517 118802 118388 117685 117120 116470 115366 113934 112514
66491 112514 111179 110004 109403 109640 110215 110268 109527 108528 107978 108177 108903 109556 109548 108802 107760 106777 105779 104730
66473 104730 104067 104235 104967 105411 104989 103884 102773 102236 102327 102560 102466 102195 102330 103055 103886 104312 104316 104064 103562
66454 103562 102914 102459 102295 102053 101569 101330 101813 102715 103324 103331 102851 101988 100920 100112 99844 99720 99214 98480 98044
66435 98044 97886 97441 96493 95493 94982 95142 95826 96541 96514 95331 93556 92295 92077 92527 93043 93360 93520 93722
66417 93722 94211 94905 95203 94600 93420 92515 92305 92548 92923 93295 93424 93039 92337 91902 91962 92144 92048 91678 91165
66398 91165 90499 89720 89091 88875 89112 89684 90404 91008 91286 91201 90784 90052 89198 88655 88642 88835 88754 88315 87741 87213
66378 87213 86923 87056 87298 86794 85211 83458 82683 82907 83410 84051 85126 86144 85997 84543 82925 82004 81447
66361 81447 80732 80049 79684 79386 78989 78921 79416 79825 79426 78439 77533 76793 75893 74954 74483 74537 74597 74262 73582 72747
66341 72747 71831 70890 70058 69510 69454 69977 70754 71199 71126 70985 71142 71235 70628 69326 68036 67385 67430 67917 68666 69606
66321 69606 70614 71483 72036 72221 72052 71436 70264 68809 67845 68017 69134 70370 71078 71106 70499 69442 68451
66304 68451 68033 68062 68016 67885 68213 69091 69781 69705 69227 69020 69147 69186 68938 68529 68163 68133 68724 69710 70251 69778 68727
66283 68727 68030 68038 68269 68029 66986 65403 64100 63943 65037 66538 67478 67576 67154 66579 66020 65425 64619 63757
66265 63757 63670 65104 67413 68830 68460 67272 66578 66369 65941 65432 65589 66407 67142 67533 67915 68107 67271 65227
66247 65227 63078 62114 62606 63888 65093 65575 65196 64513 64322 64771 65255 65284 65038 64889 64794 64465 63867 63362 63461
66228 63461 64418 65779 66404 65443 63358 61565 60899 60851 60474 59578 58711 58365 58531 58866 58956 58558 57846 57383 57677
66209 57677 58789 60403 62132 63714 65040 66110 66849 67026 66529 65712 65211 65346 65861 66297 66385 66110 65653
66192 65653 65324 65308 65402 65241 64810 64445 64265 63965 63350 62689 62290 62029 61653 61381 61782 63059 64803 66513 68101
66173 68101 69680 71059 71753 71533 70776 70126 69916 70094 70618 71543 72645 73287 72991 71952 70769 69779 68959
66156 68959 68269 67699 67037 66032 64829 63871 63321 62947 62643 62584 62747 62762 62543 62567 63087 63438 62806 61517 60847
66137 60847 61416 62415 62706 62190 61666 61701 62205 62943 63851 64765 65331 65390 65095 64534 63660 62792 62629 63331 64003 63694
66117 63694 62676 62024 62070 61957 60856 58909 56772 54909 53673 53518 54598 56451 58420 60071 61010 60805
66101 60805 59551 58030 56816 55604 53984 52404 51677 51838 52299 52963 54263 56091 57532 57992 57880 57860
66085 57860 58000 58014 57865 57694 57527 57463 57846 58792 59649 59387 57625 55121 53100 52174 52005 52097 52665 54379 57148
66066 57148 59756 61125 61509 61860 62362 62403 61834 61250 60913 60350 59420 58919 59469 60508 61053 60978 60765 60426 59576
66047 59576 58486 58147 59041 60486 61463 61714 61735 61974 62298 62158 61210 59821 58932 59162 60136 60877 60813 60072 58934
66028 58934 57546 56365 56307 57887 60345 62121 62331 61547 61061 61680 63293 65302 67110 68287 68624 68267
66012 68267 67740 67688 68522 70189 72169 73740 74394 74124 73222 71882 70129 68127 66275 64911 64105 63810 63932
65995 63932 64116 63847 63061 62359 62244 62358 61989 61185 60780 61237 62005 62206 61584 60537 59549 58906 58734 59009 59531
65976 59531 60024 60276 60240 60182 60644 61995 63943 65734 66895 67553 68025 68403 68639 68710 68555 68079 67360 66605 65841
65957 65841 64926 63962 63301 62972 62512 61636 60732 60364 60595 61172 62153 63870 66325 68914 70787 71369 70708 69506
65939 69506 68600 68206 67807 66983 66050 65652 65989 66737 67471 67831 67589 66964 66648 67038 67673 67860 67613 67395 67182
65920 67182 66516 65414 64522 64235 64378 64849 65853 67204 68101 68030 67411 66968 66946 67315 68156 69296 70000 69620
65902 69620 68290 66506 64416 62061 59912 58500 57725 57240 57262 58187 59522 60112 59585 58756 58439 58625 59072
65885 59072 59837 60719 60947 60115 58934 58429 58747 59358 59991 60722 61411 61800 61982 62170 62155 61697 61295 61769 63098
65866 63098 64402 65173 65745 66335 66500 65978 65429 65715 66848 68100 68852 68921 68394 67587 66949 66594 66072 64965
65848 64965 63480 62188 61404 61097 61111 61072 60426 59109 57960 57848 58467 58562 57479 55982 55371 56104 57443 58251
65830 58251 58019 57295 57122 57981 59385 60594 61496 62415 63365 63990 64236 64524 65188 66198 67570 69518 71894
65813 71894 73831 74456 73875 73145 73184 73869 74280 73724 72423 71156 70423 70169 70180 70336 70356 69840 68870 68195 68362
65794 68362 69018 69565 70155 71331 72882 73890 73968 73703 73687 73834 73942 74256 74974 75699 75914 75696 75539 75664 75881
65775 75881 75942 75723 75202 74533 73965 73499 72759 71450 69773 68171 66847 65687 64483 63032 61287 59583
65759 59583 58497 58270 58534 58800 58966 59136 59284 59438 59955 61135 62638 63629 63560 62579 61235 60011 59119 58539
65741 58539 58170 57998 58132 58645 59523 60790 62486 64393 65953 66640 66308 65180 63685 62375 61698 61618 61617 61244
65723 61244 60539 59863 59549 59810 60664 61666 62051 61420 60156 58939 58028 57261 56491 55775 55248 55107 55574 56566
65705 56566 57543 57936 57699 57281 57123 57311 57544 57342 56494 55432 54862 54852 54670 53807 52820 52742 53905 55741 57528
65686 57528 58875 59617 59701 59220 58304 57057 55794 55036 54950 55031 54766 54374 54373 54615 54359 53317 52073 51366 51374 51774
65666 51774 52180 52429 52749 53588 54965 56153 56397 55821 55126 54552 53797 52902 52400 52424 52462 52380 52971 54875 57370
65647 57370 58904 58704 57498 56792 57718 60304 63428 65590 66084 65414 64505 63787 63287 63141 63390 63427 62369
65630 62369 60167 57886 56638 56525 56883 57202 57431 57591 57621 57684 58168 59070 59666 59228 57970 56889 56636 56965
65612 56965 57363 57763 58316 58862 59129 59283 59766 60601 61254 61229 60514 59415 58281 57417 56915 56466 55663 54601
65594 54601 53924 54129 55002 55821 55939 55208 54043 53177 53062 53438 53660 53488 53300 53475 53858 53987 53604 52847 52126
65575 52126 51880 52278 53059 53794 54289 54521 54324 53572 52694 52504 53282 54379 54978 54950 54769 54889 55450 56295 57000
65556 57000 57147 56828 56623 56838 57080 56903 56560 56671 57335 58051 58477 58787 59198 59456 58971 57412 55157 53117
65538 53117 51985 51605 51350 51147 51650 53132 54740 55385 55030 54450 54002 53408 52732 52645 53392 54202 54248 53755 53621
65519 53621 54197 54959 55312 55305 55471 56250 57623 59172 60443 61356 62221 63317 64494 65291 65375 64811 63994 63364
65501 63364 63131 63206 63480 64128 65376 66908 67856 67653 66658 65618 64704 63563 62250 61490 61732 62388 62459 61710
65483 61710 60829 60524 60887 61640 62558 63453 64100 64483 64929 65766 66923 68067 69062 70080 71336 72903 74727
65466 74727 76544 77841 78186 77716 77146 77176 77985 79223 80294 80650 80118 79065 78058 77289 76539 75735 75128
65449 75128 74771 74201 73017 71438 69900 68393 66722 65267 64767 65244 65742 65384 64246 62920 61686 60570
65433 60570 59886 60130 61287 62600 63105 62306 60477 58552 57540 57649 58041 57791 57087 57009 57994 59040 58860
65416 58860 57552 56580 57050 58434 59275 58875 57909 57374 57368 57208 56519 55691 55138 54640 53891 53364 54015 56040 58458
65397 58458 60148 60859 60965 60659 59910 58978 58403 58449 58940 59703 60805 62213 63548 64394 64727 64881 65200 65843
65379 65843 66797 67935 69079 70093 70956 71775 72800 74338 76506 79043 81485 83581 85484 87598 90279
65364 90279 93643 97556 101907 107005 113484 121489 130074 137799 143963 148863 152824 155465 156177 154954 152326
65349 152326 148745 144463 139859 135433 131343 127263 122857 118260 113974 110352 107317 104560 101962 99684
65335 99684 97872 96400 95069 93937 93174 92614 91705 90026 87658 85042 82661 80854 79581 78266 76166
65320 76166 73120 69767 66905 64863 63549 62759 62282 61997 62052 62602 63274 63387 62934 62744 63228 63478 62316
65303 62316 59911 57655 56586 56619 57170 57781 58097 57925 57536 57370 57307 56733 55516 54392 54178 54982 56340 57625
65285 57625 58170 57551 56126 54901 54486 54448 53974 52830 51382 50037 49046 48596 48628 48761 48756 48924 49675 50780
65267 50780 51495 51429 50975 50831 51351 52404 53661 54846 55813 56477 56741 56539 56020 55566 55587 56307 57685 59401
65249 59401 60899 61721 61975 62310 63294 64876 66539 67835 68614 68922 68845 68419 67582 66272 64613 62914 61391
65232 61391 60070 59086 58871 59814 61728 63805 65103 65086 63859 62066 60497 59592 59240 59023 58606 57899 56991
65215 56991 56028 55105 54261 53609 53445 54026 55176 56226 56479 55751 54493 53480 53282 53832 54508 54739 54483 53981
65197 53981 53306 52535 52206 52941 54462 55578 55533 54866 54476 54284 53513 52100 51011 50969 51457 51396 50407 49026
65179 49026 47814 46794 45821 45185 45470 46831 48616 49838 50013 49499 49102 49466 50734 52581 54424 55679
65163 55679 55989 55397 54400 53756 54031 55236 56960 58766 60232 60755 59903 58216 57098 57357 58248 58561 58308
65146 58308 58498 59420 60194 60210 59984 60095 60161 59590 58756 58547 59080 59638 59749 59585 59338 58822 57881 56711 55624
65127 55624 54802 54342 54284 54507 54824 55230 55858 56735 57797 59057 60537 62048 63283 64139 64789 65489 66473 67931
65109 67931 69792 71604 72840 73320 73146 72366 71042 69641 68959 69512 71090 73001 74651 75934 77215 78977
65093 78977 81400 84335 87671 91548 96054 100939 105930 111155 116893 122909 128378 132595 135636 138214
65079 138214 140997 144009 146539 147668 147012 145001 142378 139486 136131 132060 127407 122708 118475 114675
65065 114675 110669 105907 100750 96246 92915 90093 86748 82636 78292 74223 70673 67997 66579 66260
65051 66260 66314 66129 65559 64542 62861 60547 58157 56330 55212 54600 54446 54879 55727 56362 56239 55468 54655
65034 54655 54195 53950 53725 53738 54323 55281 55938 55884 55273 54398 53430 52710 52730 53463 54134 54156 53947 54345 55455 56611
65014 56611 57301 57554 57494 57062 56250 55188 53975 52781 52051 52186 53001 53886 54523 55034 55463 55594 55389 55130
64996 55130 54981 54782 54431 54092 53901 53787 53795 54250 55363 56852 58122 58725 58613 58181 58037 58452 58993 59008 58530
64977 58530 58358 59054 60181 60721 60073 58493 56761 55567 55132 55281 55825 56749 57954 59057 59750 60172 60569
64960 60569 60772 60497 60038 60034 60490 60621 59901 58751 57899 57446 56901 55903 54618 53629 53512 54267 55086 55054 54201
64941 54201 53462 53464 53822 53861 53574 53461 53819 54577 55614 56784 57797 58397 58599 58520 58166 57594 57080 56899 57048
64922 57048 57348 57611 57605 57122 56313 55659 55415 55352 55265 55373 55875 56460 56665 56456 56067 55534 54841 54274 54098 54040 53646
64901 53646 53104 53122 53922 54880 55362 55447 55539 55614 55263 54387 53528 53385 54078 54970 55297 54971 54678 55126 56317 57614
64881 57614 58380 58460 58199 58081 58234 58206 57487 56371 55892 56596 57739 58216 58018 58123 59010 59988 60205 59696 59040
64862 59040 58466 57827 57252 57238 57989 59029 59681 59789 59802 60158 60690 60755 59943 58549 57256 56480 56183 56245 56728
64843 56728 57671 58910 60217 61398 62062 61596 59768 57230 55024 53564 52534 51854 52193 54118 57099 59853
64827 59853 61534 62165 62084 61604 61208 61365 61880 61966 61305 60555 60397 60594 60503 60088 59755 59533 59228 59189 60052 61627
64807 61627 62860 63129 62901 62860 63039 63183 63317 63487 63440 63045 62658 62582 62536 62128 61519 61119 60891 60510 59961 59485
64787 59485 59084 58664 58489 58884 59542 59763 59472 59396 60008 60777 60790 59825 58547 57802 57898 58434 58726 58477 58042 57916
64767 57916 58107 58249 58241 58356 58758 59327 60032 61010 62073 62636 62481 62207 62504 63202 63504 62989 61919 60679 59502
64748 59502 58807 59156 60532 62056 62826 62778 62387 61833 61012 60164 59835 60125 60579 60998 61781 63118 64382 64847
64730 64847 64640 64346 63984 63100 61851 61190 61694 62755 63337 63164 62779 62707 62939 63196 63358 63546 63891 64255 64305
64711 64305 63929 63503 63518 63997 64491 64590 64176 63280 62076 61000 60423 60122 59508 58493 57657 57395 57395 57288 57327 57991
64691 57991 59230 60552 61664 62622 63529 64409 65292 66163 66940 67716 68782 70194 71536 72374 72733 72884 72943
64674 72943 72970 73172 73628 74034 74074 73821 73431 72769 71735 70694 70076 69759 69376 69022 69055 69347 69382 69095 68956 69149
64654 69149 69283 69073 68667 68068 66836 64828 62859 62079 62838 64436 65912 66749 66929 66628 66038 65387 65012
64637 65012 65228 66029 66989 67616 67796 67751 67707 67753 67934 68214 68378 68221 67831 67434 67003 66325 65497 64984 65040 65318
64617 65318 65235 64603 63728 63032 62691 62576 62455 62240 62060 62103 62461 63179 64250 65445 66286 66449 66168 66044 66469
64598 66469 67363 68366 69070 69201 68818 68362 68229 68334 68310 68100 68100 68685 69778 70966 71906 72608 73388 74439 75352
64579 75352 75262 73715 71260 68958 67409 66539 66113 66037 66177 66396 66820 67683 68719 69109 68337 66943 66152 66775
64561 66775 68592 70746 72568 73894 74705 74825 74257 73560 73363 73474 73069 71954 71051 71171 71923 72387 72390 72382 72462
64542 72462 72460 72774 74040 75862 76791 75981 74159 72613 71873 71802 72252 72991 73387 72890 71770 70907 70917 71724 72883
64523 72883 73979 74752 75116 75188 75235 75501 75989 76319 76021 75138 74343 74099 73936 73085 71711 70961 71632 73305 74915
64504 74915 75693 75432 74364 73029 71880 70832 69575 68397 68112 68961 70182 70973 71272 71224 70517 68912 67008
64487 67008 65802 65674 66267 67123 67917 68295 68101 67771 68008 68993 70154 70705 70238 68908 67292 65963 65043
64470 65043 64292 63729 63767 64616 65916 67252 68567 69752 70327 70117 69804 70169 71023 71559 71518 71301 71054 70495
64452 70495 69703 69316 69653 70216 70396 70225 70175 70564 71437 72664 73877 74555 74431 73703 72742 71816 71167 71032 71411
64433 71411 71981 72434 72749 73047 73382 73787 74372 75227 76360 77827 79774 82304 85387 88954 92930 97148
64417 97148 101376 105441 109235 112650 115684 118502 121176 123438 125050 126328 127881 129758 131290 131893 131578
64402 131578 130490 128477 125511 122083 118664 115084 111016 106819 103221 100190 96902 93069 89614 87558
64388 87558 86681 85843 84444 83002 82328 82591 83301 83844 83843 83275 82471 81879 81667 81644 81583 81472 81359 81192 80977 80892
64368 80892 81062 81317 81380 81189 80819 80246 79499 78963 79136 80005 80953 81393 81282 80877 80293 79518 78731 78310 78481
64349 78481 79048 79541 79684 79768 80433 81898 83514 84362 84294 84025 84108 84290 84150 83930 84192 84904 85518 85986 87047
64330 87047 89134 91461 92738 92669 92285 92758 94276 96214 97997 99449 100543 101327 102101 103234 104577 105439
64314 105439 105403 104909 104747 105119 105567 105694 105511 105045 104063 102454 100648 99313 98667 98267 97541 96470 95629 95529
64296 95529 95997 96396 96457 96660 97656 99532 101815 103927 105468 106368 107147 108737 111526 114741 117270 119002
64280 119002 120783 123157 125887 128789 132211 136284 140299 143364 145323 146620 147643 148644 149908 151400
64266 151400 152417 152166 150689 148795 147098 145485 143552 141192 138634 136133 133766 131456 129130 126895
64252 126895 124940 123227 121430 119324 117136 115406 114600 114831 115745 116568 116611 115971 115517 115926 116955 117955
64236 117955 118878 120368 122951 126505 130599 134942 139327 143407 146865 149830 152925 156721 161138 165491
64222 165491 169205 172274 174873 176785 177523 176955 175435 173315 170746 167958 165271 162687 159872 156733 153626
64207 153626 150827 148249 145911 144225 143451 143277 143330 143771 144928 146628 148368 149974 151584 153099 154114
64192 154114 154478 154638 155354 157137 159779 162297 163635 163635 163094 162639 161979 160599 158786 157356 156595 156075 155448
64175 155448 154891 154767 155262 156396 158034 159800 161283 162346 163066 163487 163698 164007 164693 165654 166614 167624 169071
64158 169071 171279 174319 178074 182247 186523 190990 196174 202390 209389 217039 225927 236642 248775 261375
64144 261375 274254 288048 302970 318269 333055 346892 359322 369495 376787 381353 383636 383585 380764
64131 380764 375011 366682 356415 344929 332912 320811 308666 296314 283833 271839 261309 252936
64119 252936 246528 241208 236333 232055 228804 226521 224703 222945 221069 218946 216720 215051 214554 215087 216081
64104 216081 217511 219881 223245 226904 230293 233584 237173 241110 245390 250298 256036 262305 268694 275287
64090 275287 282557 290824 300090 310237 321017 331876 342076 351139 359018 365762 371118 374621 376116
64077 376116 375994 374703 372217 368300 363174 357324 350623 342425 332937 323783 316499 310896 305640 300045
64063 300045 294497 289453 284979 281249 278609 277025 276200 276230 277407 279365 281248 282811 284609 287033 290068
64048 290068 294154 300173 308183 317056 325901 334985 344737 354732 364461 374423 385558 397994 411064
64035 411064 424244 437439 450663 464010 477629 491144 503444 513623 521839 528766 534597 539284
64023 539284 543373 547771 552800 558190 563971 570705 578783 588029 598018 608322 618368 627464 635021 640518
64009 640518 643474 643887 642533 640288 637258 633084 628027 623070 618901 615491 612903 611921 613421 617440 623279
63994 623279 630373 638752 648774 660747 674816 690973 709016 728580 749341 771325 794985 820912
63982 820912 849537 881216 916461 955692 998645 1044443 1092506 1143211 1197423 1255580 1317526
63971 1317526 1383111 1452699 1527310 1608543 1698266 1798139 1909583 2034503 2175929 2337723
63961 2337723 2523876 2738475 2986319 3273185 3605612 3990722 4436097 4949000 5535005
63952 5535005 6196972 6934823 7745610 8623544 9560455 10546752 11572002 12624249 13688468
63943 13688468 14745275 15770681 16737119 17615831 18380425 19010362 19492467 19819614 19987950
63934 19987950 19994979 19839478 19522331 19047382 18422731 17662715 16789104 15829461 14812900
63925 14812900 13765861 12710211 11663686 10641219 9655963 8719519 7841625 7029861 6289652
63916 6289652 5624039 5032959 4513010 4058601 3663575 3321644 3025932 2769348 2545943
63907 2545943 2351396 2181966 2033668 1902915 1787344 1685304 1594776 1513359 1439140 1371097
63897 1371097 1308690 1251358 1198326 1148608 1101230 1055682 1012077 970787 931958 895372 860491
63886 860491 826596 793186 760285 728135 696712 665980 636519 609171 583990 560229 537518
63875 537518 516215 496353 477234 458691 441816 427533 415104 403026 390990 379950 370501 362136
63863 362136 354106 346200 338686 332040 326726 322707 319304 315989 313077 311123 310004 309354 309542 311253 314238
63848 314238 317475 320611 324279 328736 333057 336127 337841 338931 340008 340973 341051 339302 335454 330236 324464
63833 324464 317988 310169 301261 292423 284253 276146 267425 258326 249429 240810 232350 224373 217380 211370
63819 211370 205873 200497 195196 190235 186101 183165 181194 179474 177553 175539 173518 171148 168157 164831
63805 164831 161666 158813 156245 154161 152795 151959 151133 149963 148496 147021 145835 145042 144463 143856 143336 143347
63789 143347 144097 145159 145740 145177 143271 140450 137636 135589 134262 133116 132041 131488 131545 131583 131147 130657 130672
63772 130672 130875 130490 129457 128533 128184 128054 127646 126984 126279 125419 124229 123015 122307 122041 121503 120355 119348
63755 119348 119531 120876 122216 122629 122367 122163 122165 122077 122008 122533 123960 126016 128233 130229 131709 132714 133808
63738 133808 135551 137802 140092 142617 146145 150851 156018 161213 166954 173820 181560 189716 198558 208682
63724 208682 220072 232251 245008 258112 270457 280417 287279 291606 293942 293881 290924 285688 279490
63711 279490 272932 265614 257355 249015 241634 235186 228741 221792 214797 208318 202208 196033 189892 184302
63697 184302 179425 174954 170711 166880 163521 160286 156816 153258 150266 148601 148668 150121 151955 153341 154459
63682 154459 156287 159512 163930 168964 174417 180544 187662 195835 204782 213992 223160 232605 243022 254657
63668 254657 266823 278269 287878 295101 299941 302587 302929 300520 295151 287287 277651 266685 254828
63655 254828 242949 231776 221058 210157 199521 190651 184323 179665 175406 171259 167584 164425 161659
63642 161659 159602 158682 158766 159417 160543 162207 164014 165384 166309 167314 168733 170553 172858 175903 179749
63627 179749 184206 189094 194226 199369 204664 210919 218922 228559 239176 250723 263886 279010 295579
63614 295579 312995 331326 350952 371847 393497 415243 436410 456337 474483 490325 503021
63603 503021 511499 515156 514402 510364 504315 497505 491133 485989 482085 478877 475815 472460 468195 462268
63589 462268 454348 444773 433979 421872 408169 393356 378870 365937 354478 343514 332571 322213
63577 322213 313129 305254 298121 291694 286325 282036 278416 275318 273214 272542 273019 273922 274937 276428 278903
63562 278903 282536 287367 293628 301590 311134 321814 333480 346603 361823 379298 398624 419338
63550 419338 441303 464611 489217 514595 539656 563059 583725 601102 615072 625824 633843 639663
63538 639663 643557 645881 647856 651258 656796 663271 669079 674017 678585 681799 681065 674542 662542 646113
63524 646113 625380 600141 571304 540661 509625 479021 449791 422889 398519 376225 355850
63513 355850 337713 321778 307342 293847 281531 270970 262303 255165 249202 244355 240646 237769 235032
63500 235032 231858 228486 225948 225172 226232 228566 231623 235048 238548 242070 245970 250652 256159 262496
63486 262496 270149 279699 290912 302751 314506 326492 339404 353225 366978 379382 389639 397728
63474 397728 404002 408367 409921 407642 401502 392610 382213 370806 358307 344789 330823 317295 305065
63461 305065 294774 286727 280872 276809 273865 271265 268487 265465 262382 259371 256533 254103 252291 251005
63447 251005 250107 249913 251029 253461 256251 258407 260044 262281 266061 271461 278187 286291 296060 307412
63433 307412 319855 333078 347260 362682 379280 396823 415305 434891 455588 477259 499910
63422 499910 523693 548612 574484 601210 628739 656650 683932 709224 731084 748042 758769
63411 758769 762532 759578 751099 738952 725229 711648 699112 687859 677864 668821 659882 649941 638285
63398 638285 624577 608252 588604 565795 541243 516608 492741 469905 448489 428926 411166
63387 411166 394845 379907 366727 355684 346926 340371 335603 331993 329269 327802 328020 329740 332495
63374 332495 336268 341387 347819 355169 363456 373355 385528 399980 416257 433977 453018 473400 495197
63361 495197 518505 543387 569733 597023 624217 650130 673985 695334 713342 726542 733748 735116
63349 735116 732030 726078 718319 709311 699483 689525 680481 673215 667541 662103 655297 646096 633887 618248
63335 618248 599507 579097 558607 538578 518718 499029 480014 461880 444367 427447 411565
63324 411565 397014 383678 371575 361151 352670 345742 339754 334567 330572 328241 327700 328507 329738 330525
63310 330525 330656 330516 330492 330594 330653 330595 330472 330388 330434 330523 330348 329620 328268 326315 323792 320951 318250 315838 313404
63291 313404 310921 309151 308789 309408 309891 309798 309577 309521 309354 309004 309006 309749 310897 311897 312676 313501 314540 315862
63273 315862 317602 319717 321728 322965 323098 322451 321887 322275 323790 325752 327367 328541 329692 330974 332137
63258 332137 333118 334265 335908 338084 340701 343616 346582 349555 353005 357447 362654 367833 372644 377601
63244 377601 383394 390298 398241 406929 415828 424606 433805 444581 457595 472526 488740 505977 524365
63231 524365 544331 566589 591626 618960 647402 676128 704966 733587 761268 787727 813467
63220 813467 838899 863787 887877 911390 934410 956543 977716 998729 1020344 1042350 1064076
63209 1064076 1085118 1104674 1120659 1130542 1133060 1128457 1117230 1099526 1075801 1047195 1014917 979724
63197 979724 942310 903855 865869 829600 795721 764503 736226 711416 690635 674130 661867
63186 661867 653884 650190 650264 653123 658210 665859 676566 690066 705424 721779 738718 756231 774578
63173 774578 793896 813654 832903 851403 870046 889663 909841 929493 948220 966314 983593
63162 983593 999026 1011606 1020919 1026678 1028227 1024804 1016028 1002001 983182 960257 933931 904890
63150 904890 874096 842934 812642 783621 755658 728784 703588 680649 660061 641621 625203
63139 625203 610841 598582 588237 579167 570571 562266 555075 549967 546871 544732 542668 540637 538939
63126 538939 537682 536981 537171 538423 540423 542801 545637 549236 553563 558300 563307 568553 573575 577601 580542
63111 580542 583454 587479 592476 597257 601223 605188 610301 616630 623246 629286 634367 638197 640579 641902
63097 641902 643052 644545 646155 647483 648461 649090 649204 648774 648125 647586 647184 646870 646631 646198 645152 643697 642839
63080 642839 643321 644704 646076 647424 649740 653869 659818 667181 675648 684922 694571 704310 714399 725549
63066 725549 738389 752963 768770 785380 802916 821736 841750 862496 884025 907225 932926
63055 932926 961047 991037 1022917 1057415 1095157 1136116 1179883 1226186 1275047 1326495 1380136
63044 1380136 1435040 1490244 1545394 1600650 1655958 1710711 1764127 1815625 1864849 1911943 1958009
63033 1958009 2004707 2053011 2102711 2153276 2204501 2255866 2305779 2351992 2392341 2424728 2447040
63022 2447040 2457797 2456464 2442583 2415223 2374149 2321085 2258862 2189591 2114547 2035558 1955353
63011 1955353 1876492 1800880 1730297 1666339 1609494 1559219 1515368 1478894 1450776 1430869 1418233
63000 1418233 1412029 1411716 1416863 1427174 1442419 1462071 1485409 1512121 1542272 1575343 1609823 1644215
62988 1644215 1678072 1711596 1744551 1776182 1806123 1834764 1862512 1888856 1912306 1931179 1944352
62977 1944352 1951253 1951198 1942959 1925154 1897001 1858665 1811177 1756272 1696069 1632413 1566475 1499168
62965 1499168 1431726 1365534 1301616 1240803 1184170 1132597 1085873 1042910 1003030 966462 933470
62954 933470 903725 876900 853250 833044 815835 800833 787703 776483 766884 758242 750120 742584
62942 742584 735795 729642 723766 717717 711027 703327 694557 685071 675472 666314 657823 649829 641977 634047
62928 634047 626134 618624 611990 606395 601389 596201 590546 584938 579958 575505 571155 567030 563705 561241
62914 561241 558912 556062 552802 549582 546524 543501 540567 537977 535836 533990 532210 530368 528490 526753
62900 526753 525367 524469 524219 524908 526694 529149 531331 532483 532548 531885 530608 528409 525027 520808 516604 513034
62884 513034 509963 506952 504140 502211 501382 500945 500105 498935 498051 497718 497798 498248 499082 499953 500367 500318 500209 500248
62866 500248 500323 500386 500417 500172 499518 498907 498873 499148 498946 498106 497193 496500 495751 494906 494334 493933 492912 490914 488567
62847 488567 486425 484135 481267 478385 476522 475943 476053 476266 476375 476351 476328 476656 477499 478521 479391 480327 481649
62830 481649 482919 483122 481766 479397 476925 474742 472639 470415 468350 467009 466630 466887 467309 467655 467615 466538
62814 466538 464156 461456 460038 460430 461644 462582 463151 463698 464175 464484 465071 466517 468912 472161 476439 481735
62798 481735 487346 492610 497961 504591 513130 523189 534060 545317 556860 569002 582597 598569
62786 598569 617143 637861 660342 684742 711527 741106 773698 809372 848318 891254 939279
62775 939279 993025 1052289 1116871 1187388 1264654 1348497 1437858 1531881 1630086 1731324 1833190
62764 1833190 1932765 2027510 2115249 2193695 2260269 2312211 2346960 2362951 2360249 2340079 2303609
62753 2303609 2251582 2185215 2107005 2020252 1928002 1832617 1735966 1639545 1544433 1451490 1361759
62742 1361759 1276572 1197151 1124075 1057128 995696 939341 887972 841482 799416 761142 726200
62731 726200 694313 665254 638968 615732 595800 578804 563709 549490 535810 523118 512193
62720 512193 503473 496635 490902 485856 481775 478948 476974 475211 473840 473909 476186 480363 485656 491762 498953
62705 498953 507495 517405 528827 542338 558686 578240 600741 625687 653044 683486 717829 756264
62693 756264 798319 843621 892477 945670 1003786 1066789 1134002 1204239 1275919 1347161 1415917
62682 1415917 1480178 1538185 1588503 1629845 1660883 1680331 1687293 1681469 1663107 1632884 1591894 1541581
62670 1541581 1483522 1419257 1350461 1279260 1208109 1139023 1072800 1009208 948054 889978 836049
62659 836049 786766 741808 700743 663615 630650 601570 575496 551547 529400 509271 491388
62648 491388 475496 460965 447336 434656 423155 412795 403300 394422 385945 377533 369009 360688 353077
62635 353077 346234 339857 333959 328925 324840 321282 317981 315099 312544 309615 305843 301744 298156 295186
62621 295186 292480 290309 289537 290373 291815 292695 292944 293457 294929 297196 299665 302108 304846 308288 312542
62606 312542 317558 323319 329649 336038 342144 348481 356117 365570 376444 388361 401778 417514 435777
62593 435777 456119 478225 502448 529665 560783 596191 635487 677933 723283 771797 823212
62582 823212 876130 928818 980201 1029542 1075409 1115631 1148316 1172513 1187895 1194210 1191105 1178324
62570 1178324 1156147 1125907 1089858 1050191 1008130 964151 918813 873046 827865 784282 743373
62559 743373 706011 672430 642240 614799 589442 565707 543709 524009 506744 491085 475994
62548 475994 461241 447220 434090 421690 410090 399486 389686 380348 371666 364082 357350 350680 344021
62535 344021 338413 334696 332472 330712 328921 327386 326640 327034 328535 330710 333156 336053 339881 344590 349623
62520 349623 354976 361582 370204 380465 391503 403236 416421 431712 449252 469046 491255 516034
62508 516034 543439 573536 606348 641739 679524 719604 761697 805010 848310 890210 929199
62497 929199 963634 992144 1014035 1028968 1036265 1034961 1024670 1006151 980819 950024 915015 877330
62485 877330 838645 800123 762157 724878 688697 654203 621867 592168 565854 543543 524927
62474 524927 508721 493669 479512 466889 456534 448690 443015 438764 435206 432114 429791 428486 427986
62461 427986 427933 428308 429344 431181 433887 437619 442392 447830 453500 459429 465944 473135 480811 488926 497639
62446 497639 506942 516575 526285 535854 544893 552939 559719 564930 567807 567381 563281 555971 546140 534248
62432 534248 520701 506041 490801 475454 460563 446607 433559 421068 409224 398708 389982 382748
62420 382748 376508 371214 367036 363858 361553 360462 361016 362926 365325 367828 370991 375448 381022 387105
62406 387105 393700 401476 410606 420006 428205 434847 440939 447557 454726 461705 467935 473313 477783 481056
62392 481056 482790 482772 480998 477715 473341 468217 462518 456488 450505 444748 439142 433838 429389 426034 423198
62377 423198 420277 417717 416714 417941 421225 426473 434227 445077 458961 475304 493500 513201 534575
62364 534575 558509 586202 618267 654399 693919 736392 781634 829463 879551 931275 983631
62353 983631 1035509 1085960 1133826 1177122 1213288 1240259 1257199 1264333 1262537 1253078 1237193 1215656
62341 1215656 1188998 1158107 1124209 1088256 1050758 1012264 973553 935338 898286 863330 831314
62330 831314 802223 775400 750659 728432 708623 690120 671945 654196 637335 621212 605519
62319 605519 590662 577470 566368 557449 550964 546910 544391 542230 540193 538889 538485 538269 537651 536842
62305 536842 536165 535237 533300 530074 525857 520883 515014 508135 500669 493515 487430 482467 478082 473834 469894
62290 469894 466860 465121 464493 464434 464563 464987 466121 468172 470888 473889 477144 480872 485072 489456 493898
62275 493898 498670 504124 510384 517479 525531 534654 544818 555929 567914 580686 594216 608782 625011
62262 625011 643615 665188 690184 718846 751144 787046 826839 870833 918659 969213 1021371
62251 1021371 1074351 1127088 1177561 1222992 1260630 1288325 1304866 1310226 1305416 1291783 1270472 1242580
62239 1242580 1209534 1172924 1133923 1093079 1050736 1007653 965130 924490 886394 850856 818012
62228 818012 788624 763524 742733 725537 711319 699941 691320 685064 680600 677368 674877 672877 671436
62215 671436 670521 669666 668417 666953 665734 664725 663508 662052 660718 659596 658629 658300 659298 661393 663618
62200 663618 665845 669230 674662 681706 689648 698817 710164 724099 740381 758625 778381 799231 821393
62187 821393 845711 872525 901081 930464 960357 990145 1018074 1042301 1062321 1078460 1090487
62176 1090487 1097893 1101309 1102500 1102853 1102827 1102948 1104402 1108323 1115157 1125053 1138294 1155067 1175214 1198481
62162 1198481 1224663 1253258 1283113 1312526 1339623 1362787 1381056 1394129 1402041 1405089 1404153 1400538
62150 1400538 1395016 1387290 1376796 1363743 1348971 1333198 1316972 1301110 1286565 1273865 1263128 1254433
62138 1254433 1247846 1243286 1240794 1240639 1242633 1245590 1248036 1249391 1250115 1251034 1253002 1256853 1262937 1270756 1279538
62123 1279538 1289026 1299351 1310598 1323120 1337850 1355412 1375122 1395691 1416820 1439229 1463168
62112 1463168 1487765 1512039 1535833 1559538 1583529 1608034 1633087 1658461 1684057 1710264 1737486
62101 1737486 1765420 1793415 1821442 1850171 1880163 1911656 1944988 1980432 2017627 2056000 2095843
62090 2095843 2138141 2183074 2229324 2275027 2318855 2360161 2399067 2436880 2475890 2518201 2564794
62079 2564794 2615523 2669292 2724101 2777620 2828162 2874974 2917825 2956977 2993553 3029186 3065104
62068 3065104 3102041 3140827 3182150 3225688 3270375 3315731 3361951 3408501 3453737 3496403 3536484
62057 3536484 3573887 3607233 3634836 3656331 3672638 3684873 3693924 3700407 3704137 3704022 3699296 3690522 3678736
62044 3678736 3664064 3646046 3625038 3602341 3579013 3555337 3531445 3507623 3483933 3460339 3437556
62033 3437556 3417078 3399849 3385291 3372017 3359276 3347259 3336176 3325649 3315228 3305143 3296069
62022 3296069 3288206 3281027 3274073 3267604 3262097 3257413 3252938 3248434 3244350 3241350 3239944 3240446 3242796 3246446
62008 3246446 3250918 3256479 3263782 3272899 3283327 3294911 3308013 3322598 3337936 3353551 3369740 3386591
61996 3386591 3402898 3416507 3425457 3428488 3424822 3413833 3394809 3366988 3330293 3286121 3236855 3184423
61984 3184423 3129862 3074291 3019253 2965621 2913112 2861694 2812726 2767732 2726518 2687490 2649589
61973 2649589 2612961 2577880 2544055 2511202 2479580 2449640 2421564 2395306 2370735 2347643 2325925
61962 2325925 2305717 2287038 2269383 2252070 2234973 2218556 2203236 2189059 2175936 2163802 2152530
61951 2152530 2142026 2132464 2124163 2117337 2112210 2109225 2108722 2110488 2114025 2119287 2126764 2136853 2149457
61938 2149457 2164155 2180340 2197192 2214059 2231105 2249156 2268624 2288890 2309033 2328941 2349312
61927 2349312 2370624 2392552 2414506 2436486 2459160 2483301 2509537 2538745 2572389 2612208 2659726
61916 2659726 2716279 2783381 2862799 2956362 3065981 3193707 3341546 3511440 3705912 3928516
61906 3928516 4182986 4472011 4797702 5163495 5574865 6037635 6555931 7131640 7764336
61897 7764336 8449848 9178043 9931401 10684362 11402646 12043728 12560762 12910146 13060089
61888 13060089 12997045 12728126 12278797 11686762 10994644 10244191 9472572 8709938 7978095
61879 7978095 7290965 6656515 6078557 5557583 5091264 4675427 4305294 3976411 3684940
61870 3684940 3427398 3200156 2999309 2821206 2663128 2523309 2400315 2292491 2197951 2114969
61860 2114969 2042394 1979729 1926717 1882797 1847076 1818873 1798074 1784767 1778633 1778806 1784230 1794065
61848 1794065 1807776 1824796 1844041 1863820 1882529 1899265 1913429 1923878 1929135 1928584 1922965 1913526
61836 1913526 1901295 1887424 1873593 1861494 1852262 1846709 1845562 1848965 1856234 1866645 1879938 1895375
61824 1895375 1910811 1923649 1932528 1937263 1937365 1931697 1919760 1902444 1881159 1856928 1830680 1803787
61812 1803787 1777768 1753670 1732091 1713588 1698888 1688906 1684604 1686516 1694278 1706981 1724169 1746295
61800 1746295 1774114 1808025 1848106 1894350 1946518 2004086 2066856 2135585 2211694 2296301 2389776
61789 2389776 2492226 2604179 2726734 2861282 3009431 3173185 3354931 3557125 3782265
61780 3782265 4033551 4315487 4633518 4993260 5400676 5863110 6389443 6988743 7669045
61771 7669045 8437663 9301812 10267619 11337811 12509823 13774433 15113440 16495931 17875004
61762 17875004 19187156 20355502 21297479 21936894 22217873 22116029 21642819 20842191 19781397
61753 19781397 18538962 17192860 15811583 14449472 13145891 11926712 10806573 9791141
61745 9791141 8879280 8065331 7341389 6699058 6130256 5627269 5182577 4788826 4439158
61736 4439158 4127793 3850438 3603919 3385277 3191266 3018744 2865263 2729015 2608300
61727 2608300 2501204 2405777 2320394 2243914 2175365 2113286 2055436 1999561 1944545 1890546 1837918
61716 1837918 1786457 1735922 1686875 1640418 1597145 1556669 1518174 1481291 1446501 1414753 1386567
61705 1386567 1361407 1338090 1315769 1294338 1273960 1254674 1236479 1219246 1202386 1185131 1167478
61694 1167478 1150402 1134795 1120589 1107127 1093863 1080438 1066707 1053232 1041140 1030865 1021456
61683 1021456 1011723 1001659 992106 983422 975261 967405 959986 952993 946224 939708 933659 928077 922813 917788
61669 917788 912774 907259 901082 894839 889109 883694 878225 873021 868408 863679 857815 851066 844694 839213
61655 839213 834037 828996 825032 822998 822717 823614 825460 828119 831290 834907 839158 843834 848315 852477 856840
61640 856840 861609 866322 870803 875564 880739 885461 889093 892416 896864 903000 910465 919020 928786 939587
61626 939587 950800 961870 972503 982336 990794 997218 1000789 1000456 995432 985957 973363 959279 944742
61613 944742 929979 914898 899756 885245 871862 859342 846973 834378 821743 809461 797918
61602 797918 787502 778268 769643 760996 752536 745114 739094 734024 729494 725636 722573 720047 717948 716623
61588 716623 716271 716604 717477 719339 722612 727125 732649 739493 748017 757951 768766 780431 793273 807345
61574 807345 822521 839009 857244 877330 899029 922174 946720 972530 999508 1027720 1056944
61563 1056944 1086279 1114818 1142689 1170872 1199788 1228489 1255440 1279924 1302498 1324252 1345773
61552 1345773 1366773 1386568 1404846 1421812 1437601 1451807 1463724 1472923 1479394 1483230 1484329 1482346
61540 1482346 1476821 1467457 1454435 1438437 1420302 1400710 1380196 1359344 1338842 1319358 1301341 1284888
61528 1284888 1269958 1256863 1246434 1239496 1236241 1236291 1239239 1244879 1253266 1265057 1281606 1304050 1332215
61515 1332215 1365052 1402379 1445653 1496773 1556593 1625031 1702305 1789695 1889211 2002777 2131632
61504 2131632 2276377 2437606 2616313 2813405 3028937 3262058 3511285 3773803 4044164
61495 4044164 4313984 4573030 4810227 5014122 5173965 5281737 5333542 5329501 5273111 5170898
61485 5170898 5031550 4864301 4677855 4480413 4279531 4081212 3889633 3708173 3540051
61476 3540051 3387386 3250330 3127979 3019927 2926418 2847499 2782848 2732243 2695470 2671794
61466 2671794 2659939 2658553 2666471 2682884 2707626 2740829 2781826 2828793 2879918 2934453 2991986 3051212
61454 3051212 3110258 3167892 3223570 3276617 3326318 3372878 3417439 3461063 3504339 3548057 3593449
61443 3593449 3641381 3691674 3743395 3795372 3846360 3895156 3940923 3983318 4022274 4057650 4088863
61432 4088863 4114672 4133697 4145503 4150827 4150268 4143110 4128069 4104938 4074860 4039210 3999059 3955633
61420 3955633 3910415 3864534 3818714 3774033 3732139 3694420 3661455 3633487 3610927 3594026 3582429
61409 3582429 3575390 3572213 3572206 3574344 3577192 3579046 3578233 3573520 3564362 3550660 3532436 3510001 3484376 3457178
61395 3457178 3430137 3404985 3383646 3368072 3359856 3360473 3371875 3396374 3435804 3491321 3564153 3656091
61383 3656091 3768874 3903440 4060037 4238826 4440015 4663478 4908392 5172967 5454031
61374 5454031 5746484 6043007 6334289 6609650 6857763 7067408 7228688 7334854 7383795 7377797
61364 7377797 7321741 7221482 7083371 6913909 6718704 6501838 6266863 6018353 5761980 5503207
61354 5503207 5246393 4995012 4752031 4519861 4300253 4094285 3902308 3724136 3559737
61345 3559737 3409574 3273872 3151875 3042433 2945183 2860471 2788227 2727619 2677891 2638840
61335 2638840 2610298 2591791 2582897 2583385 2592778 2610243 2635093 2666908 2704944 2747916 2794555 2843947
61323 2843947 2895117 2946765 2997716 3047253 3094733 3139285 3180210 3217420 3251148 3281394 3307899
61312 3307899 3330660 3350385 3368427 3386058 3403473 3419596 3433041 3442966 3448624 3448641 3441671 3427708
61300 3427708 3407858 3382741 3352042 3315793 3275102 3231084 3183885 3133338 3079949 3024640 2968090
61289 2968090 2910970 2854360 2799346 2746613 2696995 2651964 2612836 2579741 2551992 2529198 2511381
61278 2511381 2498287 2489264 2483662 2480646 2478655 2475762 2470805 2463643 2454374 2442901 2429513 2415287 2401614
61265 2401614 2389570 2379997 2373783 2371589 2373265 2377761 2383789 2390666 2398773 2409477 2424778 2446867 2477640
61252 2477640 2518245 2569147 2630898 2704717 2791867 2892349 3004569 3126276 3255128 3387983
61242 3387983 3520091 3645386 3757085 3847605 3908782 3933648 3918681 3864295 3773572 3651345
61232 3651345 3504343 3340894 3169342 2996536 2827637 2666557 2515910 2376868 2249701
61223 2249701 2134572 2031509 1939846 1858250 1785530 1721152 1664780 1615655 1572705 1535129 1502517
61212 1502517 1474424 1450167 1429245 1411722 1397945 1388002 1381703 1378976 1379965 1384718 1393089 1404962 1420267
61199 1420267 1438640 1459365 1481776 1505366 1529230 1551724 1571122 1586554 1598063 1605839 1609753 1609665
61187 1609665 1605877 1599157 1590410 1580313 1569029 1556224 1541427 1524465 1505542 1485032 1463324 1440795
61175 1440795 1417760 1394409 1370855 1347161 1323240 1298817 1273630 1247593 1220663 1192723 1163830
61164 1163830 1134445 1105166 1076219 1047526 1019259 992044 966480 942670 920349 899331 879706
61153 879706 861713 845463 830685 816664 802525 787665 771844 754933 736818 717686 698202
61142 698202 679210 661362 645236 631610 621176 613815 608416 603699 599197 595318 592576 591086 590834
61129 590834 592109 595301 600357 606704 613759 621327 629417 637951 646867 656354 666719 678007 689966
61116 689966 702387 715262 728466 741497 753807 765395 776876 788840 801267 813601 825239
61105 825239 835677 844217 849939 852289 851597 848748 844341 838397 830901 822276 813149 803869 794513 785204
61091 785204 776121 767232 758269 748970 739180 728707 717357 705164 692419 679446 666524 654015
61079 654015 642278 631354 621039 611356 602668 595156 588566 582747 578033 574644 572015 569399 566982
61066 566982 565689 565800 566479 566985 567621 569004 570941 572692 574079 575648 577784 580239 582563 584515 585959
61051 585959 586822 587356 588080 589200 590299 590814 590734 590632 591119 592429 594560 597654 602066 607968 615080 622977
61035 622977 631592 641102 651375 661977 672849 684517 697335 710899 724529 737953 751108 763693
61023 763693 775427 786467 797045 806935 815864 824218 832744 841762 851177 861068 871590 882533 893757
61010 893757 905974 920242 936696 954616 973886 995556 1020777 1049876 1082665 1118950 1158463
60999 1158463 1200880 1246123 1294205 1344909 1398390 1456132 1520562 1593673 1676758 1771243 1878615
60988 1878615 1999408 2133352 2280876 2443882 2625736 2832352 3073683 3363025 3715050
60979 3715050 4145873 4674071 5318787 6097205 7027486 8135058 9453961 11024772 12896107
60970 12896107 15114919 17673621 20423521 23038579 25113161 26359981 26758078 26534335
60962 26534335 26020348 25523552 25280362 25432031 25957729 26613641 26989148 26696181 25563139
60953 25563139 23688262 21338073 18801225 16302507 13989087 11943309 10193725 8728768
60945 8728768 7516693 6521156 5706153 5037521 4486741 4032796 3658730 3348047 3085562
60936 3085562 2859515 2661109 2483485 2322435 2176422 2044057 1922487 1809388 1705113
60927 1705113 1611285 1528128 1454475 1389237 1331124 1277544 1225505 1173557 1121846 1070755 1020743
60916 1020743 973134 929589 890558 855135 822460 792523 765656 742034 721771 704799 690554
60905 690554 678181 667126 657209 648286 640156 632693 625814 619483 613892 609389 606080 603849 602849 603480
60891 603480 605734 609101 613235 618087 623270 628124 632706 637864 643940 650173 655730 660370 663659 664681
60877 664681 663285 660615 657519 653325 647094 639174 630484 621145 611078 601207 592655 585174 577694 570072
60863 570072 563036 556773 550972 546102 543181 542177 541970 542074 543179 545770 549404 553735 559179 566062 574055
60848 574055 582918 592987 604450 616924 630252 645005 661647 679813 698939 718986 739821 760282
60836 760282 778582 793607 805380 814444 821336 826645 831092 835277 839422 843380 846762 849019 849618 848459
60822 848459 846201 843922 842140 840218 837090 832539 827375 822295 817068 811059 804056 796156 787220 776957
60808 776957 765395 752952 740181 727653 715811 704681 693978 683660 674041 665244 657058 649662
60796 649662 643798 639769 636831 634274 632585 632795 635030 638505 642725 647916 654302 661718 670040 679403
60782 679403 689846 701188 713313 726272 740068 754532 769268 783535 796466 807703 817624 826775
60770 826775 835417 843831 852464 861369 869985 877962 885701 893572 901111 907587 912867 917141 920334 922458
60756 922458 923995 925203 925632 925102 924515 924705 925103 924704 923839 923610 923841 923139 921023 918663 917108 915889 913719
60739 913719 909700 903613 895899 887603 879587 871597 862803 853302 844213 836235 829023 822142 815636 809482
60725 809482 803496 798077 794190 792167 791311 790950 791029 791408 791542 791314 791393 792230 793359 794074 794064 793079 790838 787775
60707 787775 785023 783004 780775 777467 773728 770946 769551 768840 768161 767471 766893 766402 765887 765073 763415 760404
60691 760404 755902 749962 742549 733713 723858 713507 702854 691716 679876 667415 654845 642809
60679 642809 631473 620379 609263 598823 590164 583545 578313 574008 570870 569173 568750 569382 571000 573284
60665 573284 575679 578126 581239 585421 590311 595372 600513 605784 610853 615182 618404 620391 621284 621672 622414
60650 622414 624143 627122 631349 636369 641223 645450 650036 656433 664520 672482 678972 684353 689440 694134
60636 694134 698095 701928 706711 712843 720179 728901 739435 751672 764931 778645 792573 806443 819943
60623 819943 833096 846361 860194 874484 888202 899691 907647 911910 913043 911320 906714 899759 891582
60610 891582 882895 873696 864179 855126 847037 839646 832845 827337 823742 821625 820036 818573 817212 815490
60596 815490 812536 807810 801351 793446 784463 774896 765346 756606 749739 745569 743915 743821 744720 746844 750314
60581 750314 754574 759062 763767 768604 772822 775640 777069 777668 777908 778184 778899 780063 781225 782243 783636
60566 783636 785826 788502 791149 793569 795426 795934 794628 791937 788400 783801 777697 770301 762235 753890
60552 753890 745644 738235 732255 727691 724517 723198 723897 725788 728041 731115 736274 744189 754894 768776
60538 768776 786613 808709 834861 865187 900240 940199 984363 1031222 1078355 1122476 1160345
60527 1160345 1189725 1209067 1216686 1211249 1193187 1165082 1130569 1093270 1056494 1022982 994527 972044
60515 972044 955915 945924 941117 940397 943252 949451 958165 967981 977746 986924 995265 1002780 1010114 1018393
60501 1018393 1028557 1041192 1057054 1077312 1103089 1135011 1173289 1218201 1270729 1332854 1406931
60490 1406931 1494358 1595036 1708318 1834254 1973779 2128335 2299986 2491687 2707028 2949929
60480 2949929 3224761 3535767 3884660 4267290 4671245 5075217 5450463 5765036 5989906
60471 5989906 6103814 6095013 5961937 5714862 5376334 4976946 4547912 4115498 3699507 3313528
60461 3313528 2965023 2656093 2385499 2150489 1947483 1772455 1621653 1491924 1380343
60452 1380343 1284010 1200422 1127707 1064410 1009403 961925 921204 886061 855319 828553 805800
60441 805800 786499 769319 753134 737618 722775 708458 694517 680845 667112 652973 638834
60430 638834 625916 615231 606714 599568 593149 587274 581998 577422 573715 571034 569345 568341 567638 567186
60416 567186 567334 568270 569517 570470 571429 573425 576735 580276 582948 584949 587165 589810 592478 595146 598246
60401 598246 601948 606072 610563 615406 620212 624591 628765 633259 638182 643390 649022 655131 661052 665955
60387 665955 669833 673195 676048 678072 679549 681085 682397 682402 680620 677607 673983 669996 666182 663443 662049
60372 662049 661313 660548 659722 658986 658314 657825 657797 658148 658470 658733 659262 660014 660640 661333 662763 665046 667653 670498
60354 670498 674155 678735 683562 688359 693746 700025 706469 712474 718624 725795 733887 742147 750204 758050
60340 758050 765534 772553 779359 785979 791731 795915 798566 799934 799685 797434 793805 790192 787562 786115
60326 786115 785951 787357 790376 794654 799856 805857 812382 818695 823725 826366 825844 822093 815824 808078 799689
60311 799689 791224 783213 776200 770592 766539 763890 762209 760955 759702 758152 756093 753645 751438 750176
60297 750176 749962 750338 751010 752219 754350 757530 761655 766424 771289 775715 779631 783281 786652 789412 791492
60282 791492 793281 795112 796927 798566 800037 801371 802561 803730 805081 806626 808290 810262 812898 816291
60268 816291 820346 825172 830929 837428 844519 852798 863199 875809 889862 905017 921858 940849 961652
60255 961652 983968 1008428 1036107 1067627 1103164 1142872 1186900 1235359 1288657 1347477 1412167
60244 1412167 1482682 1559453 1643737 1736590 1837803 1946217 2060608 2179828 2302528 2427326
60234 2427326 2552911 2677537 2798581 2913028 3018174 3111681 3191474 3256162 3305313 3338897
60224 3338897 3356704 3358677 3345614 3319109 3281026 3233382 3178526 3119040 3057572 2997011 2940454
60213 2940454 2890574 2849105 2817206 2796027 2786584 2789379 2804706 2833232 2875860 2933041 3004573 3090050
60201 3090050 3189060 3300707 3423087 3553379 3688414 3825029 3959781 4088501 4206538 4309905
60191 4309905 4396135 4463862 4511794 4538460 4542923 4525302 4486619 4428469 4352857 4262069 4158781
60180 4158781 4046627 3930403 3815197 3705302 3604165 3514834 3439584 3379319 3334296 3305424
60170 3305424 3294002 3300315 3323536 3363056 3418628 3488778 3570302 3659943 3755479 3854351 3952249
60159 3952249 4044106 4125971 4195194 4249572 4287524 4308767 4313806 4302951 4276766 4237484 4189111
60148 4189111 4136003 4081774 4029588 3982887 3945482 3920920 3911604 3918419 3941511 3981621 4040333 4118989
60136 4118989 4218001 4337688 4479216 4644249 4834270 5050859 5296070 5571492 5876861 6210084
60126 6210084 6568463 6949176 7348480 7760915 8179399 8595817 9001599 9388259 9747832
60117 9747832 10073130 10357879 10596712 10784872 10917987 10992540 11006525 10959219 10850456 10680966
60107 10680966 10453843 10175194 9853274 9497714 9119735 8731758 8345514 7970506 7614467
60098 7614467 7284414 6986302 6724056 6499772 6314808 6170192 6066316 6002870 5978896 5992439
60088 5992439 6040466 6119524 6225961 6354829 6498953 6649888 6799703 6941421 7068337 7174110
60078 7174110 7253824 7304545 7324920 7314816 7275372 7208889 7118378 7007119 6878141 6733652 6575173
60067 6575173 6404603 6224880 6039308 5850597 5661104 5473568 5290959 5115744 4949929
60058 4949929 4795714 4655542 4531449 4424655 4335814 4265471 4214433 4183790 4174299 4185650 4216849
60047 4216849 4267473 4337896 4427892 4535609 4658284 4793154 4936956 5085112 5232244 5373117
60037 5373117 5502560 5615136 5706030 5772227 5812171 5824600 5808454 5763711 5691566 5593987 5473802
60026 5473802 5335026 5182369 5020416 4853702 4687181 4525738 4373128 4231850 4103801
60017 4103801 3990546 3893209 3812686 3749773 3704676 3676883 3666234 3673728 3700562 3746817 3812026
60006 3812026 3896696 4002223 4129300 4277216 4444501 4629160 4827973 5036226 5248223 5457575
59996 5457575 5657225 5840175 6000647 6134423 6238443 6310788 6350871 6358861 6334839 6279027
59986 6279027 6192743 6078589 5939986 5781255 5608005 5426696 5243689 5064967 4896156 4741839
59976 4741839 4605007 4487835 4392651 4321286 4273874 4249428 4247416 4267700 4309102 4369297 4446262
59965 4446262 4538580 4644034 4758998 4879721 5003383 5127572 5249544 5366381 5475111 5572436
59955 5572436 5655287 5722225 5773779 5811032 5834481 5844588 5842812 5831710 5814548 5795187 5777889
59944 5777889 5766936 5766676 5781895 5817483 5877535 5965341 6084391 6238773 6432313 6667750 6946721
59933 6946721 7269746 7635769 8042038 8484351 8956549 9449214 9949170 10440296 10904472
59924 10904472 11322071 11673056 11939082 12105510 12162729 12107470 11943946 11683401 11341855 10937744
59914 10937744 10490527 10019420 9541678 9071410 8619630 8194742 7802783 7447768 7132234
59905 7132234 6857496 6623730 6430602 6278039 6165989 6093505 6058876 6060859 6099176 6173489
59895 6173489 6282291 6422880 6591779 6784848 6997248 7223193 7455145 7683180 7895742
59886 7895742 8081211 8228580 8327397 8368765 8347308 8261960 8114948 7910974 7657585 7365105
59876 7365105 7045075 6708514 6365346 6024338 5692730 5376077 5078664 4803600 4552393
59867 4552393 4325100 4121419 3941401 3784976 3651260 3538520 3444491 3366704 3303069 3252111
59857 3252111 3212056 3179658 3150693 3121793 3091268 3058333 3022645 2984897 2946820 2909945 2875037
59846 2875037 2843132 2816247 2796310 2783765 2777615 2776249 2777635 2779171 2777950 2771155 2756187 2731140
59834 2731140 2695652 2651127 2600010 2545209 2489995 2437400 2389150 2345698 2307574 2276007 2251937
59823 2251937 2235219 2225393 2222688 2227700 2240453 2260134 2285345 2314347 2345718 2379340 2416562 2459157
59811 2459157 2508485 2565506 2630525 2702213 2777286 2851623 2921486 2983781 3036180 3077630 3108343
59800 3108343 3128872 3139665 3141635 3136411 3125680 3110961 3094392 3078897 3066995 3060009 3058937 3065457
59788 3065457 3081621 3109281 3150321 3206763 3280096 3371256 3482010 3615766 3776399 3966903
59778 3966903 4189889 4448630 4746456 5085193 5464554 5881963 6330949 6798277 7261930
59769 7261930 7691398 8050879 8305776 8431190 8418522 8276758 8028726 7705063 7337907 6955567
59759 6955567 6579579 6224707 5900294 5611247 5358932 5142660 4960925 4811504 4691284
59750 4691284 4596963 4525996 4476601 4447196 4436271 4442635 4465488 4504519 4559980 4632139 4720489
59739 4720489 4824220 4943736 5080940 5237570 5414144 5611187 5830692 6075478 6347760
59730 6347760 6649324 6982726 7351304 7758026 8204919 8693360 9224101 9796859 10409894
59721 10409894 11059375 11738472 12437194 13143374 13843568 14523356 15168690 15768975 16319577
59712 16319577 16821833 17282046 17711398 18125549 18542060 18977058 19443674 19951658 20506013
59703 20506013 21105300 21741818 22403144 23072619 23728812 24346373 24898838 25361574 25714052
59694 25714052 25942206 26040459 26011958 25867232 25623046 25301643 24928825 24530864 24132248 23755215
59684 23755215 23419772 23143143 22939243 22818940 22790780 22861760 23038052 23325445 23729201 24253547
59674 24253547 24901143 25672123 26562537 27562830 28656829 29820448 31019884 32210882
59666 32210882 33340304 34349110 35175744 35761113 36056369 36031238 35678938 35016413 34081562
59657 34081562 32928670 31621877 30227486 28807255 27413991 26089123 24861801 23749360
59649 23749360 22758325 21884766 21113886 20419970 19767978 19117890 18432145 17684317 16864926
59640 16864926 15981563 15054398 14110191 13176625 12277518 11429915 10643907 9924137 9271294
59631 9271294 8683180 8155852 7684532 7263951 6888749 6554315 6257096 5993748 5760435
59622 5760435 5553465 5370189 5208733 5067267 4944231 4838768 4750038 4676155 4614389 4562277
59612 4562277 4517911 4479249 4443747 4408567 4370761 4327527 4276911 4218183 4151199 4075703 3991750
59601 3991750 3900444 3803750 3703828 3603006 3503844 3408426 3317775 3232540 3153949 3083447 3021728
59590 3021728 2968769 2924533 2888987 2861685 2842030 2829754 2824531 2825476 2831723 2843174 2859920 2881057
59578 2881057 2904834 2929894 2955723 2982009 3008166 3033445 3057166 3079084 3099862 3120791 3142720
59567 3142720 3165942 3191619 3222470 3261079 3308128 3363182 3426591 3499524 3582686 3676259 3780959
59556 3780959 3898124 4028947 4174600 4336848 4517468 4717148 4935794 5173572 5430570
59547 5430570 5705637 5996582 6301168 6616749 6939090 7262770 7582772 7894781 8194248
59538 8194248 8476589 8738553 8978620 9196328 9392137 9567218 9721533 9852122 9955214
59529 9955214 10030845 10084540 10124499 10158556 10193929 10237780 10296480 10374787 10475956 10601329 10748756
59518 10748756 10911821 11080823 11243704 11386175 11492904 11550316 11548447 11480350 11341312 11129857
59508 11129857 10848961 10505531 10108987 9670555 9202861 8718907 8231071 7750763 7287846
59499 7287846 6849514 6439999 6061742 5716510 5405229 5127499 4881917 4666608 4479285
59490 4479285 4317392 4178596 4060970 3962716 3882366 3819401 3773939 3745462 3732428 3733452 3748396
59479 3748396 3778115 3823694 3886215 3966619 4065360 4182460 4318078 4472794 4647350 4842497
59469 4842497 5058874 5296251 5552757 5825224 6110016 6402650 6696646 6983507 7253801
59460 7253801 7497499 7703624 7861237 7961760 8000181 7974431 7885000 7735602 7533082 7285888
59450 7285888 7003018 6694383 6370724 6042062 5716344 5399576 5096332 4809556 4540634
59441 4540634 4290285 4059162 3847523 3655041 3481242 3325458 3186184 3061241 2948953
59432 2948953 2848557 2759381 2680439 2611150 2551576 2501549 2460139 2426224 2398911 2377337 2360943
59421 2360943 2350149 2345778 2347500 2353691 2363069 2375513 2391067 2409319 2430165 2454085 2481192 2511223
59409 2511223 2544886 2583487 2625908 2667101 2701290 2726589 2745910 2764220 2785971 2814421 2851696
59398 2851696 2899063 2957739 3029438 3115433 3214836 3324221 3439400 3558269 3682876 3819122
59388 3819122 3974050 4153148 4360171 4598769 4872955 5185950 5539855 5936816 6379314
59379 6379314 6868540 7403106 7979357 8591409 9229904 9881723 10531998 11166123 11769947
59370 11769947 12330127 12836520 13284422 13673892 14007448 14288988 14523849 14718036 14876609
59361 14876609 15002637 15096829 15157283 15179849 15159404 15090939 14969843 14792651 14558874 14272264
59351 14272264 13940335 13573410 13184087 12785722 12389363 12001528 11624656 11258427 10899887
59342 10899887 10543615 10183674 9815934 9438524 9051118 8655100 8254128 7853543 7459070
59333 7459070 7076228 6710168 6365023 6043422 5746994 5476863 5233228 5015099 4821232
59324 4821232 4650894 4503215 4376394 4268305 4177386 4102368 4041698 3994057 3958965 3936216
59314 3936216 3925125 3924966 3935549 3956651 3987388 4026800 4074456 4129671 4190609 4254979 4321130 4387735
59302 4387735 4452820 4513884 4568591 4614670 4649694 4671821 4680580 4676574 4661095 4636606 4606652 4574166
59290 4574166 4540312 4505897 4473337 4446224 4427424 4418648 4421449 4437452 4467738 4513032 4574446 4653213
59278 4653213 4749760 4863753 4994777 5142118 5303922 5477167 5658227 5842904 6026249 6202973
59268 6202973 6367522 6513051 6631066 6713602 6756256 6759023 6724983 6659231 6568619 6460961 6343688
59257 6343688 6223111 6104331 5990933 5884836 5786983 5697944 5617404 5543651 5474426 5408059
59247 5408059 5343332 5278935 5214036 5148960 5084394 5020329 4956794 4895359 4838863 4789846 4750213
59236 4750213 4722390 4709756 4715771 4743291 4794797 4872737 4979673 5118552 5292616 5504553 5755961
59225 5755961 6047865 6380944 6754181 7163343 7601094 8057634 8520054 8971503 9392476
59216 9392476 9763719 10068113 10291010 10420519 10448359 10370619 10188403 9908526 9543293 9108873
59206 9108873 8623572 8106883 7578053 7053550 6545641 6063499 5614463 5203195 4830679
59197 4830679 4495672 4196884 3932807 3700363 3495526 3315192 3157213 3018970 2897364
59188 2897364 2790111 2695675 2611976 2536529 2467983 2406352 2351510 2302557 2258765 2220130 2186759
59177 2186759 2158490 2135197 2116624 2102025 2090799 2083389 2080700 2082741 2088703 2098249 2111777 2129534
59165 2129534 2151396 2177429 2207740 2241916 2279521 2320986 2367121 2417968 2473061 2532554 2597037
59154 2597037 2666440 2740202 2818263 2900745 2986744 3074554 3162909 3250899 3336863 3418606 3494538
59143 3494538 3563322 3622553 3669301 3702126 3721367 3727467 3720460 3701293 3672161 3635132 3591694 3544070
59131 3544070 3495706 3449803 3408229 3372221 3343173 3322331 3310647 3309359 3320013 3343606 3380468
59120 3380468 3431097 3496316 3576523 3671646 3781947 3907968 4049603 4206260 4378144 4566445
59110 4566445 4771997 4994532 5233303 5487463 5755495 6034845 6321839 6610937 6893990
59101 6893990 7161226 7403079 7610446 7773874 7884519 7936775 7929527 7865138 7748424 7586385
59091 7586385 7387108 7157994 6905457 6635915 6355616 6069262 5780052 5491248 5206484
59082 5206484 4928471 4658919 4400079 4154919 3925223 3710770 3510805 3325106 3153179
59073 3153179 2993802 2846058 2709777 2584441 2468804 2362078 2264373 2175409 2093917 2018844
59063 2018844 1950068 1887402 1830073 1777783 1731151 1690452 1654895 1623758 1597121 1574783 1555483
59052 1555483 1537888 1521472 1505800 1489920 1473155 1455570 1437069 1416884 1394615 1370905 1346584
59041 1346584 1322097 1298353 1277075 1259474 1245308 1233865 1225050 1218940 1215143 1213326 1213653 1216159 1220526
59028 1220526 1227036 1236868 1250705 1267690 1286283 1305495 1324838 1343823 1361975 1378607 1392272 1401374
59016 1401374 1405706 1406545 1404965 1401185 1395948 1391268 1389022 1389780 1393531 1400460 1410338 1422259 1435678 1450663
59002 1450663 1466500 1481261 1493591 1503736 1511921 1516925 1517462 1513965 1507701 1498945 1487319 1473428 1458987
58989 1458987 1445596 1434250 1425554 1419450 1415005 1411275 1408263 1406658 1407023 1409609 1414344 1420592 1427558 1435325
58975 1435325 1444776 1456163 1468674 1481865 1496500 1513314 1531982 1552109 1574299 1599289 1626744
58964 1626744 1655863 1686523 1718974 1752952 1787878 1823473 1859420 1894899 1929129 1962008 1993798
58953 1993798 2024706 2055219 2086257 2118622 2152824 2189656 2230106 2274483 2322608 2375145 2433631
58942 2433631 2498756 2569867 2646776 2730879 2823720 2925580 3036241 3155911 3284505 3421234
58932 3421234 3566072 3720805 3887646 4067756 4262217 4473598 4705354 4960285 5240531
58923 5240531 5548485 5886804 6258128 6665645 7113294 7604537 8141334 8724806 9356016
58914 9356016 10035309 10761391 11531366 12340290 13179380 14034924 14889181 15721253 16506562
58905 16506562 17217179 17824634 18303119 18631194 18793429 18782979 18602630 18262989 17780568
58896 17780568 17177656 16481292 15719410 14917280 14097212 13279131 12479150 11708266 10974030
58887 10974030 10282901 9639842 9046694 8502728 8006449 7555767 7147168 6776263 6438972
58878 6438972 6131436 5849638 5590232 5351014 5129560 4922370 4726632 4541948 4369008
58869 4369008 4207366 4055864 3914385 3783676 3663920 3554654 3455406 3365206 3282238 3205301
58859 3205301 3134908 3071782 3015124 2963666 2917514 2877438 2843169 2813933 2789919 2771689 2758793
58848 2758793 2750576 2747746 2751620 2762361 2779409 2802953 2833404 2870109 2912268 2960572 3016274 3079133
58836 3079133 3147921 3222528 3303956 3392735 3489038 3593936 3708814 3833818 3968521 4113825
58826 4113825 4271719 4443548 4630180 4833562 5056458 5300913 5568508 5861860 6184367
58817 6184367 6538930 6928539 7357565 7830591 8350126 8917048 9532602 10197702 10910222
58808 10910222 11664671 12453991 13268966 14095260 14912801 15698371 16427232 17072506 17606103
58799 17606103 18002626 18242859 18314830 18214493 17946987 17526406 16973435 16312950 15572295
58790 15572295 14778845 13957407 13129495 12313689 11524556 10771097 10057917 9388226 8764564
58781 8764564 8187154 7653809 7162137 6710469 6296531 5916960 5568823 5250268 4959249
58772 4959249 4692748 4447631 4221167 4010541 3813176 3627866 3454578 3292949 3142009
58763 3142009 3001326 2871079 2750897 2639785 2537325 2443787 2359011 2282284 2213201 2151474
58753 2151474 2096012 2045587 2000265 1960839 1926905 1896945 1870199 1846974 1827147 1809884 1794885
58742 1794885 1782387 1771863 1762157 1752938 1744492 1736090 1726156 1714136 1700668 1685877 1669176 1650829
58730 1650829 1631997 1612940 1592833 1571602 1550312 1529373 1507929 1485366 1461940 1437544 1411371
58719 1411371 1383112 1353145 1321415 1287669 1252974 1219358 1187658 1157253 1128020 1100786 1075639
58708 1075639 1051665 1028797 1008174 990141 973613 957944 943694 930953 918629 906122 894208
58697 894208 883557 873808 864695 856629 849587 842851 836426 831232 827403 823876 820260 817575 816472 816141
58683 816141 815607 814654 812879 809285 803597 796738 789478 781879 774501 768697 765074 762930 761668 761443 762015
58668 762015 762436 762388 762500 763032 763709 765085 768351 773306 778154 781788 784551 786296 785639 782008 776765 771493
58652 771493 766640 762500 759863 758936 759183 760894 765305 772488 780782 789110 798256 809161 821725 836035
58638 836035 852961 872531 893354 914675 937533 963003 990903 1021035 1054140 1090737 1130605
58627 1130605 1174229 1223125 1277994 1338372 1405003 1480699 1567780 1666471 1776901 1900780 2039834
58616 2039834 2194467 2365358 2554604 2763610 2991135 3234599 3491543 3758061 4027028
58607 4027028 4289227 4534916 4753065 4930909 5056691 5122805 5125983 5066470 4948952 4783128
58597 4783128 4581200 4354630 4113590 3867721 3625385 3392348 3172075 2966761 2777459
58588 2777459 2604192 2446798 2305103 2178145 2064518 1963861 1876542 1801499 1736189 1679274
58578 1679274 1631518 1593169 1562316 1536788 1515772 1498474 1483021 1468037 1453627 1439603 1424486
58567 1424486 1407535 1390056 1373367 1357162 1341134 1326322 1313191 1300037 1284913 1267661 1248563
58556 1248563 1226614 1200945 1172718 1143959 1115700 1088614 1064028 1042712 1023895 1006888 992435
58545 992435 981068 971466 961941 952293 942801 932685 921079 908393 895380 881950 867980 854014
58533 854014 840171 825811 811277 798298 787602 777911 768379 759958 753057 746035 737576 728488 719477
58520 719477 709288 697081 684613 673909 664502 655071 646074 638583 632140 625964 620795 617417 614800
58507 614800 611852 609578 609410 610724 612109 613743 616455 619781 623046 627062 632686 638994 644853 651027
58493 651027 658746 667581 676673 686661 698315 710608 722162 733316 744772 755612 764595 772065 778696
58480 778696 783826 786824 788412 788727 785971 779059 769777 760121 749476 736705 722982 709924 696867
58467 696867 682716 668701 656520 645515 634501 624592 617240 611191 604514 598074 593822 591121 587996
58454 587996 584639 582427 580757 578173 575521 574662 575080 574972 574724 576114 579012 582102 585949 592162 600286
58439 600286 608636 617450 628232 640790 653896 667956 683964 700651 715585 728156 738659 745736
58427 745736 747983 746944 745217 742702 738055 732502 728499 725636 721764 717401 715061 714737 713937 711992 710708
58412 710708 710878 711514 712430 714433 717281 720419 725166 733072 742840 752033 760881 770947 780992 787886
58398 787886 790865 791176 788352 780885 770108 759390 749723 739787 729905 721992 715933 710001 704623 701844
58384 701844 701255 700419 699253 700108 703529 707759 712419 718849 726721 733947 739995 745940 751539 755790 759928
58369 759928 766141 773728 780247 785893 792800 800702 807465 813462 821114 830452 839354 847758 857307 867271
58355 867271 875326 882119 890605 901112 911455 921524 933096 945470 956019 964728 973410 980816 983572
58342 983572 981729 978402 974243 967496 959169 952661 948332 943920 940183 940345 943914 946990 949006 953252
58328 953252 960377 967475 974198 983531 995631 1007021 1016961 1028656 1043087 1057567 1071500 1087522
58316 1087522 1105775 1123104 1139185 1157430 1178462 1198658 1216465 1234143 1251953 1266662 1277176
58305 1277176 1285735 1292423 1294761 1293809 1294200 1296893 1298464 1298682 1301851 1309241 1317294 1324964 1335655 1350057
58291 1350057 1364288 1377109 1391833 1409134 1425295 1439685 1456560 1477295 1498217 1518223 1540954
58280 1540954 1567259 1593408 1619047 1648859 1683946 1719736 1754954 1794109 1838348 1882518 1924280
58269 1924280 1967321 2012317 2053705 2089019 2122649 2156898 2188291 2216272 2246335 2280746 2315422
58258 2315422 2349576 2388813 2434855 2482197 2529007 2581059 2640591 2701744 2761575 2824945 2893934
58247 2893934 2963556 3032875 3108914 3194268 3282379 3370343 3464468 3567654 3673842 3780870 3895936
58236 3895936 4022019 4152087 4283261 4423135 4575418 4733710 4896647 5074211 5271284
58227 5271284 5480297 5698171 5934444 6194138 6469560 6758282 7071787 7416708 7785905
58218 7785905 8178261 8607901 9083027 9596268 10147696 10755787 11433354 12175966 12987589
58209 12987589 13892955 14910472 16040349 17296278 18721018 20354732 22221031 24365655
58201 24365655 26877608 29855392 33396153 37648306 42838901 49226968 57077777 66707731
58193 66707731 78492863 92798002 109969189 130444147 154801960 183669616 217634126
58186 217634126 257037736 301115578 346532959 386767595 413888395 422151977 410709902
58179 410709902 383357994 346026173 304334159 262547615 223531020 188902645 159232418
58172 159232418 134392083 113912304 97169390 83484222 72248688 63001676 55384274
58165 55384274 49083676 43856677 39551437 36058339 33270330 31112169 29558827 28591485
58157 28591485 28173275 28292020 28985721 30306734 32301429 35007733 38336303 41846386
58149 41846386 44705190 46030549 45374421 42910748 39217882 34936062 30571417 26460703
58141 26460703 22792036 19637057 16992786 14814618 13032336 11567691 10355586 9347993
58133 9347993 8502979 7783785 7167716 6642660 6193960 5803968 5461489 5160173 4889501
58124 4889501 4637749 4401251 4180637 3970969 3765775 3567558 3383899 3215755 3059161
58115 3059161 2915251 2788549 2677915 2578668 2491077 2417434 2352939 2288499 2220732 2151396 2079709
58104 2079709 2003687 1926762 1854845 1788478 1725016 1665990 1614925 1570269 1527848 1488098 1453912
58093 1453912 1423708 1393525 1363623 1336235 1309200 1278597 1245450 1213357 1181919 1148953 1116610
58082 1116610 1088513 1063028 1036021 1008148 983033 960291 936808 913090 892040 873149 853874
58071 853874 835066 819243 805320 790731 776802 766315 757786 747965 737957 730948 725808 719005
58059 719005 711104 705305 701012 694807 686489 678386 670024 659213 647215 637150 628382 618012 606778
58046 606778 597822 590703 582365 573257 566812 563362 559994 556027 553393 551977 549706 547043 546531 548065
58032 548065 549217 549803 551561 553849 554341 553533 553952 555400 555617 555040 556155 558618 559879 560313 562782 567155
58016 567155 570194 571102 572421 575021 576762 576725 576468 576389 574928 572057 569764 568396 566059 562242 558691 556257
58000 556257 554102 552226 551586 551572 550480 548421 546636 544236 539091 531690 524592 518083 509900 499242 487601
57985 487601 475708 463189 451295 442439 436765 432406 429142 428496 430224 432230 434085 437304 441997 446552
57971 446552 450741 455827 461479 465881 468966 472288 475673 477379 477610 478350 479543 479023 476526 474313 473369
57956 473369 472285 470290 468036 465026 459684 452545 446152 441340 436779 432415 429902 429141 427942 425822
57942 425822 424812 425790 427352 428948 431705 435269 437183 436453 434618 432428 428684 423224 417704 412259 404653
57927 404653 394075 382748 372508 362683 352596 343214 335004 326971 319221 313760 311379 310385 309671 310374
57913 310374 313141 316447 319173 322387 327100 332656 338738 346576 356684 367555 377933 388167 398102
57900 398102 406064 411373 415659 420253 424360 427133 429383 431820 433658 434362 434803 435357 434787 432226 428375
57885 428375 423617 417114 408992 401296 395360 390215 384873 380096 376573 373425 370034 367355 365877 364237
57871 364237 361495 359032 358546 359755 361645 364446 368795 374253 380042 386092 392237 397622 401794 405082
57857 405082 407232 407378 406069 405400 406196 406885 406053 404124 401649 398185 394041 390917 389463 388255 386468
57842 386468 385268 385174 384449 381965 379444 378770 379065 378472 377048 375709 373960 370936 367331 364147 360748 356169
57826 356169 351063 346314 340876 333145 323515 313599 303817 293725 283893 275432 268205 261291 254727 249218
57812 249218 244612 240211 236057 232534 229266 225748 222534 220577 219853 219764 220263 221578 223516 225998 229470
57797 229470 233861 238090 241661 245771 251754 259377 267677 276369 285268 293357 299771 304846 309132 312318
57783 312318 314178 315502 316887 317607 316866 315066 312700 309176 304037 298205 292641 286810 279944 272808 266755
57768 266755 261853 257347 253122 249456 246180 243306 241575 241202 241181 241078 242285 245999 251080 255560 259242
57753 259242 263138 267266 270793 273652 276368 278845 280856 283120 286396 290114 293237 295792 298211 299974
57739 299974 300405 300075 300024 300341 300905 302588 306099 310477 314366 318018 322340 326851 330493 333803 338257 343910
57723 343910 349594 355192 361816 369827 378426 387203 396536 406495 416754 427557 439493 452474 466112
57710 466112 480737 496799 513693 530552 547849 566862 587941 610661 635255 662494 692581
57699 692581 725629 762718 804933 851751 902047 956392 1016783 1084536 1160269 1245741 1343780
57688 1343780 1456143 1583089 1725266 1884529 2062566 2259908 2476360 2711050 2961706
57679 2961706 3224575 3494659 3764841 4025100 4264021 4471231 4637996 4757178 4825479 4846391
57669 4846391 4829659 4787660 4732657 4674918 4618422 4555755 4468908 4338158 4152648 3915354 3641070
57658 3641070 3350247 3062071 2790012 2541697 2321159 2129995 1967148 1829598 1714026
57649 1714026 1617389 1536476 1468330 1411246 1364443 1326897 1297474 1275751 1261461 1253446 1250530 1253162
57637 1253162 1262789 1279738 1303100 1332504 1368588 1411914 1462982 1523329 1595130 1679605 1777036
57626 1777036 1888135 2013922 2154404 2309048 2478409 2663458 2863014 3073250 3289512
57617 3289512 3506590 3716732 3909220 4072665 4196799 4272552 4293164 4256796 4167284 4031964
57607 4031964 3859801 3661211 3447092 3226416 3005421 2789262 2582852 2389512 2210335
57598 2210335 2045592 1895563 1759602 1635999 1523665 1422671 1332517 1251289 1177342 1110544
57588 1110544 1051021 997933 950278 907700 869688 835076 803168 774214 748088 723688 700475
57577 700475 679360 661049 644604 628797 613932 601184 590810 582043 574239 567231 560981 555613
57565 555613 551376 548049 544870 541528 538703 537321 537853 540581 545704 552829 561108 570152 580035 590339
57551 590339 600347 610480 622309 636643 652722 669837 688573 709842 733819 760592 790808
57540 790808 824928 862904 905412 954396 1011512 1076799 1149644 1230266 1319575 1418506 1528250
57529 1528250 1650279 1785157 1931890 2088940 2254985 2427911 2603747 2777083 2941522
57520 2941522 3089083 3210406 3296955 3342985 3345431 3303551 3220035 3101604 2957102 2794975
57510 2794975 2622781 2447684 2275770 2111041 1955908 1812277 1681429 1563364 1457276
57501 1457276 1362522 1278636 1204881 1140367 1084213 1035250 992174 954483 922585 896586 875719
57490 875719 859375 847694 840558 836972 836132 838200 843353 851110 861515 875903 895399 919475 947146
57477 947146 978938 1016575 1061261 1113355 1173323 1241995 1320176 1408761 1508899 1621411 1746422
57466 1746422 1883886 2033576 2193762 2360561 2529043 2693980 2848645 2984078 3090899
57457 3090899 3161674 3191254 3176534 3117722 3019366 2888764 2733535 2561309 2380416 2198776
57447 2198776 2021918 1852986 1694263 1547590 1413742 1292627 1183982 1087014 999951 921135
57437 921135 850286 787627 732119 681689 635010 592070 553268 518902 489139 463427 440185
57426 440185 418076 397244 378426 361359 345171 329834 315943 303390 291587 280703 271375 263274
57414 263274 255261 246922 238762 230926 222951 214831 207179 200156 193255 186301 179769 174103 169588 166805
57400 166805 166144 166794 167139 166309 164673 162915 161485 160707 160458 159808 157972 155569 154022 153810 154207 154527 154591
57383 154591 154122 152862 151302 150235 149571 148656 147674 147501 148086 148226 147153 145282 143186 140995 139041 137926
57367 137926 137491 136692 134963 132875 131131 129795 128783 128220 127871 127066 125621 124162 123238 122752 122556 122821
57351 122821 123529 124231 124602 124612 124043 122590 120646 119226 118760 118615 118064 117143 116350 116145 116926 118845 121381
57334 121381 123642 125296 126712 128155 129465 130546 131544 132486 133333 134416 136160 138389 140529 142387 144069
57319 144069 145401 146316 147576 150101 153587 156872 159613 162495 165786 168942 171884 175414 179927 184687
57305 184687 188807 192113 194866 197588 201404 207423 215332 223622 231562 240009 249886 260987 272811 285595
57291 285595 299789 315289 331812 349492 368714 389908 413684 440377 469267 499024 529060
57280 529060 559570 590302 620494 650143 679875 709102 735591 757306 773427 783114 784928 778270
57268 778270 764114 743427 716233 683153 646515 608736 570702 532763 496080 461696 429410
57257 429410 398940 371217 347089 325744 306026 288513 274600 264013 254958 246399 238643 231865
57245 231865 225640 219971 215349 211691 208333 205123 202347 199657 196317 192684 190213 189669 190257 190870 191267
57230 191267 191651 191872 191580 190751 189755 189093 189137 189809 190594 191078 191241 191029 190152 188819 188078 188704 190160 191477
57212 191477 192752 194924 198328 202384 206507 210464 213973 216814 219344 222230 225751 229866 234595 239659
57198 239659 244153 247459 250187 253288 256574 259083 260602 261757 262857 263834 265185 267725 271270 274700
57184 274700 277469 280015 282664 285228 287870 291229 295417 299913 304725 310591 317686 325099 332011 338558
57170 338558 345256 352446 360570 370071 380607 391178 401361 411660 422522 433924 446127 459780
57158 459780 474923 490870 507394 525032 543926 563508 583707 605246 628225 651678 675248
57147 675248 700132 727504 757019 787751 819663 853199 888282 924657 962627 1002671 1044859
57136 1044859 1089126 1135382 1183031 1231453 1281308 1334115 1390051 1447756 1507023 1569999 1638639
57125 1638639 1712709 1791544 1876140 1967969 2067432 2175209 2293457 2423618 2564379 2713860
57115 2713860 2872506 3041813 3221889 3412870 3617450 3839374 4080700 4343357 4632221
57106 4632221 4953712 5312779 5714817 6169875 6692140 7297267 8004849 8843107 9847805
57097 9847805 11058736 12522667 14298379 16452460 19049513 22149380 25807788 30067209
57089 30067209 34944196 40430258 46497309 53085550 60091561 67400158 74940249 82671016
57081 82671016 90462280 97981597 104731873 110227119 114147675 116365375 116884222 115791957
57073 115791957 113239956 109415960 104510660 98711228 92220425 85264489 78075920 70872693
57065 70872693 63848012 57161444 50927653 45214477 40053392 35449381 31383983 27819951
57057 27819951 24711126 22009323 19665033 17629352 15859400 14319920 12979264 11807619
57049 11807619 10780098 9877666 9083618 8382137 7760953 7211486 6724774 6290261 5899595
57040 5899595 5548177 5231500 4943147 4678009 4434461 4211466 4005996 3814915 3636924
57031 3636924 3470982 3315122 3168407 3031877 2905926 2788658 2678224 2574701 2478337 2388013
57021 2388013 2302993 2224166 2152001 2084982 2021531 1961787 1906253 1854484 1806388 1762995 1724693
57010 1724693 1690500 1660238 1635583 1618028 1608067 1607507 1620002 1647776 1690512 1749465 1830281 1939743
56998 1939743 2081901 2258185 2465433 2687196 2888385 3025639 3068114 3010579 2870473 2676487
56988 2676487 2458246 2239716 2036395 1856601 1704450 1580912 1483314 1406185 1343040 1286941
56978 1286941 1231057 1171263 1108288 1045699 985999 929891 878273 832566 793132 759329 731226
56967 731226 709667 694589 684784 679426 678548 682193 690366 703616 722298 745537 772270 802759 837197
56954 837197 872643 902854 921540 925098 913009 887605 853719 816841 780725 747123 717298 692462
56942 692462 672803 657511 646045 638523 634945 635085 639101 647453 660408 678474 702960 735073 774542
56929 774542 819434 866025 907671 935278 941664 926066 893503 850341 801805 752610 706861 666362
56917 666362 630528 598623 570982 547928 528960 513489 501262 491762 484086 477686 472453 468184
56905 468184 464795 462797 462523 463195 463895 465117 468162 473239 479459 486357 494082 502420 511124 521026 533320
56890 533320 547863 563595 580481 599558 621236 644951 670003 694685 714625 724103 719797 702253
56878 702253 674075 638598 600196 563440 530855 502671 478983 460639 447885 440165 437864 442541
56866 442541 454760 473362 497682 529002 568992 618193 676935 746187 825646 910727 991585
56855 991585 1055081 1089201 1088498 1056826 1004303 941222 874951 811001 753998 706682 669652 642924
56843 642924 626676 620493 623775 637318 662831 700534 749154 808827 882150 971782 1078630 1201991
56831 1201991 1337455 1472136 1584432 1652419 1664151 1621045 1534375 1420256 1295277 1172428
56821 1172428 1059157 959017 874103 805218 751331 710875 683370 668930 667007 676890 698719
56810 698719 732801 778538 835366 904398 987490 1083369 1183815 1273100 1332382 1347877 1317579
56799 1317579 1250834 1161552 1062067 961831 868130 785448 714989 656305 609055 572717 546049
56788 546049 528156 519231 519205 526586 539762 558673 584332 617515 658620 707154 759457 807374
56776 807374 840872 852620 840406 806780 757708 700641 642016 585918 534850 490610 453657
56765 453657 422681 396002 373051 353964 338542 326306 316747 308861 301349 294004 287964 283875 280819
56752 280819 277755 274900 272795 271199 269867 269264 269414 269137 267635 265807 264803 264330 263599 262899 262733 262282
56736 262282 260347 257285 254591 252937 251841 250813 249683 248148 246060 243837 241833 239806 237682 236092
56722 236092 235307 234495 232874 230794 228783 226528 223828 221545 220450 220029 219582 219597 220743 222382 223404 223786
56706 223786 224049 223946 222994 221610 220473 219446 218335 217921 218956 220871 222688 224369 226047 226932 226503 225862
56690 225862 226253 226992 226584 225218 224376 224483 224695 224711 225057 225699 225977 225875 226015 226491 226900 227316 228116 229122
56672 229122 229989 231014 232414 233343 232895 231621 230820 230732 230651 230345 230154 230121 230171 230608 231336 231312 229936 228207 227179
56653 227179 226163 223932 220875 218301 216381 214400 212356 210569 208403 205176 201766 199540 198288 196978
56639 196978 195799 195458 195130 193471 191249 190559 191491 191917 190718 189004 187806 186707 185282 184078 183536 183397
56623 183397 183592 184399 185471 186049 186243 186829 187815 188569 189223 190435 191886 192532 192303 192071 192108 192137 192661 194446
56605 194446 196730 197714 196895 195395 194169 193499 193935 195763 197654 197832 196569 195645 195518 195231 195010 196405
56589 196405 199447 202047 202898 202872 202876 202444 201328 200545 200837 201653 202443 203474 204722 205496 205807 206592 208020 209129
56571 209129 209654 210612 212568 214956 217706 221817 227502 233383 238386 243104 248550 254868 261919 269788 278051
56556 278051 285773 292749 299581 306236 311909 316619 321375 326392 330646 333619 335855 337372 337232 335283
56542 335283 332705 330185 327080 322983 318542 314095 309030 303107 296990 290949 284548 278034 272461 267950
56528 267950 263516 259031 255581 253317 250883 247646 244639 242499 240370 237711 235287 233417 231054 227710
56514 227710 224576 222560 220814 218374 215690 213414 211109 208378 205979 204724 204422 204753 205908 207576 208717
56499 208717 209150 209963 211618 213124 213859 214573 215708 216393 216119 215815 216251 216878 217182 217605 218144 217800 216519
56482 216519 216059 217691 220571 223506 226710 230579 234347 237354 240219 243418 246103 247667 249149 251725
56468 251725 255051 258343 261861 266010 270172 273689 276912 280263 283375 286107 289146 292638 295581 297502
56454 297502 299306 301469 302900 302663 301391 299970 298356 296728 296110 296702 297219 297100 297734 300186 303396 305904
56438 305904 307730 309141 309321 307854 306083 305406 305508 305496 305276 304595 302455 298896 295653 293622 291396 287773
56422 287773 283833 280901 278350 275228 272198 269872 267041 262726 258439 256137 255324 254318 253098 252709 253009
56407 253009 253112 253001 252784 251551 248893 246375 245569 245854 245972 246355 247786 249150 248886 247598 246992 247184 247247
56390 247247 247420 248512 249955 250640 250949 251956 253409 254531 255959 258802 262456 265312 266960 267887 267882 266628
56374 266628 265129 264699 265254 266210 268002 270991 273977 275763 277148 279481 282324 284520 286394 288768 290897
56359 290897 291641 291800 293075 295475 297753 299469 300667 300535 298622 296481 296023 297121 298721 301065 304625
56344 304625 308124 310039 311068 312757 314802 316169 317711 320926 325082 328378 331160 335218 340544 345538
56330 345538 349880 354563 359626 364452 369789 376866 384981 392515 399799 408393 418102 427374 436170 445652
56316 445652 455405 463775 470802 478128 486048 493177 498895 503706 507327 508889 508864 508440 507151 503539 498029
56301 498029 492810 489033 486296 484608 484474 485229 485546 485500 486174 487712 489804 493358 499284 506294 512323 517635
56285 517635 524112 532194 541071 551185 563717 578062 592553 607354 624084 643217 664417 688699
56273 688699 717309 749090 781959 816496 855065 898040 944220 994564 1052001 1117561 1190003
56262 1190003 1269460 1358281 1458030 1568662 1690844 1826144 1974552 2134503 2305434 2487692
56252 2487692 2679807 2878414 3080617 3283760 3483177 3673010 3849043 4008014 4144746
56243 4144746 4253251 4330603 4376955 4392483 4377688 4336258 4273975 4194789 4101078 3997133 3888529
56232 3888529 3778085 3666047 3554011 3444763 3338283 3231922 3124860 3018605 2912924
56223 2912924 2805319 2694941 2583256 2470507 2355505 2239373 2125475 2014962 1906239
56214 1906239 1799413 1697272 1601133 1509727 1423039 1343305 1271200 1204862 1143592 1088711 1039926
56203 1039926 994782 952798 916217 885556 858170 832341 809020 788424 768783 749705 733119
56192 733119 719640 707523 696164 686939 679701 672323 664692 659235 656482 654152 651604 650979 652851 655101
56178 655101 657359 662138 670045 678286 685539 694003 704910 716440 727876 741396 757625 773662 787689
56165 787689 801445 815926 828704 837845 844721 850673 854578 855793 855919 855743 854011 850957 849225 849637
56151 849637 850039 849956 852164 857959 865321 873682 886006 904022 925965 951311 983267 1024216 1073211
56138 1073211 1130401 1199396 1282693 1379140 1488234 1611891 1748748 1891016 2029932 2160368
56128 2160368 2278031 2377700 2458179 2524953 2584494 2639259 2690101 2738174 2780949 2811083 2823280
56117 2823280 2819040 2802369 2775476 2741320 2704735 2666589 2620737 2560307 2483334 2389940 2279604
56106 2279604 2155320 2025848 1899639 1780097 1669542 1572634 1491953 1424833 1368415 1323479
56096 1323479 1289816 1262773 1238310 1216870 1198685 1180357 1160058 1140930 1125119 1109513 1091630
56085 1091630 1074564 1061470 1050224 1038194 1027323 1019759 1013413 1006676 1002578 1003378 1005856 1006850 1008592
56072 1008592 1013739 1020113 1025314 1031542 1040842 1050575 1058442 1066841 1077430 1086930 1093480 1101360 1113933
56059 1113933 1127662 1138708 1149649 1163777 1178641 1191448 1205049 1222247 1239830 1254597 1269569
56048 1269569 1287861 1306315 1321745 1337512 1357208 1377844 1396117 1415215 1438399 1462223 1483368
56037 1483368 1505740 1533283 1562301 1588607 1615619 1647448 1680747 1711641 1743792 1781173 1819933
56026 1819933 1856220 1894723 1940214 1987930 2031982 2075949 2125240 2176462 2224788 2274377 2330608
56015 2330608 2389279 2444551 2500265 2562158 2626376 2687355 2749349 2818127 2889170 2956667 3026222
56004 3026222 3105499 3190280 3273411 3359568 3457065 3562962 3670679 3784208 3909893 4042399
55994 4042399 4174350 4311600 4463293 4625580 4791416 4967174 5162247 5371634 5586764
55985 5586764 5813886 6063212 6330304 6607942 6905565 7236023 7594273 7971230 8377019
55976 8377019 8827190 9318368 9842750 10414092 11052804 11758730 12527168 13377933 14338334
55967 14338334 15412959 16603986 17946401 19488484 21256103 23277523 25628024 28411021
55959 28411021 31720465 35676166 40481527 46399324 53697569 62676415 73713541 87209129
55951 87209129 103520507 123037173 146289266 173906264 206526360 244722578 288459523
55944 288459523 335671526 380918245 416071294 433590401 430202241 408057188 372809369
55937 372809369 330713690 286867255 244845692 206851046 173889504 146072252 123018410
55930 123018410 104130162 88708100 76063554 65637470 57009076 49823805 43776970
55923 43776970 38650722 34298215 30584971 27383736 24611696 22221229 20154601 18344362
55915 18344362 16749873 15353860 14126894 13029394 12043323 11168477 10390878 9684695 9040849
55906 9040849 8464500 7947467 7470171 7027518 6626984 6264034 5923992 5605334 5317307
55897 5317307 5056748 4809817 4574551 4359883 4164088 3975323 3792431 3625129 3474241
55888 3474241 3330591 3192724 3067513 2953747 2842563 2733748 2635015 2545607 2456780 2368063
55878 2368063 2287344 2215130 2143944 2073096 2009244 1952318 1895348 1838292 1788092 1744783 1701140
55867 1701140 1656373 1616935 1583237 1548488 1511421 1477795 1448545 1418510 1387753 1362472 1343698
55856 1343698 1326291 1309999 1300564 1298702 1298263 1295944 1292744 1285554 1268004 1240751 1211131 1181891 1149921
55843 1149921 1116360 1087688 1065565 1045289 1025486 1009994 999053 987916 975494 965455 957423
55832 957423 945890 929284 911792 894931 875579 853520 832719 813808 793246 771114 751781
55821 751781 735666 718204 698193 679440 662948 645411 626811 611742 601508 592269 582583 575460
55809 575460 571477 567192 562149 560312 562753 565828 568350 573637 582514 591017 597060 602966 609371 612911
55795 612911 611979 608839 604257 595931 583912 571689 560195 546552 530250 514777 501579 488341
55783 488341 474697 463654 455667 447327 437806 430764 428018 427013 426343 427824 430931 430923 425021 415394 404106
55768 404106 390414 375085 361965 352737 344956 337367 332378 331286 331874 332589 334227 335685 333212 326049
55754 326049 317945 311000 302829 291931 280834 271513 262426 252584 244068 238070 232666 226840 222532 220527
55740 220527 218482 215105 212149 210344 207708 203905 201838 202709 203831 203577 204101 206882 209800 211112 212067
55725 212067 213058 211370 205552 198276 192238 186804 181048 176313 173311 170294 166522 163991 163513 162873 161102
55710 161102 160692 163066 165829 167251 169622 175174 182202 188302 194221 201407 208713 214478 219161 223247
55696 223247 225240 224341 222563 221908 222005 222536 224987 229773 234613 237978 241227 245205 247938 248065 247405 247663
55680 247663 247587 245942 244240 243984 244112 243689 244108 245976 246855 244909 242044 240671 240200 239516 240000 242930 246421
55663 246421 248186 249079 250954 253209 254339 254836 255677 256001 255109 254792 256877 260277 262998 265110 267197 267987
55647 267987 266262 263226 260299 256382 249954 242016 234321 226426 217183 207408 198463 189833 180712 172312
55633 172312 165989 160561 154098 146971 140688 135148 129458 124012 119366 114470 108400 102522 98648 96334
55619 96334 94130 92048 90609 88972 86312 83721 82486 81895 80808 79940 80339 81095 80852 80195 80268 80453 79757
55602 79757 79127 79986 81644 82518 82714 83143 83207 81760 79435 77832 77167 76609 75983 75347 74009 71849 70482
55585 70482 71224 73064 74368 75243 76327 76713 75259 72823 71082 70126 69128 68222 67874 67517 66679 66311 67193
55568 67193 68270 68409 68483 69828 71996 73992 76385 80103 84349 87741 90396 92946 94685 94588 93126 91280
55552 91280 89038 86540 85187 85715 86640 86511 86130 86609 87027 86288 85556 86345 87780 88292 88558 90078 92248
55535 92248 93658 95089 98327 102901 106825 109840 113259 117248 120811 123865 126917 129328 130322 130999 132937
55520 132937 135393 136215 134946 132739 129927 126070 121770 118068 114484 109901 104795 100441 96604 92258
55506 92258 87887 84718 82358 79547 76605 74705 73306 70819 67354 64398 62161 59661 56999 55184
55492 55184 53991 52280 50118 48322 46313 42830 38521 35502 34509 34620 35429 37180 38979 39263 38094
55477 38094 36959 36413 35803 35015 34481 33842 32555 31344 31093 30965 29852 28909 30166 33186 35674 36911
55461 36911 37859 38337 37105 34771 33670 34523 35700 36057 35992 35553 34095 32213 31508 31944 31752 30429 29551
55444 29551 30117 31300 32304 33328 34169 33993 33019 32525 32760 32694 32087 31832 31988 31590 30713 30604 31412 31881
55426 31881 31721 32128 33484 34668 35271 36359 38341 40040 40584 40416 39838 38450 36690 36058 37036 38345
55410 38345 38923 39033 38948 38298 37325 37127 37997 38980 39542 40181 41092 41781 42305 43217 44039 43576 41987 40726 40140
55391 40140 39106 37389 36246 36184 36199 35876 36143 37183 37690 37105 36631 36997 37135 36230 35253 35230 35528 35087 34023
55372 34023 32883 31583 30111 29112 28861 28693 28214 27895 27861 27342 26030 24723 24037 23723 23835 25154 27729
55355 27729 30341 32080 33198 33856 33496 32175 31102 31046 31463 31818 32419 33288 33636 33241 33001 33352 33511 32967
55337 32967 32337 31962 31164 29772 28978 29623 30884 31642 31988 32410 32653 32441 32278 32546 32695 32200 31477 31098
55319 31098 30956 30853 31017 31415 31474 31069 30827 30967 30885 30298 29711 29310 28677 28034 28404 29863 31040 31138 31106 31981
55299 31981 33318 34197 34638 35069 35341 35207 34938 34768 34515 34304 34680 35589 36266 36548 37104 37939 38057 37160 36276
55280 36276 36007 35608 34590 33777 33827 33992 33449 32682 32493 32688 32741 32845 33375 34115 34799 35533 36104 35884 34940
55261 34940 34166 33801 33105 32037 31753 32678 33593 33566 33308 33634 34074 34158 34612 35920 36965 36556 35230 34216
55243 34216 33578 32736 31840 31309 30856 30254 30231 31281 32367 32205 31217 30938 31962 33554 34845 35379 34973 33938
55225 33938 33021 32459 31714 30749 30556 31629 32953 33510 33841 34953 36606 37932 38997 40501 42368 43783
55209 43783 44288 44011 43309 42872 43422 44512 44471 42514 40081 39066 39504 40180 40736 41790 43395 44659 44846
55192 44846 43909 42139 40064 38477 37876 38022 38470 39125 39912 40473 40629 40596 40438 40008 39697 40219 41284 41613
55174 41613 40814 40091 40356 40828 40393 39224 38130 37248 36398 35806 35527 35009 34081 33528 33834 34204 33678 32328
55156 32328 30651 28830 27356 27163 28240 29226 29321 29364 30063 30596 30191 29713 30248 31304 31912 32359 33239 33872
55138 33872 33368 32399 32236 32757 33068 33343 34373 35853 36809 37317 38234 39562 40485 40718 40554 40042 39324 39249
55120 39249 40380 41957 43043 44009 45520 46848 46783 45645 44785 44570 44359 44038 44005 44065 43893 44219 45979 48565
55102 48565 50442 51208 51615 51889 51658 51278 51623 52594 53331 53802 54798 56453 58143 59685 61223 62130 61549
55085 61549 60020 59160 59685 60995 62570 64317 65654 65827 65275 65312 66226 66949 66710 65840 64864 64043 63882 64865
55067 64865 66470 67584 68004 68568 69749 71134 72227 72770 72383 71032 69718 69537 70123 70103 69014 67542
55051 67542 66063 64273 62277 60721 59708 58747 57914 57837 58404 58583 57744 56262 54807 53880 53949 55031 56237
55034 56237 56710 56799 57347 58202 58534 58270 57911 57356 56323 55626 56408 58258 59718 60526 61713 63455 64666
55017 64666 64913 64999 65237 64861 63691 62837 63015 63534 63647 63684 64146 64725 64936 64877 64773 64518 64039 63450 62699 61798
54997 61798 61315 61710 62312 62129 61510 61663 62579 62947 62316 61751 61946 62207 61859 61314 61141 61248 61583 62496 63913
54978 63913 65151 65977 66810 67574 67649 67315 67937 70062 72515 73959 74343 74257 74028 74011 74782 76415 78392 80538
54960 80538 83101 85738 87715 89404 92217 96593 101444 106110 111415 118150 125937 134376 143906 154688
54946 154688 166025 177856 191402 207061 222797 235898 245385 251531 254017 252029 245585 235548
54934 235548 222719 207909 192409 177412 163328 150342 139032 129675 121604 114123 107452 102025
54922 102025 97591 93884 91468 90861 91387 91928 92351 93213 94539 95944 97635 100232 103761 107758 112272
54907 112272 117909 124957 133276 142996 154548 167912 182359 197025 211242 224310 235329 243337
54895 243337 247396 246737 241139 231226 218254 203629 188510 173503 158711 144417 131634 121465
54883 121465 113898 107877 102629 98165 94412 90812 87213 84344 82769 81966 81016 79684 78319 77104 75990
54868 75990 74994 74069 72948 71468 69865 68501 67569 67157 67229 67447 67428 67238 67175 67080 66440 65210 63943 63068
54850 63068 62701 63075 64268 65535 65860 65301 64814 64650 64062 62881 62071 62139 62156 61175 59691 58869 59054 59776
54832 59776 60564 61078 61062 60820 61165 62340 63573 64211 64596 65280 66055 66454 66581 66815 67171 67512 67920 68437 68969
54813 68969 69797 71420 73517 74896 75066 75066 76086 78029 80174 82557 85831 90205 95203 100165 104553 108339
54797 108339 112504 118551 127055 137333 148832 161937 176838 192590 208080 223120 237710 250895
54785 250895 261185 267579 269529 266740 259839 250581 240387 229170 216407 202810 190001 179002
54773 179002 169923 162728 157355 153296 149884 146891 144338 142078 140157 139243 140089 142789 146903 151904 157133
54758 157133 161961 166550 172010 179447 189360 202118 218118 236999 257657 279545 302950 327404
54746 327404 350987 372090 390679 406610 417778 421436 416875 405574 389236 368889 345526 320368
54734 320368 294606 269645 247120 227764 210785 195262 181657 170917 162829 156374 151131 147012
54722 147012 143132 138448 133359 129308 126774 124796 122436 119645 116694 113822 111450 109893 108819 107766
54708 107766 106983 106913 107167 107001 106606 106879 108034 109368 110245 110395 109492 107564 105665 105006 105454 105899 105945 106066
54690 106066 106197 105567 104213 103420 104187 106196 108633 111057 113047 113934 113606 113033 113354 114712 116278 117265
54674 117265 117785 118814 121237 124692 127703 129317 130244 131923 134934 138931 143631 148955 154509 159799 164812
54659 164812 169650 173918 177311 180416 183974 187682 190869 194148 199133 206419 214947 223527 232005 240866
54645 240866 250769 262707 277556 295084 314183 334372 356168 379678 403582 425818 444580 458369
54633 458369 465852 466194 459204 445089 424640 399699 372690 345392 318644 293265 270409 250758
54621 250758 233941 219166 206015 194477 184668 176659 170225 164710 159547 154962 151714 150183 150041
54608 150041 150680 151506 152033 152271 152885 154408 156431 158016 158548 157727 155284 151614 148181 146187 145035 143146
54592 143146 140128 137013 134483 132172 129837 127916 126446 124505 121339 117347 113503 110328 107730 105294
54578 105294 102571 99544 96902 95309 94433 93313 91607 89832 88489 87680 87430 87594 87574 86969 86360 86521
54562 86521 87084 87067 86506 86329 86725 87017 87201 88104 89725 90901 91077 91079 91568 92106 92430 93360 95524 98248 100639
54543 100639 102887 105629 108882 112497 116893 122396 128503 134659 141212 148833 157497 166791 176711 187387
54529 187387 198421 209179 219350 228598 236081 240900 242707 241420 236881 229357 219888 209514 198523
54516 198523 186976 175479 164765 154912 145637 137098 129795 123894 119196 115585 112999 111092 109327
54503 109327 107362 105218 103239 101974 101706 101951 101853 101200 100527 100144 99730 99151 98906 99357 100141 100841 101641 102826
54485 102826 104192 105483 106963 108974 111374 113897 116608 119469 121892 123293 123815 124069 124438 125001 125722
54470 125722 126328 126308 125430 123931 122035 119810 117738 116734 117060 117817 118016 117678 117379 117286 117269 117419 117748 117786
54452 117786 117168 116298 115765 115403 114576 113172 111661 110315 109007 107654 106358 105109 103770 102298 100756
54437 100756 99244 98030 97403 97145 96577 95479 94563 94563 95217 95664 95515 95002 94381 93732 93189 92878 92705 92578
54419 92578 92657 93129 93929 94982 96395 98158 99989 101767 103634 105349 106150 105835 105445 106156 107867 109601
54403 109601 110972 112456 114442 116928 120087 124245 129086 133551 136865 139267 141496 143967 146610 149112
54389 149112 151044 151984 151813 150845 149491 147832 145607 142674 139431 136655 134779 133400 131722 129458 127058
54374 127058 125067 123580 122359 121155 119770 118016 115791 113096 110105 107379 105697 105228 105092 104329 103119
54359 103119 102378 102313 102224 101756 101334 101202 101006 100677 100706 101146 101378 101473 102678 105655 109179 111686 113381 115571
54341 115571 118457 120953 122579 124206 126725 129987 133384 136629 139535 141650 142621 142668 142373 142125 141858 141136
54325 141136 139479 136738 133212 129358 125507 121896 118719 115921 113108 109889 106234 102527 99413 97493
54311 97493 96735 96186 94744 92322 89773 87656 85746 83834 82179 80800 79106 76732 74147 72003 70529
54296 70529 69981 70802 72654 74062 73970 73086 72827 73407 73877 73675 73145 72697 72380 72229 72280 72224 71706 70920 70394
54277 70394 70345 70785 71979 74054 76300 77615 77669 77098 76620 76569 77186 78658 80771 82996 84986 86658 87911
54260 87911 88716 89360 90180 91141 92046 92979 94130 95365 96302 96591 95821 93578 90133 86703 84420 83303 82696
54243 82696 82313 82259 82427 82690 83322 84481 85516 85633 85085 84914 85618 86805 87971 88830 89021 88401 87603 87434
54225 87434 87693 87400 86287 85170 84723 84709 84669 84553 84327 83673 82550 81591 81486 82284 83491 84556 85086 84979
54207 84979 84558 84371 84744 85674 87015 88421 89228 88860 87390 85383 83310 81472 80289 80049 80389 80497 79875
54190 79875 78581 76894 75250 74309 74441 75115 75325 74661 73512 72325 71211 70253 69643 69444 69643 70406 71790
54173 71790 73303 74294 74758 75194 75740 76024 75885 75650 75646 75931 76512 77313 77919 77888 77334 76762 76371 76001 75647 75487
54153 75487 75472 75448 75567 76049 76644 76986 77319 78188 79459 80360 80462 79957 79031 77778 76694 76408 76752 76868 76372
54134 76372 75756 75522 75601 75743 75790 75481 74714 74032 74069 74463 74153 72896 71589 70882 70378 69577 68705 68138 67779
54115 67779 67517 67656 68333 69064 69270 68822 67814 66408 65144 64755 65312 66215 67280 69054 71582 73707 74247
54098 74247 73341 72005 70908 70151 69755 69674 69602 69319 69030 68998 69154 69368 69687 69986 69874 69339 69009 69253 69463
54079 69463 68771 67185 65556 64634 64543 64915 65220 65195 65138 65497 66065 66129 65616 65419 66221 67621 68903 70015 71178
54060 71178 72149 72581 72739 73114 73642 73985 74277 74900 75794 76648 77574 78842 80145 80903 81310 82267 84148 86355
54042 86355 88347 90427 93069 95922 98109 99450 100939 103778 108119 112955 117228 120818 124340 128235
54028 128235 132454 136884 141612 146680 151970 157533 163625 170252 176920 182953 187790 190999 192534 193209
54014 193209 194345 196508 198893 200341 200690 200770 201289 202093 202398 201418 198854 194973 190311 185370 180737 177223
53998 177223 175253 174055 172113 168717 164625 160946 157931 155224 152721 150554 148551 146361 144034 142038
53984 142038 140703 139958 139537 139213 138921 138772 138804 138684 137997 136858 135858 135287 134939 134807 135328 136548 137660
53967 137660 137973 137874 138235 139252 140413 141323 141918 142059 141581 140635 139558 138472 137430 136777 136863 137492 138109 138463
53949 138463 138743 139244 140308 142354 145396 148643 151191 153150 155588 159218 163665 168189 172685 177608 183127
53934 183127 188701 193482 196984 199268 200528 200596 199055 195841 191529 187005 183036 180116 178365 177451 176952
53919 176952 176986 178177 180827 184444 188331 192269 196334 200402 204277 208148 212544 217893 224246 231201 237937
53904 237937 243721 248646 253542 258832 263882 267852 270818 273445 275839 277353 277489 276451 274771 272792
53890 272792 270590 268012 264775 260747 256190 251511 246803 241839 236387 230345 223675 216496 209220 202455
53876 202455 196777 192535 189582 187078 183906 179557 174448 169364 164867 161286 158669 156473 153867 150774
53862 150774 148076 146325 144765 142257 138748 135090 131817 128904 126546 125216 124815 124484 123483 121805 119795
53847 119795 117649 115404 113053 110619 108367 106839 106266 106042 105367 104373 104043 104912 106423 107767 108791 109725
53831 109725 110400 110222 108838 106615 104471 103265 103229 103928 104824 105770 106762 107445 107302 106347 105248 104694 104856
53814 104856 105545 106536 107662 108822 110069 111559 113361 115412 117604 119762 121636 123159 124692 126719 129313
53799 129313 132140 135035 138288 142266 146923 151798 156372 160446 164303 168462 173086 177672 181521 184483
53785 184483 187006 189489 191850 193845 195553 197296 199156 200770 201677 201835 201687 201722 202015 202240 201972 200818
53769 200818 198436 194717 189958 184697 179382 174427 170352 167438 165291 163281 161410 160170 159475 158468
53755 158468 156720 154992 154263 154506 154950 155093 154845 154041 152603 151073 150320 150537 150983 150826 149981 149135 149120 150157
53737 150157 151502 151995 151180 149653 148132 146575 144551 142045 139368 136613 133840 131548 130246 129650 128937
53722 128937 127920 127309 127712 128894 130266 131703 133549 136016 138792 141212 142782 143619 144307 145258 146403
53707 146403 147629 149229 151593 154617 157728 160391 162422 164026 165792 168393 171995 176144 180432 184893
53693 184893 189491 193713 197159 200168 203218 206071 208157 209584 211062 212960 215123 217513 220300 223333
53679 223333 226173 228725 231249 233679 235535 236595 237154 237541 237884 238393 239270 240214 240605 240385 240240 240649 241233
53662 241233 241324 240843 240332 240282 240524 240207 238518 235706 233250 232476 233063 233380 232285 230101 227896 226426 225907
53645 225907 226138 226531 226450 225796 224984 224252 223391 222298 221340 220965 221290 222209 223523 224846 225773 226322 226846 227424
53627 227424 227781 227994 228740 230525 233042 235596 237806 239565 240733 241397 242202 243872 246356 248865 250885
53612 250885 252848 255507 258834 261908 264074 265915 268676 272819 277676 282646 288065 294419 301194 307251
53598 307251 312182 316686 321584 327020 332687 338331 343851 349230 354513 359642 364347 368480 372419 376829
53584 376829 381991 387546 392784 397036 400091 402547 405433 409077 412648 415264 417154 419118 421262 423071
53570 423071 424420 425547 426190 425867 425092 425240 426833 428895 430348 431197 431888 432366 432437 432398 432561 432631 432219 431586
53552 431586 431241 431071 430515 429438 428286 427483 427175 427521 428687 430385 431803 432267 431865 431319 431201 431408 431472
53535 431472 431302 431387 432236 433909 436265 439302 442855 446274 448992 451318 454150 457907 462265 466985 472436
53520 472436 479081 486839 495195 503785 512752 522678 534115 547029 560801 574948 589571 604902 620759
53507 620759 636846 653335 670620 688823 708061 728880 751719 776074 800795 825153 849224
53496 849224 873573 899063 926527 955842 985700 1015097 1044646 1075522 1107561 1139506 1170762
53485 1170762 1201579 1231756 1260714 1288944 1317869 1347930 1378157 1407899 1437609 1467447 1496558
53474 1496558 1524454 1551842 1579311 1606286 1632047 1656763 1680788 1703848 1725707 1746703 1766911
53463 1766911 1785643 1802440 1817687 1831648 1843973 1854823 1865242 1875473 1884035 1889486 1891979 1891969
53451 1891969 1888584 1880869 1869747 1857109 1843508 1828242 1811227 1793153 1773984 1752815 1729242 1703686
53439 1703686 1676401 1647370 1617187 1586942 1557092 1527309 1497366 1467272 1436724 1405539 1374563
53428 1374563 1345100 1317416 1290874 1265545 1242491 1222153 1203529 1185460 1168025 1152197 1138687
53417 1138687 1127475 1118079 1110037 1103439 1098986 1097238 1097947 1100404 1104167 1109023 1114794 1121898 1131627 1144921
53403 1144921 1161144 1178988 1198341 1220147 1244596 1270636 1297422 1325123 1354050 1384037 1415100
53392 1415100 1447871 1482930 1520376 1560370 1603413 1649703 1698752 1750013 1803438 1859242 1917556
53381 1917556 1978412 2041619 2106540 2172581 2239880 2308957 2379588 2450684 2521349 2591487 2661301
53370 2661301 2730847 2800071 2868509 2934847 2997513 3055854 3110046 3159870 3204533 3243946 3279134
53359 3279134 3310921 3339078 3363256 3383857 3401243 3414704 3422967 3425291 3421549 3411731 3396088 3375377
53347 3375377 3350197 3320109 3283826 3240223 3188953 3130510 3066248 2998192 2928435 2858536 2789479
53336 2789479 2721769 2655408 2590015 2525282 2461150 2397631 2334860 2273406 2214010 2156741 2100875
53325 2100875 2045823 1991722 1938957 1887651 1838048 1790826 1746581 1705400 1667381 1633084 1602870
53314 1602870 1576058 1551270 1527437 1504046 1480752 1457466 1434735 1413456 1394121 1376708 1361318
53303 1361318 1348406 1338233 1330407 1324158 1318970 1314855 1312074 1310615 1309919 1309263 1308536 1308490 1310051 1313485 1318389
53288 1318389 1324426 1331873 1341433 1353633 1368420 1385308 1403965 1424685 1448173 1474839 1504332 1535760
53276 1535760 1568210 1601039 1633861 1666431 1698555 1730119 1761182 1791871 1821961 1850686 1877191
53265 1877191 1901221 1923141 1943338 1961776 1978187 1992470 2004935 2016213 2026716 2035873 2042128 2044142
53253 2044142 2041986 2036760 2029077 2018461 2004275 1986643 1966187 1943305 1918050 1890405 1860375 1828051
53241 1828051 1793853 1758478 1722345 1685369 1647612 1609955 1573654 1539207 1506007 1473218 1440747
53230 1440747 1409150 1378737 1349099 1319660 1290499 1262258 1235251 1209028 1182994 1157093 1131581
53219 1131581 1106439 1081495 1056988 1033580 1011811 991884 973871 957662 942667 928056 913399
53208 913399 898771 884156 869140 853289 836505 818972 801057 783299 766073 749187 732192
53197 732192 715202 698978 684060 670173 656693 643360 630324 617732 605500 593264 580423
53186 580423 566482 551547 536273 521172 506203 491146 476132 461570 447666 434239 421041
53175 421041 408215 396461 386541 378491 371427 364295 356680 348665 340297 331651 323264 315904 309854 304811
53161 304811 300464 296696 293279 289862 286274 282447 278074 272945 267606 263046 259574 256578 253542 250672
53147 250672 248277 246103 243640 240667 237241 233605 230277 227734 225797 223810 221666 220094 219639 219933 220302
53132 220302 220498 220394 219563 217860 216032 215138 215463 216379 217066 217027 216310 215658 216097 217879 220089 221731 222919
53115 222919 224504 226837 229498 232085 234608 237065 239180 240706 241662 242096 241864 240768 238814 236289 233565
53100 233565 230672 227148 222650 217768 213722 210982 208696 205872 202651 199762 197108 193717 189155 184274
53086 184274 180275 177517 175528 173863 172509 171552 170769 169751 168390 167052 166157 165636 165011 163979 162704
53071 162704 161535 160666 160140 159909 159844 159947 160549 161925 163585 164470 164103 163140 162410 161790 160531 158519 156672
53054 156672 155963 156344 156791 156332 154989 153700 153244 153376 153180 152145 150508 148673 146833 145279 144497 144604
53038 144604 145077 145282 144952 144000 142366 140398 138893 138338 138450 138748 139124 139437 139096 137657 135514 133401 131480
53021 131480 129529 127769 126771 126600 126639 126338 125673 124893 124260 124055 124382 124939 125339 125611 126003 126404 126477 126396 126889
53002 126889 128314 130071 131193 131256 130581 129778 129284 129197 129368 129666 130212 131260 132877 134787 136555 137877 138715
52985 138715 139218 139488 139482 139212 138952 139019 139361 139729 140227 141338 143214 145408 147530 149752 152313 154890 157010
52968 157010 158852 161144 164285 167935 171482 174604 177353 179970 182683 185538 188373 190921 192878 194013
52954 194013 194440 194755 195475 196315 196384 195228 193222 190884 188327 185620 183041 180662 178270 176081 174885 174924
52938 174924 175187 174520 172957 171291 169782 168186 166682 165801 165499 165182 164696 164514 164862 165389 165873 166563 167612
52921 167612 168693 169423 169742 169736 169512 169404 169920 171298 173320 175542 177350 177998 177142 175445 174093 173638 173714
52904 173714 173896 174240 174866 175604 176331 177156 177955 178224 177774 177269 177577 178782 180177 181170 181822 182486 183240 183894
52886 183894 184430 185122 186045 186655 186289 185138 184276 184518 185589 186768 187917 189395 191231 192978 194350 195468
52870 195468 196464 197228 197600 197515 197017 196396 196187 196642 197391 197953 198387 199017 199759 200317 200893 202012 203680 205312
52852 205312 206566 207700 209034 210618 212528 214891 217493 219925 222291 225260 229148 233408 237232 240309
52838 240309 242793 244913 246739 248037 248278 247186 245287 243457 241897 240055 237602 234858 232126 229274
52824 229274 226291 223570 221269 218925 216138 213175 210387 207475 203852 199555 195267 191649 188935 186980
52810 186980 185374 183662 181799 180193 179088 178136 176908 175535 174468 173788 173069 171856 170030 167858 165951
52795 165951 164885 164533 163917 162139 159420 156875 155322 154644 154235 153659 152691 151141 149009 146774 145229 144829
52779 144829 145250 145658 145463 144728 143891 143233 142689 141999 140901 139313 137497 135907 134638 133203 131150 128814
52763 128814 127071 126323 126073 125598 124721 123757 122892 121845 120145 117757 115383 114003 113943 114597 115175 115397 115214
52746 115214 114298 112392 109967 107871 106320 104804 102951 100962 99164 97733 96906 96823 97031 96755 95901 95173
52730 95173 94973 94814 94241 93728 94126 95567 97388 98836 99438 98994 97699 96178 95021 94355 93984 93687 93134
52713 93134 91888 89904 87846 86567 86383 87071 88333 89925 91526 92864 93930 94855 95667 96394 97275 98613
52697 98613 100511 102906 105731 108818 111785 114264 116177 117651 118794 119701 120548 121442 122200 122458 122021 121049
52681 121049 119908 118850 117764 116302 114348 112300 110687 109581 108569 107258 105588 103738 102007 100693
52667 100693 99786 98863 97611 96255 95041 93530 91125 88206 85989 85029 84622 83876 82774 81806 81263 81283
52651 81283 82035 83343 84587 85467 86446 87978 89679 90771 91015 90724 90167 89452 88733 88071 87363 86792 87081
52634 87081 88797 91670 95033 98630 102458 106065 108718 110222 111001 111325 110909 109358 106673 103253 99695
52619 99695 96572 94184 92487 91380 90906 91035 91450 91755 91760 91382 90553 89460 88620 88408 88733 89344 90155 91003
52601 91003 91500 91522 91523 91978 92802 93696 94729 96050 97343 98138 98494 98867 99451 100074 100536 100588 99826 98235 96740
52582 96740 96623 98360 101358 104663 107521 109516 110785 111975 113473 114786 115263 115199 115566 116778 118506 120610
52566 120610 123323 126394 128946 130580 131948 133844 136258 138719 140987 142959 144356 145000 145161 145251 145450
52551 145450 145863 146645 147623 148111 147575 146319 145234 144952 145484 146361 146915 146756 146332 146695 148263 150117 151042
52534 151042 151050 151199 152051 153081 153761 154386 155329 156165 156304 156124 156612 157935 159168 159558 159266 158566 157155 154910
52516 154910 152664 151293 150395 148869 146755 145481 146079 148009 150105 151866 153288 154146 154197 153718 153222 152819
52500 152819 152339 151822 151474 151331 151376 151701 152187 152379 152098 151862 152216 152982 153688 154347 155201 156030 156495 156914 157908
52481 157908 159343 160454 160993 161410 161840 161775 161001 160092 159647 159706 160262 161673 164015 166489 168052 168394 167930
52464 167930 167151 166427 166178 166716 167854 169012 169768 170208 170730 171590 172633 173475 173983 174448 175137 175843 176201 176348
52446 176348 176878 178128 179853 181638 183223 184328 184605 183980 182856 181758 180923 180261 179533 178563 177397 176186
52430 176186 174751 172585 169706 167232 166411 167076 167741 167313 166043 164583 162960 160990 159084 157937 157615
52415 157615 157511 157096 156354 155599 155175 155216 155469 155477 155163 155002 155438 156380 157537 158946 160795 162920 164894 166505
52397 166505 167769 168602 168829 168563 168238 168206 168513 169137 170178 171673 173311 174521 174982 175063 175610 177124 179201
52380 179201 180985 182148 183189 184802 187287 190515 194055 197213 199420 200882 202467 204631 206809 208287
52366 208287 209321 210822 213085 215466 217410 219231 221579 224476 227234 229180 230241 230915 231920 233813
52352 233813 236685 240037 243115 245534 247602 249860 252367 254727 256885 259473 263009 266961 270177 272235
52338 272235 273904 276125 278972 281778 283929 285231 285866 286399 287581 289683 292070 293777 294524 294910 295639
52323 295639 296870 298398 300141 302264 304955 308265 312114 316323 320610 324685 328459 332203 336436 341584
52309 341584 347774 354938 362965 371638 380555 389411 398417 408228 419338 431655 444672 457946 471380
52296 471380 485261 500108 516352 533975 552536 571581 590999 610948 631518 652513 673497
52285 673497 694047 713998 733467 752660 771737 790794 809710 827873 844430 859142 872695
52274 872695 885709 897678 907500 915034 921417 927638 933444 938029 941236 943488 944870 944928 943373 940536
52260 940536 937043 933296 929284 924706 919276 913102 906762 900923 895906 891708 888306 885740 883948 882749
52246 882749 882097 882339 884121 887898 893424 899860 906619 914087 923218 934393 946960 959938 972868 985876
52232 985876 999340 1013645 1028946 1044807 1060302 1074660 1087624 1099099 1108892 1117067 1124064 1130049
52220 1130049 1134545 1137289 1139011 1140613 1141749 1141116 1138176 1133698 1128319 1121485 1112436 1101615 1090281 1079014
52206 1079014 1067331 1054695 1041178 1027067 1012517 997902 983993 971326 959638 948344 937409
52195 937409 927360 918493 910501 902986 896027 890095 885568 882470 880526 879290 878277 877099 875565 873703
52181 873703 871729 869922 868398 867027 865700 864556 863737 863052 862240 861468 861102 860885 859948 857888 855360 853152
52165 853152 851119 848645 845861 843705 842778 842651 842298 840820 837742 833179 827835 822510 817490 812674 808195
52150 808195 804411 801296 798334 795183 791965 788745 785239 781365 777659 774696 772345 769937 766987 763453
52136 763453 759381 754734 749635 744569 740130 736519 733291 729708 725416 720681 715934 711302 706762 702428
52122 702428 698323 694155 689835 686036 683565 682243 681032 679424 678033 677639 678321 679857 682309 685670 689467
52107 689467 693332 697723 703526 711056 719862 729409 739574 750628 763063 777373 793717 811840 831464
52094 831464 852516 874811 897842 921311 945638 971427 998408 1025310 1050935 1075132 1098619
52083 1098619 1122025 1145211 1167440 1188035 1206751 1223582 1238447 1251251 1262069 1270941 1277644 1281958
52071 1281958 1284104 1284537 1283408 1280650 1276470 1271227 1264830 1256864 1247373 1236913 1225767 1213858 1201574
52058 1201574 1189771 1178638 1167433 1155932 1145272 1136627 1129719 1123493 1117674 1112740 1108815 1105662 1103537
52045 1103537 1103044 1104204 1106566 1110145 1115331 1121829 1128669 1135499 1143011 1151772 1161371 1171119 1180881 1190717
52031 1190717 1200262 1209064 1217231 1225197 1232931 1239741 1244864 1248139 1250211 1252097 1254305 1256285 1256978 1255925
52017 1255925 1253500 1250036 1245237 1238766 1230961 1222449 1213266 1202801 1190667 1177150 1162704 1147350 1130835
52004 1130835 1113161 1094605 1075227 1054710 1032846 1009874 986063 961188 934907 907562 880154
51993 880154 853396 827249 801524 776388 751913 727597 702941 678300 654636 632518 611799
51982 611799 592131 573298 554911 536306 517087 497719 479354 462962 448508 435083 421925
51971 421925 409247 397683 387070 376410 365311 354797 346133 339317 333308 327434 321810 316595 311633
51958 311633 306946 302930 299824 297343 294977 292347 289259 285730 282031 278443 275000 271710 268897 266903
51944 266903 265516 264072 262155 259896 257643 255644 253920 252162 249872 246989 244183 242069 240336 238153
51930 238153 235313 232336 229568 226838 224091 221672 219802 218282 216915 215753 214817 214026 213538 213630 214138 214514
51914 214514 214564 214512 214231 213102 210981 208707 207179 206347 205513 204212 202400 200205 197956 196137 194831 193505
51898 193505 191800 190258 189705 190058 190326 189813 188814 187946 187223 186111 184331 182309 180738 179812 179045 177886
51882 177886 176319 174738 173396 172246 171240 170503 170114 170029 170294 171102 172475 174042 175232 175645 175292 174654
51866 174654 174454 175119 176418 177779 178913 179991 181320 183086 185286 187569 189295 190179 190821 192134 194187
51851 194187 196148 197410 198313 199496 201002 202295 202919 202855 202470 202264 202493 202916 203033 202582 201608 200213 198580
51834 198580 197169 196388 196089 195874 195903 196721 198177 199241 199272 198943 199428 201089 203383 205675 207666 209260 210440
51817 210440 211239 211605 211489 211124 210906 210850 210588 210115 210023 210653 211469 211727 211382 210898 210447 209902 209383 209271 209742
51798 209742 210690 211984 213411 214492 214765 214259 213384 212449 211650 211398 212133 213718 215403 216651 217736 219333
51782 219333 221608 223927 225507 226250 226776 227624 228662 229436 229852 230166 230450 230561 230636 231125 232260 233906 235998
51765 235998 238582 241354 243750 245775 248202 251643 255909 260596 265732 271460 277644 284260 291697 300096
51751 300096 308834 317207 325172 332772 339259 343554 345327 344949 342682 338739 333941 329364 325272 321073
51737 321073 316417 311704 307510 304260 302457 302402 303390 303973 303453 302576 302429 303208 304460 305972 307782 309633
51721 309633 311005 311653 311741 311492 311016 310481 310269 310912 312756 315460 317770 318187 316191 312624 308707 304902
51705 304902 301014 297077 293587 290817 288361 285615 282427 278993 275265 270871 265798 260859 257175 255235
51691 255235 254650 254785 255330 256259 257595 259456 262054 265388 269195 273520 279125 286852 296471 306395 314617
51676 314617 319789 321604 320650 318134 315457 313592 312638 311937 310693 308649 306304 304400 303128 301960 300318
51661 300318 298250 296266 294774 293921 293794 294333 295034 295069 293842 291270 287501 282609 276653 269851 262605 255380
51645 255380 248492 241911 235411 229105 223713 219974 217794 216273 214578 212482 210054 207298 204382 201916
51631 201916 200586 200490 201044 201540 201651 201415 200945 200244 199221 197786 196024 194302 193091 192525 192227 191777 191332
51614 191332 191416 192015 192282 191560 190354 189778 190191 190976 191586 192088 192534 192621 192441 192923 194860 197869 200913 203575
51596 203575 206163 208814 211246 213384 215611 218281 221501 225439 230311 235939 241761 247459 253123 258663
51582 258663 263590 267661 271249 274698 277664 279506 280065 279619 278314 276180 273650 271461 269878 268476 266913
51567 266913 265578 265087 265386 265903 266517 267853 270359 273492 276217 278166 279964 282500 286116 290438 294671
51552 294671 298188 301181 304617 309103 313810 317096 318299 318402 318757 319702 320685 321132 320668 319027 316495 314215
51536 314215 313418 314300 315994 317583 318784 319812 320946 322205 323181 323367 322837 322316 322199 321862 320468 318158
51520 318158 315833 313897 311931 309581 307031 304439 301486 297828 293608 289254 285094 281331 278195 275913
51506 275913 274614 274215 274189 273629 271949 269533 267369 266031 265315 264733 263938 262717 261079 259447 258336 257774
51490 257774 257463 257501 258407 260294 262513 264375 265854 267340 269062 270987 272986 274887 276632 278504 280939
51475 280939 284055 287673 291797 296564 301657 306356 310486 314842 320278 326726 333423 339761 345525 350634
51461 350634 355151 359363 363491 367373 370675 373202 374786 375176 374446 373370 372911 373375 374343 375372 376415
51446 376415 377563 378669 379354 379228 378063 375907 373031 369695 365932 361564 356381 350343 343779 337343 331497
51431 331497 325934 319832 312925 306089 300540 296569 293389 290183 286941 284195 282216 280735 279341 277885
51417 277885 276448 275153 274245 274261 275735 278551 281857 284885 287696 290845 294452 297978 300880 303131 305045
51402 305045 306802 308198 308619 307351 304134 299399 293717 287242 280050 272730 265932 259393 252206 244254
51388 244254 236641 230327 225031 219963 215068 210874 207503 204501 201533 198689 196157 193995 192137 190290
51374 190290 188001 185214 182643 181209 181243 182469 184433 186438 187340 186192 183136 179165 174976 170611 166172
51359 166172 162142 158751 155691 152881 150953 150403 150629 150439 149375 147994 146956 146451 146592 147704 149781
51344 149781 152064 153688 154644 155699 157336 159132 160292 160524 160233 160109 160748 162528 165465 169102 172699
51329 172699 175743 178330 181027 184383 188517 193103 197719 202155 206424 210529 214331 217560 219803 220589
51315 220589 219795 217946 215822 213617 210806 207020 202682 198483 194523 190351 185679 180683 175696 170989
51301 170989 166762 163060 159728 156704 154202 152290 150582 148698 146824 145262 143698 141576 139162 137478
51287 137478 137026 137272 137547 137789 138052 137982 137354 136705 136799 137660 138606 139123 139326 139600 140141 140873 141580 142097 142446
51268 142446 142768 143120 143442 143751 144166 144700 145168 145363 145163 144540 143679 142988 142655 142298 141467 140405 139789 139692 139404
51249 139404 138437 137131 136069 135406 135042 134917 134830 134462 133889 133551 133412 132728 131152 129490 128800 129121 129666 129893
51231 129893 129784 129469 129261 129830 131542 133698 135120 135520 135703 136372 137334 138084 138589 139201 140095 141110 142019
51214 142019 142761 143446 144180 144905 145491 146020 146742 147606 148081 147763 147047 146925 148136 150605 153563 156037 157460
51197 157460 158018 158333 158687 158790 158433 158014 158083 158640 159198 159411 159356 159358 159751 160587 161425 161724 161653 162080 163384 164769
51177 164769 165254 164926 164538 164184 163230 161545 160083 159908 161023 162311 162401 160625 157456 154090 151433 149522
51161 149522 147934 146397 144782 142972 141206 140192 140291 140852 140934 140437 139909 139505 138906 138147 137672 137545 137367
51144 137367 137115 137279 138005 138812 139480 140501 142274 144454 146555 148679 151076 153333 154563 154310 152873 150855
51128 150855 148731 146802 145218 143899 142537 140795 138608 136342 134547 133419 132653 131915 131266 130902 130748
51113 130748 130631 130683 131131 131875 132705 133761 135220 136650 137326 137205 137000 137199 137631 138105 138815 139841 140827 141533
51095 141533 142270 143444 145029 146770 148557 150315 151891 153325 154918 156768 158528 159866 160840 161558 161845
51080 161845 161560 160966 160456 160091 159702 159226 158690 158085 157545 157482 158227 159652 161335 162976 164481 165825 167082
51063 167082 168497 170312 172565 175096 177629 179782 181184 181768 181872 181976 182413 183274 184432 185748 187400
51048 187400 189811 192929 195773 197277 197508 197480 197749 197880 197483 196974 196909 197175 197423 197865 199046 201053 203393
51031 203393 205451 206728 206926 206254 205442 205084 205136 205338 205765 206558 207363 207593 207062 205967 204396 202347 200075
51014 200075 197957 196116 194578 193692 193864 194926 196271 197608 199152 201049 203105 205115 207083 208998 210846
50999 210846 212934 215709 219064 222270 224939 227709 231587 236788 242609 248380 254141 260327 267104 274246
50985 274246 281607 289534 298697 309537 321885 335062 348356 361524 375052 389965 407198 427004
50973 427004 448983 472787 498741 527747 560684 597999 639717 685655 735606 789461 847208
50962 847208 908787 973952 1042323 1113528 1187178 1262597 1338524 1413132 1484463 1550996 1611790
50951 1611790 1666081 1712897 1751214 1780458 1800717 1812609 1817082 1815128 1807386 1794089 1775756 1753923
50939 1753923 1730793 1708142 1686828 1667334 1650144 1635317 1622047 1609036 1595121 1579420 1561201
50928 1561201 1539984 1515544 1487525 1455212 1417962 1375786 1329318 1279379 1226798 1172470 1117213
50917 1117213 1061625 1006205 951630 898743 848374 801251 757979 718969 684449 654476 628610
50906 628610 605677 584391 564499 546894 532366 520674 511151 503588 497888 493269 488689 484006 480031
50893 480031 477399 476000 475550 476033 477311 478825 480053 480959 481784 482739 484059 485991 488412 490796 492956
50878 492956 495599 499713 505481 512155 519037 526211 534189 543128 552704 562714 573493 585589 599215
50865 599215 614302 631015 649839 671018 694243 719262 746667 777705 813355 853890 899414
50854 899414 950451 1007892 1072615 1145380 1226901 1317791 1418526 1529635 1651769 1785144 1928814
50843 1928814 2080796 2239231 2403334 2572861 2746426 2920443 3089789 3249395 3395142
50834 3395142 3523606 3631515 3715906 3774916 3808444 3818153 3806731 3777011 3731732 3674143 3608545
50823 3608545 3539864 3472575 3410184 3355487 3310627 3276463 3252111 3235351 3223296 3212452 3198574
50812 3198574 3177255 3145102 3100367 3042527 2971432 2886929 2789173 2679233 2559326 2432390 2301392
50801 2301392 2169100 2038323 1911943 1792415 1681318 1579515 1487588 1405970 1334795 1273827
50791 1273827 1222547 1180311 1146617 1121286 1104241 1095038 1092903 1097256 1107789 1123720 1143306 1164576
50779 1164576 1186405 1208471 1230219 1250248 1266720 1278160 1284003 1284784 1281797 1276155 1267987 1256802
50767 1256802 1242669 1226676 1210069 1193140 1175232 1155673 1134535 1112600 1090915 1070376 1051527
50756 1051527 1034540 1019401 1006222 995312 986831 980399 975260 970930 967535 965449 964847 965847 968829
50743 968829 974286 982500 993723 1008534 1027614 1051263 1079656 1113527 1153923 1201237 1255126 1315674
50731 1315674 1383943 1460980 1546808 1640783 1742310 1850472 1963292 2077984 2191787 2302106
50721 2302106 2406245 2501727 2586747 2659759 2718740 2761444 2786265 2792324 2779021 2746501 2696928
50710 2696928 2634703 2564997 2492267 2420081 2351603 2289622 2236125 2191971 2156950 2130197 2110676
50699 2110676 2097242 2088130 2080733 2072245 2060335 2042765 2016743 1979667 1930787 1871692 1804960 1732792
50687 1732792 1657076 1580018 1504041 1431166 1362858 1300349 1244794 1197036 1157274 1124996 1099387
50676 1099387 1080088 1067495 1062228 1064438 1074002 1091124 1116234 1149293 1189852 1237842 1293689 1357240
50664 1357240 1426939 1500290 1574821 1648404 1719173 1785602 1846518 1900824 1947520 1986292 2017826
50653 2017826 2043168 2062896 2077133 2086143 2090488 2090539 2086124 2076838 2062722 2044617 2023798 2001244 1977492
50640 1977492 1953398 1930712 1911399 1896479 1886024 1880217 1879738 1884937 1895264 1909780 1927562 1947180
50628 1947180 1966476 1983655 1998347 2011010 2021526 2029079 2033323 2034910 2034751 2033250 2030588 2027475 2025435
50615 2025435 2026472 2032395 2044121 2061489 2083865 2110809 2141843 2175621 2209712 2241418 2268653 2290079
50603 2290079 2304810 2312267 2312165 2304354 2288698 2265056 2233161 2192388 2142060 2082408 2015161 1942766
50591 1942766 1866990 1788606 1708515 1628576 1550867 1476386 1405032 1336792 1272373 1212537 1157425
50580 1157425 1106910 1061144 1020330 984262 952538 925003 901466 881226 863562 848620 837132
50569 837132 829181 823967 820992 820723 823655 829332 836989 846717 859256 874880 893227 914221 938376
50556 938376 965980 996600 1029848 1066240 1106864 1152407 1202958 1258574 1319458 1385335 1455052
50545 1455052 1527126 1600586 1674932 1749276 1821781 1890067 1952107 2006778 2053892 2093944 2127832
50534 2127832 2156644 2181597 2203937 2224618 2244125 2262959 2282311 2303752 2327981 2354394 2382412
50523 2382412 2413007 2448322 2489890 2537773 2591284 2649771 2712428 2777926 2844700 2911305 2976162
50512 2976162 3037146 3091703 3137338 3171864 3193463 3200842 3193458 3171579 3136160 3088521 3029863 2961201
50500 2961201 2884076 2801327 2716739 2633883 2555637 2484772 2424223 2376326 2342125 2321815 2315425
50489 2315425 2322467 2341077 2368173 2400647 2436131 2472498 2506898 2535546 2554379 2559869 2549397 2521300
50477 2521300 2475039 2411453 2332576 2240941 2139193 2030587 1919346 1809728 1704491 1604627
50467 1604627 1510570 1423054 1342680 1269395 1202898 1143091 1089699 1041906 999032 961323 929431
50456 929431 903213 881635 863858 849775 839312 831835 826706 824101 824648 828247 833787 840389 848652
50443 848652 860149 875609 894059 913973 934782 956797 980047 1003985 1028297 1053352 1079623
50432 1079623 1107245 1136344 1167230 1199938 1233925 1268481 1303066 1337114 1370089 1402068 1433768
50421 1433768 1465621 1497236 1528068 1558017 1586898 1613927 1638559 1661523 1684336 1707970 1732532
50410 1732532 1758050 1784922 1813671 1844759 1878438 1914151 1950260 1985022 2017800 2048708 2077295
50399 2077295 2102396 2123301 2140143 2152822 2160310 2161420 2155648 2142801 2122354 2093750 2057018 2012583
50387 2012583 1960625 1901119 1834501 1762111 1686069 1608951 1533345 1461309 1394090 1332549 1277812
50376 1277812 1231396 1194590 1167768 1150359 1141444 1140295 1146247 1158279 1175049 1195338 1217930 1240730
50364 1240730 1260481 1273984 1279670 1277673 1268565 1252481 1229451 1200045 1165530 1127673 1088286 1048573
50352 1048573 1008876 969361 930896 894743 861356 830115 800439 772673 747646 725805 707101
50341 707101 691256 677769 665931 655335 646253 639229 634392 631357 629614 628790 628754 629799 632633 637887
50327 637887 645560 655055 665723 677306 689968 703947 719146 735066 751329 768193 786237 805511
50315 805511 825389 845412 865846 887120 909127 931517 954438 978443 1003674 1029460 1054782
50304 1054782 1078900 1101572 1122862 1142759 1160896 1176734 1190143 1201542 1211146 1218301 1222025 1222199
50292 1222199 1219763 1215678 1210107 1202811 1193948 1183967 1172827 1159701 1143637 1124380 1102446 1078479
50280 1078479 1052725 1025276 996700 968194 940890 915088 890382 866499 843801 822818 803410
50269 803410 784646 765617 746347 727862 711320 697068 684532 673077 662873 654851 649751 647337
50257 647337 646615 646794 647832 649984 653006 656061 658428 660050 661406 663068 665499 668884 672754 675974 677601
50242 677601 677790 677493 677140 676050 673371 669338 665234 662197 660266 658493 655799 651772 646809 641523 636055
50227 636055 630142 623858 617875 612763 608385 604405 601114 599176 598649 598864 599354 600364 602278 605109 608823
50212 608823 613585 619170 624600 629045 632874 637175 642293 647515 652109 655941 658878 660374 660216 659129
50198 659129 658032 656908 654940 651561 646876 641211 634870 628343 622220 616686 611407 605996 600267 594120
50184 594120 587668 581536 576448 572282 567978 562740 556867 551048 545285 539163 532915 527479 523339 519920
50170 519920 516423 512878 510088 508707 508702 509605 510999 512688 514547 516339 517612 517737 516158 512777 508103
50155 508103 502885 497475 491681 485286 478558 472110 466450 461853 458460 456099 454141 451999 449791 448048
50141 448048 446772 445288 443250 441238 440047 439840 440336 441394 442887 444349 445372 446249 447731 450210 453569
50126 453569 457719 462695 468195 473521 478201 482402 486691 491672 497831 505235 513197 520588 526778 532082
50112 532082 537160 542183 546798 550740 554107 557007 559168 560161 560043 559554 559422 559560 559290 558391 557508 557329
50096 557329 557732 558144 558468 559228 560884 563422 566640 570521 575261 581095 588037 595668 603367 610931 618731
50081 618731 627102 635905 645041 654970 666121 678073 689963 701599 713539 726141 739224 752737
50069 752737 767035 782273 798065 813946 829702 845059 859576 873181 886480 900311 915231
50058 915231 931429 948741 966710 985102 1004489 1025809 1049303 1074507 1101411 1130903 1163774
50047 1163774 1200060 1239788 1283679 1332503 1386286 1444775 1508029 1575707 1646019 1716117 1783323
50036 1783323 1845318 1899536 1943433 1975638 1996336 2006624 2008300 2004326 1998563 1994242 1992854 1994546
50024 1994546 1998895 2004630 2008882 2007505 1996535 1973396 1936963 1887081 1824532 1751515 1671787 1589812
50012 1589812 1509428 1433162 1362483 1298228 1240593 1189129 1143285 1102914 1067930 1037546 1010300
50001 1010300 985041 961593 940311 921202 903737 887288 871412 855776 840199 824914 810463
49990 810463 797013 783895 770204 755825 741489 727714 714175 700463 687067 675015 664641
49979 664641 655308 646432 638264 631403 625879 621057 616295 611541 607373 604522 603222 603032 603477 604702 607120
49964 607120 610457 613689 616087 617917 619809 621856 623607 624717 625390 626429 628929 633469 639309 644810
49950 644810 649001 652414 656153 660660 665865 671997 679537 688582 698955 710873 724871 741100 759252
49937 759252 779286 801718 827098 855657 887633 923643 964659 1011957 1067142 1131784 1206743
49926 1206743 1291923 1386690 1490189 1601077 1717075 1834858 1950347 2059342 2158521 2246244
49916 2246244 2322517 2388307 2445138 2495220 2541371 2586293 2631702 2677909 2723790 2766806 2803147
49905 2803147 2828217 2837587 2828028 2798150 2748249 2679740 2594951 2497375 2391450 2281388 2170023
49894 2170023 2058918 1949266 1842250 1738654 1638687 1542467 1450446 1363324 1281828 1206609
49884 1206609 1138044 1075977 1019896 969429 924486 884741 849305 817152 787779 761295 737881
49873 737881 717293 698852 681907 666270 652079 639071 626218 612418 597650 583118 570124
49862 570124 558923 548836 539221 530021 521428 513362 505591 498276 492106 487630 484592 482141 479722 477449
49848 477449 475592 474010 472284 470136 467472 464271 460779 457617 455378 454150 453660 453688 454046 454334 454163 453628
49832 453628 453227 453355 454169 455760 457999 460280 462040 463667 466350 470731 476168 481659 487201 493831 502499
49817 502499 513224 525324 538277 552393 568809 588758 612763 640602 672057 707494 747738
49806 747738 793690 846153 905693 972325 1045475 1124395 1208302 1295633 1383142 1466069 1539523
49795 1539523 1600035 1646348 1679306 1701203 1715004 1723815 1730682 1738329 1748583 1761848 1777095 1792153
49783 1792153 1803865 1808166 1800632 1777512 1736672 1677984 1603322 1516355 1421934 1325028 1229702 1138780
49771 1138780 1054055 976542 906582 844095 788895 740714 698971 662821 631599 604995 582591
49760 582591 563511 546811 532054 519160 507908 498006 489535 482727 477201 472010 466636 461459 456994
49747 456994 453164 449760 447177 446052 446398 447528 448744 449658 449964 449428 448180 446760 445814 445816 446878 448516
49731 448516 449852 450457 450893 451994 453749 455346 456230 456597 456761 456589 455845 454712 453658 452903 452228 451258 449858
49714 449858 448302 446987 445942 444784 443326 441975 441302 441408 442039 443059 444305 445231 445360 445103 445473 446837
49698 446837 448491 449698 450592 451789 453583 455918 458761 462049 465432 468466 471024 473311 475563 477854
49684 477854 480106 482088 483544 484399 484770 484750 484382 483897 483729 484118 484842 485518 486028 486555 487223 487818 487892 487235
49666 487235 486266 485748 486046 486813 487617 488503 489606 490556 490878 490832 491209 492265 493448 494295 495029 496051 497309
49649 497309 498370 498776 498194 496630 494671 493141 492358 492036 491859 491713 491393 490751 490206 490440 491367 492090 492143 492070
49631 492070 492466 493161 493806 494517 495394 496058 496296 496577 497288 498070 498588 499374 500999 502896 504110 504964 506885
49614 506885 510549 515104 519333 522769 525541 527956 530533 533873 538176 543254 549079 555807 563199 570620
49600 570620 577873 585565 594435 604635 615778 627277 638558 649403 660295 672029 684872 698423
49588 698423 712356 726827 742078 758167 775260 793663 813283 833529 854069 875395 898283
49577 898283 923017 949409 977226 1006297 1036458 1067777 1100648 1135372 1171709 1209053 1246937
49566 1246937 1285258 1324181 1363942 1404577 1445772 1487273 1529473 1573133 1618315 1664005 1709096
49555 1709096 1753314 1796761 1838918 1878765 1915734 1949991 1981729 2010602 2035915 2057000 2073343
49544 2073343 2084689 2091181 2093209 2091089 2085049 2075514 2063125 2048425 2031782 2013667 1994770 1975769
49532 1975769 1957197 1939611 1923598 1909464 1897150 1886668 1878510 1873396 1871661 1873000 1876750 1882361
49520 1882361 1889738 1899301 1911705 1927316 1945938 1967105 1990572 2016391 2044553 2074665 2105974 2137580
49508 2137580 2168627 2198443 2226574 2252617 2275989 2295858 2311302 2321560 2326291 2325739 2320504 2310917
49496 2310917 2296579 2276692 2250893 2219608 2183658 2143811 2100724 2054920 2006579 1955661 1902504
49485 1902504 1848114 1793567 1739383 1685803 1633422 1583019 1534820 1488389 1443294 1399490 1357086
49474 1357086 1316201 1277128 1240208 1205414 1172494 1141581 1113069 1086690 1061341 1036307 1012150
49463 1012150 989902 969876 951854 935955 922375 910426 898809 887082 876083 866603 858264 850187
49451 850187 842196 834815 828376 822739 817745 813410 809644 806184 802924 799966 797308 794753 792276 790170
49437 790170 788658 787629 787019 787213 788640 791055 793684 796276 799663 804932 812198 820595 829470 839234 850892
49422 850892 864971 881306 899963 921982 948411 978005 1006053 1026438 1035705 1035154 1028966 1020809
49410 1020809 1012697 1006244 1003329 1004885 1009957 1016807 1024641 1033733 1044322 1056103 1068717 1082066 1096032
49397 1096032 1110377 1125038 1140149 1155571 1170663 1184710 1197412 1208897 1219413 1229197 1238598 1248145
49385 1248145 1258285 1268958 1279547 1289467 1298774 1308013 1317563 1327479 1337952 1349429 1362040 1375341
49373 1375341 1388924 1402884 1417361 1432010 1446467 1461107 1476795 1493976 1512428 1531797 1551915
49362 1551915 1572571 1593419 1614257 1635208 1656698 1679355 1703703 1729546 1755897 1781979 1808185
49351 1808185 1835582 1864611 1894879 1926197 1959086 1994052 2030881 2068986 2108093 2148350 2190139
49340 2190139 2234084 2280957 2331192 2384565 2440495 2498599 2558878 2621484 2686332 2752894 2820452
49329 2820452 2888698 2957903 3028248 3099239 3170122 3240666 3310971 3380596 3448548 3514178 3577443
49318 3577443 3638068 3695013 3747015 3793184 3832939 3865982 3892624 3913482 3928434 3936461 3937047 3931208
49306 3931208 3920457 3905188 3884877 3859722 3831280 3801462 3771474 3741862 3712960 3685022 3658242
49295 3658242 3633020 3610125 3590455 3574600 3562552 3553731 3547449 3543496 3542246 3544147 3549299 3557696 3569540
49282 3569540 3585011 3603868 3625598 3649798 3676146 3704169 3733340 3763233 3793228 3822283 3849492
49271 3849492 3874688 3897934 3918388 3934278 3944157 3947690 3945037 3936011 3920247 3897781 3868970 3834071
49259 3834071 3793352 3747524 3697654 3644626 3588959 3531158 3471974 3412237 3352624 3293568 3235190
49248 3235190 3177339 3120003 3063777 3009678 2958256 2909110 2861502 2815303 2771029 2729074 2689381
49237 2689381 2651862 2616585 2583244 2550896 2518753 2487071 2456691 2427760 2399420 2370896 2342350
49226 2342350 2314476 2287719 2262183 2237922 2214863 2192795 2171898 2153090 2137265 2124184 2112605
49215 2112605 2101600 2091400 2082829 2076325 2071632 2068117 2065119 2062228 2059471 2057071 2054817 2051930 2047869
49202 2047869 2043209 2039433 2037771 2038402 2040696 2043983 2048030 2053012 2059270 2067034 2076158 2086041 2095902 2105388
49188 2105388 2114985 2125719 2138271 2152412 2167454 2183241 2200359 2219242 2239278 2259232 2278547
49177 2278547 2298009 2318974 2342109 2366946 2392565 2418553 2445258 2473083 2501567 2529385 2555441
49166 2555441 2579848 2603487 2626688 2648829 2669405 2688981 2708686 2729128 2750293 2772259 2795272
49155 2795272 2819112 2843020 2866566 2890221 2914838 2940900 2968395 2996995 3026071 3054984 3083844
49144 3083844 3113811 3146205 3181232 3217605 3253170 3285823 3314359 3339034 3361188 3381999 3401714
49133 3401714 3420331 3438569 3457521 3477477 3497787 3517912 3537984 3558155 3577947 3596597 3613787
49122 3613787 3629762 3644962 3659661 3673739 3686665 3697925 3707582 3716210 3724224 3731572 3738131 3744062
49110 3744062 3749535 3754395 3758392 3761693 3765002 3769217 3774919 3782054 3790010 3798127 3806145 3814112 3822127 3830460
49096 3830460 3839590 3849494 3858914 3866101 3870653 3874108 3878370 3883906 3889814 3895191 3899863 3904090 3908201 3912579
49082 3912579 3917561 3923249 3929616 3936778 3944878 3953711 3962654 3971056 3978620 3985449 3991832 3997881 4003265 4007382
49068 4007382 4009926 4011258 4012076 4012761 4013009 4011941 4008592 4002490 3993895 3983406 3971392 3957985 3943456 3928076
49054 3928076 3911520 3892928 3871904 3849124 3825577 3801518 3776545 3750491 3723866 3697496 3672010
49043 3672010 3647582 3623892 3600412 3576925 3553697 3531111 3509415 3488936 3470070 3452742 3436318
49032 3436318 3420486 3405878 3393245 3382317 3372149 3362490 3354102 3347649 3342931 3339424 3337005 3335682 3335033
49019 3335033 3334424 3333857 3334265 3336764 3341568 3347713 3353948 3359893 3366086 3372983 3380299 3387524 3394566 3401477 3407865
49004 3407865 3413157 3417252 3420336 3422202 3422410 3421153 3419237 3416967 3413606 3408184 3400385 3390386 3378407 3365011
48990 3365011 3351512 3339362 3328950 3319308 3309147 3297972 3286159 3274144 3261782 3248488 3233812
48979 3233812 3217706 3200290 3181632 3161875 3141399 3120653 3099921 3079298 3058671 3037688 3016084
48968 3016084 2994304 2973359 2953656 2934287 2914054 2892990 2872226 2852491 2833532 2815141 2797919
48957 2797919 2782641 2769433 2758007 2748251 2740072 2732979 2726410 2720432 2715778 2713214 2713027 2714937 2718287
48944 2718287 2722510 2727666 2734480 2743623 2755028 2768045 2782128 2797247 2813756 2831986 2851879 2872935
48932 2872935 2894753 2917656 2942439 2969433 2998244 3028615 3060927 3095284 3130514 3164902 3197883
48921 3197883 3230352 3263323 3297016 3331462 3367231 3404977 3444661 3485849 3528598 3573520 3620952
48910 3620952 3670553 3721791 3774428 3828393 3883631 3940399 3999418 4061297 4125873 4192466 4260715
48899 4260715 4330778 4402722 4476223 4551064 4627365 4704945 4782847 4860116 4936746 5013222 5089164
48888 5089164 5163219 5234462 5303155 5369677 5433386 5493242 5549092 5601426 5649909 5693104 5730050
48877 5730050 5761499 5789033 5813223 5833091 5847122 5854363 5854657 5848430 5836458 5819446 5797577 5770582
48865 5770582 5738409 5701575 5660743 5616284 5568539 5518184 5465835 5411326 5353953 5293552 5230936
48854 5230936 5167131 5102586 5037409 4971897 4906341 4840516 4773978 4706930 4640434 4575683 4513288
48843 4513288 4453247 4395224 4338749 4283469 4229513 4177559 4128401 4082471 4039804 4000341 3964071
48832 3964071 3930926 3900595 3872577 3846479 3822317 3800507 3781601 3766045 3754086 3745675 3740429 3737955
48820 3737955 3738252 3741607 3748002 3756972 3768203 3781901 3798279 3817088 3838022 3861260 3887021 3914820
48808 3914820 3943822 3973876 4005583 4039254 4074412 4110495 4147480 4185555 4224568 4264144 4304027
48797 4304027 4344052 4383963 4423447 4462194 4500008 4537153 4574601 4613390 4653580 4694261 4734722
48786 4734722 4775127 4815870 4856909 4898196 4940204 4983429 5027601 5071966 5116172 5160360 5204536
48775 5204536 5248322 5291281 5333072 5373262 5411326 5446782 5479066 5507463 5531447 5550986 5566096
48764 5566096 5576210 5580448 5578458 5570554 5557018 5537814 5513056 5483305 5449119 5410706 5368223 5322131
48752 5322131 5272982 5221122 5166826 5110434 5051960 4990709 4925758 4856963 4785380 4712679 4640310
48741 4640310 4569158 4499688 4432190 4367004 4304698 4245989 4191372 4140836 4094109 4051120 4012096
48730 4012096 3977222 3946443 3919652 3896761 3877417 3860972 3847100 3836214 3828848 3824681 3822667 3822133
48718 3822133 3823224 3826145 3830553 3836045 3842852 3851531 3862237 3874680 3888650 3904083 3920691 3937930
48706 3937930 3955402 3973060 3990921 4008812 4026475 4043821 4061124 4079058 4098399 4119533 4142333
48695 4142333 4166700 4193035 4221982 4253894 4288899 4327369 4369900 4416683 4467156 4520408 4575892
48684 4575892 4633790 4694859 4759799 4828471 4899651 4971760 5043913 5116238 5189272 5263104 5336951
48673 5336951 5409297 5478548 5543857 5605264 5662857 5715898 5763029 5803141 5835653 5860156 5876377
48662 5876377 5884579 5885443 5879309 5865882 5844788 5816000 5779437 5734659 5681411 5620301 5552676 5480065
48650 5480065 5403986 5325883 5246662 5166407 5084991 5002881 4920882 4839218 4757401 4675165 4593000
48639 4593000 4511564 4431026 4351323 4272749 4195824 4120791 4047671 3976809 3908879 3844261 3782691
$$ [...]
##END NTUPLES=NMR SPECTRUM
##END=
