
##TITLE=AC1171_Tolima-ibage-TiCOAH12008_5890718_Qsy8AbS86e
##JCAMPDX= 6.0         $$ Bruker NMR JCAMP-DX V2.0
##DATA TYPE= NMR SPECTRUM
##DATA CLASS= NTUPLES
##ORIGIN= BRUKER
##OWNER= Administrator
$$ 1.72 TOPSPIN		Version 2.1
$$ 2012-04-02 15:37:18.093 -0500  Administrator@TOPSPIN
$$ Compression mode = diff/dup
##.OBSERVE FREQUENCY= 400.13188235
##.OBSERVE NUCLEUS= ^1H
##.ACQUISITION MODE= SIMULTANEOUS (DQD)
##.ACQUISITION SCHEME= undefined
##.AVERAGES= 8
##.DIGITISER RES= 22
##SPECTROMETER/DATA SYSTEM= spect
##.PULSE SEQUENCE= zg30
##.SOLVENT NAME= COFFEE_meoh
##.SHIFT REFERENCE= INTERNAL, COFFEE_meoh, 1, 14.98061
##AUDIT TRAIL= $$ (NUMBER, WHEN, WHO, WHERE, PROCESS, VERSION, WHAT)
$$ ##TITLE= Audit trail, TOPSPIN		Version 2.1
$$ ##JCAMPDX= 5.01
$$ ##ORIGIN= Bruker BioSpin GmbH
$$ ##OWNER= Administrator
$$ $$ C:\Bruker\TOPSPIN/data/COFFEE/nmr/AC1171_Tolima-ibage-TiCOAH12008_5890718_Qsy8AbS86e/10/pdata/1/auditp.txt
$$ ##AUDIT TRAIL=  $$ (NUMBER, WHEN, WHO, WHERE, PROCESS, VERSION, WHAT)
(   1,<2012-04-02 15:37:08.859 -0500>,<Administrator>,<TOPSPIN>,<go>,<TOPSPIN 2.1>,
      <created by zg
	started at 2012-04-02 15:36:02.078 -0500,
	POWCHK enabled, PULCHK disabled,
       configuration hash MD5:
       1A 1E CE 29 27 FD 77 03 67 4E F0 E3 C4 B2 CB 90
       data hash MD5: 64K
       2C 22 0D 89 0B 53 72 6B 23 DD 7B 9B DC 60 D0 1F>)
(   2,<2012-04-02 15:37:12.031 -0500>,<Administrator>,<TOPSPIN>,<proc1d>,<TOPSPIN 2.1>,
      <Start of raw data processing
       efp LB = 0 FT_mod = 6 PKNL = 1 PHC0 = 0 PHC1 = 0 SI = 32K 
       data hash MD5: 32K
       F1 AE F7 3E 89 48 9E BC A2 D1 8D B2 93 BB 50 0F>)
(   3,<2012-04-02 15:37:12.812 -0500>,<Administrator>,<TOPSPIN>,<proc1d>,<TOPSPIN 2.1>,
      <pk PHC0 = 215.2716 PHC1 = 0 
       data hash MD5: 32K
       02 7B 07 41 70 7B F1 F1 EC AF 77 B7 43 51 80 FA>)
(   4,<2012-04-02 15:37:12.890 -0500>,<Administrator>,<TOPSPIN>,<proc1d>,<TOPSPIN 2.1>,
      <abs ABSG = 1 
       data hash MD5: 32K
       EF 4C CF A5 4E 26 F0 C1 90 23 CD 09 35 70 33 5C>)
(   5,<2012-04-02 15:37:12.937 -0500>,<Administrator>,<TOPSPIN>,<proc1d>,<TOPSPIN 2.1>,
      <abs ABSG = 2 
       data hash MD5: 32K
       74 7B 79 F8 64 19 93 B6 3F 4D 22 A8 9C E8 14 DD>)
(   6,<2012-04-02 15:37:12.984 -0500>,<Administrator>,<TOPSPIN>,<proc1d>,<TOPSPIN 2.1>,
      <abs ABSG = 3 
       data hash MD5: 32K
       F4 7E 48 FF 7C 04 F7 90 A6 7C 54 CF F9 B7 53 6B>)
(   7,<2012-04-02 15:37:13.031 -0500>,<Administrator>,<TOPSPIN>,<proc1d>,<TOPSPIN 2.1>,
      <abs ABSG = 4 
       data hash MD5: 32K
       AD 96 97 54 FD 35 D6 A1 BE 38 B2 6C 1D 29 73 AB>)
(   8,<2012-04-02 15:37:13.062 -0500>,<Administrator>,<TOPSPIN>,<proc1d>,<TOPSPIN 2.1>,
      <abs ABSG = 5 
       data hash MD5: 32K
       9E D0 FE D4 9B 4B 22 01 0F E7 19 DC EB C5 08 8D>)
$$ ##END=
$$ 
$$ $$ hash MD5
$$ $$ 3C BD 30 7F 47 01 AE E2 21 E7 ED D8 EE BF 94 D9
##$RELAX= 
##$RELAX= 
##$RELAX= 
##$RELAX= 
##$RELAX= 
##$RELAX= 
##$RELAX= 
$$ Bruker specific parameters
$$ [...]
150 150 150 150 150 150 150 150
##$TP07= 0
##$TPNAME0= <>
##$TPNAME1= <>
##$TPNAME2= <>
##$TPNAME3= <>
##$TPNAME4= <>
##$TPNAME5= <>
##$TPNAME6= <>
##$TPNAME7= <>
##$TPOAL= (0..7)
0.5 0.5 0.5 0.5 0.5 0.5 0.5 0.5
##$TPOFFS= (0..7)
0 0 0 0 0 0 0 0
##$TUNHIN= 0
##$TUNHOUT= 0
##$TUNXOUT= 0
##$USERA1= <user>
##$USERA2= <user>
##$USERA3= <user>
##$USERA4= <user>
##$USERA5= <user>
##$V9= 5
##$VALIST= <valist>
##$VCLIST= <CCCCCCCCCCCCCCC>
##$VD= 0
##$VDLIST= <DDDDDDDDDDDDDDD>
##$VPLIST= <PPPPPPPPPPPPPPP>
##$VTLIST= <TTTTTTTTTTTTTTT>
##$WBST= 2048
##$WBSW= 25
##$XGAIN= (0..3)
0 0 0 0
##$XL= 0
##$YL= 0
##$YMAX_a= 528704
##$YMIN_a= -639645
##$ZGOPTNS= <>
##$ZL1= 120
##$ZL2= 120
##$ZL3= 120
##$ZL4= 120
##$ABSF1= 14.98061
##$ABSF2= -5.57192
##$ABSG= 5
##$ABSL= 3
##$ALPHA= 0
##$AQORDER= 0
##$ASSFAC= 0
##$ASSFACI= 0
##$ASSFACX= 0
##$ASSWID= 0
##$AUNMP= <proc_prof1d_extract_pilot.lims>
##$AXLEFT= 0
##$AXNAME= <>
##$AXNUC= <1H>
##$AXRIGHT= 0
##$AXTYPE= 0
##$AXUNIT= <>
##$AZFE= 0.1
##$AZFW= 0.1
##$BCFW= 0
##$BC_mod= 0
##$BYTORDP= 0
##$COROFFS= 0
##$CY= 15
##$DATMOD= 1
##$DC= 0
##$DFILT= <>
##$DTYPP= 0
##$F1P= 0
##$F2P= 0
##$FCOR= 0.5
##$FTSIZE= 32768
##$FT_mod= 6
##$GAMMA= 0
##$GB= 0
##$INTBC= 1
##$INTSCL= 1
##$ISEN= 128
##$LB= 0
##$LEV0= 0
##$LPBIN= 0
##$MAXI= 10000
##$MC2= 0
##$MEAN= 0
##$ME_mod= 0
##$MI= 0
##$NCOEF= 0
##$NC_proc= -8
##$NLEV= 6
##$NOISF1= 0
##$NOISF2= 0
##$NSP= 0
##$NTH_PI= 0
##$NZP= 0
##$OFFSET= 14.98061
##$PC= 1
##$PHC0= 215.2716
##$PHC1= 0
##$PH_mod= 1
##$PKNL= yes
##$PPARMOD= 0
##$PPDIAG= 0
##$PPIPTYP= 0
##$PPMPNUM= 2147483647
##$PPRESOL= 1
##$PSCAL= 4
##$PSIGN= 0
##$PYNMP= <proc.py>
##$REVERSE= no
##$SF= 400.13
##$SI= 32768
##$SIGF1= 0
##$SIGF2= 0
##$SINO= 400
##$SIOLD= 32768
##$SPECTYP= <>
##$SREGLST= <1H.CDCl3>
##$SSB= 0
##$STSI= 32768
##$STSR= 0
##$SW_p= 8223.68421052632
##$SYMM= 0
##$S_DEV= 0
##$TDeff= 65536
##$TDoff= 0
##$TI= <>
##$TILT= no
##$TM1= 0
##$TM2= 0
##$TOPLEV= 0
##$USERP1= <user>
##$USERP2= <user>
##$USERP3= <user>
##$USERP4= <user>
##$USERP5= <user>
##$WDW= 1
##$XDIM= 32768
##$YMAX_p= 466704879
##$YMIN_p= -691407
##$CURPLOT= <Network HP LaserJet P1505>
##$CURPRIN= <$Network HP LaserJet P1505>
##$DFORMAT= <normdp>
##$LAYOUT= <+/1D_H.xwp>
##$LFORMAT= <normlp>
##$PFORMAT= <normpl>
##$SURQMSG= 1
$$ End of Bruker specific parameters
$$ ---------------------------------
##NTUPLES= NMR SPECTRUM
##VAR_NAME=  FREQUENCY,     SPECTRUM/REAL,   SPECTRUM/IMAG
##SYMBOL=    X,             R,               I
##VAR_TYPE=  INDEPENDENT,   DEPENDENT,       DEPENDENT
##VAR_FORM=  AFFN,          ASDF,            ASDF
##VAR_DIM=   32768,         32768,           32768
##UNITS=     HZ,            ARBITRARY UNITS, ARBITRARY UNITS
##FACTOR=    0.250966925370066, 1,           1
##FIRST=     8223.43324360095, 36806,        -50555
##LAST=      0,             148340,          -172990
##MIN=       0,             -691407,         0
##MAX=       8223.43324360095, 466704879,    0
$$ Real data points
##PAGE= N=1
##DATA TABLE= (X++(R..R)), XYDATA
$$ [...]
19462g9123l56805c6169j57761J6315A44819P300C1215J05713C5984d7578k12048
19451b59626j75259E8934a50075I6583e0948f183n6156A7787k61J3437e7415n531
19439f2946A40755J7876b81024A15780a83089B1550b01476g9675j4729k60001
19429c54405a4015F3275a02824B6983N011b89336a01489I4371A2126K8121b83623
19417A98438D2045b61409E3764b69767l5830b5470m36268a24179M0729A64811
19406c8498E5916a54404A15005b35399Q4970h676B99858o88b18266B07216b90228
19394d97159a0958p826j56655C8652e4383l2267j71150a0486l2438j16882J4212
19383a45594A10336a18853c3029k94383J6682a25343B31963f7762j10001N8874
$$ y = [-79123, -435928, -36169, -193930, -177615, 144819, 152119, 31215, 136928, 35984, -47578, -259626, -434885, 58934, -150075, 96583, -50948, -6183, -62339, 17787, 17526, 30963, -57415, -62946, 140755, 158631, -281024, 115780, -183089, 21550, -201476, -79675, -94404, -354405, -14015, 63275, -102824, 26983, 31994, -289336, -101489, 94371, 12126, 40247, -283623, 198438, 42045, -261409, 53764, -269767, -305597, -25470, -461738, -124179, -83450, 164811, -38498, 55916, -154404, 115005, -235399, -150429, -8676, 299858, 299170, -218266, 207216, -290228, -497159, -10958, -18784, -175439, 38652, -54383, -86650, -257800, -10486, -42924, -159806, -145594, 110336, -118853, -33029, -327412, -310730, -125343, 231963, -67762, -177763, -118889]
19373a18889A1403J49581n2378a68271a715E0942j9720f8675C51925a41145k54260
19362c95405D9815c14936J10702k55870a56019A00320B8883b67696C1464J09020
19352A40484F9001b7951n3685A00741h3058A05043d43308D9397K2613e3064A86528
19340c03954C6605f9243A10072b53576n9687f6108A59966k3189k4935P9134d29015
19328a51887A22180j6443E0568P5671a87132O3483j2033M2399r0383j24161a04504
19316a84804C8355b25403j6447A91445F711J10387B3797f9689j78217D635b14278
19304f1997J0187m41074a81140A35457a53919J76j1022A66626a33093q8767b1515
19292h5021j62528g8381K6217j29882A30964a43297J0720c235B5037e1171k85891
$$ y = [-118889, 11403, 160984, 108606, -168271, -1715, 50942, 31222, -68675, 351925, -141145, -395405, 49815, -314936, -204234, -460104, -156019, 100320, 28883, -267696, 31464, 140484, 69001, -27951, -81636, 100741, -83058, 105043, -443308, 49397, 72010, -53064, 186528, -303954, 36605, -69243, 110072, -253576, -313263, -66108, 159966, 136777, 111842, 190976, -429015, -151887, 122180, 105737, 50568, 126239, -187132, -123649, -135682, -93283, -183666, -307827, -104504, -184804, 38355, -225403, -241850, 191445, 6711, 117098, 23797, -69689, -247906, 4635, -214278, -61997, -51810, -492884, -181140, 135457, -153919, -153743, -164765, 166626, -133093, -221860, -21515, -85021, -247549, -78381, -52164, -182046, 130964, -143297, -132577, -3235, 25037, -51171, -337062]
19281c37062a4272r4432k01949J22022N8258E4433a04205a7543l62891A95580
19270B47579f6593k26951h0356b8215l13061a15415A31785b98873A57341B753
19259h1532j48481J0323e2768A68691C1275g703k10608l2883f5363o5613B74908
19247A99530d0293m7079B73111b64906f0040m2805r5204C1635Q3521a30878j1606
19236a42484k92080C01482f3937o4451b3685m9862A69728a66835M217o020N3292
19225a15346e7661j67143d8201j19995L0314M2879k21247a52743B47233j22349
19215A24884E8527a27531G3401l551Q9029a94514C12732b06488I0243J00231F4440
19203B59225d99469J74322J45337j66854H5686L16852b482j14058c6406j61003
$$ y = [-337062, -14272, -108704, -310653, -188631, -130373, 54433, -104205, -17543, -380434, 195580, 247579, -66593, -293544, -80356, -28215, -341276, -115415, 131785, -298873, 157341, 2753, -81532, -230013, -219690, -52768, 168691, 31275, -7703, -218311, -251194, -65363, -130976, 274908, 199530, -40293, -87372, 273111, -264906, -60040, -102845, -198049, 31635, 115156, -130878, -142484, -434564, 301482, -63937, -128388, -23685, -73547, 169728, -166835, -162618, -168638, -115346, -57661, -224804, -48201, -168196, -137882, -95003, -316250, -152743, 247233, 124884, 58527, -127531, 73401, 69850, 158879, -194514, 312732, -206488, 90243, 190474, 64440, 259225, -499469, -325147, -179810, -346664, 85686, 402538, -2482, -116540, -36406, -197409]
19193a97409h4046j826j12970F702a69203A29719c52030h978k61363j3919J1736
19182b72524I7971c13706A95621J79955A7993b36616c0241E8436R6739a28724
19171f9485J0099j72462P9985L3096a6252A96049R9242H4785a78091b3726D085
19159A22401O785a7084A71722a04565N378b7316J2158j8093G0507a83978G1248
19147C98779b68261d2696B4027P4420c7599D0022j9311g3500E350J69543a51244
19135I0722C9824e2449k45939B07687p8605b80980R8782P323E1758a46235j01391
19124b47626K3156A00196a32311E6976O170P3002d1788p2509n189j23688h3532
19112b0181B58247d09397i6794k33804A57548c1079l38607a37275l10411F4292
$$ y = [-197409, -84046, -85872, -198842, 6702, -169203, 129719, -352030, -8978, -270341, -284260, -272524, 97971, -313706, 195621, 375576, 17993, -236616, -30241, 58436, 155175, -128724, -69485, -59386, -231848, -151863, -118767, -16252, 196049, 295291, 84785, -178091, -23726, 4085, 122401, 129186, -17084, 171722, -104565, -99187, -27316, -15158, -33251, 70507, -183978, 71248, 398779, -268261, -42696, 24027, 98447, -37599, 40022, 20711, -73500, 5350, 174893, -151244, 90722, 39824, -52449, -298388, 207687, 129082, -280980, -182198, -174875, 51758, -146235, -247626, -224470, 100196, -132311, 56976, 63146, 136148, -41788, -114297, -119486, -243174, -83532, -20181, 258247, -409397, -96794, -330598, 157548, -31079, -369686, -137275, -447686, 64292]
19101A03375m5977a88563B72907c08679h4614K197k7626l3880A35654f2210A04265
19089b95665I1348a42756B82516b52027e7188k47291J14608j50366K3036j0388
19079c27589e8918J4660A52013J45736h4895f50G4928e6379D278h9025H5788P682
19067I3470c516A30375b58630H6712C6379a25489p2499e7768k19786G8863h921
19055B92455b96761Q8425a03698q719j19836d0519A12772a32952j33517G9129
19044B17398p7269J1939e3347F624R5974c37D33992a42246F1305O8102c69766
19032B9835g5685K3622k28089A30530d7087r57j08469C1745b17413l8115J13566
19021a41962A1437a68644k17262a85864k26063g0568m09150B40738b75858J27918
$$ y = [103375, 57398, -188563, 272907, -308679, -84614, -82417, -110043, -143923, 135654, -62210, 104265, -295665, 91348, -142756, 282516, -252027, -57188, -304479, -189871, -340237, -317201, -327589, -58918, -44258, 152013, 297749, -84895, -650, 74928, -56379, 4278, -89025, 85788, 93470, -3516, 130375, -258630, 86712, 36379, -125489, -197988, -57768, -277554, 78863, -8921, 292455, -296761, -208336, -103698, -112417, -232253, -40519, 112772, -132952, -266469, 79129, 217398, 140129, 152068, -53347, 6624, 102598, -337, 433992, -142246, 61305, 129407, -369766, 29835, -75685, -52063, -280152, 130530, -47087, -48044, -156513, 31745, -217413, -255528, -141962, 11437, -168644, -385906, -185864, -411927, -70568, -479718, 240738, -275858, -147940]
19011a47940B58548a16096A14772a64306L9572A5906h7894B61765e9152r2334
19001a51486j11904a0855k75243C3112e0874m7429q0538k81185D2722L1020j175
18990G2567b26181i5337A35260j7336a52975a3238B17934C1423j2194i7997j65066
18979b63063A0550a32450J1965F3501b46605n1980D9163J32430e8720A4910c4181
18967F7482N5401b03140R6582j09596A3674R8937a76761f776B14841k060J98875
18956D11656O8202j82579j03351q4459J642J49411A26824D7274b14329j91413
18946d05742A44218a9206j63706D1676e07234A52275b31380e8309j68674b8060
18935i7706A99684b56381J10938j2701D8338f1371I1362a6412j96900B8221J3202
$$ y = [-147940, 258548, -116096, 114772, -164306, -124734, 15906, -87894, 261765, -59152, -151486, -263390, -10855, -286098, 33112, -50874, -98303, -178841, -460026, 42722, 73742, 72567, -226181, -95337, 135260, 117924, -152975, -13238, 217934, 31423, 19229, -97997, -263063, 10550, -132450, -120485, 63501, -246605, -298585, 49163, 181593, -58720, 14910, -34181, 67482, 122883, -203140, -106558, -216154, 13674, 112611, -176761, -6776, 214841, 212781, 411656, 479858, 297279, 193928, 109469, 111111, 260522, 126824, 47274, -214329, -405742, 144218, -19206, -182912, 41676, -507234, 152275, -231380, -58309, -226983, -28060, -97706, 199684, -256381, -145443, -158144, 48338, -61371, 91362, -16412, -213312, 28221, 41423]
18924D1423f8825A20612B0951K20696I1691i4759B18099R116g7330a7310p0328
18913h7638I8589a34593B17159i6716C67195b66214d7767K410I7614N2266K1403
18902A71283a84540A98480g3224E81958a21281E01767a17316C36725j54939M44718
18892F26504k66908G4910K78454b2772b530A15037B9760J19304b54188a26902
18881a25566N9780B30986a17107C723J38903b81518A16584a2694G2785a2691l27817
18870c40508A46191b5882p1837A10743g1837H08a30535E0972c63369f8581k89466
18859c58047A1441L9940a79553A33473l5684d47981C2687b92745A287J02488k0355
18848H3420J60223h1490b3841j18222A8466a61312j40463A8951b48845R7037o6415
$$ y = [41423, -68825, 120612, 20951, 241647, 91691, -94759, 218099, 227215, -77330, -17310, -87638, 98589, -134593, 217159, -96716, 367195, -266214, -47767, -45357, 97614, 149880, 171283, -184540, 198480, -73224, 581958, -121281, 501767, -117316, 336725, 181786, 626504, 359596, 74910, 353364, -22772, -2530, 115037, 29760, 149064, -254188, -126902, -125566, -65786, 230986, -117107, 3723, 142626, -281518, 116584, -12694, 72785, -12691, -340508, 146191, -25882, -97719, 110743, -71837, 808, -130535, 50972, -363369, -68581, -358047, 11441, 51381, -179553, 133473, 97789, -447981, 32687, -292745, 1287, 103775, 83420, 243643, -81490, -23841, -142063, 18466, -161312, -301775, 18951, -248845, -151808, -218223]
18837b18223b9024q3275a5017A60021k8592E0747K4250O1454P4860a54283A59828
18825a16981r7737A97754a05765I4845c34761H8297Q1857g2727j04243P5288M9266
18814e2416C89964f5575A32374A3038O6237c01765a4043l4206f457p1063k6747
18803a04267B68082d3161F8363a3012j22951B35634p3555b6392B0123a60711N3225
18792a07486D223J73143n5371a88677B5539r221d47444C76461e1466i734A71715
18780A3753c11904R3849e7884B09754n1514b5514B92895j10495B2988a57110J2234
18769a44876A4590J42454a94717d9742B64355h355k77365e5021C35083f3251k55665
18758c18916L5662J27281k13284A26813D6199j1834o436J30810a6009p3568H536
$$ y = [-218223, -29024, -112299, -15017, 160021, 131429, 50747, 74997, 136451, 211311, -154283, 159828, -116981, -214718, 197754, -105765, 94845, -334761, 88297, 170154, -72727, -176970, -101682, -52416, 389964, -65575, 132374, 13038, 79275, -301765, -14043, -48249, -6457, -77520, -104267, 268082, -43161, 68363, -13012, -135963, 235634, 162079, -26392, 20123, -160711, -107486, 4223, 177366, 121995, -188677, 25539, 16318, -447444, 376461, -51466, -9734, 171715, 13753, -311904, -218055, -57884, 209754, 158240, -25514, 292895, 182400, 22988, -157110, -144876, 14590, 157044, -194717, -49742, 264355, -8355, -285720, -55021, 335083, -63251, -318916, -283254, -155973, -369257, 126813, 46199, 34365, 27929, 158739, -16009, -89577, 8536]
18746h7903d0983K584j96180R288h6206j39773a0780k52358a6995k45654p0992
18735c33641b9794k41201G5681a27735d515q8334c411G3094J92381A02343c530
18723a98820j75307B72399o2292a32789n0601j99238b0731G8556d8076A91953
18712a44832j18511B57317j25163J14361b02654j63817a55497A31496d95419K44047
18702b51372C86769H0909a10473d1562h763B34690a15993f92o9515o1999b7274
18690e2005G0313d44077b6256k84707C8128I224g4636j91193A78585e445A96199
18678b17216A2056A757b08581d4322A47422K7674e5495k09639J29576m2999B88392
18666e0775m1173d5251m26497a32646a0406k70016b5438D0146b55285L0099h3654
$$ y = [-87903, -40983, -38399, -234579, -225291, -86206, -225979, -10780, -263138, -16995, -262649, -333641, -29794, -270995, 75681, -127735, -4515, -92849, -3411, 73094, 265475, 102343, -3530, -198820, -374127, 272399, 210107, -132789, -183390, -382628, -20731, 78556, -48076, 191953, -144832, -263343, 257317, 132154, 246515, -202654, -366471, -155497, 131496, -495419, -251372, 386769, 80909, -110473, -41562, -8763, 234690, -115993, -692, -70207, -132206, -27274, -52005, 70313, -444077, -26256, -310963, 38128, 9224, -74636, -265829, 178585, -5445, 196199, -217216, 12056, 1757, -208581, -44322, 147422, 175096, -55495, -265134, -135558, -178557, 288392, -50775, -91948, -45251, -471748, -132646, -10406, -280422, -25438, 40146, -255285, -225186, -83654]
18654h9200j00624b129B00567c46312g7488j60145R1313d0828F6979c60816A20971
18642e9437B49560q6306A2168a61723d5514o3156q3385j58181E2413K8980a35848
18630b58670A04456d1227j53594A9889a47101D8542b20989A2634a19787c9788
18619G0969N6410n6408O0639e88015a33983j48367a23240a2979B51716o1358h578
18607h4855A64013c31325a58678B8628d02228a48102A11611J5125a25247F675
18596A43622L6817k6993c44344L7556J37353g0834j59761E816c88121b8243B1066
18584E5910e939j10998A45220a65441G9747i0783A6002J07495a24429A35545d8026
18572a75877a0171m03689H6578b54021O0847A49844B8114b4694D0757a2575A6883
$$ y = [-89200, -189824, -2129, 200567, -346312, -77488, -237633, -146320, -40828, 66979, -360816, 120971, -59437, 249560, 163254, 12168, -161723, -45514, -108670, -192055, -350236, 52413, 81393, -135848, -258670, 104456, -41227, -194821, 19889, -147101, 48542, -220989, 12634, -119787, -39788, 70969, 127379, 70971, 131610, -588015, -133983, -282350, -123240, -12979, 251716, 190358, -8578, -84855, 164013, -331325, -158678, 28628, -402228, -148102, 111611, 126736, -125247, 6675, 143622, 180439, 153446, -344344, -306788, -169435, -70834, -230595, 5816, -388121, -28243, 21066, 55910, -5939, -116937, 145220, -165441, 79747, -90783, 16002, 123497, -124429, 135545, -48026, -175877, -10171, -413860, 86578, -254021, -193174, 149844, 28114, -24694, 40757, -12575, 16883]
18560A89960c11390a46936A01075Q8432J0299f0006D4538e1907A6984J10949g4297
18548h1372K6737J583j36655N1664C26898k4343a38441N4513g460j3402A29915
18536a03765B22215A0681b66723I5120c3923l36079a37854c3052F1816B8475a72880
18524h776C0161P8779O5324d7963n5070j00162L4028A41719b53374A6062N5854
18513G1916J4794j8168f978j27504r2310B4377J1864a25764b9397E9529K38307
18502B97836a06449B8662R9927i8880F5912b44768b5431l17421e9436j04187l7743
18491b01366H8938N7792a97157K1862k2927B26343p5783c41628c6597G6165a12063
18479a0408E6456c14610a06364C0256L07113I0715e8334j20524j46748A79315
$$ y = [189960, -311390, -146936, 101075, 189507, 199806, -60006, 44538, -51907, 16984, 127933, -74297, -81372, -54635, -53052, -189707, -138043, 326898, 302555, -138441, -83928, -7460, -20862, 129915, -103765, 222215, 10681, -266723, 95120, -33923, -370002, -137854, -33052, 61816, 28475, -172880, -8776, 30161, 108940, 174264, -47963, -103033, -203195, -169167, 141719, -253374, 16062, 71916, 86710, 68542, -6978, -134482, -226792, 24377, 36241, -125764, -29397, 59529, 297836, -106449, 28662, 128589, -98880, 65912, -244768, -25431, -342852, -59436, -163623, -201366, 88938, 146730, -197157, -175295, -198222, 226343, 150560, -341628, -36597, 76165, -112063, -10408, 56456, -314610, -106364, 30256, 337369, 90715, -58334, -178858, -325606, 179315]
18468A01216D8793R7931d805n8258B61854F4722a05465q3844j34487E00R5478
18457I5978h6753o5777o260P7746r0237j2907A4068R8420O3304m826b14519d2232
18444d0713j11172D1719d9621j50666e5740C20799a00170A04457A6790P8799i6745
18432a91099j89493J81536F4714K06960B4353g6826B45681F5250d5732A15097
18421e4524j5484J9618j99990f4296F3429b09204k03737c6968k03674Q472H9837
18409A66842D3129b0387k33813a11976L2161c629r7879j46546C05076I5763a90463
18397a9817D77792d2891j52193r6878B98897i2259I4796k0096K9243e0191H7964
18385a77639B12347E0453a08010k2115b1942m3395n4603G7155G72a7248P336A45762
$$ y = [101216, 48793, 146724, -4805, -63063, 261854, 64722, -105465, -189309, -323796, 500, 95978, -86753, -152530, -158790, -81044, -171281, -184188, 14068, 112488, 175792, 170966, -214519, -42232, -40713, -151885, 41719, -49621, -200287, -55740, 320799, -100170, 104457, 16790, 95589, -96745, -191099, -380592, -199056, 64714, 271674, 24353, -76826, 245681, 65250, -45732, 115097, -54524, -70008, -50390, -250380, -64296, 63429, -209204, -412941, -36968, -240642, -232170, 89837, 166842, 43129, -20387, -254200, -111976, -79815, -3629, -101508, -248054, 305076, 95763, -190463, -19817, 477792, -42891, -195084, -291962, 298897, -92259, 94796, 74700, 103943, -50191, 87964, -177639, 212347, 50453, -108010, -130125, -21942, -65337, -119940, 77155, 772, -17248, -9912, 145762]
18372d0477C7898c50902c8125A35198a00955B55462c31108A12253a94771e5052
18361b01162r96K690B01386b3146p0577G7674M4685a68618c6607B90892f2824
18349c5232B02030F0783d1335j42404g4746E1505L54877i7861b062A53330b1456
18337b3170j49035Q2651o4431A17802D1117J23818K5299g1515a8657m8617A4351
18325b68345J8068J2808H7689a09073B03354a27690c9814H8076b54908a8341k2479
18314d0820A6093i433k04890E0081L9380d0456a5089E4411a22317p5690A10308
18302A59156N5526b29648A9837J2272a1316k58105j07591a10681j69021R9128
18292a80574j7689O5999f0275j64629A10011J33781c4895A37392a00898r9415
$$ y = [-40477, 37898, -350902, -38125, 135198, -100955, 255462, -331108, 112253, -194771, -55052, -201162, -202158, -199468, 201386, -23146, -93723, 77674, 122359, -168618, -36607, 290892, -62824, -35232, 202030, 60783, -41335, -183739, -74746, 51505, 406382, -97861, -2062, 153330, -21456, -23170, -172205, -89554, -153985, 117802, 41117, 164935, 190234, -71515, -18657, -67274, 14351, -268345, -250277, -237469, 87689, -109073, 203354, -127690, -39814, 88076, -254908, -18341, -40820, 16093, -9433, -214323, 50081, 89461, -40456, -15089, 54411, -122317, -198007, 110308, 159156, 214682, -229648, 19837, 32109, -11316, -269421, -377012, -110681, -279702, -180574, -198263, -132264, -60275, -224904, 110011, 243792, -34895, 137392, -100898, -200313]
18282b00313F4362i7053b1851j31184c0516j78439E1219a11280A02047l0588N8717
18271A30176A2776a04415I8200h0333F3270f51550f942n6534r956c2495I8150
18259a78229J3068k17213J75368m3183a00129c0012I5930J2011a1308G8546K33770
18248C12316A32395F4799a0676A92906j0467M8521G3855b50470g8211A72442i1715
18236b8244a700A21656J4870a4772j30684M2387j6743J9331R675k412D5440l622
18224D1818P0549b0287D66273A45402m3196C8459i3879j28282l1288j52549B3269
18212b78533B87343G5648m576a22806k06676B05414f2656j37009B5902J03895
18202A29797B7211d2713e163B86793B9036g0934j05089Q3345r792b0670B16191
$$ y = [-200313, 64362, -97053, -21851, -153035, -30516, -208955, 51219, -111280, 102047, 71459, 130176, 12776, -104415, 98200, -80333, 63270, -651550, -6942, -63476, -73432, -32495, 98150, -178229, -165161, -382374, -207006, -250189, -100129, -30012, 95930, 107941, -11308, 78546, 312316, 132395, 64799, -10676, 192906, 182439, 230960, 73855, -250470, -78211, 172442, -91715, -28244, -1700, 121656, 136526, -14772, -145456, -103069, -119812, -100481, -90806, -93218, 45440, 41818, 112367, -20287, 466273, 145402, 102206, 38459, -93879, -222161, -253449, -405998, 23269, -278533, 287343, 75648, 71072, -122806, -329482, 205414, -62656, -199665, 25902, 129797, 27211, -42713, -5163, 286793, 29036, -70934, -176023, -92678, -102470, -20670, 216191]
18190g1461j5070q1950c8271B87662a53190c3732A43644F0888J72534f6422p9350
18179a45772A22064A806J77524q920a12738J5565j77333F2779d708A28165d1284
18167A79007E4740K33023A10471k245O7046J07091G3421I651J06001d20884J32735
18156b88149h2924A33618B2395K71021a95271R19q1216C83045I2017h1021A6246
18144A32916c299C092J1431g7458p2987k29747d6525A32440c31483b7251O941
18133b0310N776G070J34002a61489B30808F2251N6067J5442n9333d8666A42976
18121A49750n0005J99845h3470F5754a09780L418K7208E7244f398j77089G6983
18109b5536q1301D15435C1126c4573k27087L9074n8185E7212J13087b76183C50026
$$ y = [-71461, -86531, -168481, -38271, 287662, -153190, -33732, 143644, 60888, 233422, -66422, -145772, 122064, 1806, 179330, 170410, -112738, -97173, -274506, 62779, -4708, 128165, -41284, 179007, 54740, 287763, 110471, 108226, 175272, 282363, 73421, 9651, 115652, -420884, -288149, -82924, 133618, 22395, 293416, -195271, -194352, -275568, 383045, 92017, -81021, 16246, 132916, -3299, 3092, 14523, -77458, -150445, -380192, -46525, 132440, -331483, -27251, -20310, -14534, 7070, 141072, -161489, 230808, 62251, 118318, 133760, 74427, -48666, 142976, 149750, 99745, 299590, -83470, 65754, -109780, -106362, -79154, 57244, -6398, -183487, 76983, -25536, -106837, 415435, 31126, -34573, -261660, -222586, -280771, 57212, 170299, -276183, 350026]
18097c9824E2199a48085N843a2926B05175a27853p8304e6325d521j29989b7777
18085H5373i0533k50933E7714b09455A83498c67947C094b6928A08216L32286a41461
18073B10866n7401d6869j25106D8353g2686B13302R0103b47011I9583l9318c99128
18061h7196G9921a89727J5017e8700A16572g4914G5940e3325F24797F6924J97790
18050B64714C2613b4592j18810g549B19469h3553j1868A25104n320c712k21777
18039b25489H216L3952b59674B00675a66429p4181A17432d9572F1766J90378E2597
18027b5393B23995n8803D0532b957A81686E7076f9612p2504K1652A5728J29184
18016A44912J13950b26693N2964e8254A0224b32862E8092h3274A9556Q9921B675
$$ y = [-39824, 52199, -148085, -142242, -12926, 205175, -127853, -206157, -56325, -4521, -134510, -27777, 85373, -90533, -341466, 57714, -209455, 183498, -367947, 3094, -26928, 108216, 440502, -141461, 210866, 153465, -46869, -171975, 48353, -72686, 213302, 303405, -247011, 99583, 60265, -399128, -87196, 79921, -189727, -174710, -58700, 116572, -74914, 75940, -53325, 624797, 66924, 264714, 32613, -24592, -143402, -7549, 219469, -83553, -95421, 125104, 119784, -3712, -225489, 8216, 42168, -259674, 200675, -166429, -240610, 117432, -49572, 61766, 252144, 52597, -25393, 223995, 165192, 40532, -2957, 181686, 57076, -69612, -142116, -120464, 15728, 144912, 258862, -226693, -173729, -58254, 10224, -232862, 58092, -83274, 19556, 109477, 2675]
18004G2091K59593A37405B2630c6750A28634j2893a01333K01C50159C7277b07584
17992g7825J3689b7341p1292A52949a84729c1614A74160m7250b91434A14688b28479
17980A54642d7474j11110b9296j27224A47431h2432B38858G4039P3595C8740P4605
17969A13345c2443A14379i0103j37A88842b24520j24988D9792A2711h3672C3442
17957D4078J7088b7014o3350A43439E6099a42894K6861N5926A37991a2099A02169
17945b9415A62808B2241J09088F1525J05345a7017k07964J00350A90055N0254
17935B40309a91740a1639k01675A60277C6907K99467C9676K40854c2453A27440
17924i5206J3767j38565A28340e4041A9949c1846B16740G9955a04078D15639i3887
$$ y = [72091, 331684, 137405, 22630, -36750, 128634, 115741, -101333, -101132, 350159, 37277, -207584, -77825, -64136, -27341, -98633, 152949, -184729, -31614, 174160, 126910, -291434, 114688, -228479, 154642, -47474, -158584, -29296, -156520, 147431, -82432, 238858, 74039, 147634, 38740, 113345, -32443, 114379, -90103, -90240, 188842, -224520, -349508, 49792, 12711, -83672, 33442, 44078, 61166, -27014, -90364, 143439, 56099, -142894, -116033, -60107, 137991, -12099, 102169, -29415, 162808, 22241, 131329, 61525, 166870, -17017, -224981, -124631, 190055, 240309, -191740, -11639, -213314, 160277, 36907, 336374, 39676, 280530, -32453, 127440, -95206, -81439, -220004, 128340, -54041, 19949, -31846, 216740, 79955, -104078, 415639, -93887]
17912h6918D73400f488n1459A23767o0317L1696C9111M4248M9133O5294a88681
17900A75555N5680b8131G8028l8854c2272A84703n3085d0354m8098d394C98058
17888i9580L7570A54122J04600g9383A41303J36637b16565B52754J45881A11107
17877D09007A09056B4907e1334C1792P8180a00240j58069J02299A25839k3959
17867A01880L7355K7366g4314F2316A0686J04957J02597g8998A50986R1711A08834
17855B18813d6839B64004I2942m2328L02212G322K4584c6592j41481C44780a38170
17843a30473C39246b4354A81656e7433j66174B00172e948n6900C08943d5029A02165
17831a95834C15082b15346B35926P64j7982F0290A1421d2049C91835A73909d438
$$ y = [-86918, 473400, -6488, -57947, 123767, 63450, 95146, 39111, 83359, 132492, 197786, -188681, 175555, 231235, -28131, 78028, 39174, -32272, 184703, 131618, -40354, -88452, -4394, 398058, -99580, -62010, 154122, 258722, -79383, 141303, 277940, -216565, 252754, 398635, 111107, 409007, 109056, 24907, -51334, 31792, 109972, -100240, -258309, -156010, 125839, 101880, 139235, 166601, -74314, 62316, 10686, 115643, 218240, -78998, 150986, 242697, 108834, 218813, -46839, 264004, 92942, 50614, 352826, 7322, 31906, -36592, -178073, 344780, -138170, -130473, 339246, -24354, 181656, -57433, -223607, 200172, -5948, -62848, 308943, -45029, 102165, -195834, 315082, -215346, 235926, 236690, 218708, 60290, 11421, -42049, 391835, 173909, -4438]
17819C51569i3849o107A62086k4919a64273c3478A13179l7770L7312b8099E0930
17807c6196A07728J93741e2718A24404g3959C88287a71144j07772A33169R3667
17797B26836F7572L31685F9810N7781a02548I2176g8466F196f7843A88551c36016
17785A55253o9740B4567f8095N408D7526a83653c4403I5810a14620A63665l1O488
17773A70122N4187b70663B95604J00761A65898o6275P7610q916f3601A69469C6068
17761D5554f7971C58843a34117A82873E6187J7319J8834b8786A0921i4971L7027
17750e7944A36816F0664p772J27599a09036D45076A71360b41521A84109A5086
17739E3838a66465H9214A6986J22385Q7486J89616b00176f1953A15548N572B3181
$$ y = [351569, -93849, -99956, 162086, 137167, -164273, -33478, 113179, 75409, 112721, -28099, 50930, -36196, 107728, 301469, -52718, 124404, -73959, 388287, -171144, -278916, 133169, 226836, 67572, 399257, 69810, 127591, -102548, 92176, -78466, 6196, -67843, 188551, -336016, 155253, 85513, 24567, -68095, -62687, 47526, -183653, -34403, 95810, -114620, 163665, 163634, 170122, 224309, -270663, 295604, 396365, 165898, 99623, 177233, 168317, -63601, 169469, 36068, 45554, -67971, 358843, -134117, 182873, 56187, 73506, 92340, -28786, 10921, -94971, -57944, 136816, 60664, 52892, 180491, -109036, 445076, 171360, -241521, 184109, 15086, 53838, -166465, 89214, 16986, 139371, 226857, 416473, -200176, -61953, 115548, 121120, 23181]
17727B38524b73502C22590a9956q2668B28519d6424A71559F1893a78755H7295
17716B00766k3072G6138a48454D188b51730D32452c2707A37962J09579a685A6659
17704C42189a59323j41332B20446b655D2470J62961K00075A50706J41046a21387
17693e932r1912F8433L2229c3331G3968M0505Q2832J22669a7754D5446N28J26050
17681A72024K02460h1749F273M5090K94406A02693i6108I898K24155K0513b33484
17669G4978m283K39080m6145D3498a09952B03621K042A8233L592a6978l4303A807
17656g3406B85573a8570I9265g5855A57955a10411C3362M09805c6268C51422p3016
17645B78406A7700J2880Q9148L86738A33038L47622d7760J2404G0510f8255E18954
$$ y = [238524, -273502, 322590, -19956, -102624, 228519, -46424, 171559, 61893, -178755, 87295, 200766, 177694, 76138, -148454, 4188, -251730, 432452, -32707, 137962, 247541, -1685, 16659, 342189, -159323, -300655, 220446, -2655, 42470, 205431, 405506, 150706, 291752, -121387, -5932, -97844, 68433, 100662, -33331, 73968, 114473, 197305, 319974, -17754, 45446, 45974, 172024, 374484, -81749, 6273, 51363, 345769, 102693, -96108, 9898, 234053, 254566, -233484, 74978, 70695, 309775, 263630, 43498, -109952, 203621, 205663, 18233, 21825, -16978, -51281, 1807, -73406, 285573, -18570, 99265, -75855, 157955, -110411, 33362, 443167, -36268, 351422, 278406, 17700, 30580, 119728, 506466, 133038, 480660, -47760, -35356, 70510, -68255, 518954]
17633a81374H4183J33217J237J25732g4711B41160C6827r02b32452G2418Q7834
17622A60252b33020f0865A27073L5143o3063K50933a07974c5317C82710G179K00832
17611B08011K21110H1308J3178J76759a82600b5512A58140Q6460f4955B9564L82005
17600D11569r4785j56721E9559a73550B68519E0950K58003j03045J63021a12235
17589f4164k35537A19140M5820i6677E02619A24530b39824a02294A11883g7296
17578c057E29998B03940M18735B18453h813A65181J1986m7403L3358O0295D0635
17566a68665B35787k23a4354C70457Q5810B1585d2246B02956A9465K88442n2947
17555B54960A17753N9344R7467I6513a15195A12517M98372b11898B24314J74955
$$ y = [-181374, 84183, 217400, 218637, 344369, -74711, 241160, 36827, 35925, -232452, 72418, 160252, -233020, -60865, 127073, 162216, 99153, 350086, -107974, -35317, 382710, 7179, 208011, 429121, 81308, 94486, 271245, -182600, -25512, 158140, 244600, -64955, 29564, 411569, 316784, 160063, 59559, -173550, 268519, 50950, 308953, 205908, 368929, -112235, -64164, -299701, 119140, 164960, -96677, 502619, 124530, -239824, -102294, 111883, -77296, -3057, 529998, 203940, 622675, 218453, -8813, 165181, 177167, 129764, 163122, 223417, 40635, -168665, 235787, 235564, -14354, 370457, 456267, 21585, -42246, 202956, 19465, 307907, 254960, 117753, 177097, 274564, 96513, -115195, 112517, 610889, -211898, 224314, 399269]
17545C99269C9210J53705J13614G653R4761J01137f614E86097B39075K37430A52925
17533C10489H5712J75954R3157K29075k14422H5340J33347Q1787F3371K21152
17523B84523O1123R94o7327L12001A68310J03692A20520L02647H3632K83461R0805
17512D57898Q5436M0132J88804J71115j93595K46646k81108j05992J63108B64419
17501C91715K349A31598L45713K60897k6293M06619k79893J26502R5867J2821
17491A073831n32465L61669l56820k61145J69941j58735m4556J77327J75215k0221
17481E84041j31285a21864A60801K07778j74659k8289M3065K69483k34126b27069
17470B80007l1321L21140q8026j48523n832m2113D8043r674J15231J98860A19771
$$ y = [399269, 39210, 192915, 306529, 7653, 102414, 203551, -6614, 586097, 239075, 476505, 152925, 310489, 85712, 261666, 354823, 583898, 369476, 85340, 218687, 300474, 63371, 284523, 345646, 346640, 279313, 591314, 168310, 272002, 120520, 423167, 83632, 367093, 457898, 543334, 583466, 772270, 943385, 749790, 996436, 715328, 609336, 772444, 264419, 391715, 394064, 131598, 477311, 738208, 711915, 1118534, 838641, 965143, 1061010, 1073831, 541366, 903035, 546215, 285070, 455011, 296276, 251720, 429047, 604262, 584041, 452756, -121864, 160801, 368579, 193920, 165631, 208696, 478179, 244053, -227069, 280007, 248686, 569826, 481800, 333277, 327445, 285332, 48043, 38369, 153600, 352460, 119771]
17458C40633A09660J16632r6182L01167A54186L10843H6115L8373P0924J28619
17448C24031A36498N65064l28269J75387k04102F4212J45727Q0379j05442J57902
17438C42778A63306M16169A47543K70418r7647J94015A37620O3377l0114O6621
17428B37504L24256j01199p0300j22989g6128C36608J2111r4548L26736c6397
17417C72833J63178j80523J07995j18585L09083k41809l5087L2377q7877j39187
17407A82398K89122N7272J47391C24831j4965j11069p7955J55330J61765j10733
17397C27204J30280A93352E5747K12820b12378b9480F33179I4171h6554A20331
17386C73965J5047n6423A13751L85297k48321J72122a17008A02488M54079h6870
$$ y = [340633, 109660, 226292, 130110, 431277, 154186, 465029, 86115, 124488, 195412, 324031, 136498, 701562, 373293, 548680, 344578, 64212, 209939, 290318, 184876, 342778, 163306, 579475, 147543, 417961, 320314, 514329, 137620, 200997, 170883, 237504, 561760, 460561, 390261, 267272, -76128, 336608, 348719, 254171, 580907, -36397, 372833, 536011, 355488, 463483, 344898, 653981, 412172, 377085, 409462, 321585, 182398, 471520, 528792, 676183, 324831, 309866, 198797, 120842, 276172, 437937, 327204, 457484, 193352, 55747, 268567, -212378, -29480, 633179, 94171, -86554, 120331, 373965, 389012, 332589, 113751, 499048, 250727, 422849, -117008, 102488, 556567, -86870]
17375B31429K36207N5736j83469R1901A04182O68873A99783J5046J45634P3042
17365D33505C052M92792o8312A80105K22667A75509J63613A08294J48143L55962
17355F12399G5064M12737C3629L1118R2155I779K97022N7548Q0281J40664q7005
17344D98289B9812K10768A13819P398M16457a6418D50217J27205j2393k6118A28801
17332B92687C0198J31885N7231D8816L65684P7122r4689j0195j65170J66887A54940
17320I606M08941r7725K46683r8353J773j32466J84527B33461n4289H0967M00981
17309D81948b4276B96527l1861o9913H1595J62480J68315A49295K54825o0310
17299C43810M3331Q6530A52742J67615r6396o5057K72172l7076R0454i534G9761
$$ y = [231429, 467636, 523372, 339903, 431804, 104182, 773055, 199783, 214829, 360463, 433505, 3052, 495844, 427532, 180105, 402772, 175509, 339122, 108294, 256437, 612399, 75064, 487801, 33629, 64747, 156902, 9779, 306801, 364349, 444630, 585294, 498289, 29812, 240580, 113819, 121217, 537674, -16418, 450217, 577422, 565029, 538911, 128801, 292687, 30198, 162083, 219314, 48816, 414500, 491622, 396933, 386738, 221568, 388455, 154940, 9606, 418547, 320822, 567505, 469152, 470925, 338459, 522986, 233461, 179172, 80967, 481948, -24276, 296527, 264666, 194753, 81595, 244075, 412390, 149295, 404120, 343810, 387141, 473671, 152742, 320357, 223961, 158904, 431076, 394000, 484454, -9534, 79761]
17287B13304K85793A19044K91517n0674p602j7060J56496A35853m0346N604J17835
17276B18946r5853L00819A78727l3964K76945b41123D35622A07173J41160K79773
17266E28106r6824g2278A83764P7675n8138L74665k66210L01953A47710K39223
17256C86933A85326K42962j29310A20926L77033J47179p0756j43889j10987R3704
17246D13210L1544A56350K58138K00764B92272o2414K94375J2515r0046j53297
17236B93405L79125k37736j1511q4078A06181M26370I8231L29787J46020J15968
17226F90006j70601j12763K0720L07985B79636J38567j11641j2607j14482K623
17216A82096J76164K4239j2894J40895j85936J35234P1517A92973K26308m3464
$$ y = [213304, 499097, 119044, 410561, 359887, 352285, 335225, 491721, 135853, 95507, 101111, 218946, 123093, 423912, 178727, 144763, 421708, -241123, 435622, 107173, 248333, 528106, 431282, -72278, 183764, 261439, 203301, 577966, 311756, 613709, 147710, 386933, 185326, 428288, 298978, 120926, 497959, 645138, 574382, 430493, 319506, 413210, 444754, 156350, 414488, 615252, 292272, 229858, 524233, 536748, 446702, 293405, 672530, 434794, 423283, 339205, 106181, 532551, 98231, 428018, 574038, 690006, 519405, 406642, 427362, 735347, 279636, 418203, 306562, 293955, 179473, 182096, 358260, 382499, 369605, 510500, 324564, 459798, 531315, 192973, 419281, 375817]
17206C75817K512J25151K84175j91467A24858M15885B53244K48741A95008M77944
17196F72952A84993K15449M2820j0543A82251L38521J54051P4782l45713J27353
17186E31245A37007K42738J42454j62697O7883j17784K88386k38665q42N14661
17176H73141m19871j24807R3282K68476l35140j16420p840M08090j60031p5186
17166D03694A92481K8994L59098R7852l2015l17639L37303j67355j72356N11742
17156H38105l15914j3803J6374G0786K94309m80J09782N7706j31605L06935j51811
17145E55622B13370L07181q3588j88805M22390k41358j27390M37116j85823j18807
17135D34286M01200k38076J0988k55335J41894J59873m2472R618J95618j73857
$$ y = [375817, 378329, 503480, 787655, 596188, 124858, 540743, 253244, 501985, 195008, 672952, 184993, 400442, 443262, 432719, 182251, 520772, 674823, 749605, 403892, 531245, 137007, 379745, 522199, 359502, 427385, 309601, 597987, 359322, 358480, 873141, 453270, 328463, 421745, 690221, 355081, 238661, 230821, 638911, 478880, 403694, 192481, 221475, 580573, 678425, 646410, 328771, 666074, 498719, 326363, 838105, 522191, 508388, 524762, 70786, 365095, 364615, 474397, 532103, 400498, 707433, 555622, 213370, 520551, 436963, 248158, 670548, 429190, 301800, 738916, 553093, 434286, 835486, 597410, 608398, 353063, 494957, 654830, 612358, 621976, 817594, 643737]
17125F43737k2247K20393j31576j39834J19837J1885k89382J25779K33384l25901
17115D46075L646M30442K87139n42707n0029R6500O5491j05891J854J59000j10815
17104F80705j13438M4200j50577L88212j01225j11602L145K68708l25956m337
17094E77835n8273J65302P4048l39483N33169j20498P916j20456j74156Q4941
17084F30345M41393j79048j3349r8356M3987N9160j37283k34815K39509L4781
17074G86324q6006J02000l1926l56818N03373l38646K90564l5627N6176j34469
17064G54945J3385j65861J87620k05161J80950m9578J36381K78609l27514K96578
17054A100354k60979m7844J39834l39593L24771j37044M8347j80558J10903K30845
$$ y = [643737, 621490, 841883, 710307, 570473, 690310, 702195, 412813, 538592, 771976, 446075, 449721, 880163, 1167302, 624595, 574566, 671066, 736557, 630666, 632520, 791520, 680705, 567267, 611467, 460890, 849102, 747877, 636275, 639420, 908128, 582172, 577835, 519562, 684864, 758912, 419429, 952598, 832100, 840016, 719560, 545404, 630345, 1071738, 892690, 879341, 780985, 824972, 884132, 746849, 512034, 751543, 786324, 700318, 802318, 770392, 413574, 916947, 578301, 868865, 833238, 889414, 754945, 768330, 602469, 790089, 584928, 765878, 716300, 852681, 1131290, 803776, 1100354, 839375, 791531, 931365, 591772, 916543, 779499, 827846, 647288, 758191, 989036]
17044I89036P458j65184N9384J64486j22290j2707q7373L6842L36j6584N3J61844
17032A015301D32853N15530m08153K53842J80962J72852q1719j47129J29948o8112
17022I80874J61623k77446J72022k39148K60758k10353J27039J98199n2940l01917
17012H18711K65895K4396j92388M01666k06652l10289J65470J79668m4537J08478
17002A210418j70547K52683q507j27636J2089K0475K21039j3576l03290K83721
16992A376869k8936o16343R8961L77391J37964M050l55579L71845J87136m82031
16982A071327k2608M42100R5228k39363j98322K48289L912o3245l5641K9334r2236
16971A238775J73755n2521J58904l18419J94094J79314J73650l25761N6229L03035
$$ y = [989036, 996494, 831310, 890694, 1055180, 932890, 920183, 832810, 869652, 869988, 853404, 853457, 1015301, 432853, 948383, 540230, 794072, 975034, 1147886, 1066167, 919038, 1048986, 980874, 1142497, 865051, 1037073, 797925, 1058683, 848330, 975369, 1173568, 1120628, 818711, 1084606, 1109002, 916614, 1318280, 1111628, 801339, 966809, 1146477, 1101940, 1210418, 1039871, 1292554, 1284047, 1156411, 1168500, 1188975, 1410014, 1396438, 1093148, 1376869, 1347933, 731590, 830551, 1207942, 1345906, 1349956, 994377, 1366222, 1553358, 1071327, 1048719, 1490819, 1586047, 1346684, 1148362, 1396651, 1400563, 1337318, 1301677, 1331011, 1238775, 1412530, 1360009, 1518913, 1200494, 1394588, 1573902, 1747552, 1421791, 1478020, 1781055]
16961A781055q6557L8852j244l48128K29240q3891j03005J97948j60336Q8751
16951A552685L06212j88673L99353j10784k54570K38692m66631o8127K79315K94169
16941A981641k81201q2741j8337K87694Q6092l1017k47773K13317Q130j30366
16931A785439K32173j15659j50213K44974K06538m28536N33173l15016m2569Q8746
16921B039050J65214J06257k49453J47903k40763J54348j26358L75961n6035j59094
16911B157030O4169J83824J43629j26226o3177L4244k4919J01992J41366J41311
16901B753243k24834M6422K42666p7920J21174n1451q5511n7571J97581j0066
16891B853733j57771L76766j16066l75997K93491M45663l25415K31941m11290
$$ y = [1781055, 1694498, 1733350, 1732106, 1383978, 1613218, 1529327, 1426322, 1624270, 1463934, 1552685, 1858897, 1670224, 2069577, 1958793, 1704223, 1942915, 1476284, 1408157, 1687472, 1981641, 1700440, 1617699, 1599362, 1887056, 1973148, 1942131, 1694358, 1907675, 1915805, 1785439, 2017612, 1901953, 1751740, 1996714, 2203252, 1774716, 2307889, 1992873, 1950304, 2039050, 2204264, 2310521, 2061068, 2208971, 1968208, 2122556, 1996198, 2372159, 2316124, 2157030, 2221199, 2405023, 2548652, 2422426, 2359249, 2393493, 2368574, 2470566, 2611932, 2753243, 2528409, 2574831, 2817497, 2739577, 2860751, 2809300, 2723789, 2666218, 2863799, 2853733, 2695962, 3072728, 2956662, 2580665, 2874156, 3319819, 2994404, 3226345, 2815055]
16882B815055N03908k02976J53146k4162j36887K56213j62000J64360J92292J00950
16872C659899K21301k02095K4196L33750k55127j20866K21079L17016k03631n07018
16862C488504O00270N3886j13340K55711j23885M4718N7535K63350j90287o0604
16852D275858L23955K33039J3966J36744l72775J04163K73323J18002J612j33317
16842D974570j330L92979j57444J41761R9803R7093J29348J68538j08854K9961
16832E766425L67170j50007K53503k1191K34761J79061n8720O3481L9174M16011
16822G089668J37538p9890K17380k6162N06695k21243M40060j21267L92518m5463
16812H289834J84853O6783J49795r2805M49650M16855K55268O3350j15330M09501
$$ y = [2815055, 3318963, 3115987, 3269133, 3244971, 3108084, 3364297, 3202297, 3366657, 3558949, 3659899, 3881200, 3679105, 3703301, 4037051, 3781924, 3661058, 3882137, 4199153, 3995522, 3488504, 4088774, 4142660, 4029320, 4285031, 4161146, 4205864, 4263399, 4526749, 4336462, 4275858, 4599813, 4832852, 4846818, 4983562, 4610787, 4714950, 4988273, 5106275, 5107887, 4974570, 4973240, 5366219, 5208775, 5350536, 5450339, 5547432, 5676780, 5845318, 5736464, 5766425, 6133595, 5983588, 6237091, 6215900, 6450661, 6629722, 6571002, 6634483, 6673657, 7089668, 7227206, 7147316, 7364696, 7338534, 7845229, 7623986, 8064046, 7942779, 8335297, 8289834, 8474687, 8541470, 8691265, 8598460, 9048110, 9464965, 9720233, 9783583, 9668253, 10077754]
16802A0077754L884J64540K66221R5560J26417P26060R0951o5088K91602O50704
16792A2428605K9231K39199L93478L59594k4093M22567n984M95128Q43683L46245
16782A5527653j26702M36820M45449N46785K78709M07971N56964J93728N14187
16773A8781564Q59881L00700P15631J42820R46831M13772J067605M13814P40608
16764B4383226P54491O37397R44961L68642R13845P99015R85914J292197O84587
16755C1764275Q04025J182389R76329J646404J110516J089003J418967J306296
16747D1298204J010070J792803J616633J659101J730039J821863J991125J413708
16739E4333546J869940K198771K178283K396465K262206K062316K430176K714936
$$ y = [10077754, 10081638, 10246178, 10512399, 10607959, 10734376, 11460436, 11551387, 11486299, 11777901, 12428605, 12457836, 12697035, 13090513, 13450107, 13426014, 13848581, 13842597, 14337725, 15181408, 15527653, 15400951, 15837771, 16283220, 16830005, 17108714, 17516685, 18073649, 18267377, 18781564, 19641445, 19942145, 20657776, 20800596, 21747427, 22161199, 23228804, 23642618, 24383226, 25137717, 25775114, 26720075, 27088717, 28002562, 28801577, 29787491, 31079688, 31764275, 32568300, 33750689, 34727018, 36373422, 37483938, 38572941, 39991908, 41298204, 42308274, 44101077, 45717710, 47376811, 49106850, 50928713, 52919838, 54333546, 56203486, 58402257, 60580540, 62977005, 65239211, 67301527, 69731703, 72446639]
16731G2446639K413816K835945K526813K979805K681275K543871L138360L177382
16723I4743906K539940L144453K487651K730865K884470K722769K305384K195327
16715A15754765K142786J418220J635118J587184N04047R50283M34895J75350
16707A24602648j19255n69486q35529j203321j412116j877876j597231k508949
16699A14478885k343672k158176k681466k957518k939830k502941l275425k734205
16691I2885652l234675l040638k719881l028478k768035k556058l190543k303168
16683G0044176k684626k221591k510146k480908k041152j961058j928575k267541
16675E1948579j666123j877248j904611j502412j780062j432381j318560j671483
$$ y = [72446639, 74860455, 77696400, 80223213, 83203018, 85884293, 88428164, 91566524, 94743906, 97283846, 100428299, 102915950, 105646815, 108531285, 111254054, 113559438, 115754765, 117897551, 119315771, 120950889, 122538073, 123042120, 123992403, 124427298, 124602648, 124483393, 123913907, 123078378, 121875057, 120462941, 118585065, 116987834, 114478885, 112135213, 109977037, 107295571, 104338053, 101398223, 98895282, 95619857, 92885652, 89650977, 86610339, 83890458, 80861980, 78093945, 75537887, 72347344, 70044176, 67359550, 65137959, 62627813, 60146905, 58105753, 56144695, 54216120, 51948579, 50282456, 48405208, 46500597, 44998185, 43218123, 41785742, 40467182, 38795699]
16667C8795699j257433j046977j406160j143094j133233r34092r91606q96126
16659B9986978r41930j258376n18917p46039j086463o06700q39017n30562r35142
16650B2523832o93196k69533o71207q09709m78013n38269k43538p36993k36495
16641A7846879p78654m36735m78898k09387n29970m19282m52897l40900J3332
16632A4213488l40861n11320j54966n67506k09813J2653m57097j18298m06997
16623A1459283j16326k99864k19078k56732m36247k22752O8277j47138o54472
16614I174951M7635j27209j79655P8103n65900K08500l59900L27k82016J87639
16604H182475o86739p9559k1885m54925K36751j10226j63498k84214K27794n06139
$$ y = [38795699, 37538266, 36491289, 35085129, 33942035, 32808802, 31874710, 30883104, 29986978, 29045048, 27786672, 27267755, 26521716, 25435253, 24828553, 23989536, 23458974, 22523832, 21830636, 21561103, 20889896, 20080187, 19602174, 19063905, 18820367, 18083374, 17846879, 17068225, 16631490, 16152592, 15943205, 15413235, 14993953, 14541056, 14200156, 14213488, 13872627, 13361307, 13206341, 12638835, 12429022, 12441675, 11984578, 11866280, 11459283, 11342957, 11043093, 10824015, 10567283, 10131036, 9908284, 9976561, 9829423, 9174951, 9222586, 9095377, 8915722, 8993825, 8427925, 8636425, 8276525, 8276852, 7994836, 8182475, 7495736, 7416177, 7394292, 6939367, 7176118, 7065892, 6902394, 6618180, 6845974, 6339835]
16594F339835L02180k92004K66678n67844j69480L79088n2462l16752j39090k31648
16584E518501J55093l25586j45369M03993p45242Q8769k1391J7336j04881j1060
16574D830163j70422l8175J55617k0096m30539L8948K23735r2866m40901J25265
16564D180729m49112J01254M83026m22895l0605q4907O8518K0540l40223K20183
16554C746508j18140J42563k23436J01105r0964k78168j40467m1401K32487j99875
16544C130212j53222K43775k1900j71449k26560K59138r2010j8061Q5510j37139
16534B898294m9706j09158j72648J60198J37678R9796n9042p0429j70529j06168
16524B558286o5568j98918M12140k79951J00496R3023j15598O7743p7702j94708
$$ y = [6339835, 6642015, 6350011, 6616689, 6048845, 5879365, 6258453, 6205991, 5889239, 5750149, 5518501, 5673594, 5348008, 5202639, 5606632, 4861390, 4950159, 4928768, 4946104, 4841223, 4830163, 4659741, 4621566, 4777183, 4757087, 4326548, 4365496, 4589231, 4496365, 4055464, 4180729, 3731617, 3832871, 4315897, 3893002, 3862397, 3777490, 3846008, 3866548, 3526325, 3746508, 3628368, 3770931, 3547495, 3648600, 3557636, 3279468, 3139001, 3097600, 3330087, 3130212, 2976990, 3220765, 3198865, 3027416, 2800856, 3059994, 2967984, 2949923, 3035433, 2898294, 2848588, 2739430, 2566782, 2726980, 2864658, 2964454, 2905412, 2834983, 2664454, 2558286, 2492718, 2293800, 2705940, 2425989, 2526485, 2619508, 2503910, 2571653, 2493951, 2299243]
16514B299243K0241j72k30182J42975m1259J31619j20814J6514J55862l09894
16504B064133o8612j26701J59585j93117J76806j47583J79117j66627j22204n0222
16494A704575M63940k63189P129l41283L77819j67506k2824o721j80639K31531
16484A802832k9323j50793J82003m4478J46058j90637k36212n003J60168K45988
16474A880603m47592L03313k41874P8746K0326k52148K91068j39711l11785L70904
16464A551850j24982j31152K17149K87256n42352J19697J19803M3222k02623J49747
16454A487615m06877J67462q691n4958L42215m01398M26809m21068J70032l89657
16444I11484R5627K28475j77253k1757K35845J32035j57253M7225m05216L85015
$$ y = [2299243, 2319484, 2319312, 2089130, 2232105, 2190846, 2322465, 2201651, 2218165, 2374027, 2064133, 1995521, 1868820, 2028405, 1835288, 2012094, 1864511, 2043628, 1877001, 1754797, 1704575, 2168515, 1905326, 1912455, 1571172, 1948991, 1781485, 1758661, 1751940, 1571301, 1802832, 1773509, 1622716, 1804719, 1760241, 1906299, 1715662, 1479450, 1474447, 1634615, 1880603, 1433011, 1736324, 1494450, 1573196, 1593522, 1341374, 1632442, 1492731, 1180946, 1551850, 1426868, 1295716, 1512865, 1800121, 1257769, 1377466, 1497269, 1540491, 1337868, 1487615, 1080738, 1248200, 1239509, 1184551, 1526766, 1125368, 1552177, 1131109, 1301141, 911484, 1007111, 1235586, 1058333, 1036576, 1272421, 1404456, 1247203, 1294428, 889212, 1274227]
16434A274227r7571l8755J9735k26467K75052J9422k57064K29605k55440J44991
16424A087735k84770J90799l8962J4766L39981q9203n36284L06479O2328j64616
16414H88253J04598J32757j98966K6132K12776q5878k78795K12938R8827J63470
16404A276112k07834J83780m80426J49756k23442M56797l48259M5514k14102K74929
16394I12825K3647l1868L9979r8646j01484J09786J32236M6047j11018j03611
16384H17893L6145r8449J63474M1488l62572J82240j51757L5994J48540j60857
16374F52139R3129J26177l31319O3719K48453l7485j16994J79684Q0267j91087
16364G66683j28249r311L18822l32040j76140M13348k27483J93594Q2090J31576
$$ y = [1274227, 1176656, 1137901, 1157636, 931169, 1206221, 1225643, 968579, 1198184, 942744, 1087735, 802965, 993764, 954802, 969568, 1309549, 1220346, 684062, 990541, 1052869, 888253, 992851, 1125608, 926642, 952774, 1165550, 1079672, 800877, 1013815, 1112642, 1276112, 1068278, 1252058, 771632, 921388, 697946, 1154743, 806484, 851998, 637896, 912825, 936472, 904604, 944583, 845937, 744453, 854239, 986475, 1032522, 921504, 817893, 854038, 755589, 919063, 960551, 597979, 780219, 628462, 664456, 812996, 652139, 745268, 871445, 540126, 603845, 852298, 814813, 697819, 877503, 957770, 766683, 638434, 629123, 947945, 615905, 439765, 853113, 625630, 819224, 901314, 1032890]
16354A032890k93036K6422j79538J07885K60762k15950K2839m1859C39154L51403
16344F90557l7427L6233l519k58796J79401J60182K33442l57739J62261k62967
16334E41628L36046j6170L2115k13376N0592k73605K66822k07508L0193J77529
16324G24266k21446K7857m7931N907J27333o9192l0136j00048K41888q7377K6450
16313E97571k32010M39528l36343J46929J08153j11059j97976K54330J17528B69082
16302H57206m08462J30173k62507L78592k29175p5259j25770J74780R4468K879
16292E36925k4608j67518J91238A51388J63620L75929P733G3009M65766J21221
16282F59996B23102K77551I5260M99686J40941C37120A00296L46052M3924r5906
$$ y = [1032890, 739854, 766276, 586738, 694623, 955385, 739435, 762274, 720415, 339154, 690557, 653130, 689363, 685844, 427048, 606449, 766631, 1000073, 642334, 804595, 541628, 877674, 861504, 893619, 680243, 730835, 457230, 724052, 516544, 546737, 724266, 502820, 530677, 482746, 488653, 615986, 546794, 516658, 416610, 658498, 571121, 597571, 365561, 805089, 468746, 615675, 723828, 612769, 414793, 669123, 786651, 269082, 857206, 448744, 578917, 316410, 695002, 465827, 390568, 264798, 439578, 534046, 536925, 512317, 344799, 536037, 151388, 315008, 690937, 698670, 73009, 538775, 659996, 223102, 500653, 95260, 594946, 735887, 337120, 100296, 446348, 490272, 394366]
16272C94366M45770l26971k20636M7689K08882o9430J92187L325r5598l6650J26715
16261F69649C34230j19532n3420K16697q0814L23560B67374J19405q5264J82603
16251D84118B36638L31561P5486K32105D28882K9270r0657M63274B43361k5745
16241B17616M9828L95344k20170p1832j6671J5631q2273Q2330j27974K45906A65067
16229C41363j23188K8875K01340p1907J09661D6431L72765K1250j32232L8805
16219C47019j18628M5159K8805A22554E434M57343R4229k01018K94O5413j15359
16208C06336j34126M3696G3262L66020l5567o5517j34106p9545K68561j0396j88610
16197A94102m1353J94473n7023o0830N1700o6925A401L75230j14296c5117D47263
$$ y = [394366, 840136, 513165, 292529, 340218, 549100, 479670, 671857, 675182, 579584, 542934, 669649, 334230, 214698, 161278, 377975, 297161, 620721, 267374, 386779, 301515, 484118, 236638, 568199, 643685, 875790, 428882, 458152, 367495, 830769, 243361, 217616, 267444, 662788, 442618, 370786, 354115, 369746, 287473, 369803, 241829, 487735, 165067, 341363, 218175, 247050, 448390, 376483, 486144, 46431, 419196, 440446, 308214, 347019, 228391, 273550, 302355, 122554, 5434, 462777, 557006, 355988, 356282, 421695, 306336, 172210, 215906, 73262, 439282, 403715, 338198, 204092, 124547, 393108, 382712, 194102, 152749, 347222, 290199, 229369, 281069, 214144, 1401, 376631, 262335, -35117, 447263]
16185D07395n2289R8483A73334K24037J22807k42729H6601R5832q012K32377j65483
16174B41315A12053D4297a7261B30359K1011j11174o364J63190J06228J4737Q5825
16163E03812p2847j09747H0192P6097M0552J77267G7320J12275M7276r5134F3293
16151A48926m8123A6330L08220K63464D7223K25726j02412a56220H7845d1265
16140A12683B1508a2458A13179J51821c8036B287K28295l8255j8005F1030N43425
16129F04455j34210B27467K6882e5557b0014B06661L17686B05935K28323N1170
16119D85428G4401J48985K24763A97371l6645a27905E7562J0727K44409F1821
16108D1834L083J28800B3366J73953q9847O3305K10155C8554K51921L40475B1313
$$ y = [407395, 355106, 453589, 173334, 397371, 520178, 277449, 86601, 182433, 174421, 406798, 241315, 112053, 44297, -17261, 230359, 251370, 140196, 133832, 297022, 403250, 417987, 503812, 430965, 321218, 80192, 156289, 196841, 374108, 77320, 189595, 236871, 141737, 63293, 148926, 100803, 16330, 324550, 588014, 47223, 272949, 170537, -156220, 87845, -41265, 112683, 21508, -12458, 113179, 265000, -38036, 2287, 230582, 192327, 174322, 61030, 604455, 470245, 227467, 254349, -55557, -20014, 206661, 524347, 205935, 434258, 485428, 74401, 223386, 448149, 197371, 160726, -127905, 57562, 68289, 312698, 61821, 41834, 44917, 173717, 23366, 197319, 107472, 170777, 380932, 38554, 290475, 630950, 21313]
16096b06084A21091R7595E2097J21602p3531K2900A9882a17142A50220J62896
16086C13116E7669J20002p7904B9433N5268R4449R6500E5085j5321J94852j09753
16075A24863F2377K20705j10879o1848k4013f1870H7075c0518G3757J01437L13288
16064D88482c6261E5958a92505F8427N7735N362j4004b05949N6535k7020C48245
16052F47520C6082J2765N0385K82411j65764q6423J5307h4904D03081F1972J31325
16041A93297i4257D6092J04797K3201K20363j84443a61057B50811j13258a62621
16030G4024K408J20407m9528K29667j34025A2851P2220J4826b34891D6432J21625
16019A68057m5862g9449A42887i7309j45693E38850C6630b92341J08449C53616
$$ y = [-206084, 121091, 218686, 52097, 173699, 100168, 123068, 19882, -117142, 150220, 313116, 57669, 177671, 99767, 29433, 84701, 179150, 275650, 55085, 39764, 234616, 124863, 62377, 283082, 172203, 110355, 86342, -61870, 87075, -30518, 73757, 175194, 488482, -36261, 55958, -192505, 68427, 126162, 131524, 117520, -205949, -149414, -176434, 348245, 647520, 36082, 48847, 99232, 381643, 215879, 129456, 144763, -84904, 403081, 61972, 193297, -94257, 46092, 150889, 174090, 394453, 210010, -161057, 250811, 137553, -162621, 74024, 76432, 196839, 147311, 376978, 242953, 12851, 85071, 99897, -234891, 46432, 168057, 122195, -79449, 142887, -97309, -243002, 538850, 36630, -292341, -183892, 353616]
16008H4232k7430K16887D3035b93195I0823K0362Q8119J14800a53992A63805a21838
15996a56543C28812g2140o3567J5987c8253A82965g1859o6055H9264L7141e389
15984D18946A17509d2326G6424a7482A30108M373a87447P2095A62203K11302A61745
15972F67395j41747L09178q4122J44626J49624l28400J25959l07669j67634J1854
15962C79064D3286J91354J8823a21043j23358I1116b9348C3596c1845n6253A91818
15950i039A72506d994k84574C39567j67615L150q6671h508G0791N8205n3817b35384
15937B15264b8993l27247a10639C61154j00316r7332C3193J72477F0150A6702
15926i5334c9091J162A87290A5377a32135O1732L3636B37772A2318a23901L1563
$$ y = [84232, 56802, 273689, 43035, -293195, 90823, 111185, 199304, 314104, -153992, 163805, -121838, -156543, 328812, -72140, -135707, -119720, -38253, 182965, -71859, -137914, 89264, 126405, -5389, 418946, 117509, -42326, 76424, -17482, 130108, 134481, -187447, -115352, 162203, 373505, 161745, 667395, 525648, 834826, 750704, 895330, 1044954, 716554, 842513, 534844, 367210, 379064, 43286, 234640, 253463, -121043, -244401, 91116, -29348, 33596, -31845, -88098, 191818, -9039, 172506, -4994, -289568, 339567, 171952, 175102, 88431, -8508, 70791, 128996, 75179, -235384, 215264, -28993, -356240, -110639, 361154, 260838, 163506, 33193, 205670, 60150, 16702, -95334, -39091, -37929, 187290, 15377, -132135, -70403, -36767, 237772, 12318, -123901, -92338]
15915i2338d951l05362F1108O7986b2903B18904a03564C3068R0422A1691b93194
15903a80074M1018A48614d9885A68391b27603N9872A42132a21300C56156A22389
15892B29J70209e5451G8949d7881B51266a04074A6075L26384f5571r4654A26497
15880A1995f0831d961B21853I0622Q7278A6065m005a00658b5933k2316m1649A84998
15867d0636j99024C28734e2313j93213B874f6874j80123P1707c2403n0321B57393
15855A7665b12592A36731c7403j14523F2008g8231A46396j1624j529b32066B33910
15843B14780d2275q1298C4508a93313F1495a8424p9194l015F4622M38099A29088
15831I8101J37342I8937A1924h1055k6609M9980C865e6179A2300a60261I5458
$$ y = [-92338, -4951, -310313, 61108, 129094, -22903, 218904, -103564, 33068, 123490, 11691, -293194, -180074, -139056, 148614, -49885, 168391, -227603, -167731, 142132, -121300, 356156, 122389, 229, 170438, -55451, 78949, -47881, 251266, -104074, 16075, 342459, -65571, -160225, 126497, 11995, -60831, -4961, 221853, 90622, 177900, 16065, 12060, -100658, -25933, -48249, -89898, 184998, -40636, -239660, 328734, -52313, -245526, 2874, -66874, -246997, -175290, -32403, -82724, 257393, 17665, -212592, 136731, -37403, -151926, 62008, -78231, 146396, 134772, 133243, -232066, 233910, 214780, -42275, -123573, 34508, -193313, 61495, -18424, -97618, -100633, 64622, 502721, 129088, 98101, 235443, 98937, 11924, -81055, -107664, -57684, 3865, -56179, 12300, -160261, 95458]
15819b40977J8767e8287D7581J4122b66945A59875a06971I5914a29613r142c7811
15807b0122H0190b32522P0552N8170B67937J13226a80945c8453a114o803A64583
15795b68350J11201A71460a75242g3457b7787j50558k49193A92173E2075O2183
15785A14258a53500d3134C0540a2275q6535b6608j19266F840i5359i853B62549
15773c01567O3783j2460a18961A29796i1283F8645g5936G1998i4710d1841m9459
15762i1300A06454b57843c252k18013n4529a29693A14034a51348A93063A9739
15751D6039f3520A62700n0431b02014A13590K4877F2387j9158M81119q6470j76338
15740B61540a10718p1879i0394B24516i8379B77704b21192G2979b91678e9435
$$ y = [-240977, -222210, -58287, 47581, 61703, -266945, 159875, -106971, 95914, -129613, -138755, -37811, -20122, 80190, -232522, -161970, -103800, 267937, 381163, -180945, -38453, -1114, -7917, 164583, -268350, -157149, 171460, -175242, -73457, -27787, -178345, -427538, 192173, 52075, 114258, -153500, -43134, 30540, -12275, -98810, -26608, -145874, 6840, -95359, -9853, 262549, -301567, -237784, -250244, -118961, 129796, -91283, 68645, -75936, 71998, -94710, -41841, -91300, 106454, -257843, -3252, -221265, -275794, -129693, 114034, -151348, 193063, 19739, 46039, -63520, 162700, 112269, -202014, 113590, 138467, 62387, 43229, 524348, 437878, 261540, -110718, -182597, -90394, 224516, -98379, 277704, -221192, 72979, -291678, -59435]
15729c1975j61307D2321K08202A07102a24074A62649b40783e8046n9786j54081
15719b71913A43857k8813b43630G5757C7435K5074a23366E7735c54881A76428
15708c8449A62580A1130f8902f299D33092H8759d17017a4901F4067Q9321E9291
15696a78744e4556k24546B56080c0558G1150K44490d996k08608m3484a20016B35088
15684A24908C0062a76341j65833B13397a39890m2395D4752c085o3274k70787B11861
15672c0316j67164A02902L2553m8634a68254f0892a7141A24249b6406D1161J8047
15661E9208J4765h7056D1654b5139C3523J32418F8087e5040p4771a8337n9711
15650g8048B1153a10475A48825h5485B9975K68431a42187L695l0835j09656i7503
$$ y = [-31975, -193282, 42321, 250523, 107102, -124074, 162649, -240783, -58046, -117832, -271913, 143857, 115044, -243630, 75757, 37435, 62509, -123366, 57735, -354881, 176428, -38449, 162580, 11130, -68902, -6299, 433092, 88759, -417017, -14901, 64067, 153388, 59291, -178744, -54556, -279102, 256080, -30558, 71150, 315640, -4996, -213604, -257088, -120016, 235088, 124908, 30062, -176341, -342174, 213397, -139890, -182285, 44752, -3085, -66359, -337146, 211861, -30316, -197480, 102902, 135455, 86821, -168254, -60892, -17141, 124249, -26406, 41161, 59208, 73973, -87056, 41654, -25139, 33523, 165941, 68087, -55040, -129811, -18337, -78048, 21153, -110475, 148825, -85485, 29975, 298406, -142187, -138492, -169327, -278983, -97503]
15638C9379D626O4719J3031J7673b48389a11220n1804e9791j07687A62913b09099
15626b21918j44664E92700a1746j83977A00610E977c22907d4010J0588H1812A4984
15614B17207b99689B383J84355k7344g7534A73897E0907d2012k01292o380J06581
15603a43103D8130d6478k14820h3765H371L86671j26572b99596a43753H2762M7550
15592A30312H803O5466P8094K45292g7917j86725E6232b66433J30359F4366a18385
15580b87299a9759A97942D4864f0718H063a87206A07633b002k52069f0074A49256
15568a82260G3642i3852d4812E65444A4519J76040m6506c03771a39208C8570J82235
15557B20805a4397p7768j39348D5102M2754B8629N0506b53824i7206L2412E6938
$$ y = [39379, 4626, 69345, 82376, 100049, -248389, -111220, -163024, -59791, -167478, 162913, -209099, -221918, -366582, 592700, -11746, -195723, 100610, 5977, -322907, -44010, -33422, 81812, 14984, 217207, -299689, 2383, 186738, 159394, -77534, 173897, 50907, -42012, -243304, -249684, -143103, 48130, -46478, -261298, -83765, 8371, 395042, 268470, -299596, -143753, 82762, 130312, 8803, 74269, 152363, 397655, -77917, -264642, 56232, -266433, -136074, 64366, -118385, -287299, -19759, 197942, 44864, -60718, 8063, -187206, 107633, -2002, -254071, -60074, 149256, -182260, 73642, -93852, -44812, 565444, 14519, 190559, 144053, -303771, -139208, 38570, 220805, -14397, -92165, -231513, 45102, 87856, 28629, 79135, -253824, -97206, -64794, 56938]
15545A50881c0489B89097q2084b07082n4707F1030c07085J00621Q7904A66780
15534G8315J28249b05250R8097E9864J60249r4965b79165B51357j21600K40908
15524C70665b8591b572D4083Q8417J33446a53527j50718B34143a88129A79891
15513e1732C02102o4254e2954j05949A13480d1285L682A35825O1286A489a02042
15501a3000D68069A1441K05625k5465G3714A7296K88528q9108R9877j51211l0962
15490A34420K2681J01250m3445H7727L9848O134R9306o9825A8975Q6357J07648
15479B12980b5768A27616d5780A13586M0711P6476J81239A06331f2939B14619
15468C47674B8824P2611J4780K38190j69837m4168i5527C64886J52425J14649
$$ y = [150881, -30489, 289097, 207013, -207082, -261789, 61030, -307085, -206464, -118560, 166780, 78315, 206564, -205250, -107153, 59864, 220113, 125148, -279165, 251357, 129757, 370665, -28591, -2572, 44083, 132500, 265946, -153527, -304245, 234143, -188129, 179891, -51732, 302102, 237848, -52954, -158903, 113480, -41285, -37603, 135825, 197111, 1489, -102042, -13000, 468069, 11441, 217066, 191601, 73714, 17296, 305824, 216716, 316593, 165382, 134420, 157101, 258351, 214906, 87727, 127575, 133709, 233015, 163190, 18975, 105332, 212980, -25768, 127616, -45780, 113586, 154297, 230773, 412012, 106331, -62939, 214619, 347674, 28824, 101435, 116215, 354405, 184568, 140400, -95527, 364886, 517311, 631960]
15458F31960j72194K77867B78342Q1485A26654K79191j43309k1383e1131C77267
15447A76423k5858c8315n0853B58627c1249n2230J5473o6281f3627L978E0799
15435A99993j0523b0949C6400M26070A30204L19719k21668L17376j93245N12233
15425H64619M05518n10454j31088m9241m2843h020C79846A06980c39883E665J84788
15414A90453a30434b2767A15331j8865b30180D9436K51840B7056K43323d3186
15403d3995p5969A44187e7266A65458i7513k04415i9403D7710c08808A17919D870
15391A47208a58958H1274A4386E34b13752f6055R802k99920a52123C51170j38872
15380B12298b23515A35482O1306D8749J70680h8522F4009b1841k6927A0585K79139
$$ y = [631960, 459766, 737633, 278342, 359827, 126654, 405845, 262536, 241153, -51131, 377267, 176423, 150565, -38315, -89168, 258627, -31249, -83479, -68006, -134287, -63627, -59649, 50799, 199993, 189470, -20949, 36400, 462470, 130204, 449923, 228255, 545631, 352386, 864619, 1270137, 759683, 628595, 579354, 536511, -8020, 379846, 106980, -339883, 5665, 190453, -130434, -22767, 115331, 96466, -230180, 49436, 301276, 27056, 270379, -43186, -43995, -119964, 144187, -57266, 165458, -97513, -301928, -99403, 47710, -308808, 117919, 4870, 147208, -158958, 81274, 14386, 534, -213752, -66055, -56253, -356173, -152123, 351170, 212298, -223515, 135482, 196788, 48749, 219429, -88522, 64009, -21841, -48768, 10585, 289724]
15369B89724i5697B7357K44365H4636a37911A99089o0218a24281r3618C99332
15358C02530m2791j27695J48593I9822O1379b61151B45044j19292L63589A33326
15347H1822A3202g5534B33308p5388L3593m9522O2202J141a88936g5705B24322
15335C09145F6432K18405D1091M27314D7676K29761F0363M93100m7571n8095J92325
15324F40122k92133A53864J66523l155A26698A0434a02635A30498K53503I7531
15313B65999A15454C7181K87226J9150q0148k6042A0351J91249L84192A64419
15302A84263p1039L14937A15615a07661A34500h8437C7252L1400J4158K7917d5094
15290B11758g4999A77134m0271c4127A02449K3342r301K56090F7911J9584i669
$$ y = [289724, -95697, 27357, 271722, 84636, -137911, 199089, 138871, -124281, -217899, 399332, 302530, 259739, 132044, 280637, 99822, 161201, -261151, 245044, 125752, 489341, 133326, 81822, 13202, -75534, 233308, 157920, 191513, 141991, 204193, 205334, -188936, -75705, 224322, 309145, 66432, 284837, 41091, 468405, 47676, 277437, 60363, 553463, 505892, 447797, 640122, 347989, 153864, 320387, 317232, 126698, 10434, -102635, 130498, 384001, 97531, 265999, 115454, 37181, 324407, 343557, 263409, 237367, 10351, 201600, 585792, 164419, 184263, 113224, 428161, 115615, -107661, 134500, -88437, 37252, 68652, 82810, 110727, -45094, 211758, -74999, 177134, 136863, -34127, 102449, 125791, 116490, 372580, 67911, 87495, -9669]
15278A43865F9451J46565b43140F0513c8887B8362J50471m0883a50432O5996B45008
15266a51782c1532B720b1208k1548p7637C12952Q770a61521j92841B8058R363
15255C7421Q3616A1434L16710I671c47615A28656a34956j66510I2581a2920C020
15243c0760C37639k8872C5809J47345J39753m5066r3644q56l6649K58243D4724
15231C16754q541Q7708K46566B95354N48442P94373l33017K57500l01756l79011
15221H81885l11993B78023b5404B30970O429J2293A04745l9526k0922J38146p0897
15210A11546F744K54163c2930k31567H8512O922g4016B33866J31314I6435m2659
15199E3776J1448p042a20984d2424A18118c05520a30565B02497G9006e9764l6340
$$ y = [143865, 69451, 216016, -243140, 60513, -38887, 28362, 178833, 137950, -150432, -84436, 245008, -151782, -31532, 2720, -21208, -42756, -120393, 312952, 321722, -161521, -354362, 28058, 37421, 121037, 11434, 328144, 9671, -347615, 128656, -134956, -301466, 92581, -12920, 3020, -30760, 337639, 308767, 35809, 183154, 322907, 277841, 184197, 183341, 146692, 404935, 44724, 316754, 308213, 395921, 642487, 295354, 843796, 1638169, 1305152, 1562652, 1260896, 881885, 569892, 278023, -25404, 230970, 237399, 249692, 104745, 65219, 44297, 182443, 111546, 6744, 260907, -32930, -264497, 88512, 95434, -74016, 233866, 365180, 96435, 53776, 65224, 58182, -120984, -42424, 118118, -305520, -130565, 202497, 79006, -59764, -96104]
15188i6104C62234q7916b6584m3243A14242J89219j13802b8965n7090j41381A81614
15176C70922r661F1851J83071g8602B65378a4345B5653i2287O084b0563o7226
15165h7789H0523b6698C27915b67022A35327c061k38572E4690J24653H4653R0437
15154A75090c1752j15224A51986M7456b96503E7523K19500P5521A5203K05945
15144B21148P5293J70806A91548J36959j49405H6739K81248j69510o7858R586
15134A40205P9768k5335b84353B11702P3571a7429r4634C41238r1401F3012h845
15122B45521d948j75544N4442A01012R435J86306M9518o496n3042j34021f6149
15110a761B67791n7668Q5009J23673A91544K86031k8722j2688J55357j45522j85148
$$ y = [-96104, 362234, 274318, -26584, -69827, 114242, 303461, 189659, -28965, -86055, -227436, 181614, 370922, 361261, 61851, 244922, -78602, 265378, -14345, 25653, -92287, -86203, -20563, -87789, 80523, -26698, 327915, -267022, 135327, -3061, -241633, 54690, 179343, 84653, 175090, -31752, -146976, 151986, 199442, -296503, 57523, 277023, 352544, 15203, 221148, 296441, 467247, 191548, 328507, 179102, 86739, 367987, 198477, 130619, 140205, 219973, 194638, -284353, 211702, 285273, -17429, -112063, 341238, 249837, 63012, -8845, 245521, -4948, -180492, -126050, 101012, 110447, 296753, 346271, 339775, 286733, 152712, -66149, -1761, 267791, 210123, 295132, 418805, 191544, 477575, 448853, 436165, 591522, 446000, 260852]
15099B60852C7737J51938o7391b69915F9251M7675K84329A10217N1674C9177A1002
15087B59003r7371B7221i8370D44704J55987d0132B22164c7820F8340d9554C00969
15075A83029d38402B25777L53300b0878B38826O9680j16535M8605Q3176G7331
15064B49990m0673a18238C11679r7082g1334B38723R891m9640J46792A38031J6764
15053A54795J89373D9496K15489o1119b29655A97085P7333A8011J89965D5093
15042F2070M17223j07359A70619J50232H7630K90920P2065j17791K50973k14708
15032C69089J59738A56656J50739Q3541L5935A45165J63958J5382j54775J10217
15022B79947A39385o6818M60677j75802P7744j10380J01785M16609R6992C94802
$$ y = [260852, 37737, 189675, 122284, -269915, 69251, 116926, 401255, 110217, 161891, 39177, 11002, 259003, 161632, 27221, -98370, 444704, 600691, -40132, 222164, -37820, 68340, -49554, 300969, 183029, -438402, 225777, 579077, -20878, 238826, 308506, 191971, 240576, 323752, 77331, 249990, 209317, -118238, 311679, 214597, -71334, 238723, 248614, 198974, 345766, 138031, 154795, 344168, 49496, 264985, 203866, -229655, 197085, 274418, 18011, 207976, 45093, 62070, 479293, 371934, 170619, 320851, 87630, 378550, 450615, 332824, 583797, 369089, 528827, 156656, 307395, 390936, 426871, 145165, 309123, 324505, 169730, 279947, 139385, 72567, 533244, 357442, 435186, 324806, 426591, 843200, 940192, 394802]
15011F58964N4598k35740M3956R5601k28145J83013B30506N45446j84608M5833
15001F37177Q0436k69315J38143k57172r561A58023J58932J26369j04682Q3918
14991D22560P4728j85438j55855K91014j04576Q5910j72981M71464B74730J64256
14981D38986K80175k39929K4414J68r3827J92566Q0873N5990l67006O5464J22375
14970E60249J45519j4551j24645L0301O17264l50899J83047m42198l0691j88043
14960C85353K93606M4309M1819l30830M26372l16867k33194J82969J05799j18422
14950D80914O5920j41507M7600j83387N6038M6481j09060r1488M06223k19764
14940C57970n50j01239K10586Q3423A88784J14515J8143J45543J62228k55284
$$ y = [658964, 713562, 477822, 521778, 617379, 389234, 572247, 230506, 775952, 591344, 637177, 717613, 448298, 586441, 329269, 319708, 158023, 316955, 443324, 338642, 422560, 497288, 311850, 155995, 447009, 342433, 428343, 255362, 726826, 274730, 438986, 719161, 479232, 503646, 503814, 409987, 602553, 683426, 739416, 372410, 437874, 560249, 705768, 691217, 566572, 596873, 1214137, 863238, 1046285, 604087, 573396, 385353, 678959, 723268, 765087, 434257, 860629, 543762, 310568, 493537, 599336, 480914, 546834, 405327, 452927, 269540, 325578, 372059, 262999, 171511, 577734, 357970, 357420, 256181, 466767, 550190, 188784, 303299, 321442, 466985, 629213, 373929]
14930C73929L15105j77032J80803J50051R4294m20150J24921J00176j47672p0698
14920E23727J84887o6212K88078m6832K56574l02551K32615M61568k42885L74206
14910A663175Q3567J17732j8406m00583M40081k58378k4927M20949k13266O82483
14900B492427m78715J44348k59765o47922j30793j72220J06080r0524m29462J46616
14890F80070N4896k40563N3161k00096N6145Q187j50528L55664k20078K12541
14880F09399k14317M74566C87795L5367J36522L4575j72981N36236k14832k74453
14870D68229M94218D34611J81923L72799j98781Q166j33336p262J07807k52608
14860E13319K58655p5456J12599R7578l34453J60618k05422L07028l45600L13387
$$ y = [373929, 689034, 512002, 692805, 842856, 937150, 517000, 641921, 742097, 594425, 523727, 708614, 642402, 930480, 883648, 1140222, 837671, 1070286, 1531854, 1288969, 1663175, 1746742, 1864474, 1846068, 1445485, 1885566, 1627188, 1602261, 2023210, 1809944, 2492427, 2013712, 2158060, 1898295, 1250373, 1119580, 947360, 1053440, 962916, 533454, 680070, 734966, 494403, 547564, 347468, 403613, 411800, 261272, 616936, 396858, 609399, 395082, 869648, 387795, 423162, 559684, 594259, 421278, 957514, 742682, 468229, 962447, 434611, 616534, 989333, 790552, 798718, 665382, 658120, 765927, 513319, 771974, 696518, 809117, 906695, 572242, 732860, 527438, 834466, 488866, 802253]
14850H02253q8260J99206J5190j97808j52366k1717j45110L92760C9472P40133
14840G79605A53710L90981L0628L24441C41936J94503r5730M65411j55686j62773
14830E87661J60585J99981j27119J54009J8505K07977j0705Q1070l38625l60095
14820E73244L4763j07856K23123l17391M94510l09713Q1475j36565k3295M90581
14810A002876k32083j37969K16317k58664J08943j09315K7310n5174J84273N1972
14800G98486k1749k21094K19746L261M6800o752k52211P41681j83481q3460k63545
14789G77682J22954L7569J39045j76925q2455k31347j08897r93J36142j68837
14779D43938M30024k99903J6779j84729N6493K9281J32304m5006J59362l15269
$$ y = [802253, 713993, 913199, 928389, 730581, 578215, 556498, 411388, 804148, 39472, 779605, 153710, 544691, 575319, 899760, 341936, 536439, 440709, 906120, 750434, 587661, 748246, 948227, 821108, 975117, 993622, 1201599, 1190894, 1271964, 933339, 573244, 608007, 500151, 723274, 405883, 900393, 590680, 672155, 535590, 512295, 1002876, 770793, 632824, 849141, 590477, 699420, 590105, 617415, 562241, 746514, 798486, 776737, 555643, 775389, 778650, 825450, 818698, 566487, 1308168, 1124687, 1041227, 777682, 900636, 938205, 1077250, 900325, 817870, 586523, 477626, 476633, 612775, 443938, 873962, 574059, 590838, 406109, 462602, 491883, 624187, 579181, 738543, 423274]
14769D23274N15509k54253j82644L15224k77977j4077k1453L48373J7732K45128
14759A114836k68447K39356K61508l02420l12774Q5793r6817K90609k40432k34034
14749E37178L1578K33469J66621D47675L98266l18434J08360l3046m5560j77163
14739C80098K46419j2203J46578O4951j97196k2305J83391B74100M38170M2097
14729G54367J77681l91104M94803m10843K73958j10536L59160k43903j14171N1949
14719H41361N8213K20999p2941j52751L93463O3663K16841J79377l5694O5929
14709A778460k61901K786k73893k2763j67313j07691L42050j08982l55832J88174
14699A013095j16967M54267o59780K99011j38825P8058r6303J23518L45402j44951
$$ y = [423274, 938783, 684530, 501886, 817110, 539133, 525056, 503603, 851976, 869708, 1114836, 846389, 1085745, 1347253, 1044833, 732059, 817852, 721035, 1011644, 771212, 537178, 568756, 802225, 968846, 447675, 845941, 527507, 635867, 602821, 557261, 380098, 626517, 614314, 760892, 825843, 628647, 606342, 789733, 274100, 712270, 754367, 932048, 540944, 1035747, 624904, 898862, 788326, 1147486, 903583, 789412, 841361, 899574, 1120573, 1047632, 894881, 1288344, 1352007, 1568848, 1748225, 1712531, 1778460, 1516559, 1519345, 1245452, 1222689, 1055376, 947685, 1289735, 1180753, 824921, 1013095, 896128, 1350395, 690615, 989626, 850801, 928859, 832556, 956074, 1301476, 1156525]
14689A156525J86546N30015k23869o1810O97540m82276o2924k47146j6000j14625
14679A361976k04108j21567M98951k30944k09238O7550L2636m9289p1213r100
14669A065654J56535k81589K6946N0608R2637j15533R5056L0499j41480P5209
14659A054542K19567n25984M22673j96270j6567L9384J38740P113k38246L24699
14649A229651j93403k4638j38222M44968m79714J10732P1886j8896K10288j2979
14639A199673J2445P100L80320j52796K02314j20042n66162K62688k26667N49913
14629A548786p4139G17298Q28485n7534m9827O4465k09866O1632o0126j45499
14619A149028K4753k5829K31580P5026k68995J70388J5400L4465Q5293j90713
$$ y = [1156525, 1343071, 1873086, 1649217, 1587407, 2284947, 1802671, 1739747, 1492601, 1476601, 1361976, 1157868, 1036301, 1535252, 1304308, 1095070, 1162620, 1195256, 1145967, 1074754, 1065654, 1222189, 940600, 967546, 1018154, 1110791, 995258, 1090314, 1120813, 979333, 1054542, 1274109, 748125, 1170798, 974528, 957961, 997345, 1136085, 1143198, 904952, 1229651, 1036248, 1011610, 873388, 1318356, 838642, 949374, 1021260, 1002364, 1212652, 1199673, 1212118, 1219218, 1599538, 1446742, 1649056, 1529014, 962852, 1225540, 998873, 1548786, 1474647, 717298, 1545783, 1488249, 1438422, 1502887, 1293021, 1354653, 1294527, 1149028, 1173781, 1147952, 1379532, 1454558, 1185563, 1355951, 1371351, 1405816, 1491109, 1300396]
14609A300396L12663l19359J96240q8681J12280l52138L54669j12177M19500l45775
14599A477618q1834J27471k06425K64245K81566k26080K52909k89812J75486k87291
14589A487853k31162M86336l9084Q7016J8550R5770N391j98564J10015k43530
14579A578591m0828N32888l13995L06795o22436L44891L54225o2068n4207j20921
14569A902935Q9234J91619l71651K34835J64845j04483k22085J21900J00454O9855
14559B177458J12021j04939n3881J9235L03301j40979K34016l35915N92232j36115
14549B666434r865N40164q2922j95599K54561J27035j73882P8573L18560L21339
14539C844398J96700O08477P62697P35060J443277K133595L382864O725180J0993989
$$ y = [1300396, 1613059, 1293700, 1489940, 1401259, 1513539, 1161401, 1516070, 1403893, 1823393, 1477618, 1395784, 1523255, 1316830, 1581075, 1862641, 1636561, 1889470, 1599658, 1775144, 1487853, 1256691, 1743027, 1703943, 1790959, 1809509, 1905279, 1910670, 1712106, 1822121, 1578591, 1537763, 2070651, 1756656, 2063451, 1441015, 1785906, 2140131, 2078063, 2023856, 1902935, 1992169, 2183788, 1812137, 2046972, 2211817, 2107334, 1885249, 2007149, 2107603, 2177458, 2289479, 2184540, 2130659, 2149894, 2453195, 2312216, 2546232, 2210317, 2802549, 2666434, 2656569, 3196733, 3113811, 2918212, 3172773, 3299808, 3125926, 3204499, 3523059, 3844398, 4041098, 4649575, 5412272, 6147332, 7590609, 9724204, 13107068, 19832248, 30826237]
14530C0826237K265305j4247853p849478m043634j809475j152653j21735j81360
14522C685354Q49822M14766j125562r37585r5230m74066L29544N4158l24179L41337
14512B718359k38130L3446l91837M94258j12811N1190k62863M59317J71038j48197
14502B773770o8415p0439k28751M82048J23733j84087l871K15362j4296R3470
14492C118524k10079L70612m04019K88037L1926L57089n27649K73382m42606O39380
14482C494597r3886J50056l0445r9474K55957Q4648k47886R6776k4818J5710K44672
14471C845907m1398P5981N12658n55141L00651k33032O0740j71687L12924K59748
14461D367351p4678M06265n89435K42655L66483j76370J20681j9528l3796n3260
$$ y = [30826237, 33091542, 18843689, 10994211, 6950577, 5141102, 3988449, 3866714, 3685354, 4535176, 4949942, 3824380, 2886795, 2791565, 2317499, 2647043, 2701201, 2377022, 2718359, 2480229, 2513675, 2121838, 2616096, 2503285, 2554475, 2291612, 2750929, 2921967, 2773770, 2705355, 2634916, 2406165, 2888213, 3011946, 2827859, 2823988, 3039350, 3025054, 3118524, 2908445, 3279057, 2875038, 3163075, 3195001, 3552090, 3024441, 3297823, 2855217, 3494597, 3400711, 3550767, 3520322, 3420848, 3676805, 3761453, 3513567, 3610343, 3585525, 3601235, 3845907, 3804509, 3880490, 4393148, 3838007, 4138658, 3905626, 3966366, 3794679, 4107603, 4367351, 4292673, 4698938, 4109503, 4352158, 4718641, 4542271, 4662952, 4643424, 4609628, 4556368]
14451D556368L10318k54160R7326J87940r1859m2925L40921P8523k86951M86475
14441E381976k67757o5835K18979k2663J55478M40555N1783n8844r6939K37609
14431E974342l84838M15218K72590o003m90383M88998j2378M1852K43837J55154
14421F698389J5700J79542J27219j41209p4658L49457K89049j10975K81447J6616
14411G630577J63438J75827O8711L40722j12234L69533K22188l287m9042L42168
14401I148601k14038L27808j01622j51520L49201Q2681L76440J15716K55481J12997
14391A0301745K18870L40567J66371l0071j44276N5067M32602K11750N4533j96083
14381A1411075M47664M10599R1746Q5858J34098K59904L60894J58127L71900O7149
$$ y = [4556368, 4866686, 4612526, 4709852, 4897792, 4805933, 4763008, 5103929, 5182452, 4895501, 5381976, 5114219, 5048384, 5267363, 5244700, 5400178, 5840733, 5892516, 5833672, 5736733, 5974342, 5589504, 6004722, 6277312, 6271309, 5780926, 6269924, 6257546, 6299398, 6543235, 6698389, 6714089, 6893631, 7020850, 6879641, 6804983, 7154440, 7443489, 7332514, 7613961, 7630577, 7794015, 7969842, 8038553, 8379275, 8267041, 8636574, 8858762, 8855475, 8806433, 9148601, 8934563, 9262371, 9160749, 9009229, 9358430, 9441111, 9817551, 9933267, 10188748, 10301745, 10520615, 10861182, 11027553, 10997482, 10853206, 10908273, 11340875, 11552625, 11607158, 11411075, 11858739, 12269338, 12361084, 12446942, 12581040, 12840944, 13201838, 13359965, 13731865, 13799014]
14371A3799014M41373J0940N47706J09656K32990K83047O05126j0901N26138J11752
14361A6656841K07260K20015M60982K770P04234K64957N27010K51444R8024J073692
14351B0467229L13522M40539J88939O77544K50664K82153P42538J62567P64232
14342B4289927O65334P27697L09503N06967P44834P04083K97774J079202P42623
14333C0067944N47898P26852Q81398J178016P44970R65797R44051R06903J102926
14324C8066755Q05823J098618J136406J594146J131817J168620J648417J020278
14316D7670880J472431J620596J722159J431006J837231J939022K008305J932628
14308F1634258K120179K047654K679950K572518K104785K979581K585180L249013
$$ y = [13799014, 14240387, 14251327, 14799033, 14908689, 15141679, 15424726, 16029852, 16018951, 16545089, 16656841, 16864101, 17084116, 17545098, 17547868, 18252102, 18517059, 19044069, 19295513, 19393537, 20467229, 20780751, 21221290, 21410229, 22087773, 22338437, 22620590, 23363128, 23525695, 24289927, 24955261, 25682958, 25992461, 26499428, 27244262, 27948345, 28246119, 29325321, 30067944, 30615842, 31342694, 32224092, 33402108, 34147078, 35112875, 36056926, 36963829, 38066755, 38872578, 39971196, 41107602, 42701748, 43833565, 45002185, 46650602, 47670880, 49143311, 50763907, 52486066, 53917072, 55754303, 57693325, 59701630, 61634258, 63754437, 65802091, 68482041, 71054559, 73159344, 76138925, 78724105, 81973118]
14300H1973118K844378L164519L219034L825981M054011L889079M594003M224480
14292A11788603N558651M667408N199809N824433O269345O276082O920701O748490
14284A59253522P639086P761881Q318751R251332Q836692R805226J0469426J0866722
14276B32202638J1453475J1924013J2659260J2923511J3558318J2858377J4130580
14269C21710172J3821957J3495112J3621148J3340550J3001046J2607796J1498821
14262D13096602J1136429J0722281R149146P517789O018240L617551K666540K780301
14254D66704879l08757p079926o137777p202458q937654j0648082j1461180j2087430
14246D02841615j2923365j3673559j4225806j4483557j4235568j4366566j3386457
$$ y = [81973118, 84817496, 87982015, 91201049, 95027030, 99081041, 102970120, 107564123, 111788603, 117347254, 122014662, 127214471, 133038904, 139308249, 145584331, 152505032, 159253522, 166892608, 174654489, 182973240, 192224572, 201061264, 210866490, 221335916, 232202638, 243656113, 255580126, 268239386, 281162897, 294721215, 307579592, 321710172, 335532129, 349027241, 362648389, 375988939, 388989985, 401597781, 413096602, 424233031, 434955312, 444104458, 451622247, 457640487, 461258038, 463924578, 466704879, 466396122, 459316196, 453178419, 445975961, 437038307, 426390225, 414929045, 402841615, 389918250, 376244691, 362018885, 347535328, 333299760, 318933194, 305546737]
14239C05546737j3397029j3438990j4029447j4096846j2980212j2202731j1359582
14232B14041900r887056r980180r889703q641750q264381q177728p260116p103252
14224A44837734o839688o037331n680550n422173n092699m892068m727747m558560
14216A01586918l549519l899768l548509l756929l593960k899978k994689l172567
14208G4170999k541345k499127k323945k294882k149059k281162j741164k100127
14200E6240188j500022j847628j501217j444409j788356j336277j323851r31300
14192D4567128j301817j080133j457912j120557j137330r07192j057849p47681
14184C5756657j122625r77449p28197r95557n81866n24139j006211n50196j020218
$$ y = [305546737, 292149708, 278710718, 264681271, 250584425, 237604213, 225401482, 214041900, 204154844, 194174664, 184284961, 175643211, 167378830, 159201102, 151940986, 144837734, 137998046, 131960715, 126280165, 120857992, 115765293, 110873225, 106145478, 101586918, 98037399, 94137631, 90589122, 86832193, 83238233, 80338255, 77343566, 74170999, 71629654, 69130527, 66806582, 64511700, 62362641, 60081479, 58340315, 56240188, 54740166, 52892538, 51391321, 49946912, 48158556, 46822279, 45498428, 44567128, 43265311, 42185178, 40727266, 39606709, 38469379, 37562187, 36504338, 35756657, 34634032, 33656583, 32928386, 31932829, 31350963, 30826824, 29820613, 29270417, 28250199]
14175B8250199m49303p84397m02748r83783l86505n35823k11930q84272p06406
14166B2905032m50405l88747l86600m04231o12616l26710l26599o82854J1018
14157A9337288n56108j23840m16537k95589o83523m5889m55946l58237j37071
14148A6264548n85856j31270m18766k35227q8714k12975m27157k02380J21502
14139A4083705m92921l07159j87132m32476l898m66514j31067M0255j10671l33208
14129A1658914m9410k47079k07837j19206l67302k16564K26566k3351o95518J96461
14119A0155674j25688l16314J2281k88199K1438k53799j87237k61367K38750p8340
14109H917199l11900j93545n2896J18658n11029K89134j84052j27865k03737j19275
$$ y = [28250199, 27800896, 27016499, 26613751, 25629968, 25243463, 24707640, 24495710, 23611438, 22905032, 22454627, 22065880, 21679280, 21275049, 20662433, 20335723, 20009124, 19326270, 19337288, 18781180, 18657340, 18240803, 17945214, 17261691, 17215802, 16759856, 16401619, 16264548, 15678692, 15547422, 15128656, 14893429, 14804715, 14591740, 14164583, 13962203, 14083705, 13590784, 13283625, 13096493, 12664017, 12660119, 12193605, 12062538, 12102793, 11992122, 11658914, 11609504, 11362425, 11154588, 11035382, 10668080, 10451516, 10678082, 10654731, 9959213, 10155674, 10029986, 9713672, 9725953, 9437754, 9459192, 9205393, 9018156, 8756789, 8995539, 8917199, 8605299, 8411754, 8358858, 8477516, 7966487, 8255621, 8071569, 7943704, 7739967, 7620692]
14099G620692L17872o56654P1755M6133j50539j81952K11369l44086N02801p49928
14089F687463o3266p5172J51887l24901p319m63043J16296k1172J05261l49768
14079E756266J99306j72416K46876j32467o3259p0838j90213N8434j14749k7375
14069E489565k55890J0415J35795l55571J25614k43783k12489L36940j96519J26355
14059D960432j05034j88811l46979L16498j46219l8014K48614q9303o5166m06628
14049D139390R5585J69553j71057J53117K38860p6172n62844L55620q8565l85173
14039C868314K69927k57546K22901n01059J53095P8945J80987m77408j28804K5763
14029C435115Q5463q8549k489l30111N56083m34225K94028j60023L8459k5558
$$ y = [7620692, 7938564, 7281910, 7353665, 7399798, 7249259, 7067307, 7278676, 6934590, 7437391, 6687463, 6624197, 6549025, 6700912, 6376011, 6368692, 5905649, 6021945, 6000773, 6106034, 5756266, 5955572, 5783156, 6030032, 5897565, 5834306, 5763468, 5573255, 5631689, 5516940, 5489565, 5233675, 5244090, 5379885, 5024314, 5149928, 4906145, 4693656, 5030596, 4834077, 4960432, 4855398, 4666587, 4319608, 4636106, 4489887, 4451873, 4700487, 4611184, 4546018, 4139390, 4234975, 4404528, 4233471, 4386588, 4625448, 4549276, 3986432, 4342052, 4253487, 3868314, 4138241, 3880695, 4103596, 3602537, 3755632, 3834577, 4015564, 3538156, 3409352, 3435115, 3520578, 3432029, 3429540, 3099429, 3655512, 3221287, 3515315, 3355292, 3393751, 3368193]
14019C368193j98545O9198L06010l12190K35076p26917K78030J38602O610K12462
14009C376529k8016n15250M61356n41439J45795P211r5858k9183j7047J21761
13999B885859j4661k02594o20l9884J15225k04927m450K55486j53884k55465L46362
13988B726447M0782m94361J71232J42987R5439j09745l10643L12677K84130p2055
13978B786890N11062j59093Q98570M07070J515576K895793N956073J0569786R940658
13969C5322385j2060583q111459n026026k501543j378948r97698r95187j07500
13961D143441p04162M17856p91763j1370j26046J38473o75109M03576k94548k03729
13951B296619M75733m14669K75794l09208J83435k09091j79667j77593L91065
$$ y = [3368193, 3169648, 3238846, 3544856, 3232666, 3467742, 2740825, 3018855, 3157457, 3164067, 3376529, 3348513, 2833263, 3294619, 2753180, 2898975, 2906186, 2810328, 2781145, 2764098, 2885859, 2871198, 2668604, 2667984, 2628100, 2743325, 2538398, 2533948, 2789434, 2635550, 2380085, 2726447, 2767229, 2272868, 2444100, 2587087, 2682526, 2572781, 2262138, 2574815, 2858945, 2786890, 3297952, 3138859, 4037429, 4444499, 5960075, 8855868, 14811941, 25381727, 35322385, 23261802, 15150343, 10124317, 7622774, 6243826, 5246128, 4250941, 4143441, 3439279, 3857135, 3065372, 3054002, 2927956, 3066429, 2391320, 2794896, 2500348, 2296619, 2772352, 2357683, 2633477, 2324269, 2507704, 2298613, 2118946, 1941353, 2332418]
13942B332418j33771k28722L22077o3059j99348r9010j24211R3254K73114j42626
13932B030116J6456R9512j10454O5055j90678J60913k24181j99993K79105J156
13922A927007j08749K07907m03938J15960j5853p3151L12334n26951K49876J3102
13912A697544K37822p927j39837j03536l79895J50262o6841k9922K36366k94267
13902A299769L61934k01663K6124L47524q0071m37626R1765M0659J14229J04459
13892A667103k9865j71633L65546p57330L20354J2344J33637P41K3241j25672
13882A438466n2222L38938l64218k6162j939m6469L39461j04606j05634j62090
13872A253525L59272m37933M22846k88504k08044J88391L11479k76717L5754k85801
$$ y = [2332418, 2198647, 1969925, 2292002, 2228943, 2029595, 1930585, 1806374, 1899628, 2172742, 2030116, 2046572, 2146084, 2035630, 2100685, 1910007, 2070920, 1846739, 1646746, 1925851, 1927007, 1818258, 2026165, 1622227, 1738187, 1722334, 1649183, 1961517, 1434566, 1684442, 1697544, 1935366, 1927439, 1787602, 1684066, 1304171, 1454433, 1387592, 1357670, 1594036, 1299769, 1661703, 1460040, 1486164, 1833688, 1753617, 1315991, 1407756, 1448415, 1562644, 1667103, 1637238, 1465605, 1831151, 1073821, 1394175, 1406519, 1540156, 1540897, 1564138, 1438466, 1386244, 1725182, 1360964, 1334802, 1332863, 1286394, 1625855, 1521249, 1415615, 1253525, 1612797, 1174864, 1597710, 1309206, 1101162, 1289553, 1601032, 1324315, 1360069, 1074268]
13862A074268O0658R3758k06332m2259K66415n19340O18724J10997l44527O4990
13852A177352K15545l36876q47K47602J94684m14200j38922J52356M3278J71301
13842A311273P7399j94248k22130L70363j09718k51031l6686J4608L34347n4952
13832A239225k57037l3515M64484m93979J37965K18025l97372M1238L7422o1414
13822H95042M2417k67255O01094l22684n4192k28024p8240M26566k43193J85248
13812I56779n9057K77421j40226q2623J68549j27022o4364j15509M10275l54440
13802H69783L6130j49793J1851L82741l78562L87195m13083j7925P474L0232P2725
13791H38768q5787j23493K47759k04585J82110K64561l01154J4722j44213K45583
$$ y = [1074268, 1134926, 1228684, 1022352, 980093, 1246508, 727168, 1345892, 1456889, 1112362, 1177352, 1392897, 1056021, 1055174, 1302776, 1497460, 1083260, 944338, 1096694, 1139972, 1311273, 1388672, 1194424, 972294, 1342657, 1232939, 981908, 945222, 959830, 1294177, 1239225, 982188, 948673, 1413157, 919178, 1057143, 1275168, 877796, 919034, 956456, 895042, 937459, 670204, 1271298, 948614, 894422, 666398, 588158, 1014724, 771531, 956779, 897722, 1175143, 1034917, 952294, 1120843, 993821, 929457, 813948, 1224223, 869783, 905913, 756120, 767971, 1150712, 772150, 1159345, 746262, 728337, 735811, 766043, 838768, 752981, 629488, 877247, 672662, 854772, 1119333, 818179, 832901, 688688, 934271]
13781I34271K3871l33986J94076n3792l70636M63352n8992j42569j90508N18916
13771I84003k31317r8628L8506j15324O17600l52382l5933N4581k23891j24489
13761E12726K70677K51655l20749j44892J79115l2858n0557O2281j64197M42682
13751A005883l00593J50580J16781k00282J47235j70906R4319l92840j13086M79183
13741H16274k50610Q9802q8654j3804M28574l23254M9929j50871K0251k33666
13731C43971O77952k86246j983o5530j35963n7768L43320q5539k00824l0714K83010
13720G83686j45040j8845k93167M36004j19993q0372J42732j64039k35404M21839
13710G27401j16293k21080N63218m49262K49015C71229m618L84212L5747j01879
$$ y = [934271, 958142, 624156, 818232, 764440, 393804, 857156, 798164, 655595, 465087, 984003, 752686, 654058, 692564, 577240, 1194840, 842458, 806525, 861106, 637215, 512726, 783403, 1035058, 714309, 569417, 748532, 715674, 665117, 727398, 563201, 1005883, 705290, 855870, 972651, 772369, 919604, 748698, 843017, 450177, 337091, 816274, 565664, 655466, 566812, 553008, 981582, 658328, 708257, 557386, 577637, 343971, 1021923, 735677, 733694, 668164, 532201, 474433, 817753, 732214, 531390, 500676, 783686, 638646, 619801, 326634, 762638, 642645, 562273, 705005, 540966, 305562, 727401, 611108, 390028, 953246, 503984, 752999, 371229, 366611, 750823, 786570, 684691]
13700F84691j88362m2725P3903K79119B31640L08152M60763D09347L96429C47038
13689C53528K58628l1101J71297J5808A72546K75882L08815k8643B97922R9123
13679C97045Q1826P366N6986O4708L36j76400K92024o8917O1224k49456N6355
13668E23097j58968N1085J67639j86162J46818J02637k18444M4700L8941j57831
13658C53512L89526j78552J38716p0925A52523J43299K17547k35039K19506j45021
13648C52815J40719O5673B47087M75398k28057L14526l64243j37478m0102K74186
13638E41317l3993l244Q9512j61506j80023K27949M8753A64597N71257C55561
13627D05197L98566k20030k40878K16097p1341l4011K25328K6298C23004M57343
$$ y = [684691, 496329, 453604, 527507, 806626, 231640, 539792, 1000555, 409347, 805776, 347038, 353528, 612156, 581055, 752352, 768160, 172546, 448428, 757243, 728600, 297922, 397045, 478871, 486237, 543223, 607931, 608267, 431867, 723891, 654974, 716198, 466742, 523097, 364129, 415214, 582853, 396691, 543509, 646146, 427702, 472402, 511343, 353512, 743038, 564486, 703202, 632277, 152523, 295822, 513369, 278330, 497836, 352815, 493534, 559207, 247087, 722485, 494428, 808954, 444711, 307233, 267131, 541317, 507324, 504080, 593592, 432086, 252063, 480012, 528765, 164597, 735854, 355561, 405197, 803763, 583733, 342855, 558952, 487611, 453600, 678928, 705226, 323004, 780347]
13617G80347l83140r6930A39521L51800M9357N9844k37800N0161F2363J31310
13607A93673a14500D27281A84952J51241J2420J11249O3914o8961k00993M579
13597B58401O5911q1206J32374j32266j8100O5734R8618j14126J34486J32690
13587E42516j33517B5068a3196F09857k07803j15119l8431k8909J30649J22543
13577D72787L54451A61627K58854A89566L20620j49795K9093F5784N53176B06418
13566D92489m5589I0717J15704K44827Q6901o9754j29143J48J56122A99283K87690
13555D86973q6908j94198K40821r9777K91358B08989L26038B47816m3941L90314
13545E94189k84753p9230O7848K25521M0473B56034L1631N5982I3970K64556o7250
$$ y = [780347, 397207, 300277, 139521, 491321, 540678, 600522, 362722, 412883, 62363, 193673, -114500, 427281, 184952, 336193, 348613, 459862, 523776, 454815, 253822, 258401, 324312, 243106, 375480, 243214, 225114, 290848, 389466, 275340, 409826, 542516, 408999, 25068, -13196, 609857, 402054, 286935, 248504, 219595, 350244, 472787, 827238, 161627, 420481, 189566, 510186, 360391, 389484, 65784, 618960, 206418, 492489, 446900, 90717, 206421, 451248, 538149, 468395, 339252, 339400, 495522, 199283, 486973, 400065, 205867, 446688, 346911, 638269, 208989, 535027, 247816, 203875, 594189, 309436, 230206, 298054, 523575, 564048, 256034, 287665, 343647, 93970, 358526, 291276]
13534B91276L1327j56423M9695L1482J0834k9106q952R4820K47451k42836Q4653
13523D04221D8795l344L76347j04822Q0435j20572A21388L28376k19867G9616
13512C65529D5911K44698N32918H2497K70793o4061J97792b2885C00735J76400
13502D77135k1539A63814J24945A21008K78995E2155g6406B79844J7688J05784
13492D03316J4178n6469J8107A10016J95990G5752J4497J77227E6973b1715B21204
13480A48563R3760Q3168G2639L01100J58033j37918A75237J94131j631a0048B31481
13468A64096J2177O1881k6188G3303M74608k2116B41731p3268K02539A02562J49508
13457B52070l1088j5183L04717k09801I0544J43652K73341A09619M5568N4059
$$ y = [291276, 322603, 166180, 215875, 247357, 258191, 229085, 220133, 314953, 562404, 319568, 404221, 48795, 45451, 421798, 316976, 397411, 276839, 121388, 449764, 229897, 79616, 365529, 45911, 290609, 823527, 82497, 353290, 289229, 487021, -22885, 300735, 477135, 455596, 163814, 288759, 121008, 400003, 52155, -76406, 279844, 297532, 403316, 417494, 361025, 379132, 110016, 306006, 75752, 90249, 267476, 56973, -21715, 221204, 148563, 242323, 325491, 72639, 373739, 531772, 393854, 175237, 369368, 367737, -10048, 231481, 164096, 176273, 238154, 211966, 73303, 547911, 525795, 241731, 168463, 371002, 102562, 252070, 220982, 205799, 510516, 300715, 90544, 234196, 507537, 109619, 155187, 209246]
13447B09246K59683j33411A16874J73941C8561J53270L6261G0339J03709p1885
13437A02163B1863K00102l4427i3555A92966l8021L5535M07796k46673n3605O2742
13426C60740A09496J24521K78345A15728C2034J12626J73821L3534j55056J27354
13416C24313h5896B69575e3007B2237K53225D9043N8813L94187c8947E2637c9833
13404C4192J86090K7049G3393K62384j58583K11512j71850J92475K73555j39376
13394E43510B42363F4466D12L1763J78771B2342J45694o186J14903P8980d5807
13382C42625A24399O7878e8365o5159C89298J04603j65014A22768Q1582o4941
13372A39409d7048A95452p3844L9165n6657M1641J30593J3408H9275K08532K6412
$$ y = [209246, 468929, 335518, 116874, 290815, 38561, 191831, 228092, 70339, 174048, 102163, 21863, 221965, 187538, -93555, 192966, 154945, 190480, 598276, 351603, 297998, 360740, 109496, 234017, 512362, 115728, 32034, 144660, 318481, 352015, 196959, 324313, -85896, 269575, -53007, 22237, 275462, 49043, 107856, 502043, -38947, 52637, -39833, 34192, 220282, 247331, 73393, 335777, 177194, 388706, 216856, 409331, 682886, 543510, 242363, 64466, 412, 32175, 210946, 22342, 168036, 161850, 276753, 355733, -45807, 342625, 124399, 192277, -58365, -123524, 389298, 493901, 328887, 122768, 204350, 139409, -47048, 195452, 121608, 160773, 104116, 145757, 276350, 289758, 89275, 297807, 324219]
13361C24219J62732I2807C3696L61190A72439K03830A38510J73647D1009d7599
13350a11321D07943A76139J76384A75570c7206J3949B87653I2788a40389r8848
13340b39237C98390R496b10356B35044K31945E2479j2672L50696q4638a7124C47651
13328a40704G94340A35922L19012A02268K30346A16057D0899M22791k09366M812
13318B59136c4772l9398D60141A32985J02074J61152j74192G7238J81981f8615
13307C52037K66133A24264R529F0172d9747B72580O0038J1650j63007L718D3345
13295A55214n5340J17195n1931J27000o8426m3862D5827J39727a10880B65428
13284A66799n6541R3865L47580B12050M8587m7660a49765C75737A76859m3892
$$ y = [324219, 486951, 92807, 33696, 394886, 172439, 376269, 138510, 312157, 41009, -47599, -111321, 407943, 176139, 352523, 175570, -37206, -23257, 287653, 92788, -140389, -239237, 398390, 407886, -210356, 235044, 466989, 52479, 39807, 390503, 305865, -17124, 347651, -140704, 794340, 135922, 454934, 102268, 332614, 116057, 40899, 463690, 254324, 259136, -34772, -74170, 460141, 132985, 235059, 396211, 222019, 77238, 259219, -68615, 352037, 618170, 124264, 133793, 60172, -49747, 272580, 332618, 344268, 181261, 184979, 43345, 155214, 99874, 217069, 165138, 292138, 223712, 179850, 45827, 185554, -110880, 265428, 166799, 110258, 204123, 551703, 212050, 260637, 212977, -149765, 375737, 176859, 132967]
13274A32967O7916q1193b7805C12011O7260A63679F0209B1111M99404k21114a61248
13262F2814C0673K6850K8447M1281P8081n8091f0393C19070A51190a88703D2445
13250A87744P87F3693g9386A77061L40k9412K43186q7892E8531L155i8089E1168
13237B07691p2497Q1770A5026J33052J34541n4696J75654C7233M86188c8613j0131
13226d8744B19080J06065N2011I0154f7272j96064E1129i8149B92892j09585a55785
13214A50267J34593A15467b2696C62701j77619l5551n2952d8743a4797j84714
13204a99511D55200A56678J1936K81614A03316L36800j96874a59477E5109l202
13194E1907J11120N9685H128g9654A54752D4977J62715a24782k4463B26137K68333
$$ y = [132967, 200883, 119690, -27805, 312011, 379271, 163679, 60209, 21111, 520515, 299401, -161248, 62814, 30673, 57523, 85970, 127251, 205332, 147241, -60393, 319070, 151190, -188703, 42445, 187744, 188531, 63693, -79386, 177061, 177401, 147989, 391175, 303283, 58531, 61686, -98089, 51168, 207691, 135194, 216964, 15026, 148078, 282619, 227923, 403577, 37233, 523421, -38613, -48744, 219080, 325145, 377156, 90154, -67272, -263336, 51129, -98149, 292892, 183307, -155785, 150267, 284860, 115467, -22696, 362701, 185082, 149531, 96579, -48743, -14797, -199511, 455200, 156678, 168614, 450228, 103316, 440116, 243242, -159477, 55109, 51907, 163027, 222712, 8128, -79654, 154752, 44977, 207692, -124782, -149245, 226137, 494470]
13183D94470G0453K03160M6774I3761b34712C32459I588O948M37352j25507d8436
13171A49048C0235e937a375r1179A7164L2304a76137G9545k9058Q9619D7350k2382
13159B4968M9833K1519j5980i9744q8869Q9970m1997c8381A37769N6186k9659
13148A64296B8207a25673C4810g1434l39959A99517a4926G1816J0681K80444A01405
13136B46639E0910a22870A94206a25069A7681O8290O0153g7138D84669b25559
13125C6217a51918A9298M8488J72217j15019J35276H0941K62981A19838a4205
13114c6401A80109J15070a41779C6269K7964K9043K13296B0636J76766a52559
13103a52374b388A14357J05938G074K14464e8115A87428J39827C6503K62599h528
$$ y = [494470, 70453, 273613, 320387, 93761, -234712, 332459, 9588, 16536, 453888, 328381, -48436, 149048, 30235, -5937, -1375, -92554, 17164, 49468, -176137, 79545, 50487, 140106, 47350, 24968, 74801, 96320, 80340, -99744, -188613, -98643, -140640, -38381, 137769, 193955, 164296, 28207, -125673, 34810, -71434, -411393, 199517, -14926, 71816, 82497, 362941, 101405, 246639, 50910, -122870, 194206, -125069, 17681, 85971, 146124, -77138, 484669, -225559, 36217, -151918, 19298, 67786, 240003, 124984, 260260, 80941, 343922, 119838, -14205, -36401, 180109, 295179, -141779, 36269, 64233, 93276, 306572, 20636, 197402, -152559, -152374, -2388, 114357, 220295, 7074, 221538, -58115, 187428, 327255, 36503, 299102, -8528]
13091d6496E21534A30391b1207B59633b23678c365n5154D0699N6482J01578o9545
13080A29214O356J75295j27542K4736m9276c4231j11609L9240F6330b23238i0352
13068C7577A4689R2600N6489D3367L85438b4859H0786c55827B83507a85551N1848
13057a33703b2535B77976c71034a82665A55056M1534o1821J53008m7131o1425
13047A79221A916L67547J17245f5064B03355l8166J56040B2636f1180n7283I2134
13035B26149P897J44352j78788l6218C1095J49637F3271c5618m18A237M27777
13024D29014E4424K58890A16389a18391j31306n4251G722R1746h3395A76024K5772
13013B01796m919i631B32829l5864G8588g4691n9017I7081J98164q633J68984
$$ y = [-46496, 521534, 130391, -21207, 259633, -223678, -3365, -58519, 40699, 97181, 198759, 129214, 135570, 310865, 183323, 208059, 158783, -34231, -145840, -106600, 66330, -223238, -90352, 37577, 14689, 107289, 163778, 43367, 428805, -24859, 80786, -355827, 283507, -185551, -133703, -22535, 277976, -371034, -182665, 155056, 196590, 134769, 287777, 240646, 179221, 1916, 369463, 486708, -65064, 203355, 165189, 321229, 22636, -61180, -118463, 92134, 226149, 234046, 378398, 199610, 163392, 31095, 180732, 63271, -35618, -36036, 1237, 429014, 54424, 313314, 116389, -118391, -249697, -303948, 7722, 99468, -83395, 176024, 201796, 196877, -9631, 232829, 196965, 78588, -74691, -133708, 97081, 295245, 286612, 455596]
13002D55596d2121j69171C25388A41286a23024e2859E2395R2929L8125C096J88194
12991A91290A3964K10790A05307J10876m3374o2592o584b66794A16787K09034
12981C25821A4110N4181J99397f8739A10337b3674j83182C40740j17677F4111
12970b14224h7734A73323f0387C10082e07F6930o750k2841a00161L1226B63018
12958B57837h9976A41766e0603F0776k1552a73042F555J56273K10799f6530j21224
12947a87754J0847G9455d67054i1725A28266a67581k9024F0704a13567B69506
12936B10904a58427b7282C18880N3498H304K71714h0411B12476q3780c53167f4708
12924a3359j98002A68311b07250f9323p8001m3584e1260p931r780j39074e12A87834
$$ y = [455596, -42121, -211292, 325388, 141286, -123024, -52859, 52395, 145324, 183449, 3096, 191290, 13964, 224754, 105307, 216183, 172809, 110217, 103633, -266794, 116787, 325821, 14110, 68291, 267688, -68739, 110337, -23674, -206856, 340740, 223063, 64111, -214224, -87734, 173323, -60387, 310082, -507, 66930, 60180, 37339, -100161, -68935, 263018, 257837, -89976, 141766, -50603, 60776, 39224, -173042, 6555, 162828, 373627, -66530, -187754, -176907, 79455, -467054, -91725, 128266, -167581, -196605, 60704, -113567, 269506, 210904, -158427, -27282, 318880, 372378, 8304, 280018, -80411, 212476, 128696, -353167, -64708, -13359, -211361, 168311, -207250, -69323, -147324, -190908, -51260, -59191, -68971, -208045, -512, 187834]
12911I6600J77703a0806E1326k1423K0045L09166H0580K01933B8360A2306N854
12900A8160N7028k8963a0515I7591K0373J29055H3447a88925a9728F4310e82205
12888A33850b4802k2187F7882J72242a2296B14019F6316f1931C0685e422C29132
12876a58068C262J29038D159b0880j87183A74596M6638A4232b8177C0205J12026
12865A42231R8919l4393B1459J2460b21692d0311C1703a42901L4897d6789A9348
12853B0635J46105b16576B32322q1014a04256A06839A9488c09392P7388g3811
12842D19896d643k34990c0535B07089f1045A76991J84084b10940K0531B4571l745
12831B0826K20740g8228C01430h2410D7549a29843L012A92596b5108B06041d8466
$$ y = [96600, 274303, -10806, 51326, 29903, 49948, 359114, 80580, 282513, 28360, 12306, 18160, 75188, 46225, -10515, 97591, 117964, 247019, 83447, -188925, -19728, 64310, -582205, 133850, -24802, -46989, 67882, 240124, -12296, 214019, 66316, -61931, 30685, -5422, 329132, -158068, 3262, 132300, 4159, -20880, -208063, 174596, 221234, 14232, -28177, 30205, 142231, 241150, 206757, 21459, 33919, -221692, -40311, 31703, -142901, -108004, -46789, 19348, 20635, 166740, -216576, 232322, 151308, -104256, 106839, 19488, -309392, -232004, -73811, 419896, -4643, -239633, -30535, 207089, -61045, 176991, 361075, -210940, -190409, 24571, 20826, 241566, -78228, 301430, -82410, 47549, -129843, -126831, 192596, -25108, 206041, -48466]
12819a24488k3052G0518i6611r6350d2402a9493H8395b51352A51486O665J26437
12808B84588a98471K6110B03181j4670P1497p7181D3744K12686b28207A19877
12797i1197A21704m6265b81731f1263k16994N7647O564A66175a60715G1043J26972
12786A98015F8320i3474j38155E9888i6138B14600D5255a21926E0980a8494l7206
12775e5700A26994M8212h6383K7090j07050c2478j44971k57008B36292d6600k59422
12764c06022b9560j16944K1076A66908a46661A48876c57199e3153j83864o567
12754b43584e8442r0033l406i418j55186A3767i7058A56530c2484D3394a10289
12742d3608D9663R861c3517B84756E6992J57308F9151G807J3746a01797I7781
$$ y = [-124488, -147540, 70518, -96611, -192961, -42402, -19493, 88395, -251352, 151486, 158151, 284588, -198471, -172361, 203181, 188511, 260008, 182827, 43744, 256430, -228207, 119877, -91197, 121704, 75439, -281731, -61263, -278257, -220610, -214046, 166175, -160715, 71043, 198015, 68320, -93474, -231629, 59888, -96138, 214600, 45255, -121926, 50980, -18494, -55700, 126994, 175206, -86383, -59293, -166343, -32478, -177449, -434457, 236292, -46600, -306022, -29560, -146504, -125428, 166908, -146661, 148876, -357199, -53153, -237017, -243584, -58442, -148475, -151881, -9418, -164604, 13767, -97058, 156530, -32484, 43394, -110289, -43608, 49663, 59524, -33517, 284756, 56992, 214300, 69151, 7807, 21553, -101797, 97781]
12730B11492D4109a3447A47107a37912M8407A61622l6903m6666a06519F4701J41606
12719B06307d0978l5726A68216e203q265p0981B73284c8144B0656J84836K1698
12708B27190G2295K01234A28820b01830a5649k20895B62068h5036q7088I7321
12697C88399d7961A08938b80754A91280C6408g7555C41555i050C27282j35724
12687A91558O3309a54322D28920A38387b30882D7429i1875A5861Q9491J20241
12677B25593A54h0720j15779P4808K1227J8756A12996l8346a91382Q8222A4155
12665b42790A27924J38446d4641C28890J47992a04486A37002a64504n6620e2985
12654H546a15628D9574a13852A9305a23367a5415A49080D9674K48597E229d4131
$$ y = [211492, 44109, -13447, 147107, -137912, -89505, 161622, 124719, 78053, -106519, 64701, 206307, -40978, -76704, 168216, -5203, -13468, -84449, 273284, -38144, 20656, 205492, 227190, 72295, 273529, 128820, -201830, -15649, -236544, 262068, -85036, -172124, 97321, 388399, -47961, 108938, -280754, 191280, 36408, -77555, 341555, -9050, 327282, 191558, 254867, -154322, 428920, 138387, -230882, 47429, -91875, 15861, 105352, 225593, 154, -80720, -196499, -121691, -100464, -81708, 112996, 74650, -191382, -103160, 14155, -242790, 127924, 266370, -44641, 328890, 476882, -104486, 137002, -164504, -221124, -52985, 8546, -115628, 49574, -113852, 19305, -123367, -15415, 149080, 49674, 298271, 5229, -44131]
12642e5137m2689A2828J27255J41978A36136C3356a31452e8777k04516B36060
12631I9104a51470K635D13277A30763K9785B4068J15508K86615G7234A8575J22395
12620A40970C9474N8146R2464h3544B83162A26092a68331B3332L03572j18722
12610B08182Q4375K50081d3089C17317j3834E7490H969J15854i5133G0075a39281
12598b32370A2861K16175E1016b5303j24690P3414F093K06469A03352a66514C72406
12586e1392q2365d8958A45451J14452a09507G939a3381C9648d787k8775Q997p8699
12574a03264b1694k70149h0462A19363J16807a92456a5672r7736l9372G424b84548
12562e1448K0834B20090D6440K20161I8791a38002k9883n4031e7740A99179a03215
$$ y = [-55137, -97826, 12828, 140083, 282061, 136136, 33356, -131452, -58777, -263293, 236060, 99104, -151470, -148835, 413277, 130763, 160548, 24068, 139576, 426191, 77234, 18575, 140970, 39474, 97620, 190084, -83544, 283162, 126092, -168331, 23332, 326904, 208182, 292557, 542638, -43089, 317317, 303483, 57490, 8969, 124823, -95133, 70075, -139281, -232370, 12861, 229036, 51016, -25303, -149993, -76579, 6093, 212562, 103352, -166514, 372406, -51392, -133757, -48958, 145451, 259903, -109507, 7939, -13381, 39648, -4787, -33562, -24565, -103264, -21694, -291843, -80462, 119363, 236170, -192456, -15672, -113408, -152780, 7424, -284548, -51448, -30614, 220090, 46440, 266601, 98791, -138002, -167885, -221916, -57740, 199179, -103215]
12550h8175I4465b36166P2153k8754C6890g0702A03934J79465b83172A19442J499
12539A20941a52265e4986j25899O8797j00915A38737J1409d602p3650A00287g0152
12527G0869a58434B4957J35523e2683k99541f5541E0119a03489j99868A9764P9829
12516I9593c67050H4984c5496j53867I3751J04879c27674A47232L0352g5135k11747
12505b86882B11358a33780A99438B0552h7471I2044a44837b9860B31190A2077
12494A62606D054J50294a23849q2945H908b30967A24082J23561g05j7664r9621
12483a17990B9993b28249A37714a83655B53986A2812h555o9499A50265i5559j49502
12472b45061I9327B6813J15629a59859A29570c7571A47455c53538g8885j37943
$$ y = [-88175, 94465, -236166, -164013, -192767, 36890, -70702, 103934, 283399, -283172, 119442, 120941, -152265, -54986, -180885, -112088, -213003, 138737, 150146, -4602, -78252, 100287, -70152, 70869, -158434, 24957, 160480, -52683, -352224, -65541, 50119, -103489, -303357, 19764, 99593, -367050, 84984, -35496, -189363, 93751, 198630, -327674, 147232, 177584, -75135, -286882, 211358, -133780, 199438, 20552, -87471, 92044, -144837, -29860, 231190, 12077, 162606, 4054, 154348, -123849, -206794, 8908, -230967, 124082, 247643, -705, -18369, -117990, 29993, -228249, 137714, -183655, 253986, 12812, -8555, -78054, 150265, -95559, -245061, 99327, 26813, 142442, -159859, 129570, -37571, 147455, -353538, -78885, -216828]
12462b16828P3625I1053b3752j05405d5666G9071a68760P951A42105M421m0870
12451A05656b30493M9437c9685j38259A44141h6234q9268r4877c6439E6463e2701
12439H0625e8311A16314a82200A51651a88380A5041g4151B49961c04806I109c51784
12427A87074h3976k83645o8633A4557c18563a00455A45924d1640q0011H5665b26412
12415h9458j73363a25587d1561j14522B16569b88138a23194B12293a22280J8492
12405a03788l12546B0889M9025a07485k49315C1845d01727A45901J30860b35950
12394a01741C08918K11046a79933Q14j03996b7578C7486a00j14430M9097E526
12382I8088a56260I8466e0094j79845P9480B83471q1758e3245j7262C0460c38170
$$ y = [-216828, -143203, 91053, -23752, -129157, -45666, 79071, -168760, -160809, 142105, 146526, 105656, -230493, -181056, -39685, -177944, 144141, -86234, -175502, -270379, -36439, 56463, -52701, 80625, -58311, 116314, -182200, 151651, -188380, 15041, -74151, 249961, -304806, 9109, -351784, 187074, -83976, -367621, -436254, 14557, -318563, -100455, 145924, -41640, -121651, 85665, -226412, -89458, -262821, -125587, -41561, -156083, 216569, -288138, -123194, 212293, -122280, -103788, -416334, 20889, 69914, -107485, -356800, 31845, -401727, 145901, 276761, -235950, -101741, 308918, 519964, -179933, -179119, -283115, -27578, 37486, -100, -114530, -65433, 5526, 98088, -156260, 98466, -50094, -229939, -150459, 283471, 201713, -53245, -70507, 30460, -338170]
12370C61367p694j05480G7914N3033g2180l4406F77c9447B78879r1165o2920Q8893
12358B13687a55519B16612A2130M7109A2923K41178c3127B46478a24631f049B14991
12346B00296p9666O4882K0351H0237h2341a6199j79725q6819A2264c08336C79709
12334B38201j2954f2183A35675a90321N4393b8403l2127o269f357C69828j57494
12323B12334B9218J19138i020l6884J3499l9338F4630K91570j66772J45929p2220
12312B63137l788n1721e2885B97247J34607J49098k78901I2315a1902B23244F1940
12300A57469a07583D65078l3575k14372G2333K91358A33647b0401j47714E0254
12289B51425D864M06420A27871n0969J02155i4203j06848A29801n0398J9604D7793
$$ y = [361367, 353673, 248193, 77914, 130947, -72180, -106586, 677, -39447, 278879, 187714, 124794, 213687, -155519, 216612, 12130, 59239, 12923, 254101, -33127, 246478, -124631, -6049, 214991, 200296, 120630, 185512, 205863, 80237, -82341, -16199, -195924, -282743, 12264, -308336, 379709, 238201, 225247, -62183, 135675, -190321, -135928, -28403, -60530, -66799, -6357, 369828, 212334, 29218, 148356, -9020, -45904, -32405, -71743, 64630, 356200, 189428, 335357, 263137, 259349, 207628, -52885, 297247, 431854, 580952, 302051, 92315, -11902, 223244, 61940, 157469, -107583, 465078, 431503, 217131, 72333, 363691, 133647, -20401, -168115, 50254, 251425, 4864, 411284, 127871, 76902, 179057, -94203, -201051, 129801, 79403, 99007, 47793]
12277i0928B06467J02755A16380j7551e0472B13308l9792r31h4280B92578r7378
12266A95200D5633J48982c432j71101C6174L08963A25358J83710c0207A22522
12255H3821k4131J07540d307B02431J86503A15493J40736o0871q2567J62767M5923
12244C21481b73520E1712J22376J95343I9496K39772f0080A7127J23299M3672
12234A84098o0637b47013B33400b923F9546P2135P1695f7214D12595a65136N4222
12223a10914A23027a12722A86684e1804j03383b564A21230a69230H9508R7642
12213A87150J0130a51944B93253J1341A15052N7251J73827j26240K22240A85378
12202c4057q587D27418A09214K00286m4992L3759K5222A28825M625A5292h3333
$$ y = [-90928, 206467, 309222, 116380, 98829, -50472, 213308, 173516, 172585, -84280, 292578, 195200, 45633, 194615, -3432, -174533, 36174, 345137, 125358, 309068, -30207, 122522, 83821, 59690, 167230, -4307, 202431, 388934, 115493, 256229, 195358, 112791, 275558, 321481, -273520, 51712, 174088, 369431, 99496, 339268, -60080, 17127, 140426, 184098, 123461, -247013, 233400, -2923, 69546, 141681, 213376, -67214, 412595, -165136, -110914, 123027, -112722, 186684, -51804, -155187, -2564, 121230, -169230, 89508, 187150, 197280, -151944, 293253, 304594, 115052, 172303, 346130, 219890, 442130, 185378, -34057, -42644, 427418, 109214, 309500, 264508, 298267, 323489, 128825, 133450, 15292, -83333]
12190F5198O9764a5412E7846k8044J00721B0414j113O6578e7027k23013C17994
12178b7688D46990B3011K14378a08012H4981J83316F3844J94991B0850J29770
12168A50620K00992g6260C60949m0766l6407l8840D1496K40117a03834G0455J2193
12157H2648o821F000L24093h8980A83169J1624i5972B12666J97980A79518K66699
12146D46217k16298D9407J2889J63752O8928j25591H361a03066I5473L64507a12364
12134c16239Q8518B18643a0149D7636A3549a80083B54853L126E7495c3263A18965
12122B48383e464k21141A66009B9687h4577F4812d2832B45773b44146A0173J22445
12111A32618b07365B38585L09329j28428C8881J37746F6362b4705o5093B41471
$$ y = [65198, 134962, -15412, 57846, 29802, 130523, 20414, 19301, 85879, -57027, -280040, 317994, -27688, 446990, 23011, 237389, -108012, 84981, 268297, 63844, 258835, 20850, 150620, 351612, -76260, 360949, 320183, 283776, 244936, 41496, 281613, -103834, 70455, 82648, 75827, 6000, 330093, -88980, 183169, 194793, -95972, 212666, 410646, 179518, 446217, 229919, 49407, 62296, 226048, 294976, 169385, 8361, -103066, 95473, 459980, -112364, -316239, -227721, 218643, -10149, 47636, 13549, -180083, 254853, 257979, 57495, -33263, 118965, 248383, -5464, -226605, 166009, 29687, -84577, 64812, -42832, 245773, -244146, 10173, 132618, -207365, 238585, 547914, 419486, 38881, 176627, 66362, -24705, -89798, 241471]
12100E1869R3446n0804l702K09674L44456A02581a2191A3223N8988e8621A75130
12088A69700J39359p8960j1085J040a29540D8065M4800K84465b0163A86359h5472
12076A43350k4100n2424L87810B1442J81251a83977d9275A43480A7976K53749
12066B71725F8890q786P9812n4867Q8652J5730n5878D8891j4183L6419R0210M2404
12054B03741K8603b32727A29153Q9235P3528D0560J44880m1233Q3329A09515Q2063
12043A91578b17249g3962B21890D4079e3863A59542p0083K49918J8200a59393
12032A2666n642P1911a75570h0486C43168A04431R1569N6259c6780j17505E6845
12020b7534k590l6807J6999k835A46649J86736a8878I1445h0942a2009A65380
$$ y = [51869, 145315, 94511, 90809, 300483, 644939, 102581, -12191, 13223, 72211, -58621, 175130, 169700, 309059, 230099, 219014, 220054, -129540, 48065, 92865, 377330, -20163, 186359, -85472, 143350, 119250, 66826, 454636, 21442, 202693, -183977, -49275, 143480, 17976, 271725, 68890, 60104, 139916, 85049, 173701, 189431, 133553, 48891, 34708, 71127, 161337, 203741, 232344, -232727, 129153, 218388, 291916, 40560, 185440, 144207, 227536, 109515, 191578, -217249, -73962, 221890, 44079, -53863, 159542, 89459, 339377, 357577, -159393, 12666, 7024, 78935, -175570, -80486, 343168, 104431, 196000, 252259, -36780, -154285, 56845, -27534, -30124, -66931, -49932, -52767, 146649, 333385, -18878, 91445, -80942, -12009, 165380]
12008c4306A048L98809H3546a73148I6301L0595A140J82460F9837K9790k861g2157
11995D5040K36647b5679C29211N555H0153h5306A49723H897a21089j29759J24140
11984a26708c3705d248B58784B5784L2654J2857a21791j18737B07948b49023p6508
11973c25531B65558c9167B29882b27714l351o1580a26195D0780J91880a04380
11962A04780j8867J61239A3070K83637g1977C08392j02575M8858A4276a93575
11951B61071c27469I5638a45087c2529j13925A47985d5127A40290n3188b84276
11940a38091D7107f4552D5673a19131A16454a9949n7659c0621A4342Q5713e2454
11928A65324d4149j26471F8077M242O7718a21157b685C89745G5271J25962a7493
$$ y = [-34306, 1048, 399857, 83546, -173148, 96301, 126896, 1140, 183600, 69837, 99627, 96766, -72157, 45040, 281687, -25679, 329211, 334766, 80153, -85306, 149723, 8897, -121089, -250848, -126708, -33705, -4248, 258784, 25784, 58438, 71295, -121791, -240528, 207948, -249023, -325531, 265558, -39167, 229882, -227714, -231065, -292645, -126195, 40780, 232660, -104380, 104780, 85913, 247152, 13070, 296707, -71977, 308392, 205817, 254675, 14276, -193575, 261071, -327469, 95638, -145087, -32529, -146454, 147985, -45127, 140290, 87102, -284276, -138091, 47107, -64552, 45673, -119131, 116454, -19949, -77608, -30621, 14342, 100055, -52454, 165324, -44149, -170620, 68077, 72319, 140037, -121157, -2685, 389745, 75271, 201233, -17493]
11916E0466J0881a80711G1132J12987E8258K771J05282A2252e0909A19632n4760
11905F4872J1710d2572C29362A09437E3781d7163k1540k1042J3581K5264b1335
11893I1876r755L756b63083g4196A65490a92942M2359B03951a27094E8648k6479
11882C2169h9101k77262J73888B7255a65076B14978e6437k81111J00868A87521
11871A57871m8986m3120l188K66560b15390o1745F2739C0203b14704a8952n11256
11860e30208a4039A67222m7647f8489a1660k5339m6576j0978C2358i2833k72622
11849c65455b0902j86331p156b4706C6617b32848B71590a37113H5815K5226m8575
11838F2466a91457R94A35882B8170J29292g0839m3540k01692A30848b248F9670
$$ y = [50466, 61347, -180711, 71132, 184119, 58258, 61029, 166311, 12252, -50909, 119632, 64872, 76582, -42572, 329362, 109437, 53781, -47163, -68703, -89745, -76164, -50900, -21335, 91876, 82121, 85877, -263083, -74196, 165490, -192942, -150583, 203951, -127094, 58648, 32169, -89101, -366363, -192475, 27255, -165076, 214978, -56437, -337548, -236680, 187521, 157871, 108885, 65765, 62577, 329137, -215390, -277135, 62739, 30203, -214704, -18952, -530208, -14039, 167222, 119575, -68489, -11660, -36999, -83575, -94553, 32358, -92833, -365455, -20902, -207233, -214389, -24706, 36617, -232848, 271590, -137113, 85815, 111041, 62466, -191457, -190463, 135882, 28170, 157462, -70839, -114379, -316071, 130848, -2248, 69670]
11826a15356A27134h2213l2026D6530d39960C4810g4114j38617l398M3770d9164
11814a22135A4424Q8250b30048B06181J20474a20823B4703K17566b74215a27306
11803d508D4474f3810j74066Q5381f4346B89622c42746H542L1284J21834b58770
11791e1937b3925E9734f2038r5385c7340k9194j94867J15975C38015n1746D9010
11779B99480d2136k2787j43545A46334a08132g334k06659P8037A11309D7917K36320
11768B84237O3020m0177A07456b98749E0451k612g5241j26728P1623a4436B4437
11756E8632n130J36481q4368H318D74b7621I8503a68831E8744K00642h9526I4335
11743b21475A95233G4829K50623a87062E4790i6677A53233l6960O0085N1694l4757
$$ y = [-115356, 127134, -82213, -114239, 46530, -439960, 34810, -74114, -212731, -216129, -172359, -49164, -122135, 14424, 102674, -230048, 206181, 326655, -120823, 24703, 242269, -274215, -127306, -4508, 44474, -63810, -237876, -152495, -64346, 289622, -342746, 8542, 39826, 161660, -258770, -51937, -23925, 59734, -62038, -157423, -37340, -66534, -261401, -145426, 338015, 286269, 49010, 299480, -42136, -64923, -208468, 146334, -108132, -7334, -213993, -135956, 111309, 47917, 284237, 347257, 307080, 107456, -298749, 50451, 47839, -75241, -201969, -130346, -14436, 24437, 58632, 53502, 189983, 105615, 8318, 474, -27621, 98503, -168831, 58744, 259386, -89526, 94335, -221475, 195233, 74829, 325452, -187062, 54790, -96677, 153233, 116273, 176358, 228052, 193295]
11732A93295g6766C37976i2886A62867J42723j13245b9183E5384a996A08244b08884
11720d2551k670p0382l12285e8638k45550A70105B6771c0263j75799g7884j1196
11709h9080a3608j18879A02201K5532r138a74475e4897k0995p4275c8986o8891
11698a07877k5957A67790g2656A42298B7751L34639f5841j965G9577K205O7651
11687A49433D0369a07353I4310A6405a3889B05534b0078A45232K27754A01745
11676A51730b31218e271C0913j353c1428p3621K6755L0123j31657a4435p3192
11665h7627l16528a89369I4980a50031c9978I847Q2230J09597B2220J75131L4407
11654B31758E6964B0409K44252b28601B99965B6139K96524a06326D14700H1619
$$ y = [193295, -76766, 337976, -92886, 162867, 305590, 192345, -29183, 55384, -1996, 108244, -208884, -42551, -45221, -115603, -427888, -58638, -304188, 170105, 26771, -30263, -206062, -77884, -89080, -13608, -132487, 102201, 127733, 118595, -174475, -54897, -75892, -150167, -38986, -107877, -133834, 167790, -72656, 142298, 27751, 362390, -65841, -67806, 79577, 81782, 149433, 40369, -107353, 94310, 16405, -13889, 205534, -20078, 145232, 372986, 101745, 151730, -231218, -5271, 30913, 29560, -31428, -105049, -78294, -48171, -179828, -14435, -87627, -404155, -189369, 94980, -150031, -39978, 9847, 92077, 201674, 22220, 197351, 231758, 56964, 20409, 264661, -228601, 299965, 26139, 322663, -106326, 414700, 81619]
11643I984a52960B5876c1842H7708e0115A19369k0994a18372L6828A39058h3902
11631B70620d6582A90961b30022i8029B18189E667K01747N1086F7309e4897A40305
11619A32963g6184A92029a22816k38753B73625c67901J8372D53213d3748p7125
11609a20873B07491b58461C32325f2190a9291j67837A6664a97382j88503E0276
11598B55650C7554f3845E0860e4290E5459a03900m173B12571b13690A18919J98937
11587C17856b48239H2458a10610C1658a40469N7942D39317A99643N1917I8161
11576I9671Q9301p0451E6072a61550A6234b33709A04056R2027K87882A17106A5539
11564A35094A9046J51229J17767A28657F0954i1018b3902B39675H0006c00528
$$ y = [9984, -152960, 25876, -31842, 87708, -50115, 119369, 98375, -118372, -81544, 139058, -83902, 270620, -46582, 190961, -230022, -98029, 218189, 5667, 207414, 258500, 67309, -54897, 140305, 132963, -76184, 192029, -122816, -361569, 273625, -367901, -349529, 453213, -43748, -120873, 207491, -258461, 332325, -62190, -19291, -187128, 16664, -197382, -385885, 50276, 255650, 37554, -63845, 50860, -54290, 55459, -103900, -108073, 212571, -213690, 118919, 317856, -248239, 82458, -110610, 31658, -140469, -82527, 439317, 199643, 251560, 98161, 99671, 188972, 118521, 56072, -161550, 16234, -233709, 104056, 196083, 483965, 117106, 15539, 135094, 19046, 170275, 288042, 128657, 60954, -91018, -23902, 239675, 80006, -300528]
11553g0703H8887l8615J47008D7462N1426c5222k63445f4282E912b68446C11485
11541a05470j7355L4026B9632J40682b6386B42408l865b29921d673A04738P1153
11530A75891a07638C51113A70330L7880I2427B4511b4072A41686J1382f861j07258
11519a14119K542A09511b0693A76556b77995D69589a98966M1483n0648B35185
11508B67635a94773H8557K18617c2657k17202J1027C4974J01311J74407F3122
11497H5677K05389a52833A80386b11064B86260I0326j3726a4010C27247C6235
11486A37157D8484K65769j3030c6985B88053c0681k5452H827M5324f452B4987
11474c34304F4471J59820f1075e690A9334J52805M1206d6454A74490a00032H3388
$$ y = [-70703, 88887, 50272, 197280, 47462, 98888, -35222, -298667, -64282, 5912, -268446, 311485, -105470, -122825, -88799, 29632, 170314, -26386, 242408, 238543, -229921, -4673, 104738, 175891, -107638, 351113, 170330, 208210, 92427, 24511, -24072, 141686, 153068, -6861, -114119, -111577, 109511, -20693, 176556, -277995, 469589, -198966, -157483, -208131, 235185, 267635, -194773, 88557, 307174, -32657, -249859, -238832, 34974, 136285, 310692, 63122, 85677, 291066, -152833, 180386, -211064, 286260, 90326, 76600, -14010, 327247, 36235, 137157, 48484, 314253, 301223, -36985, 288053, -30681, -56133, 8827, 54151, -6452, 24987, -334304, 64471, 224291, -61075, -5690, 19334, 172139, 213345, -46454, 174490, -100032, 83388]
11462a01932D2118c4657G0061K0046a08155A32196N0267j8905J20582a8412A42211
11450b8480G1277k0769J95961I9072a33912D48181A58598a99237A61090d25908
11439e6646I9624b4730B41708d1151J8299D53919a07118L7152b5092l4775A56528
11427B40620O9069c3952B26640a6410A31772d1520q5542L7814B9075g9170j31862
11416b11032i096J841j7095A97952a6750l7288A13647D2235L2280J9677M5594
11405A39786N986f3410l0576L2299D155a6647j21822l2607j28340g4803I4911
11393b41613A53212D6215a17066G6522L3441J01608C3548P3760J70331b17086
11382b31058H2170J20440r4470b35222B91421h0518A93096L126d13260a8277n4715
$$ y = [-101932, 42118, -34657, 70061, 90107, -108155, 132196, 182463, 163558, 284140, -18412, 142211, -28480, 71277, 50508, 246469, 99072, -133912, 448181, 158598, -199237, 161090, -425908, -56646, 99624, -24730, 241708, -41151, -22852, 453919, -107118, -69966, -25092, -59867, 156528, 240620, 309689, -33952, 226640, -16410, 131772, -41520, -127062, -89248, 29075, -79170, -211032, -9096, -7255, -24350, 197952, -16750, -54038, 113647, 42235, 74515, 94192, 139786, 145772, -63410, -93986, -61687, 4155, -16647, -138469, -171076, -299416, -74803, 94911, -241613, 153212, 46215, -117066, 76522, 109963, 211571, 33548, 107308, 277639, -217086, -231058, 82170, 202610, 108140, -235222, 291421, -80518, 193096, 196222, -413260, -18277, -72992]
11371g2992B93388f676n1628l0500p095K6890m8766B84283G0940f6862F9581J1329
11359H0910a03280A26930O7552J07118A02985a44604C30678F9167P6704b57406
11348a07243e847F4902b76276f7616o1377I3061J5219d0852B65253b32844j25367
11337c58211A06539A7468K1527d0949o0486K554J558j45316g6004A61861c64588
11325E34273G9105h6816D9221K11066c54677A1614Q7874J48983N0124C1633J43617
11314A75250F9088b85185J12006H4187J48835d43316f2701j80177R6672l8218
11304a84424A59070A2247a5879k60846Q4068B5421J91279D1131a67419A15964
11293a4011l46538H7858J14169b02752m4625O6578C640J30767a43575L156A64151
$$ y = [-72992, 293388, -6676, -58304, -88804, -95899, -69009, -117775, 284283, 70940, -66862, 69581, 80910, -103280, 126930, 194482, 301600, 102985, -144604, 330678, 69167, 145871, -257406, -107243, -5847, 64902, -276276, -67616, -128993, 93061, 108280, -40852, 265253, -232844, -358211, 106539, 17468, 38995, -40949, -101435, -98881, -97323, -242639, -76004, 161861, -364588, 534273, 79105, -86816, 49221, 260287, -354677, 11614, 99488, 248471, 298595, 31633, 175250, 69088, -285185, -173179, 84187, 233022, -443316, -62701, -242878, -146206, -184424, 159070, 12247, -15879, -276725, -192657, 25421, 216700, 41131, -167419, 115964, -14011, -360549, 87858, 202027, -202752, -247377, -180799, 3640, 134407, -143575, -140419, 164151]
11281A91643n1649d4744q9155b1473H9136a40079j40096A08303g0382b4542j84507
11270b09049Q4317b5917j2502a7247l20679n8676A02473b66221I4727b47301J0287
11259b37014e520C16872A46193b7551I803N2973K89575a34877K4669B78284d4048
11247a35656r3801L4549b8441j9395m32694a5294j98922A33091C261a03817M8116
11236e5701k46375a26994A35163c55323f8452B27287f5731B05337A9197a08441
11225i9484m5894f7701E4895J32433J12303a08578A28926a00250j95937J07601
11215a88586L4750a9138j16079I3463a60611K9683E1297O9519f4822r5756b2787
11203A79348f8275o912j9958b2739j23228j20789c6511l07023a02071d5226r6538
$$ y = [191643, 139994, -44744, -133899, -21473, 89136, -140079, -280175, 108303, -70382, -24542, -209049, -124732, -25917, -38419, -17247, -337926, -396602, 102473, -266221, 94727, -247301, -237014, -5520, 316872, 146193, -27551, 9803, 62776, 352351, -134877, -110208, 278284, -44048, -135656, -229457, -194908, -28441, -47836, -480530, -15294, -214216, 133091, 3261, -103817, -55701, -302076, -126994, 135163, -355323, -68452, 227287, -65731, 205337, 19197, -108441, -99484, -145378, -67701, 54895, 187328, 299631, -108578, 128926, -100250, -296187, -188586, -153836, -19138, -135217, 93463, -160611, -130928, 51297, 120816, -64822, -160578, -22787, 179348, -68275, -75187, -95145, -22739, -145967, -266756, -36511, -343534, -102071, -45226, -141764]
11192a41764A70837b42559Q4986A23033O1706c80665i7588j55171h7844D8337
11181C1730a21055I1688P9941b1217G0498K0996a59226E2321g4378I7803j1539
11170H6264f9395j2024h214l9797m3783B10647e4475m4247F0674a06907r2378
11159a99285h641B38274a64024h0171K0564A27193a70331A04549N5349c70353
11148I0503a97651b5512I7390a23027n806I9351e0387m3911A46045J23447b98517
11136D1936e0460B8205K19044e8l99243a68500k57381b09766m3159B26046a29779
11124C04230g8460P938E9905a30766E5389a71337L6988B05166a97164Q2443C47784
11112b95706C04798L357b50644B98085a95237C3657O8471J45774g1187A74260
$$ y = [-141764, 170837, -242559, -157573, 123033, 184739, -380665, -97588, -252759, -87844, 48337, 31730, -121055, 91688, 171629, -21217, 70498, 91494, -159226, 52321, -74378, 97803, 86264, -69395, -81419, -8214, -48011, -91794, 210647, -54475, -98722, 60674, -106907, -199285, -8641, 238274, -164024, -80171, -59607, 127193, -170331, 104549, 159898, -370353, 90503, -197651, -25512, 97390, -123027, -128833, 99351, -50387, -94298, 146045, 269492, -298517, 41936, -50460, 28205, 247249, -58, -399301, -168500, -425881, -209766, -252925, 226046, -129779, 304230, -78460, -70522, 59905, -130766, 55389, -171337, -134349, 205166, -197164, -114721, 347784, -295706, 304798, 308155, -250644, 298085, -195237, 33657, 102128, 247902, -71187, 174260]
11101A34390m753B4567N2827d1986j99750n8114f8406l7548q8536B90807f534
11089a36524A79153F5549A1915L5143a69168A37197k7650K58416A3165e5434H5584
11077B4243A0715K01967J09552a33911A29385J02460A08614d482D05997A17224
11066A16315n4207c28443C62533B5751J59694K13899A86141m4489M1336B0165
11055C8143f2348E629J52524a40903b726B10922q9781J75906j25973O7883o1050
11044A77907m9244K78664q8905K5924A71537J2024L64583B32216I7729K16330
11034C14059M08722j24177j27104j44646K2346K29407j6285K7538j06594L00065
11024G83331k74865j72519R7684b8513C13108J69267A99610L34865k6076j72463
$$ y = [134390, 129637, 24567, 77394, -41986, -241736, -299850, -68406, -105954, -194490, 290807, -6534, -136524, 179153, 65549, 11915, 47058, -169168, 137197, 109547, 367963, 13165, -55434, 85584, 24243, 10715, 212682, 322234, -133911, 129385, 231845, 108614, -4482, 405997, 117224, 116315, 62108, -328443, 362533, 25751, 185445, 399344, 186141, 141652, 182988, 20165, 38143, -62348, 5629, 158153, -140903, -2726, 210922, 121141, 297047, 171074, 238957, 177907, 128663, 407327, 318422, 344346, 171537, 183561, 548144, 232216, 97729, 314059, 722781, 598604, 471500, 326854, 349200, 578607, 562322, 589860, 483266, 783331, 508466, 335947, 433631, -28513, 313108, 482375, 199610, 534475, 508399, 335936]
11014C35936L9268J98555M7126J77457j42113j83314j4456J66256j62676l6428
11004D25611K85729k19j5763k49170J46509A91399L61434l269j55272k3533M1934
10993D12693K15737k78722J19256L8132K45741l17168j25076L05090k81268K41642
10983E76057K8018L2700J25246k28930j64474J42302k03982M43080B63175N12569
10973G75744j82565j1573J91735K81142l40583j2642K66859L3265k85337k80832
10963D35213O67773l18501M56855R5981k77359K84406j05146L16857R0273K89243
10953A935595j19114j5017K42740K36236l76580j39237R762m83350K19822m1960
10943A468897j15387K73332K43349o5041j47962p9652P2956k60764J56124m35128
$$ y = [335936, 375204, 573759, 620885, 798342, 656229, 472915, 458459, 624715, 462039, 425611, 711340, 711121, 695358, 446188, 592697, 191399, 552833, 549564, 394292, 370759, 412693, 628430, 349708, 468964, 507096, 752837, 435669, 310593, 615683, 334415, 576057, 604075, 636775, 762021, 533091, 368617, 510919, 306937, 750017, 263175, 775744, 593179, 581606, 773341, 1054483, 713900, 701258, 968117, 1001382, 716045, 435213, 1102986, 784485, 1241340, 1337321, 1059962, 1344368, 1239222, 1556079, 1646352, 1935595, 1816481, 1801464, 2044204, 2280440, 1903860, 1764623, 1774385, 1291035, 1510857, 1468897, 1353510, 1626842, 1870191, 1805150, 1657188, 1577536, 1650492, 1389728, 1545852, 1110724]
10933A110724L01107n75329L46370k63472k40760m8730A99518K29243q2204k4428
10923C22129E7709L27721j45253L12203I61K92445H5403e3948M952A25482L92545
10912E18027A66842b17475M4715j63484C68985b765B43452a64911B33434a13396
10901B61204a96052m7753R8862B22931e1183A06930d6447J7888j50959N3052C7458
10889H0991g4351A66039j3652c4963q6911o735l5075N9014d2110p658a9477C4099
10876H7720K36512b71588A6506a7805j22994B7898h7531a8279k17290k449K5323
10865b12695A41630d0532B24793J24228A59457M535a53671r5149D9566e4454A81401
10853f7312b407A15169O9502a12858D32673j56047i5026l8424A99254K6957a35261
$$ y = [1110724, 1411831, 836502, 1182872, 919400, 678640, 629910, 199518, 428761, 346557, 322129, 57709, 385430, 240177, 552380, 961, 293406, 85403, -53948, -48996, 125482, 518027, 166842, -217475, -172760, -336244, 368985, -2765, 243452, -164911, 233434, -113396, 261204, -196052, -243805, -144943, 222931, -51183, 106930, -46447, -28559, -179518, -126466, 37458, 80991, -74351, 166039, 152387, -34963, -121874, -128609, -163684, -104670, -42110, -49768, -19477, 34099, 87720, 324232, -271588, 16506, -17805, -140799, 27898, -87531, -18279, -235569, -238018, -212695, 141630, -40532, 224793, 349021, 159457, 163992, -153671, -248820, 49566, -54454, 181401, -67312, -2407, 115169, 184671, -112858, 432673, 276626, -95026, -133450, 199254, 226211, -135261]
10841a46710n6565d2950H8267h1548k58777j0458A12510k3067a95884O1684a4333
10829f0859m6324a5037m1187a3385j13249M0299B34773p2173c52601F1332J03294
10818A64626c2540m163j22055N6766n5557A0316b51457J06839q5804d4297A55293
10806a14365O243J7435q4881E33768B10102M8326h1200k84700h0605B7341N0658
10795G7999c61643c5822k75026N4755k66B00502D259a48233j3569j9837B1773
10783b42791J11120M9583n6576k50772A0400K73837j35972P5400a8960p8935n1055
10772a48950J2615q2801G9272h6776j45987o9232A77258b22684n63E4527K355
10761E6882a96292M4340B4271K96720a93639j03362a0670C2696J48928J2575L3524
$$ y = [-146710, -203275, -42950, 88267, -81548, -340325, -350783, 112510, 89443, -195884, -134200, -14333, -60859, -107183, -15037, -56224, -13385, -126634, -86335, 234773, 162600, -352601, 61332, 164626, -32540, -36703, -158758, -101992, -157549, 10316, -251457, -144618, -230422, -44297, 155293, -114365, -108122, -90687, -175568, 533768, 210102, 258428, -81200, -365900, -80605, 27341, 77999, -361643, -35822, -310848, -256093, -256359, 200502, 4259, -148233, -161802, -181639, 21773, -242791, -131671, -82088, -138664, -389436, 10400, 284237, 148265, 223665, -18960, -97895, -148950, -136335, -219136, 79272, -86776, -232763, -301995, 177258, -222684, -223247, 54527, 56882, -196292, -151952, 24271, 320991, -193639, -297001, -10670, 32696, 181624, 194199, 227723]
10750B27723c37606E6343a47272j3020j07404c0553G5185L3346b41599i1223a1898
10738g8681j90899g5781A50102a56592l8287Q9503B43818b15495o2393i8609n7199
10727a55808K8040e4747K7172n6859A56754d07316A03352a98234D53560a63381
10716B34841d36625a45419j81605B96182a97455D5646a94109l3054A14656J58281
10706B72937i3489k95446A26037b37964f3218D2257a86128B64021f4895B9195
10695h8785k28442f3127j83501O2256M9708I6151L6833r324b726B17908H1851
10683A3187a42178j80924a49689d0104j27630A06195a46941L3497A6669l288K25588
10672B38969a54108O2976e84j2369r9182a1164F6908L020a70479r6236a22458
$$ y = [227723, -337606, 56343, -147272, -160292, -267696, -30553, 75185, 108531, -241599, -91223, -11898, -78681, -269580, -75781, 150102, -156592, -194879, -105376, 243818, -215495, -277888, -98609, -155808, -127768, -54747, -27575, -84434, 156754, -407316, 103352, -198234, 453560, -163381, 234841, -436625, -145419, -327024, 296182, -197455, 45646, -194109, -227163, 114656, 272937, -93489, -388935, 126037, -237964, -63218, 42257, -186128, 264021, -64895, 29195, -88785, -317227, -63127, -246628, -184372, -134664, 96151, 132984, 123660, -2726, 217908, 81851, 13187, -142178, -323102, -149689, -40104, -167734, 106195, -146941, -113444, 16669, 13381, 238969, -154108, -91132, -584, -12953, -112135, -11164, 66908, 69928, -170479, -266715, -122458]
10660a85363l4990C0857d01828D8316a74862o5349E9635J6202c3028D0598h4085
10648a02680B62849a45839c0410p2856q0153A69999e8435b7491k41358q5895B63475
10636a32118e501l01105J3654J27717c2155E183a05018a8530l15134a25944M1090
10625h4854k44319B84513r0733c38099E8871b62000d5691j75010A06629k0335
10615H6294l8583b06972a00143m3688l02525E5367b04596F8498K60962D3997b8148
10603C1227O860I854e5087k28707g3801R211j52801A61495o7858B2000e0278k41405
10591b91683f4861K5133G1002a87622G2302a48620m6767A57444o2203a56444D0231
10579b19216m6403B4188a36536c7148B45497b2628D395a98928n2386f1358q2757
$$ y = [-185363, -220353, 30857, -401828, 48316, -174862, -240211, 59635, 75837, -33028, 40598, -84085, -102680, 262849, -145839, -30410, -103266, -183419, 169999, -58435, -27491, -268849, -354744, 263475, -132118, -5501, -306606, -292952, -165235, -32155, 5183, -105018, -18530, -333664, -125944, -84854, -329173, 284513, 193780, -338099, 58871, -262000, -45691, -220701, 106629, 86294, 47711, -206972, -100143, -143831, -446356, 55367, -204596, 68498, 329460, 43997, -28148, 31227, 38087, 9854, -55087, -283794, -73801, -64590, -217391, 161495, 93637, 22000, -50278, -291683, -64861, -39728, 71002, -187622, 72302, -148620, -195387, 157444, 95241, -156444, 40231, -219216, -265619, 24188, -136536, -37148, 245497, -22628, 4395, -198928, -251314, -61358, -144115]
10568a44115L9336G1660a88749d6646o1623j65195A55372a00910F3251h0516J3686
10557f6830A09688e5299K4668k11173E9350g5877B57472j27949f2070G2852l3359
10546C9493c85781a50566i407I031f8291b4289l7208E8535e1983A756P6050h1531
10533a95086A17812J25245P8994a21438J8607j71962b9774E8305a40810D869P0077
10522G4946b10667A51710d51140a7089j84980c475k843j20945o7415I9153c0372
10510e0756F902b03244D0169C933J88217b597k31027E2246b70663j5323j73753
10499d59739b0047j09905j17033g0857q4958d4050G6720a80822b1834G577a14124
10487b94327i0800d4207I2105d167A85368f6453n0123C1752g8766J640B04294
$$ y = [-144115, -104779, 71660, -188749, -46646, -108269, -273464, 155372, -100910, 63251, -80516, -66830, 109688, -55299, -30631, -241804, 59350, -75877, 257472, 129523, -62070, 72852, 39493, -385781, -150566, -9407, 9031, -68291, -24289, -61497, 58535, -51983, 1756, 77806, -81531, -195086, 117812, 243057, 322051, -121438, -102831, -274793, -29774, 58305, -140810, 4869, 74946, -210667, 151710, -451140, -17089, -202069, -3475, -6318, -127263, -194678, 99153, -30372, -50756, 6902, -203244, 40169, 3933, 192150, -2597, -233624, 52246, -270663, -285986, -459739, -20047, -129952, -246985, -70857, -155815, -44050, 76720, -180822, -21834, 7577, -114124, -294327, -90800, -44207, 92105, -4167, 185368, -66453, -116576, 31752, -78766, -77126, 204294]
10475I479c26689I1770I934a86640B88328A03076e801j30524a1518q9389B36195
10463D3434a23995A39527K29685q7591M17178l22579j4627P2105F7596R4380o2204
10452I9772i1348B893a13213E8804d8133I9151a23626A17788L0037n3748e8855
10440B78765d10434I4468c01254A6095g8565k00377A21851d7047r6003B69998
10429B75080b3371A95799A2309a17267L5027j78192A49120k6590a29049j5004
10419a44053l0491D6645R6680a94529b2A02180a01979M5540k57390C1888c64122
10407a23835e5622A21137A7488f6304a912l97254J70603a8190H2282K5740b49189
10395A58214b27274A86279d094B00818n4560h411p2575j46398B40774A9732a52366
$$ y = [9479, -326689, 91770, 9934, -186640, 288328, 103076, -5801, -136325, -11518, -100907, 236195, 43434, -123995, 139527, 369212, 281621, 698799, 376220, 361593, 433698, 67596, 161976, 99772, -91348, 2893, -113213, 58804, -48133, 99151, -123626, 117788, 147825, 94077, -58855, 278765, -410434, 94468, -301254, 16095, -78565, -278942, 121851, -47047, -143050, 269998, 275080, -23371, 195799, 12309, -117267, -82240, -260432, 149120, 122530, -129049, -144053, -174544, 46645, 143325, -194529, -22, 102180, -101979, -56439, -313829, 31888, -364122, -123835, -55622, 121137, 17488, -66304, -1912, -399166, -228563, -18190, 82282, 108022, -249189, 158214, -227274, 186279, -4094, 200818, 146258, -8411, -80986, -227384, 240774, 19732, -152366]
10383f9919A61376P2927a57123N5921d8661B04309F830L21751j52039a0397B4919
10371a15743j0180C34722c11020B89963H3237k4847L3416B9959a01853B8947A2976
10359d3249F5445J57751A04892l5497L86228j45594A10412A8975L033Q948M05913
10348D36869q4831f7870D05294k6293A53802M07143B25883K80293k48508j18148
10338A39520K18280G6958a84810B30335L0799o7041n709A1443K61846j01977L15227
10327D86539j64890j55028l0835n5818K12308O6640p8484l4750P525r8427o5032
10316H9748H07J2545d4266B06937a55881C72595a60931C878K37142k4295H6258
10304c2100B46351j7797o2001b263I9823j7815K07688l559E2483J60970j3278
$$ y = [-69919, 161376, 234303, -157123, -101202, -48661, 204309, 6830, 328581, 176542, -10397, 24919, -115743, -125923, 334722, -311020, 289963, 83237, 58390, 91806, 29959, -101853, 28947, 12976, -43249, 65445, 223196, 104892, 69395, 455623, 310029, 110412, 18975, 22008, 30956, 436869, 352038, -67870, 405294, 379001, 153802, 560945, 225883, 506176, 257668, 139520, 357800, 76958, -184810, 230335, 261134, 194093, 188384, 11443, 273289, 171312, 486539, 321649, 166621, 135786, 79968, 292276, 358916, 280432, 245682, 253207, 154780, 89748, 807, 13352, -44266, 206937, -155881, 372595, -160931, 3878, 241020, 216725, 86258, -32100, 246351, 228554, 166553, -2263, 99823, 82008, 289696, 286137, 52483, 213453, 200175]
10293B00175c0129a3715k68540b2988D1760L99399d20348b09535I2955P2616A5427
10281B6336c22327F8516b05730P2342r1969A65236O6779b03055O5855G9514b01385
10269c23123A75442A0217a21444k430l599M8279K1807j93650R7485f3821G4717
10257c39928a39600M098G2903a99247B03787f1767j33589N1755B9082a19998c9555
10245i0282j06603f0884j10312h5251j11367A23700M4494F2288J06620K48036
10235D16944A25857K03983D9261L36665B4005J54662E906N0037K6655P5987G6247
10223F5557J85434b08849B0918a6713B22256b1682I9470A9201b4716H5618a45587
10211B23039b27878j76I4809g4781A2353J6347K92792H5915b30566F9862N9675
$$ y = [200175, -30129, -13715, -282255, -22988, 41760, 441159, -420348, -209535, 92955, 165571, 15427, 26336, -322327, 68516, -205730, -133388, -225357, 165236, 232015, -203055, -137200, 79514, -201385, -323123, 175442, 10217, -121444, -123874, -127473, -79194, -57387, -251037, -153552, -63821, 74717, -339928, -139600, -135502, 72903, -199247, 203787, -61767, -195356, -143601, 29082, -119998, -39555, -90282, -196885, -60884, -171196, -85251, -196618, 123700, 168194, 62288, 168908, 416944, 125857, 329840, 49261, 385926, 24005, 178667, 5906, 55943, 82598, 158585, 76247, 65557, 250991, -208849, 20918, -16713, 222256, -21682, 99470, 19201, -24716, 85618, -145587, 223039, -227878, -228054, 94809, -74781, 12353, 28700, 321492, 85915, -230566, 69862, 129537]
10200A29537b21511C09132C3883m027f556A5190b1394k6921p2980A62660f8631
10188B0072c80599A45600k6566c1668A99767c06717f0360m1495j35612J11150
10178a26317m0085k1475f5441l20307j93502B10386b6489C6030R6772b90213b7742
10166A9426M871a49444F019b16821B15960a51474D68191b23716d8524H7677a12893
10154d07014a01165B07707G5815f981L024A4738g5097c5339o5337J0993G4988
10142a84371m2140O4752A15425a35527B09039c05972J37475B17965h181A1558
10131D02438b44031B90859b38617A64816e3902I0058q521b67595R0159b6974r8075
10120a25049K1029n4104g8595A48709h8881l9275e6621l3641G2587g0163k42288
$$ y = [129537, -221511, 309132, 33883, 29856, -6556, 15190, -21394, -48315, -121295, 162660, -68631, 20072, -380599, 145600, 119034, -31668, 199767, -306717, -60360, -101855, -237467, -126317, -166402, -187877, -65441, -385748, -579250, 210386, -26489, 36030, 132802, -290213, -27742, 19426, 24297, -149444, 6019, -216821, 215960, -151474, 468191, -223716, -48524, 87677, -112893, -407014, -101165, 207707, 75815, -6981, -3957, 14738, -75097, -35339, -100676, -89683, 74988, -184371, -226511, -161759, 115425, -135527, 209039, -305972, -168497, 217965, -8181, 11558, 402438, -244031, 290859, -238617, 164816, -53902, 90058, 81537, -267595, -177436, -26974, -125049, -104020, -158124, -78595, 148709, -88881, -128156, -56621, -90262, 72587, -70163, -312451]
10109c12451q1893a62449f6548p154j82688F5642b07519d2874G8104L9221a64663
10097h197j90157j1524M2243J5801K9653A7711K18213e971o9118b421A34957n2495
10085H2462b83072i9646o0633H877a34305H705b36892f1163g70C1710L56333a51701
10072b98021i3712j19558A3564a91487j70722F2177L6963O3929a81931N2257m9540
10061a79214L608G5174I397h3241J4697J6326n0662B3854l076b45089m507j36250
10049c85846G6381P8302a22368A91656m5172b78942g5169a2339j58842A63444
10038C0729R7507e0923r5978D9847a66664A9736e24118b35081h270l5166C07183
10026B3902J03493b4791k7289b062j28062d4521A3177R5256B8135d0257j88436
$$ y = [-312451, -394344, -162449, -66548, -73702, -256390, 65642, -207519, -42874, 78104, 117325, -164663, -8197, -198354, -209878, -167635, -151834, -122181, 17711, 235924, -5971, -75089, -2421, 134957, 82462, -283072, -99646, -160279, 8877, -134305, 8705, -236892, -61163, -770, 31710, 388043, -151701, -298021, -93712, -213270, 13564, -191487, -362209, 62177, 99140, 163069, -181931, -129674, -179214, -175606, 75174, 9397, -83241, -68544, -52218, -102880, 23854, 20778, -245089, -249596, -385846, 76381, 154683, -122368, 191656, 146484, -278942, -75169, -12339, -171181, 163444, 30729, 128236, -50923, -146901, 49847, -166664, 19736, -524118, -235081, -8270, -43436, 307183, 23902, 127395, -24791, -52080, -2062, -130124, -44521, 13177, 108433, 28135, -40257, -228693]
10015b28693f1750K9687A39138k7000a24929j3454A1328K5597d0471A08348e0177
10003a91486I0732M2824b7741F3371J4418b61543P0238G6562g7645H9758a73491
9991A76778a73856d7173k93391B354L0595b34226G4974a41568A39544b33777A36021
9979c52877a52637p0520f3674J4285k4809j45649a0833A1334f2011j83089k5661
9968b70761P9242D8419M3080c33533J07842B22319b7147l24122h6822p7480B49489
9956a62813D7058P2039b82873K7001F283h1962A18334a54656j27943g4779k49501
9945c24280e1216B40876b19886K4619A26543d1650o9891J6013J9634r4437D11982
9933a90414C5911b32715B36186b6246m4236A182b87455R3871G7894i4576E956
$$ y = [-228693, -61750, -32063, 139138, 112138, -124929, -138383, 11328, 36925, -40471, 108348, -50177, -191486, 90732, 133556, -27741, 63371, 77789, -261543, -191305, 76562, -77645, 89758, -173491, 176778, -173856, -47173, -340564, 2354, 32949, -234226, 74974, -141568, 139544, -233777, 136021, -352877, -152637, -223157, -63674, -49389, -74198, -219847, -10833, 11334, -62011, -245100, -270761, -191519, 48419, 91499, -333533, -225691, 222319, -27147, -351269, -86822, -164302, 249489, -162813, 47058, 119097, -282873, -255872, 6283, -81962, 118334, -154656, -282599, -74779, -324280, -51216, 240876, -219886, -195267, 126543, -41650, -111541, -95528, -75894, -170331, 411982, -190414, 35911, -232715, 236186, -26246, -70482, 1182, -287455, -193584, 77894, -94576, 5956]
9921E7350d17481A74803a14038E9764f4744j36440P3270A93168f10049b85344
9910b11155L0981E5205J69589e9781G1947J16538k4807d89752K22075J2302A18569
9898F2764c92129a4951j10156D0966i6997l49384a49554B035a38697F8841a72775
9886c45141a50595F0370K502a43497p4716i6119M2927l47488J42345C5932a3499
9874F2739J67815p331a96254a2617q651a0040A27876a40470A52813b52551A57427
9862B00158a04083D55350A20617a64721F6817b70623B98096d0476p5244d3818
9851A71693e3303k43582Q8082N5748O5112F2514d28270K11321k3501A62715c2265
9839A42546g1280C8147K3578d9270D1097A7205c74244j3705a56213B53198d6337
$$ y = [57350, -417481, 174803, -114038, 59764, -64744, -201184, -127914, 193168, -610049, -285344, -211155, -180174, 55205, 224794, -59781, 71947, 188485, 163678, -489752, -267677, -255375, 118569, 62764, -392129, -14951, -125107, 40966, -96997, -446381, -149554, 2035, -138697, 68841, -172775, -345141, -150595, 60370, 62872, -143497, -218213, -96119, -53192, -400680, -258335, 35932, -13499, 62739, 230554, 223223, -196254, -12617, -21268, -10040, 127876, -140470, 152813, -252551, 157427, 200158, -104083, 455350, 120617, -164721, 66817, -270623, 298096, -40476, -115720, -43818, 171693, -53303, -296885, -208803, -153055, -87943, 62514, -428270, -216949, -240450, 162715, -32265, 142546, -71280, 38147, 61725, -49270, 41097, 17205, -374244, -387949, -156213, 253198, -46337]
9827a89810i3923r2461j84179C3701b29851i4172q8688A41948m4764a87710h4147
9815A95660i2644D1899a94003A51563D2727J41653d5237M912H9361f5702r6978
9804a62680O6442C38251A11697c6947E1586a95184A9229c88406a00233b9595A3937
9792A67084P3378a22181D1792c10165A77160a54856A44967A3136c11842A49346
9781b70933g99j5521C19349b47915J09798e1459o1263b1889l4076j83362e7943
9769b26722D9485b71058n7411d3696l01462B29787b52003Q36B02770f3965A11388
9757H7904a63875e9619k75462a896k18217J03916k6858d6778A25581b22916A0078
9745e3255l0274o1159k6376C8732N4147c4493k79652e5112D8968n618d2009k40835
$$ y = [-189810, -93923, -186384, -370563, 33701, -229851, -94172, -182860, 141948, 97184, -187710, -84147, 195660, -92644, 41899, -194003, 151563, 42727, 184380, -45237, -40325, 89361, -65702, -162680, -96238, 338251, 111697, -36947, 51586, -195184, 19229, -388406, -100233, -29595, 13937, 167084, 240462, -122181, 41792, -310165, 177160, -154856, 144967, 13136, -311842, 149346, -270933, -799, -16320, 319349, -247915, -138117, -51459, -112722, -21889, -55965, -239327, -57943, -226722, 49485, -271058, -328469, -43696, -345158, 229787, -252003, -251167, 202770, -63965, 111388, 87904, -163875, -59619, -335081, -1896, -220113, -116197, -143055, -46778, 125581, -222916, 10078, -53255, -83529, -144688, -171064, 38732, 92879, -34493, -314145, -55112, 48968, 43350, -42009, -282844]
9733b82844J2341O869a2138m3510B57097c03897A60370D250a60333q5030f0920
9721C80939h9499l95655A18937a68312A02099d4855j5623A1027a1234j39608M4510
9710a06332j9936C0171a85785F0199g4224G6198d0418k92659f8712l40l32502
9699d01554a79455B9692a12425A68241C7516j3465J75253d33278I8490b4988p930
9688c2918D3804h7051C45106d4470j19044j85642A84517B2060a08277A3222b06746
9676B01214E1992b68707b5208k02131J8454D7215a32365j36289J00723B21076
9665d51393b17398O6641A18195R148a89894A77659J27379J38529G8176a15380
9654A15902b65096N5208j17592H0127J69328e5905k81939G09c24404c3380j68600
$$ y = [-282844, -270503, -263634, -12138, -55648, 257097, -303897, 160370, 4250, -160333, -245363, -60920, 380939, -89499, -485154, 118937, -168312, 102099, -44855, -60478, 11027, -11234, -150842, -106332, -126268, 30171, -185785, 60199, -74224, 76198, -40418, -333077, -68712, -69052, -401554, -179455, 29692, -112425, 168241, 37516, 24051, 199304, -433278, 98490, -24988, -32918, 43804, -87051, 345106, -44470, -163514, -349156, 184517, 22060, -108277, 13222, -206746, 201214, 51992, -268707, -25208, -227339, -208885, 47215, -132365, -268654, -167931, 221076, -451393, -217398, -150757, 118195, 127343, -189894, 177659, 305038, 443567, 78176, -115380, 115902, -265096, -209888, -327480, 80127, 249455, -55905, -337844, 709, -324404, -33380, -201980]
9643b01980D8725a10211l12765a80374e4779J9294k65476M9416E4854a40020p6492
9632b16512R556M6536D8981i0662K0807A52181b33673J09586B01525c6203j08124
9621a44327C8073c3463q9815C04008a76771D499M2429O5453l0038N060J04624
9610A92027d48263e0585l41292a5946j82245D8094a65240H0927Q6792e05021B0536
9598h4185n36938b60631a08144l43009N1363i0794B51410c12616F8073f9276A67913
9586A81965D4786K48389h862m9731B8524K04379b28073H7082J52461b66787a03296
9574a65789E5689A1096K58152a76674D44825a10997J725k57609G3961q428J3138
9563G8671c1223H1929b063B17783C9910a01385j70743f7150H172b94572B70749
$$ y = [-201980, 48725, -110211, -422976, -180374, -54779, -35485, -300961, -251545, 54854, -140020, -216512, -206956, -160420, 48981, -90662, -69855, 152181, -233673, -124087, 201525, -36203, -144327, 38073, -33463, -123278, 304008, -176771, 4499, 46928, 112381, 82343, 87403, 192027, -448263, -50585, -391877, -15946, -198191, 48094, -165240, 80927, 167719, -505021, 20536, -84185, -621123, -260631, -108144, -451153, -399790, -90794, 251410, -312616, 68073, -69276, 167913, 181965, 44786, 293175, -8862, -58593, 28524, 232903, -228073, 87082, 239543, -266787, -103296, -165789, 55689, 11096, 269248, -176674, 444825, -110997, -109272, -366881, 73961, 65533, 78671, -31223, 81929, -2063, 217783, 39910, -101385, -272128, -67150, 8172, -294572, 270749]
9551d22206O633A49819a41859D108J7330L88265a88584o3130g2500B92553b23130
9539D7615a06184k8521B8184L00837c27397A48540j5104R747L5833F0361a8973
9527E399e4378j30410h3961J0131k77043A06627a04345m0260o8720l8229J01842
9516a49712P940L5728A6385K7220J76235I2540c24999a55378k73435g9920j25813
9505b05733a3772j83643B54495A11872a6536l75063a4655A82602A3861A475a30006
9493C8592J72347d78356A66257f8683c920j6126j28070I7393C8069L47189b59747
9481b50353J23066a7912j50140g0844a7915A3203e1324l08237A32664c86260a931
9469g1672o420j8892k44143I4296l7422a00734m3530B50770c77327h131k4455
$$ y = [-422206, -415573, 149819, -141859, 4108, 21438, 409703, -188584, -251714, -72500, 292553, -223130, 47615, -106184, -134705, 28184, 329021, -327397, 148540, 133436, 143183, 179016, 60361, -18973, 5399, -54378, -184788, -83961, -73830, -350873, 106627, -104345, -144605, -213325, -251554, -149712, -141772, -106044, 16385, 43605, 219840, 92540, -324999, -155378, -428813, -79920, -205733, -13772, -197415, 254495, 111872, -16536, -391599, -14655, 182602, 13861, 1475, -130006, 38592, 210939, -478356, 166257, -68683, -3920, -20046, -148116, 97393, 38069, 385258, -259747, -250353, -127287, -17912, -168052, -70844, -17915, 13203, -51324, -359561, 132664, -386260, -1931, -71672, -78092, -96984, -341127, 94296, 56874, -100734, -144264, 250770, -377327, -8131, -32586]
9458c2586A16877a37251A61585i6145A27395b61024D8677P6929a97870k63384
9448d61254a20183C1470p575e6382E2986a0244j67625B3331K3977M5386b82596
9436a17336j97492P4281E47422e34993d9939k16375F2179i4296k7030j67209h8636
9424C9936K68959f2712k31813J39916O1877B18926F6710k4188L4830F171a46103
9412A30838i6762b3756j7788B42448a49822K7740d4825n2817n948B48099C2861
9400A03160K6490N7525b51698J00130d399k02417H2550P8836f0917E6357a00254
9388C47748a48649C3371a1486E5542c55124A95322a22551j6459b7779o4503j72396
9377b64678F191J40985J37051c36463B33943b65193J25182j0142C03117A6597
$$ y = [-32586, 116877, -137251, 161585, -96145, 127395, -261024, 48677, 125606, -197870, -461254, -120183, 31470, 23895, -56382, 52986, -10244, -177869, 23331, 47308, 92694, -282596, -117336, -314828, -240547, 547422, -534993, -49939, -266314, 62179, -94296, -121326, -288535, -88636, 39936, 308895, -62712, -294525, -154609, -92732, 218926, 66710, 42522, 77352, 6171, -146103, 130838, -96762, -23756, -41544, 242448, -149822, -122082, -44825, -97642, -103590, 248099, 32861, 103160, 129650, 187175, -251698, -151568, -4399, -206816, 82550, 161386, -60917, 56357, -100254, 347748, -148649, 33371, -11486, 55542, -355124, 195322, -122551, -139010, -27779, -92282, -264678, 6191, 147176, 284227, -336463, 233943, -265193, -140011, -150153, 303117, 16597]
9366H6108a32381M5262k74538a54424c2899p5825L4164l21872h927j63020j4538
9355a86485g0903p0105d1140M318A15375b63358a9063A03145e38117b5068A70370
9343b24819n7661E1576J10764G2367a71611O81e2947F6629i1995m8044A87619
9331A15992c11303A52735a50645D5705a65049k82779A76107e1354k63995F3723
9320b98494g7923R439G390O6152B2350J28569J68878e14892d2258A14691h0317
9308a93263F3576J6455b40581J08562M8776p0038L0145k35764E4999c05063a05636
9296a85083A1137a04095j48782j94969A44174c8131p9492A16524n0536b49590
9285b20204F79a29633j32294Q0215M537a5745A23840b11285B69550j26710b36457
$$ y = [86108, -132381, -87119, -361657, -154424, -32899, -108724, -74560, -396432, -8927, -171947, -186485, -70903, -141008, -41140, -36822, 115375, -263358, -19063, 103145, -538117, -25068, 170370, -224819, -282480, 51576, 162340, 72367, -171611, -170930, -52947, 66629, -91995, -140039, 187619, 115992, -311303, 152735, -150645, 45705, -165049, -447828, 176107, -51354, -315349, 63723, -298494, -77923, -68484, 7390, 73542, 22350, 150919, 319797, -514892, -42258, 114691, -80317, -193263, 63576, 80031, -240581, -132019, -83243, -153281, -123136, -358900, 54999, -305063, -105636, -185083, 11137, -104095, -252877, -447846, 144174, -38131, -117623, 116524, 65988, -249590, -220204, 679, -129633, -261927, -181712, -177175, -15745, 123840, -211285, 269550, 142840, -236457]
9273f4032m4326B157b73460A34515b04410e2082j61961c0266j05484Q218E3397
9261b98309A08868m6463a79637E4918J38268b2829A61953a83034r1504f5908J7337
9250d8571a5193B09776j448g4542j86039E3207b60290B95135a27586B27785c8022
9238B01063b28190k569A7329g6056H0244A2844e7795l8042j79529J32226j34134
9227b77274I3686b55977m9626J19798k29338c6676H8299O9766c44272a12683i077
9215A32273C7082c2409P947q3613j7339N6717k59548a63303a0172l38236B26574
9203c16938D5379e6992A37761f0082l1601B6499C807c8865n53770a00665a7796
9191A08099J05604a27786p4825K3440B18380a15167j9172b4716G2441B3402a04051
$$ y = [-64032, -108358, 2157, -273460, 134515, -204410, -52082, -214043, -30266, -135750, -127532, 53397, -298309, 108868, 62405, -179637, 54918, 193186, -22829, 161953, -183034, -274538, -65908, -48571, -15193, 209776, 208328, -74542, -260581, 53207, -260290, 295135, -127586, 227785, -38022, 201063, -228190, -230759, 17329, -76056, 80244, 12844, -57795, -95837, -275366, -143140, -277274, 93686, -255977, -305603, -185805, -415143, -36676, 88299, 158065, -344272, -112683, -9077, 132273, 37082, -32409, -24462, -108075, -125414, -68697, -328245, -163303, -10172, -348408, 226574, -316938, 45379, -56992, 137761, -60082, -91683, 26499, 3807, -38865, -592635, -100665, -17796, 108099, 213703, -127786, -202611, -179171, 218380, -115167, -134339, -24716, 72441, 23402, -104051]
9179A8166d02149F4484P9596b1991H0763J81640B3057b3071j97917a9765A10645
9167a37717f7859H2680d544D6603a6799G0231K2375e5196B13088a27834k27360
9156c55194A88445C5063N572a81069j34572a24792B84166a96105m5279N5056d0765
9144G3184b44066Q4448K7748A5907f3950r5453j1934j02631a5801A77700e9957
9132b55105B66475b13231b5951G0005e0593j9312G3554L4642b98938a37424O6966
9121g0458p2716k08888I161M1143f28p0927j36779K5379N2002l2673l8838n0309
9109b52773F3220c80172R2570a22133k23765A72578f202G4568g0345B20945c26151
9097c65798A02602b02375q9790B2831c72178A664c932I4186C4176a24960B6206
$$ y = [18166, -402149, 64484, 144080, -21991, 80763, 262403, 23057, -23071, -220988, -19765, 110645, -137717, -67859, 82680, -4544, 46603, -16799, 70231, 92606, -55196, 213088, -127834, -355194, 188445, 35063, 40635, -181069, -315641, -124792, 284166, -196105, -241384, -186328, -40765, 73184, -244066, -159618, -131870, 15907, -63950, -159403, -171337, -273968, -15801, 177700, -59957, -255105, 266475, -213231, -25951, 70005, -50593, -69905, 73554, 108196, -298938, -137424, -70458, -143174, -352062, 9161, 50304, -628, -71555, -208334, -182955, -130953, -163626, -202464, -252773, 63220, -380172, -287602, -122133, -345898, 172578, -6202, 74568, -70345, 220945, -326151, -365798, 102602, -202375, -292165, 22831, -372178, 1664, -3932, 94186, 34176, -124960, 26206]
9085A50705o7553j8547Q551J73571m6566r7824J7250F30a2143p7257b2126q6871
9073a08997H9764c45072j9070b1102G7512j9122c46661g3201b9381k28564f4485
9061g1994j15556D622c05775o4076A40229c50105D9629J42454F7214h9430B89836
9049a31382j12854d3971j19102N1468q8716L6010B7641e7637J5927A28965d2217
9037c86392i0375A25721j2613b78002J26947n1308B21049D5498f7964j09102D9564
9025I2772a56097l37887C7262G286K45656c34286A90447R398o587a18342j7919
9014a36261G4010J70547r2909a7261E8053a30097e0439G6590C1654K1285b90679
9002c51031a40791p1205k6307D5157L8655b15957F4790a22876C1098A1778J2748
$$ y = [150705, 83152, 64605, 73156, 246727, 200161, 102337, 119587, 630, -12143, -89400, -22126, -108997, 89764, -345072, -364142, -21102, 77512, 58390, -346661, -73201, -29381, -257945, -64485, -71994, -187550, 4622, -305775, -369851, 140229, -350105, 49629, 192083, 67214, -89430, 289836, -131382, -244236, -43971, -163073, -111605, -200321, -164311, 27641, -57637, -41710, 128965, -42217, -386392, -90375, 125721, 113108, -278002, -151055, -202363, 221049, 45498, -67964, -177066, 49564, 92772, -156097, -493984, 37262, 7286, 252942, -334286, 190447, 199845, 193258, -118342, -136261, 74010, 244557, 151648, -17261, 58053, -130097, -50439, 76590, 31654, 52939, -290679, -351031, -140791, -211996, -238303, 45157, 83812, -215957, 64790, -122876, 31098, 11778, 24526]
8991B4526a86574b804F0903d7163n00185H7467a62146j2786F38a72728p5001A6088
8978g9564D5713e328k92697h9903B09925a74439j3504q428q7928P1124c2711k38578
8966b71289g6628L3972a3116A12942e8446A34754c26863e3968a0397l2755j96448
8955b39600A04741c4944n6022A12587K7475b39666O9081K7117B99123b03801g047
8943a15464m884D62640j71937e62874K07025A26273g3130J8544m1602r0310d5448
8931b76841B2752K36892E5192M7940a24230d9131q6708A74039b47606F2509a52682
8919G6096L3373J62735B7817R5394J94952O9016N2973g7312C33224Q938q6105
8908B56057L51347j19290N92734K76215J296797L132972J142050C063161j336113
$$ y = [24526, -186574, -2804, 60903, -47163, -547348, 87467, -162146, -174932, 638, -172728, -247729, 16088, -79564, 45713, -5328, -298025, -89903, 209925, -174439, -187943, -196371, -284299, -213175, -32711, -271289, -76628, -42656, -13116, 112942, -58446, 134754, -326863, -53968, -10397, -43152, -239600, 104741, -34944, -90966, 112587, 140062, -239666, -170585, -143468, 299123, -203801, -7047, -115464, -120348, 462640, 290703, -562874, -355849, 126273, -73130, -54586, -96188, -186498, -45448, -276841, 22752, 259644, 55192, 103132, -124230, -49131, -135839, 174039, -247606, 62509, -152682, 76096, 109469, 272204, 27817, 123211, 318163, 387179, 440152, -77312, 333224, 342162, 256057, 607404, 488114, 1080848, 1357063, 2653860, 5786832, 6928882, 3063161, 1727048]
8899A727048G80697j72036n4359B03435c6824A66178p8300a5436j16567C99714
8888E2670M63586d4391J3421o6284A24178b6869q1115m5194a6453B46997a39090
8876A76886a8044C5438b37112G7980J05532H3832a13534c3656o071k45449h6643
8864e1251D4398h5384B82589d9839b2969k4128K1492j18661a8911j49259l4714
8853b02884A65245a43737f5904C55d3218A44804M0337c19897a57612F5605b80744
8841d0927f897p7639j81090e9688q4530j77289F7947J99910p8924b45523L1355
$$ y = [1727048, 780697, 608661, 554302, 203435, -36824, 166178, 87878, -15436, -132003, 399714, 52670, 516256, -44391, -30970, -97254, 124178, -26869, -107984, -153178, -16453, 246997, -139090, 176886, -18044, 35438, -237112, 77980, 183512, 83832, -113534, -33656, -39727, -285176, -86643, -51251, 44398, -85384, 282589, -49839, -22969, -47097, -25605, -144266, -18911, -168170, -202884, 165245, -143737, -65904, 355, -43218, 144804, 185141, -319897, -157612, 65605, -280744, -40927, -6897, -84536, -265626, -59688, -144218, -321507, 67947, 267857, 188933, -245523, -214168]
$$ [...]
##END NTUPLES=NMR SPECTRUM
##END=
