
##TITLE=AC1171_Tolima-ibage-TiCOAH12008_5890718_Qsy8AbS86e
##JCAMPDX= 6.0         $$ Bruker NMR JCAMP-DX V2.0
##DATA TYPE= NMR SPECTRUM
##DATA CLASS= NTUPLES
##ORIGIN= BRUKER
##OWNER= Administrator
$$ 1.72 TOPSPIN		Version 2.1
$$ 2012-04-02 15:50:54.078 -0500  Administrator@TOPSPIN
$$ Compression mode = diff/dup
##.OBSERVE FREQUENCY= 400.13188235
##.OBSERVE NUCLEUS= ^1H
##.ACQUISITION MODE= SIMULTANEOUS (DQD)
##.ACQUISITION SCHEME= undefined
##.AVERAGES= 64
##.DIGITISER RES= 22
##SPECTROMETER/DATA SYSTEM= spect
##.PULSE SEQUENCE= noesygpps1d.comp
##.SOLVENT NAME= COFFEE_meoh
##.SHIFT REFERENCE= INTERNAL, COFFEE_meoh, 1, 14.96874
##AUDIT TRAIL= $$ (NUMBER, WHEN, WHO, WHERE, PROCESS, VERSION, WHAT)
$$ ##TITLE= Audit trail, TOPSPIN		Version 2.1
$$ ##JCAMPDX= 5.01
$$ ##ORIGIN= Bruker BioSpin GmbH
$$ ##OWNER= Administrator
$$ $$ C:\Bruker\TOPSPIN/data/COFFEE/nmr/AC1171_Tolima-ibage-TiCOAH12008_5890718_Qsy8AbS86e/12/pdata/1/auditp.txt
$$ ##AUDIT TRAIL=  $$ (NUMBER, WHEN, WHO, WHERE, PROCESS, VERSION, WHAT)
(   1,<2012-04-02 15:50:48.531 -0500>,<Administrator>,<TOPSPIN>,<go>,<TOPSPIN 2.1>,
      <created by zg
	started at 2012-04-02 15:39:16.468 -0500,
	POWCHK enabled, PULCHK disabled,
       configuration hash MD5:
       1A 1E CE 29 27 FD 77 03 67 4E F0 E3 C4 B2 CB 90
       data hash MD5: 64K
       8F 98 6C 0C D7 93 65 3B 29 30 18 C6 97 DA 89 4F>)
(   2,<2012-04-02 15:50:51.687 -0500>,<Administrator>,<TOPSPIN>,<proc1d>,<TOPSPIN 2.1>,
      <Start of raw data processing
       efp LB = 0.3 FT_mod = 6 PKNL = 1 PHC0 = 0 PHC1 = 0 SI = 128K 
       data hash MD5: 128K
       CD BF B2 D1 62 3E 46 47 BA 6A EB 80 59 26 C0 C4>)
(   3,<2012-04-02 15:50:53.109 -0500>,<Administrator>,<TOPSPIN>,<proc1d>,<TOPSPIN 2.1>,
      <pk PHC0 = 37.75452 PHC1 = 0 
       data hash MD5: 128K
       B5 58 2F F2 89 FA B5 5B 14 A7 18 39 34 0F 11 00>)
(   4,<2012-04-02 15:50:53.437 -0500>,<Administrator>,<TOPSPIN>,<proc1d>,<TOPSPIN 2.1>,
      <abs ABSG = 1 
       data hash MD5: 128K
       9D A6 4C B1 8D 1A 82 0D 13 46 90 29 8D 81 A3 95>)
(   5,<2012-04-02 15:50:53.562 -0500>,<Administrator>,<TOPSPIN>,<proc1d>,<TOPSPIN 2.1>,
      <abs ABSG = 2 
       data hash MD5: 128K
       3D B7 35 8A C3 EF C9 E2 83 B5 C2 F0 2C 06 9D 80>)
(   6,<2012-04-02 15:50:53.828 -0500>,<Administrator>,<TOPSPIN>,<proc1d>,<TOPSPIN 2.1>,
      <abs ABSG = 3 
       data hash MD5: 128K
       4D B0 24 B2 AC A1 F1 B7 8E 76 7B 85 13 F3 58 D3>)
(   7,<2012-04-02 15:50:53.906 -0500>,<Administrator>,<TOPSPIN>,<proc1d>,<TOPSPIN 2.1>,
      <abs ABSG = 4 
       data hash MD5: 128K
       FA C1 B9 02 44 C4 13 B6 43 20 51 37 4C 08 61 84>)
(   8,<2012-04-02 15:50:53.984 -0500>,<Administrator>,<TOPSPIN>,<proc1d>,<TOPSPIN 2.1>,
      <abs ABSG = 5 
       data hash MD5: 128K
       AF FD 82 9B 1B 47 A7 FC 0F 2B 0E 38 00 B4 44 4E>)
$$ ##END=
$$ 
$$ $$ hash MD5
$$ $$ 6A AE 87 58 93 D9 D1 E0 0B FD 48 B1 64 CF 8F 77
##$RELAX= 
##$RELAX= 
##$RELAX= 
##$RELAX= 
##$RELAX= 
##$RELAX= 
##$RELAX= 
##$RELAX= 
$$ [...]
##$TP07= 0
##$TPNAME0= <>
##$TPNAME1= <>
##$TPNAME2= <>
##$TPNAME3= <>
##$TPNAME4= <>
##$TPNAME5= <>
##$TPNAME6= <>
##$TPNAME7= <>
##$TPOAL= (0..7)
0.5 0.5 0.5 0.5 0.5 0.5 0.5 0.5
##$TPOFFS= (0..7)
0 0 0 0 0 0 0 0
##$TUNHIN= 0
##$TUNHOUT= 0
##$TUNXOUT= 0
##$USERA1= <user>
##$USERA2= <user>
##$USERA3= <user>
##$USERA4= <user>
##$USERA5= <user>
##$V9= 5
##$VALIST= <valist>
##$VCLIST= <CCCCCCCCCCCCCCC>
##$VD= 0
##$VDLIST= <DDDDDDDDDDDDDDD>
##$VPLIST= <PPPPPPPPPPPPPPP>
##$VTLIST= <TTTTTTTTTTTTTTT>
##$WBST= 2048
##$WBSW= 25
##$XGAIN= (0..3)
0 0 0 0
##$XL= 0
##$YL= 0
##$YMAX_a= 13437909
##$YMIN_a= -6720371
##$ZGOPTNS= <>
##$ZL1= 120
##$ZL2= 120
##$ZL3= 120
##$ZL4= 120
##$ABSF1= 14.96874
##$ABSF2= -5.58379
##$ABSG= 5
##$ABSL= 3
##$ALPHA= 0
##$AQORDER= 0
##$ASSFAC= 0
##$ASSFACI= 0
##$ASSFACX= 0
##$ASSWID= 0
##$AUNMP= <proc_prof1d_extract.lims>
##$AXLEFT= 0
##$AXNAME= <>
##$AXNUC= <1H>
##$AXRIGHT= 0
##$AXTYPE= 0
##$AXUNIT= <>
##$AZFE= 0.1
##$AZFW= 0.1
##$BCFW= 0
##$BC_mod= 0
##$BYTORDP= 0
##$COROFFS= 0
##$CY= 15
##$DATMOD= 1
##$DC= 0
##$DFILT= <>
##$DTYPP= 0
##$F1P= 0
##$F2P= 0
##$FCOR= 0.5
##$FTSIZE= 131072
##$FT_mod= 6
##$GAMMA= 0
##$GB= 0
##$INTBC= 1
##$INTSCL= 1
##$ISEN= 128
##$LB= 0.3
##$LEV0= 0
##$LPBIN= 0
##$MAXI= 10000
##$MC2= 0
##$MEAN= 0
##$ME_mod= 0
##$MI= 0
##$NCOEF= 0
##$NC_proc= -2
##$NLEV= 6
##$NOISF1= 0
##$NOISF2= 0
##$NSP= 0
##$NTH_PI= 0
##$NZP= 0
##$OFFSET= 14.96874
##$PC= 1
##$PHC0= 37.75452
##$PHC1= 0
##$PH_mod= 1
##$PKNL= yes
##$PPARMOD= 0
##$PPDIAG= 0
##$PPIPTYP= 0
##$PPMPNUM= 2147483647
##$PPRESOL= 1
##$PSCAL= 4
##$PSIGN= 0
##$PYNMP= <proc.py>
##$REVERSE= no
##$SF= 400.130004748395
##$SI= 131072
##$SIGF1= 0
##$SIGF2= 0
##$SINO= 400
##$SIOLD= 131072
##$SPECTYP= <>
##$SREGLST= <1H.CDCl3>
##$SSB= 0
##$STSI= 131072
##$STSR= 0
##$SW_p= 8223.68421052632
##$SYMM= 0
##$S_DEV= 0
##$TDeff= 65536
##$TDoff= 0
##$TI= <>
##$TILT= no
##$TM1= 0
##$TM2= 0
##$TOPLEV= 0
##$USERP1= <user>
##$USERP2= <user>
##$USERP3= <user>
##$USERP4= <user>
##$USERP5= <user>
##$WDW= 1
##$XDIM= 131072
##$YMAX_p= 247103191
##$YMIN_p= -292229142
##$CURPLOT= <Network HP LaserJet P1505>
##$CURPRIN= <$Network HP LaserJet P1505>
##$DFORMAT= <normdp>
##$LAYOUT= <+/1D_H.xwp>
##$LFORMAT= <normlp>
##$PFORMAT= <normpl>
##$SURQMSG= 1
$$ End of Bruker specific parameters
$$ ---------------------------------
##NTUPLES= NMR SPECTRUM
##VAR_NAME=  FREQUENCY,     SPECTRUM/REAL,   SPECTRUM/IMAG
##SYMBOL=    X,             R,               I
##VAR_TYPE=  INDEPENDENT,   DEPENDENT,       DEPENDENT
##VAR_FORM=  AFFN,          ASDF,            ASDF
##VAR_DIM=   131072,        131072,          131072
##UNITS=     HZ,            ARBITRARY UNITS, ARBITRARY UNITS
##FACTOR=    0.0627417313425165, 1,          1
##FIRST=     8223.62146879498, -4160,        -44703
##LAST=      0,             -2627,           -45929
##MIN=       0,             -292229142,      0
##MAX=       8223.62146879498, 247103191,    0
$$ Real data points
##PAGE= N=1
##DATA TABLE= (X++(R..R)), XYDATA
$$ [...]
61970C651917r675j0022j0688j0889j0495j0150j0198j0172r612q834q518q836
61958C533828r225q908p664o125n146m752m059k573j077o24j035j198o15J34M53
61943C481414L49n5p57j418j499j243j771l715o312q425r898j1294j2767j4025
61929C408584j5199j6919j9382k1894k3731k4944k6073k7295k8280k8795k9077
61918C146995k9495l0108l0704l1126l1319l1142l0490k9575k8820k8327k7693
61907B818196k6500k4839k3162k1841k1016k0642k0495k0252j9784j9214j8552
61896B581899j7525j5964j4150j2491j1102r950r148q718q287p430o231n037l854
61883B452012k377o28R27J986K815M000N991Q792J1802J4147J5553J6839J9105
$$ plain form
61970 3651917 3642242 3632220 3621532 3610643 3600148 3589998 3579800 3569628 3560016 3551182 3542664 3533828
61958 3533828 3524603 3515695 3508031 3501906 3496760 3492008 3487949 3485376 3484299 3483675 3482640 3481442 3480827 3480961 3481414
61943 3481414 3481763 3481708 3480951 3479533 3478034 3476791 3475020 3471305 3464993 3456568 3446670 3435376 3422609 3408584
61929 3408584 3393385 3376466 3357084 3335190 3311459 3286515 3260442 3233147 3204867 3176072 3146995
61918 3146995 3117500 3087392 3056688 3025562 2994243 2963101 2932611 2903036 2874216 2845889 2818196
61907 2818196 2791696 2766857 2743695 2721854 2700838 2680196 2659701 2639449 2619665 2600451 2581899
61896 2581899 2564374 2548410 2534260 2521769 2510667 2500717 2491569 2482851 2474564 2467134 2460903 2455866 2452012
61883 2452012 2449635 2449007 2449934 2451920 2454735 2458735 2464726 2473518 2485320 2499467 2515020 2531859 2550964
61870B550964K2579K6647L0834L5187L9692M4136M8664N3917O0224O7214P4501
61859C054559Q2307R1050J00720J11131J22515J35367J49879J65891J83441K02988
61849D399848K25053K49733K76622L05232L35494L67678M01611M35956M68532
61840G465759M97144N19577N32634N31588N10983M66060L94143K95950J76626
61831A1390464M5281q7221k10750l17423m02346m64049n04034n25202n30571n23271
61821G870878n06802m84273m57565m27880l96893l66567l37846l10392k83823
61812D298837k58612k35548k14884j96300j79337j63642j49173j36293j25234
61803B639814j15412j05791r6099q7067p9258p2345o5911o0172n5300n0673m5629
$$ plain form
61870 2550964 2573543 2600190 2631024 2666211 2705903 2750039 2798703 2852620 2912844 2980058 3054559
61859 3054559 3136866 3227916 3328636 3439767 3562282 3697649 3847528 4013419 4196860 4399848
61849 4399848 4624901 4874634 5151256 5456488 5791982 6159660 6561271 6997227 7465759
61840 7465759 7962903 8482480 9015114 9546702 10057685 10523745 10917888 11213838 11390464
61831 11390464 11435745 11348524 11137774 10820351 10418005 9953956 9449922 8924720 8394149 7870878
61821 7870878 7364076 6879803 6422238 5994358 5597465 5230898 4893052 4582660 4298837
61812 4298837 4040225 3804677 3589793 3393493 3214156 3050514 2901341 2765048 2639814
61803 2639814 2524402 2418611 2322512 2235445 2156187 2083842 2017931 1957759 1902459 1851786 1806157
61792A806157m0592l6504l3439l0576k7441k4295k1391j8667j6245j4325j2480
61781A530202r959o926m576l576l180k336r64L83J471K398L181L971N202O874
61767A522165Q185Q569Q688R675J1633J3647J5097J6211J7469J9126K1273K3770
61755A695508K6248K8583L1196L4301L7322L9785M2351M6034N0563N4670N7945
61744B144506O1322O5630P0726P6308Q2491Q9138R5622J01794J08390J15963J24207
61733C136097J32839J42314J53070J64844J77423J91434K07580K25645K45011
61724D776257K65820K88824L14440L42616L73494M07582M45408M87347N33483
61715H235271N83294O35854O90621P47387Q04839Q59665R07488R43872R63278
$$ plain form
61792 1806157 1765565 1729061 1695622 1665046 1637605 1613310 1591919 1573252 1557007 1542682 1530202
61781 1530202 1520243 1513317 1508741 1505165 1501985 1499649 1498685 1499068 1500539 1502937 1506118 1510089 1515291 1522165
61767 1522165 1530350 1538919 1547607 1557282 1568915 1582562 1597659 1613870 1631339 1650465 1671738 1695508
61755 1695508 1721756 1750339 1781535 1815836 1853158 1892943 1935294 1981328 2031891 2086561 2144506
61744 2144506 2205828 2271458 2342184 2418492 2500983 2590121 2685743 2787537 2895927 3011890 3136097
61733 3136097 3268936 3411250 3564320 3729164 3906587 4098021 4305601 4531246 4776257
61724 4776257 5042077 5330901 5645341 5987957 6361451 6769033 7214441 7701788 8235271
61715 8235271 8818565 9454419 10145040 10892427 11697266 12556931 13464419 14408291 15371569
61706A5371569R57514R16690Q32535P01403N25592L13787Q0545j55966l77689
61697A9165980n70018p23816q36051r08850r47123r56449r42691r12202q70792
61688A1497988q22271p68799p12635o56748o03486n53503n06446m62217m21290
61679E990593l84187l50927l20877k93061k66919k42832k21641k03609j87986
61670C518554j73504j59153j44749j31121j19437j09967j01703r3561q5614p8656
61660B321089p2957o8020o3373n8937n4742n0942m7881m5551m3227m0293l7156
61649A738010l4698l3009l1465k9843k8466k7331k6074k4876k4452k4910k5413
61638A427473k5192k4270k3027k1745k0691k0011j9409j8533j7651j7234j6940
$$ plain form
61706 15371569 16329083 17245773 18078308 18779711 19305303 19619090 19699635 19543669 19165980
61697 19165980 18595962 17872146 17036095 16127245 15180122 14223673 13280982 12368780 11497988
61688 11497988 10675717 9906918 9194283 8537535 7934049 7380546 6874100 6411883 5990593
61679 5990593 5606406 5255479 4934602 4641541 4374622 4131790 3910149 3706540 3518554
61670 3518554 3345050 3185897 3041148 2910027 2790590 2680623 2578920 2485359 2399745 2321089
61660 2321089 2248132 2180112 2116739 2057802 2003060 1952118 1904237 1858686 1815459 1775166 1738010
61649 1738010 1703312 1670303 1638838 1608995 1580529 1553198 1527124 1502248 1477796 1452886 1427473
61638 1427473 1402281 1378011 1354984 1333239 1312548 1292537 1273128 1254595 1236944 1219710 1202770
61627A202770j5964j4386j3158j2613j2098j1302j0723j0440r635q045o803o884
61615A070719p646p801p186o574o331o174n853n262m289l318l398n005p064q039
61601I86779p715p038o540n993n412n284n579n561m883m133l926m063m005l656
61587I12991l243k751j909o91M61R17M13n42r50k89Q92J623J708J843K546L464
61571I16483L949L854L436K819K039J417J311J511J324N05l18l98K34R49J296
61556I40411J176M83p93k098k717k726k987l908m920n501n956o580o809o069m945
61541H86061m488m754m959m851m721m327l040j251l00n89q96j60J152K171L141
61526H58189M799O837Q173Q525Q764R688J1128J2462J3495J4566J5983J7570J8872
$$ plain form
61627 1202770 1186806 1172420 1159262 1146649 1134551 1123249 1112526 1102086 1092451 1084406 1077603 1070719
61615 1070719 1063073 1055272 1048086 1041512 1035181 1029007 1023154 1017892 1013603 1010285 1006887 1001882 994818 986779
61601 986779 979064 972026 965486 959493 954081 948797 943218 937657 932774 928641 924715 920652 916647 912991
61587 912991 909748 906997 905088 904397 904858 905775 906188 905646 904696 904407 905299 906922 908630 910473 913019 916483
61571 916483 920432 924286 927722 930541 932580 933997 935308 936819 938143 938648 938330 937932 938166 939115 940411
61556 940411 941587 942070 941277 939179 936462 933736 930749 926841 921921 916420 910464 903884 897075 891006 886061
61541 886061 881573 876819 871860 867009 862288 857961 854921 853670 853370 852781 851885 851725 852877 855048 858189
61526 858189 862988 869825 877998 886523 895287 904975 916103 928565 942060 956626 972609 990179 1009051
61513A009051J9766K0668K1890K3121K3931K4552K5510K6637K7223K7182K7235
61502A276766K7730K8063K7565K6273K4556K2756K1423K1062K1174K0380J8098
61491A535846J5346J3354J2061J0633Q676O337L765J277n92j835l254n231o937
61478A589446p431p018o597o349n933n419m941l893j667J081L110M403O168R121
61464A564081J2758J6428K0058K3708K7330L1160L5566M0420M5401N0910N7672
61453A925492O5354P2610P8942Q5559R3882J03888J14476J24872J35131J45714
61443B945920J57004J68865J80255J89678J96230J99828K00054J95291J83637
61434D616762J64480J38802J08150P3876L7521J377l1873o0374q3870j03036j18128
$$ plain form
61513 1009051 1028817 1049485 1071375 1094496 1118427 1142979 1168489 1195126 1222349 1249531 1276766
61502 1276766 1304496 1332559 1360124 1386397 1410953 1433709 1455132 1476194 1497368 1517748 1535846
61491 1535846 1551192 1564546 1576607 1587240 1595916 1602253 1606018 1607295 1606703 1604868 1601614 1596383 1589446
61478 1589446 1582015 1574997 1568400 1562051 1556118 1550699 1545758 1541865 1540198 1541279 1544389 1548792 1554960 1564081
61464 1564081 1576839 1593267 1613325 1637033 1664363 1695523 1731089 1771509 1816910 1867820 1925492
61453 1925492 1990846 2063456 2142398 2227957 2321839 2425727 2540203 2665075 2800206 2945920
61443 2945920 3102924 3271789 3452044 3641722 3837952 4037780 4237834 4433125 4616762
61434 4616762 4781242 4920044 5028194 5102070 5139591 5140968 5109095 5048721 4964851 4861815 4743687
61423D743687j28637j34309j35932j34642j30913j24759j16706j07742r8413q8582
61413C543052p8158o7523n7050m6724l6387k6070j5997o612J559Q469J4921K1718
61401C255198K8469L3857L7255L9450M1527M3637M5178M5766M5490M4524M2988
61390C703339M1148L9485L8463L8249L8571L8924L9021L9037L9205L9369L9136
61379D133947L8313L6886L4775L2044K9114K6212K2758J7984J2208O674J982k636
61367D390261q023j3757j8593k1892k4056k5739k7134k8005k8099k7378k5969
61356D141616k3963k1306j8035j4448j0847p282l882j273r7n5n2M24O27l46k285
61341D038796m150n307n864n934n259l625j120K356P433J4715K3943L4083M4299
$$ plain form
61423 4743687 4615050 4480741 4344809 4210167 4079254 3954495 3837789 3730047 3631634 3543052
61413 3543052 3464894 3397371 3340321 3293597 3257210 3231140 3215143 3208531 3210090 3218559 3233480 3255198
61401 3255198 3283667 3317524 3354779 3394229 3435756 3479393 3524571 3570337 3615827 3660351 3703339
61390 3703339 3744487 3783972 3822435 3860684 3899255 3938179 3977200 4016237 4055442 4094811 4133947
61379 4133947 4172260 4209146 4243921 4275965 4305079 4331291 4354049 4372033 4384241 4390915 4392897 4390261
61367 4390261 4382238 4368481 4349888 4327996 4303940 4278201 4251067 4223062 4194963 4167585 4141616
61356 4141616 4117653 4096347 4078312 4063864 4053017 4045735 4041853 4040580 4040483 4040428 4040376 4040800 4041427 4041081 4038796
61341 4038796 4034646 4029339 4023475 4017541 4012282 4008657 4007537 4009893 4017326 4032041 4055984 4090067 4134366
61328D134366N4656O5814P8289R2130J07027J22378J37445J51813J65688J79359
61318E288965J92276K03056K10359K13343K11123K02468J86469J63303J34050
61309G005412J00087O3030K4886j2281m6887p7996j05260j29037j50129j68913
61299F502912j84876j97202k05626k10386k11733k09943k05531j99147j91399
61290D687069j82941j74269j65104j54657j42864j30767j19109j07378r5045q2899
61280C332036p2054o2178n2096m1778l2322k4009j5862p324Q70P979J4175J9720
61268C067157K4322K7952L1340L4964L8234M0336M1166M0903L9331L6391L2838
61257C454934K9610K6859K4238K1778J9844J8382J6822J4677J1932Q827N577K154
$$ plain form
61328 4134366 4189022 4254836 4333125 4425255 4532282 4654660 4792105 4943918 5109606 5288965
61318 5288965 5481241 5684297 5894656 6107999 6319122 6521590 6708059 6871362 7005412
61309 7005412 7105499 7168529 7193415 7181134 7134247 7056251 6950991 6821954 6671825 6502912
61299 6502912 6318036 6120834 5915208 5704822 5493089 5283146 5077615 4878468 4687069
61290 4687069 4504128 4329859 4164755 4010098 3867234 3736467 3617358 3509980 3414935 3332036
61280 3332036 3259982 3197804 3145708 3103930 3071608 3047599 3031737 3024413 3025283 3033262 3047437 3067157
61268 3067157 3091479 3119431 3150771 3185735 3223969 3264305 3305471 3346374 3385705 3422096 3454934
61257 3454934 3484544 3511403 3535641 3557419 3577263 3595645 3612467 3627144 3639076 3647903 3653480 3655634
61245C655634j715o171j0803j5006j8764k2640k6841l0906l4468l7761m1026m3958
61233C365575m6153m7666m8685m9023m8385m6899m4992m2898m0498l7477l3574
61222B879325k9038k4812k1720j9469j7105j4528j2742j2295j2455j2437j2546
61211B690178j3255j4036j4089j3655j3440j3069j1390q265m933k321M1L111P163
61198B592040J1994J7558K3799L0370L7056M4218N2194O0483O8046P4429Q0017
61187C092204Q5117Q9170R1134R0257Q6162P8396O6420N0021K9478N502k0497
61176C743364m6167o8911q7294j01441j11942j18907j22368j22910j21251j17622
61166B724551j12212j05773r9099r2156q4658p7201p0887o5784o0692n4652m7981
$$ plain form
61245 3655634 3653919 3647748 3636945 3621939 3603175 3580535 3553694 3522788 3488320 3450559 3409533 3365575
61233 3365575 3319422 3271756 3223071 3174048 3125663 3078764 3033772 2990874 2950376 2912899 2879325
61222 2879325 2850287 2825475 2803755 2784286 2767181 2752653 2739911 2727616 2715161 2702724 2690178
61211 2690178 2676923 2662887 2648798 2635143 2621703 2608634 2597244 2588979 2584046 2581725 2581766 2584877 2592040
61198 2592040 2604034 2621592 2645391 2675761 2712817 2757035 2809229 2869712 2937758 3012187 3092204
61187 3092204 3177321 3266491 3357625 3447882 3534044 3612440 3678860 3728881 3758359 3763861 3743364
61176 3743364 3697197 3628286 3540992 3439551 3327609 3208702 3086334 2963424 2842173 2724551
61166 2724551 2612339 2506566 2407467 2315311 2230653 2153452 2082565 2016781 1956089 1901437 1853456
61155A853456m1698l6572l2811k9976k7101k3503j9575j6070j2814r063n062j997
61143A597214j24J787M598P487R250R880J0094J0048R414Q137O250L543K00k845
61129A674933m931o587q630j0875j2636j3962j5416j6897j7769j8046j8483j9413
61117A511288k0288k0583k0446k0315k0390k0626k0874k0879k0484j9881j9533
61106A286989j9833k0915k2600k4324k5450k5813k5713k5286k4311k2861k1486
61095A028397k0414j9178j7594j6459j6541j7395j7948j7932j7950j8341j8711
61084H29934j8543j7633j6065j4258j2833j1907j0809q947o691m724l027j253
61072G03244K73R49J097J663K748L467L510L717M758O058O688O648O687P210P956
$$ plain form
61155 1853456 1811758 1775186 1742375 1712399 1685298 1661795 1642220 1626150 1613336 1604273 1599211 1597214
61143 1597214 1597090 1598877 1603475 1610962 1620212 1630092 1640186 1650234 1659648 1667785 1674035 1677578 1677778 1674933
61129 1674933 1670002 1663415 1654785 1643910 1631274 1617312 1601896 1584999 1567230 1549184 1530701 1511288
61117 1511288 1491000 1470417 1449971 1429656 1409266 1388640 1367766 1346887 1326403 1306522 1286989
61106 1286989 1267156 1246241 1223641 1199317 1173867 1148054 1122341 1097055 1072744 1049883 1028397
61095 1028397 1007983 988805 971211 954752 938211 920816 902868 884936 866986 848645 829934
61084 829934 811391 793758 777693 763435 750602 738695 727886 718939 712248 707524 704497 703244
61072 703244 703517 704466 705563 707226 709974 713441 716951 720668 725426 731484 738172 744820 751507 758717 766673
61057G66673Q519Q755Q794Q907R292R797R996R708R253R091R276R338Q662P019
61043H93080M819K891J736J069K38r84k255l257m113n044n931o410o442o510p100
61028H55787q080q799q861q567q376q229p783p013o250n685n362n409n762n807
61014G55804m993l816l374l958m714m869m372l314j699j42K95m57j071n56M62
60999G19226Q48N76L78M68N35M94M70L72K56O84J964L399M048L920L773M076M799
60982G50286N876P252Q737J0302J2036J3579J4214J4082J4365J5611J6759J6762
60970H99861J6274J6587J7727J8786J9522K0248K0701K0424J9975K0405K1704
60959A112214K2901K3579K4148K4881K5761K7096K9209L1796L4512L7714M1565
$$ plain form
61057 766673 775192 783947 792741 801648 810940 820737 830733 840441 849694 858785 868061 877399 886061 893080
61043 893080 897899 900790 902526 903595 903833 902849 900594 897337 893224 888180 882249 875839 869397 862887 855787
61028 855787 847707 838908 830047 821480 813104 804875 797092 790079 783829 778144 772782 767373 761611 755804
61014 755804 750811 746995 743621 739663 734949 730080 725708 722394 720695 720553 720848 720391 719320 718764 719226
60999 719226 720074 720650 721028 721496 722031 722525 722995 723367 723623 724307 726271 729670 733718 737638 741411 745487 750286
60982 750286 756162 763414 772151 782453 794489 808068 822282 836364 850729 866340 883099 899861
60970 899861 916135 932722 950449 969235 988757 1009005 1029706 1050130 1070105 1090510 1112214
60959 1112214 1135115 1158694 1182842 1207723 1233484 1260580 1289789 1321585 1356097 1393811 1435376
60948A435376M5025M7204M9180N2868N8288O3701O8283P3010P8677Q4709R0305
60937B146626R5493J00796J06879J14598J24283J35168J46618J59464J74712J91492
60927C496129K08074K24551K42563K63037K86485L15068L51518L96080M47457
60918F230962N06695N76573O57110P46235Q45965R62822J100283J256698J431865
60909A4315208J621715J790652J855157J722764J371004Q88524M26067J00497
60901B4091588n5862o8721K3103J68044K75555K31320l0652m67873r50407j346154
60891B1869941j589938j687214j676279j597009j481540j352900j223536j097718
60883A0163807r77548q65455p62486o68376n84148n11961m51927m01475l58339
$$ plain form
60948 1435376 1480401 1527605 1576785 1629653 1687941 1751642 1819925 1892935 1971612 2056321 2146626
60937 2146626 2242119 2342915 2449794 2564392 2688675 2823843 2970461 3129925 3304637 3496129
60927 3496129 3704203 3928754 4171317 4434354 4720839 5035907 5387425 5783505 6230962
60918 6230962 6737657 7314230 7971340 8717575 9563540 10526362 11626645 12883343 14315208
60909 14315208 15936923 17727575 19582732 21305496 22676500 23565024 23991091 24091588
60901 24091588 24035726 23967005 23990108 24158152 24433707 24665027 24634375 24166502 23216095 21869941
60891 21869941 20280003 18592789 16916510 15319501 13837961 12485061 11261525 10163807
60883 10163807 9186259 8320804 7558318 6889942 6305794 5793833 5341906 4940431 4582092
60874D582092l21980k91608k65072k40687k18547j99189j82230j66935j52978
60865B542866j40106j28087j17335j08586j01601r5211q8884q3190p8449p3968
60855A527449o9033o3768n8667n4058n0189m7064m4109m0727l7270l4524l2335
60844I95705k9737k6567k3797k2055k0828j9470j8040j6748j5439j3957j2425
60833G76642j0887r343q103p301o178l876j053N52L86k18KP71J232J214Q93K41
60817G34974n24p28k40M9n66j652k485l112l850m505m765m838m954m837m344l982
60801F89641m109m248l985l810m125m083k628l16J221J523J755K793M077M801
60787F78507N207O068P444Q668R220R177R036R398J0534J1965J2660J2034J0577
$$ plain form
60874 4582092 4260112 3968504 3703432 3462745 3244198 3045009 2862779 2695844 2542866
60865 2542866 2402760 2274673 2157338 2048752 1947151 1851940 1763056 1679866 1601417 1527449
60855 1527449 1458416 1394648 1335981 1281923 1231734 1184670 1140561 1099834 1062564 1028040 995705
60844 995705 965968 939401 915604 893549 872721 853251 835211 818463 803024 789067 776642
60833 776642 765755 756412 748309 741008 734830 730954 729901 730453 730839 730621 730623 731394 732626 733840 734733 734974
60817 734974 734450 733722 733482 733531 732965 731313 728828 725716 721866 717361 712596 707758 702804 697967 693623 689641
60801 689641 685532 681284 677299 673489 669364 665281 662653 662337 663558 665081 666836 669629 673706 678507
60787 678507 683714 689782 697226 705894 715114 724291 733327 742725 753259 765224 777884 789918 800495
60774H00495R270Q500P856O907N814N111N125N698O289O232N147L320J614P87
60760H78165Q12J045R48M74k03j003j830k485k928l440m267n277o153o813p398
60745H39647q030q753r573j0267j0370r725q842q366q273p946p080o014n202m690
60731G26516m269l766l088k162r89L62J812L188M218M796N221N897O901Q004Q973
60716G61614R626R801R664R828J0778J2214J3358J3828J3752J3244J2322J1316
60704I01345J0669J0223R302P640N784M392L657L475L683L873L552K763K071J703
60690I74132J195K63n88p83n49n31q50j099j135j299j860k675l432l968m359m869
60674I47593n705o691p321p394p351p681q202q258p583o570n688n026m440l847
$$ plain form
60774 800495 809765 818265 826121 833028 838842 843953 849078 854776 861065 867297 872444 875764 877378 878165
60760 878165 878977 880022 880970 881444 881241 880238 878408 875923 872995 869555 865288 860011 853858 847045 839647
60745 839647 831617 822864 813291 803024 792654 782929 774087 765721 757448 749502 742422 736408 731206 726516
60731 726516 722247 718481 715393 713231 712242 712604 714416 717604 721822 726618 731839 737736 744637 752641 761614
60716 761614 771240 781041 790705 800533 811311 823525 836883 850711 864463 877707 890029 901345
60704 901345 912014 922237 931539 939179 944963 949355 953012 956487 960170 964043 967595 970358 972429 974132
60690 974132 975327 975590 975002 974219 973670 973139 972289 971190 970055 968756 966896 964221 960789 956821 952462 947593
60674 947593 941888 935197 927876 920482 913131 905450 897248 888990 881407 874837 869149 864123 859683 855836
60660H55836l229k513j653p51J9N32P84Q51P96O51L90l3o46j373j956k134k093
60643H43478k482l653m891m970l641k102j656k270k856k722k127j566j161r15
60629H06466j046j735k823m073n463o991q346r153r402r341r055q518p988p894
60615G14638q183q259p784p183o901o569n460l629k001j222r60n04L77J367J994
60600F59721J876R67j77p23m74j37l32p26n87J36Q48J197J345J388J240J129J564
60583F68255K500L105K757J980J810K484L183L171K683K480K889L621M440N488
60569G10846O804P985Q713R370J0540J2032J2985J3108J3137J3699J4303J4103
60557H47625J3242J2748J3122J3675J3414J2092J0193Q260O462M767L275K271
$$ plain form
60660 855836 852607 850094 848441 847690 847709 848241 849025 849876 850672 851323 851713 851680 851034 849661 847705 845571 843478
60643 843478 840996 837343 832452 827482 823841 821739 820083 817813 814957 812235 810108 808542 807381 806466
60629 806466 805420 803685 800862 796789 791326 784335 775989 766836 757434 748093 739038 730520 722532 714638
60615 714638 706455 698196 690412 683229 676328 669759 664299 660670 658669 657447 656487 655983 656360 657727 659721
60600 659721 661597 662564 662387 661664 661190 661053 660721 659995 659408 659544 660392 661589 662934 664322 665562 666691 668255
60583 668255 670755 673860 676617 678597 680407 682891 686074 689245 691928 694408 697297 700918 705358 710846
60569 710846 717650 725635 734348 743718 754258 766290 779275 792383 805520 819219 833522 847625
60557 847625 860867 873615 886737 900412 913826 925918 936111 944371 950833 955600 958875 961146
60545I61146J864J673J091l4j339k645m366o794r375j1117j1649j1465j1221j1133
60531H84636j0972j0325q924p027n357m371l731k852j789j183j387k025k460k449
60517H19784k367k853m043n076m787l158j522r84j129r17j57P01J671L009M238
60502H02410M606M453M879N967O565O172N761O168O789O691O079N797N954N987
60488H84278N705N476N604O174P235Q620R862J0833J2194J4593J7723K0735K3379
60475A032411K6019K8723L0935L2076L1915L0253K6807K1512J4711O998q26p737
60463A273797j2845j5908j7292j7411j6474j4658j2160r014n169q81L201O527
60451A161713R092J1279J3326J5114J6429J7309J8034J8825J9827K1438K4308
$$ plain form
60545 961146 963010 964683 965774 965740 964401 961756 957390 950596 941221 930104 918455 906990 895769 884636
60531 884636 873664 863339 854415 847388 842031 837660 833929 831077 829288 828105 826718 824693 822233 819784
60517 819784 817417 814564 810521 805445 800658 797500 795978 794994 793865 792948 792791 793492 795163 798172 802410
60502 802410 807016 811469 816348 822315 828880 835052 840813 846981 853770 860461 866540 872337 878291 884278
60488 884278 889983 895459 901063 907237 914472 923092 932954 943787 955981 970574 988297 1009032 1032411
60475 1032411 1058430 1087153 1118088 1150164 1182079 1212332 1239139 1260651 1275362 1282360 1281534 1273797
60463 1273797 1260952 1245044 1227752 1210341 1193867 1179209 1167049 1158035 1152866 1151985 1155186 1161713
60451 1161713 1170805 1182084 1195410 1210524 1226953 1244262 1262296 1281121 1300948 1322386 1346694
60440A346694K8633L3710L8715M3831M9968N7303O4855P1961P9355Q8101R7916
60429B001042J07519J16471J25751J36247J47621J59200J71443J85659K02328
60420C353281K20149K36539K48300K51531K41812K15706J72657J15353M8368k3134
60410E080562r3535j56773k07552k43126k63830k71953k70250k61223k47111k29995
60400B835214k11713j93569j76139j59487j43698j28999j15317j02287r0060p9663
60390A434282p1864o5982o0495n4750m9293m4562m0170l5826l2097k9630k8112
60379I21501k6629k4733k2636k0604j8692j7070j6024j5467j4768j3330j1300
60368G20248r448q318p639o839n942n473n446n110m139l310l354l646l040j646
$$ plain form
60440 1346694 1375327 1409037 1447752 1491583 1541551 1598854 1663709 1735670 1815025 1903126 2001042
60429 2001042 2108561 2225032 2350783 2487030 2634651 2793851 2965294 3150953 3353281
60420 3353281 3573430 3809969 4058269 4309800 4551612 4767318 4939975 5055328 5103696 5080562
60410 5080562 4987027 4830254 4622702 4379576 4115746 3843793 3573543 3312320 3065209 2835214
60400 2835214 2623501 2429932 2253793 2094306 1950608 1821609 1706292 1604005 1513945 1434282
60390 1434282 1362418 1296436 1235941 1181191 1131898 1087336 1047166 1011340 979243 949613 921501
60379 921501 894872 870139 847503 826899 808207 791137 775113 759646 744878 731548 720248
60368 720248 710800 702482 694843 688004 682062 676589 671143 666033 661894 658584 655230 651584 648544 646898
60354F46898o36l92r5O81J242J152J115J731K327K016J184R32J492K158K480K614
60338F66899K672K616K721L361M286M797M700M480M430M211L496K521J773J430
60324G14393J368J424J451J243O77j59j048j846k519k961k882k124j092n70p90
60309G04565r90l74P41J317J019N50M94P37J160K054L357M285M339M016L953L929
60293G35152L471K873K867L602M685N849O897P387P168O953P451Q173P976O705
60279H17209N360M635M178L427K397J375O19N18J307K355K448J297J33L67K002
60264H49627L784M570M151L074K067J509J146M15q42k175l120l688m071m233m030
60249H48184l590l172k873k611k294j807j018p3N03L60q8PR45K117K763K817K806
$$ plain form
60354 646898 646262 645870 645775 646456 647698 648850 649965 651696 654023 656039 657223 658155 659647 661805 664285 666899
60338 666899 669571 672187 674908 678269 682555 687352 692052 696532 700962 705173 708669 711190 712963 714393
60324 714393 715761 717185 718636 719879 720556 720397 719349 717503 714984 712023 709141 707017 705925 705355 704565
60309 704565 703575 703201 703942 705259 706278 706828 707322 708059 709219 711273 714630 718915 723254 727270 731223 735152
60293 735152 738623 741496 744363 747965 752650 758499 765396 772783 779951 786904 794355 802528 810504 817209
60279 817209 822569 827204 831382 834809 837206 838581 839200 839718 841025 843380 845828 847125 847258 847625 849627
60264 849627 853411 857981 862132 865206 867273 868782 869928 870343 869501 867326 864206 860518 856447 852214 848184
60249 848184 844594 841422 838549 835938 833644 831837 830819 830746 831249 831609 831521 831528 832473 834590 837353 840170 842976
60232H42976L111L658M206M606M746M552M243M230M571M777M484M090M321N280
60218I03851O321O814O745O583O871P831R052R755R741R872J1050J2953J4477
60205A021916J5296J6088J7236J8371J9460K1289K4251K7534L0160L2211L4365
60194A278177L6900L9805M3273M7223N0932N4007N7271O1771O7263P2611P7433
60183A886666Q2404Q7955R3599R8578J02469J05069J06380J06691J06108J04018
60173B879937R9599R2860Q4656P5764O6453N6758M6585L5668K4132J2943L131
60162C478486n324j3015j9677k4189k6034k5873k4436k1706j7518j2183o070Q69
60150C283330Q704J7189K6068L5410M5271N5409O5467P5099Q3812R1101R6759
$$ plain form
60232 842976 846087 849745 853951 858557 863303 867855 872098 876328 880899 885676 890160 894250 898571 903851
60218 903851 910172 916986 923731 930314 937185 945016 954068 963823 973564 983436 994486 1007439 1021916
60205 1021916 1037212 1053300 1070536 1088907 1108367 1129656 1153907 1181441 1211601 1243812 1278177
60194 1278177 1315077 1354882 1398155 1445378 1496310 1550317 1607588 1669359 1736622 1809233 1886666
60183 1886666 1969070 2057025 2150624 2249202 2351671 2456740 2563120 2669811 2775919 2879937
60173 2879937 2979536 3072396 3157052 3232816 3299269 3356027 3402612 3438280 3462412 3475355 3478486
60162 3478486 3473162 3460147 3440470 3416281 3390247 3364374 3339938 3318232 3300714 3288531 3282461 3283330
60150 3283330 3292034 3309223 3335291 3370701 3415972 3471381 3536848 3611947 3695759 3786860 3883619
60139C883619J00695J02446J01431R7678R1718Q3683P3239O0583M6765L2748J8655
60128D693260M287j0194k4343l7597m9135n8119o4447o8712p1113p0998o7873
60117D175016o2239n4890m5944l5223k3231j1035O83J1894K2645L2727M1989N0537
60105D102929N8372O4983O9453P1005O9566O5757O0299N3538M5717L7366K9013
60094D727998K0714J2456M992m13l122l438j658K517R292J8167K8418L9766N2264
60081D907953O5943Q0749R6412J12185J27341J42215J58095J75786J94803K14359
60071F275841K34263K54212K73024K89500L03571L15585L24712L29060L27307
60062H927075L19411L05768K86551K62101K33142K00260J63665J23814Q1762L8593
$$ plain form
60139 3883619 3984314 4086760 4188191 4285869 4377587 4461270 4534509 4595092 4641857 4674605 4693260
60128 4693260 4697547 4687353 4663010 4625413 4576278 4518159 4453712 4385000 4313887 4242889 4175016
60117 4175016 4112777 4057887 4011943 3976720 3953489 3942454 3943137 3955031 3977676 4010403 4052392 4102929
60105 4102929 4161301 4226284 4295737 4366742 4436308 4502065 4562364 4615902 4661619 4698985 4727998
60094 4727998 4748712 4761168 4766160 4765747 4762625 4759187 4757529 4760046 4769338 4787505 4815923 4855689 4907953
60081 4907953 4973896 5054645 5151057 5263242 5390583 5532798 5690893 5866679 6061482 6275841
60071 6275841 6510104 6764316 7037340 7326840 7630411 7945996 8270708 8599768 8927075
60062 8927075 9246486 9552254 9838805 10100906 10334048 10534308 10697973 10821787 10903549 10942142
60052A0942142n232m9570r3761j36294j75217k08806k35932k55979k68617k73845
60042I238889k72311k65182k53363k37051k16328j92005j65488j37976j10206
60033G388979q2796n6251l0706o221J6405L5703N0602O1049O7347O9352O6716
60022G580179N9508M8171L3190J5367l799k2720m0780n8258p5099r0459j03780
60011G341520j15627j26798j36968j44984j50365j53717j55548j55450j52854
60002F049209j47991j41553j33766j24321j13041j00100q5742p0274n4299l8493
59992E039629k3039p618Q009K3637L8835N3187O6313P7846Q7443R4651R8841R9475
59980E657209R6414Q9843Q0055O7518N2941L6899J9510Q23j8637l7998n6565p3817
$$ plain form
60052 10942142 10936910 10887340 10793579 10657285 10482068 10273262 10037330 9781351 9512734 9238889
60042 9238889 8966578 8701396 8448033 8210982 7994654 7802649 7637161 7499185 7388979
60033 7388979 7306183 7249932 7219226 7213005 7229410 7265113 7315715 7376764 7444111 7513463 7580179
60022 7580179 7639687 7687858 7721048 7736415 7732616 7709896 7669116 7610858 7535759 7445300 7341520
60011 7341520 7225893 7099095 6962127 6817143 6666778 6513061 6357513 6202063 6049209
60002 6049209 5901218 5759665 5625899 5501578 5388537 5288437 5202695 5132421 5078122 5039629
59992 5039629 5016590 5008972 5016981 5040618 5079453 5132640 5198953 5276799 5364242 5458893 5557734 5657209
59980 5657209 5753623 5843466 5923521 5991039 6043980 6080879 6100389 6101212 6082575 6044577 5988012 5914195
59968E914195q9061j01570j10988j17240j20164j19672j16140j10150j01966r1815
59958D835429q0456o8731n6595m3405k9241j5109j545J2169K6931M2628N8492
59947D680567P4113Q9477J04365J18174J30271J40103J47174J51053J51237J47061
59937E933595J38183J25247J09519R1727P1788M9901K7119M473j7752l9289n9100
59926F435411p6082r0006j01020j08536j11593j10189j05387r8126q8658p7230
59916E468584o4474n0816l6120k0332m058J1853K7017M1393N4684O6280P5839
59905E569850Q3541Q9607R3807R5710R5401R3571R0743Q6660Q0854P3651O6154
59894F519549N9168N2641M6301M0406L5618L2516L1683L3891L9590M8333N9213
$$ plain form
59968 5914195 5825134 5723564 5612576 5495336 5375172 5255500 5139360 5029210 4927244 4835429
59958 4835429 4754973 4686242 4629647 4586242 4557001 4541892 4540347 4552516 4579447 4622075 4680567
59947 4680567 4754680 4844157 4948522 5066696 5196967 5337070 5484244 5635297 5786534 5933595
59937 5933595 6071778 6197025 6306544 6398271 6470059 6519960 6547079 6551552 6533800 6494511 6435411
59926 6435411 6359329 6269323 6168303 6059767 5948174 5837985 5732598 5634472 5545814 5468584
59916 5468584 5404110 5353294 5317174 5296842 5292784 5304637 5331654 5373047 5427731 5494011 5569850
59905 5569850 5653391 5742998 5836805 5932515 6027916 6121487 6212230 6298890 6379744 6453395 6519549
59894 6519549 6578717 6631358 6677659 6718065 6753683 6786199 6817882 6851773 6891363 6939696 6998909
59883F998909P2002Q7448J06200J27778J50912J74754J99424K25175K51404K76718
59873H670724K99855L19878L35445L44445L44953L36137L17712K88757K48021
59864A1505927J95593J33735O5958m150p3101j37371j93940k40935k77561l03629
59854A0670526l19385l25626l23606l14859l00941k83035k61730k37377k10690
59845H093277j82691j54134j25395r6818o8677m0824j3094J3844L8688O0738Q0254
59834G605168R7298J10939J20036J24061J22552J14370R8338P4460M4011Q668
59824H519901k9967p0247j10428j48788j83577k13153k36531k53527k64246k68810
59814F740627k67879k62819k54821k44213k31116k16336k00923j85236j69144
$$ plain form
59883 6998909 7070911 7158359 7264559 7392337 7543249 7718003 7917427 8142602 8394006 8670724
59873 8670724 8970579 9290457 9625902 9970347 10315300 10651437 10969149 11257906 11505927
59864 11505927 11701520 11835255 11901213 11897063 11823962 11686591 11492651 11251716 10974155 10670526
59854 10670526 10351141 10025515 9701909 9387050 9086109 8803074 8541344 8303967 8093277
59845 8093277 7910586 7756452 7631057 7534239 7465562 7424738 7411644 7425488 7464176 7524914 7605168
59834 7605168 7702466 7813405 7933441 8057502 8180054 8294424 8392762 8467222 8511233 8519901
59824 8519901 8489934 8419687 8309259 8160471 7976894 7763741 7527210 7273683 7009437 6740627
59814 6740627 6472748 6209929 5955108 5710895 5479779 5263443 5062520 4877284 4708140
59805D708140j52917j37267j22596j08844r6025q4363p4032o5284n8698n4600
59795C753514n2271n0359m8248m6431m5350m4399m2441l8993l4548k9887k5455
59784C295132k1405j8012j5779j5061j5845j8044k1760k6782l1969l5779l7682
59773C037014l8521l9114l9064l7379l3873k9334k4558j9745j4744r414l710K269
59761B749827Q339J4475K0755K6884L2079L5867L8773M1813M5436M9316N3030
59750C116594N6517N9733O2161O2839O0979N6665N0849M4441L7642L0525K4002
59739C662947J9340J6808J5690J5780J7760K1756K6638L1543L7150M4531N3581
59728C963524O3650P4991Q8267J03064J18240J33742J50797J70239J91611K14094
$$ plain form
59805 4708140 4555223 4417956 4295360 4186516 4090491 4006128 3932096 3866812 3808114 3753514
59795 3753514 3701243 3650884 3602636 3556205 3510855 3466456 3424015 3385022 3350474 3320587 3295132
59784 3295132 3273727 3255715 3239936 3224875 3209030 3190986 3169226 3142444 3110475 3074696 3037014
59773 3037014 2998493 2959379 2920315 2882936 2849063 2819729 2795171 2775426 2760682 2751268 2747558 2749827
59761 2749827 2758166 2772641 2793396 2820280 2852359 2888226 2926999 2968812 3014248 3063564 3116594
59750 3116594 3173111 3232844 3295005 3357844 3418823 3475488 3526337 3570778 3608420 3638945 3662947
59739 3662947 3682287 3699095 3714785 3730565 3748325 3770081 3796719 3828262 3865412 3909943 3963524
59728 3963524 4027174 4102165 4190432 4293496 4411736 4545478 4696275 4866514 5058125 5272219
59718E272219K37241K60528K82903L03043L19177L28189L25414L06088K67460
59709G902262K10230J38912O0925j5410q2909j36602j74158j96134k05446k05539
59699G296131j98770j86603j70623j52384j32662j11814r0765p0604n1314l1914
59689F098678j2049P499K5986M3537O0538P7152R3738J10961J29072J47698J66643
59678F949453J86294K06901K28208K50081K72987K97411L23315L50452L78838
59669I443940M08547M39428M71082N02729N33113N61109N86426O08843O26727
59660A4181944O37248O38501O30746O15376N93735N67687N40423N15609M95878
59651A9417147M82631M76689M78277M86575M99814N15689N31260N42992N47622
$$ plain form
59718 5272219 5509460 5769988 6052891 6355934 6675111 7003300 7328714 7634802 7902262
59709 7902262 8112492 8251404 8312329 8296919 8214010 8077408 7903250 7707116 7501670 7296131
59699 7296131 7097361 6910758 6740135 6587751 6455089 6343275 6252510 6181906 6130592 6098678
59689 6098678 6086629 6094128 6120114 6163651 6224189 6301341 6395079 6506040 6635112 6782810 6949453
59678 6949453 7135747 7342648 7570856 7820937 8093924 8391335 8714650 9065102 9443940
59669 9443940 9852487 10291915 10762997 11265726 11798839 12359948 12946374 13555217 14181944
59660 14181944 14819192 15457693 16088439 16703815 17297550 17865237 18405660 18921269 19417147
59651 19417147 19899778 20376467 20854744 21341319 21841133 22356822 22888082 23431074 23978696
59642B3978696N42889N26938M97567M53155L94472L24938K48933J70334R2637
59633B7230559J9707m4354r6059j33245j55214j62401j55841j36673j06065o5375
59623B6195039j6230L9728J01171J67187K37103L10073L84785M59501N32296O01008
59613B9011661O62732P13291P47338P59122P43456O96297O14840M97750L46240
59604C4792727J65603l4287k40500m39788o20767p74836q96397r82937j034882
59595B9933936j055174j048627j021108r78678r27172q72418q20589p77888p49606
59586B1682676p38963p45954p66613p93608q18547q34725q38591q29486q08627
59577A4507562p78169p40581o98353o53874o09065n64973n21980m80565m41459
$$ plain form
59642 23978696 24521585 25048523 25546090 25999245 26393717 26718655 26967588 27137922 27230559
59633 27230559 27250266 27205912 27109853 26976608 26821394 26658993 26503152 26366479 26260414 26195039
59623 26195039 26178809 26218537 26319708 26486895 26723998 27034071 27418856 27878357 28410653 29011661
59613 29011661 29674393 30387684 31135022 31894144 32637600 33333897 33948737 34446487 34792727
59604 34792727 34958330 34924043 34683543 34243755 33622988 32848152 31951755 30968818 29933936
59595 29933936 28878762 27830135 26809027 25830349 24903177 24030759 23210170 22432282 21682676
59586 21682676 20943713 20197759 19431146 18637538 17818991 16984266 16145675 15316189 14507562
59577 14507562 13729393 12988812 12290459 11636585 11027520 10462547 9940567 9460002 9018543
59568I018543m04882l70292l37347l06626k78790k53524k29982k07938j87742
59559F441420j69348j52276j36455j22399j10508j00835r3431q8206q4557q1889
59549E301516q0529q1344q4295q8098r1502r4207r6371r7828r8217r7364r5269
59538D296492r2032q7914q3114p7467p0868o3875n7244n0880m4022l6546k9289
59527C603241k2831j6769j0635m735M97N377J0555J6015K1078K5211K8433L1038
59515C686475L3298L5376L7275L8900M0292M1847M4263M8282N4203O1438O8871
59504D190520P5955Q3236R1454J00514J09875J19582J30122J41463J53127J65119
59494E360967J77910J91409K04811K17621K30029K42017K52826K61609K68019
$$ plain form
59568 9018543 8613661 8243369 7906022 7599396 7320606 7067082 6837100 6629162 6441420
59559 6441420 6272072 6119796 5983341 5860942 5750434 5649599 5556168 5467962 5383405 5301516
59549 5301516 5220987 5139643 5055348 4967250 4875748 4781541 4685170 4587342 4489125 4391761 4296492
59538 4296492 4204460 4116546 4033432 3955965 3885097 3821222 3763978 3713098 3669076 3632530 3603241
59527 3603241 3580410 3563641 3553006 3548271 3548768 3554145 3564700 3580715 3601793 3627004 3655437 3686475
59515 3686475 3719773 3755149 3792424 3831324 3871616 3913463 3957726 4006008 4060211 4121649 4190520
59504 4190520 4266475 4349711 4441165 4541679 4651554 4771136 4901258 5042721 5195848 5360967
59494 5360967 5538877 5730286 5935097 6152718 6382747 6624764 6877590 7139199 7407218
59485G407218K71876K72875K70848K65822K57731K46603K33128K18393K03012
59476I647506J87141J71206J55657J40045J23502J06515R1147P9105P0473O4822
59466A0837119O2416O3615O7752P3397P9005Q2790Q2677P7066O5134M6119J9195
59455A1556285j5259n5069r7733j41801j86154k28819k67522l00936l28410l49022
59445I585560l61973l67606l67054l61052l49977l34765l16879k97282k76243
59436F552729k54115k31609k09263j87285j66022j45986j27295j09486r2077p4964
59426D954627n8384m2610k7650j3055J809J7010L1918M6110O0058P4527Q9543
59415E133903J04459J18811J32638J46120J59345J72247J84328J94406K01058
$$ plain form
59485 7407218 7679094 7951969 8222817 8488639 8746370 8992973 9226101 9444494 9647506
59476 9647506 9834647 10005853 10161510 10301555 10425057 10531572 10622719 10701824 10772297 10837119
59466 10837119 10899535 10963150 11030902 11104299 11183304 11266094 11348771 11425837 11490971 11537090 11556285
59455 11556285 11541026 11485957 11388224 11246423 11060269 10831450 10563928 10262992 9934582 9585560
59445 9585560 9223587 8855981 8488927 8127875 7777898 7443133 7126254 6828972 6552729
59436 6552729 6298614 6067005 5857742 5670457 5504435 5358449 5231154 5121668 5029591 4954627
59426 4954627 4896243 4853633 4825983 4812928 4814737 4831747 4863665 4909775 4969833 5044360 5133903
59415 5133903 5238362 5357173 5489811 5635931 5795276 5967523 6151851 6346257 6547315
59406F547315K03313K00717J92860J79142J59081J32697J00689O4326K5011j6042
59396G789109n7615r8016j35230j67636j94355k14996k29580k38779k43608k44599
59386E964695k41698k35136k25939k15317k03951j92058j79732j67035j54117
59377D149712j41404j29300j17737j06436r5544q5385p5733o6134n6875m8683
59367C226481m1430l4189k6751j9922j4008q201j947M194R622J4509J8954K2523
59355C149835K5407K8792L3263L7955M2192M6579N1267N4466N4469N2299N0700
59344C627224N1184N3652N8325O5914P6002Q7108R8652J11296J24932J37827J48428
59333D640544J57138J65960J77101J92096K11231K33370K56999K81759L08334
$$ plain form
59406 6547315 6750628 6951345 7144205 7323347 7482428 7615125 7715814 7780140 7805151 7789109
59396 7789109 7731494 7633478 7498248 7330612 7136257 6921261 6691681 6452902 6209294 5964695
59386 5964695 5722997 5487861 5261922 5046605 4842654 4650596 4470864 4303829 4149712
59377 4149712 4008308 3879008 3761271 3654835 3559291 3473906 3398173 3332039 3275164 3226481
59367 3226481 3185051 3150862 3124111 3104189 3090181 3081980 3080033 3084227 3093849 3108358 3127312 3149835
59355 3149835 3175242 3204034 3237297 3275252 3317444 3364023 3415290 3469756 3524225 3576524 3627224
59344 3627224 3678408 3732060 3790385 3856299 3932301 4019409 4118061 4229357 4354289 4492116 4640544
59333 4640544 4797682 4963642 5140743 5332839 5544070 5777440 6034439 6316198 6624532
59324F624532L36809L66010L94712M22573M49352M73698M93259N05761N09800
59315A0576506N04989M91655M70372M41934M07847L70394L31723K92945K54486
59306A4142851K16928J80966J46738J13689Q0953M7455J2077k5661o5182j05547
59296A4745267j46104j85885k22943k55089k81130l00783l13942l21049l23883
59287A2394459l24919l25866l27410l30112l34430l39949l45541l50372l54004
59278I361856l55592l53971l48687l40165l28812l14717k98369k80817k62855
59269F477871k44622k26185k07907j90048j72564j55415j38751j22772j07785
59260D911822r4207q2060p0670n9432m8622l8854l0024k1478j2937m531L820J2198
$$ plain form
59324 6624532 6961341 7327351 7722063 8144636 8593988 9067686 9560945 10066706 10576506
59315 10576506 11081495 11573150 12043522 12485456 12893303 13263697 13595420 13888365 14142851
59306 14142851 14359779 14540745 14687483 14801172 14882125 14929580 14941657 14915996 14850814 14745267
59296 14745267 14599163 14413278 14190335 13935246 13654116 13353333 13039391 12718342 12394459
59287 12394459 12069540 11743674 11416264 11086152 10751722 10411773 10066232 9715860 9361856
59278 9361856 9006264 8652293 8303606 7963441 7634629 7319912 7021543 6740726 6477871
59269 6477871 6233249 6007064 5799157 5609109 5436545 5281130 5142379 5019607 4911822
59260 4911822 4817615 4735555 4664885 4605453 4556831 4517977 4487953 4466475 4453538 4449007 4452827 4465025
59248D465025K0120K7050L3314L9588M5581N0314N3627N6341N8785O0221N9978
59237D969944N8278N5573N1952M7548M2868L8299L3903K9892K6829K5101K4780
59226E404967K6030K9071L3624L9081M5337N2750O1176O9723P7773Q5502R3014
59215F018048R9511J03733J04870J02841R7918R0262P9738O6190N0009L2153J3342
59204F858615o344k6572m5933o2596p5421q3874q7427q6092q1191p4520o6836
59193F161809n7986m8368l9143l0966k3489j6245r261k758K995P528J0713J3333
59181E968162J6402K0125K4342K9623L6823M5802N5870O7361Q1395R8104J16468
59170F560477J36022J57274J80142K03280K25320K45424K62207K73537K77930
$$ plain form
59248 4465025 4485145 4512195 4545509 4585097 4630678 4680992 4734619 4790960 4849745 4909966 4969944
59237 4969944 5028222 5083795 5135747 5183295 5226163 5264462 5298365 5328257 5355086 5380187 5404967
59226 5404967 5430997 5460068 5493692 5532773 5578110 5630860 5692036 5761759 5839532 5925034 6018048
59215 6018048 6117559 6221292 6326162 6429003 6526921 6617183 6696921 6763111 6813120 6845273 6858615
59204 6858615 6852271 6825699 6779766 6717170 6641749 6557875 6470448 6384356 6303165 6228645 6161809
59193 6161809 6103823 6055455 6016312 5985346 5961857 5945612 5936351 5933593 5936588 5944116 5954829 5968162
59181 5968162 5984564 6004689 6029031 6058654 6095477 6141279 6197149 6264510 6345905 6444009 6560477
59170 6560477 6696499 6853773 7033915 7237195 7462515 7707939 7970146 8243683 8521613
59161H521613K74839K62998K40059K04968J59532J06643M8050j5079q0297j44062
59151I579264k03420k56493l01694l37512l63072l78350l83936l80988l71170
59142F602629l56269l37923l17678k96770k75652k54349k33409k13854j96082
59133D120643j79526j63723j48939j35444j23015j11534j01382r2724q5119p8161
59123B901076p1857o5927n9621n2697m5947m0200l5382l0981k6787k2666j8328
59112B430683j3812r635n944k111K294O731J0416J3379J6307J9768K3887K8359
59100B520322L2545L6052L9403M3459M8078N2163N5252N8107O1372O4639O7458
59089C078850P0335P3880P7627Q0390Q1380Q0499P8047P4677P1015O6897O1433
$$ plain form
59161 8521613 8796452 9059450 9299509 9504477 9664009 9770652 9818702 9803623 9723326 9579264
59151 9579264 9375844 9119351 8817657 8480145 8117073 7738723 7354787 6973799 6602629
59142 6602629 6246360 5908437 5590759 5293989 5018337 4763988 4530579 4316725 4120643
59133 4120643 3941117 3777394 3628455 3493011 3369996 3258462 3157080 3064356 2979237 2901076
59123 2901076 2829219 2763292 2703671 2650974 2605027 2564827 2529445 2498464 2471677 2449011 2430683
59112 2430683 2416871 2407236 2401292 2399181 2401475 2408206 2418622 2432001 2448308 2468076 2491963 2520322
59100 2520322 2552867 2588919 2628322 2671781 2719859 2772022 2827274 2885381 2946753 3011392 3078850
59089 3078850 3149185 3223065 3300692 3381082 3462462 3542961 3621008 3695685 3766700 3833597 3895030
59078C895030N4197M5789L7002K8210J9953J3155Q195M465J388q26j884j925p43
59065D102006K628Q704J6620K5088L3704M2730N2247O2367P3568Q6019R8962J11469
59053D716112J23328J34693J45393J55225J64312J72492J78782J81961J81215
59044F153513J75749J64479J46769J23017R4089O0908K5128j0641m4069p4054
59034F814888r9924j20688j35937j46770j54787j60664j64407j66451j67486j67722
59024E330052j67191j66375j65762j65068j63699j61597j58985j55710j51609
59015C874056j47081j42552j37727j32104j25848j19486j13113j06580j00024
59006B749541r3617q7107q0353p3903o8383o3577n8667n3107m6931m0687l5449
$$ plain form
59078 3895030 3949227 3995016 4032018 4060228 4080181 4093336 4101531 4105996 4107384 4106558 4104674 4102749 4102006
59065 4102006 4104634 4113338 4129958 4155046 4188750 4231480 4283727 4346094 4419662 4505681 4604643 4716112
59053 4716112 4839440 4974133 5119526 5274751 5439063 5611555 5790337 5972298 6153513
59044 6153513 6329262 6493741 6640510 6763527 6857616 6918524 6943652 6933011 6888942 6814888
59034 6814888 6714964 6594276 6458339 6311569 6156782 5996118 5831711 5665260 5497774 5330052
59024 5330052 5162861 4996486 4830724 4665656 4501957 4340360 4181375 4025665 3874056
59015 3874056 3726975 3584423 3446696 3314592 3188744 3069258 2956145 2849565 2749541
59006 2749541 2655924 2568817 2488464 2414561 2346178 2282601 2223934 2170827 2123896 2083209 2047760
58995B047760l2174l0504k8879k6445k4170k3385k4134k5670k7779l0492l3191
58984A740937l5134l6437l7483l7865l6941l5120l3443l2060l0148k7232k3769
58973A375305k0421j7536j5261j3522j1892j0016q026o144m276k383q33J16P15
58960A265826J110R83K94k16J6N63Q52J100J698K334K621L021M130N550O443O793
58944A303118P247Q056R017J0008J0824J0929J0173R374R397J0141J1069J2096
58932A421449J3200J3949J4278J4972J6400J7545J7440J6803J6932J7749J8326
58921A599043J8739J9762K1181K2000K2200K2763K4022K5353K6538K8042K9842
58910A859485L1321L2484L4134L6583L9181M1373M3282M5162M7099M9254N1602
$$ plain form
58995 2047760 2015586 1985082 1956203 1929758 1905588 1882203 1858069 1832399 1804620 1774128 1740937
58984 1740937 1705803 1669366 1631883 1594018 1557077 1521957 1488514 1456454 1426306 1399074 1375305
58973 1375305 1354884 1337348 1322087 1308565 1296673 1286657 1278631 1272487 1268211 1265828 1264995 1265111 1265826
58960 1265826 1266936 1267919 1268213 1267997 1268013 1268576 1269428 1270528 1272226 1274560 1277181 1280202 1284332 1289882 1296325 1303118
58944 1303118 1310365 1318421 1327438 1337446 1348270 1359199 1369372 1378746 1388143 1398284 1409353 1421449
58932 1421449 1434649 1448598 1462876 1477848 1494248 1511793 1529233 1546036 1562968 1580717 1599043
58921 1599043 1617782 1637544 1658725 1680725 1702925 1725688 1749710 1775063 1801601 1829643 1859485
58910 1859485 1890806 1923290 1957424 1994007 2033188 2074561 2117843 2163005 2210104 2259358 2310960
58899B310960N3423N4006N3776N3873N4608N5326N5729N6404N7984O0621O4364
58888B931074O9188P4629Q0096Q5554R1328R7425J03813J10996J19452J28705
58878C892260J37897J47059J56967J67940J79768J92499K06328K20905K35812
58869E537435K51619K69429K89476L11116L34012L58269L83632M09620M36419
58860H581027M64541M93694N22922N51703N79715O05520O26704O41249O47817
58851A3714892O44591O29057N99073N53383M91060M11702L16650K09342R4339
58842A7664089k3446j38941k47431l45297m29837m98878n51395n88263o11371
58833A4229230o22145o21691o11884n95112n73039n46643n17268m86568m55518
$$ plain form
58899 2310960 2364383 2418389 2472165 2526038 2580646 2635972 2691701 2748105 2806089 2866710 2931074
58888 2931074 3000262 3074891 3154987 3240541 3331869 3429294 3533107 3644103 3763555 3892260
58878 3892260 4030157 4177216 4334183 4502123 4681891 4874390 5080718 5301623 5537435
58869 5537435 5789054 6058483 6347959 6659075 6993087 7351356 7734988 8144608 8581027
58860 8581027 9045568 9539262 10062184 10613887 11193602 11799122 12425826 13067075 13714892
58851 13714892 14359483 14988540 15587613 16140996 16632056 17043758 17360408 17569750 17664089
58842 17664089 17640643 17501702 17254271 16908974 16479137 15980259 15428864 14840601 14229230
58833 14229230 13607085 12985394 12373510 11778398 11205359 10658716 10141448 9654880 9199362
58824I199362m24494l94195l65508l38747l13991k91852k72782k56033k40469
58815F301291k26109k13663k02891j92741j82648j72451j61461j49322j37421
58806D662584j27574j19379j10601j00300q9807q0443p2008o3948n6353m9277
58796C792894m2412l5825k9864k4048j7336r703k201M730J1669J8886K5976L2991
58784C725757M0472M8223N5495O2464P0059P8239Q6106R3814J02522J12267J21821
58773D597239J31079J41418J53149J64723J75461J87044K01078K16927K33324
58764F201442K50528K69427K89819L11075L33544L57912L83995M11250M39733
58755I248725M69411M99212N27698N54106N77882N97734O11731O17683O12907
$$ plain form
58824 9199362 8774868 8380673 8015165 7676418 7362427 7070575 6797793 6541760 6301291
58815 6301291 6075182 5861519 5658628 5465887 5283239 5110788 4949327 4800005 4662584
58806 4662584 4535010 4415631 4305030 4204730 4114923 4034480 3962472 3898524 3842171 3792894
58796 3792894 3750482 3714657 3684793 3660745 3643409 3633706 3631505 3636235 3647904 3666790 3692766 3725757
58784 3725757 3766229 3814452 3869947 3932411 4002470 4080709 4166815 4260629 4363151 4475418 4597239
58773 4597239 4728318 4869736 5022885 5187608 5363069 5550113 5751191 5968118 6201442
58764 6201442 6451970 6721397 7011216 7322291 7655835 8013747 8397742 8808992 9248725
58755 9248725 9718136 10217348 10745046 11299152 11877034 12474768 13086499 13704182 14317089
58746A4317089N94525N60688N10810M44441L61168K62407J52351L6343q0862j94796
58736A6964164l00626l94066m72568n35075n81337o12114o29242o34825o30717
58727A2173594o18917o01561n80060n55109n27835n00031m72833m46159m19686
58718G451403l93574l67963l42932l19252k97974k78958k61072k44079k28929
58709D716670k15770k03255j90508j78277j67337j57146j46947j36962j27611
58700C192857j18689j10149j02521r5735q8779q1291p4280o8468o3181n7793n2947
58689B279024m9273m6122m2702l9447l7065l5211l3132l0830k8613k6385k4210
58678A886034k2703k1900k0796j8828j6982j6401j6815j7194j7122j6751j6261
$$ plain form
58746 14317089 14911614 15472302 15983112 16427553 16788721 17051128 17203479 17239822 17158960 16964164
58736 16964164 16663538 16269472 15796904 15261829 14680492 14068378 13439136 12804311 12173594
58727 12173594 11554677 10953116 10373056 9817947 9290112 8790081 8317248 7871089 7451403
58718 7451403 7057829 6689866 6346934 6027682 5729708 5450750 5189678 4945599 4716670
58709 4716670 4500900 4297645 4107137 3928860 3761523 3604377 3457430 3320468 3192857
58700 3192857 3074168 2964019 2861498 2765763 2676984 2595693 2521413 2452945 2389764 2331971 2279024
58689 2279024 2229751 2183629 2140927 2101480 2064415 2029204 1996072 1965242 1936629 1910244 1886034
58678 1886034 1863331 1841431 1820635 1801807 1784825 1768424 1751609 1734415 1717293 1700542 1684281
58667A684281j6197j7387j9754k2069k3591k4966k6799k8527k9513l0138l0852
58656A414488l1192l0717k9941k9411k8735k7387k5610k3795k1957k0391j9764
58645A125588j9855j9443j8072j6664j5768j4716j3261j2485j2950j3539j3219
58634I55616j2439j1702j0344q103o246n710n487m429l193k820k774k178j688
58621H78503k320l453l881l805m028m143l435k643k886l581l349k354j872j987
58607H34766j667p68j43R6P85K200L700M744N190M855L864L118L404M447N669
58592H74260P170R040J0550J1173J1565J2462J3521J4397J5867J8530K1421K3405
58580A043361K4999K7197K9477L0784L1669L3649L6909M0345M3474M6740N0357
$$ plain form
58667 1684281 1668084 1650697 1630943 1608874 1585283 1560317 1533518 1504991 1475478 1445340 1414488
58656 1414488 1383296 1352579 1322638 1293227 1264492 1237105 1211495 1187700 1165743 1145352 1125588
58645 1125588 1105733 1086290 1068218 1051554 1035786 1021070 1007809 995324 982374 968835 955616
58634 955616 943177 931475 921131 913028 906782 901072 895585 891156 887963 885143 882369 880191 878503
58621 878503 876183 872730 868849 865044 861016 856873 853438 850795 847909 844328 840979 838625 836753 834766
58607 834766 833099 832331 832188 832284 833069 835269 838969 843713 848903 853758 857622 860740 864144 868591 874260
58592 874260 881430 890470 901020 912193 923758 936220 949741 964138 980005 998535 1019956 1043361
58580 1043361 1068360 1095557 1125034 1155818 1187487 1221136 1258045 1298390 1341864 1388604 1438961
58569A438961N4284N8909O4483P0345P6039Q2468R0560R9539J08037J16168J24999
58558B384792J34675J44649J55083J66147J76493J84093J88287J89419J86887
58549C910525J79050J64753J43578J15165P9932M0182q99m0905p7867j09382j33771
58538D270361j51526j63986j71263j72997j70351j65314j58550j49734j39546
58529B827094j29488j20056j10744j01513r2717q3985p4876o6149n8914n2970
58519A935682m7519m2827l9576l7226l4821l2826l2309l2820l2976l2555l2293
58508A537934l2084l1350l0636l0910l1671l1688l1149l1097l1195l0154k8101
58497A197899k6495k5843k5337k4538k3617k2245k0067j7986j7189j7187j6595
$$ plain form
58569 1438961 1493245 1552154 1616637 1686982 1763021 1845489 1936049 2035588 2143625 2259793 2384792
58558 2384792 2519467 2664116 2819199 2985346 3161839 3345932 3534219 3723638 3910525
58549 3910525 4089575 4254328 4397906 4513071 4593003 4633185 4632286 4591381 4513514 4404132 4270361
58538 4270361 4118835 3954849 3783586 3610589 3440238 3274924 3116374 2966640 2827094
58529 2827094 2697606 2577550 2466806 2365293 2272576 2188591 2113715 2047566 1988652 1935682
58519 1935682 1888163 1845336 1805760 1768534 1733713 1700887 1668578 1635758 1602782 1570227 1537934
58508 1537934 1505850 1474500 1443864 1412954 1381283 1349595 1318446 1287349 1256154 1226000 1197899
58497 1197899 1171404 1145561 1120224 1095686 1072069 1049824 1029757 1011771 994582 977395 960800
58486I60800j5323j4238j3223j1574r810r034q977q628q240q554q754p539n622
58473H31284m726m630l770k316j931k701l080k815l190m312m859m689n112o289
58459G76864o960o929p326q127q073p312p452q575q867p747o747o651o395n495
58445F74208n027n285m938l517k409k413k495j894j401j532j530j119j264k172
58431F37212k494j545n61p37j569k074k144j907j187l23r9m14l52J69L19M0J61
58414F22495O62O27J49L59J348J877J473R48P02M10M63J664L321L753K846K151
58398F45248K301K460K354K531K540J229r69k404k951l964n505o296o441p350
58384F22783q672q348o213m594m602m790m188l724l751l095j581p39r67p62K63
$$ plain form
58486 960800 945477 931239 918016 906442 896632 887598 878621 869993 861753 853199 844445 836906 831284
58473 831284 826558 821928 818158 815842 813911 811210 808130 805315 802125 797813 792954 788265 783153 776864
58459 776864 769904 762975 755649 747522 739449 732137 724685 716110 707243 699496 692749 686098 679703 674208
58445 674208 669181 663896 658958 655441 653032 650619 648124 646230 644829 643297 641767 640648 639384 637212
58431 637212 634718 633173 632612 631875 630306 628232 626088 624181 622994 622671 622572 622158 621806 621975 622294 622334 622495
58414 622495 623157 623784 623933 624292 625640 627517 628990 629938 630640 631050 631513 633177 636498 640251 643097 645248
58398 645248 647549 650009 652363 654894 657434 658663 657694 655290 652339 648375 642870 636574 630133 622783
58384 622783 614111 605763 599550 594956 590354 585564 581376 577652 573901 570806 569225 568486 567519 566757 567020
58369E67020M39q07j689j142m65o37o01M87J769K649L765M980M956L744L222L980
58353E91670M428M018M366O087P425P379P262P804P692O492N960O808P124N846
58339F80361M831N483O160N073L248K377K084J398Q37J032J184O22Ll57j270k554
58323G10512k547r94J27j08j30R78J788J426J181J630J276k03m76J536L453L294
58307G22743K547L083L960L833L726M713N397M382K954K726K857K087J311J665
58293G67984K169J662J162J957L293M035M627N468N452M124L154L728M636M721
58279H18172M976O382P952Q714R339J0192J0215R278R026R998J0635J0467J1092
58266I36438J2615J2696J0766R507J0216J0603R262Q384R510J0546R769R034J0142
$$ plain form
58369 567020 567459 566652 564963 563821 563356 562719 562118 562605 564374 567023 570788 575768 580724 584468 587690 591670
58353 591670 596098 600116 604482 610569 617994 625373 632635 640439 648131 654623 660583 667391 674515 680361
58339 680361 685192 690675 696835 701908 705156 707533 709617 711015 711852 712884 714068 714690 714693 714336 713066 710512
58323 710512 707965 706971 707098 706990 706860 707838 709626 711052 712233 713863 715139 714936 714460 715996 719449 722743
58307 722743 725290 728373 732333 736166 739892 744605 750002 754384 757338 760064 762921 765008 766319 767984
58293 767984 770153 771815 772977 774934 778227 782262 786889 792357 797809 801933 805087 808815 813451 818172
58279 818172 823148 829530 837482 846196 855535 865727 875942 885220 894246 904244 914879 925346 936438
58266 936438 949053 961749 972515 982022 992238 1002841 1012103 1020487 1029997 1040543 1050312 1059346 1069488
58253A069488J1604J1856J2140J3441J4128J3414J3446J5290J6682J6460J7073
58242A225022J9809K1873K1373K0795K2084K2910K1434K0237K1458K2594K1361
58231A460950K0273K1890K3793K3134K2004K3378K5656K6090K6004K7711K9888
58220A730771L0686L1768L4637L6802L6237L5826L8568M2367M4269M5726M8832
58209B156489N1645N2404N3907N8516O3186O4807O5943O9842P4514P7412Q0994
58198B869659Q7617R3884R6347R7918J02232J06803J08434J10201J16037J23466
58188C912598J28887J34786J44381J54492J61437J68595J80212J93225K03255
58179E381868K13041K26464K40180K50004K59617K73761K89015L00826L13272
$$ plain form
58253 1069488 1081092 1092948 1105088 1118529 1132657 1146071 1159517 1174807 1191489 1207949 1225022
58242 1225022 1244831 1266704 1288077 1308872 1330956 1353866 1375300 1395537 1416995 1439589 1460950
58231 1460950 1481223 1503113 1526906 1550040 1572044 1595422 1621078 1647168 1673172 1700883 1730771
58220 1730771 1761457 1793225 1827862 1864664 1900901 1936727 1975295 2017662 2061931 2107657 2156489
58209 2156489 2208134 2260538 2314445 2372961 2436147 2500954 2566897 2636739 2711253 2788665 2869659
58198 2869659 2957276 3051160 3147507 3245425 3347657 3454460 3562894 3673095 3789132 3912598
58188 3912598 4041485 4176271 4320652 4475144 4636581 4805176 4985388 5178613 5381868
58179 5381868 5594909 5821373 6061553 6311557 6571174 6844935 7133950 7434776 7748048
58170G748048L31817L52946L71456L91262M18073M48282M76606N07421N46338
58161A1592249N88005O25005O61411P04296P49970P92758Q39066Q97857R66161
58152A8416778J039587J127185J238390J365377J497088J640326J807064J992444
58144C0124239K187558K402453K653539K941891L269739L663133M149364M728911
58136E6120827N400750O192260P124427Q173736R318094J0593589J2054850J3730083
58128A28708616J5684097J7988773K0340232K1636342K0267398J5251194P226539
58121B47103191j760886r518771j4828672j7614931j8434040j7973262j6824388
58114A50148241j5401392j3917372j2450314j1045932r751035q585399p538890
$$ plain form
58170 7748048 8079865 8432811 8804267 9195529 9613602 10061884 10538490 11045911 11592249
58161 11592249 12180254 12805259 13466670 14170966 14920936 15713694 16552760 17450617 18416778
58152 18416778 19456365 20583550 21821940 23187317 24684405 26324731 28131795 30124239
58144 30124239 32311797 34714250 37367789 40309680 43579419 47242552 51391916 56120827
58136 56120827 61521577 67713837 74838264 83012000 92330094 102923683 114978533 128708616
58128 128708616 144392713 162381486 182721718 204358060 224625458 239876652 247103191
58121 247103191 245342305 235823534 220994862 203379931 184945891 166972629 150148241
58114 150148241 134746849 120829477 108379163 97333231 87582196 78996797 71457907
58107G1457907o602390n774943n045002m391503l803587l280367k813351k385418
58099C7361346j986097j615184j272077r50714o43890l44645l9337K99943P02175
58090C1511520J142062J475718J468027R57321K6338j016340j849654k332513
58082C1382479k506798k478120k335238k144568j952163j772199j597507j427787
58074A5168099j273480j137333j012558q98380q00391p16698o39397n68813n11922
58065G609127m67752m27836l90013l59048l34721l11573k89576k73286k61031
58056D494291k45931k27138k09820j94786j78236j60850j47235j36879j25156
58047B868260j12740j04779j01172r6701r0450q6376q4675q1130p5169p0534o7713
$$ plain form
58107 71457907 64855517 59080574 54035572 49644069 45840482 42560115 39746764 37361346
58099 37361346 35375249 33760065 32487988 31537274 30893384 30548739 30509402 30809345 31511520
58090 31511520 32653582 34129300 35597327 36554648 36580986 35564646 33714992 31382479
58082 31382479 28875681 26397561 24062323 21917755 19965592 18193393 16595886 15168099
58074 15168099 13894619 12757286 11744728 10846348 10045957 9329259 8689862 8121049 7609127
58065 7609127 7141375 6713539 6323526 5964478 5629757 5318184 5028608 4755322 4494291
58056 4494291 4248360 4021222 3811402 3616616 3438380 3277530 3130295 2993416 2868260
58047 2868260 2755520 2650741 2549569 2452868 2362418 2276042 2191367 2110237 2035068 1964534 1896821
58036A896821o3402n7596n3877n2484n0118m6617m4990m4882m2830l8961l6847
58025A364217l6694l5243l2325l1086l1570l0492k7580k6008k6229k5378k3072
58014A038540k2009k2435k1628j9191j7580j7038j5256j2238j0433r960q602o509
58002H55661n933o529n951m816n872q499r286p968p512q453q530p837q765j0678
57988G49032j0254p562o274p208p155m989l452l740l625k270j867k945k886p83
57974F84022P79M29J60J125J564N97Q1Q86J115j68j113o93o51k052l247l036k814
57957F76984l783m870n069n194n837o076n575n549o477p150o919o644o614n935
57943E95292m683m251m880n190m709m445m586m146l250l157l702l399k318k062
$$ plain form
58036 1896821 1833419 1775823 1721946 1669462 1619344 1572727 1527737 1482855 1440025 1401064 1364217
58025 1364217 1327523 1292280 1259955 1228869 1197299 1166807 1139227 1113219 1086990 1061612 1038540
58014 1038540 1016531 994096 972468 953277 935697 918659 903403 891165 880732 870772 862170 855661
58002 855661 849728 843199 837248 832432 826560 818061 808775 800807 793295 784842 776312 768475 759710 749032
57988 749032 738778 731216 724942 717734 710579 705590 702138 698398 694773 692503 690636 687691 684805 684022
57974 684022 684801 685230 685390 686515 688079 688676 688757 689643 690758 690590 689477 688784 688133 686081 682834 679798 676984
57957 676984 673201 668331 663262 658068 652231 646155 640580 635031 628554 621404 614485 607841 601227 595292
57943 595292 590609 586358 581478 576288 571579 567134 562548 558402 555152 551995 548293 544894 542576 540514
57929E40514k592k107m47N14L01O34K091L156L214L404L795K900R03J33J173J674
57913E59260K41j486k011k251l170l851l556l287l739l960l448l356m286m974
57899E16126m496l744l628l715l689m119m844m659l528k978l493l637k674j690
57885D65232j318o34O18J075K75k33N45J468J434J014P23j30j653k475j997j551
57869D62393k075k609k363k224k935l584l310k747k496j962q83k52m83m28N37
57854D34579J312J170J254K545M027M373L991L995M441M879N335N675N189L798
57840D86563K453J603O93k82m59p0p11k754m379m345l768l979m456m326m089m380
57824D53314m541l972l418l568l702l052k180j820j616j186r81j133p92K71R40
$$ plain form
57929 540514 537922 535815 535368 535882 536183 536817 538908 542064 545278 548682 552477 555377 556280 556413 557586 559260
57913 559260 559501 558015 556004 553753 550583 546732 543176 539889 536150 532190 528742 525386 521100 516126
57899 516126 511630 507886 504258 500543 496854 492735 487891 483232 479704 476726 473233 469596 466922 465232
57885 465232 463914 463280 463898 464973 465248 465015 465560 467028 468462 469476 470199 470069 468416 465941 463944 462393
57869 462393 460318 457709 455346 453122 450187 446603 443293 440546 438050 436088 435205 434953 434470 434042 434579
57854 434579 435891 437061 438315 440860 444887 449260 453251 457246 461687 466566 471901 477576 482765 486563
57840 486563 489016 490619 491312 491030 490571 490501 489790 487036 482657 478312 474544 470565 466109 461783 457694 453314
57824 453314 448773 444801 441383 437815 434113 431061 428881 427061 425445 424259 423278 422145 421353 421624 422564
57809D22564O98O77J728L027L737M346N105N058L951L285L930M455L508K044J371
57794D69484P00j173l249l701k842k457k967l283k951k570k489k709l572n093
57780D31128o164n796m610l834l585l337l261l665l898l290k509k573l146l216
57766C78244k862k937l525m091m593n222n497m963m206l995l929l221k266k059
57752C24878k473k463j720r78p90j042j449j696j390n86Jl5j21L42J082J592J944
57735C15096K198J988J522J996L903N872O276N255M031L099K337K059K490K757
57721C60879J896L85m91n04m75q39j340j859k443k776k554k108j805j338m42K51
57705C44437R1l93j95P08J551J963K027J683J085J029J970L088L323K888K727
$$ plain form
57809 422564 423262 423939 425667 428694 432431 436777 441882 446940 450891 454176 458106 462561 466069 468113 469484
57794 469484 470184 469011 465762 462061 459219 456762 453795 450512 447561 444991 442502 439793 436221 431128
57780 431128 424964 419168 414558 410724 407139 403802 400541 396876 392978 389688 387179 384606 381460 378244
57766 378244 375382 372445 368920 364829 360236 355014 349517 344554 340348 336353 332424 329203 326937 324878
57752 324878 322405 319942 318222 317244 316454 315412 313963 312267 310877 310291 310292 310257 310136 310478 311560 313152 315096
57735 315096 317294 319282 320804 322800 326703 332575 338851 344106 348137 351236 353573 355632 358122 360879
57721 360879 362775 363160 362669 362165 361690 360851 359511 357652 355209 352433 349879 347771 345966 344628 344186 344437
57705 344437 344528 344135 343940 344648 346199 348162 350189 351872 352957 353986 355956 359044 362367 365255 367982
57690C67982K958K993K867L298M514N927O864O964O191N084M589M962N363N184
57676D35740N039N664O595O964O912P139P598P738P624P788Q306Q935R746J0747
57662E42535J1392J1361J1315J1989J3106J4016J4790J5751J6646J7314J8415
57651F98630K0411K2418K3419K3882K4975K6715K8267K9620L1536L4136L6897
57640A000906L9834M3424M7578N1830N6314O1390O6642P1499P6576Q3050R0857
57629A689900R8819J06494J14650J23782J33344J42479J50615J57217J61746J63790
57619C042836J62463J56011J42949J23429R8800P0389L9870J0147j5681l6267
57609C794946n1842o2501o8261p0912p4272q1797r4300j09750j24378j34360j37894
$$ plain form
57690 367982 370940 373933 376800 380098 384612 390539 397403 404367 410558 415642 420231 425193 430556 435740
57676 435740 440779 446443 453038 460002 466914 474053 481651 489389 497013 504801 513107 522042 531788 542535
57662 542535 553927 565288 576603 588592 601698 615714 630504 646255 662901 680215 698630
57651 698630 719041 741459 764878 788760 813735 840450 868717 898337 929873 964009 1000906
57640 1000906 1040740 1084164 1131742 1183572 1239886 1301276 1367918 1439417 1515993 1599043 1689900
57629 1689900 1788719 1895213 2009863 2133645 2266989 2409468 2560083 2717300 2879046 3042836
57619 3042836 3205299 3361310 3504259 3627688 3726488 3796877 3836747 3846894 3831213 3794946
57609 3794946 3743104 3680603 3612342 3541430 3467158 3385361 3291061 3181311 3056933 2922573 2784679
57598B784679j36068j31174j24379j15704j05633r5283q5164p5096o5291n6320
57588A794567m8064l9964l2306k5929k0635j5182r087l146K048O942J2048J7283
57576A638575K2609K8298L4241L9965M5616N2026N9504O7473P5490Q3708R2119
57565B239624J00235J07774J14695J20475J24193J25432J24128J19356J09445
57556C285357R3615P2601M7527J9244j0789m0170o6737q9492j08035j21978j31286
57545B949857j36489j38131j36645j32877j27905j22115j15294j07763j00548
57536A832090r4115q7939q1562p5260o9313o3552n8041n3275m9290m5367m1120
57525A113256l7075l3755l0962k8375k6103k4181k2244k0106j8021j6061j4015
$$ plain form
57598 2784679 2648611 2517437 2393058 2277354 2171721 2076438 1991274 1916178 1850887 1794567
57588 1794567 1746503 1706539 1674233 1648304 1627669 1612487 1603400 1600254 1602302 1609244 1621292 1638575
57576 1638575 1661184 1689482 1723723 1763688 1809304 1861330 1920834 1988307 2063797 2147505 2239624
57565 2239624 2339859 2447633 2562328 2682803 2806996 2932428 3056556 3175912 3285357
57556 3285357 3378972 3451573 3499100 3518344 3507555 3467385 3400648 3311156 3203121 3081143 2949857
57545 2949857 2813368 2675237 2538592 2405715 2277810 2155695 2040401 1932638 1832090
57536 1832090 1737975 1650036 1568474 1493214 1423901 1360349 1302308 1249033 1199743 1154376 1113256
57525 1113256 1076181 1042426 1011464 983089 956986 932805 910561 890455 872434 856373 842358
57514H42358j2142j1152j0958j0411q776o642m886l592k559j970j760j144L92
57501G66758K301L851N210O822Q307Q996R149R765J1267J3147J4737J5867J6803
57488H92980J8085K0197K3003K5738K7932L0083L2956L6535M0165M3547M7048
57477A238269N1169N6063O1471O6882P1819P6250Q0620Q5331R0332R5195R9283
57466B072684J01720J01620R8540R2315Q2457O8335N0201K9428P471j4862l6697
57455B653212n6417p2431q4262r2373r7195r8989r8360r6207r3101q9057q3958
57444A690862p7912p1313o4669n8332n2235m6218m0586l5866l1863k7636k2837
57433A161395j8410j5297j3004j0266o837l570q34K099N803R751J3185J6298J9830
$$ plain form
57514 842358 830216 819064 808106 797695 788919 782277 777391 773799 771240 769270 767510 766366 766758
57501 766758 769059 772910 778120 784942 793249 802245 811394 821159 832426 845573 860310 876177 892980
57488 892980 911065 931262 954265 980003 1007935 1038018 1070974 1107509 1147674 1191221 1238269
57477 1238269 1289438 1345501 1406972 1473854 1545673 1621923 1702543 1787874 1878206 1973401 2072684
57466 2072684 2174404 2276024 2374564 2466879 2549336 2617671 2667872 2697300 2704771 2689909 2653212
57455 2653212 2596795 2524364 2440102 2347729 2250534 2151545 2053185 1956978 1863877 1774820 1690862
57444 1690862 1612950 1541637 1476968 1418636 1366401 1320183 1279597 1243731 1211868 1184232 1161395
57433 1161395 1142985 1127688 1114684 1104418 1097581 1094011 1093177 1095276 1101079 1110830 1124015 1140313 1160143
57420A160143K3875K7808L1331L4938L9220M4206M9619N5361O1311O7013P2063
57409A666888P6646Q1171Q5432Q8699R0564R0961Q9093Q3313P2614N7661L9670
57398B522712J8957m367k8694n1145o9655q3958r4556j01719j05802j07508j07288
57387A786977j05138j01387r6896r2076q6504q0097p3878o8642o3686n7891n1705
57376I09077m6764m3625m1011l7656l3826l0511k7925k5555k3249k1368k0004
57365E57583j8720j7251j5929j5194j4926j4592j3905j3056j2363j1929j1672
57354C98046j1497j1282j0853j0179r530r194r003q301o693m719l510l571m125
57341B95589l983k978k074j949k049j493m52J05r0k01L90J094R00k73j515j934
$$ plain form
57420 1160143 1184018 1211826 1243157 1278095 1317315 1361521 1411140 1466501 1527812 1594825 1666888
57409 1666888 1743534 1824705 1910137 1998836 2089400 2180361 2269454 2352767 2425381 2483042 2522712
57398 2522712 2541669 2537302 2508608 2457463 2387808 2303850 2209294 2107575 2001773 1894265 1786977
57387 1786977 1681839 1580452 1483556 1391480 1304976 1224879 1151001 1082359 1018673 960782 909077
57376 909077 862313 818688 777677 740021 706195 675684 647759 622204 598955 577587 557583
57365 557583 538863 521612 505683 490489 475563 460971 447066 434010 421647 409718 398046
57354 398046 386549 375267 364414 354235 344705 335511 326508 318207 311514 306795 303285 299714 295589
57341 295589 291606 288628 286554 284605 282556 281063 280611 280716 280626 280425 280815 281909 282809 282536 281021 279087
57325B79087j425o14l73j071k091k350j615q83j107j900k106j335k93L20N60P76
57309B63580J025J151J115R66P69O69Q48J283J761K120K367K590K889L366L941
57294B90440M255M012L404K985L137L816M780N768O482O634O224N663N522O117
57280C59239P260Q315Q610P976O927O281O518P448Q393Q718Q384P886P611P338
57266D66904O706N986N954O881Q064Q610Q391Q050Q238R028R932J0448J0617J1008
57252E84817J1913J2799J2921J2349J1916J2209J3046J3891J4283J3922J3005
57241G27071J2467J3240J5158J7151J8532J9461K0218K0916K1926K3642K5594
57230I35376K6778K7109K7545K8396K8730K8008K7125K7054K7398K7272K6732
$$ plain form
57325 279087 277662 277048 276675 275604 273513 271163 269548 268665 267558 265658 263552 262217 261924 262244 262804 263580
57309 263580 264605 265756 266871 267837 268606 269275 270123 271406 273167 275287 277654 280244 283133 286499 290440
57294 290440 294695 298707 302111 305096 308233 312049 316829 322597 329079 335713 341937 347600 353122 359239
57280 359239 366499 374814 383424 391400 398327 404608 411126 418574 426967 435685 444069 451955 459566 466904
57266 466904 473610 479596 485550 492431 500495 509105 517496 525546 533784 542812 552744 563192 573809 584817
57252 584817 596730 609529 622450 634799 646715 658924 671970 685861 700144 714066 727071
57241 727071 739538 752778 767936 785087 803619 823080 843298 864214 886140 909782 935376
57230 935376 962154 989263 1016808 1045204 1073934 1101942 1129067 1156121 1183519 1210791 1237523
57219A237523K6369K6105K5453K4475K3582K2740K1629K0260J8723J6751J4217
57208A477827J1586R289P116M858K861J273n49k954m914n029l228n71K265N452
57194A505282R248J3640J8452K3151K6864K9247L1032L2967L4708L5448L5151
57183A795190L4339L3133L1327K9006K6263K2750J8400J4230J1477J0246R827
57172B036188J0041J1401J4168J8103K3001K8630L4285L9112M2730M5176M6440
57161B349275M6637M6151M5147M3299M0536L7558L5116L3249L1673L0336K9163
57150B768140K8006K7354K8245L0851L3903L6044L6968L6738L5240L3021L1457
57139C125967L1079L0741K9366K7473K5897K4224K1712J8839J6605J5151J4105
$$ plain form
57219 1237523 1263892 1289997 1315450 1339925 1363507 1386247 1407876 1428136 1446859 1463610 1477827
57208 1477827 1489413 1498702 1505818 1510676 1513537 1514810 1514261 1511307 1506393 1501364 1498136 1497565 1499830 1505282
57194 1505282 1514530 1528170 1546622 1569773 1596637 1625884 1656916 1689883 1724591 1760039 1795190
57183 1795190 1829529 1862662 1893989 1922995 1949258 1972008 1990408 2004638 2016115 2026361 2036188
57172 2036188 2046229 2057630 2071798 2089901 2112902 2141532 2175817 2214929 2257659 2302835 2349275
57161 2349275 2395912 2442063 2487210 2530509 2571045 2608603 2643719 2676968 2708641 2738977 2768140
57150 2768140 2796146 2823500 2851745 2882596 2916499 2952543 2989511 3026249 3061489 3094510 3125967
57139 3125967 3157046 3187787 3217153 3244626 3270523 3294747 3316459 3335298 3351903 3367054 3381159
57128C381159J3469J3111J2267J0604Q776P085M712J346j811l827n427p279q376
57115C425809p671o044n057m963n390o702r082j1497j3144j4541j5887j5907j3998
57102C295926j1782j0644r541p235m904m187m344l729k570j955j783k122m868
57089C226262j1266j9340k6383l2516l9153m5767n1144n6188o2397o9057p4843
57078B738208q0604q7587r4717j00732j07092j15544j24964j33912j44037j57099
57068A591920j70971j82763j93674k06505k20629k33991A35501a29440k84526
57059d13966l05018l28607l58646l94501m34033m78691n30834n88823o50658p19643
57049e203420q00613q93952r99797j124475j275799j456099j667465j918880k219130
$$ plain form
57128 3381159 3394628 3407739 3420006 3430610 3439386 3446471 3451183 3452529 3450718 3446891 3441464 3434185 3425809
57115 3425809 3418138 3412094 3407037 3402074 3396684 3389982 3380900 3369403 3356259 3341718 3325831 3309924 3295926
57102 3295926 3284144 3273500 3263959 3256724 3251820 3247633 3243289 3239560 3236990 3235035 3233252 3231130 3226262
57089 3226262 3214996 3195656 3169273 3136757 3097604 3051837 3000693 2944505 2882108 2813051 2738208
57078 2738208 2657604 2570017 2475300 2374568 2267476 2151932 2026968 1893056 1749019 1591920
57068 1591920 1420949 1238186 1044512 838007 617378 383387 135501 -129440 -413966
57059 -413966 -718984 -1047591 -1406237 -1800738 -2234771 -2713462 -3244296 -3833119 -4483777 -5203420
57049 -5203420 -6004033 -6897985 -7897782 -9022257 -10298056 -11754155 -13421620 -15340500 -17559630
57040a7559630k567487k961212l407676l919669m506007n178893n962232o876186
57032e2938992p917343r065033j0294015j1563174j2808921j3976834j5042934
57025a33607246j5974184j6705924j7229499j7669908j8127995j8361210j7723196
57018b55399162j5586701j1878357p160197k204725K447286O563174J0046823
57011b73171859J2829447J4892991J6290482J7104815J7413258J7292740J6826610
57004a60521516J6094733J5170642J4126487J3023116J1894972J0758844R636590
56997f9816132Q557669P543699O605268N752519M995330M333029L755456L254731
56989b5018431K826764K462613K148823J876983J644608J447052J276537J128797
$$ plain form
57040 -17559630 -20127117 -23088329 -26496005 -30415674 -34921681 -40100574 -46062806 -52938992
57032 -52938992 -60856335 -69921368 -80215383 -91778557 -104587478 -118564312 -133607246
57025 -133607246 -149581430 -166287354 -183516853 -201186761 -219314756 -237675966 -255399162
57018 -255399162 -270985863 -282864220 -290024417 -292229142 -289781856 -283218682 -273171859
57011 -273171859 -260342412 -245449421 -229158939 -212054124 -194640866 -177348126 -160521516
57004 -160521516 -144426783 -129256141 -115129654 -102106538 -90211566 -79452722 -69816132
56997 -69816132 -61258463 -53714764 -47109496 -41356977 -36361647 -32028618 -28273162 -25018431
56989 -25018431 -22191667 -19729054 -17580231 -15703248 -14058640 -12611588 -11335051 -10206254
56981a0206254J002865Q94636P97927P11456O37739N75389N19176M67194M21279
56972d178593L80716L42134L05613K74541K49084K25582K02660J82323J64635
56963a851305J46595J26895J07159Q8067O8769N0289L5178K3413J2633K405n477
56952a195379j0856j5390j9053k0044j8098j4510r373k098O020J3157K0049K8395
56940a237180L7326M4960N2140O0875P0649Q0094Q9996R9271R9845Q2525M8730
56929d70769J1006j9038l8653m9944n4242n2831m8531m3444l7622l1405k6374
56918h61847k2896j9463j5482j2020r149n373m43M020P425J0962J4884J7815J9441
56905h72126K1141K3292K4560K4560K4673K5511K6036K5821K5788K6044K5272
$$ plain form
56981 -10206254 -9203389 -8308753 -7510826 -6799370 -6161631 -5586242 -5067066 -4599872 -4178593
56972 -4178593 -3797877 -3455743 -3150130 -2875589 -2626505 -2400923 -2198263 -2015940 -1851305
56963 -1851305 -1704710 -1577815 -1470656 -1382589 -1313820 -1263531 -1228353 -1204940 -1192307 -1189902 -1195379
56952 -1195379 -1206235 -1221625 -1240678 -1260722 -1278820 -1293330 -1302703 -1304801 -1298781 -1285624 -1265575 -1237180
56940 -1237180 -1199854 -1154894 -1102754 -1041879 -971230 -891136 -801140 -701869 -602024 -519499 -470769
56929 -470769 -459763 -478801 -517454 -567398 -621640 -674471 -723002 -766446 -804068 -835473 -861847
56918 -861847 -884743 -904206 -919688 -931708 -940857 -946230 -946673 -942653 -935228 -924266 -909382 -891567 -872126
56905 -872126 -850985 -827693 -803133 -778573 -753900 -728389 -702353 -676532 -650744 -624700 -599428
56894e99428K2779J9235J5128J0634O927N228M692L650K657L580N941P335P496
56881d84146Q556J1010J2792J3072J3594J5263J6622J6818J7208J8713K0228K0796
56869b99474K0820K0013J6752J0777M225j090n330q678j0199r779q932q546p883
56856b87324o628n712n293m256k584j768j915j071J439L580L865L554M097M759
56842b95257M506M062M274M375L705L387M501O078O654O480O643P301Q182R656
56828b15453J1869J3935J5157J6021J6952J7256J6233J4257J1958R562P624O916
56816e7713O976O319M795L978M540N132M797M542N347d826B177P591Q977J0670
56802B9415J2241J4524J8123K1872K3995K3606K0361J4237O708M38l413o111q599
$$ plain form
56894 -599428 -576649 -557414 -542286 -531652 -524725 -519497 -514805 -511155 -508498 -504918 -498977 -491642 -484146
56881 -484146 -475590 -464580 -451788 -438716 -425122 -409859 -393237 -376419 -359211 -340498 -320270 -299474
56869 -299474 -278654 -258641 -241889 -231112 -226887 -227977 -233307 -241985 -252184 -261963 -270895 -279441 -287324
56856 -287324 -293952 -299664 -304957 -309213 -311797 -313565 -315480 -316551 -315112 -311532 -307667 -304113 -300016 -295257
56842 -295257 -290751 -286689 -282415 -278040 -274335 -270948 -266447 -260369 -253715 -247235 -240592 -233291 -225109 -215453
56828 -215453 -203584 -189649 -174492 -158471 -141519 -124263 -108030 -93773 -81815 -72253 -64629 -57713
56816 -57713 -50737 -44418 -39623 -35645 -31105 -25973 -21176 -16634 -11287 -4826 2177 9768 18745 29415
56802 29415 41656 56180 74303 96175 120170 143776 164137 178374 185082 185520 182107 175996 167397
56789A67397r697q421o206n013m662l756j997J02K710O152R753J2682J5238J8128
56775A92410K1305K4540K7917L0565L0171K5158J6553O641l175j2079j8830k2569
56763C18607k3838k3592k2075j9536j6917j4675j2076q684n405k908m60K608N587
56750A76636P988J0843J4843J8477J9726J8553J6013J2081O200q14p260j2387
56738B80899j6259j8542j8954j8268j7384j6004j3573j0737q487o597m353k072
56726A29669m19J078L325O042Q330J0194J2009J3078J2192R284N194M27m656r021
56712A96726j1779j3290j4231j4224j2753j0652r224q445p527o580o166n784m577
56699G1494l135k885l891m790m823m415l868k924j671o45NM79O29K81k4K76O92
$$ plain form
56789 167397 157700 149279 143073 138060 133398 129642 127645 127747 130457 136609 146362 159044 174282 192410
56775 192410 213715 238255 266172 296737 326908 352066 368619 375260 372085 360006 341176 318607
56763 318607 294769 271177 249102 229566 212649 197974 185898 177214 171809 168901 168441 171049 176636
56750 176636 184624 195467 210310 228787 248513 267066 283079 295160 301360 300546 293286 280899
56738 280899 264640 246098 227144 208876 191492 175488 161915 151178 142691 136094 131741 129669
56726 129669 129250 130328 133653 139695 148025 158219 170228 183306 195498 204782 209976 210403 205747 196726
56712 196726 184947 171657 157426 143202 130449 119797 110573 102128 94601 88021 81855 76071 71494
56699 71494 68359 65474 61583 56793 51970 47555 43687 40763 39092 38447 38452 38931 39560 39841 39817 40093 40785
56682D0785M21k33l11K08N31L85J52j16o28j057r03m27k63l98n02p54j368j781
56664C3741j442q97r61j369j423j400j887k293j547nQ51N01j63m08m14n09p88
56647A9587j375k156k390j596m79L2J74O70J232J069M76L91P72P78M71Q21K019
56630B0496L156L631L725L742L672L678L920M015L594L078K971K790J860P50N21
56615F5599R45R00K68M0N46J016R19M72j63j030j740j782j393j180j070p13n56
56598F1078j211k129k149j205j97N48J282J733J351N87M12P82Q97Q14J223J898
56582F5714J899J234P63M94l40j569k076j668j330j466j481j189j167j439j284
56567E5095o16j80j85j73k34q65j547j175k7L79k77o31K9O41K86l47k85K88N96
$$ plain form
56682 40785 41206 40973 40662 40870 41401 41786 41938 41822 41194 40137 39234 38807 38544 38146 37644 36890 35522 33741
56664 33741 32299 31402 30441 29072 27649 26249 24362 22069 20522 20517 21368 21869 21706 21298 20884 20375 19587
56647 19587 18212 16056 13666 12070 11591 11623 11797 12467 13699 14768 15244 15635 16407 17185 17656 18477 20496
56630 20496 23652 27283 31008 34750 38422 42100 46020 50035 53629 56707 59678 62468 64328 65078 65599
56615 65599 66544 67444 67712 67752 68298 69314 70233 70705 70542 69512 67772 65990 64597 63417 62347 61634 61078
56598 61078 59867 57738 55589 54384 54187 54735 56017 57750 59101 59688 60100 60882 61779 62593 63816 65714
56582 65714 67613 68847 69610 70104 69764 68195 66119 64451 63121 61655 60174 58985 57818 56379 55095
56567 55095 54479 54299 54114 53941 53707 52842 51295 50120 50093 50472 50195 49564 49593 50234 50520 50173 49888 50176 50772
56548E0772L19m67j409j737r99J3K32P2P28J870J921P45N4P12J555J589J412J605
56530E8987J550R01N75J156J750J531J175J523K069J911J287J021J272J731K307
56515H0746K880L053K815K732K996L114K869K666K656K528K435K977M023M774
56501A23264N220O030O888O590N254M576N239N909N669N492O255O941O294M805
56487B04426L635K784J696N86j46q52j848k614k769k892l387l640l282l127l816
56472A84754m626m743m576m671m505l595k728k757l152l027k690k815l049k783
56458A35037k410k499k536j872j105j129j552j466j147j522k464l014k913k663
56444A06745k426k041j745j749j579p98N7K52j1j84m50j111j609j276m67J87R20
$$ plain form
56548 50772 51091 50624 49215 47478 46479 46492 46724 46796 47524 49394 51315 52060 52114 52826 54381 55970 57382 58987
56530 58987 60537 61438 62013 63169 64919 66450 67625 69148 71217 73128 74415 75436 76708 78439 80746
56515 80746 83626 86679 89494 92226 95222 98336 101205 103871 106527 109055 111490 114467 118490 123264
56501 123264 128484 134514 141402 147992 153246 157822 163061 168970 174639 180131 186386 193327 199621 204426
56487 204426 208061 210845 212541 213127 212981 212129 210281 207667 204898 202006 198619 194979 191697 188570 184754
56472 184754 180128 175385 170809 166138 161633 158038 155310 152553 149401 146374 143684 140869 137820 135037
56458 135037 132627 130128 127592 125720 124615 123486 121934 120468 119321 117799 115335 112321 109408 106745
56444 106745 104319 102278 100533 98784 97205 96407 96464 96716 96705 96521 96071 94960 93351 92075 91608 91795 92715
56427I2715K072K887K526J672J662K449K896K791L019L785M177L643K706J972
56413A30972J483J233J455K086K627K702K391J982J771J899K174K297K499L287
56399A60858M398M780M063L110K639K283J683J377J686J780R41j29m44k92n16
56384A88217r59q51k05L88P52Q94L58j036k384k744k413k176j924j135j93J08
56368A74697j76m13n43q61j147j085j031j424j880j879j660j580j368j006j379
56353A57265k838l992l416j739o40m73l83m8K04M68Q58O86m50j382q51L57N12
56336A44138l16m92N00J544J948K158K370K125J480J097J043Q31N96Q71J339J189
56320A62421O59P36J400J687J421J347J559J344P07N59J184J849K146K412K662
$$ plain form
56427 92715 94787 97674 100200 101872 103534 105983 108879 111670 114689 118474 122651 126294 129000 130972
56413 130972 132455 133688 135143 137229 139856 142558 144949 146931 148702 150601 152775 155072 157571 160858
56399 160858 165256 170036 174099 177209 179848 182131 183814 185191 186877 188657 189598 189469 189025 188733 188217
56384 188217 187258 186407 186202 186590 187342 188236 188594 187558 185174 182430 180017 177841 175917 174782 174589 174697
56368 174697 174521 174108 173565 172704 171557 170472 169441 168017 166137 164258 162598 161018 159650 158644 157265
56353 157265 154427 150435 147019 145280 144640 144167 143784 143736 143940 144408 145266 145952 145502 144120 143269 143626 144138
56336 144138 143822 143330 143830 145374 147322 149480 151850 153975 155455 156552 157595 158426 159022 159893 161232 162421
56320 162421 163080 163816 165216 166903 168324 169671 171230 172574 173281 173840 175024 176873 179019 181431 184093
56305A84093K433J783J305J067O78L29N93J251J582J621J924K263J910J114Q70
56290B04816J342J814K113K550K762K130J299J531K631L110K570K218K847L857
56276B37590M561M929M859M147L385L485M216M576M571N085O045O459O332O719
56262C06959P593P606O422N530O049P229P820P583O941O292O096O499O682N778
56248D01079M368L712L695L173K217K011K490K205R55L71J260K443L039L892N650
56233D42560P257P559P042O857P331Q323R892J1749J3135J3959J5056J6796J8526
56220E86042J9770K0877K2133K3458K5194K7891L1092L3765L6059L9021M2459
56209I07761M5015M6619M8921N2745N7117O1464O6742P3486Q0705Q7633R4809
$$ plain form
56305 184093 186526 188309 189614 190681 191359 191688 192281 193532 195114 196735 198659 200922 202832 203946 204816
56290 204816 206158 207972 210085 212635 215397 217527 218826 220357 222988 226098 228668 230886 233733 237590
56276 237590 242151 247080 251939 256086 259471 262956 267172 271748 276319 281404 287449 293908 300240 306959
56262 306959 314552 322158 328580 334110 340159 347388 355208 362791 369732 376024 382120 388619 395301 401079
56248 401079 405447 409159 412854 416027 418244 420255 422745 424950 425905 426276 427536 429979 433018 436910 442560
56233 442560 449817 457376 464418 471275 478606 486929 496821 508570 521705 535664 550720 567516 586042
56220 586042 605812 626689 648822 672280 697474 725365 756457 790222 826281 865302 907761
56209 907761 952776 999395 1048316 1101061 1158178 1219642 1286384 1359870 1440575 1528208 1623017
56198A623017J02497J09762J16163J22640J29730J36384J41530J45256J47566
56189B774545J47524J44442J38533J29691J17362J02194Q5913O8841M9558K7955
56179C786558O463j2809l0030m5601n8533o8347p6396q3495q8249q9628q9356
56168C150577q9742r0665r0813r0450r0809r1826r2587r3153r4118r4993r4713
56157B136708r3226r1314q9435q7757q6387q4624q1141p5981p1127o7890o5060
56146A242766o0888n5664n0806m6680m2790l9162l6098l3314l0486k7872k5533
56135G93473k2986k0333j8464j7381j5879j3672j2060j1556j0755q807o993o425
56123F28162o084m788l217k312j390L41K073K937L596M546M642L329K444L654
$$ plain form
56198 1623017 1725514 1835276 1951439 2074079 2203809 2340193 2481723 2626979 2774545
56189 2774545 2922069 3066511 3205044 3334735 3452097 3554291 3640204 3709045 3758603 3786558
56179 3786558 3793021 3780212 3750182 3704581 3646048 3577701 3501305 3417810 3329561 3239933 3150577
56168 3150577 3060835 2970170 2879357 2788907 2698098 2606272 2513685 2420532 2326414 2231421 2136708
56157 2136708 2043482 1952168 1862733 1774976 1688589 1603965 1522824 1446843 1375716 1307826 1242766
56146 1242766 1181878 1126214 1075408 1028728 985938 946776 910678 877364 846878 819006 793473
56135 793473 770487 750154 731690 714309 698430 684758 672698 661142 650387 641580 634587 628162
56123 628162 622078 617290 614073 611761 610371 610712 612785 615722 619318 623864 628506 631835 634279 637933
56109F37933N679O367O007O204O814O565N605N031M674L572K016J153J219J804
56095G00643K952M454N202M847M872O382Q250R185J0054J2149J4791J6803J8842
56082H19426K1953K5207K7274K9009L2116L6345M0426M4657N0078N6070O1181
56071A243742O5331O8975P1077P0206O6759O2087N6624N0887M6742M5136M3848
56060A891414M0003L3562K5994J7209O687l815j1854j7608k2796k7442l0784l4239
56048A866331m0126m7957n4963n9673o2356o2776o0510n6852n3514m9985m4846
56037A272773l8855l4004l0349k6608k3018k0749j9308j7418j5608j5062j4823
56026A016971j3042j0176p992o445m531l002l055l421k123l4O99O87K106M552
$$ plain form
56109 637933 643612 649979 655986 662190 669004 675569 681174 686205 690879 694451 696467 697620 698839 700643
56095 700643 703595 708049 713251 718098 722970 729352 737602 746787 756841 768990 783781 800584 819426
56082 819426 841379 866586 893860 922869 954985 991330 1031756 1076413 1126491 1182561 1243742
56071 1243742 1309073 1378048 1449125 1519331 1586090 1648177 1704801 1755688 1802430 1847566 1891414
56060 1891414 1931417 1964979 1990973 2008182 2014869 2011054 1999200 1981592 1958796 1931354 1900570 1866331
56048 1866331 1826205 1778248 1723285 1663612 1601256 1538480 1477970 1421118 1367604 1317619 1272773
56037 1272773 1233918 1199914 1169565 1142957 1119939 1099190 1079882 1062464 1046856 1031794 1016971
56026 1016971 1003929 993753 985761 979316 974785 971783 968728 965307 963184 963150 963849 964536 966642 971194
56012I71194N833O025P019Q698R376R314J0182J1730J2538J3193J5058J6964J6936
55999A114060J6157J7087J8758J8395J6665J6718J8675J9827J9729K0372K1653
55988A318096K1534K0458K0943K2906K3971K4155K5595K7920K8696K8224K9083
55977A591581L1192L2265L2839L5639M0132M2979M3868M5664M8795N0860N1794
55966B047608N4060N7627O0170O2149O6149P1379P4603P6377Q0330Q6295R0368
55955B827115R1904R4129R7690J00109J01770J05869J12121J17151J21241J27940
55945C897039J37055J45128J52671J63356J76235J86754J95318K06505K19923
55936E479984K30787K39551K51410K66090K78139K87942L01905L20825L38999
$$ plain form
56012 971194 977027 983052 990071 998769 1008145 1017459 1027641 1039371 1051909 1065102 1080160 1097124 1114060
55999 1114060 1130217 1147304 1166062 1184457 1201122 1217840 1236515 1256342 1276071 1296443 1318096
55988 1318096 1339630 1360088 1381031 1403937 1427908 1452063 1477658 1505578 1534274 1562498 1591581
55977 1591581 1622773 1655038 1687877 1723516 1763648 1806627 1850495 1896159 1944954 1995814 2047608
55966 2047608 2101668 2159295 2219465 2281614 2347763 2419142 2493745 2570122 2650452 2736747 2827115
55955 2827115 2919019 3013148 3110838 3210947 3312717 3418586 3530707 3647858 3769099 3897039
55945 3897039 4034094 4179222 4331893 4495249 4671484 4858238 5053556 5260061 5479984
55936 5479984 5710771 5950322 6201732 6467822 6745961 7033903 7335808 7656633 7995632
55927G995632L56003L77973M05639M32902M59049M90206N26643N61338N93485
55918A2198870O30237O72725P14245P55077Q04583Q65865R33763J010744J107658
55909A9693767J225136J352314J487986J643671J821455K010404K210940K440706
55901C3886379K710931L021734L386365L831409M365503M979245N683679O513043
55893F8378288P483962Q599922R905364J1473049J3318271J5391872J7640628
55886A52191356J9867261K1363884K0853609J7200649J0429746K000576o037301
55879B37869780j2204764j6068095j7921523j8292035j7692715j6550649j5154448
55872A23985551j3652994j2134207j0683637r363477q187459p148614o247185
$$ plain form
55927 7995632 8351635 8729608 9135247 9568149 10027198 10517404 11044047 11605385 12198870
55918 12198870 12829107 13501832 14216077 14971154 15775737 16641602 17575365 18586109 19693767
55909 19693767 20918903 22271217 23759203 25402874 27224329 29234733 31445673 33886379
55901 33886379 36597310 39619044 43005409 46836818 51202321 56181566 61865245 68378288
55893 68378288 75862250 84462172 94367536 105840585 119158856 134550728 152191356
55886 152191356 172058617 193422501 214276110 231476759 241906505 243907081 237869780
55879 237869780 225665016 209596921 191675398 173383363 155690648 139139999 123985551
55872 123985551 110332557 98198350 87514713 78151236 69963777 62815163 56567978
55865E6567978n476436m810979m229332l728448l303874k936687k612144k331812
55857B7138266k095803j890738j706040j545397j411290j293082j180712j076747
55849A4938457r85397r02004q22429p51250o91880o38727n86944n40245n01899
55840H517682m67393m32925m02114l77695l55035l30340l07124k88485k70817
55831E285754k51214k33518k21018k10225j97694j86286j78953j72643j63968
55822C470235j55025j48430j42226j34584j28066j24406j20364j13320j05831
55813B297983j00298r4371q5951p7689p2128o7241o1013n5615n2782m9828m4581
55802A536486l9773l8144l7462l4687l1077k8901k6950k3449j9836j7629j5087
$$ plain form
55865 56567978 51091542 46280563 42051231 38322783 35018909 32082222 29470078 27138266
55857 27138266 25042463 23151725 21445685 19900288 18488998 17195916 16015204 14938457
55849 14938457 13953060 13051056 12228627 11477377 10785497 10146770 9559826 9019581 8517682
55840 8517682 8050289 7617364 7215250 6837555 6482520 6152180 5845056 5556571 5285754
55831 5285754 5034540 4801022 4580004 4369779 4172085 3985799 3806846 3634203 3470235
55822 3470235 3315210 3166780 3024554 2889970 2761904 2637498 2517134 2403814 2297983
55813 2297983 2197685 2103314 2017363 1939674 1867546 1800305 1739292 1683677 1630895 1581067 1536486
55802 1536486 1496713 1458569 1421107 1386420 1355343 1326442 1299492 1276043 1256207 1238578 1223491
55791A223491j0864p615q152j1133j4055j7195k1090k3470k2529k0319j9417j8985
55779A028667j7420j5882j5859j6149j5512j5521j7542j9703k0015j9743k0504
55768H34817k0869j9143j6771j5731j5156j3728j2816j3862j5181j4700j3550
55757F63310j3593j3756j2247j0279j0036j0834j0599r546r117q867p540n823
55745E41073n111m908m052l144l154l218k315j556k288l571m006m317n604o777
55731D87052o428n593n986o937o826o033n974o501o781p227q152q103o060l744
55717C96707l165l434k636j383j656l428n198o680q328r357q978q431r166j0131
55703C14736r524p982p344p307o280m678m339n250n704n324n311o012o588o891
$$ plain form
55791 1223491 1212627 1205012 1196860 1185727 1171672 1154477 1133387 1109917 1087388 1067069 1047652 1028667
55779 1028667 1011247 995365 979506 963357 947845 932324 914782 895079 875064 855321 834817
55768 834817 813948 794805 778034 762303 747147 733419 720603 706741 691560 676860 663310
55757 663310 649717 635961 623714 613435 603399 592565 581966 572420 563303 554436 546896 541073
55745 541073 535962 531054 527002 523858 520704 517486 515171 513615 511327 507756 503750 499433 493829 487052
55731 487052 480624 475031 469045 462108 455282 449249 443275 436774 429993 422766 414614 406511 400451 396707
55717 396707 393542 390108 387472 386089 384433 381005 375807 369127 360799 351442 342464 334033 324867 314736
55703 314736 305212 297230 289886 282579 276299 271621 267282 262032 256328 251004 245693 239681 233093 226202
55689B26202p356p435o255m459l393k955k172j286j244j788k003k107k695k964
55675A78090j834r1O24L02O7Om09o35j2L83q10k667l196k456k064k340k339k197
55657A58422k786l462k772j203o26j171j204l22K27J90P71K145K939K688K574
55642A56410L161L499L023K509K522K721L035L872M783M672L720L380M037M410
55628B05754L721K778K305J797P31m61j264j761j982j657j005o64o06k22L22R1
55612B07877j002j826j695j201j061j123j000p70o08m17j54K4O3jk53n96n75j26
55594A95556L0n43j143r91n62q09j704k613l502m517n027m508l816m148n137n424
55578A51142m775m097l748l389l255l933m955n128m269l282k624k057j706j966
$$ plain form
55689 226202 218846 211411 205156 200697 197304 194349 192177 190891 189647 187859 185856 183749 181054 178090
55675 178090 176256 176165 176789 177091 177158 177164 176755 176120 176108 176491 175681 173014 169818 167362 165298 162958 160619 158422
55657 158422 155636 152174 149402 148199 147573 146402 145198 144876 145103 145293 146064 148209 151148 153836 156410
55642 156410 159571 163070 166093 168602 171124 173845 176880 180752 185535 190207 193927 197307 201344 205754
55628 205754 209475 212253 214558 216355 217086 216625 215361 213600 211618 209961 208956 208292 207686 207464 207786 207877
55612 207877 206875 205049 203354 202153 201092 199969 198969 198199 197591 197174 197020 197044 197107 197106 196853 196257 195682 195556
55594 195556 195586 195043 193900 192909 192347 191538 189834 187221 183719 179202 174175 169667 165851 161703 156566 151142
55578 151142 146367 142270 138522 135133 131878 127945 122990 117862 113593 110311 107687 105630 103924 101958
55564A01958k466k497k267k439k675k122j091p16j100j378j374j601j818j283
55550G7131m25m54j305j640j076n95o46n35m2R3k95l76N7Q5o98j431j356p50q6
55531F5656N42Q53M45k52l06K63N62L35J56jo97j496j126M33J594J403O10R3k54
55512F8813n64l93K48O30O61J136K094K378J528P14R66J690J808J263N38k70j111
55495H2129j563j510j436j539j392r17p19j043j299j095q01o59m00j22m45j235
55479F5954j398m78N75R04R29J398K137K552K515K119J302L33r2K61P65Q15M84
55462H1075L2m49o86l95J3k27j069j810k381l359m579n068m634m117l768k851
55446D5727j355n47j029j681j397o50m36p61j102j379j625j538j095p45m62L44
$$ plain form
55564 101958 99492 96995 94728 92289 89614 87492 86401 85685 84585 83207 81833 80232 78414 77131
55550 77131 76706 76252 74947 73307 72231 71636 70990 70455 70413 70506 70211 69835 69892 69977 69279 67848 66492 65742 65656
55531 65656 66198 67051 67496 67244 66938 67201 67763 68098 68254 68253 67556 66060 64934 65367 66961 68364 68974 69067 68813
55512 68813 68249 67856 68104 68734 69395 70531 72625 75003 76531 77245 78211 79901 81709 82972 83510 83240 82129
55495 82129 80566 79056 77620 76081 74689 73772 73053 72010 70711 69616 68815 68156 67756 67634 67189 65954
55479 65954 64556 64078 64653 65557 66486 67884 70021 72573 75088 77207 78509 78842 78750 79011 79776 80591 81075
55462 81075 81107 80658 79972 79577 79590 79363 78294 76484 74103 70744 66165 61097 56463 52346 48578 45727
55446 45727 44372 43825 42796 41115 39718 39068 38632 37871 36769 35390 33765 32227 31132 30387 29925 30269
55430C0269J445J591L82r03j169r51j068j088l61N07N38n6m20m79p23j099j162
55413B5253r28p00m93k91l49o25n89j64r4p64j453j453j064p42k22O57J172P49
55395A7900L4q5J98J93o6j48j41k96k88K00O71N35Q4n7L3m0j44J1J49j24n59p75
55373A7285r74j388j550r77q2L99M16L65K53j21o56j214j842k178j439K72J513
55356H082J259L10%K91L32J72N64J408J747J282P49Q15J298J559J096n6j096j053
55338A8759q5M57k04j208j498j363j543j648q24N82J367J261J045J079R08L22
55322A7407k54n03n06k93J23M00K56L0J58L50P5m26m97j38J12J26J55L6n70j281
55302A4760j245l22P42J286J237P37M7l67k65k5o4j79r8k25r77j777j660p00J50
$$ plain form
55430 30269 31714 33305 33687 32784 31615 30664 29596 28508 28147 28654 29192 29136 28716 28237 27514 26415 25253
55413 25253 24325 23625 23132 22841 22492 21867 21278 21114 21020 20256 18803 17350 16286 15544 15322 15979 17151 17900
55395 17900 17934 17849 18047 18240 18174 18026 17885 17589 17301 17501 18172 18707 18791 18734 18767 18727 18583 18594 18743 18619 18060 17285
55373 17285 16311 14923 13373 12396 12314 12713 13129 13494 13747 13626 12970 11756 9914 7736 6297 6569 8082
55356 8082 9341 9651 9651 9942 10274 10446 11010 12418 14165 15447 16196 17011 18309 19868 20964 20908 19812 18759
55338 18759 18674 19131 18927 17719 16221 14858 13315 11667 10843 11425 12792 14053 15098 16177 17085 17407
55322 17407 17153 16650 16144 15851 15974 16374 16630 16660 16818 17168 17243 16817 16320 16182 16294 16420 16575 16611 16041 14760
55302 14760 13515 13193 13935 15221 16458 17195 17242 16875 16610 16585 16521 16342 16244 16019 15042 13265 11605 10905 11055
55283A1055M39M64L08l49j346j963j846j313o79l3L34N8o39j119j184A053E9c67
55264A02J016Q20K74P4N19J328J825J476N61L3L33P21L03o54j117o92K7L40N0
55245G339n55q34j89J141K086K016J510J236Q58j15j073j132o07m42n32n2Q00
55228A1455Q47j28r28p49k23j83m21l03K18P20R21P67L29p8j05J94M18L70J49
55209A3270j98o66r90q58l33L69J183J850J684L80j245k059j917j407p75M9P10
55192I047P64N44O59Q97O08k7k68j11j46k49K56J146J388Q60N44P90P62K6o24
55173A6866n20j00J07L80Q85R79K41o40q67o99q43j287j528j427j116n32K94Q71
55155A1064P94L47O4P3K37N05O90M11k73n84l6P37P66R1l58o1N29O91K48m55r69
$$ plain form
55283 11055 11494 11958 12266 11917 10571 8608 6762 5449 4770 4737 5071 5129 4490 3371 2187 1053 59 -367
55264 102 1118 1938 2212 2286 2805 4133 5958 7434 7995 8028 8361 9082 9385 8731 7614 6922 6949 7289 7339
55245 7339 6784 5950 5761 6902 8988 11004 12514 13750 14608 14493 13420 12288 11681 11239 10707 10655 11455
55228 11455 12302 12174 11246 10497 10274 10091 9670 9367 9585 10305 11226 11993 12322 12244 12139 12333 12751 13121 13270
55209 13270 13072 12406 11416 10558 10225 10594 11777 13627 15311 15691 14446 12387 10470 9063 8288 8337 9047
55192 9047 9811 10355 11014 11911 12519 12492 12224 12113 11967 11718 11974 13120 14508 15368 15912 16702 17464 17490 16866
55173 16866 16346 16246 16353 16733 17618 18597 18838 18198 17331 16632 15789 14502 12974 11547 10431 9899 10193 11064
55155 11064 11858 12205 12269 12342 12579 13084 13774 14185 13912 13328 13292 14029 14795 14886 14528 14467 14996 15687 15935 15480 14511
55134A4511j018o04LM05L22j35n13m06Q8M50L74M2k70n54p43n23J40O67N89K29
55114A3054J47K68J67r8j42mkr3n9r2l86m80J20R33J080O42L65K13n03j541j663
55093A1926m89P63R61M02o6k66l72k32K62O90O73M87N82Q80R76O95J33n54j109
55074A6342j289j127q50n15r8K26L80P01J313J541Q13j54j65N61O55k16p66r8
55056A7254J067J677J691J452Q57m0m99n0O91R17O92M74K67p8k49J22R22J754
55038B8921K313K236J261j21q81o96k44lL54R90J356J196J107J386J320M04o28
55021D0271q65n09k66j96l6M2l3K82J206J818J257Q6n73o65q89j263j233q67p40
55002C6827q48o86k86j28j87l9K37K24J01L70P70N14l12p05k52K75J66k84n65
$$ plain form
55134 14511 13493 12889 12892 13297 13619 13484 12971 12565 12653 13103 13477 13519 13249 12695 11952 11429 11569 12236 12825 13054
55114 13054 13201 13469 13636 13538 13396 13392 13390 13297 13238 13146 12760 12280 12400 13333 14413 15055 15420 15633 15130 13589 11926
55093 11926 11437 12200 13161 13563 13497 13231 12859 12627 12889 13579 14252 14739 15321 16201 17177 17872 18005 17451 16342
55074 16342 15053 13926 13076 12561 12463 12689 13069 13770 15083 16624 17437 17283 17118 17679 18334 18118 17352 17254
55056 17254 18321 19998 21689 23141 23998 23958 23459 23409 24100 25017 25709 26183 26450 26372 26123 26245 27167 28921
55038 28921 31234 33470 34731 34610 33729 33033 32789 32786 33140 34130 35486 36682 37789 39175 40495 40899 40271
55021 40271 39406 38897 38631 38435 38399 38441 38408 38690 39896 41714 42971 43057 42484 41819 40930 39667 38434 37567 36827
55002 36827 35979 35293 35007 34879 34692 34653 34890 35114 35215 35585 36355 36869 36557 35852 35600 35875 36041 35757 35192
54983C5192p93j245j611j348n05K93O01N47M82N19N30M85N95R65J292J205P95
54966C7999M45J71l38j008j346j249j155j175q37j7O22O31M61O26Q74Q32Q00J146
54948C7482J483J280Q00O60Q98J131J270J316R62J66m07l01j20n72j162r64j81
54931D3741K14L6n6J02J02M7M03P60J05j406k268j680n88j34j00L47J176J636
54913D2437J391P88L23K86P01J255J530J501J485J526J293P50M11O35J159J635
54897E9106K142K845L538L956M184M449M735M993N411O181P101P736P840P459
54883A31676O744N839M860L780K470R20o83k248l911n745p438q459q515p761o639
54868A04890n511m492l573k840k496k608k982l283l272k866k101j127j40O93J249
$$ plain form
54983 35192 34399 33154 31543 30195 29690 29983 30584 31131 31613 32132 32662 33147 33742 34707 35999 37204 37999
54966 37999 38444 38615 38277 37269 35923 34674 33519 32344 31507 31490 32112 32743 33204 33830 34704 35536 36336 37482
54948 37482 38965 40245 41045 41705 42603 43734 45004 46320 47282 47448 47041 46740 46620 46048 44886 43922 43741
54931 43741 43955 43991 43935 44037 44139 44186 44589 45349 45454 44048 41780 40100 39512 39378 39278 39625 40801 42437
54913 42437 43828 44616 44939 45225 45926 47181 48711 50212 51697 53223 54516 55266 55677 56312 57471 59106
54897 59106 61248 64093 67631 71587 75771 80220 84955 89948 95359 101540 108641 116377 124217 131676
54883 131676 138420 144259 149119 152899 155369 156289 155606 153358 149447 143702 136264 127805 119290 111529 104890
54868 104890 99379 94887 91314 88474 85978 83370 80388 77105 73833 70967 68866 67739 67599 68292 69541
54853F9541J499J682K190L061L736L732L410L540M226M892N322N917O784P302
54839A26834O980O015M620K576n6k469m033n076o112o863o763n977n135m509m098
54824I5934m147m766n335n169m452l818l227k208r79m35r69k039k903l190k784
54809D9513j814p59q4J81J51k55p92o07O72J921J647k3j488j771j456j397j565
54792D2074j427p92R6P69P63J20l97j57M23N18K05J94L88j03j354k197j889j124
54774C6110q64r83p79j95K10J79P6L97J260K134K144J006l74p95k12L94N49P66
54756D1023J367J821J742J597J849K141K032J879K240K902L262L274L283L259
54742G3671K984K759L121L905M346M235M302N142O295O825O553O201O391O846
$$ plain form
54853 69541 71040 72722 74912 77973 81709 85441 88851 92391 96617 101509 106831 112748 119532 126834
54839 126834 133814 139829 144449 147025 146969 144500 140467 135391 129279 122416 115653 109676 104541 100032 95934
54824 95934 91787 87021 81686 76517 72065 68247 65020 62812 61833 61398 60429 58390 55487 52297 49513
54809 49513 47699 46940 46856 47037 47188 46933 46141 45534 46206 48127 49774 49751 48263 46492 45036 43639 42074
54792 42074 40647 39855 39951 40720 41483 41603 41206 41049 41472 41990 42195 42389 42777 42674 41320 39123 37234 36110
54774 36110 35246 34263 33484 33289 33499 33678 33754 34151 35411 37545 39689 40695 40321 39526 39314 39708 40257 41023
54756 41023 42390 44211 45953 47550 49399 51540 53572 55451 57691 60593 63855 67129 70412 73671
54742 73671 76655 79414 82535 86440 90786 95021 99323 104465 110760 117585 124138 130339 136730 143576
54728A43576O841O120N006L746K248N49r30j926k740l712m629n087n126n009m643
54713A34284l832k857k212j873j507j217j380j799j720q65K64J132J692K038K119
54698A22267J988J911K148K930M465O452P777P593O584O362P446Q748R205Q957
54684B04833Q578P991O839N340M100L257K232L07k611n632p477p785p592q012
54670B04368q796q971q529q323q435p963o712n787n897o253n801m647l546k794
54656A11914k317k173k202j844r80l77o40j312j637j594j483j121k96M66M04m13
54640I4395j247j600j421q00j2M51M47M43O93O87J1p90q49j40P08J360J827J888
54622I6051J298L34m06o56m44K16J092J547J261P50O28P60Q32J179K178L200L275
$$ plain form
54728 143576 150417 156537 161543 165289 167537 168086 167156 165230 162490 158778 154149 149062 143936 138927 134284
54713 134284 130452 127595 125383 123510 122003 120786 119406 117607 115887 115022 115286 116418 118110 120148 122267
54698 122267 124255 126166 128314 131244 135709 142161 149938 157531 164115 170477 177923 186671 195876 204833
54684 204833 213411 221402 228241 233581 237681 240938 243170 243477 240866 235234 227757 219972 212380 204368
54670 204368 195572 186601 178072 169749 161314 153351 146639 140852 134955 128702 122901 118254 114708 111914
54656 111914 109597 107424 105222 103378 102398 102021 101381 100069 98432 96838 95355 94234 93938 94404 94808 94395
54640 94395 93148 91548 90127 89327 89315 89766 90213 90656 91349 92036 92047 91257 90408 90268 90976 92336 94163 96051
54622 96051 97349 97683 97277 96621 96177 96393 97485 99032 100293 101043 101671 102431 103263 104442 106620 109820 113095
54605A13095K566K208K698L390L631L535L418L353L418L678L774L206K209J706
54591A55885K045K476K151J216N45P50J704K727L152K950K868L675N182O447O934
54576B00707P062P549Q573R746J0450J0164Q787O795M785K820N00k289n084p317
54562B63248q739r325r235q941r003r421r636r312q715q119p290n911m266l033
54548A52302k529k496k506k265j588n13N36R78O33j26q60j458j973k279k206j857
54532A31793j545j446j573k033k910l892m414m329m018l700l087k119j446j672
54518I3609k324k378j603q24q67j746k871l522l222k176j324j341j706j377l25
54503F6003M29L09r7p8K56L72L1p27j699k333k028q63M36J383K013K256J899J284
$$ plain form
54605 113095 115661 117869 120567 123957 127588 131123 134541 137894 141312 144990 148764 151970 154179 155885
54591 155885 157930 160406 162557 163773 164318 165068 166772 169499 172651 175601 178469 182144 187326 193773 200707
54576 200707 207769 215318 223891 233637 244087 254251 263038 269833 274618 277438 277938 275649 270565 263248
54562 263248 254509 245184 235949 227008 218005 208584 198948 189636 180921 172802 165512 159601 155335 152302
54548 152302 149773 147277 144771 142506 140918 140405 140941 141919 142552 142426 141566 140108 138135 135856 133650 131793
54532 131793 130248 128802 127229 125196 122286 118394 113980 109651 105633 101933 98846 96727 95281 93609
54518 93609 91285 88907 87304 86480 85613 83867 80996 77474 74252 72076 70752 69411 67705 66328 66003
54503 66003 66432 66741 66644 66566 66822 67194 67225 66498 64799 62466 60438 59575 60011 61394 63407 65663 67562 68846
54485F8846J106J233P82k77p54l9Q50Q49M03N29J220J852K408L219L990M218M055
54468I4490L881L541K930K753L586M686M960M552M253L784K205j53j729j891j686
54453A30162k186l203m073m670n104n263n075m701m223l639l239l335l560l183
54439G4708k141j098m37j0J36l39j279j862j571o88K18P55O25r7n94n3J073J436
54421F8782N47o80j276j209p18K59J524K325K220J654J161P28L58N18J404K279
54405G9876K223J206ko65m72L86J209J204L53n18p45n19l21k81l76p60j403j888
54387G8507j922j698j417r86n01m46r17j241q87l50m21j052j505j443j130q34
54371F1757n96n16o67p67m45J59M44J13m82p49m23K87Q81R80P26O36R49J306J310
$$ plain form
54485 68846 69952 71185 71967 71690 70936 70897 71747 72596 72999 73528 74748 76600 79008 82227 86217 90435 94490
54468 94490 98371 101912 104842 107595 111181 115867 120827 125379 129632 133416 135621 135468 133739 131848 130162
54453 130162 127976 124773 120700 116030 110926 105663 100588 95887 91664 88025 84786 81451 77891 74708
54439 74708 72567 71469 71032 71022 71158 70819 69540 67678 66107 65419 65637 66392 67017 66920 66326 66273 67346 68782
54421 68782 69329 68649 67373 66164 65446 65705 67229 69554 71774 73428 74589 75317 75675 76193 77597 79876
54405 79876 82099 83305 83303 82638 82166 82552 83761 84965 85318 84800 84055 83536 83215 82934 82558 81798 80395 78507
54387 78507 76585 74887 73470 72484 71983 71537 70620 69379 68492 68142 67721 66669 65164 63721 62591 61757
54371 61757 61161 60645 59978 59211 58766 58925 59369 59482 59000 58251 57828 58115 58996 59976 60702 61338 62287 63593 64903
54352F4903J165J309J618J465O89M3L43J422K267K242J802J769K241K590K569
54337H8437K744L548M454M595L928L154K691K332J860J426J140R07P24P49Q50
54322A23539O09j60j133j936k458k682k575k275k098k217k640l298l918l957l175
54307H9626k155j682j724j672j393j334j571j659j435j170p85Q4J113J382Q02
54292G6427L48M67L51n11j163n54P68J489J473J653K366K965L019K910L066L407
54276I8481L637L583L162K500J998J819J489N05q23j735k082k377k854l078k647
54261A01578j737q63m91r04j999l179l739l486k725j823j095r14j409k093k319
54246G2802k102k004k224k344k090j737j545j267o30O0J61n28j551k269k355j858
$$ plain form
54352 64903 66068 67377 68995 70460 71149 71192 71535 72957 75224 77466 79268 81037 83278 85868 88437
54337 88437 91181 94729 99183 103778 107706 110860 113551 115883 117743 119169 120309 121216 121940 122689 123539
54322 123539 124148 123988 122855 120919 118461 115779 113204 110929 108831 106614 103974 100676 96758 92801 89626
54307 89626 87471 85789 84065 82393 81000 79666 78095 76436 75001 73831 73046 73130 74243 75625 76427
54292 76427 76775 77242 77593 77082 75919 75365 76133 77622 79095 80748 83114 86079 89098 92008 95074 98481
54276 98481 102118 105701 108863 111363 113361 115180 116669 117174 116351 114616 112534 110157 107303 104225 101578
54261 101578 99841 98978 98487 97583 95584 92405 88666 85180 82455 80632 79537 78623 77214 75121 72802
54246 72802 70700 68696 66472 64128 62038 60301 58756 57489 56859 56919 57080 56552 55001 52732 50377 48519
54230D8519j059l17R6J52J12K04K43k25j161j706j039M38J377J068K12j55NJ8
54212D6782k72k81M34J629K754L418L377K509J026n18j586j960j754j270q03m29
54196E3056J3N50Q59O65K61K18N90Q03M79j2r7J34M5o52j492j871j702j271p30
54177D9846j30K60J77j14q8J71J5o44r42l58L67L19j03J74J085J498J001M42M69
54158E3445O58N30M15O23O74J38m68l84K00M55R9l84m76j30K85K01n88j420j320
54139E2553l67K53n0l55K51J090Q70l50j328j432j086o25O6P42P36M7m59k79P1
54120E0348l1m32o75p04o69m82n1L34K71j95n49l34L55R14P80N6n94p75p99j019
54100D5749j160p84q9M01P09J218J725J496M42m57k93P20J616J726J153M71K38
$$ plain form
54230 48519 47460 47143 47239 47391 47503 47707 47950 47725 46564 44858 43819 44257 45634 46702 46914 46759 46764 46782
54212 46782 46510 46229 46663 48292 51046 54464 57841 60350 61376 60858 59272 57312 55558 54288 53485 53056
54196 53056 53069 53619 54478 55143 55404 55622 56212 57015 57494 57482 57385 57519 57564 56912 55420 53549 51847 50576 49846
54177 49846 49716 49976 50153 50039 49951 50122 50137 49493 48551 48193 48560 48879 48776 48950 50035 51533 52534 52976 53445
54158 53445 54103 54633 55048 55671 56345 56483 56015 55631 55831 56286 56385 56001 55525 55395 55680 55881 55293 53873 52553
54139 52553 52186 52439 52389 52034 52285 53375 54245 53895 52567 51135 50049 49424 49490 50232 50968 51015 50556 50277 50348
54120 50348 50317 49885 49210 48506 47837 47355 47304 47638 47909 47714 47165 46831 47186 48100 48880 48936 48342 47567 46768 45749
54100 45749 44589 43805 43716 44117 44826 46044 47769 49265 49707 49250 48957 49677 51293 53019 54172 54643 54881
54083E4881N59R76R63M90j01o16j084j357j175o27j61m4j78m38p58r15o93l38
54065D9384l86r10j360j271p71k44M9j9l62n69k96J70J76l29o84n30l20n06p83
54046D0439o50k41j27m26o49k89O80J786K363K008J081M60O50J182J199M98l07
54029D9657n73l43k10n72j149j295p80j10P0k50n68n38k73N4M03O28M66l1l17
54010D4269R3J021J721J532M72p01j087n62P2P8j77K41J348K057J613O18J35L46
53992E3089O82Q47J044J320J372J193J274J904K609K692K155J676J681J814J522
53977G6874R36O86J038J571J882K128K604L133L296L090K909K920K923K790K724
53962A11504K945L424L905M052L615K686J788J461J783K446L129L571L505K900
$$ plain form
54083 54881 55440 56416 57379 57869 57768 57152 56068 54711 53536 52909 52748 52704 52526 52088 51330 50415 49722 49384
54065 49384 48998 48088 46728 45457 44686 44442 44491 44472 44110 43541 43245 43415 43591 43262 42578 42048 41728 41222 40439
54046 40439 39789 39548 39421 38995 38346 38057 38737 40523 42886 44894 45975 46435 47085 48267 49466 49964 49657
54029 49657 49084 48741 48531 47959 46810 45515 44735 44625 44695 44445 43877 43339 43066 43120 43523 44151 44617 44586 44269
54010 44269 44362 45383 47104 48636 49108 48407 47320 46758 46830 46908 46731 46972 48320 50377 51990 52608 52743 53089
53992 53089 53771 54618 55662 56982 58354 59547 60821 62725 65334 68026 70181 71857 73538 75352 76874
53977 76874 77810 78496 79534 81105 82987 85115 87719 90852 94148 97238 100147 103067 105990 108780 111504
53962 111504 114449 117873 121778 125830 129445 132131 133919 135380 137163 139609 142738 146309 149814 152714
53948A52714K131J544R85J34q32j435j567j500j326r64o36p54j264j657j664j420
53932A42489j012m53j23m67j153j311p76l39n02q30r18j103j681k162k100k000
53916A25559k551l408l613k978k203j804j624j427j252j086p64k95J02L27M41
53901A03424L87Q3k22j16L95P94O47Q0l33j04P18J478J551J150J131J775K241
53884A15079J747Q93J011K425M120N117N369N231M827M340M156M298M200L586
53870A66399L017L086L453L321K556J680R46J80m97o11k63k90j121j951j717m51
53854A77737R07J758K225K386K067J491J400K156L169L746M003M431M947M959
53840B17382M276L302K380J455N29o3r3J34nq27k020k894l059k843k889l234l232
$$ plain form
53948 152714 154845 156389 157374 157508 156676 155241 153674 152174 150848 149884 149248 148494 147230 145573 143909 142489
53932 142489 141477 141024 140901 140434 139281 137970 137194 136855 136353 135523 134605 133502 131821 129659 127559 125559
53916 125559 123008 119600 115987 113009 110806 109002 107378 105951 104699 103613 102849 102554 102656 102983 103424
53901 103424 103811 103894 103672 103556 103951 104745 105392 105472 105139 105035 105753 107231 108782 109932 111063 112838 115079
53884 115079 116826 117719 118730 121155 125275 130392 135761 140992 145819 150159 154315 158613 162813 166399
53870 166399 169416 172502 175955 179276 181832 183512 184458 184638 184141 183530 183267 182977 181856 179905 178188 177737
53854 177737 178644 180402 182627 185013 187080 188571 189971 192127 195296 199042 203045 207476 212423 217382
53840 217382 221658 224960 227340 228795 229324 229261 229168 229302 229297 228470 226450 223556 220497 217654 214765 211531 208299
53823B08299k641k255k904m162m834m561m074l862l524k739k060k180k912l491
53809A62100l548l355l278l446l792m135m306m288m171l935l536l113k765k231
53795A12201j265l77m38j417k233k178j793j805j972j687j133j017j446j864j929
53780H9647j755j435r90o86p94j031q21j52M09N25M02K49ql95o74p07o10m74k55
53761H0445m3n9l20n46n43l64p4L52Q11J047R25N78J87j12j53J73P18J197J519
53742H5738J758J901J896J914K128K295K022J507J476K215L126L552L589L697
53728A18814L871L754L331L025L071L219L108K637J835P56l41r80r35n45l19k60
53712A44041O4P90J369J151J01j202k145k425k062j400j030j237j522j181l41
$$ plain form
53823 208299 205658 203403 200499 196337 191503 186942 182868 179006 175482 172743 170683 168503 165591 162100
53809 162100 158552 155197 151919 148473 144681 140546 136240 131952 127781 123846 120310 117197 114432 112201
53795 112201 110936 110559 110121 108704 106471 104293 102500 100695 98723 97036 95903 94886 93440 91576 89647
53780 89647 87892 86457 85467 84781 83987 82956 82135 81983 82392 82917 83319 83568 83560 83165 82491 81784 81174 80700 80445
53761 80445 80402 80343 80023 79477 78934 78570 78496 78848 79659 80706 81631 82209 82396 82284 82131 82304 83022 84219 85738
53742 85738 87496 89397 91293 93207 95335 97630 99652 101159 102635 104850 107976 111528 115117 118814
53728 118814 122685 126439 129770 132795 135866 139085 142193 144830 146665 147421 147080 146100 145165 144620 144301 144041
53712 144041 144105 144895 146264 147415 147516 146314 144169 141744 139682 138282 137252 136015 134493 133312 132971
53697A32971%p54j994k659k381j484l71N09M52q70k571l160k224r44o11j127j402
53680A11380q72o7J95k69r20j104n88K59Q35Q49N57M08N52P74P82M94O2j57K16
53661A13386J180K146K362J723R07O42R38J287J384J366J406J428J310J061O97
53646A33223K21j39n2L86N32n9j038j626j467p84l6K95p2p52q08J32J185J324
53628A30465Q44Q37J413J567R46M92Q41J248R29M46P76J652J989J610J358J651
53612A49064J961J851J559J361J124P74N86O68O80M37K82N27Q89Q80M52m3l49
53595A62703m79m99m05j51K57O98Q39L71n91j481j794j593j378j524j871j862
53579A51240j107J16J036J106M95k28p48j108j322j198o37J80R42J456J685J709
$$ plain form
53697 132971 132971 132217 130223 127564 125183 123699 123328 123837 124289 123419 120848 117688 115464 114520 113909 112782 111380
53680 111380 110508 110441 110636 110367 109447 108343 107755 108014 108849 109698 110255 110663 111215 111989 112771 113265 113327 113170 113386
53661 113386 114566 116712 119074 120797 121704 122346 123284 124571 125955 127321 128727 130155 131465 132526 133223
53646 133223 133444 133305 133253 133639 134171 134112 133074 131448 129981 129197 129161 129456 129384 128632 127824 127956 129141 130465
53628 130465 131309 132146 133559 135126 136072 136564 137405 138653 139582 140028 140804 142456 144445 146055 147413 149064
53612 149064 151025 152876 154435 155796 156920 157694 158280 158948 159628 160065 160347 160874 161763 162643 163095 163052 162703
53595 162703 162224 161725 161320 161169 161426 162124 162963 163334 162743 161262 159468 157875 156497 154973 153102 151240
53579 151240 150133 150249 151285 152391 152886 152658 151910 150802 149480 148282 147645 147825 148767 150223 151908 153617
53563A53617J707J865K197K490K449J986J314Q12O34N46K72l5P2O91J424J913
53547A73954K220K473K487K093J579J494K019K732K999K500J600J204J867K993
53533B04214L345K617J895K231L285L977M003L873L834L573K955K309J833J391
53519B45335R26N37Q7o78j495j651q89J96Q74R68P10L96L74Q90J714K231K136
53502B52661J721J361J092Q61P67Q30Q29O62N48O94J032J410J767K014K069K171
53486B72489K680L396L541K774J755J323J508J834K211K881L674M052L991M161
53472C12270M910N607N394M379L575L697M416M917M898M712M747M984N307N804
53458C79617O566P361P804P859P947Q516R624J0870J1711J1881J1612J1408J1518
$$ plain form
53563 153617 155324 157189 159386 161876 164325 166311 167625 168437 169071 169617 169889 169854 169926 170617 172041 173954
53547 173954 176174 178647 181134 183227 184806 186300 188319 191051 194050 196550 198150 199354 201221 204214
53533 204214 207559 210176 212071 214302 217587 221564 225567 229440 233274 236847 239802 242111 243944 245335
53519 245335 246261 246798 246885 246207 244712 243061 242172 242368 243242 244210 244920 245316 245690 246580 248294 250525 252661
53502 252661 254382 255743 256835 257696 258463 259293 260122 260784 261332 262026 263058 264468 266235 268249 270318 272489
53486 272489 275169 278565 282106 284880 286635 287958 289466 291300 293511 296392 300066 304118 308109 312270
53472 312270 317180 322787 328181 332560 336135 339832 344248 349165 354063 358775 363522 368506 373813 379617
53458 379617 386183 393544 401348 409207 417154 425670 435294 446164 457875 469756 481368 492776 504294
53445E04294J1776J2004J2355J3024J3846J4480J4935J5565J6528J7480J7904
53434F64191J7693J7266J7142J7340J7338J6819J6299J6581J7597J8426J8582
53423H55274J8584J8860J8885J8143J7231J7064J7351J7061J6167J5743J6190
53412A046553J6560J6016J4979J4243J3801J3284J2819J2737J2719J2090J0760
53401A196561R327Q229P298O105M456K529P67m73j318k274l625n095o330p430
53387A208727q711j0094j1078j1353j1205j1193j1495j1752j1640j1469j1853
53376A086884j2806j3548j3572j3360j3614j4093j3998j3244j2575j2330j1960
53365I41784j0903r328p721o330n238m440l635k520j429j034j225j021N5J328
$$ plain form
53445 504294 516070 528074 540429 553453 567299 581779 596714 612279 628807 646287 664191
53434 664191 681884 699150 716292 733632 750970 767789 784088 800669 818266 836692 855274
53423 855274 873858 892718 911603 929746 946977 964041 981392 998453 1014620 1030363 1046553
53412 1046553 1063113 1079129 1094108 1108351 1122152 1135436 1148255 1160992 1173711 1185801 1196561
53401 1196561 1205888 1214117 1221415 1227520 1231976 1234505 1235272 1234799 1233481 1231207 1227582 1222487 1216157 1208727
53387 1208727 1200016 1189922 1178844 1167491 1156286 1145093 1133598 1121846 1110206 1098737 1086884
53376 1086884 1074078 1060530 1046958 1033598 1019984 1005891 991893 978649 966074 953744 941784
53365 941784 930881 921553 913832 907502 902264 897824 894189 891669 890240 889206 887981 886960 887015 888343
53351H88343K139K845L943N007N369N409O103P557Q907R657J0237J1201J2499
53338I79216J3800J4956J6020J7140J8537K0245K1836K2787K3178K3720K4922
53327A196357K6548K7901K8570K8815K9310L0502L2115L3422L4013L4073L3882
53316A535508L3471L2980L2854L3199L3330L2546L1146L0088K9676K9164K7698
53305A881660K5188K2109J8948J5985J3332J0874Q434O044L851J677j011m486
53293B002605q285j1615j4155j6279j8483k0791k2835k4433k5816k7244k8610
53282A784059k9603l0086l0076k9538k8531k7478k6864k6612k6196k5438k4734
53271A478903k4429k4407k4466k4622k4736k4347k3269k2025k1221k0718j9829
$$ plain form
53351 888343 890482 893327 897270 902277 907646 913055 919158 926715 935622 945279 955516 966717 979216
53338 979216 993016 1007972 1023992 1041132 1059669 1079914 1101750 1124537 1147715 1171435 1196357
53327 1196357 1222905 1250806 1279376 1308191 1337501 1368003 1400118 1433540 1467553 1501626 1535508
53316 1535508 1568979 1601959 1634813 1668012 1701342 1733888 1765034 1795122 1824798 1853962 1881660
53305 1881660 1906848 1928957 1947905 1963890 1977222 1988096 1996530 2002574 2006425 2008102 2007091 2002605
53293 2002605 1994320 1982705 1968550 1952271 1933788 1912997 1890162 1865729 1839913 1812669 1784059
53282 1784059 1754456 1724370 1694294 1664756 1636225 1608747 1581883 1555271 1529075 1503637 1478903
53271 1478903 1454474 1430067 1405601 1380979 1356243 1331896 1308627 1286602 1265381 1244663 1224834
53260A224834j8199j6179j4377j3096j2115j0931r429q312q445r585j0405j0059
53248A083702r225r075r651r984r520q699q157p947p709p139o159m899l604k397
53234I79537j178J19J349K328L037L467L596L741M546O272Q394J0190J1451J2286
53220A049135J2680J2735J2956J3654J4395J4556J4265J4081J4043J3751J3169
53209A199420J2602J1915J0606Q746P121O188N534M619L452K288J121j54j450
53196A272008k615l683m765n991p510r343j1166j2559j3512j4309j4986j5279
53184A156290j5164j4991j5012j5147j5285j5402j5298j4740j3988j3628j3741
53173I93894j3704j3145j2567j2606j3030j3032j2286j1277j0642j0562j0810
$$ plain form
53260 1224834 1206635 1190456 1176079 1162983 1150868 1139937 1130508 1122196 1113751 1104166 1093761 1083702
53248 1083702 1074477 1065402 1055751 1045767 1036247 1027548 1019391 1011444 1003735 996596 990437 985538 981934 979537
53234 979537 978359 978478 979827 982155 985192 988659 992255 995996 1000542 1006814 1015208 1025398 1036849 1049135
53220 1049135 1061815 1074550 1087506 1101160 1115555 1130111 1144376 1158457 1172500 1186251 1199420
53209 1199420 1212022 1223937 1234543 1243289 1250410 1256598 1262132 1266751 1270203 1272491 1273612 1273458 1272008
53196 1272008 1269393 1265710 1260945 1254954 1247444 1238101 1226935 1214376 1200864 1186555 1171569 1156290
53184 1156290 1141126 1126135 1111123 1095976 1080691 1065289 1049991 1035251 1021263 1007635 993894
53173 993894 980190 967045 954478 941872 928842 915810 903524 892247 881605 871043 860233
53162H60233j1076j1084j0614r595q240o997o246n953n725n303m891m817n064
53149G64628n324n402n327n187n243n940p404q954r686r581r530j0070j0667j0562
53135F55751r864r303r176r100q748q357q362q872r621j0261j0527j0288r742
53122E33530r466r946j0928j1498j1066j0086r464r463r588r448r191q960q540
53109D05886p839p224p022p008o834o540o332o196o146o498p331q035p949p204
53095C07728o430n877n428n207n449n844n725m912l871l043k576k557k898l071
53081B44840k619j876j516j515j382j254j763k652k733j615n13o54j687k391k312
53066B18358j903j531j139o72j20P09J794K404J721M8j162p55Q83K283K381J413
$$ plain form
53162 860233 849157 838073 827459 817864 809624 802627 796381 790428 784703 779400 774509 769692 764628
53149 764628 759304 753902 748575 743388 738145 732205 724801 715847 706161 696580 687050 676980 666313 655751
53135 655751 645887 636584 627408 618308 609560 601203 592841 583969 574348 564087 553560 543272 533530
53122 533530 524064 514118 503190 491692 480626 470540 461076 451613 442025 432577 423386 414426 405886
53109 405886 398047 390823 383801 376793 369959 363419 357087 350891 344745 338247 330916 322881 314932 307728
53095 307728 301298 295421 289993 284786 279337 273493 267768 262856 258985 255942 253366 250809 247911 244840
53081 244840 242221 240345 238829 237314 235932 234678 232915 230263 227530 225915 225402 224748 223061 220670 218358
53066 218358 216455 214924 213785 213113 212993 213702 215496 217900 219621 219669 218507 217752 218635 220918 223299 224712
53050B24712M33J06J76R1j57j94m5k92j247k439l122l086k718k423k232k023j910
53033B03630k365l672n293o115n584m358l471l146k932k677k655k803k628j997
53019A53934j393j224j385j700k147k555k583k261k004j925j690j195q16p45o84
53004A29627m83m39o73q33p16n59m46q4M49M97j49p61p66n94p50q27l16K53L6
52985A22466p19j082r52j065j557j725j347j106j338j359o22J63o2j130j726j089
52969A05750J2L28k62o39M8J247J748J204L66j06l41n89o54m42m17q85j271q69
52951A04228j8K74j59l66L67J560K201J914J089K37m29p84n67L99J729K440J792
52934A15907K02j008r07K08J353J816J424M36m75n45L36J415J955J955J736J387
$$ plain form
53050 224712 225145 225251 225427 225518 225361 225167 225122 224830 223583 221144 218022 214936 212218 209795 207563 205540 203630
53033 203630 201265 197593 192300 186185 180601 176243 172772 169626 166694 164017 161362 158559 155931 153934
53019 153934 152541 151317 149932 148232 146085 143530 140947 138686 136682 134757 133067 131872 131056 130311 129627
53004 129627 129144 128705 128032 127199 126483 125924 125478 125394 125843 126340 126191 125430 124664 124070 123320 122493 122177 122430 122466
52985 122466 121747 120665 119713 118648 117091 115366 114019 112913 111575 110216 109594 109757 109695 108565 106839 105750
52969 105750 105762 106090 105828 105189 105237 106484 108232 109436 109802 109696 109355 108766 108112 107670 107253 106368 105097 104228
52951 104228 104210 104484 104325 103959 104326 105886 108087 110001 111090 111327 110898 110114 109547 109946 111675 114115 115907
52934 115907 116109 115101 114194 114402 115755 117571 118995 119431 118956 118411 118747 120162 122117 124072 125808 127195
52918A27195J023J041J449J524Q48K16N66J476J770J393J458K321K958K576J790
52903A49604J590K035K602L116L638L933L671K896J803M63q48j558j528j450j902
52888A68065k398k150j379j043j337j351m85N28N18o56j992k571k412k084j870
52873A47383j485o34L62P74L22l88n31q8J81j92p06o17LL60O2l66k74J78K95j80
52853A44459p42q23l92K20P42J045J033P52M45K88J12l09p63o81J63J200J583
52836A48332J138N95O91J216J283N57k08j87L74N57J21j55L59J246J596J089K67
52819A58871q0L76J197J510Q94J0q6P20J394J145M08R6L92P65Q64P69O10M74N43
52800A70872R00J306J539J725J967J911J249M67M58J396K517L031K812K193J548
$$ plain form
52918 127195 128218 129259 130708 132232 133080 133296 133862 135338 137108 138501 139959 142280 145238 147814 149604
52903 149604 151194 153229 155831 158947 162585 166518 170189 173085 174888 175351 174503 172945 171417 169967 168065
52888 168065 165667 163517 162138 161095 159758 158407 157922 158450 158968 158312 156320 153749 151337 149253 147383
52873 147383 145898 145264 145626 146400 146722 146334 145803 145715 145896 145704 144998 144381 144384 144744 144806 144440 144166 144344 144639 144459
52853 144459 143717 142894 142502 142722 143464 144509 145542 146294 146739 147027 147139 146830 146067 145386 145549 146749 148332
52836 148332 149470 150065 150756 151972 153255 153812 153604 153417 153791 154348 154469 154314 154673 155919 157515 158604 158871
52819 158871 158791 159167 160364 161874 162768 162778 162692 163412 164806 165951 166359 166455 166847 167612 168476 169245 169855 170329 170872
52800 170872 171772 173078 174617 176342 178309 180220 181469 181936 182394 183790 186307 189338 192150 194343 195891
52785A95891J218J425K047K756L375L916M295M334M012L426K561J433L20m83j096
52770B29430j786k437k721k775l079l630l844l500l119l141l229k872k227j791
52756A89279j598j298r56j078j778k481k711k687k800k835k326j520j298j885
52742A62028k341j811p47k33m24n41l35m85j324k121k205j968k064k229j796r52
52726A40452n36p91j121j103r09p62o54o98j103j632j770j493j344j514j515j025
52710A22482n04n18q58q28k20M11M62m6n77p59p28q13r68q48m55l05p56j475j915
52691A10782k011k044k112k175k310k416j962o41Q59J367N54p55j555j475p62
52676I3344n1r6j034j979j931j092n73p79r81o83m89j052j933k157j540q18n96
$$ plain form
52785 195891 197109 198534 200581 203337 206712 210628 214923 219257 223269 226695 229256 230689 231009 230526 229430
52770 229430 227644 225207 222486 219711 216632 213002 209158 205658 202539 199398 196169 193297 191070 189279
52756 189279 187681 186383 185427 184349 182571 180090 177379 174692 171892 169057 166731 165211 163913 162028
52742 162028 159687 157876 157129 156896 156472 155931 155596 155111 153787 151666 149461 147493 145429 143200 141404 140452
52726 140452 139916 139125 138004 136901 135992 135230 134576 133878 132775 131143 129373 127880 126536 125022 123507 122482
52710 122482 121978 121460 120602 119774 119554 119965 120427 120381 119804 119045 118317 117504 116536 115688 115233 114928 114172 112697 110782
52691 110782 108771 106727 104615 102440 100130 97714 95752 95111 95970 97337 97891 97136 95581 94106 93344
52676 93344 93293 93197 92163 90184 88253 87161 86588 85809 84828 84145 83656 82604 80671 78514 76974 76156 75560
52659G5560p24o84k38M04Q47R20P88O71N56L63J62P8P1J54N11J083J302P65J6
52640H2605M2J037K228K865K880K572K235K102K114J853J166O45Q67J401J371
52625A07983P84L19m4j029k592l629l503k729j893r58j06p6r62j727j649j359
52609H6830j686k360k692k672k514j886o65K70Q4o61q02l20j87p48j331j352r04
52592F6404k88K18K14m50j180j212n83L6K64K12mk52k00J57J41o00j142l72J256
52573F2619K177J826J178J112J393J541J587J580J199M30j32j39k4l15r05j413
52557G3714j637j422o86J10J69n80j176q67o1M00L16K3k72m41k38K47L42k84p88
52538F6869j26J380K253J696M27m42o20m27o8M00P39P73P19R02J213J265J033
$$ plain form
52659 75560 74836 74152 73914 74318 75165 76085 76873 77544 78100 78463 78625 78703 78774 78928 79439 80522 81824 82589 82605
52640 82605 82647 83684 85912 88777 91657 94229 96464 98566 100680 102533 103699 104344 105211 106612 107983
52625 107983 108767 109086 109042 108013 105421 101792 98289 95560 93667 92709 92603 92527 91565 89838 88189 86830
52609 86830 85144 82784 80092 77420 74906 73020 72355 72625 72709 72048 71246 70926 70739 69991 68660 67308 66404
52592 66404 66116 66334 66548 66098 64918 63706 63123 63159 63423 63635 63631 63379 63179 63336 63477 62877 61735 61363 62619
52573 62619 64796 66622 67800 68912 70305 71846 73433 75013 76212 76642 76510 76371 76347 76032 75127 73714
52557 73714 72077 70655 69969 70079 70248 69668 68492 67625 67564 67964 68280 68303 68031 67590 67352 67599 67941 67657 66869
52538 66869 66743 68123 70376 72072 72499 72057 71437 71010 70942 71342 72081 72854 73573 74475 75688 76953 77986
52521G7986R28J155J370J154N71J17K27R25J779K100J467K45o37o17LO28J039
52504I0440J205R13K37n1O79J764J881Q84N1K53Q61R50O88P27R53Q22M67N20R94
52485A05238J251J010N98K39j25k70K44J244J855J591R95Q91J371J838J799J299
52469A21068P49M85N07N75O09P76J065J074N44r3j78K56N72M21N7k25m97q27j023
52450A25915q89m47J75P97J075P48O9l78l98l47m34l75N8N22N23J02j86M5O18
52431A27193J013Q92M21Q6J60M10M70K87M7k09n04o15k69L53O88N20K37K82O43
52412A32105J036J274J337J201Q57L30k19m25R9J214K099K043J268N70L17L00
52396A45406M46R27J452J250J71p91o29M06J146R56L22Q7N05J099J236P59J37
$$ plain form
52521 77986 78914 80069 81439 82593 83164 83281 83508 84433 86212 88312 89779 90024 89387 88770 88773 89401 90440
52504 90440 91645 92558 92795 92744 93423 95187 97068 97952 98003 98256 99117 100067 100755 101482 102435 103257 103724 104244 105238
52485 105238 106489 107499 108097 108336 108211 107941 108185 109429 111284 112875 113870 114761 116132 117970 119769 121068
52469 121068 121817 122302 122809 123384 123993 124769 125834 126908 127452 127359 127181 127437 128009 128430 128487 128262 127765 126938 125915
52450 125915 125026 124579 124754 125551 126626 127374 127443 127065 126667 126320 125886 125511 125569 126091 126614 126716 126530 126575 127193
52431 127193 128206 129098 129519 129605 129765 130175 130645 130932 130979 130770 130266 129651 129382 129735 130423 130943 131180 131462 132105
52412 132105 133141 134415 135752 136953 137810 138140 137921 137496 137595 138809 140908 142951 144219 144789 145106 145406
52396 145406 145852 146779 148231 149481 149652 148861 148232 148638 149784 150740 151062 151149 151654 152753 153989 154748 154885
52379A54885k8L80R15J120R51O97O44Q53J090J018O56N23R61J475J282M99J16
52362A68037N85J153R98M25L27Q42J271J230J168J592K270K438J614Q2j268j601
52346A81163q35K65P78M28l82j146j593j602j170n77k83m33o26l87K71R26J211
52329A76008R87K16r60j946j992j050K4M88N94R89J490J297L18m93m89j38n4j1
52311A75278L92P24L10n44r11o09k51J7O93J721K189J738J279J635K285K259J668
52294A89873J431J775K049J958K038K603L069K824K216K079K513K734K211J384
52280B20757J046J409K057K598K924K983K748K492K621L106L435L331L058K824
52266B57389K382J632J140J468K308K902L102L355L772L925L643L330L403L836
$$ plain form
52379 154885 154857 155237 156152 157272 158223 158920 159564 160417 161507 162525 163181 163704 164665 166140 167422 167921 168037
52362 168037 168622 169775 170773 171198 171525 172367 173638 174868 176036 177628 179898 182336 183950 184032 182764 181163
52346 181163 180328 180593 181371 181799 181417 180271 178678 177076 175906 175329 175046 174613 173987 173600 173871 174797 176008
52329 176008 176995 177211 176251 174305 172313 171263 171287 171775 172369 173358 174848 176145 176463 175970 175481 175343 175289 175278
52311 175278 175670 176394 176704 176160 175249 174640 174389 174406 175099 176820 179009 180747 182026 183661 185946 188205 189873
52294 189873 191304 193079 195128 197086 199124 201727 204796 207620 209836 211915 214428 217162 219373 220757
52280 220757 221803 223212 225269 227867 230791 233774 236522 239014 241635 244741 248176 251507 254565 257389
52266 257389 259771 261403 262543 264011 266319 269221 272323 275678 279450 283375 287018 290348 293751 297587
52252B97587M469N206N877O303O660P282P994Q157P576O903O846P427Q192Q871
52238C95350R459J0006J0520J0962J1196J1174J1199J1702J2662J3561J4005J4100
52226E35896J4153J4308J4554J4833J5012J4984J4781J4496J4189J4111J4640
52215F95957J5625J6129J5427J3997J2900J2413J2058J1643J1287J0587Q994P089
52203H44106O253O684O935N958M470L560L032K123J020N84R73J488J552J132M75
52188H90345lJ34P53J084P67M91J020K139L179M011M774N098M617L952M244N772
52172I32377P717R218J0004J0132R840R569R547R411Q811Q120P959Q183P988P021
52158A055897N721M626L839L076J906P3j934l064l006k904m043o160p901q652
$$ plain form
52252 297587 302056 307262 313139 319442 326102 333384 341378 349535 357111 364014 370860 378287 386479 395350
52238 395350 404809 414815 425335 436297 447493 458667 469866 481568 494230 507791 521796 535896
52226 535896 550049 564357 578911 593744 608756 623740 638521 653017 667206 681317 695957
52215 695957 711582 727711 743138 757135 770035 782448 794506 806149 817436 828023 837017 844106
52203 844106 850359 857043 863978 869936 874406 877966 880998 883121 884141 884725 885698 887186 888738 889870 890345
52188 890345 890342 890476 891229 892313 893080 893571 894591 896730 899909 903920 908694 913792 918409 922361 926605 932377
52172 932377 940094 949312 959316 969448 979288 988857 998404 1007815 1016626 1024746 1032705 1040888 1048876 1055897
52158 1055897 1061618 1066244 1070083 1073159 1075065 1075138 1073204 1070140 1067134 1064230 1060187 1054027 1046126 1037474
52144A037474q942r250r487r704j0237j0884j0923j0273r845j0295j1096j1320
52132I15218j0727r743q821q166p716p132o201n343n212n613n446m091k333j465
52118H27209j802k543k824k584k406k789l556m003l674k928k461k462k531k417
52104G88229k290k319k424k505k594k633k501k281k198k283k453k809l418l860
52090G51661l559k658j943j841j958j817j469j109n96J95Q70Q15j06j416k506
52075G32563l139l425l438l034k189j464j637k670l527l384k598k048j987k158
52061F95865k523l091l389k980k292k030j965j312j33P40J153J733K491K589J914
52046F86770J638K573L984M735M752M755N322O726Q894J0954J1727J1337J1439
$$ plain form
52144 1037474 1028532 1019282 1009795 1000091 989854 978970 968047 957774 947929 937634 926538 915218
52132 915218 904491 894748 885927 877761 870045 862913 856712 851369 846157 840544 835098 831007 828674 827209
52118 827209 825407 822864 820040 817456 815050 812261 808705 804702 801028 798100 795639 793177 790646 788229
52104 788229 785939 783620 781196 778691 776097 773464 770963 768682 766484 764201 761748 758939 755521 751661
52090 751661 748102 745444 743501 741660 739702 737885 736416 735307 734711 734906 735776 736591 736485 735069 732563
52075 732563 729424 725999 722561 719527 717338 715874 714237 711567 708040 704656 702058 700010 698023 695865
52061 695865 693342 690251 686862 683882 681590 679560 677595 676283 676150 676890 678043 679776 682267 684856 686770
52046 686770 688408 690981 694965 699700 704452 709207 714529 721255 730149 741103 752830 764167 775606
52033G75606J3070J5186J6233J6301J6654J7740J8862J9490J9772J9891J9828
52022I68633J9642J9316J8528J7229J6043J5483J5116J4295J3187J2220J1030
52011A140722R052O801N373M822M198L063J827N82j127l103m366m598m689n351
51997A153206o138o438o523o944p543p807p638p195o445n459m759m701m791m263
51983A066562l116k023j344p96r9N32P09N08N58J436K894L943L931L437L577M502
51967A085211N171M773L679K717K102J622J289J210J088N48k76r84j547k189k825
51952A101589l317m087n678p705r025r281r525j0817j2825j4405j5184j5851j7003
51939I66886j8352j9244j9428j9129j8730j8672j9317k0574k1754k2165k1782
$$ plain form
52033 775606 788676 803862 820095 836396 853050 870790 889652 909142 928914 948805 968633
52022 968633 988275 1007591 1026119 1043348 1059391 1074874 1089990 1104285 1117472 1129692 1140722
52011 1140722 1149774 1156575 1161948 1166770 1170968 1174031 1175858 1176440 1175313 1172210 1167844 1163246 1158557 1153206
51997 1153206 1147068 1140630 1134107 1127163 1119620 1111813 1104175 1096980 1090535 1085076 1080317 1075616 1070825 1066562
51983 1066562 1063446 1061423 1060079 1059283 1059184 1059716 1060425 1060933 1061491 1062927 1065821 1069764 1073695 1077132 1080709 1085211
51967 1085211 1090382 1095155 1098834 1101551 1103653 1105275 1106564 1107774 1108862 1109410 1109134 1108150 1106603 1104414 1101589
51952 1101589 1098272 1094185 1088507 1080802 1071777 1062496 1052971 1042154 1029329 1014924 999740 983889 966886
51939 966886 948534 929290 909862 890733 872003 853331 834014 813440 791686 769521 747739
51928G47739k1130k0575k0042j9426j8919j8681j8502j8088j7583j7455j7849
51917E39489j8276j8057j6946j5265j3610j2477j2010j1964j1944j1791j1674
51906C85475j1723j1682j1141j0024q731p699p074o801o877p263p649p611p042
51893B74158o277n649n141m552l872l299l012l072l425l845l948l554k991k725
51879B18796k770k728k425k098j966j878j679j533j651j870j813j352p37l90n66
51864A93340j137j597j539j168j024j094p58J72R24P67O2l35l69o65j392k101
51848A82086k633l288l894l687k556j532j441j729j380m85Ok11m76l74l67r57
51832A57082j778k034j495p43n17r83j626j813j505j224j239j104l64N23O69N3
$$ plain form
51928 747739 726609 706034 685992 666566 647647 628966 610464 592376 574793 557338 539489
51917 539489 521213 503156 486210 470945 457335 444858 432848 420884 408940 397149 385475
51906 385475 373752 362070 350929 340905 332174 324475 317401 310600 303723 296460 288811 281200 274158
51893 274158 267881 262232 257091 252539 248667 245368 242356 239284 235859 232014 228066 224512 221521 218796
51879 218796 216026 213298 210873 208775 206809 204931 203252 201719 200068 198198 196385 195033 194296 193906 193340
51864 193340 192203 190606 189067 187899 186875 185781 185023 185195 186119 186886 186948 186613 186244 185579 184187 182086
51848 182086 179453 176165 172271 168584 166028 164496 163055 161326 159946 159461 159467 159256 158780 158406 158039 157082
51832 157082 155304 153270 151775 151032 150515 149532 147906 146093 144588 143364 142125 141021 140657 141180 141849 141902
51816A41902l49P0P42Q58M53O1k60p81j297j256o78k89n66j127j300q57m2P76
51798A36060J273J278R54O85O28O54P45J069J495J445O07m77r16l92O85J744K347
51781A49884K203J340L75P0N43J151J330J224J313J603J542P71k53o07Q7J129
51765A63705J433O96l81j022j146j084j001q77p73o97m42K9K60j24o90o23J45
51748A57408P90O73m1q67j510j638q99M44J362J191N26L97Q32R02J45p71j044
51731A57900p99o98q43o32K69J286J518P54l81j207j540j467r82r2R04J584J756
51714A57330J453P24k36r72j130q66n66k73J65N41M27p7l19L8O01Q98R36Q58O04
51695A60136K42J50M84P87O37L03L17O93J052J323J742K287K616K618K569K655
$$ plain form
51816 141902 141553 141623 142365 143223 143676 143737 143477 142696 141399 140143 139465 139176 138610 137483 136183 135326 135284 136060
51798 136060 137333 138611 139565 140250 140878 141532 142277 143346 144841 146286 146893 146416 145500 145108 145793 147537 149884
51781 149884 152087 153427 153802 153872 154415 155566 156896 158120 159433 161036 162578 163349 163096 162489 162576 163705
51765 163705 165138 165834 165453 164431 163285 162201 161200 160323 159550 158853 158411 158440 158700 158576 157886 157263 157408
51748 157408 158198 158871 158830 157963 156453 154815 153916 154360 155722 156913 157439 157836 158668 159570 159715 158944 157900
51731 157900 157101 156403 155560 154928 155197 156483 158001 158755 158374 157167 155627 154160 153178 153086 153990 155574 157330
51714 157330 158783 159507 159271 158299 157169 156303 155737 155464 155629 156170 156597 156520 156201 156239 156840 157738 158674 159532 160136
51695 160136 160378 160528 161012 161799 162436 162739 163056 163749 164801 166124 167866 170153 172769 175387 177956 180611
51679A80611K749K722K712K963L555M286M756M635M087L775M224N252O266O925
51665B39518P247P273P031O780O870P257P398O799N490L955K716J921J257L14
51651C11826q47j661j843j868k365l229l753l553k916k315j978j991k275k413
51637B78819j947j016l71m05n94j28J032K149K537K187J523Q99M38K75O74J744
51621B87816L057L830L663K984K555K637K814K640K120J510Q98J20r64k166k968
51606C10546k862j832m48O24J129J126O40k01p78l05J221K712L081K476K033K372
51590C21534K854K489J241r2j023j801k638l184l183l055l214l305k877k478l098
51575B98170m547n492n288m767m779m989m833m632m858n009m344l247k691k734
$$ plain form
51679 180611 183360 186082 188794 191757 195312 199598 204354 208989 213076 216851 221075 226327 232593 239518
51665 239518 246765 254038 261069 267849 274719 281976 289374 296173 301663 305618 308334 310255 311512 311826
51651 311826 310979 309318 307475 305607 303242 300013 296260 292707 289791 287476 285498 283507 281232 278819
51637 278819 276872 275856 275485 275080 274486 274358 275390 277539 280076 282263 283786 284685 285123 285398 286072 287816
51621 287816 290873 294703 298366 301350 303905 306542 309356 311996 314116 315626 316524 316644 315680 313514 310546
51606 310546 307684 305852 305404 306028 307157 308283 308923 308722 307944 307639 308860 311572 314653 317129 319162 321534
51590 321534 324388 326877 328118 328026 327003 325202 322564 319380 316197 313142 309928 306623 303746 301268 298170
51575 298170 293623 288131 282843 278076 273297 268308 263475 258843 253985 248976 244632 241385 238694 235960
51561B35960k619k219k156k493k504j978j591j711j797j478j283j695k243k217
51547B07976j737j402j355j266r84o29l33k70p03j525k099j906j207o19l40j28
51531A91473K01N74Q54Q35K92o45j314j115j59R08J614J959K174K424K692K808
51515B05575K710K723L195L837L898L228K631K772L226L142K500K023K105K406
51501B45971K417J871O93r03k309k927k761k267j778j489j682k416l066k905k090
51486B24359j381r14j13J054J733J525J278J803K564K609K212K510L670M583M551
51471B52043M147M051L958L322K467K086K137K043J693J363Q61k89j706k250j606
51456B74320q76j040j646j663r92k72L19J063J710J601Q27K96M44O34K65l11m68
$$ plain form
51561 235960 233341 231122 228966 226473 223969 221991 220400 218689 216892 215414 214131 212436 210193 207976
51547 207976 206239 204837 203482 202216 201232 200603 200270 200000 199297 197772 195673 193767 192560 191941 191601 191473
51531 191473 191674 192248 193102 193937 194229 193584 192270 191155 190996 191904 193518 195477 197651 200075 202767 205575
51515 205575 208285 211008 214203 218040 221938 225166 227797 230569 233795 236937 239437 241460 243565 245971
51501 245971 248388 250259 250952 250049 247740 244813 242052 239785 238007 236518 234836 232420 229354 226449 224359
51486 224359 222978 222064 221951 223005 224738 226263 227541 229344 231908 234517 236729 239239 242909 247492 252043
51471 252043 256190 260241 264199 267521 269988 272074 274211 276254 277947 279310 280171 279882 278176 275926 274320
51456 274320 273444 272404 270758 269095 268103 267831 268150 269213 270923 272524 273351 273647 274091 274725 274990 274679 274211
51439B74211l06l91q46j268j380j343j463j879k436k762k617k256k170k452k740
51424B47902k842k975l181l097k563j989j701j427q93m29l93l97J79J146J679
51409B29019J495J098R90J152J433J787K081K186K389L169M387N219N122M461
51395B65988L942L810L869L936L967L951L961M169M589M974N051M785M307L781
51381C25080L434L377L345K890K009J240Q99O05j07r64j257q46l46k03j13L82
51365C39425J114J484J308J053J234J844K457K623K085R61j37m55O2M96l8j267
51349C54249k119k214k314l039l864l907l303k981l291l575l275k696k401k314
51335C12956j991j505j501k261l218l568l168k524k029j563r45m17l12m45l15
$$ plain form
51439 274211 273905 273514 272668 271400 270020 268677 267214 265335 262899 260137 257520 255264 253094 250642 247902
51424 247902 245060 242085 238904 235807 233244 231255 229554 228127 227234 226805 226412 226015 226194 227340 229019
51409 229019 230514 231612 232602 233754 235187 236974 239055 241241 243630 246799 251186 256405 261527 265988
51395 265988 269930 273740 277609 281545 285512 289463 293424 297593 302182 307156 312207 316992 321299 325080
51381 325080 328514 331891 335236 338126 340135 341375 342274 342879 342772 341808 340551 339705 339359 339156 339043 339425
51365 339425 340539 342023 343331 344384 345618 347462 349919 352542 354627 355588 355451 354996 355058 355554 355516 354249
51349 354249 352130 349916 347602 344563 340699 336792 333489 330508 327217 323642 320367 317671 315270 312956
51335 312956 310965 309460 307959 305698 302480 298912 295744 293220 291191 289628 288683 288266 287954 287509 287194
51320B87194J10L07O8n7M45J176J242L86p51j465j706j949k644l821n028n660
51304B67847n606n415n571n825n610n021m777n173n662n646n229m873m728m623
51290A94088m395l945l161k152j350j085j225j523k014k696l040k448j214m91
51276A63349r66j959k252j541o61l64m77m43k81m75j061j425j172p38p69j140
51260A47625j129m25M95J045J208J267J242R46M89L23P05J321J614J419J062Q44
51244A60051O67L97M07J305L017M531M963M536M092L827L187K027J200J507K499
51229A98213K855J907L69o11p87r90j936l218l794l362k808k978l529l531k953
51214A72847k710l225l769l605l089k994l338l508l279k948k631k125j523j296
$$ plain form
51320 287194 287304 287611 287679 287622 288067 289243 290485 290871 290120 288655 286949 285000 282356 278535 273507 267847
51304 267847 262241 256826 251255 245430 239820 234799 230022 224849 219187 213541 208312 203439 198711 194088
51290 194088 189693 185748 182587 180435 179085 178000 176775 175252 173238 170542 167502 165054 163840 163349
51276 163349 162383 160424 158172 156631 155970 155606 155129 154686 154405 153930 152869 151444 150272 149534 148765 147625
51260 147625 146496 146071 146566 147611 148819 150086 151328 152274 152763 153086 153791 155112 156726 158145 159207 160051
51244 160051 160718 161115 161522 162827 165844 170375 175338 179874 183966 187793 190980 193007 194207 195714 198213
51229 198213 201068 202975 203344 202733 201946 200956 199020 195802 192008 188646 185838 182860 179331 175800 172847
51214 172847 170137 166912 163143 159538 156449 153455 150117 146609 143330 140382 137751 135626 134103 132807
51200A32807j604k063k355k540k571k087j042j16N4l17n40m19l14l62k73J30O60
51183A17048J151J647J972J622M65p28r40k7J189J896J980J724J224M74k31m25
51167A30041p7K42Kn78p87l41K60M63L67M17N75L72k36o25l96Ln2m00m13j8K71
51146A29090K78M45R75J345J049L27k49n54p93r14o70j58K88O03R91J353J289
51129A34695P76L20K03K0o47j411j451o30K13K25n05j175j269j048j047j358j568
51112A24343j300o56j43j92p37j190r61j23N37L88k77o35m31k06l26l96L2O50
51094A18377Q65P06O82Q69Q85O93O96Q44M21q46k087k299j653j105j015q90m28
51077A14715n8j54l85l02r3k40o50p47l32J50L03K77L56M98N45O00P83Q34L97
$$ plain form
51200 132807 131203 129140 126785 124245 121674 119587 118545 118429 118483 118166 117626 117207 116893 116531 116258 116388 117048
51183 117048 118199 119846 121818 123440 123905 123177 122237 122210 123399 125295 127275 128999 130223 130697 130466 130041
51167 130041 129964 130206 130208 129630 128843 128502 128762 129225 129592 130009 130584 130956 130720 130095 129699 129702 129650 129250 128837 128819 129090
51146 129090 129368 129813 130788 132133 133182 133509 133260 132706 131913 130999 130329 130171 130459 131062 132053 133406 134695
51129 134695 135471 135791 135994 136014 135367 133956 132505 131875 132088 132313 131808 130633 129364 128316 127269 125911 124343
51112 124343 123043 122387 122244 122052 121315 120125 119164 119041 119578 119966 119689 119054 118623 118417 118091 117695 117727 118377
51094 118377 119242 119948 120630 121499 122384 123077 123773 124617 125038 124192 122105 119806 118153 117048 116033 115143 114715
51077 114715 114657 114503 114118 113816 113723 113483 112833 112086 111754 111904 112207 112484 112840 113338 113883 114483 115266 116100 116497
51058A16497l89r21q15k09N41J170J460J327J100J319K050K712K796K447K042
51043A33127J588R54M11L39N27L47k61n75j13N48M92k69p37k02Q71J453J163N49
51025A40212K14J38j8k12n6N55J196J414J190Q14N08K89N8k63n47m84K3N04L86
51006A45921j74l63J98Q67Q55K58k28l05k49k20j3M38P92P32L88J48K13M73O69
50987A50400O60M70J68k21n53m65K30J096J437J259J321K021K760K780K160J468
50971A66991R64P13J076K172L188L127K192J590J865K288K093J474R88O90L48
50956A91759O1J48O83J442K058K111J459O59O16J526K545K845K528K195K086K118
50940B16839K415L170M088M572M504M406M660N005N024M916N403O752Q224Q827
$$ plain form
51058 116497 116108 115187 114372 114163 114704 115874 117334 118661 119761 121080 123130 125842 128638 131085 133127
51043 133127 134715 135669 136080 136419 136946 137293 137032 136457 136344 136892 137384 137115 136378 136176 137047 138500 139663 140212
51025 140212 140426 140564 140546 140334 140278 140833 142029 143443 144633 145447 145955 146244 146302 146039 145492 145008 145031 145535 145921
51006 145921 145747 145384 145582 146449 147304 147562 147334 147029 146780 146560 146547 146985 147777 148509 148897 149045 149258 149731 150400
50987 150400 151060 151530 151698 151477 150924 150459 150689 151785 153222 154481 155802 157823 160583 163363 165523 166991
50971 166991 167955 168668 169744 171916 175104 178231 180423 182013 183878 186166 188259 189733 190721 191411 191759
50956 191759 191820 191968 192651 194093 196151 198262 199721 200380 200996 202522 205067 207912 210440 212635 214721 216839
50940 216839 219254 222424 226512 231084 235588 239994 244654 249659 254683 259599 265002 271754 279978 288805
50926B88805Q588Q564R429J0599J1182J1341J2022J3445J4755J5251J5294J5751
50914D35026J7129J9486K2588K5739K7995K9125L0020L1716L4283L7019L9510
50903G49636M1936M4527M7146M9470N1323N2776N3998N5002N5393N4629N2529
50892A308365M9465M5946M2220L8218L3692K8417K2509J6541J1014N827O47m275
50880A598586q254j1067j3062j4328j4581j4092j3870j4457j5275j5717j6143
50869A447740j7210j8734k0114k1402k3199k5675k8468l1361l4408l7478m0208
50858A149483m2351m3749m4160m3530m2275m0814l9100l7051l5049l3407l1668
50847G16329k9167k6131k3420k1293j9200j6849j4677j3081j1854j0618r331q083
$$ plain form
50926 288805 297393 305957 315386 325985 337167 348508 360530 373975 388730 403981 419275 435026
50914 435026 452155 471641 494229 519968 547963 577088 607108 638824 673107 710126 749636
50903 749636 791572 836099 883245 932715 984038 1036814 1090812 1145814 1201207 1255836 1308365
50892 1308365 1357830 1403776 1445996 1484214 1517906 1546323 1568832 1585373 1596387 1602214 1602861 1598586
50880 1598586 1590332 1579265 1566203 1551875 1537294 1523202 1509332 1494875 1479600 1463883 1447740
50869 1447740 1430530 1411796 1391682 1370280 1347081 1321406 1292938 1261577 1227169 1189691 1149483
50858 1149483 1107132 1063383 1019223 975693 933418 892604 853504 816453 781404 747997 716329
50847 716329 687162 661031 637611 616318 597118 580269 565592 552511 540657 530039 520708 512625
50835E12625o887n805m887l886k419o25Q15J464J595J753K149K717L384M128M905
50820E11026N663O288O623O767P205Q247R479J0221J0516J1068J2225J3570J4696
50807F33594J5779J7120J8613K0064K1601K3395K5287K7136K9280L2138L5484
50796H99491L8615M1363M4481M8821N4294N9984O5177P0044P5276Q1326Q8129
50785A567001R5311J02305J08388J13136J16806J19902J22230J22873J21301J17885
50775B707138J12984J06031R6195Q3607O9334N4283L8809K3295Q512m774j6149
50764C279265k5428l2536l7528m0465m1270l9994l7165l3600l0038k7141k5652
50753B908448k6145k8726l3247l9519m7026n4747o1889o8571p5328q2150q8501
$$ plain form
50835 512625 505738 499933 495046 491160 488741 488116 488931 490395 491990 493743 495892 498609 501993 506121 511026
50820 511026 516689 522977 529600 536367 543572 551819 561298 571519 582035 593103 605328 618898 633594
50807 633594 649373 666493 685106 705170 726771 750166 775453 802589 831869 864007 899491
50796 899491 938106 979469 1023950 1072771 1127065 1187049 1252226 1322270 1397546 1478872 1567001
50785 1567001 1662312 1764617 1873005 1986141 2102947 2222849 2345079 2467952 2589253 2707138
50775 2707138 2820122 2926153 3022348 3105955 3175289 3229572 3268381 3291676 3300188 3295414 3279265
50764 3279265 3253837 3221301 3183773 3143308 3102038 3062044 3024879 2991279 2961241 2934100 2908448
50753 2908448 2882303 2853577 2820330 2780811 2733785 2679038 2617149 2548578 2473250 2391100 2302599
50742B302599r3900r7881r9782r9451r7839r5987r3621q9769q4668p9730p5431
50731A294540p0530o4038n6887n0849m6481m2929l9219l5084l0870k7246k4692
50720H05715k2822k0578j7453j4147j1661j0197r355q814q324p472o161m929m287
50707F59515l978l484k904k683k701k328j347k28O02J253K044L068M114M896N313
50692F61152N708O648Q272J0033J1319J2175J3087J4278J5649J7281J9524K2520
50680H17646K5828K8690L0613L1851L3359L6068L9989M4195M7800N0787N3754
50669A240580N7130O0893O4784O8518P1882P4799P7175P8538P8113P5484P1021
50658B018917O5345N8585N0399M0561K9330J7350N371o002j6415k5536l2776l7513
$$ plain form
50742 2302599 2208699 2110818 2011036 1911585 1813746 1717759 1624138 1534369 1449701 1369971 1294540
50731 1294540 1224010 1159972 1103085 1052236 1005755 962826 923607 888523 857653 830407 805715
50720 805715 782893 762315 744862 730715 719054 708857 699502 690688 682364 674892 668731 663802 659515
50707 659515 655537 652053 649149 646466 643765 641437 640090 639862 640464 641717 643761 646829 650943 655839 661152
50692 661152 666860 673508 681780 691813 703132 715307 728394 742672 758321 775602 795126 817646
50680 817646 843474 872164 902777 934628 967987 1004055 1044044 1088239 1136039 1186826 1240580
50669 1240580 1297710 1358603 1423387 1491905 1563787 1638586 1715761 1794299 1872412 1947896 2018917
50658 2018917 2084262 2142847 2193246 2233807 2263137 2280487 2285858 2279856 2263441 2237905 2205129 2167616
50646B167616l9727m0098l9379l7922l5829l3196l0053k6538k3206k0833j9839
$$ plain form
50646 2167616 2127889 2087791 2048412 2010490 1974661 1941465 1911412 1884874 1861668 1840835 1820996
$$ [...]
##END NTUPLES=NMR SPECTRUM
##END=
