
##TITLE=AC1171_Tolima-ibage-TiCOAH12008_7165207_nqq4PPrPGX
##JCAMPDX= 6.0         $$ Bruker NMR JCAMP-DX V2.0
##DATA TYPE= NMR SPECTRUM
##DATA CLASS= NTUPLES
##ORIGIN= BRUKER
##OWNER= Administrator
$$ 1.72 TOPSPIN		Version 2.1
$$ 2012-12-01 20:02:28.860 -0500  Administrator@X
$$ Compression mode = diff/dup
##.OBSERVE FREQUENCY= 400.02188249412
##.OBSERVE NUCLEUS= ^1H
##.ACQUISITION MODE= SIMULTANEOUS (DQD)
##.ACQUISITION SCHEME= undefined
##.AVERAGES= 8
##.DIGITISER RES= 22
##SPECTROMETER/DATA SYSTEM= spect
##.PULSE SEQUENCE= zg30
##.SOLVENT NAME= COFFEE_meoh
##.SHIFT REFERENCE= INTERNAL, COFFEE_meoh, 1, 14.98509
##AUDIT TRAIL= $$ (NUMBER, WHEN, WHO, WHERE, PROCESS, VERSION, WHAT)
$$ ##TITLE= Audit trail, TOPSPIN		Version 2.1
$$ ##JCAMPDX= 5.01
$$ ##ORIGIN= Bruker BioSpin GmbH
$$ ##OWNER= Administrator
$$ $$ E:\/data/COFFEE/nmr/AC1171_Tolima-ibage-TiCOAH12008_7165207_nqq4PPrPGX/10/pdata/1/auditp.txt
$$ ##AUDIT TRAIL=  $$ (NUMBER, WHEN, WHO, WHERE, PROCESS, VERSION, WHAT)
(   1,<2012-12-01 20:02:21.237 -0500>,<Administrator>,<X>,<go>,<TOPSPIN 2.1>,
      <created by zg
	started at 2012-12-01 20:01:19.797 -0500,
	POWCHK enabled, PULCHK disabled,
       configuration hash MD5:
       86 BA 57 50 F2 9D 5C 9B 26 00 A9 28 5F 66 2E 89
       data hash MD5: 64K
       A3 8A 0E 4B 8A DC 67 AB 0E 4B DB 89 85 37 66 E3>)
(   2,<2012-12-01 20:02:24.062 -0500>,<Administrator>,<X>,<proc1d>,<TOPSPIN 2.1>,
      <Start of raw data processing
       efp LB = 0 FT_mod = 6 PKNL = 1 PHC0 = 0 PHC1 = 0 SI = 32K 
       data hash MD5: 32K
       E3 87 3E 1D B0 74 14 F9 B4 A7 C4 11 53 3D 33 6E>)
(   3,<2012-12-01 20:02:24.481 -0500>,<Administrator>,<X>,<proc1d>,<TOPSPIN 2.1>,
      <pk PHC0 = 97.16309 PHC1 = 0 
       data hash MD5: 32K
       B9 A1 3B 17 D6 02 9C BE DD E3 50 D7 F1 3E F0 5B>)
(   4,<2012-12-01 20:02:24.719 -0500>,<Administrator>,<X>,<proc1d>,<TOPSPIN 2.1>,
      <abs ABSG = 1 
       data hash MD5: 32K
       3D E0 0A 2E FE 58 88 2B 44 C8 81 B4 B8 FD 92 03>)
(   5,<2012-12-01 20:02:24.859 -0500>,<Administrator>,<X>,<proc1d>,<TOPSPIN 2.1>,
      <abs ABSG = 2 
       data hash MD5: 32K
       6E BA 1F 14 77 88 6F 00 28 58 DF 24 F0 57 05 DC>)
(   6,<2012-12-01 20:02:24.999 -0500>,<Administrator>,<X>,<proc1d>,<TOPSPIN 2.1>,
      <abs ABSG = 3 
       data hash MD5: 32K
       56 77 FA FD 67 A6 ED 97 FF C7 7F E9 51 6B 02 A2>)
(   7,<2012-12-01 20:02:25.125 -0500>,<Administrator>,<X>,<proc1d>,<TOPSPIN 2.1>,
      <abs ABSG = 4 
       data hash MD5: 32K
       78 A2 50 85 A7 FB C4 E1 23 88 5F 2F 37 32 68 9B>)
(   8,<2012-12-01 20:02:25.264 -0500>,<Administrator>,<X>,<proc1d>,<TOPSPIN 2.1>,
      <abs ABSG = 5 
       data hash MD5: 32K
       7A 3E 77 15 48 4A 4B F4 BD 5D 8B 8E AC 1E EE 62>)
$$ ##END=
$$ 
$$ $$ hash MD5
$$ $$ CD DA 5B DB 04 9A A1 C5 A7 F9 CD 25 CB 3B AB 7E
##$RELAX= 
##$RELAX= 
##$RELAX= 
##$RELAX= 
##$RELAX= 
##$RELAX= 
##$RELAX= 
$$ Bruker specific parameters
$$ --------------------------
##$DU= <E:\>
##$EXPNO= 10
$$ [...]
150 150 150 150 150 150 150 150
##$TP07= 0
##$TPNAME0= <>
##$TPNAME1= <>
##$TPNAME2= <>
##$TPNAME3= <>
##$TPNAME4= <>
##$TPNAME5= <>
##$TPNAME6= <>
##$TPNAME7= <>
##$TPOAL= (0..7)
0.5 0.5 0.5 0.5 0.5 0.5 0.5 0.5
##$TPOFFS= (0..7)
0 0 0 0 0 0 0 0
##$TUNHIN= 0
##$TUNHOUT= 0
##$TUNXOUT= 0
##$USERA1= <user>
##$USERA2= <user>
##$USERA3= <user>
##$USERA4= <user>
##$USERA5= <user>
##$V9= 5
##$VALIST= <valist>
##$VCLIST= <CCCCCCCCCCCCCCC>
##$VD= 0
##$VDLIST= <DDDDDDDDDDDDDDD>
##$VPLIST= <PPPPPPPPPPPPPPP>
##$VTLIST= <TTTTTTTTTTTTTTT>
##$WBST= 1024
##$WBSW= 4
##$XGAIN= (0..3)
0 0 0 0
##$XL= 0
##$YL= 0
##$YMAX_a= 673381
##$YMIN_a= -572308
##$ZGOPTNS= <>
##$ZL1= 120
##$ZL2= 120
##$ZL3= 120
##$ZL4= 120
##$ABSF1= 14.98509
##$ABSF2= -5.573092
##$ABSG= 5
##$ABSL= 3
##$ALPHA= 0
##$AQORDER= 0
##$ASSFAC= 0
##$ASSFACI= 0
##$ASSFACX= 0
##$ASSWID= 0
##$AUNMP= <proc_prof1d_extract_pilot.lims>
##$AXLEFT= 0
##$AXNAME= <>
##$AXNUC= <1H>
##$AXRIGHT= 0
##$AXTYPE= 0
##$AXUNIT= <>
##$AZFE= 0.1
##$AZFW= 0.1
##$BCFW= 0
##$BC_mod= 0
##$BYTORDP= 0
##$COROFFS= 0
##$CY= 15
##$DATMOD= 1
##$DC= 0
##$DFILT= <>
##$DTYPP= 0
##$F1P= 0
##$F2P= 0
##$FCOR= 0.5
##$FTSIZE= 32768
##$FT_mod= 6
##$GAMMA= 0
##$GB= 0
##$INTBC= 1
##$INTSCL= 1
##$ISEN= 128
##$LB= 0
##$LEV0= 0
##$LPBIN= 0
##$MAXI= 10000
##$MC2= 0
##$MEAN= 0
##$ME_mod= 0
##$MI= 0
##$NCOEF= 0
##$NC_proc= -8
##$NLEV= 6
##$NOISF1= 0
##$NOISF2= 0
##$NSP= 0
##$NTH_PI= 0
##$NZP= 0
##$OFFSET= 14.98509
##$PC= 1
##$PHC0= 97.16309
##$PHC1= 0
##$PH_mod= 1
##$PKNL= yes
##$PPARMOD= 0
##$PPDIAG= 0
##$PPIPTYP= 0
##$PPMPNUM= 2147483647
##$PPRESOL= 1
##$PSCAL= 4
##$PSIGN= 0
##$PYNMP= <proc.py>
##$REVERSE= no
##$SF= 400.02
##$SI= 32768
##$SIGF1= 0
##$SIGF2= 0
##$SINO= 400
##$SIOLD= 32768
##$SPECTYP= <>
##$SREGLST= <1H.CDCl3>
##$SSB= 0
##$STSI= 32768
##$STSR= 0
##$SW_p= 8223.68421052631
##$SYMM= 0
##$S_DEV= 0
##$TDeff= 65536
##$TDoff= 0
##$TI= <>
##$TILT= no
##$TM1= 0
##$TM2= 0
##$TOPLEV= 0
##$USERP1= <user>
##$USERP2= <user>
##$USERP3= <user>
##$USERP4= <user>
##$USERP5= <user>
##$WDW= 1
##$XDIM= 32768
##$YMAX_p= 471550802
##$YMIN_p= -742572
##$CURPLOT= <Network HP LaserJet P1505>
##$CURPRIN= <$Network HP LaserJet P1505>
##$DFORMAT= <normdp>
##$LAYOUT= <+/1D_H.xwp>
##$LFORMAT= <normlp>
##$PFORMAT= <normpl>
##$SURQMSG= 1
$$ End of Bruker specific parameters
$$ ---------------------------------
##NTUPLES= NMR SPECTRUM
##VAR_NAME=  FREQUENCY,     SPECTRUM/REAL,   SPECTRUM/IMAG
##SYMBOL=    X,             R,               I
##VAR_TYPE=  INDEPENDENT,   DEPENDENT,       DEPENDENT
##VAR_FORM=  AFFN,          ASDF,            ASDF
##VAR_DIM=   32768,         32768,           32768
##UNITS=     HZ,            ARBITRARY UNITS, ARBITRARY UNITS
##FACTOR=    0.250966925370066, 1,           1
##FIRST=     8223.43324360094, 62487,        -248463
##LAST=      0,             -141703,         -26865
##MIN=       0,             -742572,         0
##MAX=       8223.43324360094, 471550802,    0
$$ Real data points
##PAGE= N=1
##DATA TABLE= (X++(R..R)), XYDATA
$$ [...]
19548d13156A57404b72475l0311D02030b15772J00021j76191B1855J06001i9989
$$ -413156 157404 -272475 -302786 402030 -215772 -115751 -291942 21855 127856 -99989
19537c7681A09254h4201k01831B9974b0522k7320k75938e1539k63127J47365E1418
$$ -37681 109254 -84201 -286032 29974 -20522 -47842 -323780 -51539 -314666 -167301 51418
19525B4843N8290a33604A43694J58225c00473c503j77522h6720l6379L5514B85672
$$ 24843 83133 -133604 143694 301919 -300473 -3503 -181025 -86720 -123099 -87585 285672
19513F3053J1865q452c9271j29168p8308M7277l04027b4844j10610I4590D2278
$$ 63053 74918 66466 -39271 -168439 -246747 -199470 -503497 -24844 -135454 94590 42278
19501e5500k47329c0254j37945A05142K38858N611A41847c20167B80309b71053
$$ -55500 -302829 -30254 -168199 105142 344000 349611 141847 -320167 280309 -271053
19490A93705a83777j28605E4289b91327a1119F2484R7588a5759F999a90042n8162
$$ 193705 -183777 -312382 54289 -291327 -11119 62484 160072 -15759 6999 -190042 -248204
19479b48204i622A24801a07128A26286f57764b89838L7156d0045j83429p1322
$$ -248204 -9622 124801 -107128 126286 -657764 -289838 -252682 -40045 -223474 -294796
19469b94796o129d3051j85898B61550c62747A32418b59867A58005a74768e0776
$$ -294796 -300925 -43051 -228949 261550 -362747 132418 -259867 158005 -174768 -50776
19458a66776A59116b42174a11613C6656a10887d2979l2225j8472c8360C17324
$$ -166776 159116 -242174 -111613 36656 -110887 -42979 -75204 -93676 -38360 317324
19447b83153F4278b71569R2282A60752c03807J50962C7659b5029A3844i7058k30451
$$ -283153 64278 -271569 -179287 160752 -303807 -152845 37659 -25029 13844 -97058 -327509
19436c27509a12301M7146I6194c5473a6473q2654n477K3396K158F3814g3699j33482
$$ -327509 -112301 -65155 96194 -35473 -16473 -99127 -104604 -81208 -79050 63814 -73699 -207181
19424b07181e4238n8913D5085K04595h712A99206M5265b0204B841a64706e2131
$$ -207181 -54238 -113151 45085 249680 -8712 199206 244471 -20204 2841 -164706 -52131
19412G94d7997j411B9837b41498A37235a54872c2768n3396j7019D3487a29050
$$ 794 -47997 -49408 29837 -241498 137235 -154872 -32768 -86164 -103183 43487 -129050
19400b18779R9877A36754K8502c7340B42534G1610L2522J54632c1770G8056B6252
$$ -218779 -118902 136754 165256 -37340 242534 71610 104132 258764 -31770 78056 26252
19388C9893b63688a03283j88453a18768G0693b01503B91754f1838G556J86220
$$ 39893 -263688 -103283 -291736 -118768 70693 -201503 291754 -61838 7556 193776
19378A93776d6931j97426P4314c5043q13G2275M6105c2466k11982f3029l60799
$$ 193776 -46931 -244357 -170043 -35043 -35856 72275 118380 -32466 -244448 -63029 -423828
19367d23828P0030A62257a19787e081C9874A9493d743A38637d583C0509c29806
$$ -423828 -353798 162257 -119787 -5081 39874 19493 -4743 138637 -4583 30509 -329806
19355b82043F6967a18999p4732j38954A20180L4852a79644k2306k9938e4646l21970
$$ -282043 66967 -118999 -193731 -332685 120180 155032 -179644 -201950 -231888 -54646 -376616
19344c76616i319B58307C1459a29403c0133H2784M6772a24528A43129a93364H9063
$$ -376616 -9319 258307 31459 -129403 -30133 82784 129556 -124528 143129 -193364 89063
19332H2615d17886a89519R3437d599I1147a22914b9900q4459h993j21156l08142
$$ 82615 -417886 -189519 -96082 -4599 91147 -122914 -29900 -114359 -8993 -130149 -438291
19321d38291J81454a10867L6530J3764D5603K43642j02630b39749B33169j3535
$$ -438291 -256837 -110867 -74337 -60573 45603 289245 186615 -239749 233169 219634
19311B19634A03859B426R9567m2432Q4517b73745A38232C0422L11704c58871B46857
$$ 219634 103859 2426 101993 59561 144078 -273745 138232 30422 342126 -358871 246857
19299G1515M9744b63073b510H4728k9264a75326H193a21113l00821B89735M617
$$ 71515 121259 -263073 -2510 84728 55464 -175326 8193 -121113 -421934 289735 294352
19288B94352a57893B1359a41061A41302d4476A22976a03149H6221c2630B4382
$$ 294352 -157893 21359 -141061 141302 -44476 122976 -103149 86221 -32630 24382
19277h5616r9262d7848p0274N3476o5703j75735J35949A77766b69181g4557g16
$$ -85616 -184878 -47848 -118122 -64646 -130349 -306084 -170135 177766 -269181 -74557 -716
19265A42480i9116c7265j77737h2204j5818m6073M6803k6586r9926C2487K09301
$$ 142480 -99116 -37265 -215002 -82204 -98022 -144095 -97292 -123878 -223804 32487 241788
19254B41788a05895A08221a82306P0775A72301a01675A59868J33312j06880a35653
$$ 241788 -105895 108221 -182306 -111531 172301 -101675 159868 293180 186300 -135653
19243g0608A30600d830N56m089k47556h3740l70713E2856R3807J09265g5787k21237
$$ -70608 130600 -4830 -4274 -8363 -255919 -83740 -454453 52856 146663 255928 -75787 -297024
19231b97024J38635J7805j60513C0335f5860D95744A53624F6687b60798J25095
$$ -297024 -158389 -140584 -301097 30335 -65860 495744 153624 66687 -260798 -135703
19221a35703B26454b45558K3877G4670b38124i8893C5686A2148b72708j6414a7292
$$ -135703 226454 -245558 -221681 74670 -238124 -98893 35686 12148 -272708 -289122 -17292
19209c28671a30650j09958e2790j21259E0806K33718c70389E5113a06877L4768
$$ -328671 -130650 -240608 -52790 -174049 50806 284524 -370389 55113 -106877 -72109
19199g2109C5709a98007O3666A6672f8062K2009r0260q9552l6171M7618f5375
$$ -72109 35709 -198007 -134341 16672 -68062 -46053 -136313 -225865 -262036 -214418 -65375
19187A65657J20034A01200m6589b5112C5984a75937n7555A29351b26916J07805
$$ 165657 285691 101200 54611 -25112 35984 -175937 -233492 129351 -226916 -119111
19177a19111j041k3159A43337a26888N1846m64993a89852j65161A13421b53598
$$ -119111 -120152 -143311 143337 -126888 -75042 -540035 -189852 -355013 113421 -253598
19166a47984j22067f1024C52583i5546K222C08185Q0695a48384A26419b99657
$$ -147984 -270051 -61024 352583 -95546 -93324 308185 388880 -148384 126419 -299657
19155i4608B06310a1839n8047j27144c2248j91685k8516P9284E3883J1051a36133
$$ -94608 206310 -11839 -69886 -197030 -32248 -223933 -252449 -173165 53883 64934 -136133
19143a85894E6330e3469q5889A64848R3221d4867p7645l02166A04024f6274m4966
$$ -185894 56330 -53469 -139358 164848 258069 -44867 -122512 -424678 104024 -66274 -111240
19132a11240j9552A4404i5555A02798g6043j56762I8301d3934I3907J96954a51832
$$ -111240 -130792 14404 -95555 102798 -76043 -232805 98301 -43934 93907 290861 -151832
19120c91409a94646R3944L7962F0910b81302c8371Q974I3352J51365g1904k43755
$$ -391409 -194646 -100702 -62740 60910 -281302 -38371 -29397 93352 244717 -71904 -315659
19109c15659J46420C78009b11113b8020g10A64497b31842C9351N7003b0519A14105
$$ -315659 -169239 378009 -211113 -28020 -710 164497 -231842 39351 96354 -20519 114105
19097A18159b5397B43917r1844b36604J10080b0936A36032b16195j02719f8244
$$ 118159 -25397 243917 152073 -236604 -126524 -20936 136032 -216195 -318914 -68244
19086A63288a14045B7181a54872a8020o0405A89607i8656j76620P5125d07B9818
$$ 163288 -114045 27181 -154872 -18020 -78425 189607 -98656 -275276 -200151 -407 29818
19074D18841H4827a02982j35382f1953j86604o702L6021B27717D0011a1749A78431
$$ 418841 84827 -102982 -238364 -61953 -248557 -255259 -219238 227717 40011 -11749 178431
19062A7765f4879E21381e89351K86503Q8821h9787A51109A7254a44571c0857p5099
$$ 17765 -64879 521381 -589351 -302848 -214027 -89787 151109 17254 -144571 -30857 -105956
19051a05956L3524L1920j48565P3335I1388b14854B2942a90501d6371J8407m9253
$$ -105956 -72432 -40512 -189077 -115742 91388 -214854 22942 -190501 -46371 -27964 -77217
19040g7217E3213i3530A6488a12448C38835g0671B54282J05891D5514R123b40947
$$ -77217 53213 -93530 16488 -112448 338835 -70671 254282 360173 45514 54637 -240947
19028h5731E0410c8548A41104J5635n4203J20226b84848D9836a44116a0833A87953
$$ -85731 50410 -38548 141104 156739 102536 222762 -284848 49836 -144116 -10833 187953
19016C99904f3112C6843a29619J3773B12438O8455c7071a8186F1643J3566J65757
$$ 399904 -63112 36843 -129619 -115846 212438 280893 -37071 -18186 61643 75209 240966
19005B40966D9265g0384j03146A3898a45217a3564j03816j08277A51998l3927
$$ 240966 49265 -70384 -173530 13898 -145217 -13564 -117380 -225657 151998 118071
18995A18071n1496b70437A9777a75169A54441K46a29874B10001m1713j8983p693
$$ 118071 66575 -270437 19777 -175169 154441 154687 -129874 210001 168288 149305 141612
18984A41612c99243F5241k2821a59456B53055B6077g4961H3357J15672a71854
$$ 141612 -399243 65241 42420 -159456 253055 26077 -74961 83357 199029 -171854
18973c20943g4654m9459A31244a23544L5161m754k64432J34694B02529a38183
$$ -320943 -74654 -124113 131244 -123544 -88383 -93137 -357569 -222875 202529 -138183
18962A35194b01476A29806F2362Q8802d3113j5432A65224h178j31072N0775a9248
$$ 135194 -201476 129806 62362 151164 -43113 -58545 165224 -8178 -139250 -88475 -19248
18950E6231K65011a13063J3601j43559A67544a55801A49360o2106b23691f5270
$$ 56231 321242 -113063 -99462 -243021 167544 -155801 149360 87254 -223691 -65270
18939A25293e3078J2828B6285g8575k375b5691B9874d07446a64711H427J40609
$$ 125293 -53078 -40250 26285 -78575 -80950 -25691 29874 -407446 -164711 8427 149036
18928A49036b4994m5507C909K24165b89817i3827a4222l57427A47849a49206h11
$$ 149036 -24994 -70501 3909 228074 -289817 -93827 -14222 -371649 147849 -149206 -811
18916f5374l8129L3853B64435a96095j7293A2667c9531H9818L9337a21291A33095
$$ -65374 -103503 -69650 264435 -196095 -213388 12667 -39531 89818 129155 -121291 133095
18904a15948N6734l08478J82738E2309c1709a883l23286a19468D6705J4778j2225
$$ -115948 -59214 -367692 -184954 52309 -31709 -1883 -325169 -119468 46705 61483 49258
18893D9258c97942J16568B430b45357A84104e1941k81981g6220j50804B27482
$$ 49258 -397942 -281374 2430 -245357 184104 -51941 -333922 -76220 -227024 227482
18882a76836L4290N6826j72747B95364B8530b26233j9450k7275G3369b80779E3481
$$ -176836 -142546 -85720 -258467 295364 28530 -226233 -245683 -272958 73369 -280779 53481
18870b08728J01505j70873f9746A21651E7608c18852A04897b5368A6892i4145
$$ -208728 -107223 -278096 -69746 121651 57608 -318852 104897 -25368 16892 -94145
18859a51270r8304f0638e252D48059c3951j49788B285P4758K8547a37113B48046
$$ -151270 -249574 -60638 -5252 448059 -33951 -183739 2285 77043 105590 -137113 248046
18847F6473f1184m4715p1039e3126B58724D5260K8788a85334D1599c57948a77663
$$ 66473 -61184 -105899 -176938 -53126 258724 45260 74048 -185334 41599 -357948 -177663
18835a03813D7926h3571A88655a1417n9507A60401k4189b57151L7944N1762b6213
$$ -103813 47926 -83571 188655 -11417 -70924 160401 136212 -257151 -219207 -167445 -26213
18823i3317H8930b89123q4319a48083B5850b13124a0857D7453Q8282E402K88392
$$ -93317 88930 -289123 -373442 -148083 25850 -213124 -10857 47453 135735 5402 293794
18812B93794H5504J88252g077j17234A86514h3447B4826d6036A5180J59147b85580
$$ 293794 85504 273756 -7077 -124311 186514 -83447 24826 -46036 15180 174327 -285580
18800f2870A79613a76121a625l5879o6906j16067m9521h5762C05137h2905B11187
$$ -62870 179613 -176121 -1625 -37504 -104410 -220477 -269998 -85762 305137 -82905 211187
18788A11129l6892a33707p5490P479g8390r1116C8488L8850g0565D7916K6434
$$ 111129 74237 -133707 -209197 -201718 -78390 -169506 38488 77338 -70565 47916 74350
18777G4350a40869A37766h8361C7518P0391e0342o5742p24A21021c3848l5670
$$ 74350 -140869 137766 -88361 37518 107909 -50342 -116084 -116808 121021 -33848 -69518
18766f9518j18872h9834A45245Q1055a53302o1857C6417c830A85231b00106Q3437
$$ -69518 -188390 -89834 145245 226300 -153302 -215159 36417 -3830 185231 -200106 -116669
18755a16669d1472n7658j2322c6061m2788A42450B2329e000A22547i5213A01695
$$ -116669 -41472 -99130 -111452 -36061 -78849 142450 22329 -5000 122547 -95213 101695
18743a56558c3318j10034B0065h611k25160O9176L4962k36163A16076j939B2494
$$ -156558 -33318 -143352 20065 -8611 -233771 -164595 -129633 -365796 116076 114137 22494
18731B73729A24944M1829c54329a38653A9349a25420j28118h8237k32033d8051
$$ 273729 124944 166773 -354329 -138653 19349 -125420 -253538 -88237 -320270 -48051
18720a85893B1228J13563k7127f9080j18550B16931b898B6944f1676n2761E8502
$$ -185893 21228 134791 107664 -69080 -187630 216931 -2898 26944 -61676 -114437 58502
18708f2369m1378a6277A12739a51866O328e0644h269A95820c03311c8833A34604
$$ -62369 -103747 -16277 112739 -151866 -145538 -50644 -8269 195820 -303311 -38833 134604
18696c0281j3503j75702f7068F025M01826a28896a0763j84395K8369n3307k77995
$$ -30281 -43784 -219486 -67068 6025 407851 -128896 -10763 -195158 -166789 -220096 -498091
18685d98091a91845G0750e2440E570b87490C7526a57068E41292b58443I8842k6564
$$ -498091 -191845 70750 -52440 5570 -287490 37526 -157068 541292 -258443 98842 72278
18674G2278e2465q7730d86l13044A10571a50400F4003b22881R8749L0072D02535
$$ 72278 -52465 -140195 -486 -313530 110571 -150400 64003 -222881 -124132 -94060 402535
18662b7533m97046i4244F4609a04537M9925E9550d9432A02632b27983r9571b3062
$$ -27533 -524579 -94244 64609 -104537 -54612 59550 -49432 102632 -227983 -327554 -23062
18650a4936j93899c5934j91051N3741p0065O2353A25005g7638c3558F5975N5490
$$ -14936 -208835 -35934 -226985 -173244 -243309 -180956 125005 -77638 -33558 65975 121465
18639A21465k4075K46340B6016a9184r1879k4867d2358j85628A89678n796D6441
$$ 121465 97390 343730 26016 -19184 -111063 -135930 -42358 -227986 189678 183882 46441
18627A50946g5527m3923j88393g246H9329a74651r5480B54821q6535J01026d1789
$$ 150946 -75527 -119450 -307843 -7246 89329 -174651 -270131 254821 168286 269312 -41789
18615f155j29957C57418A25460h7867H5359B571J4361L2593M5732B8124b29237
$$ -6155 -136112 357418 125460 -87867 85359 2571 16932 49525 95257 28124 -229237
18603A37895A4236K33337I9188B6317J2371c12064A2691g6649l20115A95367h2688
$$ 137895 14236 247573 99188 26317 38688 -312064 12691 -76649 -396764 195367 -82688
18591a4149k32892d9111K1485b646p7367l16992B8923A4417i3197A54203J02137
$$ -14149 -247041 -49111 -27626 -2646 -80013 -397005 28923 14417 -93197 154203 256340
18580B56340f3469A3509d6482I9767a73296J6258a0536C7825a8182F3453b29505
$$ 256340 -63469 13509 -46482 99767 -173296 -157038 -10536 37825 -18182 63453 -229505
18568A82449a44956j7665B83700c55002c5569A5328J61681b72312D958M4017b85465
$$ 182449 -144956 -162621 283700 -355002 -35569 15328 177009 -272312 4958 48975 -285465
18556h1590j75981B73780d7838A12437D5371a45770j06573A22878e7377C3305
$$ -81590 -257571 273780 -47838 112437 45371 -145770 -252343 122878 -57377 33305
18545a46612A37136J1274b72377f2141J3204A99117R8370b47301R547b2214F4352
$$ -146612 137136 148410 -272377 -62141 -48937 199117 297487 -247301 -237754 -22214 64352
18533a50972p8158L0404j78288R6258J31830f2839o5782N9177B4925d03714O2641
$$ -150972 -229130 -198726 -377014 -280756 -148926 -62839 -128621 -69444 24925 -403714 -341073
18522c41073g3502A58951F834b05248A48794L0039b18586b203A44079a68203e498
$$ -341073 -73502 158951 6834 -205248 148794 178833 -218586 -2203 144079 -168203 -5498
18510a12991N1945r1086k18549h7566r1235B75972a71552d6560B18632o2281a55130
$$ -112991 -61046 -152132 -370681 -87566 -178801 275972 -171552 -46560 218632 156351 -155130
18498B1468R1112a28158B43507A14814h2252j58835e2433D0453a99626i4227a0276
$$ 21468 112580 -128158 243507 114814 -82252 -241087 -52433 40453 -199626 -94227 -10276
18486a32004D3093h7171j765l8637I367Q4569a57317r58C48569c70462J13742
$$ -132004 43093 -87171 -88936 -127573 9367 93936 -157317 -158275 348569 -370462 -256720
18475b56720A5484a20479A97736a23984a9543n9496c6375j25574f1912r6794I618
$$ -256720 15484 -120479 197736 -123984 -19543 -79039 -36375 -161949 -61912 -158706 9618
18463d7809A03121b22815o7245J05569n6779A12511D3766e8037j23602p270n6417
$$ -47809 103121 -222815 -290060 -184491 -241270 112511 43766 -58037 -181639 -188909 -245326
18452b45326O3947F0243a8914l19799K1402a5565o5500k3815m51574a221D2789
$$ -245326 -181379 60243 -18914 -338713 -317311 -15565 -81065 -104880 -556454 -1221 42789
18440c31798D6751K43698b37419F8633j5779b44757f4468p058M504j07034k2329
$$ -331798 46751 290449 -237419 68633 52854 -244757 -64468 -71526 -67022 -174056 -196385
18429a96385H8833J7665n3186e1402F5493J49478M5990J18147c99686a65128A3633
$$ -196385 88833 106498 53312 -51402 65493 214971 260961 379108 -399686 -165128 13633
18417d54A42185e5752F1715K3092a1031l9241A47296c8151B24690D7477j337J64139
$$ -454 142185 -55752 61715 84807 -11031 -50272 147296 -38151 224690 47477 46140 210279
18405B10279R9991A08626c23235A14232b8432n0331j800C4701K2810J60668g8386
$$ 210279 310270 108626 -323235 114232 -28432 -78763 -80563 34701 57511 218179 -78386
18393i6018M3584B51381p4467l4975j7225a83899G3085K20623b78908J21584A13487
$$ -96018 -52434 251381 176914 141939 124714 -183899 73085 293708 -278908 -157324 113487
18381e2744B1976b20226A5598a40207f5508B56831A7494J80827n9474l1412f8824
$$ -52744 21976 -220226 15598 -140207 -65508 256831 17494 198321 138847 107435 -68824
18369c25723B99826e179r7714E1634Q001J19413c7556l306J3411j03664l0771
$$ -325723 299826 -5179 -102893 51634 59635 179048 -37556 -40862 -27451 -131115 -161886
18358a61886A65735M5392a29514f1562m5450D7890M1024b71881K9448F4012a19913
$$ -161886 165735 211127 -129514 -61562 -107012 47890 88914 -271881 -242433 64012 -119913
18346b22135d2241d407A79826a91070B75807b08748B32755i2077j73688I6972
$$ -222135 -42241 -4407 179826 -191070 275807 -208748 232755 -92077 -265765 96972
18335A21478a41672j3730a5005j2919j68117A82124a7221F2226b38515c6201A13623
$$ 121478 -141672 -155402 -15005 -27924 -196041 182124 -17221 62226 -238515 -36201 113623
18323b622B45459F1842a91047R2707k25707q8214E6535J27550a73252b4715A17697
$$ -2622 245459 61842 -191047 -98340 -324047 -412261 56535 184085 -173252 -24715 117697
18311D3295d2761D6187a52718E7925a17751B87958j28136G7826c84707A75766
$$ 43295 -42761 46187 -152718 57925 -117751 287958 159822 77826 -384707 175766
18300A58530M221f31992L14928H5334d1406E4128a42530b2276j44804A39578N0987
$$ 158530 162751 -631992 -317064 85334 -41406 54128 -142530 -22276 -167080 139578 190565
18289A90565d6447E1738a6925k46777p2351d0376O696I0607c6693p5806r9489
$$ 190565 -46447 51738 -16925 -263702 -336053 -40376 -33680 90607 -36693 -112499 -211988
18278b11988o872R7892j77323f5822j54813K3698A286Q3971e4723A28069N8062
$$ -211988 -218860 -120968 -298291 -65822 -220635 -196937 1286 85257 -54723 128069 186131
18267A86131f4075k03511A9166L00134f3004K1442j1909C19238a12567C3465a32774
$$ 186131 -64075 -267586 19166 319300 -63004 -41562 -53471 319238 -112567 33465 -132774
18255B73431h4919k00161G9515a50943A17638B3725R316K22026d70052a84694
$$ 273431 -84919 -285080 79515 -150943 117638 23725 33041 255067 -470052 -184694
18244f3736A81070a13251d6749j70686p5807J32433G3243C8a02817j68966F0110
$$ -63736 181070 -113251 -46749 -217435 -293242 -160809 73243 38 -102817 -271783 60110
18232i9127B6721g4551A49457B7797h1600k6842J1109j72473C4929P678a23975
$$ -99127 26721 -74551 149457 27797 -81600 -108442 -97333 -269806 34929 42607 -123975
18220C25122b1737A2659c89324a51008P4056n3974j83822I8892O5881R4871o7647
$$ 325122 -21737 12659 -389324 -151008 -76952 -130926 -314748 98892 164773 259644 191997
18209A91997c1342A21244j5636D3173a88971h6032j00879A34354a49399q0108
$$ 191997 -31342 121244 105608 43173 -188971 -86032 -186911 134354 -149399 -229507
18199b29507A1062K65987e2365A6822b89884i6340A25818K8163e1588D9968a58177
$$ -229507 11062 277049 -52365 16822 -289884 -96340 125818 153981 -51588 49968 -158177
18187d9940F1631b5660j39066L0783e5958p9041C075N3261M5384f0603A08695
$$ -49940 61631 -25660 -164726 -133943 -55958 -134999 3075 56336 101720 -60603 108695
18175E9562e3536m6992G796L0862J02379A3059c7354k51992F9457b17277B37778
$$ 59562 -53536 -100528 7796 38658 141037 13059 -37354 -289346 69457 -217277 237778
18163F0368a15923B67155A33411J40439a83287M9802K7744G9226K12773e9506
$$ 60368 -115923 267155 133411 273850 -183287 -133485 -105741 79226 291999 -59506
18152B07197a7844A49434B9707a67355K3010j86193a48808A85705e4090a6799
$$ 207197 -17844 149434 29707 -167355 -144345 -330538 -148808 185705 -54090 -16799
18141A15227j7974a91755n3194b0802B51294h9023H4337a02662j49003A31593
$$ 115227 97253 -191755 -244949 -20802 251294 -89023 84337 -102662 -251665 131593
18130a52195A76277a14619B705g4237L5963q4529e883E0921a76092B40105b65470
$$ -152195 176277 -114619 2705 -74237 -38274 -122803 -5883 50921 -176092 240105 -265470
18118c3593a6630l00239Q6352J6388B00979b99650H8253B8888b12444b4978j73342
$$ -33593 -16630 -316869 -230517 -214129 200979 -299650 88253 28888 -212444 -24978 -198320
18107a98320D7550R5960a77286N0871j85884f2535m5918c0028o4691o080b8612
$$ -198320 47550 143510 -177286 -126415 -312299 -62535 -108453 -30028 -94719 -100799 -28612
18095c1850A10191J88855m2808L4811b65238A87074D3167L9141a86699r3801B3905
$$ -31850 110191 299046 256238 291049 -265238 187074 43167 82308 -186699 -280500 23905
18083A45862P5432c17027A72125f0366j349F7520a72911d542l72679a80945A28758
$$ 145862 221294 -317027 172125 -60366 -61715 67520 -172911 -4542 -377221 -180945 128758
18071A17183j7510A1762a85797E9914b03261f426p1735C0289c2874l455J3517
$$ 117183 99673 11762 -185797 59914 -203261 -6426 -78161 30289 -32874 -36329 -22812
18060b2812k35070G5430a59413A21470e5440a9172q1971d099A16630b16690M3287
$$ -22812 -257882 75430 -159413 121470 -55440 -19172 -101143 -4099 116630 -216690 -173403
18049a73403L8969H6565J22090f0952m0568M2270k51014A00209J67138b5271p2501
$$ -173403 -134434 86565 208655 -60952 -101520 -59250 -310264 100209 267347 -25271 -97772
18038i7772J0360j50793p6415G2797a57183E3589i5112c7888I3207K01473A07370
$$ -97772 -87412 -238205 -314620 72797 -157183 53589 -95112 -37888 93207 294680 107370
18026A59077a9472B39977B4638h5207A55356M0990a05410p2839c8199B94692j1929
$$ 159077 -19472 239977 24638 -85207 155356 196346 -105410 -178249 -38199 294692 282763
18015B82763a97353L494L9135j18998N9183A68146b28064A01185L9494b3986B20913
$$ 282763 -197353 -193859 -154724 -273722 -214539 168146 -228064 101185 140679 -23986 220913
18003b47522j1833A41148a7299H7714b67547F3753P0084c23419i8489E9126j1071
$$ -247522 -259355 141148 -17299 87714 -267547 63753 133837 -323419 -98489 59126 48055
17992D8055J44381C5217a30912B02381a37895q985A72364c57976J28467h9955
$$ 48055 192436 35217 -130912 202381 -137895 -146880 172364 -357976 -229509 -89955
17981A30182a36105A38927B6983b7938k38087b8000k07054J02859D31253i2462
$$ 130182 -136105 138927 26983 -27938 -266025 -28000 -235054 -132195 431253 -92462
17970A59527K156a74082a4161A99448a11601j64706E1214b31521F2764f7754A11060
$$ 159527 161683 -174082 -14161 199448 -111601 -276307 51214 -231521 62764 -67754 111060
17958f6063k13830b1311A88460f313G5377K13298G1615c10958d6674j33483c1959
$$ -66063 -279893 -21311 188460 -6313 75377 288675 71615 -310958 -46674 -180157 -31959
17946D8482f7795k173A61482F9054N4702g9627A4876b8423B58905e0443q0710
$$ 48482 -67795 -69968 161482 69054 123756 -79627 14876 -28423 258905 -50443 -131153
17935a31153K7048j03492i6432H3071a51831D0423J86452n2178L4788d9689j40001
$$ -131153 -104105 -207597 -96432 83071 -151831 40423 226875 174697 209485 -49689 -189690
17924a89690A19822a71347C7971b61848n4869d4917C4513a37148j18944C53213
$$ -189690 119822 -171347 37971 -261848 -316717 -44917 34513 -137148 -256092 353213
17913B35040A3577j785J69072b79226j5601A71519a40433c7761A79943q1978b04573
$$ 235040 13577 11792 180864 -279226 -294827 171519 -140433 -37761 179943 97965 -204573
17901b50912a15759q5284m5064H0142a91992e9862q0706m2945A3234c66733g1519
$$ -250912 -115759 -201043 -246107 80142 -191992 -59862 -140568 -183513 13234 -366733 -71519
17889I2730a34136B24297a04975k7594e2461C20272i8281j53777k08742E8556
$$ 92730 -134136 224297 -104975 -132569 -52461 320272 -98281 -252058 -460800 58556
17878G2476f3171A40328a22927A44742D9026j2982K9741A634a29629B9673e167
$$ 72476 -63171 140328 -122927 144742 49026 36044 65785 1634 -129629 29673 -5167
17866A03734k3846a84811c7650A21394k6546M083b62063a16437e2812p7110l9595
$$ 103734 79888 -184811 -37650 121394 94848 98931 -262063 -116437 -52812 -129922 -169517
17855a69517g8520G4401K2709b71672C31980A53059a34261m1648B21582q9467
$$ -169517 -78520 74401 97110 -271672 331980 153059 -134261 -175909 221582 132115
17845A32115l3964N2186O1775g9131p8711A74843p9091B0110L38736d9819e302
$$ 132115 98151 150337 212112 -79131 -157842 174843 95752 20110 358846 -49819 -5302
17833A28752O2700b185j80641N1159C00046a43214m29132H2094C3722A13e6732
$$ 128752 191452 -2185 -182826 -131667 300046 -143214 -572346 82094 33722 113 -56732
17821A75228c15076c2852j62190j98534A31053M503i1504H467K48432k9384h0275
$$ 175228 -315076 -32852 -195042 -393576 131053 135556 -91504 8467 256899 227515 -80275
17809B77965e28322B54937d1399C69245A02673e6568b8261A12637N1627b4297
$$ 277965 -528322 254937 -41399 369245 102673 -56568 -28261 112637 164264 -24297
17798b27551i6101I2648b37995C1993a63973f0760k04970B2155a8477j18762j8115
$$ -227551 -96101 92648 -237995 31993 -163973 -60760 -265730 22155 -18477 -137239 -155354
17787a55354A31864d6274B0496a91522B66453h3725D11377a89886g0456j38717
$$ -155354 131864 -46274 20496 -191522 266453 -83725 411377 -189886 -70456 -209173
17777b09173b0400a9k9643m6288F5339b8168j4690F1552a6085j37885D305L465
$$ -209173 -20400 -19 -29662 -75950 65339 -28168 -42858 61552 -16085 -153970 4305 7770
17765G770K88733j20051d6864k9046D6237a95191g1056l08895J55888j8104G7651
$$ 7770 296503 176452 -46864 -75910 46237 -195191 -71056 -379951 -224063 -242167 77651
17753b35318B4172b73592O5152A16810D966a04616I3646c89188B35400a89598
$$ -235318 24172 -273592 -208440 116810 4966 -104616 93646 -389188 235400 -189598
17742A91163p6895n2846M2381f2472k5314M531A27643F3674J9657B1396J3078
$$ 191163 114268 61422 103803 -62472 -87786 -83255 127643 63674 83331 21396 34474
17731C4474J13526b10555L7419D16861a50710B57991e0982D7058K99759i8050
$$ 34474 148000 -210555 -173136 416861 -150710 257991 -50982 47058 346817 -98050
17720B50919c3378k971o4720M4603j85290C32276A05536M754D789P2833B4612
$$ 250919 -33378 -36349 -101069 -56466 -241756 332276 105536 110290 4789 77622 24612
17708B00352F1402a29967C186Q4128a98868J9621c2287A44630e0328H3224J25206
$$ 200352 61402 -129967 3186 87314 -198868 -179247 -32287 144630 -50328 83224 208430
17697B08430m0403a11956C1497b62562B02513N0908c63882D2053c94412A76808
$$ 208430 168027 -111956 31497 -262562 202513 253421 -363882 42053 -394412 176808
17686B55810F3138a06412H1435d6833A00220J93031j00069n6450L64389a17004
$$ 255810 63138 -106412 81435 -46833 100220 293251 193182 136732 501121 -117004
17675b47419B75844O9060a17605A05611a84669C11577o7881D5231J12758c81074
$$ -247419 275844 344904 -117605 105611 -184669 311577 243696 45231 157989 -381074
17664c32097C05721a0757A9883L4684J50180G4263a03232A89297q0738m5083b07883
$$ -332097 305721 -10757 19883 54567 204747 74263 -103232 189297 108559 63476 -207883
17652H0460a23934F1609a32832B7687b30559B32735c14624B97281b05886e9829
$$ 80460 -123934 61609 -132832 27687 -230559 232735 -314624 297281 -205886 -59829
17641A96843b4305A06185e948r6742A69517a69640g7213B27502f3063A4946P6970
$$ 196843 -24305 106185 -5948 -102690 169517 -169640 -77213 227502 -63063 14946 91916
17630I1916b58110b9091j93864A95501n115L7175d5574j08892j63620d0775j44560
$$ 91916 -258110 -29091 -222955 195501 190386 227561 -45574 -154466 -318086 -40775 -185335
17619a85335B4624j0706M4664g5874C17574F1367a36096n8015E802R253J22147
$$ -185335 24624 13918 58582 -75874 317574 61367 -136096 -194111 5802 15055 137202
17608A37202J08872K0454j7999A8067d0555E8665C898J19449b48673i1968b5817
$$ 137202 246074 266528 248529 18067 -40555 58665 3898 123347 -248673 -91968 -25817
17596D2684J96002A13468J1223b48704Q6080A76437a62653P9215B13563b04227
$$ 42684 238686 113468 124691 -248704 -162624 176437 -162653 -83438 213563 -204227
17585a17082N2245D3610R8258l6706J1267k3556m4747b2777A69641j9563h8546
$$ -117082 -64837 43610 141868 105162 116429 92873 48126 -22777 169641 150078 -88546
17573C2069e4960D05654A74322E3447k1930d2187B11156G0331k1060J00018l0595
$$ 32069 -54960 405654 174322 53447 31517 -42187 211156 70331 49271 149289 118694
17562A18694c84932a73261b2280C2901B124K67451n2180o3704c33669d0118C35777
$$ 118694 -384932 -173261 -22280 32901 2124 269575 217395 153691 -333669 -40118 335777
17550C7927J09159J8153o1630L23923c04815C04041a29733A0444a47035j88382
$$ 37927 147086 165239 103609 427532 -304815 304041 -129733 10444 -147035 -335417
17540c35417B1485K43371E177a70364N6097A12952c55871a43902j61765B1161
$$ -335417 21485 264856 5177 -170364 -114267 112952 -355871 -143902 -305667 21161
17529D1432J19551C6763Q5001h5603l3221f496j51708C06634C061K35695A16057
$$ 41432 160983 36763 121764 -85603 -118824 -6496 -158204 306634 3061 238756 116057
17517G399a22578B08489a94252C99755b34627B70285g1004A00343b44557A82514
$$ 7399 -122578 208489 -194252 399755 -234627 270285 -71004 100343 -244557 182514
17506D4067b4060B0270J08122K96874H362b60600f9764H7172L05904g5989q2244
$$ 44067 -24060 20270 128392 425266 8362 -260600 -69764 87172 393076 -75989 -158233
17495a58233L7192A38887k4967K8812i9770L1075A80674L9293p6816J31023D4508
$$ -158233 -121041 138887 113920 142732 -99770 -68695 180674 219967 143151 274174 44508
17483A77123J58648K7792b79198h0546l07005C25725E8310d4119A49724Q7933
$$ 177123 335771 363563 -279198 -80546 -387551 325725 58310 -44119 149724 237657
17473B37657K9101j3968o1561K13746G1902J47345a67503P9748J9876I9174K69501
$$ 237657 266758 252790 191229 404975 71902 219247 -167503 -87755 -67879 99174 368675
17462C68675L0874f4621I0801h3393B3599J74764B2191L21885A24855b3714B57277
$$ 368675 399549 -64621 90801 -83393 23599 198363 22191 344076 124855 -23714 257277
17450B36647K6979J18988j83800K84624l4468k04704N2660q7607d800A42165a50497
$$ 236647 263626 382614 198814 483438 448970 244266 296926 209319 -4800 142165 -150497
17438B20179H3737J51867q3144j2596m9839K79866h4519A05291M62953A15178
$$ 220179 83737 235604 152460 139864 90025 369891 -84519 105291 568244 115178
17427A98278J53583A54672L3466J34590J50909a5966C08404A19731J6121K65646
$$ 198278 351861 154672 188138 322728 473637 -15966 308404 119731 135852 401498
17417D01498c2499A43893p0256l5320N8304M01498j53600j10859I2523J00606
$$ 401498 -32499 143893 73637 38317 96621 498119 344519 233660 92523 193129
17407A93129L39579k49090G5302e9412Q187K2986G4700I899O2706K83940a41121
$$ 193129 532708 283618 75302 -59412 -51225 -28239 74700 9899 72605 356545 -141121
17395b3156j2171B02292A6670J01667O6692g9334j84715A78239J05135D7569K3072
$$ -23156 -35327 202292 16670 118337 185029 -79334 -264049 178239 283374 47569 70641
17384G0641J64965J36238G8303C1212K40037B9389d4294A10145J82323M6024A68577
$$ 70641 235606 371844 78303 31212 271249 29389 -44294 110145 292468 338492 168577
17372B50000a48638d9427B02376M0136P5515K02652a23204B30488l8447a09710
$$ 250000 -148638 -49427 202376 242512 318027 520679 -123204 230488 192041 -109710
17361B72179J06481j19654f8368A56147a19070B77568A37103b41534D11562I2665
$$ 272179 378660 259006 -68368 156147 -119070 277568 137103 -241534 411562 92665
17350D46181f5698F1224L26226a66647A15429g6345A60779F3675K46330a88296
$$ 446181 -65698 61224 387450 -166647 115429 -76345 160779 63675 310005 -188296
17339g6665D56339A88490a43411A46576O0886a55600B25176d9410A73201K92092
$$ -76665 456339 188490 -143411 146576 207462 -155600 225176 -49410 173201 465293
17329D65293A1283J26465L1219J1961c9989B03427F6126M95986A87107l6841J22993
$$ 465293 11283 137748 168967 180928 -39989 203427 66126 562112 187107 150266 273259
17318B73259L4721L090F7980N7762K72384o5768B1330R5273J69575g7697A63330
$$ 273259 307980 311070 67980 125742 398126 332358 21330 116603 286178 -77697 163330
17306B44115L63585A51669N577J12434d6653D02364j14393J04983A79452J57414
$$ 244115 607700 151669 157246 269680 -46653 402364 287971 392954 179452 336866
17296C36866b08667A28695J51067j5982p3127B1803K78037k5385j29983N7879
$$ 336866 -208667 128695 279762 263780 190653 21803 299840 274455 144472 202351
17286B02351J55129j18437j01576C1361J2701c3069J4738A99272M6513i1783G9483
$$ 202351 357480 239043 137467 31361 44062 -33069 -18331 199272 245785 -91783 79483
17274B77049o3561J2131F9089k8323O2120M9750K08202J43623j64953A61900L357
$$ 277049 213488 225619 69089 40766 102886 152636 360838 504461 339508 161900 165257
17263A65257j136F3508J43813E9295d8335A34080C6542j7223P1048a84476A72003
$$ 165257 164121 63508 207321 59295 -48335 134080 36542 19319 90367 -184476 172003
17251C90231j14851J40032B04554f9559n8875C10085j31385J69721A46790f2749
$$ 390231 275380 415412 204554 -69559 -128434 310085 178700 348421 146790 -62749
17240A69962p689k2246K52825j79529o4535E3041L90262A92149J59506j1527A6893
$$ 169962 162273 140027 392852 213323 148788 53041 443303 192149 351655 340128 16893
17228B98693K41478j32969A72188k6229D0824M8658g4236B5070i6298B67665j6211
$$ 298693 540171 407202 172188 145959 40824 89482 -74236 25070 -96298 267665 251454
17217B51454Q9389O3121j96073K31415A2179N2200C0215J49695K48358A20151
$$ 251454 340843 403964 207891 439306 12179 64379 30215 179910 428268 120151
17206B10747J99954A86947a15300C22643r6511J74831j29768J76019C0802K36637
$$ 210747 410701 186947 -115300 322643 226132 400963 271195 447214 30802 267439
17196B67439I4038Q6777R1441L52865j61545k01823j07989P163K32081K1058J23802
$$ 267439 94038 180815 272256 625121 463576 261753 153764 160927 393008 414066 537868
17185E37868e4243I1344J10392F4893L55778Q309j34139J58864k09297K08726
$$ 537868 -54243 91344 201736 64893 420671 428980 294841 453705 244408 453134
17175D53134j38088p6220j14636L04267j54583m6921k7524J65824L76121B81134
$$ 453134 315046 238826 124190 428457 273874 226953 199429 365253 741374 281134
17164D34571H3931K98720A67409J56030D1721K81372J87707r8089K20271j71158
$$ 434571 83931 382651 167409 323439 41721 323093 510800 412711 632982 461824
17154D61824j21169j05336J15897K65046A97845L04060j01531b4263B52474q2725
$$ 461824 340655 235319 351216 616262 197845 501905 400374 -24263 252474 169749
17144A69749L94481B53831J07279M6589o4812j36190K5931L32191k32016H8735
$$ 169749 564230 253831 361110 407699 342887 206697 232628 564819 332803 88735
17133F4808M18208A47310l9099R0828Q1218c986C15770L74806C6221L27704M5087
$$ 64808 483016 147310 108211 199039 280257 -3986 315770 690576 36221 363925 409012
17122D09012j79699J71842l3125K2777A29247J02022J98452A19568M16560P2040
$$ 409012 229313 401155 368030 390807 129247 231269 429721 119568 536128 608168
17112F08168N5441J9852A3942N42033j49940j66483Q8620p1512L54895j1833k49404
$$ 608168 663609 683461 13942 555975 406035 239552 328172 256660 611555 599722 350318
17101C50318p5006N5865K78039j28334j23399K88266F6033L05530K29591K5072
$$ 350318 275312 331177 609216 480882 357483 645749 66033 371563 601154 626226
17091F26226r5436q3237K83111B97933j36852K18213j08047J00675J29794M6464
$$ 626226 530790 447553 730664 297933 161081 379294 271247 371922 501716 548180
17081E48180J82660o1075A60193K41064q9495M20838j68731o3766L3143k48733
$$ 548180 730840 669765 160193 401257 311762 732600 563869 500103 533246 284513
17071B84513O11565D16340p5732K30154J29446l35423a5378D01251K7197L20256
$$ 284513 896078 416340 340608 570762 700208 364785 -15378 401251 428448 748704
17061G48704l26688N0316K093L95835k34609k19155p1434J21683K50857C18684
$$ 748704 422016 472332 474425 870260 635651 416496 345062 466745 717602 318684
17050C11868L67062o6277D7421J66956K51279m4666L76917k0422L4890K9604l10311
$$ 311868 678930 612653 47421 214377 465656 420990 797907 777485 812375 841979 531668
17039E31668J32749J64362l99188M60070D29778J74403Q3422L6469M8664l15188
$$ 531668 664417 828779 429591 889661 429778 604181 687603 724072 772736 457548
17029D57548K82976J93300C27342J05294J81669k48046M46410C79387J67218K97717
$$ 457548 740524 933824 327342 432636 614305 366259 812669 379387 546605 844322
17019H44322B72962L85966J42187J45045l53268J1696k1425J18824J13637r9322
$$ 844322 272962 658928 801115 946160 592892 604588 583163 701987 815624 716302
17009G16302r598K32304l44270K24903O7790j84762j57661N55929l09204j26438
$$ 716302 706704 939008 594738 819641 887431 702669 545008 1100937 791733 665295
16999F65295N60259m46941J12450l07310L05472K87780k39907j43684k50501K11010
$$ 665295 1225554 778613 891063 583753 889225 1177005 937098 793414 542913 753923
16989G53923l20176K92910j95534K21938J19630k1111N8558k44180M06722m15783
$$ 753923 433747 726657 531123 753061 872691 851580 910138 665958 1072680 656897
16979F56897J21275K94528l08215L68407l64485R4721O4254j51120K88743N3365
$$ 656897 778172 1072700 764485 1132892 768407 863128 927382 776262 1065005 1118370
16969A118370R7477j94700J05405p0783j62873K3242L06584m02684J81804j74690
$$ 1118370 1215847 1021147 1126552 1055769 892896 916138 1222722 820038 1001842 827152
16959H27152J76019p164K14581J26815k75923J45662l36071N01553j18276K0963
$$ 827152 1003171 996007 1210588 1337403 1061480 1207142 871071 1372624 1254348 1275311
16949A275311j67302m2309K62467Q9425k54465Q6401n804r2962J23735p9593K30941
$$ 1275311 1108009 1065700 1328167 1417592 1163127 1249528 1243724 1150762 1274497 1194904 1425845
16938A425845O3746l4332l10535L17367j01292J2457J66261j59823O7635M7154
$$ 1425845 1489591 1455259 1144724 1462091 1360799 1373256 1539517 1379694 1447329 1494483
16928A494483J8926j13468O0259M0655j15412j9276L46160O9113J6678O5775l30573
$$ 1494483 1513409 1399941 1460200 1500855 1385443 1366167 1712327 1781440 1798118 1863893 1533320
16917A533320m3223K40555K52116l30311m79431M72628l3602J52919R3810j7052
$$ 1533320 1490097 1730652 1982768 1652457 1173026 1645654 1612052 1764971 1858781 1841729
16907A841729j98832J73857k17943K22035k59021J47634L74019R1140m2360l30109
$$ 1841729 1642897 1816754 1598811 1820846 1561825 1709459 2083478 2174618 2132258 1802149
16897A802149J93557n274j99015j22693L54205M07639l10817k88553M55783k41430
$$ 1802149 1995706 1990432 1791417 1668724 2022929 2430568 2119751 1831198 2286981 2045551
16887B045551j46126K33709J53395o6462J28833M11107j34928j11793k79224J27359
$$ 2045551 1899425 2133134 2286529 2220067 2348900 2760007 2625079 2513286 2234062 2361421
16877B361421K10501K48529m53810K60727r4028R2878R5800J22733R845k1256
$$ 2361421 2571922 2820451 2366641 2627368 2533340 2626218 2722018 2844751 2854596 2833340
16867B833340N1539j38070L53644k32487j90306L81114K9561J87390M1593l70336
$$ 2833340 2884879 2746809 3100453 2867966 2677660 3058774 3088335 3275725 3317318 2946982
16857B946982K12202P1054L12986j93236J15639K3221J52459k27477L82775P4546
$$ 2946982 3159184 3230238 3543224 3349988 3465627 3488848 3641307 3413830 3796605 3871151
16847C871151K42376l37491l19911N77892k31278K33120M9592O7589R5662R3334
$$ 3871151 4113527 3776036 3456125 4034017 3802739 4035859 4085451 4153040 4248702 4342036
16837D342036J19007k1497J58307m02872M15595j52396M60460O8398Q6448J8984
$$ 4342036 4461043 4439546 4597853 4194981 4610576 4458180 4918640 4987038 5073486 5092470
16827E092470j7311K20810n8807m0284L2629O0755N16672p9561L07179J85569
$$ 5092470 5075159 5295969 5237162 5196878 5229507 5290262 5806934 5727373 6034552 6220121
16817F220121p2003l8107K56174N3669P7948L98911L11642l85519O79459K32058
$$ 6220121 6148118 6110011 6366185 6419854 6497802 6896713 7208355 6822836 7502295 7734353
16807G734353j30758L06084Q0652M25420R4294P7147K45123J72544K89079N06
$$ 7734353 7603595 7909679 7990331 8415751 8510045 8587192 8832315 9004859 9293938 9294444
16797I294444N45104K8247K62894J53988M29385P6410K81788M61960J13485K27271
$$ 9294444 9839548 9867795 10130689 10284677 10714062 10790472 11072260 11534220 11647705 11874976
16787A1874976M07320K81872K53194O16239L73228L57423K12657O99735N28043
$$ 11874976 12282296 12564168 12817362 13433601 13806829 14164252 14376909 15076644 15604687
16778A5604687M57053L38409Q07269j25624P99147N51222N75652J003072M03980
$$ 15604687 16061740 16400149 17207418 17081794 17880941 18432163 19007815 20010887 20414867
16769B0414867N34752J060164N99629Q33415O36514J115170J135742O91486R54469
$$ 20414867 20949619 22009783 22609412 23442827 24079341 25194511 26330253 27021739 27976208
16760B7976208J367568R06581J347069J414577R30710J840033J546813J713336
$$ 27976208 29343776 30250357 31597426 33012003 33942713 35782746 37329559 39042895
16752C9042895J442354J851832K028433K076755J928324K863991K098607K536585
$$ 39042895 40485249 42337081 44365514 46442269 48370593 51234584 53333191 55869776
16744E5869776L085222K717426L020572L651813L648596L758264M089358M440159
$$ 55869776 58954998 61672424 64692996 68344809 71993405 75751669 79841027 84281186
16736H4281186M489033N116434M805523N373426N619785N638872O152320O037338
$$ 84281186 88770219 93886653 98692176 104065602 109685387 115324259 121476579 127513917
16728A27513917O183131O336902O435814O019537O157547N493992N057963M420013
$$ 127513917 133697048 140033950 146469764 152489301 158646848 164140840 169198803 173618816
16720A73618816L736967L079704K065353J229076N1634q07977k375964k621840
$$ 173618816 177355783 180435487 182500840 183729916 183781550 182973573 180597609 177975769
16712A77975769l780635m286525n110389n658330n840137o314305o392497o552670
$$ 177975769 174195134 169908609 164798220 159139890 153299753 146985448 140592951 134040281
16704A34040281o116891o139078o767061n692081n480031n758918n240339m476268
$$ 134040281 127923390 121784312 115017251 109325170 103845139 98086221 92845882 88369614
16696H8369614n172778m151873m146106m205298l552754l084007l591925k701651
$$ 88369614 83196836 79044963 74898857 70693559 67140805 64056798 60464873 57763222
16688E7763222k913617k634357k445408k662680k137550k072382j697559k075806
$$ 57763222 54849605 52215248 49769840 47107160 44969610 42897228 41199669 39123863
16680C9123863j873651j255247j630130j592854r72698j393127j226901j352935
$$ 39123863 37250212 35994965 34364835 32771981 31799283 30406156 29179255 27826320
16672B7826320j141003n61958j179987o71239j232650p77343p53565j239560m22049
$$ 27826320 26685317 26123359 24943372 24272133 23039483 22262140 21508575 20269015 19846966
16663A9846966k58339r69179p20097k95440q89278l64108m62836p22358n47933
$$ 19846966 19588627 18619448 17899351 17603911 16714633 16350525 15887689 15165331 14617398
16654A4617398l33722k81573l22023n99412k96842j69831p20290q6565l69122
$$ 14617398 14283676 14002103 13680080 13080668 12783826 12613995 11893705 11807140 11438018
16645A1438018k20234n02596O7897o57262N0935n74699J13681m03290j93145j22007
$$ 11438018 11217784 10715188 10783085 10125823 10176758 9602059 9715740 9312450 9119305 8997298
16635H997298k87995l79901r9594m44046p9608J81010n95584K49574m90751p0597
$$ 8997298 8709303 8329402 8229808 7785762 7706154 7887164 7291580 7541154 7050403 6979806
16625F979806j7508m21566j77666j89548J56053p8683r3148k40411O0948k23161
$$ 6979806 6962298 6540732 6363066 6173518 6329571 6250888 6157740 5917329 5978277 5755116
16615E755116J2938n1538q5379k91850j25892k88846l63932P38351l42058k81938
$$ 5755116 5768054 5716516 5631137 5339287 5213395 4924549 4560617 5298968 4956910 4674972
16605D674972n3462j30336j96802J72464r1131o1694j65123k29424J48342q9566
$$ 4674972 4621510 4491174 4294372 4466836 4375705 4314011 4148888 3919464 4067806 3978240
16595C978240k08978K66335l76502J8140j10060Q1564j80272R5673j32622K5916
$$ 3978240 3769262 4035597 3659095 3677235 3567175 3648739 3468467 3564140 3431518 3457434
16585C457434R3155m07582J09534j80321l4317J42347p9995j74492m2445O797
$$ 3457434 3550589 3143007 3252541 3072220 3037903 3180250 3100255 2925763 2883318 2890115
16575B890115q9338q8765j0794k3445m52180P14640l22570K52110l31398K61162
$$ 2890115 2800777 2712012 2701218 2677773 2225593 2940233 2617663 2869773 2538375 2799537
16565B799537n47099K16312j10363k69947j74071O2838L97010J78900j24457l76734
$$ 2799537 2252438 2468750 2358387 2088440 1914369 1977207 2374217 2553117 2428660 2051926
16555B051926j85845K91529k97110K24599j41728K01338m7973r5490j63670J06849
$$ 2051926 1866081 2157610 1860500 2085099 1943371 2144709 2096736 2001246 1837576 1944425
16545A944425K32520l00027J72884j78656j87063J4739P2334L1944j272l47980
$$ 1944425 2176945 1876918 2049802 1871146 1684083 1698822 1771156 1803100 1801828 1453848
16535A453848L09879j65729R1488J14424j64067j31248r8993J17221q7690K09697
$$ 1453848 1763727 1597998 1689486 1803910 1639843 1508595 1409602 1526823 1439133 1648830
16525A648830m41830J88811n0053J85086j90970L42166k33155j17229l93568N61361
$$ 1648830 1207000 1395811 1345758 1530844 1339874 1682040 1448885 1331656 938088 1499449
16515A499449k04300J7836K29046n05016K98700J70813m03191M5508n5988J78453
$$ 1499449 1295149 1312985 1542031 1037015 1335715 1506528 1103337 1148845 1092857 1271310
16505A271310k66032J85547p0787q2536J98180j56109o8635K97776k27495P1537
$$ 1271310 1005278 1190825 1120038 1037502 1235682 1079573 1010938 1308714 1081219 1152756
16495A152756M9288k57990K43523J41288m15627J02765J04504J71718k78945j79054
$$ 1152756 1202044 944054 1187577 1328865 913238 1016003 1120507 1292225 1013280 834226
16485H34226O9845M6718k8397l9582K60189l12407K57367j92283j44283K4905
$$ 834226 904071 950789 922392 882810 1142999 830592 1087959 895676 751393 776298
16475G76298j46288L62009P5524Q9502l07063j06405J92009o9042J18621j36746
$$ 776298 630010 992019 1067543 1157045 849982 743577 935586 866544 985165 848419
16465H48419J14376k06985k58218K08684J77141l8334j77905R4470k30500N80211
$$ 848419 962795 755810 497592 706276 883417 845083 667178 761648 531148 1111359
16455A111359m57401n0951K51990j60287L88617j82510j46210J73504l16671L38955
$$ 1111359 653958 603007 854997 694710 1083327 900817 754607 928111 611440 950395
16445I50395l30928l7036r386L42174D25570M90037k08122N9137P5219k74399
$$ 950395 619467 582431 573045 915219 425570 915607 707485 766622 841841 567442
16435E67442R7603J46204k42145K58433o479l11373L36967k34416R7717r6908
$$ 567442 665045 811249 569104 827537 821058 509685 846652 612236 709953 613045
16425F13045K45736n2928k58140O6742J24338j5155J11881C04204R0263J74907
$$ 613045 858781 805853 547713 614455 738793 723638 835519 304204 394467 569374
16415E69374k16667Q8216r3788K08735j06612j20475L16925o8912A65506J09637
$$ 569374 352707 440923 347135 555870 449258 328783 645708 576796 165506 275143
16405B75143L4782R3186N5051J81416j44256J76824O5054H9919N11156j55207
$$ 275143 309925 403111 458162 639578 495322 672146 737200 89919 601075 445868
16395D45868j74667J12606l7168L10377m7838n3631B65038J8804K86774j99892
$$ 445868 271201 383807 346639 657016 609178 555547 265038 283842 570616 370724
16385C70724O7943j95618K18575p3934k1680J6501J98485j95005b6820B99169
$$ 370724 438667 243049 461624 387690 366010 382511 580996 385991 -26820 299169
16374A58907J39033K86784B11116J57332J03830k8243r7969q4927K47059j51345
$$ 158907 297940 584724 211116 368448 472278 444035 346066 261139 508198 356853
16364C56853n1577J10521j12917q5996H4756K48338M69428k01060G4448a41299
$$ 356853 305276 415797 302880 216884 84756 333094 802522 601462 74448 -141299
16353D09239l055D78K40986N8387J85228A79140l1922J28761a80819E49579F4687
$$ 409239 406184 478 241464 299851 485079 179140 147218 275979 -180819 549579 64687
16341E8904J55883H3134K42658A47964J91983K38192B00435l0446K01982j22997
$$ 58904 214787 83134 325792 147964 339947 578139 200435 169989 371971 248974
16331B48974j9006K36092A32539L77343p9749B12343M7826E5014L48698J11629
$$ 248974 229968 466060 132539 509882 430133 212343 260169 55014 403712 515341
16321E15341j75308j34870P2484J12488A73012L88206B35141k4658G2819i556
$$ 515341 340033 205163 277647 390135 173012 561218 235141 210483 72819 -9556
16310A37698B3382O6727B5551J51732k8169h3D32598j44557H9267J37796J8866
$$ 137698 23382 90109 25551 177283 149114 -83 432598 288041 89267 227063 245929
16299B45929J81415j15175L9505j72388L4893R9565H6004J93911j04073L48062
$$ 245929 427344 312169 351674 179286 214179 313744 86004 279915 175842 523904
16289E23904K8423G8806Q6746m3362L32764k2965O5392I9019K39899H1777J74464
$$ 523904 552327 78806 165552 122190 454954 431989 497381 99019 338918 81777 256241
16278B56241B1665K65379P2555j74707a7724C9705J85586b059A22702K28634A26806
$$ 256241 21665 287044 359599 184892 -17724 39705 225291 -2059 122702 351336 126806
16266B14736Q0434D0318J95467J25452j2173D2504O612J47237b9469B64989J9406
$$ 214736 295170 40318 235785 361237 349064 42504 49116 196353 -29469 264989 284395
16255B84395j32845R116J69670G4979M46535A25129h6602A74344b44731D04592
$$ 284395 151550 160666 330336 74979 521514 125129 -86602 174344 -244731 404592
16244A26737J33865m8258o6456a9525B78910L5822A38173i8343B84123I0516J37654
$$ 126737 260602 212344 145888 -19525 278910 314732 138173 -98343 284123 90516 228170
16233B28170i3316B62509j26119J98315j41282D9866a36029B37398I1201J31006
$$ 228170 -93316 262509 136390 334705 193423 49866 -136029 237398 91201 222207
16223B22207G4342B4052P4025l4341K07905j07081a52169A41913a93376d0835
$$ 222207 74342 24052 98077 63736 271641 164560 -152169 141913 -193376 -40835
16212D37622A51787a26006B99190E367P4538J95569H4730a47396C6704K32179
$$ 437622 151787 -126006 299190 5367 79905 275474 84730 -147396 36704 268883
16202B68883C8982J89529k7464a560q2104C6030c9356l510I1012j4707O2939h395
$$ 268883 38982 228511 201047 -1560 -83664 36030 -39356 -42866 91012 76305 139244 -8395
16189B41942f0491F0417N2885D5012a38935A4844M8920e8129C09932a95807B04444
$$ 241942 -60491 60417 113302 45012 -138935 14844 63764 -58129 309932 -195807 204444
16177I32a6011m983B0314J92591f1582A08347O7624m734g3508A50477D2235P418
$$ 932 -16011 -20994 20314 212905 -61582 108347 175971 171237 -73508 150477 42235 49653
16165D9653J68503I7980r040a37832A16586M1773J46850f5751m7093C21883f8200
$$ 49653 218156 97980 88940 -137832 116586 158359 305209 -65751 -112844 321883 -68200
16153B02282M1346a65179D6368H749L90201g327A16920g2970C27131a54775N2447
$$ 202282 243628 -165179 46368 8749 398950 -7327 116920 -72970 327131 -154775 -102328
16142a02328C96320a39900l68301A8640L53430A41349J0606C341J31836J62110
$$ -102328 396320 -139900 -508201 18640 372070 141349 151955 3341 135177 297287
16132B97287d4605C04273d8437D8976J68981p3604a16960E8521K21075a02539
$$ 297287 -44605 304273 -48437 48976 217957 144353 -116960 58521 279596 -102539
16121a62059c9668j34263B00526J21879D0121K92633A49045K67576F6149a64430
$$ -162059 -39668 -173931 200526 322405 40121 332754 149045 416621 66149 -164430
16110I1427i409j19085p5483D22952j55500A25709L17378a52747d1697I4644Q1084
$$ 91427 -9409 -128494 -203977 422952 267452 125709 443087 -152747 -41697 94644 175728
16099A75728P6363e0201A60168b74768A9174K93648b43849f9128A38357a98501
$$ 175728 252091 -50201 160168 -274768 19174 312822 -243849 -69128 138357 -198501
16088A82143p6930O1685J3930q6220h0832k7852A63660L0640n9405D6456L387
$$ 182143 105213 166898 180828 94608 -80832 -108684 163660 194300 134895 46456 49843
16077D9843b52429C12956A43051b42203J03117k89088i615A21927D9696M28816
$$ 49843 -252429 312956 143051 -242203 -139086 -428174 -9615 121927 49696 478512
16067D78512a00980B58218C9537O6468K52161a35433M4101L2929j71260n0278
$$ 478512 -100980 258218 39537 106005 358166 -135433 -91332 -58403 -229663 -279941
16057b79941d8288r5171I5518q025P7615j6900F0081i5226p8781O9089l18389
$$ -279941 -48288 -143459 95518 87493 165108 148208 60081 -95226 -174007 -104918 -423307
16046d23307b8465E3966a42775M0729A85837b29529A87641D7764K3089J64908
$$ -423307 -28465 53966 -142775 -102046 185837 -229529 187641 47764 70853 235761
16036B35761k0235h9632C8283f6918G1707e5531I9156B3491O4595J58443b44022
$$ 235761 215526 -89632 38283 -66918 71707 -55531 99156 23491 88086 246529 -244022
16024G0343c6143J0736k2372j34064C46494A08953c47055J68955D5937j6398a30561
$$ 70343 -36143 -25407 -47779 -181843 346494 108953 -347055 -178100 45937 29539 -130561
16012e9564k53502d3838p0604A09698J43040e3747b0715j0599B49347a93754O6172
$$ -59564 -313066 -43838 -114442 109698 252738 -53747 -20715 -31314 249347 -193754 -127582
16001a27582I000J76772A2029f7294n9678e1640r732j07540Q3291H9402b4019
$$ -127582 9000 185772 12029 -67294 -126972 -51640 -61372 -168912 -85621 89402 -24019
15989B61464a559j08332j16624A87078J1427J2091C2586J69815M36491B60960
$$ 261464 -1559 -109891 -226515 187078 198505 210596 32586 202401 638892 260960
15978A27969c2746n5628J4027B59132M019a80385k4613B32360a61015B56831e9700
$$ 127969 -32746 -88374 -74347 259132 263151 -180385 -204998 232360 -161015 256831 -59700
15966a27063N3551n8136h997A80788p4508L8848M6189B2049L3000J01579h2890
$$ -127063 -73512 -131648 -8997 180788 106280 145128 191317 22049 55049 156628 -82890
15954g7240A2732a40551B41185b55935l2237B9197a10289I4931b16591O2801r1597
$$ -77240 12732 -140551 241185 -255935 -288172 29197 -110289 94931 -216591 -153790 -245387
15943b45387B25814a12958l38306B00474d66291E5664b28372F5709a11632l20826
$$ -245387 225814 -112958 -451264 200474 -466291 55664 -228372 65709 -111632 -432458
15933d32458h8650C18453C4999k485M1029h5948k68513h982j5936E7715a75536
$$ -432458 -88650 318453 34999 32514 73543 -85948 -354461 -8982 -24918 57715 -175536
15921C817L4509O8175C7450J11683c0674A00488a12616m5502j5235B5656b36532
$$ 3817 38326 106501 37450 149133 -30674 100488 -112616 -158118 -173353 25656 -236532
15909a18592A74473E6912a85391C62034B8200h7974k7480A2706J81667l9405b4678
$$ -118592 174473 56912 -185391 362034 28200 -87974 -115454 12706 194373 154968 -24678
15897e3657A50164d36317a66240O2888e0284j50228J7989f805r1920E9582b86765
$$ -53657 150164 -436317 -166240 -103352 -50284 -200512 -182523 -6805 -98725 59582 -286765
15885B13309j1600a85171h3621j33474A40782b65908P0304O6483d6549n3549F3936
$$ 213309 201709 -185171 -83621 -217095 140782 -265908 -195604 -129121 -46549 -100098 63936
15873b36292o2444a45942q6117M3255B8801K27510b65792k8816A33305a59166
$$ -236292 -298736 -145942 -232059 -188804 28801 256311 -265792 -294608 133305 -159166
15862G0149O6363a74248N4583e8812m820q4624N0237j13763C2966f1282j03275
$$ 70149 136512 -174248 -119665 -58812 -63632 -148256 -98019 -211782 32966 -61282 -164557
15851a64557A46246i3486N342A49594Q516a2604j95823Q6603j53170A88439a68669
$$ -164557 146246 -93486 -88144 149594 158110 -12604 -208427 -121824 -274994 188439 -168669
15839b31467j90348D2309j9521a20100A20006J45902F0559J71305a65829k65342
$$ -231467 -421815 42309 22788 -120100 120006 265908 60559 231864 -165829 -431171
15829d31171A14836J06686L4321j18852b66932J08540j4579r252h1896j22357
$$ -431171 114836 221522 255843 136991 -266932 -158392 -172971 -182223 -81896 -204253
15819b04253a0653l62284A91954a05825d4796H6305b0881j04212A23039B4292
$$ -204253 -10653 -372937 191954 -105825 -44796 86305 -20881 -125093 123039 24292
15808h7382l6392L6734c2973J500A01878K3573g9570B21481F8794o258J19625
$$ -87382 -123774 -87040 -32973 -31473 101878 125451 -79570 221481 68794 62536 182161
15797A82161b02238g1400m3855B05702f1803B27771c22860A18724B643e9715J5291
$$ 182161 -202238 -71400 -115255 205702 -61803 227771 -322860 118724 2643 -59715 -44424
15786d4424j51919i1199j15750C50189d7544r3833j27057N875M4206A49358a00193
$$ -44424 -196343 -91199 -206949 350189 -47544 -141377 -268434 -262559 -218353 149358 -100193
15774a40912O9238r0103H6701a19186j1575B32515B9544b3914o5961k6251c0090
$$ -140912 -71674 -161777 86701 -119186 -130761 232515 29544 -23914 -89875 -116126 -30090
15762B72751J5071a84270D4743c5137k79362B71602a83312A77788k2585G5317
$$ 272751 287822 -184270 44743 -35137 -314499 271602 -183312 177788 155203 75317
15751d4867j28270D64739e67944I9891J4908k8998a12465A92643a93948R2226
$$ -44867 -173137 464739 -567944 99891 114799 85801 -112465 192643 -193948 -101722
15741a01722j32292M4464O6409A70567P9560B24c35476a09310H3593a1366B25644
$$ -101722 -234014 -189550 -123141 170567 250127 224 -335476 -109310 83593 -11366 225644
15729d39453b509o5502B8425a02119c6327j0285n7187E9864K60283i1788A58703
$$ -439453 -2509 -68011 28425 -102119 -36327 -46612 -103799 59864 320147 -91788 158703
15717a96276k45673F9714b43640A53905N1482b89900c7429I553b09933C85765
$$ -196276 -441949 69714 -243640 153905 205387 -289900 -37429 9553 -209933 385765
15706a3012F4582J18259J6878D4337P5061c9935B73470F4028a2737j92324A37629
$$ -13012 64582 182841 199719 44337 119398 -39935 273470 64028 -12737 -205061 137629
15694a04859I7312L649J75533A16902K87200E5313J88956j01405h0039o5116b6061
$$ -104859 97312 100961 276494 116902 404102 55313 244269 142864 -80039 -145155 -26061
15682B62631A17530k2135a20881a8890B71116h6620K5621F8132K14082e3582q6688
$$ 262631 117530 95395 -120881 -18890 271116 -86620 -60999 68132 282214 -53582 -140270
15671a40270j1033K8044K7420B16484A05920D8596P2585b87468C51966e2218p6969
$$ -140270 -151303 -123259 -95839 216484 105920 48596 121181 -287468 351966 -52218 -129187
15660a29187b0563l4668I2682D0513L14958e938o552A15449b28303B5988K2994
$$ -129187 -20563 -55231 92682 40513 355471 -5938 -12490 115449 -228303 25988 48982
15649D8982A1789J05388b33896L634b9298F3787a93044N4438d8934j01960M3049
$$ 48982 11789 117177 -233896 -230262 -29298 63787 -193044 -138606 -48934 -150894 -107845
15638a07845j78799f4092M362c663k0120k013l47285C7079a612C6223a17167B38211
$$ -107845 -286644 -64092 -59730 -3663 -23783 -25796 -373081 37079 -1612 36223 -117167 238211
15625A8709b5243q4730E363i8011G1369g7235B38800q9068K14236A78624h0635
$$ 18709 -25243 -109973 5363 -98011 71369 -77235 238800 149732 363968 178624 -80635
15613b02443A38752o4973d3869r6197r199p6134l3793C03888c28993h242F7864
$$ -202443 138752 73779 -43869 -140066 -149265 -225399 -259192 303888 -328993 -8242 67864
15601b68323D0091f9038K5260l01106a03889d0049J9232k29234K1998G4785e22
$$ -268323 40091 -69038 -43778 -344884 -103889 -40049 -20817 -250051 -228053 74785 -522
15589b60659i5474j88436r4197C02913F1224M7278J25147Q6826b51873A87534
$$ -260659 -95474 -283910 -378107 302913 61224 108502 233649 320475 -251873 187534
15578A3911P5617l5950b6752k5590j37051e7652E3060b9949A52448c20692B1990
$$ 13911 89528 53578 -26752 -52342 -189393 -57652 53060 -29949 152448 -320692 21990
15566C4609a19062L5970j00927B5471e7A40649n8698O5108D8809c21761a55627
$$ 34609 -119062 -83092 -184019 25471 -57 140649 81951 147059 48809 -321761 -155627
15554H5824K0182a74856a9338A50883a62739B34789a00319o2819P5659m2799F1278
$$ 85824 106006 -174856 -19338 150883 -162739 234789 -100319 -163138 -87479 -130278 61278
15542h7218j06297G6538h0318E1170L15638O5352d76193A5629a11747C84153g0318
$$ -87218 -193515 76538 -80318 51170 366808 432160 -476193 15629 -111747 384153 -70318
15530i7036k31921b5596G2047k6224a54521M9171K5270B55124O46b65209b6785
$$ -97036 -328957 -25596 72047 45823 -154521 -105350 -80080 255124 255770 -265209 -26785
15518a26620r0820F3146d31685J64033C60060a27313l8994f9415A63216c7511
$$ -126620 -217440 63146 -431685 -267652 360060 -127313 -166307 -69415 163216 -37511
15507g7171A62882P322a04385d7694j01856J9276m17925J75500J51345D3770i3433
$$ -77171 162882 170204 -104385 -47694 -149550 -130274 -548199 -372699 -221354 43770 -93433
15495A02931N3215d051k85345b2770B3129c43637c4129A20899d8462A96724b23507
$$ 102931 156146 -4051 -289396 -22770 23129 -343637 -34129 120899 -48462 196724 -223507
15483a0313k33198f547C4483b38346L386f0472j32544A84491j9533a42535e7746
$$ -10313 -243511 -6547 34483 -238346 -234960 -60472 -193016 184491 164958 -142535 -57746
15471h4159D4972K50114d8202A73183a9947k7686A48823F2073i5464j39598A76090
$$ -84159 44972 295086 -48202 173183 -19947 -47633 148823 62073 -95464 -235062 176090
15459E06609H9577B1406a51454r5427A9073J97319b33475j10065J46438c4045
$$ 506609 89577 21406 -151454 -246881 19073 216392 -233475 -343540 -197102 -34045
15448c92941B9005h2254j55993i5905A09978a33494F7238D487P6243a85859A90261
$$ -392941 29005 -82254 -238247 -95905 109978 -133494 67238 4487 80730 -185859 190261
15436C03715A49527f1165p4518B44731j6081a76756B9257N7001b34788C7113a31214
$$ 303715 149527 -61165 -135683 244731 228650 -176756 29257 86258 -234788 37113 -131214
15424A1055K05902p3554C1823f9755J1037j02910C08845c5256E043J67150E4320
$$ 11055 216957 143403 31823 -69755 -58718 -161628 308845 -35256 5043 172193 54320
15412b08186q2450O4755F9567L5832i7129j40359m2876J07939j3387c5768B8619
$$ -208186 -290636 -225881 69567 105399 -97129 -237488 -280364 -172425 -185812 -35768 28619
15400A82500E6779K8775b6054l6827C77784b48138i4181j54401J01820A87373
$$ 182500 56779 85554 -26054 -62881 377784 -248138 -94181 -248582 -146762 187373
15389a60651e0671j28101N7255b6219C1150d6880p5532c6480B13150r811e0981
$$ -160651 -50671 -178772 -121517 -26219 31150 -46880 -122412 -36480 213150 203339 -50981
15377c2966F8662A060J53889o9236B1279a39434b1231I8648B6324J37374o8989
$$ -32966 68662 1060 154949 85713 21279 -139434 -21231 98648 26324 163698 94709
15366I4709P8929i6836M7796C50179a46208d3620B84253j00058C6334d2111B2891
$$ 94709 173638 -96836 -49040 350179 -146208 -43620 284253 184195 36334 -42111 22891
15354A55809a01358m133b3322C3482a79747Q421c2511G1693g1888a8034n9728
$$ 155809 -101358 -105491 -23322 33482 -179747 -171326 -32511 71693 -71888 -18034 -77762
15343g7762O257k01703a09205B84676E291K16816a06245B38766a42784l3327B45493
$$ -77762 -71505 -273208 -109205 284676 5291 222107 -106245 238766 -142784 -176111 245493
15331e4219B66902e3371A87775R1578A20413a44931L6403L4001a8427k38757A28286
$$ -54219 266902 -53371 187775 279353 120413 -144931 -108528 -74527 -18427 -257184 128286
15319C11468E2028R0771a83902P7424G3683J3462Q7099a23160d4231q834A59534
$$ 311468 52028 142799 -183902 -106478 73683 87145 174244 -123160 -44231 -53065 159534
15307B84801j18145i3278f195B60485p4704B6089b1442A12637D2725c11287C56425
$$ 284801 166656 -93278 -6195 260485 185781 26089 -21442 112637 42725 -311287 356425
15295d9436D1006A0221a05700J8569d0048G2725g0096A14532Q0197J92272H7672
$$ -49436 41006 10221 -105700 -87131 -40048 72725 -70096 114532 194729 387001 87672
15283A14270b66461L7107A4165Q6358D3875L64840E3667d5736J2153j50527A38305
$$ 114270 -266461 -229354 14165 100523 43875 408715 53667 -45736 -33583 -184110 138305
15271C57027C3103N1288a18951C89988f6209G2303J21448d7997A75347f045j79326
$$ 357027 33103 84391 -118951 389988 -66209 72303 193751 -47997 175347 -6045 -185371
15260a85371f9631A18102O6276p6570m0270K61282m1838j00021a234C76842N70623
$$ -185371 -69631 118102 184378 107808 67538 328820 286982 186961 -1234 376842 947465
15249I47465M12622n73710L48169J6585k95726C5260M6826Q0352D790M5857j5981
$$ 947465 1360087 786377 1134546 1151131 855405 35260 82086 162438 4790 50647 34666
15238C4666A644h9048B88576J3184r0560D4061J74699p043J03362C9288M0881
$$ 34666 1644 -89048 288576 301760 211200 44061 218760 211717 315079 39288 80169
15227H0169J29607d9257H5653b87856D0170a94374M8928P477a4256E2440a39174
$$ 80169 209776 -49257 85653 -287856 40170 -194374 -145446 -137969 -14256 52440 -139174
15215a18314j35839B21144a28343p343K1714B0852M47508A83503L36682b01903
$$ -118314 -254153 221144 -128343 -135686 -113972 20852 468360 183503 520185 -201903
15204f5919A79912m9700a94557e548A56458h7219H6623L6079b2499A20470J45791
$$ -65919 179912 130212 -194557 -5548 156458 -87219 86623 122702 -22499 120470 266261
15193B66261r3094K46308B7370K7496O2833c49060B0007J6028L4325a37814G0217
$$ 266261 173167 419475 27370 54866 117699 -349060 20007 36035 70360 -137814 70217
15181A18963D9923J23044C8269a81088r0310d7544p2849C66128A10122O0867H617
$$ 118963 49923 172967 38269 -181088 -271398 -47544 -120393 366128 110122 170989 8617
15169E124J96940h208j23047J2942I6763J72654a92031B16822n7008A8681c7956
$$ 5124 202064 -8208 -131255 -118313 96763 269417 -192031 216822 159814 18681 -37956
15157g3441B83362I6306C0160a39837C63685E7235K02054d405A21789l0119m3620
$$ -73441 283362 96306 30160 -139837 363685 57235 259289 -4405 121789 91670 48050
15146D8050J64810F1652K01283J6077n5474m528G6390k3099J72702r5841j1178
$$ 48050 212860 61652 262935 279012 223538 219010 76390 53291 225993 130152 118974
15135A18974Q9073M24380A36113D3883J04395L9947a89567A90107N4580o6094
$$ 118974 208047 632427 136113 43883 148278 188225 -189567 190107 244687 178593
15125A78593l8521m1868h3403C9200Q6924B8095a25833B70101A14857j6788a65282
$$ 178593 140072 98204 -83403 39200 126124 28095 -125833 270101 114857 98069 -165282
15113A57991b65891B33944f3204B87367i4671H7390f1281E9571B4335O5525Q7871
$$ 157991 -265891 233944 -63204 287367 -94671 87390 -61281 59571 24335 89860 177731
15102A77731F3887L37429j30052A34704a72985d1296m742m6519b2292C06900I7694
$$ 177731 63887 401316 271264 134704 -172985 -41296 -46038 -92557 -22292 306900 97694
15090D1291K71958R5502h5559D5086N4390K21840H1704M2804K1130f2876I1009
$$ 41291 313249 408751 -85559 45086 99476 321316 81704 124508 145638 -62876 91009
15078C11846r2558C6698J39003J16128A15270H055h4594B20658k1831J56302I3636
$$ 311846 219288 36698 175701 291829 115270 8055 -84594 220658 198827 355129 93636
15066B39463I7654i2819G5500J90841a34976D14335e9359B20853e7413D81647
$$ 239463 97654 -92819 75500 266341 -134976 414335 -59359 220853 -57413 481647
15055A24994J83076J23288a69739A73344a21791B5862K81901J03799G0024A1002
$$ 124994 308070 431358 -169739 173344 -121791 25862 307763 411562 70024 11002
15044C29222A48652L102F8802M0917A2229O0240k4034J04149J69526a65305A73841
$$ 329222 148652 151754 68802 109719 12229 72469 48435 152584 322110 -165305 173841
15032A98972r1358J05411k9878F5070K1297i8875B22999l6900l1749m1611J93890
$$ 198972 107614 213025 183147 65070 86367 -98875 222999 186099 154350 112739 306629
15021C06629j49603K94433C0285N013M1465L27906A88520J57945n6818J52434
$$ 306629 157026 451459 30285 35298 76763 404669 188520 346465 289647 442081
15011D42081G2767K70164k4796j34546o7933L82809B30548H602K73978q1894K38552
$$ 442081 72767 342931 318135 183589 115656 498465 230548 8602 282580 200686 439238
15000D39238c44302B45640Q5801F4734B1886M18871C4413K06151L3036p8385F7196
$$ 439238 -344302 245640 331441 64734 21886 440757 34413 240564 273600 195215 67196
14988B42090P5950L5667j58348M354J49910j65090F3363A2327a08692A70217M5931
$$ 242090 318040 353707 195359 199713 349623 184533 63363 12327 -108692 170217 216148
14977B16148P2593A34744J10635N1565K6484m1275e9989p5695D32555A99212C8543
$$ 216148 288741 134744 245379 296944 323428 282153 -59989 -135684 432555 199212 38543
14965b1974I2025L26203a57877B11799K09011P4415k40811C0479J12815L11087
$$ -21974 92025 418228 -157877 211799 420810 495225 254414 30479 143294 454381
14955D54381L1811A25142J60092l4603O2615L1813c1294A16653J89782j48709
$$ 454381 486192 125142 285234 250631 313246 345059 -31294 116653 306435 157726
14945A57726P4134E554L7522K62644j38091F2281K99066j37824J59921A69825
$$ 157726 231860 5554 43076 305720 167629 62281 361347 223523 383444 169825
14934H1169L66800M742j46841J5336K33181B51370b6739B90754K56577k26761
$$ 81169 447969 452711 305870 321206 554387 251370 -26739 290754 547331 320570
14924C20570q2101M4656i4114P027E04473B51838K5017J70196A3051K04675J95751
$$ 320570 238469 283125 -94114 -87087 504473 251838 276855 447051 13051 217726 413477
14913D13477A03211K63495J23196k28272p3748E8808M94717j21981M3561r2097
$$ 413477 103211 366706 489902 261630 187882 58808 553525 431544 475105 383008
14903C83008j8813N7513J11776M064q5291I3089K48075A60601J95671P257G5878
$$ 383008 364195 421708 533484 537548 452257 93089 341164 160601 356272 363529 75878
14891C00049j4150O2719h4310A09326K11385m5575J98393j92517n7966K87302
$$ 300049 285899 348618 -84310 109326 320711 275136 473529 281012 223046 510348
14881E10348A09608J66455M39957C18051A8297N27182k9150r2131m2785J4479
$$ 510348 109608 276063 716020 318051 18297 545479 516329 424198 381413 395892
14871C95892a9871B91143J47304j12239N2732A24745N5493p2019K14129P5249
$$ 395892 -19871 291143 438447 326208 378940 124745 180238 108219 322348 397597
14861C97597K08976k053J13271k93180Q9550B20036J14418l3892q5550J8418L0194
$$ 397597 606573 604520 717791 424611 514161 220036 334454 300562 215012 233430 263624
14850B63624R9882A71337L01878k36260o7526N8786M79532j65059j51931M2120
$$ 263624 363506 171337 473215 236955 169429 228215 707747 542688 390757 432877
14840D32877J48913B45184J40816J36762B56909O38804C07592j14516J73692J34994
$$ 432877 581790 245184 386000 522762 256909 895713 307592 193076 366768 501762
14830E01762o2396P7116J51379j73353j2265n9850K1750A25625L02161P0305Q8342
$$ 501762 439366 516482 667861 494508 482243 422393 444143 125625 427786 498091 586433
14819E86433k38806L92221k64112p8790K72627C24355J54818L5264o7888J73833
$$ 586433 347627 739848 475736 396946 669573 324355 479173 514437 446549 620382
14809F20382j11736j02875j30927k6916J30391K64676B97509K53459R5418B87676
$$ 620382 508646 405771 274844 247928 378319 642995 297509 550968 646386 287676
14798E83934O6464j01719n7592J68602p61j9488j8963r4211j18127N72768D63448
$$ 583934 650398 548679 491087 659689 658928 639440 620477 526266 408139 980907 463448
14786A89113M96950j099J62522j81307m9162B72051R3829O459K29210r1277P3851
$$ 189113 686063 684964 847486 666179 617017 272051 365880 372339 601549 510272 584123
14775E84123J12320L8140A94345N09114j50003O5671j14486M2596K89671j64967
$$ 584123 696443 734583 194345 703459 553456 619127 504641 547237 836908 671941
14765F71941l8643o5913k7406M778K978J79977k41874K73538j72788Q2982M23085
$$ 671941 633298 567385 539979 544757 547735 727712 485838 759376 586588 669570 1092655
14754A092655j28303l45952J17173k11463K77017k93113J70945L05406l26365
$$ 1092655 964352 618400 735573 524110 801127 508014 678959 984365 658000
14745F58000J5898N818r1658J43294J58786J37572j96168l22382L98506j25409
$$ 658000 673898 679716 588058 731352 890138 1027710 831542 509160 907666 782257
14735G82257k09072m1355K591J56501J29708K63454m90445J47698j15905K32611
$$ 782257 573185 531830 534421 690922 820630 1084084 593639 741337 625432 858043
14725H58043N190J16260j66075j65261R4059k722M41911k59676j53572O5172R9435
$$ 858043 863233 979493 813418 648157 742216 739494 1181405 921729 768157 833329 932764
14714I32764r6631J14842k32220r5594l5120M97976j61052j50196J96791j88161
$$ 932764 836133 950975 718755 623161 588041 1086017 924965 774769 971560 783399
14704G83399L99516m24217J40808L1548k24083K23199J32934j76981K6031q8463
$$ 783399 1182915 758698 899506 931054 706971 930170 1063104 886123 912154 823691
14694H23691M07588C39783P05183K82637j20268n54439O00748n50648K49583J36911
$$ 823691 1231279 339783 1044966 1327603 1207335 652896 1253644 702996 952579 1089490
14684A089490O4425l69050L14772l18066p7693O6244M9402K74201L5322l48564
$$ 1089490 1153915 784865 1099637 781571 703878 770122 819524 1093725 1129047 780483
14674G80483K81218j93125R8833K95562j30076k96585J85875R41R4103j72266
$$ 780483 1061701 868576 967409 1262971 1132895 836310 1022185 1023126 1117229 944963
14664I44963J55876J09337J2817L1125j75232N06026m18972k87803R4066K36912
$$ 944963 1100839 1210176 1222993 1254118 1078886 1584912 1165940 878137 972203 1209115
14654A209115N7068k48848L34462j28982p6381j02705M3624J12894l53173J06803
$$ 1209115 1266183 1017335 1351797 1222815 1146434 1043729 1087353 1200247 847074 953877
14644I53877K81917J46791m14256L54900k12296L65535R1552k63775J29431J27676
$$ 953877 1235794 1382585 968329 1323229 1110933 1476468 1568020 1304245 1433676 1561352
14634A561352l6849J30727m29773n7161J97276k8334P1772J33400j53952j5188
$$ 1561352 1524503 1655230 1225457 1168296 1365572 1337238 1409010 1542410 1388458 1373270
14624A373270p2654k27903M50973N552K38670o39701K92790j06556L18533m57779
$$ 1373270 1300616 1072713 1523686 1529238 1767908 1128207 1420997 1314441 1632974 1175195
14614A175195L6428L94894k31701J27631J61624k66911M6538J61330K01178K49302
$$ 1175195 1211623 1606517 1374816 1502447 1664071 1397160 1443698 1605028 1806206 2055508
14604B055508l66545R1655K02355l10701O51820n42309k37465L23578P5090n88012
$$ 2055508 1688963 1780618 1982973 1672272 2324092 1781783 1544318 1867896 1942986 1354974
14594A354974M89956j00250P7703K38905m04392K3501q5144N01623k03289k5195
$$ 1354974 1844930 1744680 1822383 2061288 1656896 1680397 1595253 2096876 1893587 1868392
14584A868392K01227P0394k15833o0032J95952j34769J412J52987K2750J71972
$$ 1868392 2069619 2140013 1924180 1864148 2060100 1925331 1926743 2079730 2102480 2274452
14574B274452J32608l25405J39400m397M0074K9505j87661J50842N05401m06279
$$ 2274452 2407060 2081655 2221055 2216658 2256732 2286237 2098576 2249418 2754819 2348540
14564B348540K04403j25270K91399J06951K26075l90623M54773j64913r5198N28117
$$ 2348540 2552943 2427673 2719072 2826023 3052098 2661475 3116248 2951335 2856137 3384254
14554C384254O47948J2222J44040Q22285J055000K106811M450227R498548K0067209
$$ 3384254 4032202 4044424 4188464 5010749 6065749 8172560 12622787 22121335 42188544
14545D2188544M940286B0565203H699111l783807j839954m57496m60209o6367
$$ 42188544 47128830 20565203 8699111 4915304 3075350 2617854 2157645 2091278
14537B091278J69742n49353K68395J37520p7868L99060l88464J90952l6426j34982
$$ 2091278 2261020 1711667 1980062 2117582 2039714 2438774 2050310 2241262 2204836 2069854
14527B069854O73834l70346J33106j11054R8348j25454L91080m2020j09525p7668
$$ 2069854 2743688 2373342 2506448 2395394 2493742 2368288 2759368 2717348 2607823 2530155
14517B530155J99717j33674J82253o5540M25183n36290P0727L68601p7388J02831
$$ 2530155 2729872 2596198 2778451 2712911 3138094 2601804 2672531 3041132 2963744 3066575
14507C066575n72320M31464J29925J1345m2129J92775k9611J98419k02874K98358
$$ 3066575 2494255 2925719 3055644 3066989 3024860 3217635 3188024 3386443 3183569 3481927
14497C481927k9778k43743K80906N1527j69987N7250L88254j6225j36548J39457
$$ 3481927 3452149 3208406 3489312 3540839 3370852 3428102 3816356 3800131 3663583 3803040
14487C803040l25331N81477j28886P3763j50027K37831P1401p6899J36477j67428
$$ 3803040 3477709 4059186 3930300 4004063 3854036 4091867 4163268 4086369 4222846 4055418
14477D055418K31476l65750L77950K61422p7731j10664K16830J60244J00488l07478
$$ 4055418 4286894 3921144 4299094 4560516 4482785 4372121 4588951 4749195 4849683 4542205
14467D542205L12692K5331m93612L89127j36388L22331q9319K05660k69168K31385
$$ 4542205 4854897 4880228 4386616 4775743 4639355 4961686 4872367 5078027 4808859 5040244
14457E040244l5628L71910p0900K363L05654j36035L8467L867K56415p3202L93548
$$ 5040244 5004616 5376526 5305626 5307989 5613643 5477608 5516075 5519942 5776357 5703155 6096703
14446F096703k59042L3339K84196j01133J7900J26995L28244O2574O3487l2698
$$ 6096703 5837661 5871000 6155196 6054063 6071963 6198958 6527202 6589776 6653263 6620565
14436F620565L4860J73209J1485J80055J76242k56344O9795M93308k07320J01927
$$ 6620565 6655425 6828634 6840119 7020174 7196416 6940072 7009867 7503175 7295855 7397782
14426G397782j28106L85561k146R1195N75240J40437k82931j44194L84923J96249
$$ 7397782 7269676 7655237 7653091 7744286 8319526 8459963 8177032 8032838 8417761 8614010
14416H614010K23447j15285J40852K09682J3380K78512M41608J94026j98972L14392
$$ 8614010 8837457 8722172 8863024 9072706 9086086 9364598 9806206 10000232 9801260 10115652
14406A0115652O3814j41788M13507J25655J30880K59796j9103K15911J45565N20868
$$ 10115652 10179466 10037678 10451185 10576840 10707720 10967516 10948413 11164324 11309889 11830757
14396A1830757k15058K96466M12529J06095J61434L96118r5162L00554K27068
$$ 11830757 11615699 11912165 12324694 12430789 12592223 12988341 12893179 13193733 13420801
14387A3420801O5288O59263m4993N16302J04581J6214J96027J30625O14792J73362
$$ 13420801 13486089 14145352 14100359 14616661 14721242 14737456 14933483 15064108 15678900 15852262
14377A5852262N70378K41582J70776N82188J39909K45950O09343K63189P17993
$$ 15852262 16422640 16664222 16834998 17417186 17557095 17803045 18412388 18675577 19393570
14368A9393570J65801O39125K93484Q7214Q85853K62127N42176L79413R94889
$$ 19393570 19559371 20198496 20491980 20579194 21465047 21727174 22269350 22648763 23643652
14359B3643652J55267Q22612J93620O27716N84852P97211M95071L92104O66480
$$ 23643652 23798919 24621531 24815151 25442867 26027719 26824930 27320001 27712105 28378585
14350B8378585P98079P47351Q27649R69461O17048J071258O47020O60890J226763
$$ 28378585 29176664 29924015 30751664 31721125 32338173 33409431 34056451 34717341 35944104
14341C5944104J039497P40433J436239P73502J128835J280156J126407J688785
$$ 35944104 36983601 37724034 39160273 39933775 41062610 42342766 43469173 45157958
14333D5157958J231568J368502J279352J579047J572185J825647J936422J566672
$$ 45157958 46389526 47758028 49037380 50616427 52188612 54014259 55950681 57517353
14325E7517353J969971J703755K187623K227368K134108K806845K435416K113950
$$ 57517353 59487324 61191079 63378702 65606070 67740178 70547023 72982439 75096389
14317G5096389L092917K986794L092442L125957L252667L930837M065562L792542
$$ 75096389 78189306 81176100 84268542 87394499 90647166 94578003 98643565 102436107
14309A02436107M339025M600859M542102N105712N322118N476008O222246O221726
$$ 102436107 106775132 111375991 115918093 121023805 126345923 131821931 138044177 144265903
14301A44265903O604388P351783P518234P749701Q305072Q976567R655212J0097501
$$ 144265903 150870291 158222074 165740308 173490009 181795081 190771648 200426860 210524361
14293B10524361R968055J1385928J1316531J2233215J2884633J3068316J3393329
$$ 210524361 220492416 231878344 243194875 255428090 268312723 281381039 294774368
14286B94774368J3734526J4710197J4888343J4841225J4623559J5123536J4518607
$$ 294774368 308508894 323219091 338107434 352948659 367572218 382695754 397214361
14279C97214361J4018163J3598008J2578270J1405987R773902O655213M157041
$$ 397214361 411232524 424830532 437408802 448814789 458588691 465243904 469400945
14272D69400945J781259L68598k163085j417660l358497m857620p209701r239221
$$ 469400945 471182204 471550802 469387717 467970057 464611560 459753940 452544239 443305018
14264D43305018j0449860j2242849j4185791j4578413j5277525j5785709j5636245
$$ 443305018 432855158 420612309 406426518 391848105 376570580 360784871 345148626
14257C45148626j5882910j4398021j4859221j4200036j4009201j3199158j2554843
$$ 345148626 329265716 314867695 300008474 285808438 271799237 258600079 246045236
14250B46045236j2153061j1249913j0859420j0052757r974933q993877q419674
$$ 246045236 233892175 222642262 211782842 201730085 191755152 182761275 174341601
14243A74341601q025910p858376p219626p294149n936301n961701n281906n262012
$$ 174341601 166315691 158457315 151237689 143943540 138007239 132045538 126763632 121501620
14235A21501620n543512m860790m574455m109997l722591l869292l765518l559261
$$ 121501620 115958108 111097318 106522863 102412866 98690275 94820983 91055465 87496204
14227H7496204l444969l460481k554194l032742k717350k548982k126847k338878
$$ 87496204 84051235 80590754 78036560 75003818 72286468 69737486 67610639 65271761
14219F5271761j840753k441856k011012k265542j332017j640435r69582k060352
$$ 65271761 63431008 60989152 58978140 56712598 55380581 53740146 52770564 50710212
14211E0710212j579611j701099j281360j061212p00861j291087j455752j519207
$$ 50710212 49130601 47429502 46148142 45086930 44386069 43094982 41639230 40120023
14203D0120023r28360j007985q74627j147270m86106j372012q86539m61427j015181
$$ 40120023 39191663 38183678 37309051 36161781 35675675 34303663 33417124 32955697 31940516
14194C1940516r34377m22296r65881n61136j067068p08170l63102o77112m89331
$$ 31940516 31006139 30583843 29617962 29056826 27989758 27281588 26918486 26241374 25752043
14185B5752043o84353q10143J13050p84516o50538k71591n91323n53478n13932
$$ 25752043 25067690 24257547 24370597 23586081 22935543 22663952 22072629 21519151 21005219
14176B1005219J53903p76799o10413k21184j22163o35380k38628m04058l76501
$$ 21005219 21159122 20382323 19771910 19550726 19428563 18793183 18554555 18150497 17773996
14167A7773996q8665m70633k68037m07257j69940m28854n8714l46186n33025J05812
$$ 17773996 17685331 17214698 16946661 16539404 16369464 15940610 15881896 15535710 15002685 15108497
14157A5108497k51503j45776k20732m97807k89025J71051l71873m16528l38614
$$ 15108497 14856994 14711218 14490486 13992679 13703654 13874705 13502832 13086304 12747690
14148A2747690K24756k76331m07729j19634M2071p53472L68397m16672Q5900l74129
$$ 12747690 12972446 12696115 12288386 12168752 12210823 11457351 11825748 11409076 11494976 11120847
14138A1120847j46574l22578j7291j72911m64867j79847J91210l84968r0615o1641
$$ 11120847 10974273 10651695 10634404 10461493 9996626 9816779 10007989 9623021 9532406 9470765
14128I470765O1850l45048J81303l91116q4270r2918L0742l77373k4987L3624
$$ 9470765 9532615 9187567 9368870 8977754 8893484 8800566 8831308 8453935 8428948 8462572
14118H462572l38320l40473J31239k6295j02847j11663j92636j84753k12822R3326
$$ 8462572 8124252 7783779 7915018 7888723 7785876 7674213 7481577 7296824 7084002 7177328
14108G177328K73612m27525p814l29289L19141m16458K22915l19406K8301k79306
$$ 7177328 7450940 7023415 7015601 6686312 7005453 6588995 6811910 6492504 6520805 6241499
14098F241499k59328N69750p76648O34587k38379k0805m97492L95260l65769P3205
$$ 6241499 5982171 6551921 5775273 6409860 6171481 6150676 5653184 6048444 5682675 5755880
14088E755880k03337q3825J98748Q0754n55938M29174j94812j34465o3637K39489
$$ 5755880 5552543 5468718 5667466 5748220 5192282 5621456 5426644 5292179 5228542 5468031
14078E468031k75108j2320k32885o6364J49041J31361n83615q327M29435n86154
$$ 5468031 5192923 5180603 4947718 4881354 5030395 5161756 4578141 4569814 4999249 4413095
14068D413095K68193j3238P3309j21081k47448K01033l80191J72821j18448J30148
$$ 4413095 4681288 4668050 4741359 4620278 4372830 4573863 4193672 4366493 4248045 4378193
14058D378193m6853J5277j42644p4804p1154N4883l87498J1077K2167n1958L1136
$$ 4378193 4331340 4346617 4203973 4129169 4058015 4112898 3725400 3736477 3758644 3706686 3737822
14047C737822O3402k30781L16472k52342j01401K37835j29370J09437l31594q2039
$$ 3737822 3801224 3570443 3886915 3634573 3533172 3771007 3641637 3751074 3419480 3337441
14037C337441M63156r81929M60218L8870l4213m7996K93980l24800P0192M272
$$ 3337441 3800597 2818668 3278886 3317756 3283543 3235547 3529527 3204727 3274919 3279191
14027C279191k82810q2368L95802k63661j11225j187Q4006j24115L3102k5765
$$ 3279191 2996381 2914013 3309815 3046154 2934929 2933742 3017748 2893633 2926735 2900970
14017B900970k87660R8539P3391j09096J10793j13239J94000l06604m9997K82052
$$ 2900970 2613310 2711849 2785240 2676144 2786937 2673698 2867698 2561094 2511097 2793149
14007B793149k97832r3787K8296J6602k47782J6865o0285K63033k0510K2548k24612
$$ 2793149 2495317 2401530 2429826 2446428 2198646 2215511 2155226 2418259 2397749 2420297 2195685
13996B195685j74850K64127J00228k8114J10748J87462J40526J520761K508976
$$ 2195685 2020835 2284962 2385190 2357076 2467824 2655286 2795812 4316573 6825549
13987F825549P122581J9058718J5246666k0623406j3402988n587629k184397j262519
$$ 6825549 13948130 33006848 48253514 27630108 14227120 8639491 6455094 5192575
13979E192575q37158o62533J8246l51442l54331K80698P6664q17975M83051l58323
$$ 5192575 4355417 3692884 3711130 3359688 3005357 3286055 3362719 2544744 3027795 2669472
13969B669472Q907j7626k19808M31577l38012J27086r0636Q8492n50350L19232
$$ 2669472 2678379 2660753 2440945 2872522 2534510 2661596 2570960 2659452 2109102 2428334
13959B428334N334j19014j39004L28945n47254M6527K11924J59282k74077j7684
$$ 2428334 2433668 2314654 2175650 2504595 1957341 2003868 2215792 2375074 2100997 2083313
13949B083313j25723J39562m3003o7915j18424j51780N70120K35982n34227q3483
$$ 2083313 1957590 2097152 2054149 1986234 1867810 1716030 2286150 2522132 1987905 1904422
13939A904422O1150l04348K77299k07678K34241j8293j26225j76229J89370K36950
$$ 1904422 1965572 1661224 1938523 1730845 1965086 1946793 1820568 1644339 1833709 2070659
13929B070659o25388K05601J36301j6369j46699j96028K26424o0543K22429n5562
$$ 2070659 1445271 1650872 1787173 1770804 1624105 1428077 1654501 1593958 1816387 1760825
13919A760825L0954j26411r0501J09025j04924M5304M24622j89337j83701p8075
$$ 1760825 1791779 1665368 1574867 1683892 1578968 1624272 2048894 1859557 1675856 1597781
13909A597781K45860L7041j33639l18926q726j95421K35729k78340O21441k74049
$$ 1597781 1843641 1880682 1747043 1428117 1419391 1223970 1459699 1181359 1802800 1528751
13899A528751j08212j59514j01113K8684L40965k82181K79744j07418J69886j57137
$$ 1528751 1420539 1261025 1159912 1188596 1529561 1247380 1527124 1419706 1589592 1432455
13889A432455J38488l73401L47357j87370l03252M6003L33584k9432O0699j48595
$$ 1432455 1570943 1197542 1544899 1357529 1054277 1100280 1433864 1404432 1465131 1316536
13879A316536o8760j69249J68438O6134L4160m39433P16530n01100J41952o564
$$ 1316536 1247776 1078527 1246965 1313099 1347259 907826 1624356 1123256 1265208 1258644
13869A258644K53601m1191l41637M43837o1490m21353M15224m02244j11380J48900
$$ 1258644 1512245 1471054 1129417 1573254 1511764 1090411 1505635 1103391 992011 1140911
13859A140911M8742j28690L01433j31115k12522M29807j51186m44637K8571j11900
$$ 1140911 1189653 1060963 1362396 1231281 1018759 1448566 1297380 852743 881314 769414
13849G69414M58109k79359J83316k60513L80775O647l74251L47406j29765m6622
$$ 769414 1227523 948164 1131480 870967 1251742 1258389 884138 1231544 1101779 1055157
13839A055157J3586j1558n5676m5346o3039N22258o16364L19942D95204M67108
$$ 1055157 1068743 1057185 1001509 956163 893124 1415382 799018 1118960 495204 962312
13829I62312m1412N461Q0065k17943L18379k35288L04252j04718j32052P9640
$$ 962312 920900 926361 1006426 788483 1106862 871574 1175826 1071108 939056 1018696
13819A018696n08794L18276K88752k22051K44917K1080o0876k02663k26264M26828
$$ 1018696 509902 828178 1116930 894879 1139796 1160876 1100000 897337 671073 1097901
13809A097901k74544R1357k68966L36987j80757L35088m50290L34675j28725K51537
$$ 1097901 823357 914714 645748 982735 801978 1137066 686776 1021451 892726 1144263
13799A144263M9645j36071l85397K94584l01470K73545j75773k2706K94694l43948
$$ 1144263 1193908 1057837 672440 967024 665554 939099 763326 740620 1035314 691366
13789F91366J38674m610N1513k37566L48068l9089j379l12745K01191l17413J90440
$$ 691366 830040 825430 876943 639377 987445 948356 946977 634232 835423 518010 708450
13778G08450o088k31045J80767r8815K76742m5005j08358L00316l79147L09729
$$ 708450 702362 471317 652084 553269 830011 785006 676648 976964 597817 907546
13768I07546j91951J98105k16784J27587j18332J67672j80397P2373k70379K68694
$$ 907546 715595 913700 696916 824503 706171 873843 693446 765819 495440 764134
13758G64134J84311l04844J81575l68459N20202J8708D69592K19049J03752J16208
$$ 764134 948445 643601 825176 456717 976919 995627 469592 688641 792393 908601
13748I08601m26812K62038K5377L0140C00359P41378l97800J25984k15675K39447
$$ 908601 481789 743827 769204 799344 300359 1041737 643937 769921 554246 793693
13738G93693Q4837p5792n9753C55792K40413K26681j89769j42294K3263M43098
$$ 793693 878530 802738 742985 355792 596205 822886 633117 490823 514086 957184
13728I57184m25918O7499L93613m37418K80435J36543H4724J45442L15420J28583
$$ 957184 531266 598765 992378 554960 835395 971938 84724 230166 545586 674169
13718F74169k59688L71971l09189A45756L29438J34643P2059l0378j572n7019
$$ 674169 414481 786452 477263 145756 475194 609837 681896 651518 649946 592927
13708E92927j68005J3768J50977K33514k12894J59328l7661k52772K41846k0402
$$ 592927 424922 438690 589667 823181 610287 769615 731954 479182 721028 700626
13698G00626C38806p2912O62085j29970r9849m3783B24355J6932M10263J33348
$$ 700626 338806 265894 927979 798009 698160 654377 224355 241287 651550 784898
13688G84898J2657j55616J6204k49504J502J46804k14050L71028o2855q0015K44382
$$ 784898 797555 641939 658143 408639 410141 556945 342895 713923 651068 571053 815435
13677H15435k57267J15454k13696J20410m1574k16968O6274K77096B35317L46597
$$ 815435 558168 673622 459926 580336 538762 321794 388068 665164 235317 581914
13667E81914K51495m2509j79121q7821j7220R0249j309k21397K45158K29745l64434
$$ 581914 833409 790900 611779 523958 506738 596987 595678 374281 619439 849184 484750
13656D84750N8550P9037k01612K54138J87073C94131K66949l22891J48533P1011
$$ 484750 543300 622337 420725 674863 861936 394131 661080 338189 486722 557733
13646E57733K07688C33933P4367K4952J58922j24119j52356O59817A01825K35399
$$ 557733 765421 333933 408300 433252 592174 468055 315699 975516 101825 337224
13636C37224n3184K47190k27872M50665O266C40565M29293l68750O3746n431m72
$$ 337224 284040 531230 303358 754023 760289 340565 769858 401108 464854 459423 458951
13625D58951j15923A07116M6651J75120O1843M4254J19368j14664A12923K72944
$$ 458951 343028 107116 153767 328887 390730 434984 554352 439688 112923 385867
13615C85867j74999j639L59018K52253k95161R4948r9389A50086K40975o7617
$$ 385867 210868 209229 568247 820500 525339 620287 520898 150086 391061 323444
13605C23444J23659j2885J93143q2453J21472j39788l0217L35846C55262l9441
$$ 323444 447103 434218 627361 544908 666380 526592 496375 832221 355262 315821
13595C15821m4387J05890J69005j87799J02117r2481J86098O4737B10898Q7917
$$ 315821 271434 377324 546329 358530 460647 368166 554264 619001 210898 298815
13585B98815R3406m5485K65118A46822j5072L5019M5804N1637M9735j39795K18470
$$ 298815 392221 346736 611854 146822 131750 166769 212573 264210 313945 174150 392620
13574C92620j55756J98458J9925j80259Q5524j3309K19930J55486j00061j79632
$$ 392620 236864 435322 455247 274988 360512 347203 567133 722619 622558 442926
13564D42926J75487j82684A29061K81328l0135L0489j04126J07484J15586A96136
$$ 442926 618413 435729 129061 410389 380254 410743 306617 414101 529687 196136
13553A60008J45302j06366J22134n7115A00244K92530P4369p8154N0424K3256
$$ 160008 305310 198944 321078 263963 100244 392774 467143 388989 439413 462669
13543D62669Q9146d6107B46445l3832J42252j19747M38504A57398L7478L21519
$$ 462669 551815 -46107 246445 212613 354865 235118 673622 157398 194876 516395
13533E16395k35668Q5505K18638B28207L44799p6957J45137r4112B60102L708
$$ 516395 280727 366232 584870 228207 573006 496049 641186 547074 260102 263810
13523B63810J68615n2429J00393k32596M23613j22919j00167J5549j07633K4736
$$ 263810 432425 379996 480389 247793 671406 548487 448320 463869 356236 380972
13513C80972D2993O08791A53716K18285J11489J27706A12165L91369j97430J5185
$$ 380972 42993 651784 153716 372001 483490 611196 112165 503534 306104 321289
13503C21289J26799J6481o9815M0228P5514B21778p1022L01967k23013M24781
$$ 321289 448088 464569 394754 434982 510496 221778 150756 452723 229710 654491
13493F54491C07555l68R4505l0379N0344j31496P967J92738A12443L78522k23718
$$ 654491 307555 307187 401692 371313 421657 290161 298128 490866 112443 490965 267247
13482B67247j8869r4560P9027J4508L9529P1393q8224j9192j01447K06569A41001
$$ 267247 248378 153818 232845 247353 286882 358275 270051 250859 149412 355981 141001
13470A32231N0916a19718C35922o21A8290J35605J21998K60500I4775M17561B08715
$$ 132231 183147 -119718 335922 335301 18290 153895 275893 536393 94775 512336 208715
13458A67090Q0180k2653K26923j66454q5900J97110h1436C22707J07649m8206
$$ 167090 247270 224617 451540 285086 199186 396296 -81436 322707 430356 382150
13448C82150j15802K36577J94A95283K48030A61691K39773N2891F630M7472J58295
$$ 382150 266348 502925 503119 195283 443313 161691 401464 454355 6630 54102 212397
13437B12397J31961H1063O2823K5687K55172j0764P6007n9215c8902B22266O8967
$$ 212397 344358 81063 143886 169573 424745 413981 489988 430773 -38902 222266 291233
13426B91233r065A24909J66901l5895J69570G8463L77958a40908D60951j94219
$$ 291233 282168 124909 291810 255915 425485 78463 456421 -140908 460951 266732
13416B66732j17692P8550o7246C6814L5680Q7210n968K0680F7780J48961n5580
$$ 266732 149040 227590 160344 36814 72494 159704 153736 174416 67780 216741 161161
13405A61161M6960j01215f7664B20406A02265J3901J50391j07368N4041p5392
$$ 161161 208121 106906 -67664 220406 102265 116166 266557 159189 213230 137838
13395A37838B3240N09507A42115K7452K2391J03718k1807N5484q3569A4491g1837
$$ 137838 23240 532747 142115 169567 191958 295676 273869 329353 245784 14491 -71837
13383F0008J70710o2565P2959d3561A29804P9393o7680g089C63793r0774j23102
$$ 60008 230718 168153 241112 -43561 129804 209197 141517 -7089 363793 273019 149917
13372A49917J31362J41782j61014E5682K17821J7669r2569p2783J26036M0470
$$ 149917 281279 423061 262047 55682 273503 291172 198603 125820 251856 292326
13362B92326A11662K35119a27314C81713e1228C06561j47127L34795B37053J99807
$$ 292326 111662 346781 -127314 381713 -51228 306561 159434 494229 237053 436860
13352D36860a67348C07294j03155J0774I1685K50450Q0723A77129L18820l3137
$$ 436860 -167348 307294 204139 214913 91685 342135 422858 177129 495949 462812
13342D62812o3508k9512o7843K78523k62796p6308K16584M6074j88835n7128K6617
$$ 462812 399304 369792 301949 580472 317676 241368 457952 504026 315191 258063 284680
13331B84680L18948B13922K21466O1078E2503J94888J58324I7952l6002k0232
$$ 284680 603628 213922 435388 496466 52503 247391 405715 97952 61950 41718
13321D1718L73522k05945G997J3696K62780A38864o144J68136j8618a53522C10034
$$ 41718 415240 209295 7997 21693 284473 138864 132720 300856 282238 -153522 310034
13309A9208L51438M6315E2582K31216o0823K30879a06076d2378A02905R300g5497
$$ 19208 370646 416961 52582 283798 222975 453854 -106076 -42378 102905 112205 -75497
13297A24978J74550n5057p555p9908J39115c4596B40029K67329A63576J75F7903
$$ 124978 299528 244471 236916 157008 296123 -34596 240029 507358 163576 163751 67903
13285f1622G98070C28274j16579d5660C6194i1577A84946D7793J35383P1393a69947
$$ -61622 798070 328274 211695 -45660 36194 -91577 184946 47793 183176 254569 -169947
13273B96057n74p4307K25558j74402A27921j8825O1628b806j64034C76142H7768
$$ 296057 295483 221176 446734 272332 127921 109096 170724 -2806 -166840 376142 87768
13261B01500J18023a94942j5169C25754A37887b3020A11722J67198B748K6222
$$ 201500 319523 -194942 -210111 325754 137887 -23020 111722 278920 2748 28970
13251B8970J92969D9642L1310M4943B1586g7155A27049A3545K40878O6820E2467
$$ 28970 221939 49642 80952 125895 21586 -77155 127049 13545 254423 321243 52467
13239C77626H7134L57271B17012Q3397R145j36180p427D3139C451K79936f638
$$ 377626 87134 444405 217012 300409 309554 173374 165947 43139 3451 283387 -6638
13227i4350A26574i4487G3831B2547J33396J61583i0662G3787K49404D2301J6976
$$ -94350 126574 -94487 73831 22547 155943 317526 -90662 73787 323191 42301 59277
13216E9277L57886F5460J05755p1509K80162C1376b9921B67464A20827a1545j25519
$$ 59277 417163 65460 171215 99706 379868 31376 -29921 267464 120827 -11545 -137064
13205a37064I5856K7418R9589P8832b97107B8657L52057c73888C67879Q4402j38598
$$ -137064 95856 123274 222863 301695 -297107 28657 380714 -373888 367879 452281 313683
13194C13683j04401K4926K59963g0176A96553E2491e0296C30714a03525A45262
$$ 313683 209282 234208 494171 -70176 196553 52491 -50296 330714 -103525 145262
13183B81216E4820R0465M05542g9545j09429O9370A45431o8920J75281K16811
$$ 281216 54820 145285 550827 -79545 -188974 -119604 145431 76511 251792 468603
13173D68603A81004q0190j4207K28487K1280L4434j20381n3200j3154G9550b0747
$$ 468603 181004 100814 86607 315094 336374 370808 250427 197227 184073 79550 -20747
13161A02629n170J87163m296j35153L7783I0420J22360b33777A46903A6557K09571
$$ 102629 97459 284622 280326 145173 182956 90420 212780 -233777 146903 16557 226128
13150B26128I4625P2951d2053j5393B88310A01240a3945A21714a06865H1726J74575
$$ 226128 94625 167576 -42053 -57446 288310 101240 -13945 121714 -106865 81726 256301
13139B56301j06277m9529g8929C27021j28649D1847K34780H0229J4702J89093
$$ 256301 150024 100495 -78929 327021 198372 41847 276627 80229 94931 284024
13129B84024o3088p9688Q2011d7123j29850A67059j7460i4182j14972B31161c13613
$$ 284024 220936 141248 223259 -47123 -176973 167059 149599 -94182 -209154 231161 -313613
13117D40900k09372l9177j8966b05314F2840Q637N4147J61088n9717K13017b8658
$$ 440900 231528 192351 173385 -205314 62840 71477 125624 286712 226995 440012 -28658
13105A18076k1665e8011C07564a89608d5904B32920b52675C94534d6273A81239
$$ 118076 96411 -58011 307564 -189608 -45904 232920 -252675 394534 -46273 181239
13094A80939M0515b65899B04241I3662J3064J01145a85952B19781B7771a88969
$$ 180939 221454 -265899 204241 93662 106726 207871 -185952 219781 27771 -188969
13083A72132M8400l7446g0899B96781A5353a23617A52139M8048M38694A74891
$$ 172132 220532 183086 -70899 296781 15353 -123617 152139 200187 638881 174891
13072A92259e3907j11478K9661K3708p415A98284j3152d4005A60249J65933g1932
$$ 192259 -53907 -165385 -135724 -112016 -119431 198284 185132 -44005 160249 326182 -71932
13060A09413g7466j486A90639B3385R2748a9936p9418A93043o1836J68454n4047
$$ 109413 -77466 -78952 190639 23385 116133 -19936 -99354 193043 131207 299661 245614
13049B45614q1540J14957a53506E5079K03770A02514L746L0147L43944A43066
$$ 245614 164074 279031 -153506 55079 258849 102514 106260 136407 480351 143066
13038C39132a6979j65611k0182B0211M40760j96191A21079l3430L65993k799b18645
$$ 339132 -16979 -182590 -202772 20211 460971 264780 121079 87649 453642 450843 -218645
13026A64352a44889A38235L12499b81406A47027l2502c8768B00629a16125B92054
$$ 164352 -144889 138235 450734 -281406 147027 114525 -38768 200629 -116125 292054
13015A87549a40041B4680K01987L6278a93911A99116K20631A55452j7932Q9197
$$ 187549 -140041 24680 226667 262945 -193911 199116 419747 155452 137520 226717
13005B26717r8857C9220d3912C38280f6271E8380K20111J4420A37292A0123L41199
$$ 226717 127860 39220 -43912 338280 -66271 58380 278491 292911 137292 10123 351322
12994C51322n0788K7884A25761L8468h8263m2978B48515N7024F4010j3335g9231
$$ 351322 300534 328418 125761 164229 -88263 -131241 248515 305539 64010 50675 -79231
12982D3309Q5974K17424c51968a8995C57203D3437A904K46966a54440A41292f7275
$$ 43309 129283 346707 -351968 -18995 357203 43437 1904 248870 -154440 141292 -67275
12970a78244O4953j3014A85156E6026J8700K56870A36793K3761a87772E1229J38564
$$ -178244 -113291 -126305 185156 56026 74726 331596 136793 160554 -187772 51229 189793
12959A89793a36294C11110g2863l5226B48124a3466C9188K38239p6702J18844
$$ 189793 -136294 311110 -72863 -108089 248124 -13466 39188 277427 200725 319569
12949C19569H5129B2371a3997D1586a61831P4279j22863p5045a18562J3450H5658
$$ 319569 85129 22371 -13997 41586 -161831 -87552 -210415 -285460 -118562 -105112 85658
12937A09368L7166a89596j8725G2954A0082N2446N1580M19007A06481i162j99697
$$ 109368 146534 -189596 -208321 72954 10082 62528 114108 533115 106481 -9162 -208859
12926b08859D1499b36600R9372A6524J9521J39724F4712J15831D3726A554J32416
$$ -208859 41499 -236600 -137228 16524 36045 175769 64712 180543 43726 1554 133970
12915A33970C5270J41685p8007a1076A53747c1265h924l35193C0001b09356A39544
$$ 133970 35270 176955 98948 -11076 153747 -31265 -8924 -344117 30001 -209356 139544
12903C13843g7309G4114d4195E769J04638a11429I4996j933l8191L42743A18224
$$ 313843 -77309 74114 -44195 5769 110407 -111429 94996 93063 54872 397615 118224
12891G5861a32715C52792j50026m9274f3527E7270a8217A9496N9892B3744h7077
$$ 75861 -132715 352792 202766 153492 -63527 57270 -18217 19496 79388 23744 -87077
12879B473K52418R4861A63053G4806J384K1528J24359C4958M1826g0057B55826
$$ 2473 254891 349752 163053 74806 76190 97718 222077 34958 76784 -70057 255826
12867A45231C8270M2517M8491E1893B3607E806J1568h339q3122C18288b61406
$$ 145231 38270 80787 129278 51893 23607 5806 17374 -8339 -91461 318288 -261406
12855D9313O5376m4647a30075j74994g2378l3355A22077K1024A8889N0944P2552
$$ 49313 114689 70042 -130075 -305069 -72378 -105733 122077 143101 18889 69833 142385
12844A42385E7620Q0733J20308j5133p5913I24J57455A8606d8391I325Q2540h0895
$$ 142385 57620 138353 258661 243528 167615 924 158379 18606 -48391 9325 91865 -80895
12831B828n08J54709K22883r9666a22100k91813C4043L4196A0784M5796b33251
$$ 2828 2320 157029 379912 280246 -122100 -413913 34043 68239 10784 56580 -233251
12819A15655J3023K38337j26624D8166A1713O3395P7572b82779B07879a35752
$$ 115655 128678 367015 240391 48166 11713 75108 152680 -282779 207879 -135752
12808D8666L1770L9428c6524A77267a17975B07123r5571D4939m597h5532n8014
$$ 48666 80436 119864 -36524 177267 -117975 207123 111552 44939 40342 -85532 -143546
12797a43546D6362Q2184O3254c31631H1517a0402p4315n5794D0378L4r233K1200
$$ -143546 46362 128546 191800 -331631 81517 -10402 -84717 -140511 40378 40412 31179 52379
12785E2379g2424B37511r425p3163K2870a4117C70749A10447a40280A80834a69406
$$ 52379 -72424 237511 228086 154923 177793 -14117 370749 110447 -140280 180834 -169406
12773I9718i1341C3016L73774I1758k7563h7474F187O355J62395k4532f5069B9511
$$ 99718 -91341 33016 406790 91758 64195 -87474 6187 12542 174937 150405 -65069 29511
12760B61995d5985A01114e9300k01003L8737G0546f5315M248A32183a76294B6541
$$ 261995 -45985 101114 -59300 -260303 -221566 70546 -65315 -61067 132183 -176294 26541
12748a0519B78180B8743P8913a65506A95224B6504g184B47301k4136a23994C40292
$$ -10519 278180 28743 107656 -165506 195224 26504 -7184 247301 223165 -123994 340292
12736B21310J31949F7091b1801A49829G564Q5592J0578N2399M6334r1128J28931
$$ 221310 353259 67091 -21801 149829 7564 93156 103734 156133 202467 111339 240270
12725B40270c3931j61099e6166A7325b52308J18262j10642B86912d7505A64963
$$ 240270 -33931 -195030 -56166 17325 -252308 -134046 -244688 286912 -47505 164963
12714B4985K72931a37103B93700n9236E72J31717L55536B29277D7933K74814F6642
$$ 24985 297916 -137103 293700 234464 572 132289 487825 229277 47933 322747 66642
12702A05843b34345C23375J68232B16625L4114J12531J50890A62926a25699B65454
$$ 105843 -234345 323375 491607 216625 250739 363270 514160 162926 -125699 265454
12691b64740C3827i0843A13334B3917a10528q1718H6031J92445a6295k47844A66076
$$ -264740 33827 -90843 113334 23917 -110528 -192246 86031 278476 -16295 -264139 166076
12679C84910e885C23794a81049A17238d8120A93064J45834A08799K38699a64147
$$ 384910 -5885 323794 -181049 117238 -48120 193064 338898 108799 347498 -164147
12668a27284A20866E9381J19722H1392J8081P0670e6839j24491F4276a49916B75639
$$ -127284 120866 59381 179103 81392 99473 170143 -56839 -181330 64276 -149916 275639
12656A75494F2323J34180D3905d8059J7618B70518A00527a9647r1065A61595j4424
$$ 175494 62323 196503 43905 -48059 -30441 270518 100527 -19647 -110712 161595 147171
12645A47171d7966A90124f4121A83782R658l1106J16290E6605P6586m2735f0791
$$ 147171 -47966 190124 -64121 183782 193440 162334 278624 56605 133191 90456 -60791
12633A7838K57116D968K32145a88853B15434c7750a402H947K4178P9431R9771
$$ 17838 274954 4968 237113 -188853 215434 -37750 -1402 8947 33125 112556 212327
12622B12327j8945a23908F2957L0315a92490Q3607L0058j59040F9822k8164d52250
$$ 212327 193382 -123908 62957 93272 -192490 -108883 -78825 -237865 69822 41658 -452250
12610d3111B23507e954p1664E872a86591r9350A33695l5454J16653f583j26633
$$ -43111 223507 -5954 -77618 5872 -186591 -285941 133695 98241 214894 -6583 -133216
12599a33216B40247c1764A46807R8481F8449a90096c6111A4466J31098B8225K4862
$$ -133216 240247 -31764 146807 245288 68449 -190096 -36111 14466 145564 28225 53087
12588E3087G251J76994E0473a30064J5346A88034a15950M9994j69299C674Q9860
$$ 53087 7251 184245 50473 -130064 -114718 188034 -115950 -65956 -235255 3674 93534
12577I3534Q8458E3750L20218d0973k32374B23904d4571G8865b9563B21459Q3374
$$ 93534 181992 53750 373968 -40973 -273347 223904 -44571 78865 -29563 221459 304833
12566C04833j42462D2709L82382A04971K00330H6880b87291a17182B02389i3898
$$ 304833 162371 42709 425091 104971 305301 86880 -287291 -117182 202389 -93898
12555I2597Q9799J54437b85608J27898c9155A83872b24547O0571q8488m0977A64812
$$ 92597 182396 336833 -285608 -157710 -39155 183872 -224547 -163976 -252464 -293441 164812
12543B45254c44056A26071a11343B8060g451A0765b98017g2343j68160D205b3080
$$ 245254 -344056 126071 -111343 28060 -7451 10765 -298017 -72343 -240503 4205 -23080
12531f9596B66028J19468J8003A47711O9400F1899b3603B82447D4123M8715i4
$$ -69596 266028 385496 403499 147711 217111 61899 -23603 282447 44123 92838 -94
12519i9961j29551A90268K4735G8053a25955j9331f1645n2272m869A38241A0559
$$ -99961 -229512 190268 215003 78053 -125955 -145286 -61645 -113917 -118786 138241 10559
12507B6715a37306J4594C7679L0160k9554a24835C3584R6650m8725A2847c10627
$$ 26715 -137306 -122712 37679 67839 38285 -124835 33584 130234 81509 12847 -310627
12495a46593j27535D61240B4304r700J79962a01796r1407d4867A3483h6821B43158
$$ -146593 -274128 461240 24304 14604 194566 -101796 -193203 -44867 13483 -86821 243158
12483C93171D8936J95981j20289L6148a99781L395n9612O0350B311M6653e9084
$$ 393171 48936 244917 124628 160776 -199781 -196386 -255998 -195648 2311 48964 -59084
12471a52436C19247A55503L823F3800c27529F8258a26596j51014A53373P5596
$$ -152436 319247 155503 159326 63800 -327529 68258 -126596 -277610 153373 228969
12461B28969a49014B1695b35581K2449A16777b49174C47000D9013A3907J44214
$$ 228969 -149014 21695 -235581 -213132 116777 -249174 347000 49013 13907 158121
12451A58121O0350J47808j80760p7704d2744j2937A09001c30154a09176C6705
$$ 158121 218471 366279 185519 107815 -42744 -55681 109001 -330154 -109176 36705
12440A4279c297F7928c3349N33j29677k67781E9898c27244g0141m7923A0761h9219
$$ 14279 -3297 67928 -33349 -32816 -162493 -430274 59898 -327244 -70141 -118064 10761 -89219
12427C50078f03858a19085k3503C20968F4631c0422A04095q769f2233G4915P2727
$$ 350078 -603858 -119085 -142588 320968 64631 -30422 104095 95326 -62233 74915 147642
12416A47642E8731J64810G9154R6327g0928A00074J71214a6606B63248B192J0060
$$ 147642 58731 223541 79154 175481 -70928 100074 271288 -16606 263248 2192 12252
12405A2252c3725I6820h8831q7747b2467B78069h9487C07955c54402E4725a52257
$$ 12252 -33725 96820 -88831 -176578 -22467 278069 -89487 307955 -354402 54725 -152257
12393A02595a90138k8981B46526J38624e3288j21755m5628A3287h808k49755B3988
$$ 102595 -190138 -219119 246526 385150 -53288 -175043 -220671 13287 -8808 -258563 23988
12381i8905L7637F0120M3821i0738A11708a21981e0532D9963J7680d8409A35623
$$ -98905 -61268 60120 103941 -90738 111708 -121981 -50532 49963 67643 -48409 135623
12369b00749L821J2222o294A88811p2142a10562B09279G611a11122J2594I0439
$$ -200749 -196928 -184706 -191000 188811 116669 -110562 209279 7611 -111122 -98528 90439
12357C17887a03430G7674K15906p0684h6168l4336A95751k742a54812A01277L70405
$$ 317887 -103430 77674 293580 222896 -86168 -120504 195751 193009 -154812 101277 471682
12346D71682c0688G1609b4384l0917H8298j5111e789j13114B57661a09933l4365
$$ 471682 -30688 71609 -24384 -55301 88298 73187 -5789 -118903 257661 -109933 -144298
12335a44298G4799M9969l1772f0783j19256a2377A20137R9235f3736A51838c8845
$$ -144298 74799 124768 92996 -60783 -180039 -12377 120137 219372 -63736 151838 -38845
12323h8842l7067A51529c7758D3810a46034c6401j2725r1596A56315F6095R673
$$ -88842 -125909 151529 -37758 43810 -146034 -36401 -49126 -140722 156315 66095 75768
12312G5768g3743C0214L54566c2645J2948A51512c4814C609a79059A57124J31488
$$ 75768 -73743 30214 384780 -32645 -19697 151512 -34814 3609 -179059 157124 288612
12301B88612C2003d3672B01240a8072j34915A12210J36811F2787b5970A46739
$$ 288612 32003 -43672 201240 -18072 -152987 112210 249021 62787 -25970 146739
12290A58877G2123a65497A30640a66643e0791A13018D0909J91630C7202K42745
$$ 158877 72123 -165497 130640 -166643 -50791 113018 40909 232539 37202 279947
12280B79947e5686O904C19156q8432l7078K47802j48563j36812a96429Q4985K8154
$$ 279947 -55686 -48782 319156 230724 193646 441448 292885 156073 -196429 -111444 -83290
12269h3290B32866a81814P0588B65768n2583a34196A92806b68751J19988A09754
$$ -83290 232866 -181814 -111226 265768 213185 -134196 192806 -268751 -148763 109754
12258B4457J73016A2315M076n072J99747f4551K9101k16548D27055b38419C05323
$$ 24457 197473 12315 16391 11319 211066 -64551 -35450 -251998 427055 -238419 305323
12246h8605C37217J10062A57043L21005A83112g4116j2857B63978D8612J9929
$$ -88605 337217 447279 157043 478048 183112 -74116 -86973 263978 48612 68541
12236F8541L95609H9498A6103i2732I4195J9039J243J63274a00354B83M95921
$$ 68541 464150 89498 16103 -92732 94195 113234 114477 277751 -100354 283 496204
12225D96204A17297Q8636J20122A62120R3018A27014k0338h306p0612C37900i4781
$$ 496204 117297 205933 326055 162120 255138 127014 106676 -8306 -78918 337900 -94781
12213b267D29545C1035i5753A99325q1278f3309B70668b4545A32658a79190D67276
$$ -2267 429545 31035 -95753 199325 118047 -63309 270668 -24545 132658 -179190 467276
12201b67325E15181q0397C2377a25699B30829J25545A71726R5246I5388a36301
$$ -267325 515181 434784 32377 -125699 230829 356374 171726 266972 95388 -136301
12190E6092J25501Q6877j12617J6307a21281A42103o1522B4302J02287a43100
$$ 56092 181593 268470 155853 172160 -121281 142103 80581 24302 126589 -143100
12179F8322J41021q3968a4143j04341A50487a29313D41562J7039g7229K8886n0135
$$ 68322 209343 125375 -14143 -118484 150487 -129313 441562 458601 -77229 -48343 -98478
12168i8478G1020R5392H0718h8241c1140C69546f8819C1092f3064C4538J57484
$$ -98478 71020 166412 80718 -88241 -31140 369546 -68819 31092 -63064 34538 192022
12157A92022o0495a05040A58246a40375G2871B3471a3845j61049B38212l8047
$$ 192022 131527 -105040 158246 -140375 72871 23471 -13845 -174894 238212 200165
12147B00165c2701D0742a69911A26543a65967j08561i0832A56551B277J26215
$$ 200165 -32701 40742 -169911 126543 -165967 -274528 -90832 156551 2277 128492
12137A28492m7993a32311N2259n897A66711P4273r4738a42051I8941l7703d6399
$$ 128492 80499 -132311 -80052 -85949 166711 240984 146246 -142051 98941 61238 -46399
12125A86282c9012q3751B36864C7340K43003q9505G3696J00938C9821a6149A2940
$$ 186282 -39012 -122763 236864 37340 280343 190838 73696 174634 39821 -16149 12940
12113B9171b6089B31924g7183B5274R5736a18223G6341a74910n1793r0018G142
$$ 29171 -26089 231924 -77183 25274 121010 -118223 76341 -174910 -226703 -316721 7142
12101d32150b1512k00996A79795g6200l5718b2631k3248p1229C430K38748C7226
$$ -432150 -21512 -222508 179795 -76200 -111918 -22631 -45879 -117108 3430 242178 37226
12089a04500A78680a39338H7459j9459a74291A9889J9467i8380B0179J44815d0904
$$ -104500 178680 -139338 87459 68000 -174291 19889 39356 -98380 20179 164994 -40904
12077A063186J230614j135946C20847n609B7454R7552D3983Q9959m5684c0293
$$ 1063186 2293800 1157854 320847 315238 27454 125006 43983 133942 88258 -30293
12066D40992c7521A57960n4249J9736g9143C9679d2589m2547B9396Q407Q3934
$$ 440992 -37521 157960 103711 123447 -79143 39679 -42589 -85136 29396 37803 121737
12055A21737J05349a1967B9880K23072e2355A29622J2302M4441b15370c9115H8098
$$ 121737 227086 -11967 29880 252952 -52355 129622 141924 186365 -215370 -39115 88098
12043c09121a560A5895b51542i9412k66070J35416Q8460B08521G1713i6532L1666
$$ -309121 -1560 15895 -251542 -99412 -365482 -230066 -141606 208521 71713 -96532 -64866
12032f4866A27472h6498D40116C8718P0464f1838a6003l12154J49077h8396C35198
$$ -64866 127472 -86498 440116 38718 109182 -61838 -16003 -328157 -179080 -88396 335198
12020c6978m4993A17057b03167D06117a46279B968J11421J05263D0311g3103j59723
$$ -36978 -81971 117057 -203167 406117 -146279 2968 114389 219652 40311 -73103 -232826
12009b32826N5325Q4273A9484i0539j61807B50787d8292q5619e2151I8960f4054
$$ -232826 -177501 -93228 19484 -90539 -252346 250787 -48292 -133911 -52151 98960 -64054
11997a37792D46930L9054a09136d7258d453A54066a70749A86004b04878J00362
$$ -137792 446930 485984 -109136 -47258 -4453 154066 -170749 186004 -204878 -104516
11987a04516H2074J50594D2253N6429a02646C7201a42524J4512D7719K50192b95850
$$ -104516 82074 232668 42253 98682 -102646 37201 -142524 -128012 47719 297911 -295850
11975F8119c454j70263A51988f4260g919A84000c5051j81534c351G6188Q958J65602
$$ 68119 -3454 -173717 151988 -64260 -7919 184000 -35051 -216585 -3351 76188 85146 250748
11963B50748F0253b57796G2269d84064A05238O898f9380K2957B7570J53314b31959
$$ 250748 60253 -257796 72269 -484064 105238 112136 -69380 -46423 27570 180884 -231959
11951G8765a40499A21337a24629g512A24893c10741M2483A23114e3589I2407l0150
$$ 78765 -140499 121337 -124629 -7512 124893 -310741 -268258 123114 -53589 92407 62257
11940F2257K37313a99861A34784N0900c0876j40040K4582G6446J63892g5532A49131
$$ 62257 299570 -199861 134784 185684 -30876 -170916 -146334 76446 240338 -75532 149131
11928A94825a97219g7926B37139j05791c4385E2991i0765G122J20465b9022j56788
$$ 194825 -197219 -77926 237139 131348 -34385 52991 -90765 7122 127587 -29022 -185810
11917a85810B20709b41579i2790B13083a70518N3534J7680j02431A34442O1177
$$ -185810 220709 -241579 -92790 213083 -170518 -116984 -99304 -201735 134442 195619
11907A95619h1654B63750b13161E2215d2784L551I0109i0272c594j68187j18131
$$ 195619 -81654 263750 -213161 52215 -42784 -39233 90109 -90272 -3594 -171781 -289912
11896b89912J39452J3414o0617F0543a44232E3476J52220p1659b31927j3530b408
$$ -289912 -150460 -137046 -197663 60543 -144232 53476 205696 134037 -231927 -245457 -2408
11884c27677A62360E9000K74712j64871c81609e453B48069E262a43926F9808h3826
$$ -327677 162360 59000 333712 168841 -381609 -5453 248069 5262 -143926 69808 -83826
11872A64220i9885D26364i5109k0595j64957b553H9664a88988Q1795A47959i8183
$$ 164220 -99885 426364 -95109 -115704 -280661 -2553 89664 -188988 -107193 147959 -98183
11860B5800f3806A32129g1868l59285e2708A91615d00874B61975g8375B08909
$$ 25800 -63806 132129 -71868 -431153 -52708 191615 -400874 261975 -78375 208909
11849A83647f8130j31648A1940e6970k38716j14734e3892l26435C06605c09162
$$ 183647 -68130 -199778 11940 -56970 -295686 -410420 -53892 -380327 306605 -309162
11838A12578A3604g3505k23895A73318a26772l0525L3203M8092A48758a6963A76505
$$ 112578 13604 -73505 -297400 173318 -126772 -157297 -124094 -76002 148758 -16963 176505
11826a6824q4078a4380k19869M3609j29714a51026A2314J65478a0797k94717G5875
$$ -16824 -100902 -14380 -234249 -190640 -320354 -151026 12314 177792 -10797 -305514 75875
11814B34959l5049d4127A05381M428C9622j3976K73324a94467B67880d0438G2998
$$ 234959 199910 -44127 105381 109809 39622 25646 298970 -194467 267880 -40438 72998
11802b95896c6885A11092R4369I1154C9843a33772A95416J04518d34196a05818
$$ -295896 -36885 111092 205461 91154 39843 -133772 195416 299934 -434196 -105818
11791a78607k04988B2380a64371A32315a5040j44636E7318A662J6703d1864q344
$$ -178607 -383595 22380 -164371 132315 -15040 -159676 57318 1662 18365 -41864 -50208
11780e0208q043B6439a57651k5397K393A33547c6363j87691Q2944B07663j03529
$$ -50208 -58251 26439 -157651 -183048 -180655 133547 -36363 -224054 -141110 207663 104134
11769A04134e4257m9587c8309k70086h4791j85249C6093O0838a9689A43858m9481
$$ 104134 -54257 -103844 -38309 -308395 -84791 -270040 36093 96931 -19689 143858 94377
11758I4377h6549K7228B30538c29752J14197P7577q7021C2049a40586M1898H8021
$$ 94377 -86549 -59321 230538 -329752 -215555 -137978 -224999 32049 -140586 -98688 88021
11746E1048J93919A15718J78597a87941E75227E6882a00350B1676K38142d13166
$$ 51048 244967 115718 294315 -187941 575227 56882 -100350 21676 259818 -413166
11735a86618C54602I9049k6493h0344F4624K98548c2057G4242J420O7398F2967
$$ -186618 354602 99049 72556 -80344 64624 363172 -32057 74242 75662 143060 62967
11723A90319D6514M01744A27886b49967A9661b7778B62943C4385i3957j67610
$$ 190319 46514 448258 127886 -249967 19661 -27778 262943 34385 -93957 -261567
11713b61567A95715D0112a59483B49759M664l0977I0166J8029N1747e5977C33227
$$ -261567 195715 40112 -159483 249759 254423 223446 90166 108195 159942 -55977 333227
11701A6826i3698I3290g4173A38719n8650a75749A51256J14655D7485e3682C037
$$ 16826 -93698 93290 -74173 138719 80069 -175749 151256 265911 47485 -53682 3037
11689b2278A55942D3849J63453N0771B290J62904P169n5457d63660A14752Q4328
$$ -22278 155942 43849 207302 258073 2290 165194 172363 116906 -463660 114752 199080
11678A99080J9023J7087c7190A42703b00026g8210c4444C49969a92634C0282R2759
$$ 199080 218103 235190 -37190 142703 -200026 -78210 -34444 349969 -192634 30282 123041
11667A23041J24561b25282E6908j8387b09020H0968c6257A6402a10643A01827
$$ 123041 247602 -225282 56908 38521 -209020 80968 -36257 16402 -110643 101827
11656b28404i6355k40445h9060k7399C2329M8104L6553a65466I6537L037M3405
$$ -228404 -96355 -336800 -89060 -116459 32329 80433 116986 -165466 96537 99574 142979
11645A42979a55802a0716l0310G2860d2327g187q7124m4900C66972j69543b31766
$$ 142979 -155802 -10716 -41026 72860 -42327 -7187 -94311 -139211 366972 197429 -231766
11633c3192j28063A9209a8721k81332b5088D5905b61503A32112H037e1663C62106
$$ -33192 -161255 19209 -18721 -300053 -25088 45905 -261503 132112 8037 -51663 362106
11621b94235R9067d0231J7124F8349M19493a56038A96485b6762n1669k76303f8897
$$ -294235 -195168 -40231 -23107 68349 487842 -156038 196485 -26762 -78431 -354734 -68897
11609B78203b38204A92334F8008b21400m8087H0600b2831I248K24724A05452K66618
$$ 278203 -238204 192334 68008 -221400 -269487 80600 -22831 9248 233972 105452 372070
11598C72070i3176G5725F906a42680D02682j30662b4119l1232F7686K06647a33801
$$ 372070 -93176 75725 6906 -142680 402682 272020 -24119 -55351 67686 274333 -133801
11586h3835m5175A85616b43598C63126D6489J57370J67685j63049E901J35417
$$ -83835 -129010 185616 -243598 363126 46489 203859 371544 208495 5901 141318
11576A41318a12970C2510Q4321j3715c3399k41835C00610K5963d5049r4291L9840
$$ 141318 -112970 32510 116831 103116 -33399 -275234 300610 326573 -45049 -139340 -99500
11565i9500A03456C064P5588i8214n5480F06296F6943c522C53560G4892J11871
$$ -99500 103456 3064 78652 -98214 -153694 606296 66943 -3522 353560 74892 186763
11554A86763a33523A60484f871a802C92226G1679K5529K26850G5325K43784B7455
$$ 186763 -133523 160484 -6871 -1802 392226 71679 97208 324058 75325 319109 27455
11542A89528h0989B45410G4852A7762i607D6045P6495d3416D0075R324J70392
$$ 189528 -80989 245410 74852 17762 -9607 46045 122540 -43416 40075 49399 219791
11531B19791a82962A68176g3217B25575a33717B42953n4217b7332B86516a46961
$$ 219791 -182962 168176 -73217 225575 -133717 242953 188736 -27332 286516 -146961
11520h6714H7878C0871K11009a40746A68968P725i422A86416N1844o4591h7872
$$ -86714 87878 30871 241880 -140746 168968 176693 -9422 186416 238260 173669 -87872
11508F3128i8514B94772k0727n0172a21210B52333q3228L8752I4739a2360r3405
$$ 63128 -98514 294772 274045 223873 -121210 252333 169105 207857 94739 -12360 -105765
11497a05765C83686A84487R5207A24740A5252J09500k4579B1675c5538I1763b25616
$$ -105765 383686 184487 279694 124740 15252 124752 100173 21675 -35538 91763 -225616
11485a8047A39487M3859Q8033i8175A82809R9097O1338I7944J1170k2995N2602
$$ -18047 139487 183346 271379 -98175 182809 281906 343244 97944 109114 86119 138721
11474A38721Q0926N4689n8744k0965D396L2209N7397J07192E3410N6142M3417
$$ 138721 219647 274336 215592 194627 4396 36605 94002 201194 53410 109552 152969
11463A52969a43323D23381A56560n8509M5497c3452I5452O1345p2240O0953F1242
$$ 152969 -143323 423381 156560 98051 143548 -33452 95452 156797 84557 145510 61242
11451h8598A46740D0386a85126B67586l7432a68326A92680b13754A10262O3421
$$ -88598 146740 40386 -185126 267586 230154 -168326 192680 -213754 110262 173683
11441A73683E7422f4643k49396C91149A79234k6905c03206a45566J1592O6294
$$ 173683 57422 -64643 -314039 391149 179234 152329 -303206 -145566 -133974 -67680
11431f7680n6987a1753K200A8818a93144E6289a2882l6281j2123A19753E5484
$$ -67680 -124667 -11753 -9553 18818 -193144 56289 -12882 -49163 -61286 119753 55484
11419a44167A5880b26019p6063e1466K1047H4956J29509L0972q725A089J13211
$$ -144167 15880 -226019 -302082 -51466 -30419 84956 214465 245437 236712 1089 114300
11408A14300a76236H2102K98422I6841a48465B38080J28509A72121G3169L4677
$$ 114300 -176236 82102 380524 96841 -148465 238080 366589 172121 73169 107846
11398A07846J01526r6157D6385a95158A41322m4399B0586a54925d298n9458A32443
$$ 107846 209372 113215 46385 -195158 141322 96923 20586 -154925 -4298 -63756 132443
11386F6651a20355E9241c63347A1768a7640n2364A91093a03808n4330B06334G0678
$$ 66651 -120355 59241 -363347 11768 -17640 -70004 191093 -103808 -158138 206334 70678
11374A03665O6754K51187b3387F2626e6248N391A77144c91244c6650r5044j55032
$$ 103665 170419 421606 -23387 62626 -56248 -50857 177144 -391244 -36650 -131694 -286726
11363b86726I4511N5081B9982d92978d3066r6318H757J29258j4322J88642e5986
$$ -286726 94511 149592 29982 -492978 -43066 -139384 8757 138015 123693 312335 -55986
11351a42744L8801A47505j3314C5886a10133d0190k20876A23152m3448b82296
$$ -142744 -103943 147505 134191 35886 -110133 -40190 -261066 123152 79704 -282296
11340b51748A54941b07950O9569k87954J24650d1964j10126J1663A53100a66109
$$ -251748 154941 -207950 -138381 -426335 -301685 -41964 -152090 -140427 153100 -166109
11329d221A69628L1205n8073a15895c8379F6239K21416b301C2503b35499d978
$$ -4221 169628 200833 142760 -115895 -38379 66239 287655 -2301 32503 -235499 -4978
11317c3850j04932C01913A9096N3736J93726e9998q7260H397a19121B89746g8125
$$ -33850 -138782 301913 19096 72832 266558 -59998 -147258 8397 -119121 289746 -78125
11305H0394b3320j9199m04568A58075C7131O2496K7379b65027G9328l0254a29493
$$ 80394 -23320 -42519 -447087 158075 37131 99627 127006 -265027 79328 49074 -129493
11293c8025k3170B10788a1629K670j80421D8547L56524b43095j23123C08981a77011
$$ -38025 -61195 210788 -11629 -8959 -189380 48547 405071 -243095 -366218 308981 -177011
11281c86177a27851d9932p384m8871C5149b16642A93010a04105m4724e1879j2287
$$ -386177 -127851 -49932 -57316 -106187 35149 -216642 193010 -104105 -148829 -51879 -64166
11270f4166B32303b37472J10979B96605J4810b44622g9500A61733c9178k65593
$$ -64166 232303 -237472 -126493 296605 311415 -244622 -79500 161733 -39178 -304771
11260c04771P0451H6400A4312L6869b32663O8219d0914A03451J41746D2614i989
$$ -304771 -234320 86400 14312 51181 -232663 -164444 -40914 103451 245197 42614 -9989
11248B4954k873c36487B32854a40287E3479b30480G1819b85782k1328C13871a06344
$$ 24954 22081 -336487 232854 -140287 53479 -230480 71819 -285782 -307110 313871 -106344
11236C27987j44407F9645L2718C6572J30814a09813A07966a00306A23609a12492
$$ 327987 183580 69645 102363 36572 167386 -109813 107966 -100306 123609 -112492
11225i2257h330k14583a4213j10870k63147e0281a1453E2666a52656c3250l34354
$$ -92257 -8330 -222913 -14213 -125083 -388230 -50281 -11453 52666 -152656 -33250 -367604
11214c67604a58271H641J98268b24654C9501a91665j49618c4654C03512H5990
$$ -367604 -158271 8641 206909 -224654 39501 -191665 -341283 -34654 303512 85990
11203A69472e9320j70072G3646g3105l23238J74473p7924O7716B34212a70769
$$ 169472 -59320 -229392 73646 -73105 -396343 -221870 -299794 -232078 234212 -170769
11192g7753C09450I924K89882a56729e413l1359A32631b8875A36416n2162L918
$$ -77753 309450 9924 299806 -156729 -5413 -36772 132631 -28875 136416 84254 88172
11181H8172a07244I6208m7258h0397I6775K03416a44003g731m9135j47865A16714
$$ 88172 -107244 96208 48950 -80397 96775 300191 -144003 -7731 -56866 -204731 116714
11169g3554m2878B77216f7329m7939o313j48873A30401K12791c4531E7347Q4768
$$ -73554 -116432 277216 -67329 -115268 -121581 -270454 130401 343192 -34531 57347 142115
11158A42115J02988a01150G2150a07757A72871a1183n2859j57442A22218b77365
$$ 142115 245103 -101150 72150 -107757 172871 -11183 -64042 -221484 122218 -277365
11147E0117e1677E574e0861B87847j28627p1622R3316a07969N0744j90194e1931
$$ 50117 -51677 5574 -50861 287847 159220 87598 180914 -107969 -57225 -247419 -51931
11135A60480g7710J6404G1424C1404a4512A99278J88500H9820B4729a42697H7197
$$ 160480 -77710 -61306 71424 31404 -14512 199278 387778 89820 24729 -142697 87197
11123A58841g608k25046b0981H5626J51568N1518j35905L7217i4109A17662O0469
$$ 158841 -7608 -232654 -20981 85626 237194 288712 152807 190024 -94109 117662 178131
11112A78131a41937A70745n6722J93450j14554A9674M46636A46307a19981B631
$$ 178131 -141937 170745 114023 307473 192919 19674 466310 146307 -119981 2631
11101A95559o3952e5995A11299K0369g7693a9377A51274k4849J19365r6961h0292
$$ 195559 131607 -55995 111299 131668 -77693 -19377 151274 126425 245790 148829 -80292
11089B77645D1508J82271I2588J10775a55455C99074o1162a2940C86207h3047
$$ 277645 41508 223779 92588 203363 -155455 399074 337912 -12940 386207 -83047
11078C08236D997J70764J93191j33243J38651P4636k01735P0552E2417K14614
$$ 308236 4997 175761 368952 235709 374360 448996 247261 317813 52417 267031
11068B67031q0409J8849B9031J59804H9406K95963j72078O4751M1875J44673J60966
$$ 267031 186622 205471 29031 188835 89406 385369 213291 278042 319917 464590 625556
11057F25556j92806K54453j86982L2759L05576j75296n9439m0868K25454J57960
$$ 625556 432750 687203 500221 532980 838556 663260 603821 562953 788407 946367
11047I46367l95759K4334Q4341n4973K69816m27732J97707J61285k6328k96857
$$ 946367 550608 574942 659283 604310 874126 446394 644101 805386 779058 482201
11037D82201J40788J77064k0024N5954j62150p0480B09258M19528K9238j20337
$$ 482201 622989 800053 780029 835983 673833 603353 209258 628786 658024 537687
11027E37687n9598N78414k08898B73590L54316m0683k9256L4057J11610l17214
$$ 537687 478089 1056503 847605 273590 627906 587223 557967 592024 703634 386420
11017C86420K38334k03322K09717k15921n2622O5100k0037P9189j63606L27339
$$ 386420 624754 421432 631149 415228 362606 427706 407669 486858 323252 650591
11007F50591o2600q0971K09341l43850J38570M9551j97878N24433j03610j60397
$$ 650591 587991 507020 716361 372511 511081 560632 362754 887187 783577 623180
10997F23180K7266k63234J98487M28674C93149O1627K49516l0789M2366j42896
$$ 623180 650446 387212 585699 1014373 393149 454776 704292 673503 715869 572973
10987E72973L16794Q4364l30169J41045K79222l9472m4703L17561K2290k14725
$$ 572973 889767 974131 643962 785007 1064229 1024757 980054 1297615 1319905 1105180
10977A105180J67432M29835L64533O7132K81252j25591J35162K6276N06885o52793
$$ 1105180 1272612 1702447 2066980 2134112 2415364 2289773 2424935 2451211 2958096 2305303
10967B305303r4510m68285N7920j5043m46514o1761M97141j08721k733J00895
$$ 2305303 2210793 1742508 1800428 1785385 1338871 1277110 1774251 1665530 1662797 1763692
10957A763692m9141J88500k67792L5745j27109l67821j95745j90605r0485j16509
$$ 1763692 1714551 1903051 1635259 1671004 1543895 1176074 980329 789724 699239 582730
10947E82730o7983k1934k42309J88660A15953K40247A30464K0947J96104E4070
$$ 582730 514747 492813 250504 439164 115953 356200 130464 151411 347515 54070
10936A09444K9509J95876I3510P4470a31234e8981I2889N8848A1414P6099j3467
$$ 109444 138953 334829 93510 167980 -131234 -58981 92889 151737 11414 87513 74046
10925G4046C0902a67780O205A07337b9871A66085n8314b11560A94699g2228A26964
$$ 74046 30902 -167780 -161575 107337 -29871 166085 107771 -211560 194699 -72228 126964
10913C980M549L5271h1727A54294B1890L54525k1922i6093B16007r6498c8895
$$ 3980 8529 43800 -81727 154294 21890 376415 354493 -96093 216007 119509 -38895
10901B40812b98186E879c35200I8036c61695D903b76672B35892C8396L1579c0111
$$ 240812 -298186 5879 -335200 98036 -361695 4903 -276672 235892 38396 69975 -30111
10889e4938j61892I3901P5825a21731M4746C75660A43845c22916D919M2722a11495
$$ -54938 -216830 93901 169726 -121731 -76985 375660 143845 -322916 4919 47641 -111495
10877D7093a41787A27864E9765f9582H2119Q0718J59112I1077b6182m0413B3249
$$ 47093 -141787 127864 59765 -69582 82119 162837 321949 91077 -26182 -66595 23249
10865A96409d12527B43113H528a344G2224J13888b987j00225j32165E5528a49629
$$ 196409 -412527 243113 8528 -1344 72224 186112 -2987 -103212 -235377 55528 -149629
10853G9684l5643d12678C49257A14792i8618M322A92305i6712o0149A04654a92420
$$ 79684 44041 -412678 349257 114792 -98618 -94296 192305 -96712 -156861 104654 -192420
10841a82705a8233j63026j2635D9669J75353b28396k9021B7595f7121G4600a63270
$$ -182705 -18233 -181259 -193894 49669 225022 -228396 -257417 27595 -67121 74600 -163270
10829B27405G9343k4352Q1763b2358n8281k3023A34282e9326p7804A59341c91853
$$ 227405 79343 54991 136754 -22358 -80639 -103662 134282 -59326 -137130 159341 -391853
10817e20896K31224k2279H3286J9353g9499k60248a49067f1312E7506c26591a08901
$$ -520896 -289672 -311951 83286 102639 -79499 -339747 -149067 -61312 57506 -326591 -108901
10805d2895r2548l7113B90744a2153l05364a22776D1785d2996N119l40125A37791
$$ -42895 -135443 -172556 290744 -12153 -317517 -122776 41785 -42996 -37877 -378002 137791
10793C99815C5102f5595B97172a84098D6050b04452A4595g4649A7241O8771g3226
$$ 399815 35102 -65595 297172 -184098 46050 -204452 14595 -74649 17241 86012 -73226
10781i6693k31077b9262j84276A2072b72599A8707d9149n9709l83337g8484B20018
$$ -96693 -327770 -29262 -213538 12072 -272599 18707 -49149 -108858 -492195 -78484 220018
10769h304B22160a3780k96324B1785J51580n720C9632a60341p3895K7458b912
$$ -8304 222160 -13780 -310104 21785 173365 167645 39632 -160341 -234236 -206778 -2912
10757A20332a23779N9870E6449a39610c9997F1227d0017j490A55016G1437B2232
$$ 120332 -123779 -63909 56449 -139610 -39997 61227 -40017 -41507 155016 71437 22232
10745A00475K31994h5297A07813b95842B46014F7126e335A45235M4624b64964
$$ 100475 332469 -85297 107813 -295842 246014 67126 -5335 145235 189859 -264964
10734A65991g0493j40624C0596L05248H6190A3246K81279e1180G1576K40886C5650
$$ 165991 -70493 -211117 30596 335844 86190 13246 294525 -51180 71576 312462 35650
10722a76311j0543C3530b44702R5928m7375o2870Q3456A01702H649O4119d11564
$$ -176311 -186854 33530 -244702 -148774 -196149 -259019 -175563 101702 8649 72768 -411564
10710F9623c2060F6237a248j17763C76571B7818M927a48419b2994k3449n13129
$$ 69623 -32060 66237 -1248 -119011 376571 27818 32745 -148419 -22994 -46443 -559572
10699e59572D11193D9381K34991H4626l7442a80773A65269a2958A00302c27667
$$ -559572 411193 49381 284372 84626 47184 -180773 165269 -12958 100302 -327667
10688a15120J9888k47575A37743b12278B9815e482A20099i689k59466h3784A23960
$$ -115120 -95232 -342807 137743 -212278 29815 -5482 120099 -9689 -269155 -83784 123960
10676c7946k2873j86025J07328C34159a63820K3949B8871R4240A7897i3214D9440
$$ -37946 -60819 -246844 -139516 334159 -163820 -139871 28871 123111 17897 -93214 49440
10664B1816L5623d6131B8134J13199A3346J08613c04295J51768j14028C5555K3116
$$ 21816 57439 -46131 28134 141333 13346 121959 -304295 -152527 -266555 35555 58671
10653E8671b10979R7726e5385p1556H979b39785A70650K74742B1436a43768E6148
$$ 58671 -210979 -113253 -55385 -126941 8979 -239785 170650 445392 21436 -143768 56148
10641a03054B4092a29806A47010a62414M8073j25674g7297q5135G0624d3420C04034
$$ -103054 24092 -129806 147010 -162414 -114341 -240015 -77297 -162432 70624 -43420 304034
10629b8948k27102g7582o7299e9643o6003B08549m9111a67958m5547H0485c86787
$$ -28948 -256050 -77582 -144881 -59643 -125646 208549 159438 -167958 -213505 80485 -386787
10617G9607d87462A75060a14605m54k42775M6149a28234D8115b50078f885A10162
$$ 79607 -487462 175060 -114605 -115059 -357834 -311685 -128234 48115 -250078 -6885 110162
10605A46503a10034l60513F2795e0134A7049J2235J30660M6306a96415n4586f4253
$$ 146503 -110034 -470547 62795 -50134 17049 29284 159944 206250 -196415 -251001 -64253
10593A40111b00017M987A10251a22241M8192B5829a91845f2386r9974A66855l1214
$$ 140111 -200017 -195030 110251 -122241 -74049 25829 -191845 -62386 -162360 166855 135641
10582A35641i4961l28364e8275A25847c3802O874j10715C25053B2955Q0338a53580
$$ 135641 -94961 -423325 -58275 125847 -33802 -26928 -137643 325053 22955 103293 -153580
10570C0671N5816A5860d2952q9092b6739k8755a1462k88208n5816A77461m7045
$$ 30671 86487 15860 -42952 -132044 -26739 -55494 -11462 -299670 -355486 177461 130416
10559A30416A3043J3156J08712F4548n948c7433A4626a55962D7855N9509a91173
$$ 130416 13043 26199 134911 64548 58600 -37433 14626 -155962 47855 107364 -191173
10547c7437p5858m4626k00028A56742m945a48929O1947D8884c021B0516J10203
$$ -37437 -113295 -157921 -357949 156742 151797 -148929 -86982 48884 -3021 20516 130719
10536A30719a09777j0724D22282a09109E5477J7020J48862c08330B44791q6980
$$ 130719 -109777 -120501 422282 -109109 55477 72497 221359 -308330 244791 157811
10526A57811a44991j84824C5982A7278h3805A86950d02170f0461C8917b65506
$$ 157811 -144991 -329815 35982 17278 -83805 186950 -402170 -60461 38917 -265506
10515i0227B33022D0799J26286m3734m1048L2006b13841h9546A10207D8705a22833
$$ -90227 233022 40799 167085 123351 82303 114309 -213841 -89546 110207 48705 -122833
10503a50898j24701A32586a92389D4271c41661a01116j3124j10967C74781c6595
$$ -150898 -275599 132586 -192389 44271 -341661 -101116 -114240 -225207 374781 -36595
10492i5024E320a04866q076M5712k47942C1654F79J01625K93244A74586o5311
$$ -95024 5320 -104866 -112942 -67230 -315172 31654 679 102304 395548 174586 109275
10481A09275L95933R9348j39068A79823H5020J33956g946q3790A6201a19511F5861
$$ 109275 505208 604556 465488 179823 85020 218976 -7946 -91736 16201 -119511 65861
10469b3962r1841B75552J977I7289c90507a94552B9523i9665A54586b62158N1662
$$ -23962 -115803 275552 277529 97289 -390507 -194552 29523 -99665 154586 -262158 -210496
10458b10496O1530A41640d09415h6345L4910J8685E1873d0263r8881c4378k1130
$$ -210496 -148966 141640 -409415 -86345 -51435 -32750 51873 -40263 -139144 -34378 -55508
10447e5508E8720O9058g9868D2492c36797a28680E9824b7217j2221A03676J8054
$$ -55508 58720 127778 -79868 42492 -336797 -128680 59824 -27217 -39438 103676 121730
10436A21730g762k20684j70437A42202D2690a02944B874c7054l5984k47240M8484
$$ 121730 -7762 -228446 -398883 142202 42690 -102944 2874 -37054 -73038 -320278 -271794
10425b71794A4769O8574K71680c7971D587J08575K45348r2119c86498c0524I4668
$$ -271794 14769 83343 355023 -37971 4587 113162 358510 266391 -386498 -30524 94668
10413e0368G605c03071j3031G7475a07116L026o4008j3439l5941h3742j635A24721
$$ -50368 7605 -303071 -316102 77475 -107116 -104090 -168098 -181537 -217478 -83742 -85377 124721
10400a69919D9630a9236j8038k38556f947B6922a92887A88931a48921O3192h525
$$ -169919 49630 -19236 -37274 -275830 -6947 26922 -192887 188931 -148921 -85729 -8525
10388b7754A41669n4760a16931A61575A090e10A90677g4333A2646L05648b25253
$$ -27754 141669 86909 -116931 161575 1090 -510 190677 -74333 12646 318294 -225253
10376A68469J5498M504K58667n0973r6810p5340O376c0780C66217q976m1793J03148
$$ 168469 183967 188471 447138 396165 299355 224015 230391 -30780 366217 357241 315448 418596
10364D18596l4810j82008r2791K87887j94590r0931K65334R2280e0075B38401
$$ 418596 383786 201778 108987 396874 202284 111353 376687 468967 -50075 238401
10353C17131j2435K17964k13231P3623K47976A77809L8667J40197H6351K23668
$$ 317131 304696 522660 309429 383052 631028 177809 216476 356673 86351 310019
10343C10019J20254j98583K33345a45909B12891I9199K70156A036N9138a36882
$$ 310019 430273 231690 465035 -145909 212891 99199 369355 1036 60174 -136882
10332g8682D43361F3526o25L10155f686A90766j8776k4409A8736B507K61225L28
$$ -78682 443361 63526 62901 373056 -6686 190766 171990 147581 18736 2507 263732 264060
10320B64060b4159k10010D1271Q3527K15011g3297B36807D5633C080R7028c2391
$$ 264060 -24159 -234169 41271 124798 339809 -73297 236807 45633 3080 100108 -32391
10308h7391a9627F1264K12151J32543A34288B4242K5011B0604J31810a15225A16687
$$ -87391 -19627 61264 273415 405958 134288 24242 49253 20604 152414 -115225 116687
10296A90750G4709B5049f828m5075A67116a25764H59J08456e6627l2218A71825
$$ 190750 74709 25049 -6828 -51903 167116 -125764 859 109315 -56627 -88845 171825
10284c37539B188a82050n5942f2795l04243A9346J67828b55122a18366F715N3336
$$ -337539 2188 -182050 -237992 -62795 -367038 19346 187174 -255122 -118366 6715 60051
10273F0051a43316C8973j376J82343b1233k9907B94497m2257b37639A99018J41320
$$ 60051 -143316 38973 37597 219940 -21233 -51140 294497 252240 -237639 199018 340338
10262C40338C8439L6170L48457J92057i3630D20275j00460E6639J329f0576B19171
$$ 340338 38439 74609 423066 615123 -93630 420275 319815 56639 57968 -60576 219171
10250B71866a18047b7263a955A23629c66795a09352j0331c6787C4851a26291j08555
$$ 271866 -118047 -27263 -1955 123629 -366795 -109352 -119683 -36787 34851 -126291 -234846
10239b34846Q3595A50405d69688a27565k047n8688P3598l60120A02697l8856a07805
$$ -234846 -151251 150405 -469688 -127565 -129612 -188300 -114702 -474822 102697 63841 -107805
10227c03163e0879j12587D9776a64617A38769A9042b2912j05444r7491A97788
$$ -303163 -50879 -163466 49776 -164617 138769 19042 -22912 -128356 -225847 197788
10216a0657j63479A30366i5681m2656O8289j85490D6493K61527A4461i97j74116
$$ -10657 -174136 130366 -95681 -138337 -70048 -255538 46493 308020 14461 -997 -175113
10205a75113Q1288j88174i5322B9614a95037g8691j29403d6041A45133l0841c66716
$$ -175113 -93825 -281999 -95322 29614 -195037 -78691 -208094 -46041 145133 114292 -366716
10193b33817j12156F3725K82088c716k18145N2388l36927a55301E1509K0102h4240
$$ -233817 -345973 63725 345813 -3716 -221861 -169473 -506400 -155301 51509 71611 -84240
10181a49153F600a35801b9584q7223B81894K13040b06161n6504R2578B24018b81526
$$ -149153 6600 -135801 -29584 -116807 281894 494934 -206161 -262665 -170087 224018 -281526
10169d6767C69216d44670A21620c06382a36982f6110I0110j035H309P4073J593
$$ -46767 369216 -444670 121620 -306382 -136982 -66110 90110 89075 8309 82382 83975
10158H3975c50663J34743M7202F6768i1703k9437A51792h8644j43653D4269A5520
$$ 83975 -350663 -215920 -168718 66768 -91703 -121140 151792 -88644 -232297 44269 15520
10146h379r4951i123q5597G8877a90848A04441c69497J75003j3876F6017g0379
$$ -8379 -103330 -9123 -94720 78877 -190848 104441 -369497 -194494 -208370 66017 -70379
10134a14809A53771f868B7104b78484q5069J41857M0587D33933A09679b5838H478
$$ -114809 153771 -6868 27104 -278484 -363553 -221696 -181109 433933 109679 -25838 8478
10122b52347E2940b11994b9516k4483m26389A18657C5317a67660A22627a36614
$$ -252347 52940 -211994 -29516 -53999 -480388 118657 35317 -167660 122627 -136614
10111g8543q533n977m9724k22971d6153B08503F172b46299B89671b5174B17414
$$ -78543 -87076 -93053 -142777 -365748 -46153 208503 6172 -246299 289671 -25174 217414
10099i7471r686a3487p7885A7890a31451A8451K0580L9466b30710G0183c88085
$$ -97471 -107157 -13487 -91372 17890 -131451 18451 39031 78497 -230710 70183 -388085
10087a83690E8084c1228C6531a29640j386A08368d27682d2764j99312H6675A6220
$$ -183690 58084 -31228 36531 -129640 -131026 108368 -427682 -42764 -242076 86675 16220
10075i217A53068a53011l17763a57154g345k25717A70597l1713B4067g5766F671
$$ -9217 153068 -153011 -470774 -157154 -7345 -233062 170597 138884 24067 -75766 6671
10063b34110Q1323O5883k08594h2078n8081j07852A1768a66259K3012o5035M8328
$$ -234110 -152787 -86904 -295498 -82078 -140159 -248011 11768 -166259 -143247 -208282 -159954
10052a59954H35a0042j9196n7489M2945A74212E6267d1923A05165a5298l9942
$$ -159954 835 -10042 -29238 -86727 -43782 174212 56267 -41923 105165 -15298 -55240
10041e5240j52994M0825a9925A27847c04189g6949m8116C8931J15125a1077j07099
$$ -55240 -208234 -167409 -19925 127847 -304189 -76949 -125065 38931 154056 -11077 -118176
10030a18176k66596a17095k3009a1221j11793q2213j00640f0j17891B7936a43639
$$ -118176 -384772 -117095 -140104 -11221 -123014 -205227 -305867 -60 -117951 27936 -143639
10018d60138B72209a39064G9787Q3800d5734B22300b48733A16244D6081e0345
$$ -460138 272209 -139064 79787 163587 -45734 222300 -248733 116244 46081 -50345
10007b70549i3863l0168M4148j8429J4550A22047b2295k10060b2747k15565a3321
$$ -270549 -93863 -124031 -79883 -98312 -83762 122047 -22295 -232355 -22747 -238312 -13321
9995e2226l71227B51604E9405b42471j94666d1573C6366a1697l10248A41516J04345
$$ -52226 -423453 251604 59405 -242471 -437137 -41573 36366 -11697 -321945 141516 245861
9984B45861e5341G7737b56669a17123k0756A67136C8831A1401d06204B5935Q5363
$$ 245861 -55341 77737 -256669 -117123 -137879 167136 38831 11401 -406204 25935 111298
9973A11298B0848L6918a77236C0905a91888f0598D22398b94100P134F1097d9968
$$ 111298 20848 57766 -177236 30905 -191888 -60598 422398 -294100 -286966 61097 -49968
9961b77366j7054D287b53493a13737B01392b50397B26648g5385B61592j21429
$$ -277366 -294420 4287 -253493 -113737 201392 -250397 226648 -75385 261592 140163
9951A40163a94965a5701G8496J0157a84654d3683H3016H546Q0236b41789E0053
$$ 140163 -194965 -15701 78496 88653 -184654 -43683 83016 8546 88782 -241789 50053
9939B59579b62026A89033b52826P5554r7414i4684p8028A71087A5958o993a29938
$$ 259579 -262026 189033 -252826 -177272 -274686 -94684 -172712 171087 15958 8965 -129938
9927b44492a03532j637o5386C8371a08195L6409H8475Q7157j0402a66477n8345
$$ -244492 -103532 -105169 -170555 38371 -108195 -71786 88475 175632 165230 -166477 -224822
9916b24822b3226p1438l0786j71606J28564k71128A5184b71829k4349j22365J21984
$$ -224822 -23226 -94664 -125450 -297056 -168492 -439620 15184 -271829 -296178 -418543 -296559
9905b96559B385L8871a51555K0547b4836A5152b0599k84185O8959C6349e5338
$$ -296559 2385 41256 -151555 -131008 -24836 15152 -20599 -304784 -235825 36349 -55338
9893B67223A0713K66034A24525o420h996j04872A96761f0277b5659A4255J35404
$$ 267223 10713 276747 124525 118105 -8996 -113868 196761 -60277 -25659 14255 149659
9882A49659e8172r3053N2533A04652a52217j31118J04669B08435i9785j71567
$$ 149659 -58172 -151225 -98692 104652 -152217 -283335 -178666 208435 -99785 -271352
9872b71352a27251b8695C38582a12277D8709a86446P6318j89311c080A9337b56737
$$ -271352 -127251 -28695 338582 -112277 48709 -186446 -110128 -299439 -3080 19337 -256737
9860d92706A13888a08029G01K98351p8377b10889H7229b6125j1309j71112k656
$$ -492706 113888 -108029 701 299052 220675 -210889 87229 -26125 -37434 -208546 -211202
9849b11202F3111g4564B63753e6175j71543Q7489j56202A0178a65866O7721M2062
$$ -211202 63111 -74564 263753 -56175 -227718 -140229 -296431 10178 -165866 -98145 -56083
9838e6083j00722e5448A06280b09962k14360a10308j83756G5727a30420e3702
$$ -56083 -156805 -55448 106280 -209962 -424322 -110308 -294064 75727 -130420 -53702
9827b5157o6797K7512A61869K11119B6465d14801A5364J56519a06489j09673J7578
$$ -25157 -91954 -64442 161869 372988 26465 -414801 15364 171883 -106489 -216162 -198584
9816a98584A00146A8123c99023A06297n758j7381a19066l4189l4680N9115q1756
$$ -198584 100146 18123 -399023 106297 100539 83158 -119066 -153255 -187935 -128820 -210576
9805b10576n7188i4067A19225l563c05139F5029c06735e4885g758A40836c23501
$$ -210576 -267764 -94067 119225 115662 -305139 65029 -306735 -54885 -7758 140836 -323501
9793c4213D32860A68895a28290j6169M2262D05714A38366m7412b25426A28927
$$ -34213 432860 168895 -128290 -144459 -102197 405714 138366 90954 -225426 128927
9782g5599J759m5481l537c7314j00842B037a35091I3036b17833B44688c17331
$$ -75599 -73840 -119321 -122858 -37314 -138156 2037 -135091 93036 -217833 244688 -317331
9770a52381j07474l3711I805a88318Q2127H261a69442E1974A6607b20508C21068
$$ -152381 -259855 -293566 9805 -188318 -106191 8261 -169442 51974 16607 -220508 321068
9758g7945p424A03990a88934A02506a50714n9670e6299I1650a26049p8662I2721
$$ -77945 -85369 103990 -188934 102506 -150714 -210384 -56299 91650 -126049 -204711 92721
9746B21539b19709P5407j91674F714J7484e0926l6828D9194a68113N8491A78322
$$ 221539 -219709 -144302 -335976 6714 24198 -50926 -87754 49194 -168113 -109622 178322
9734A24415a27358j61658L3000A37206g5358A78981m6115B3379J63963J67710
$$ 124415 -127358 -289016 -256016 137206 -75358 178981 132866 23379 187342 355052
9724C55052a59326H983a33115a3952j46647a0835A59852E5670j4793j3260e57484
$$ 355052 -159326 8983 -133115 -13952 -160599 -10835 159852 55670 40877 27617 -557484
9712A92190b91140A7332R4195a46804D2440Q0595a25990k46835I2508c28879g7558
$$ 192190 -291140 17332 111527 -146804 42440 123035 -125990 -372825 92508 -328879 -77558
9700E0007b73732P2784l0205B2837a31681p7541M0464j5058i1030B06399a11566
$$ 50007 -273732 -200948 -231153 22837 -131681 -209222 -168758 -183816 -91030 206399 -111566
9688b6336m33850B1358c76806B42926F5920c53346J33470c4859k35935B14808
$$ -26336 -460186 21358 -376806 242926 65920 -353346 -219876 -34859 -270794 214808
9677a9090A3602a1557m9556a0487l864n6997B1133a30443A80871b09949l4266
$$ -19090 13602 -11557 -61113 -10487 -14351 -71348 21133 -130443 180871 -209949 -244215
9666b44215Q7406M5924E3141f6985j72915A76948E6008b80834a21281e4071G2936
$$ -244215 -156809 -110885 53141 -66985 -239900 176948 56008 -280834 -121281 -54071 72936
9654B83999c08919A38585a08882j48283A54045p0388a72862g1699r8468B4953
$$ 283999 -308919 138585 -108882 -257165 154045 83657 -172862 -71699 -170167 24953
9643c22970A42275J7943b04161A57176c16730C2816c47675O2357C5898a50582
$$ -322970 142275 160218 -204161 157176 -316730 32816 -347675 -285318 35898 -150582
9632b33556G8085c05703a15845o2262P3929j61687j14207A66755c74777a75804
$$ -233556 78085 -305703 -115845 -178107 -104178 -265865 -380072 166755 -374777 -175804
9621g7695B71321r8114a37589B16872I3080b20576D580f5176j94214d258A50019
$$ -77695 271321 173207 -137589 216872 93080 -220576 4580 -65176 -259390 -4258 150019
9609A01367b85526H5370c29335H6432g339m9085l35364A40706a69076d3534j01267
$$ 101367 -285526 85370 -329335 86432 -7339 -56424 -391788 140706 -169076 -43534 -144801
9598a44801E8649b32174N451C7491K12084a2696E2055e9739K6897o4690F9128
$$ -144801 58649 -232174 -226723 37491 249575 -12696 52055 -59739 -32842 -97532 69128
9586b04527k2079C12684A41079B2205c67842A3972a0353A4234a19103c8010j23167
$$ -204527 -226606 312684 141079 22205 -367842 13972 -10353 14234 -119103 -38010 -161177
9575a61177c0181l84729a15093H6222k5116J57200j06069a19180L0782j30259
$$ -161177 -30181 -414910 -115093 86222 61106 218306 112237 -119180 -88398 -218657
9565b18657m5966O3019H8996B0953J73512a62670P2853k14224L9172j71878a85352
$$ -218657 -264623 -201604 88996 20953 194465 -162670 -89817 -304041 -264869 -436747 -185352
9553a84121g7527F292N2298P9168J17916j07633e0749A73748J60448a33078o400
$$ -184121 -77527 6292 58590 137758 255674 148041 -50749 173748 334196 -133078 -139478
9542a39478o3789G0695b04184I3012J57450A22496f1957n0537F0677B3919D892
$$ -139478 -203267 70695 -204184 93012 250462 122496 -61957 -112494 60677 23919 4892
9530H8855i7729D2903b0614A42411Q917g5498E5269a91233G1725b8108j88040
$$ 88855 -97729 42903 -20614 142411 151328 -75498 55269 -191233 71725 -28108 -216148
9519b16148D3400a22365j9935A87579p8084c75998b0433l0096j40014B39435D7162
$$ -216148 43400 -122365 -142300 187579 109495 -375998 -20433 -50529 -190543 239435 47162
9507d9570C819J31920m975D4362a73895I2517b72319b7531B8611a38675A00134
$$ -49570 3819 135739 130764 44362 -173895 92517 -272319 -27531 28611 -138675 100134
9495A11404b6660l4808C9667N461b1648B532c22865a29378B09147i9019j66760
$$ 111404 -26660 -61468 39667 45128 -21648 2532 -322865 -129378 209147 -99019 -265779
9484b65779N0979i5924A17752L7033F381J5963a31322j47944A26529a3898D7352
$$ -265779 -214800 -95924 117752 154785 6381 22344 -131322 -279266 126529 -13898 47352
9472b66666A93398d74738d4875k56894J13261A2811a80928C6598a03130E5382
$$ -266666 193398 -474738 -44875 -301769 -188508 12811 -180928 36598 -103130 55382
9461F2263N8871a5854A67731J4621g8019n2017n9209a320C7445a65091g6985a3295
$$ 62263 121134 -15854 167731 182352 -78019 -130036 -189245 -1320 37445 -165091 -76985 -13295
9448i2289d4709J0716j35515B80961A38312e2130A1250a59819N3509E009b20853
$$ -92289 -44709 -33993 -169508 280961 138312 -52130 11250 -159819 -106310 5009 -220853
9436a4597A49921A9015a12423E4826c54346i4758B26165g129k98531C9223j2844
$$ -14597 149921 19015 -112423 54826 -354346 -94758 226165 -7129 -305660 39223 26379
9425B6379b5394j91519H1498J48073c29706c5457k80531d1367A96988f8202q0091
$$ 26379 -25394 -216913 81498 229571 -329706 -35457 -315988 -41367 196988 -68202 -148293
9414a48293A63988m2164N1571a83252E4604M6763l7362a60192B6903b14032B9611
$$ -148293 163988 121824 173395 -183252 54604 101367 64005 -160192 26903 -214032 29611
9402a1410A29721b22467a00546o360p4106d8936J0416C3541a39624m8760L030
$$ -11410 129721 -222467 -100546 -106906 -181012 -48936 -38520 33541 -139624 -188384 -185354
9391a85354i595D3687K9622K8771l6961R138a86059n9698A38441b11104f2475
$$ -185354 -9595 43687 73309 102080 65119 74257 -186059 -245757 138441 -211104 -62475
9379F2326a09906n3343A9468a02399C12009b88148J13983A97712H2229b73167
$$ 62326 -109906 -163249 19468 -102399 312009 -288148 -174165 197712 82229 -273167
9368A33367l6932a07324m1921j6259I6148e26242a76507n9168B74877a06761L3277
$$ 133367 96435 -107324 -149245 -165504 96148 -526242 -176507 -235675 274877 -106761 -73484
9357g3484r1731B5622b03033k200H5555a44950j16555d8220m64874a33907n0562
$$ -73484 -165215 25622 -203033 -205233 85555 -144950 -261505 -48220 -513094 -133907 -184469
9346a84469A40818e63530b0308D5548j4813b55767Q6308E5014J3905e8439k34409
$$ -184469 140818 -563530 -20308 45548 30735 -255767 -169459 55014 68919 -58439 -292848
9335b92848D1243b28292P8723j01631g738k15391j44728J04650e077j46019A20484
$$ -292848 41243 -228292 -149569 -251200 -7738 -223129 -367857 -263207 -5077 -151096 120484
9323i910m7175M003G0153f8608J9475k37937B70730F4615c87198a78500d623J382
$$ -9910 -57085 -53082 70153 -68608 -49133 -287070 270730 64615 -387198 -178500 -4623 -3241
9311c241k7102m33870A32825b72479b0040j03993c3766A1737b34374a02941b311
$$ -3241 -30343 -464213 132825 -272479 -20040 -124033 -33766 11737 -234374 -102941 -2311
9299c03622n0298a70336P7348F3917B8821b38246B9694q810a52377N0448B37362
$$ -303622 -353920 -170336 -92988 63917 28821 -238246 29694 20884 -152377 -101929 237362
9287c45992L8219N4907G3864a54318l4137Q3012e1423n411E9566c38820a9876
$$ -345992 -307773 -252866 73864 -154318 -188455 -105443 -51423 -56834 59566 -338820 -19876
9275f9854n7314O295o10750I0028a9551H0914Q0335b65929G2160f0383A92140
$$ -69854 -127168 -120873 -731623 90028 -19551 80914 161249 -265929 72160 -60383 192140
9263g9002J5402r7278G2026a50024A7121i2676A05907D8217a32260e5487D25725
$$ -79002 -63600 -160878 72026 -150024 17121 -92676 105907 48217 -132260 -55487 425725
9251A7613K57374a88804k43368b12447a5247A54925b72739c7264G8768b69900
$$ 17613 274987 -188804 -432172 -212447 -15247 154925 -272739 -37264 78768 -269900
9240A82862G1931J83380g099j55363k18384f269A12914b37098q304f0166k00718
$$ 182862 71931 255311 -7099 -162462 -380846 -6269 112914 -237098 -245402 -60166 -260884
9229b60884A88120g9391l42563A55825J09377j28023c26285J02261H8331J2556
$$ -260884 188120 -79391 -421954 155825 265202 137179 -326285 -224024 88331 100887
9219A00887n0320G560J11161h5291j3685d2222C7245i7909L1523B20293G9805
$$ 100887 50567 7560 118721 -85291 -98976 -42222 37245 -97909 -66386 220293 79805
9207b35198g8573l9321D7248J19780O330A5305J78767a27731j47280C14743c66647
$$ -235198 -78573 -117894 47248 167028 173358 15305 194072 -127731 -275011 314743 -366647
9195D7669i9456p1565k76935G2496a5446j18350k5563M5542o7693C8431a65138
$$ 47669 -99456 -171021 -447956 72496 -15446 -133796 -159359 -113817 -181510 38431 -165138
9183c60449g550j04221b2391j47911r5905a07571r2505b0105k25866h6734A98136
$$ -360449 -7550 -111771 -22391 -170302 -266207 -107571 -200076 -20105 -245971 -86734 198136
9171I4338b1979j14717M9537K9369o0172c861D9453f5772D5387M7001b06117B62991
$$ 94338 -21979 -136696 -87159 -57790 -117962 -3861 49453 -65772 45387 92388 -206117 262991
9158a55139C16794b62722l7212e2447F9823L2204K87412a98157a9384A03087d31563
$$ -155139 316794 -262722 -299934 -52447 69823 102027 389439 -198157 -19384 103087 -431563
9146a42671l66908C57018a90826P2191A1594c76432Q8420O1636j66709A75261
$$ -142671 -509579 357018 -190826 -118635 11594 -376432 -288012 -226376 -393085 175261
9135A43948b83736i9469n01610a52569K9286d6042p1647F5536l0185b24694B54363
$$ 143948 -283736 -99469 -601079 -152569 -123283 -46042 -117689 65536 35351 -224694 254363
9123c94705b4158A22845L9356F4688e49146b56090a267k0179r0000j08775J01849
$$ -394705 -24158 122845 162201 64688 -549146 -256090 -1267 -21446 -111446 -220221 -118372
9112a18372j47343O9706E4088k3255J85918i4615j62746F1055J56847j8440L8004
$$ -118372 -265715 -196009 54088 30833 216751 -94615 -257361 61055 217902 199462 237466
9101B37466J886r7228J35754A05712j8750I374J28111b72847g7362j56078j20533
$$ 237466 239352 142124 277878 105712 86962 9374 137485 -272847 -77362 -233440 -353973
9090c53973J37691k5847B3733a0764C73070b31709J09092B5649d08266a72056
$$ -353973 -216282 -242129 23733 -10764 373070 -231709 -122617 25649 -408266 -172056
9079b35596j55795L6482C7557a49273j06478F6362L42749a28909d8784A17693
$$ -235596 -391391 -354909 37557 -149273 -255751 66362 409111 -128909 -48784 117693
9068c85841A97821c52712Q6849C39241A27239l062g4571A56613h183H2105e1706
$$ -385841 197821 -352712 -265863 339241 127239 124177 -74571 156613 -8183 82105 -51706
9056b54786n3727h1127A74724g5365A47314b67441a00818B16825A04412k6612
$$ -254786 -308513 -81127 174724 -75365 147314 -267441 -100818 216825 104412 77800
9046G7800a55177F256g3193j51865A14402b12372n642j67947h52A77653q2697
$$ 77800 -155177 6256 -73193 -225058 114402 -212372 -218014 -385961 -852 177653 94956
9035I4956N8153B2327a78033f8045B11182B4675b71283I2038g6873L7781k80465
$$ 94956 153109 22327 -178033 -68045 211182 24675 -271283 92038 -76873 -39092 -319557
9024c19557c1915H0100b95872H6148j6478D626g2798E2796b55968a19838m174
$$ -319557 -31915 80100 -295872 86148 69670 4626 -72798 52796 -255968 -119838 -124012
9013a24012C34366a29324O2554K9078j59184L0618O7969n5977D2579O8651b55963
$$ -124012 334366 -129324 -66770 -37692 -196876 -166258 -98289 -154266 42579 111230 -255963
9001a73934L2021b576l32185g372j82190B37296b93691A83543E1116c78740J44715
$$ -173934 -141913 -2576 -334761 -7372 -189562 237296 -293691 183543 51116 -378740 -234025
8990b34025j15058a57388f5517l37570B8375d6094j90430J14540A52085m9989
$$ -234025 -349083 -157388 -65517 -403087 28375 -46094 -236524 -121984 152085 102096
8980A02096e703B99817b83773B9328J60615g0070j16382J5g9517L2405k1565H9181
$$ 102096 -5703 299817 -283773 29328 189943 -70070 -186452 -186437 -79517 -47112 -68677 89181
8967b28814N7710F762c6858F1179g9699A90605a8942k58161G5727L02632F601
$$ -228814 -171104 6762 -36858 61179 -79699 190605 -18942 -277103 75727 378359 6601
8955c27230A22598Q0188a6782A11247E0331b04861o1402A64410D6609a70907j9158
$$ -327230 122598 202786 -16782 111247 50331 -204861 -266263 164410 46609 -170907 -190065
8944a90065A64365m7953a45907G627b45452C2237c1707j82178A30715M7125J61193
$$ -190065 164365 116412 -145907 7627 -245452 32237 -31707 -213885 130715 177840 339033
8933C39033j35883c95593d0386p0256j14967b0588A73525P4681J03029L65816
$$ 339033 203150 -395593 -40386 -110642 -225609 -20588 173525 248206 351235 717051
8923G17051J571230N391285M175504C125766A043676D18139j74952j13538a01915
$$ 717051 2288281 7679566 11855070 3125766 1043676 418139 243187 129649 -101915
8913f7788G3444M2370a51022L1090F7321K03918A24114b56235E8631K57628b28936
$$ -67788 73444 115814 -151022 -119932 67321 271239 124114 -256235 58631 316259 -228936
8901a73483K2815l0944j96448C77785r0835a6856A12108D9857K8829k762J04910
$$ -173483 -150668 -181612 -378060 377785 286950 -16856 112108 49857 78686 75924 180834
8890A80834K86351B01096k598I3503J79280f8770B2172J7556f6023G0940e2637
$$ 180834 467185 201096 198498 93503 272783 -68770 22172 39728 -66023 70940 -52637
8878b15259P6721I6149c8110n3861D09751a65320r529i780q4483B35671a05709
$$ -215259 -138538 96149 -38110 -91971 409751 -165320 -174849 -9780 -94263 235671 -105709
8866G2835a67006G5533b06604B96566B2983J8507b04776C7826M0817b01976B31464
$$ 72835 -167006 75533 -206604 296566 22983 41490 -204776 37826 78643 -201976 231464
$$ [...]
##END NTUPLES=NMR SPECTRUM
##END=
