
##TITLE=AC1171_Tolima-ibage-TiCOAH12008_7165207_nqq4PPrPGX
##JCAMPDX= 6.0         $$ Bruker NMR JCAMP-DX V2.0
##DATA TYPE= NMR SPECTRUM
##DATA CLASS= NTUPLES
##ORIGIN= BRUKER
##OWNER= Administrator
$$ 1.72 TOPSPIN		Version 2.1
$$ 2012-12-01 20:15:37.394 -0500  Administrator@X
$$ Compression mode = diff/dup
##.OBSERVE FREQUENCY= 400.02188249412
##.OBSERVE NUCLEUS= ^1H
##.ACQUISITION MODE= SIMULTANEOUS (DQD)
##.ACQUISITION SCHEME= undefined
##.AVERAGES= 64
##.DIGITISER RES= 22
##SPECTROMETER/DATA SYSTEM= spect
##.PULSE SEQUENCE= noesygpps1d.comp
##.SOLVENT NAME= COFFEE_meoh
##.SHIFT REFERENCE= INTERNAL, COFFEE_meoh, 1, 14.96095
##AUDIT TRAIL= $$ (NUMBER, WHEN, WHO, WHERE, PROCESS, VERSION, WHAT)
$$ ##TITLE= Audit trail, TOPSPIN		Version 2.1
$$ ##JCAMPDX= 5.01
$$ ##ORIGIN= Bruker BioSpin GmbH
$$ ##OWNER= Administrator
$$ $$ E:\/data/COFFEE/nmr/AC1171_Tolima-ibage-TiCOAH12008_7165207_nqq4PPrPGX/12/pdata/1/auditp.txt
$$ ##AUDIT TRAIL=  $$ (NUMBER, WHEN, WHO, WHERE, PROCESS, VERSION, WHAT)
(   1,<2012-12-01 20:15:31.487 -0500>,<Administrator>,<X>,<go>,<TOPSPIN 2.1>,
      <created by zg
	started at 2012-12-01 20:04:00.126 -0500,
	POWCHK enabled, PULCHK disabled,
       configuration hash MD5:
       86 BA 57 50 F2 9D 5C 9B 26 00 A9 28 5F 66 2E 89
       data hash MD5: 64K
       A8 69 82 39 1C 0D D4 7B FF 5B 1B 81 4E B1 AB 3E>)
(   2,<2012-12-01 20:15:34.628 -0500>,<Administrator>,<X>,<proc1d>,<TOPSPIN 2.1>,
      <Start of raw data processing
       efp LB = 0.3 FT_mod = 6 PKNL = 1 PHC0 = 0 PHC1 = 0 SI = 128K 
       data hash MD5: 128K
       14 B3 AC 98 E5 20 D2 65 27 F1 3E B1 D0 F0 05 6C>)
(   3,<2012-12-01 20:15:35.675 -0500>,<Administrator>,<X>,<proc1d>,<TOPSPIN 2.1>,
      <pk PHC0 = -80.5188 PHC1 = 0 
       data hash MD5: 128K
       02 1B 4B D4 FB 05 89 BD CB 4D 45 D3 E4 4B 4E E7>)
(   4,<2012-12-01 20:15:36.394 -0500>,<Administrator>,<X>,<proc1d>,<TOPSPIN 2.1>,
      <abs ABSG = 1 
       data hash MD5: 128K
       FF 73 D2 DB 0F E7 93 98 F5 FE 18 F5 C7 77 3C 85>)
(   5,<2012-12-01 20:15:36.565 -0500>,<Administrator>,<X>,<proc1d>,<TOPSPIN 2.1>,
      <abs ABSG = 2 
       data hash MD5: 128K
       0C FF 1C 30 92 B0 C3 51 1A A7 DA 1A 90 47 29 A0>)
(   6,<2012-12-01 20:15:36.753 -0500>,<Administrator>,<X>,<proc1d>,<TOPSPIN 2.1>,
      <abs ABSG = 3 
       data hash MD5: 128K
       4A 03 EE 2B F6 0F 60 FC 2D 17 57 74 F9 B9 52 FE>)
(   7,<2012-12-01 20:15:36.894 -0500>,<Administrator>,<X>,<proc1d>,<TOPSPIN 2.1>,
      <abs ABSG = 4 
       data hash MD5: 128K
       75 0F 20 8B 7C 48 C1 FF C9 DD B6 43 D9 22 0E D4>)
(   8,<2012-12-01 20:15:37.065 -0500>,<Administrator>,<X>,<proc1d>,<TOPSPIN 2.1>,
      <abs ABSG = 5 
       data hash MD5: 128K
       49 22 9D FE 49 57 14 EC AE 27 1B F2 CD B9 AB F4>)
$$ ##END=
$$ 
$$ $$ hash MD5
$$ $$ DE B4 AD B4 B8 55 33 3E AE 5D 01 90 A2 3F B4 D5
##$RELAX= 
##$RELAX= 
##$RELAX= 
##$RELAX= 
##$RELAX= 
##$RELAX= 
##$RELAX= 
##$RELAX= 
$$ Bruker specific parameters
$$ --------------------------
##$DU= <E:\>
$$ [...]
150 150 150 150 150 150 150 150
##$TP07= 0
##$TPNAME0= <>
##$TPNAME1= <>
##$TPNAME2= <>
##$TPNAME3= <>
##$TPNAME4= <>
##$TPNAME5= <>
##$TPNAME6= <>
##$TPNAME7= <>
##$TPOAL= (0..7)
0.5 0.5 0.5 0.5 0.5 0.5 0.5 0.5
##$TPOFFS= (0..7)
0 0 0 0 0 0 0 0
##$TUNHIN= 0
##$TUNHOUT= 0
##$TUNXOUT= 0
##$USERA1= <user>
##$USERA2= <user>
##$USERA3= <user>
##$USERA4= <user>
##$USERA5= <user>
##$V9= 5
##$VALIST= <valist>
##$VCLIST= <CCCCCCCCCCCCCCC>
##$VD= 0
##$VDLIST= <DDDDDDDDDDDDDDD>
##$VPLIST= <PPPPPPPPPPPPPPP>
##$VTLIST= <TTTTTTTTTTTTTTT>
##$WBST= 1024
##$WBSW= 4
##$XGAIN= (0..3)
0 0 0 0
##$XL= 0
##$YL= 0
##$YMAX_a= 6085465
##$YMIN_a= -12156142
##$ZGOPTNS= <>
##$ZL1= 120
##$ZL2= 120
##$ZL3= 120
##$ZL4= 120
##$ABSF1= 14.96095
##$ABSF2= -5.597232
##$ABSG= 5
##$ABSL= 3
##$ALPHA= 0
##$AQORDER= 0
##$ASSFAC= 0
##$ASSFACI= 0
##$ASSFACX= 0
##$ASSWID= 0
##$AUNMP= <proc_prof1d_extract.lims>
##$AXLEFT= 0
##$AXNAME= <>
##$AXNUC= <1H>
##$AXRIGHT= 0
##$AXTYPE= 0
##$AXUNIT= <>
##$AZFE= 0.1
##$AZFW= 0.1
##$BCFW= 0
##$BC_mod= 0
##$BYTORDP= 0
##$COROFFS= 0
##$CY= 15
##$DATMOD= 1
##$DC= 0
##$DFILT= <>
##$DTYPP= 0
##$F1P= 0
##$F2P= 0
##$FCOR= 0.5
##$FTSIZE= 131072
##$FT_mod= 6
##$GAMMA= 0
##$GB= 0
##$INTBC= 1
##$INTSCL= 1
##$ISEN= 128
##$LB= 0.3
##$LEV0= 0
##$LPBIN= 0
##$MAXI= 10000
##$MC2= 0
##$MEAN= 0
##$ME_mod= 0
##$MI= 0
##$NCOEF= 0
##$NC_proc= -2
##$NLEV= 6
##$NOISF1= 0
##$NOISF2= 0
##$NSP= 0
##$NTH_PI= 0
##$NZP= 0
##$OFFSET= 14.96095
##$PC= 1
##$PHC0= -80.5188
##$PHC1= 0
##$PH_mod= 1
##$PKNL= yes
##$PPARMOD= 0
##$PPDIAG= 0
##$PPIPTYP= 0
##$PPMPNUM= 2147483647
##$PPRESOL= 1
##$PSCAL= 4
##$PSIGN= 0
##$PYNMP= <proc.py>
##$REVERSE= no
##$SF= 400.02000965536
##$SI= 131072
##$SIGF1= 0
##$SIGF2= 0
##$SINO= 400
##$SIOLD= 131072
##$SPECTYP= <>
##$SREGLST= <1H.CDCl3>
##$SSB= 0
##$STSI= 131072
##$STSR= 0
##$SW_p= 8223.68421052631
##$SYMM= 0
##$S_DEV= 0
##$TDeff= 65536
##$TDoff= 0
##$TI= <>
##$TILT= no
##$TM1= 0
##$TM2= 0
##$TOPLEV= 0
##$USERP1= <user>
##$USERP2= <user>
##$USERP3= <user>
##$USERP4= <user>
##$USERP5= <user>
##$WDW= 1
##$XDIM= 131072
##$YMAX_p= 470156847
##$YMIN_p= -12640
##$CURPLOT= <Network HP LaserJet P1505>
##$CURPRIN= <$Network HP LaserJet P1505>
##$DFORMAT= <normdp>
##$LAYOUT= <+/1D_H.xwp>
##$LFORMAT= <normlp>
##$PFORMAT= <normpl>
##$SURQMSG= 1
$$ End of Bruker specific parameters
$$ ---------------------------------
##NTUPLES= NMR SPECTRUM
##VAR_NAME=  FREQUENCY,     SPECTRUM/REAL,   SPECTRUM/IMAG
##SYMBOL=    X,             R,               I
##VAR_TYPE=  INDEPENDENT,   DEPENDENT,       DEPENDENT
##VAR_FORM=  AFFN,          ASDF,            ASDF
##VAR_DIM=   131072,        131072,          131072
##UNITS=     HZ,            ARBITRARY UNITS, ARBITRARY UNITS
##FACTOR=    0.0627417313425164, 1,          1
##FIRST=     8223.62146879497, 846,          -55831
##LAST=      0,             2906,            -55487
##MIN=       0,             -12640,          0
##MAX=       8223.62146879497, 470156847,    0
$$ Real data points
##PAGE= N=1
##DATA TABLE= (X++(R..R)), XYDATA
$$ [...]
67967 102269 99309 97006 95326 93777 91928 89692 87169 84500 81973 80008 78793 78115 77680 77451 77439
67952 77439 77415 77131 76609 75901 74812 73324 72054 71657 71854 71708 70920 70234 70344 71068 71880 72669 73555 74469
67934 74469 75380 76635 78517 80709 82571 83779 84339 84290 83829 83525 83847 84561 85066 85280 85683 86458 87091 87030
67916 87030 86330 85375 84237 82678 80679 78663 77149 76380 76340 76908 77805 78499 78456 77647 76640 76074 76144 76715
67898 76715 77665 78813 79708 79924 79576 79134 78709 78000 77015 76350 76486 77205 77966 78466 78554 78057 77116 76318 75991
67879 75991 75718 75108 74662 75108 76049 76202 75100 73726 73161 73379 73850 74610 75959 77556 78658 79188 79743
67862 79743 80472 80662 79793 78428 77515 77099 76313 74635 72690 71575 71643 72171 72171 71375 70367 69800 69574 68992
67844 68992 67756 66528 66195 66701 67063 66636 65924 65861 66609 67495 67944 68038 68167 68541 69202 70228 71719 73623
67826 73623 75655 77391 78534 79232 80015 81281 82969 84871 87018 89373 91398 92456 92624 92539 92304 91180
67810 91180 88617 85060 81285 77398 73105 68692 65071 62788 61537 60776 60385 60477 60877 61150 61094 60929 60964
67793 60964 61202 61367 61247 60896 60500 60152 59837 59504 59059 58411 57706 57341 57448 57471 56644 54992 53486 53019 53524
67774 53524 54264 54764 55211 56115 57782 59996 62047 63205 63372 63197 63491 64642 66569 68948 71304 73197
67758 73197 74540 75605 76580 77302 77597 77547 77231 76497 75331 74242 73860 74250 74880 75173 74858 73946 72669 71378
67740 71378 70264 69267 68448 68173 68623 69350 69733 69747 69876 70330 70746 70645 69829 68351 66485 64759 63631 63006
67722 63006 62343 61329 60224 59526 59575 60399 61593 62321 61845 60264 58504 57428 57148 57234 57323 57356 57476 57873
67704 57873 58628 59587 60450 61018 61288 61336 61284 61263 61216 60843 60037 59294 59310 60057 60604 60009 58239 56202 55062 55401
67684 55401 56702 57700 57612 57041 57237 58450 59621 59838 59478 59492 60113 60883 61598 62571 64048 65889 67787 69379
67666 69379 70220 70203 69979 70478 71919 73657 75073 76059 76496 75901 74123 72064 71088 71713 73247 74639 75314
67649 75314 75184 74364 73135 71880 70790 69784 68871 68344 68347 68493 68287 67796 67530 67668 67879 67959 68162 68678 69159
67630 69159 69150 68760 68578 69037 70183 71895 73917 75740 76843 77239 77483 78030 78791 79452 80006 80776 81955 83321
67612 83321 84436 85058 85302 85375 85277 84903 84348 83920 83751 83622 83287 82761 82154 81437 80627 79966 79565 79015 77766
67593 77766 75927 74325 73642 73701 73726 73129 71980 70753 69734 68726 67387 65772 64243 62895 61524 60384
67577 60384 60377 61991 64370 66082 66571 66250 65432 64077 62614 62078 62922 64289 64915 64387 63234 62202 61778
67560 61778 62028 62519 62641 62269 61874 61840 62035 62229 62497 62897 63172 63122 62900 62636 62208 61724 61755 62565 63570 64092
67540 64092 64213 64200 63579 61714 59116 57202 56618 56655 56490 56143 55901 55551 54734 53604 52611 51949 51604 51623 51953
67521 51953 52285 52413 52520 52805 53176 53635 54589 56201 57745 58296 58012 58005 58803 59604 59419 58406 57567 57462 57774
67502 57774 57985 57906 57488 56660 55611 54920 55065 55949 57083 58100 58868 59270 59174 58598 57742 56844 56157 55970 56423
67483 56423 57250 57904 57962 57346 56233 54993 54134 54008 54436 54881 55086 55336 56023 57148 58364 59296 59693 59459
67465 59459 58701 57694 56678 55779 55044 54419 53760 53175 53240 54430 56319 57909 58882 59887 61261 62218 61884
67448 61884 60589 59338 58413 57410 56465 56354 57260 58330 58818 58924 59150 59478 59696 60029 60898 62309 63911
67431 63911 65353 66260 66196 65116 63629 62419 61577 60781 59853 58726 57198 55273 53572 52869 53249 54157 55175
67414 55175 56229 57117 57466 57288 57093 57303 57921 58789 59716 60330 60352 60148 60405 61066 61277 60710 60246 60757 61870
67395 61870 62675 63137 63848 64616 64444 63050 61440 60580 60208 59497 58352 57466 57390 58034 58928 59578 59664 59228 58649
67376 58649 58273 58146 58170 58296 58401 58280 57975 57862 58143 58510 58574 58385 58255 58317 58600 59260 60260 61021 60939 60206
67356 60206 59646 59689 59959 59914 59460 58846 58318 58026 57999 58089 58156 58351 58962 59998 61217 62503 63847 65040 65811
67337 65811 66299 66883 67491 67720 67739 68427 70205 72331 73821 74655 75487 76540 77388 77707 77624 77365 76970 76376
67319 76376 75443 74021 72354 71268 71476 72634 73515 73224 71977 70693 70157 70640 71927 73508 74870 75799
67303 75799 76391 76857 77443 78376 79568 80494 80669 80289 80060 80409 81192 82108 82955 83365 82805 81189 79209 77774
67285 77774 77290 77697 78862 80578 82380 83797 84724 85225 85079 84017 82446 81419 81580 82452 83135 83449 83953
67268 83953 84911 85793 85955 85399 84571 83718 82875 82338 82634 83931 85767 87504 88780 89468 89525 89118 88640 88374
67250 88374 88277 88249 88410 88866 89386 89674 89866 90437 91576 92923 93969 94529 94793 95120 95830 96985 98261 99160
67232 99160 99403 99041 98238 97216 96442 96526 97619 99020 99745 99553 99156 99244 99562 99254 98055 96724 96125 96232
67214 96232 96352 96117 95768 95525 95210 94719 94458 94931 96049 97141 97633 97559 97470 97947 99153 100779 102458 104164
67196 104164 105998 107698 108719 108936 108845 108897 108980 108869 108764 108996 109443 109705 109655 109390 108835 107901 106961 106662 107205
67177 107205 108223 109380 110620 111756 112303 112021 111303 110747 110497 110219 109630 108906 108575 109057 110287 111805 113170
67160 113170 114175 114669 114523 114009 113927 114979 117126 119811 122553 125015 126802 127775 128429 129352 130373 130792
67144 130792 130455 129944 129668 129416 129033 128928 129509 130574 131583 132221 132419 132273 132224 132923 134530 136430 137939
67127 137939 138979 139822 140572 141284 142230 143549 144876 145741 146168 146510 146925 147443 148352 149996 152216 154392 156020
67110 156020 156947 157190 156959 156834 157476 159066 161227 163491 165530 167010 167647 167574 167389 167662 168493 169568 170480
67093 170480 171054 171513 172301 173580 174957 175954 176667 177638 179061 180486 181425 181960 182525 183316 184152 184867 185593
67076 185593 186664 188389 190928 194244 198034 201731 204746 206846 208262 209338 210137 210556 210721 211028 211752
67061 211752 212880 214334 216092 217962 219621 221102 222895 225271 227753 229667 230989 232185 233402 234368
67047 234368 235113 236232 238192 240812 243642 246582 249850 253554 257526 261425 264814 267294 268801 269740 270675
67032 270675 271944 273633 275744 278167 280607 282816 284936 287389 290319 293284 295662 297337 298892 301180
67018 301180 304713 309359 314434 319040 322545 324946 326807 328818 331391 334587 338219 341987 345699 349522
67004 349522 353793 358458 362969 367019 371111 375928 381345 386631 391581 396742 402388 407992 413049 417835
66990 417835 422830 427908 432649 437150 441928 447225 452884 458704 464435 469667 474293 478929 484341 490609
66976 490609 497419 504920 513444 522478 530796 537893 544486 551336 558339 565238 572515 580827 589955 599040
66962 599040 607694 616329 625463 635192 645348 655780 666331 676844 687310 697965 709156 721075
66950 721075 733483 745775 757595 769423 782199 796246 810882 825233 839027 852425 865620
66939 865620 879041 893418 909096 925509 941993 958841 976920 996331 1016193 1035848 1055526
66928 1055526 1075626 1095954 1116141 1136353 1157113 1178657 1200840 1223495 1246528 1269745 1292958
66917 1292958 1316293 1340171 1364963 1390753 1417372 1444530 1471982 1499677 1527737 1556175 1584761
66906 1584761 1613279 1641866 1670909 1700595 1730615 1760357 1789380 1817854 1846628 1876726 1908532
66895 1908532 1941415 1974249 2006303 2037506 2067954 2097493 2126009 2153920 2181934 2210178 2237837
66884 2237837 2263933 2288292 2311423 2333526 2354085 2372607 2389397 2405262 2420680 2435550 2449528
66873 2449528 2462180 2472887 2481109 2486821 2490358 2491846 2491194 2488648 2484775 2479651 2472588 2463075 2451580
66860 2451580 2438932 2425216 2409827 2392455 2373405 2353018 2331328 2308484 2284954 2260995 2236175
66849 2236175 2209795 2181694 2152461 2122830 2092959 2062354 2030586 1998040 1965719 1934156 1902814
66838 1902814 1870924 1838620 1806701 1775423 1744211 1712682 1681263 1650388 1619718 1588690 1557519
66827 1557519 1527109 1498055 1470194 1443034 1416244 1389724 1363489 1337509 1311510 1285139 1258551
66816 1258551 1232584 1207948 1184411 1161186 1137988 1115225 1093249 1072013 1051547 1032096 1013509
66805 1013509 995023 976076 957023 938583 920890 903592 886721 870831 856093 841715 826640
66794 826640 810642 794447 778866 764113 750029 736617 724011 712066 700343 688619 677112
66783 677112 666010 655056 643869 632562 621671 611464 601590 591478 580940 570318 560201 550968
66771 550968 542459 534103 525528 516939 508743 500934 493181 485450 478106 471372 465009 458667 452182 445431
66757 445431 438277 430899 423842 417478 411642 406049 400694 395583 390363 384759 379159 374242 370018 365706
66743 365706 360691 355203 349875 344952 340224 335533 331043 326970 323282 319704 316004 312228 308672 305599
66729 305599 302945 300347 297450 294192 290746 287229 283556 279606 275491 271549 268113 265366 263402 262137
66715 262137 261022 259109 255815 251623 247722 244897 242999 241490 240063 238528 236467 233489 229809 226249
66701 226249 223551 221774 220388 218800 216787 214491 212116 209694 207212 204865 203025 201868 201134 200250 198655
66686 198655 196090 192788 189377 186434 184084 182143 180593 179607 179153 178856 178396 177822 177327 176906 176316 175213
66670 175213 173346 170845 168321 166369 164955 163605 162174 160908 159769 158419 157107 156727 157399 157727 156344
66655 156344 153806 151929 151364 150869 149120 146349 143788 142161 141258 140547 139660 138473 137142 136071 135594 135729
66639 135729 136267 136942 137408 137365 136917 136590 136717 136932 136585 135574 134442 133608 132790 131380 129210 126723 124501
66622 124501 122906 122194 122570 123826 125137 125632 125212 124489 123915 123322 122374 121064 119591 118052 116522 115180
66606 115180 114137 113347 112842 112723 112783 112538 111852 111058 110175 108568 105958 103240 101563 100956 100640 100459 100986
66589 100986 102197 103059 102781 101739 100766 100180 99911 99990 100400 100812 100939 100895 100868 100757 100447 100105 99801 99143 97754
66570 97754 95985 94671 94271 94604 95401 96665 98358 100028 100988 100829 99668 97969 96183 94593 93403 92742
66554 92742 92443 91977 90954 89642 88721 88443 88348 87892 87053 86145 85280 84347 83399 82780 82718 82901 82635 81563 80162
66535 80162 79337 79458 80016 80315 80157 79649 78830 77933 77659 78514 79972 80985 81242 81279 81357 81073 80272 79510 79203
66516 79203 78954 78251 77261 76444 75852 75387 75319 75876 76603 76790 76408 76006 75810 75537 75106 74910 75192 75628 75812
66497 75812 75859 76219 76978 77638 77623 76860 75671 74151 72006 69304 67071 66526 67699 69347 70392 70858 71178
66480 71178 71296 71021 70697 70803 71158 71222 71032 71155 71756 72329 72363 71786 70724 69368 68105 67295 66772 66017 64926
66461 64926 63952 63425 63285 63626 64920 67222 69622 71034 71325 71203 71186 71214 71261 71638 72395 72874 72370 71139
66443 71139 70241 70285 70741 70782 70483 70702 71832 73182 73736 73233 72263 71563 71470 71840 72237 72284 72037 72003 72601 73656
66423 73656 74529 74710 74205 73461 72981 72932 73031 72920 72642 72520 72584 72422 71769 70912 70292 70026 70133 70893 72487 74363
66403 74363 75448 75072 73482 71422 69493 67916 66671 65678 64906 64357 64025 63994 64536 65819 67460 68653
66387 68653 68947 68629 68195 67805 67457 67331 67481 67512 67069 66465 66378 67002 67970 68996 70056 70974 71402 71355 71307 71513
66367 71513 71622 71158 70136 68962 67940 67085 66347 65836 65757 66138 66646 66819 66556 66208 66067 65999 65787 65576 65628
66348 65628 65782 65577 64882 64083 63648 63801 64532 65620 66656 67339 67744 68001 67855 66946 65545 64558 64618 65421
66330 65421 66129 66219 65843 65482 65418 65499 65436 65243 65168 65166 64904 64472 64584 65610 66859 67460 67625 68261 69487 70383
66310 70383 70320 69757 69492 69760 70263 70540 70095 68794 67393 67089 68188 69739 70779 71337 71824 72073 71623 70542
66292 70542 69313 68145 66991 66065 65758 66056 66492 66680 66551 66145 65530 64901 64435 64043 63569 63161 63152 63625 64395
66273 64395 65393 66733 68313 69696 70512 70800 70834 70790 70672 70383 69759 68704 67478 66674 66657 67022 66885 65820
66255 65820 64317 63142 62455 61875 61265 61007 61374 62058 62608 63033 63651 64546 65479 66222 66685 66908 67191 68004
66237 68004 69414 70748 71227 70755 69708 68200 66185 64141 62972 63110 64221 65814 67592 69194 70265
66222 70265 70959 71714 72365 72226 71370 71075 72367 74658 76449 76991 76678 76137 75632 75222 74869 74342 73432 72305
66204 72305 71378 70880 70780 70998 71397 71691 71684 71569 71697 72091 72401 72330 71926 71472 71209 71059 70605 69530 68163
66185 68163 67322 67541 68643 70120 71511 72339 72250 71532 71017 71031 70909 70038 68987 68898 69997 71350 72019 71824
66167 71824 71010 69861 68800 68322 68531 69046 69525 69969 70421 70698 70641 70417 70377 70719 71358 71954 72022 71223 69762
66148 69762 68391 67868 68358 69348 70140 70392 70197 69726 69003 68156 67626 67779 68416 69081 69768 70791 71910 72277
66130 72277 71640 71021 71653 73581 75799 77448 78413 78973 79457 80124 80875 81149 80514 79272 78136 77485 77315
66113 77315 77647 78414 79111 79186 78745 78367 78242 78069 77811 77910 78621 79668 80761 81993 83503 85116 86523 87494
66095 87494 87810 87344 86408 85679 85529 85680 85659 85395 85219 85426 85956 86399 86332 85818 85450 85666 86109 85992 85033 83706
66075 83706 82642 82138 82176 82483 82653 82597 82815 83715 84789 85065 84365 83463 82970 82795 82822 83310 84220 84903 84947 84769
66055 84769 84891 85260 85750 86696 88173 89302 89116 87836 86497 85507 84423 83079 82028 81736 82041 82709 83820
66038 83820 85340 86789 87763 88420 89091 89763 90289 90891 92038 93888 96073 97969 99026 99043 98395 97865 97964
66021 97964 98425 98599 98344 98199 98644 99544 100543 101724 103423 105455 106996 107427 107056 106747 107051 107926 109158
66004 109158 110686 112493 114485 116589 118845 121330 124090 127123 130256 133059 135107 136324 136963 137328 137769
65989 137769 138792 140710 143066 144788 145063 143827 141364 137940 134098 130745 128442 126817 125170 123453
65975 123453 122146 121354 120611 119612 118540 117550 116475 115322 114583 114654 115201 115511 115306 114860 114455 114142 113961 113941
65957 113941 113801 113064 111778 110802 111024 112380 113964 115063 115744 116475 117552 119112 121294 124022 126807 129138
65941 129138 131009 132716 134199 134987 134944 134691 135053 136292 138075 139959 141661 143088 144420 146079 148300
65926 148300 150749 152829 154337 155587 156944 158576 160640 163302 166405 169437 172084 174536 176974 179079
65912 179079 180474 181501 182987 185211 187546 189310 190511 191492 192201 192306 191841 191265 190895 190617 190227 189662
65896 189662 188808 187402 185355 182933 180440 177850 174945 171659 168081 164229 160044 155590 151115 146909
65882 146909 143183 140065 137617 135843 134703 134093 133783 133447 132828 131852 130657 129613 129184 129479 129896 129543
65866 129543 128229 126779 126118 126165 125956 124839 123234 122157 122152 122851 123484 123634 123401 122930 122123 121001 120075 119926
65848 119926 120480 121153 121784 122922 124915 127164 128675 129148 129129 129276 129789 130472 131043 131399 131759 132413 133327 134269
65830 134269 135431 137493 140764 144668 148459 152106 156007 160191 164399 168649 173098 177429 181007 183598
65816 183598 185371 186249 185837 184021 181194 177851 174439 171448 169043 166677 163722 160446 157670 155432 152878
65801 152878 149630 146447 144169 142790 141973 141761 142202 142900 143553 144478 146037 147949 149753 151577 153844 156513
65785 156513 159288 162362 166438 171985 178887 186601 194297 201101 206708 211621 216416 220936 224593 227099
65771 227099 228313 227630 224321 218511 211193 203224 194896 186582 179099 173072 168405 164717 161929 160067
65757 160067 158871 158119 158213 160019 164061 170138 177763 186719 197014 208470 220579 232820 244930 256724
65743 256724 267737 277255 284802 290518 294935 298359 300430 300235 296886 290183 280827 269978 258559 246917
65729 246917 235018 222817 210528 198649 187686 177772 168736 160637 153909 148675 144260 139888 135671
65716 135671 132302 129904 127854 125717 123586 121453 119130 117079 116365 117206 118359 118649 118443 118804 119703 120070
65700 120070 119333 118021 116891 116254 116115 116270 116238 115737 115227 115399 116181 116900 117402 118329 120179 122755 125639
65683 125639 128554 131080 132750 133796 135325 138338 142966 148838 155771 163799 172938 183232 194737 207246
65669 207246 220365 233998 248284 262896 276920 289767 301671 312828 322594 330142 335560 339579
65657 339579 342399 343572 343124 342091 341639 342047 342853 343724 344810 346368 348350 350462 352441 354046 354744 353638
65641 353638 350003 343830 335606 325529 313324 299000 283379 267565 252115 237106 222744 209406
65629 209406 197177 185885 175654 166889 159563 153036 146894 141553 137552 134523 131442 127842 124292
65616 124292 121587 119876 118792 118032 117538 117267 117091 116868 116520 116167 116237 117131 118553 119473 119098 117711 116184
65599 116184 114899 113659 112557 112263 113196 114931 116693 118131 119321 120362 121361 122558 124107 125820 127398
65584 127398 128891 130745 133497 137542 142965 149385 156237 163509 172041 182709 195361 208891 222359
65571 222359 235708 249326 263121 276161 287137 295169 300307 303295 304782 304709 302418 297246 289067
65558 289067 278472 266508 254029 241220 227907 214302 201125 188979 178023 168356 160167 153226
65546 153226 146795 140583 135384 132182 130865 130361 129840 129226 128755 128629 129018 129826 130548 130934 131611 133371 135843
65529 135843 137648 138012 137501 136935 136312 135188 133473 131323 128674 125519 122386 120041 118735 118058 117467 116726
65513 116726 115914 115203 114617 113995 113305 112941 113391 114568 115778 116465 116626 116433 115870 115051 114457 114471 114916 115433
65495 115433 116103 117265 118860 120418 121724 123125 125007 127249 129452 131596 134184 137565 141271 144259
65481 144259 145848 146208 145892 145225 144385 143680 143274 142827 141936 140846 140124 139629 138448 136056 132968 129970 127266
65464 127266 124777 122750 121488 120769 120097 119366 118781 118221 117245 115786 114434 113833 114036 114555 114833 114576 113877
65447 113877 113180 113058 113783 115068 116294 117119 117842 119038 120762 122301 122868 122400 121520 120915 121095 122586 125686
65430 125686 129824 133603 135861 136496 136072 134935 133075 130672 128318 126567 125457 124582 123582 122553 121952
65415 121952 122106 122856 123757 124495 124958 125108 125080 125299 125981 126542 126028 124431 123101 123520 125896 129256 132620
65398 132620 135649 138351 140727 142788 144555 145877 146436 146100 145186 144219 143465 142836 142271 142000 142219 142572 142361
65381 142361 141385 140243 139553 139248 139056 139299 140554 142636 144560 145655 146209 146871 147926 149305 150863 152470
65365 152470 154184 156456 159726 163698 167491 170669 173686 177250 181779 187579 194834 203067 211240 218746
65351 218746 225812 232567 238378 242582 245262 246715 246699 244936 241917 238391 234363 229347 223465 217484 211761
65336 211761 205880 199456 192768 186414 180683 175427 170316 165199 160329 156136 152701 149769 147424 146240
65322 146240 146321 146659 146050 144371 142400 140685 139230 138066 137358 136920 136280 135286 134200 133210 132315 131577 131008
65305 131008 130322 129386 128735 129012 129935 130538 130411 130003 129704 129418 129237 129769 131394 133719 136067 138018 139309
65288 139309 139776 139696 139671 139878 139910 139629 139559 140049 140619 140662 140357 140261 140283 139745 138348 136587 135146 134242 133636 133007
65268 133007 132268 131635 131370 131333 130979 129943 128573 127676 127790 128757 129934 130696 130875 130842 131097 131733 132367 132606
65250 132606 132451 132211 132215 132628 133325 133839 133594 132312 130142 127519 125102 123682 123650 124451 124985 124752 124294 124303 124704
65231 124704 125014 125223 125783 126764 127530 127432 126579 125693 125285 125123 124527 123163 121514 120516 120786 122160 123877 125063
65213 125063 125189 124323 123074 122138 121813 121976 122412 123005 123714 124498 125202 125379 124382 122071 119414 117952 118454
65196 118454 120298 122258 123611 124327 124538 124239 123501 122688 122331 122810 124166 126145 128331 130283 131683 132605
65180 132605 133618 135312 137587 139632 140779 141098 141022 140749 140426 140518 141374 142574 143303 143347 143264 143596 144442 145812
65162 145812 147761 150032 152084 153654 154864 155699 155943 155835 156203 157628 159888 162484 165326 168695 173012
65147 173012 178845 186584 195716 204988 213790 222929 233468 245154 256612 266835 275881 284279 292422
65134 292422 300527 308640 316502 323684 329827 334550 337318 337853 336578 334166 330740 325986 320110 314086
65120 314086 308654 303469 297546 290364 282215 273638 264910 256114 247431 239123 231304 223914 216977 210690
65106 210690 205088 199770 194167 188107 181905 176000 170723 166322 162803 159684 156316 152670 149492 147443
65092 147443 146401 145839 145565 145713 146251 146906 147484 147903 147914 147144 145526 143518 141849 141098 141366 142222 143038 143455
65074 143455 143477 143085 142114 140681 139387 138744 138638 138701 139054 140151 141938 143650 144587 144765 144662 144639 144852 145501
65056 145501 146810 148666 150440 151331 150966 149687 148248 147193 146504 145721 144346 142247 139905 138221 137818
65041 137818 138447 139226 139518 139354 139011 138465 137460 135931 134163 132596 131513 130776 129852 128344 126554 125273
65025 125273 124965 125364 125931 126294 126180 125387 124191 123428 123735 124831 125858 126291 126307 126434 127118 128541 130642
65008 130642 133314 136580 140379 144168 147079 148672 149257 149376 149327 149288 149452 149766 150001 150332 151296 152827 153974
64991 153974 154111 153875 154239 155188 156140 157188 158885 160981 162549 163452 164707 167029 169800 171879 172818 172900
64975 172900 172519 171905 171111 169906 168001 165521 162913 160281 157276 153856 150653 148273 146681 145528 144711
64960 144711 144235 143910 143559 143237 142914 142252 141050 139642 138508 137674 136869 136071 135527 135346 135394 135418 135022 133781
64942 133781 131753 129714 128493 128175 128351 128961 130303 132239 134016 135092 135610 135755 135185 133632 131748 130663
64926 130663 130723 131171 131173 130640 129846 128809 127531 126471 126164 126461 126751 126908 127429 128542 129823 131000 132518
64909 132518 134789 137356 139456 141106 142952 145187 147372 149371 151758 154985 158730 162452 166198 170381
64895 170381 175038 179816 184578 189535 194717 199705 204067 207842 211356 214682 217515 219546 220697 220969
64881 220969 220309 218829 216881 214637 211741 207765 202922 197960 193373 189189 185524 182701 180618 178635
64867 178635 176537 175064 174871 175393 175397 174466 173291 172580 172249 171690 170365 168112 165263 162433 159889 157286
64851 157286 154383 151669 149747 148416 147054 145685 144796 144234 143322 142205 142052 143440 145387 146533 146571 145974
64835 145974 144945 143392 141603 140206 139557 139581 140019 140496 140573 140147 139650 139634 140367 141947 144373 147221 149796
64818 149796 152079 155028 159370 164422 168797 172038 174924 178333 182522 187515 193396 199905 206229 211567
64804 211567 215725 218930 221179 221924 220396 216374 210706 204958 200256 196518 192942 189087 185230 181855
64790 181855 179149 176980 175029 172931 170567 168286 166680 166132 166675 168184 170401 172873 175081 176735 177789
64775 177789 178285 178377 178495 179232 181015 183903 187591 191526 195235 198767 202678 207382 212678 218122 223589
64760 223589 229057 234046 237823 240284 242219 244556 247637 251300 255314 259505 263645 267448 270600 272646
64746 272646 273053 271577 268540 264541 259833 254123 247116 239178 231237 223953 217259 211000 205753 202460
64732 202460 201194 200884 200526 200158 200264 200747 201121 201402 202069 203160 204137 204782 205639 207271 209491 211655 213466
64715 213466 215220 217384 220107 223018 225404 226682 226781 225988 224515 222426 219897 217132 214020 210213 205694
64700 205694 200924 196284 191729 187223 183168 180029 177713 175692 173715 172111 171341 171439 171949 172318 172324 172227 172536
64683 172536 173585 175295 177267 179062 180542 182161 184832 189142 194607 200015 204673 209017 213736 218686
64669 218686 223109 226689 229739 232321 233821 233702 232204 229869 226753 222662 217969 213537 209759 206272
64655 206272 202822 199872 197921 196664 195378 193936 192871 192511 192629 193032 193923 195491 197551 199918 202855
64640 202855 206862 212188 218692 225941 233347 240553 247927 256277 265717 275081 282871 288626 292934 296313
64626 296313 298624 299541 299091 297515 294983 291673 287921 284081 280280 276354 272053 267401 263014 259834 258263
64611 258263 257619 256706 254910 252534 250128 247867 245568 242989 239972 236505 232742 228877 224973 221077 217339
64596 217339 213815 210263 206519 202965 200227 198397 197014 195839 195161 195145 195402 195603 196163 197886 201051 205155
64580 205155 209438 213402 216955 220353 224023 228181 232565 236569 239616 241465 242350 242872 243437 243647 242500
64565 242500 239411 234827 229616 224173 218471 212740 207520 202980 198651 194050 189310 185008 181587 179153
64551 179153 177584 176528 175373 173663 171771 170868 171810 174092 176288 177683 179083 181637 185202 188406 190225
64536 190225 190835 190774 190011 188326 186170 184390 183193 181955 180148 178015 176171 174959 174366 174263 174385 174279
64520 174279 173629 172682 172185 172799 174630 177235 179913 182005 183158 183569 183962 185091 187142 189668 192192 194723
64504 194723 197625 201154 205368 210366 216275 222916 229779 236425 242669 248210 252386 254622 254955 253862
64490 253862 251724 248750 245339 242105 239362 236843 234096 231054 228150 225973 224900 224962 225878 227152 228086
64475 228086 227870 225938 222496 218609 215487 213597 212517 211570 210351 208759 206945 205463 205174 206633 209521
64460 209521 212863 215802 218118 220102 222115 224215 226059 227085 226893 225547 223532 221538 220245 220128 221208
64445 221208 223054 225150 227278 229430 231535 233629 236229 240088 245442 251804 258739 266447 275206 284618
64431 284618 294019 303570 314322 327168 342318 359998 380971 405933 434961 468232 506966 552934
64419 552934 607068 669167 738823 815717 898609 984645 1070220 1152381 1229320 1300130 1364578
64408 1364578 1422648 1473438 1514508 1542899 1556980 1557086 1544527 1520552 1486311 1442967 1391182 1330683
64396 1330683 1260910 1182340 1097149 1008743 920785 836449 758080 687174 624435 569815 522632
64385 522632 481964 447056 417288 391837 369695 350206 333336 319215 307568 297788 289325 281775
64373 281775 274841 268579 263461 259716 256669 253183 248775 243876 239017 234284 229704 225538 221874 218393
64359 218393 214916 211811 209479 207807 206546 205862 206016 206806 207962 209878 213286 218175 223640 228839 233527
64344 233527 237534 240332 241412 240754 238683 235566 231747 227503 223002 218577 214925 212523 210864 208947
64330 208947 206667 205072 205002 206131 207713 209544 211675 213811 215712 217712 220056 222035 222576 221606 220171
64315 220171 219262 219070 219287 219487 219207 218237 216892 215569 213980 211325 207242 202193 196990 192332 188690 186085
64299 186085 184017 182089 180616 180038 179862 178996 177187 175411 174637 174937 176081 178208 181384 185021 188285
64284 188285 190803 192739 194568 197050 200854 205781 210752 214988 218802 222884 227291 231704 236273 241449
64270 241449 247049 252039 255335 256596 256316 255469 254966 255160 255809 256501 256939 256916 256464 256130 256526 257341 257360 255812
64252 255812 253094 249673 245014 238425 230567 223125 217116 212299 208190 204784 202163 200117 198450 197170
64238 197170 196218 195437 194906 194882 195330 195980 196851 198190 199792 200953 201302 201229 201253 201425 201557 201572 201342 200583 199258
64219 199258 197786 196510 195198 193368 190939 188289 185817 183628 181532 179275 176928 175137 174700 175715
64205 175715 177308 178368 178433 177856 177390 177720 179081 181132 183370 185763 188762 192648 197179 202036 207271
64190 207271 213114 219688 227155 235876 246030 257146 268194 278060 285852 291064 293701 294092 292426 288641
64176 288641 282907 275908 268404 260735 252982 245371 238176 231418 224882 218331 211548 204550 197996 192993
64162 192993 189974 188055 185996 183633 181851 181277 181606 182209 182812 183427 184150 185240 187027 189579 192722 196440
64146 196440 200840 205565 209694 212518 214145 215169 216034 216933 217929 218843 219203 218645 217272 215522 213805 212375
64130 212375 211252 210116 208650 207217 206832 208049 210171 212037 213335 214664 216505 218778 221401 224590
64116 224590 228443 232771 237711 243993 252171 261758 271420 279957 286923 292554 297396 301860 305853 308898
64102 308898 310786 312035 313641 316463 320904 326904 333979 341460 348920 356235 363072 368611 372077 373340
64088 373340 372721 370499 367037 363004 358766 353654 346639 337889 328909 320891 313584 306213 298843 292141
64074 292141 286241 280642 275098 269937 265486 261806 259056 257529 257115 257102 256795 256095 255308 254735 254589 255066
64058 255066 256166 257631 259239 261073 263334 265984 268780 271630 274720 278279 282408 287257 293322 301264
64044 301264 311219 322290 333108 343113 353084 364173 376542 389246 401278 412196 421702 429156
64032 429156 433908 435843 435327 432745 428356 422492 415636 408301 400960 394047 387845 382430 377807 374032
64018 374032 371030 368253 364702 359438 352283 344101 336284 329725 324237 319115 314130 309639 305739 301910
64004 301910 297855 294270 292249 291986 292550 292949 292979 292989 293242 293810 294791 296296 298279 300640 303449 306859 310787
63987 310787 314892 318959 323199 328047 333740 340243 347613 356175 366172 377296 388877 400583 412768
63974 412768 425937 440037 454435 468530 482147 495303 507818 519429 530326 541460 554090
63963 554090 568920 585749 604133 624334 647361 674058 704447 738261 775925 818788 868500
63952 868500 926480 993957 1072165 1162270 1265259 1382079 1513767 1661192 1824463 2002541
63942 2002541 2193437 2394828 2604518 2820318 3039534 3258618 3473174 3678103 3867859
63933 3867859 4037003 4180931 4296209 4380383 4431886 4450234 4435874 4389334 4310705 4200457
63923 4200457 4060852 3896284 3712260 3514291 3307467 3096364 2884896 2676380 2473831
63914 2473831 2279978 2097021 1926722 1770696 1630084 1504778 1393516 1295142 1209317 1135561
63904 1135561 1072108 1016467 967059 923642 886156 853799 825453 800359 777972 757529 738266
63893 738266 719942 702736 686648 671251 656074 640975 626151 612015 599188 588401 580149 574369
63881 574369 570570 568393 567991 569840 574220 581004 589972 601147 614647 630213 647043 664218 681435
63868 681435 699329 718971 740816 764031 786994 808444 828042 845863 861789 875609 887356
63857 887356 897063 904328 908590 909841 908599 905089 898850 889340 876637 861340 844068 825278 805290
63844 805290 784179 761754 737921 712977 687377 661312 634775 607977 581498 555982 531720
63833 531720 508515 485957 464026 443383 424814 408293 392973 378295 364657 352645 342044
63822 342044 332224 323191 315455 308876 302441 295493 288484 282126 276351 270665 265130 260329 256465 253087
63808 253087 249756 246566 243882 241915 240673 240026 239687 239276 238541 237398 235764 233564 230984 228435 226127
63793 226127 223884 221587 219536 218040 216764 214929 212295 209563 207546 206162 204605 202443 200195 198726
63779 198726 198346 198579 198699 198320 197677 197417 198026 199296 200402 200630 199947 198812 197626 196556 195731 195329 195464
63762 195464 196138 197224 198365 199015 198875 198231 197625 197220 196776 196243 196042 196626 197997 199777 201510 202796 203418
63745 203418 203633 204181 205752 208349 211226 213468 214698 215322 216131 217605 219618 221802 224007 226209 228212
63730 228212 229831 231259 232912 234924 237157 239658 242586 245715 248596 251400 254945 259542 264354 268332
63716 268332 271322 273781 275856 277330 278153 278358 277687 275913 273441 270954 268511 265624 262217 258912 256292
63701 256292 254434 253308 253019 253402 253878 254113 254547 255954 258680 262418 266487 270203 273321 276314 279943
63686 279943 284336 288711 292195 294630 296374 297616 298262 298316 297961 297226 295921 294020 291977 290446 289673 289266
63670 289266 288698 288025 287893 288748 290287 291865 293175 294124 294344 293405 291546 289628 288140 286673 284475 281191
63654 281191 276912 271983 267047 262861 259706 257203 254924 252948 251604 251018 251147 251956 253203 254378 255151
63639 255151 255686 256230 256772 257474 259107 262444 267355 272960 278589 284141 289636 294988 300281 305811 311745
63624 311745 318104 325151 333377 342983 353701 365301 377952 391951 407416 424508 443723 465648
63612 465648 490382 517260 545135 572994 600498 627940 655445 682167 706409 726535 741534
63601 741534 750862 754339 752562 747099 739781 731803 723691 715886 708849 702524 696100 688519 678975 666813
63587 666813 651318 632170 610095 586651 563241 540576 519147 499658 482500 467115 452556
63576 452556 438771 426780 417475 410771 406205 403791 403736 405653 408654 412170 416264 421212 427288 434848
63562 434848 444058 454407 464939 475190 485608 496937 509604 523855 540054 558461 579008 601651
63550 601651 626844 655325 687595 723649 762678 802359 838595 866801 884052 890086 886519 875673
63538 875673 860196 843040 826863 813265 802724 795102 789867 785955 781899 776325 768153 756379 740131
63525 740131 719224 694447 667068 638163 608537 578998 550330 523071 497548 474049 452697
63514 452697 433275 415491 399356 385016 372338 361069 351333 343422 337014 331108 325003 318908 313376
63501 313376 308598 304622 301763 300183 299304 298281 297025 296227 296355 297074 297789 298340 298965 299839 300812 301469 301397
63484 301397 300652 300004 300485 302502 305571 309010 312688 316908 321655 326213 329593 331294 331583 331070 330129 328803
63468 328803 327073 324903 322024 318121 313449 308908 305168 301974 298693 295333 292543 290672 289371 288260
63454 288260 287567 287939 289775 292844 296457 300072 303903 308806 315342 323193 331781 341260 352355 365462
63440 365462 380537 397851 418116 441743 468579 498324 530239 562019 589909 610923 624706
63429 624706 632785 636630 637259 636240 635781 637549 642158 650108 662528 680528 704201 732640 764714
63416 764714 799446 835736 871989 905980 935025 956546 969005 972626 969295 961580 951645 940826
63404 940826 929980 919904 911136 903351 895228 885090 871563 853694 830894 803280 771996 738811
63392 738811 705267 672268 640416 610349 582562 557078 533581 511981 492762 476587 463520
63381 463520 452818 443716 436284 431194 428709 428312 429416 431944 436009 441481 448197 456236 465618 476105
63367 476105 487734 501141 516786 534162 552463 571922 593763 618864 647129 678144 711639
63356 711639 746981 782867 817807 850431 879108 902041 918224 927896 931642 929679 922600 912325
63344 912325 901399 891372 882341 873808 865271 856016 845052 831501 814713 794045 769140 740632
63332 740632 710138 679287 649022 619955 592962 569068 548958 532893 520960 513209 509472 509050
63320 509050 510349 510829 507740 499384 485837 468566 449508 430410 412472 396129 381176 367370
63308 367370 354907 344255 335664 329045 324183 320795 318437 316591 314888 313100 310982 308431 305821 303837
63294 303837 302764 302084 300999 299213 296992 294571 291859 288817 285840 283511 282122 281621 281883 282670 283399
63279 283399 283423 282732 281999 281676 281389 280614 279630 279186 279355 279414 279011 278796 279540 281144 282953 284632 286241 287746
63261 287746 289130 290880 293732 297746 302073 305807 308777 311433 314321 317866 322337 327695 333608 339795
63247 339795 346286 353242 360711 368792 377876 388352 400021 412105 424109 436628 451000 468096
63235 468096 487642 508892 531682 556386 582888 610118 636836 662503 687146 710830 733694
63224 733694 756232 778973 801983 825125 848676 873188 898750 924858 950939 976474 1000661
63213 1000661 1022550 1041559 1057273 1068693 1074480 1074141 1068262 1057209 1040412 1017491 989403 957728
63201 957728 923400 887062 850313 815521 784266 756593 731854 709677 690121 673548 660534
63190 660534 651428 645843 642995 642577 644890 650146 658208 669074 682977 699680 718191 737500 757206
63177 757206 777153 796885 815963 834543 853159 872009 890778 909086 926788 943726 959414
63166 959414 973023 983631 990456 992866 990266 982189 968636 950158 927391 900691 870543 838141
63154 838141 805058 772338 740292 709159 679408 651309 624788 600008 577579 557902 540716
63143 540716 525628 512616 501631 492128 483526 475797 469055 462943 457084 451933 448325 446101 443961
63130 443961 441010 437896 435998 435889 437007 438567 440268 442189 444451 447160 450451 454396 458883 463631
63116 463631 468244 472277 475387 477662 479743 482402 485829 489447 492569 495109 497447 499678 501398 502285
63102 502285 502544 502589 502552 502414 502411 502921 503898 504719 504717 503827 502639 501802 501342 500639 499234 497603 496810 497364 498771
63083 498771 500454 502646 505944 510271 514898 519478 524454 530283 536789 543579 550704 558513 567052 576064
63069 576064 585545 595949 607722 620824 634825 649310 664183 679704 696471 715312 737013 762018
63057 762018 790323 821704 856037 893483 934394 978978 1026948 1077548 1130072 1184368 1240644
63046 1240644 1298723 1357727 1416664 1475109 1533079 1590458 1646946 1702517 1757583 1812656 1868086
63035 1868086 1924072 1980509 2036723 2091655 2144332 2193780 2238402 2275835 2303568 2319441 2321664
63024 2321664 2309128 2282184 2242569 2192028 2131407 2061550 1984664 1904005 1822445 1742046 1664804
63013 1664804 1592779 1527241 1468419 1416475 1372124 1335931 1307546 1286269 1272033 1265265 1265847 1272731
63001 1272731 1284630 1300703 1320525 1343728 1369939 1398882 1430256 1463440 1497448 1531300 1564543
62990 1564543 1597340 1629993 1662383 1693935 1724074 1752482 1778726 1801640 1819241 1829497 1831280
62979 1831280 1824543 1809538 1786034 1753515 1712101 1662959 1607730 1547897 1484929 1420668 1357073
62968 1357073 1295515 1236554 1180422 1127478 1078248 1033236 992673 956227 922979 892012 863009
62957 863009 836096 811186 787833 765748 745036 725733 707461 689892 673322 658360 644982
62946 644982 632244 619132 605626 592696 581172 570790 560555 549943 539468 530037 522109 515659
62934 515659 510543 506407 502485 498117 493529 489680 487222 486001 485623 485946 486750 487318 486869 485278 483110
62919 483110 481045 479461 478389 477538 476451 474933 473320 472067 471115 469888 467913 465152 461717 457639 453186
62904 453186 449116 446172 444259 442454 439998 437103 434666 433408 433481 434675 436567 438442 439584 439824 439597
62889 439597 439275 438769 437992 437303 437089 437080 436565 435293 433854 433111 433433 434467 435510 436199 436965 438505 440635
62872 440635 442100 441997 440990 440409 440375 439712 437741 435248 433334 432106 431066 430165 429814 430173 431020 432122
62856 432122 433300 434300 434999 435581 436160 436501 436487 436584 437343 438659 440014 441253 442517 443492 443432 442098 440148
62839 440148 438415 437194 436427 436065 435953 435721 435211 434781 434832 435140 435047 434308 433430 433114 433550 434407 435332 436298 437503
62820 437503 439123 441238 443862 446939 450333 453985 458061 462793 468137 473775 479466 485244 491154 497041
62806 497041 502785 508638 515071 522354 530484 539416 549134 559495 570297 581540 593478 606358 620306
62793 620306 635541 652573 672069 694575 720344 749328 781409 816866 856657 901933 953224
62782 953224 1010308 1073019 1141769 1216976 1298268 1384795 1476245 1572795 1673672 1776163 1876588
62771 1876588 1972077 2060933 2141346 2210431 2264898 2302365 2321769 2322923 2306235 2272831 2224467
62760 2224467 2163109 2090707 2009363 1921441 1829331 1735159 1640688 1547347 1456341 1368823 1285864
62749 1285864 1208075 1135411 1067689 1005293 948994 898962 854299 813746 776606 742847 712550
62738 712550 685586 661683 640535 621863 605489 591284 578972 568184 558794 551023 544990 540333
62726 540333 536432 532925 529847 527449 526079 526080 527586 530467 534590 539952 546429 553682 561685 571144 582939
62711 582939 597162 613105 630219 648786 669583 693293 720398 751320 786300 825247 867906
62700 867906 914221 964497 1019250 1078881 1143336 1212017 1284051 1358625 1434829 1511095 1584939
62689 1584939 1653405 1713809 1764109 1802773 1828524 1840313 1837522 1820187 1789083 1745664 1691949
62678 1691949 1630295 1562938 1491544 1417372 1341986 1267547 1196086 1128529 1064736 1004505 948185
62667 948185 896237 848514 804330 763218 725398 691448 661522 634925 610526 587692 566774
62656 566774 548526 533091 519750 507631 496372 485916 476001 466206 456432 447030 438408 430751 424171
62643 424171 418831 414721 411482 408683 406264 404519 403660 403597 404098 404930 405735 406005 405454 404369 403382 402883 402717
62626 402717 402419 401598 400183 398469 396979 396138 396014 396446 397376 398936 401290 404540 408729 413784 419528 425887
62610 425887 432950 440571 448076 454837 461117 467960 476285 486609 499632 516244 536487 559214 583508
62597 583508 610074 640516 675489 714258 755913 800170 846844 895272 944502 993416 1040351
62586 1040351 1083155 1120084 1150296 1173107 1187262 1191542 1185964 1171778 1150340 1122478 1088980 1051066
62574 1051066 1009979 966491 921253 875527 831096 789299 750378 713960 679881 648344 619465
62563 619465 593109 569181 547707 528530 511313 496034 483077 472480 463375 454656 446107 438383
62551 438383 431971 426686 422279 418916 416737 415339 414155 413195 412992 413839 415359 416798 417556 417429 416595 415501
62535 415501 414617 414165 414098 414371 415179 416879 419656 423351 427726 432926 439598 448395 459357 471905 485515
62520 485515 500373 517368 537487 561178 588167 617784 649499 683256 719380 758179 799567
62509 799567 842902 887076 930793 972795 1011853 1046611 1075634 1097731 1112250 1119101 1118664 1111675
62497 1111675 1098979 1081237 1059096 1033820 1007506 982373 959911 940820 925425 913695 905072
62486 905072 899007 895927 897291 904390 917241 934715 955375 978003 1001557 1024942 1046827 1065598
62474 1065598 1079756 1088521 1091957 1090297 1083316 1070461 1051414 1026303 995593 960078 921003 879881
62462 879881 838060 796476 755755 716440 679177 644828 614299 588057 565790 546677 530024
62451 530024 515578 503350 493361 485641 480187 476746 474675 473246 472194 471970 473388 476976 482558 489387
62437 489387 496621 503684 510263 516107 520930 524424 526249 526024 523520 518928 512769 505354 496538 486311
62423 486311 475595 465901 457923 450799 443221 435044 427283 420663 414887 409467 404536 400386 396677 392786
62409 392786 388712 385081 382301 380183 378337 376524 374649 372812 371383 370632 370269 369757 369104 368957 369840 371708
62393 371708 374266 377224 380096 382283 383692 384886 386347 388002 389770 392125 395555 399784 404080 408253
62379 408253 412878 418568 425436 433182 441290 449208 456794 464693 473798 484237 495283 506453 518308
62366 518308 531880 547612 565242 584511 605611 629026 655376 685462 720071 759458 803101
62355 803101 850137 899885 951751 1004672 1056845 1106084 1150303 1187678 1216677 1236347 1246791
62344 1246791 1249298 1245764 1237681 1225341 1207850 1184068 1153832 1118487 1080217 1040931 1001777 963584
62332 963584 927295 893713 862968 834596 808250 784188 763002 744971 729760 716563 704367
62321 704367 692186 679296 665407 650549 634845 618490 601870 585417 569340 553787 539321
62310 539321 526772 516329 507211 498763 491531 486576 483840 482031 480260 479063 479452 481677 485369 490220
62296 490220 495848 501531 506934 512849 520340 529199 538016 545780 552643 558964 564420 568478 571112 572524
62282 572524 572604 571217 568766 565966 563140 560203 557299 554978 553603 552883 552269 551736 551997 553930 557988 564227
62266 564227 572701 583527 596624 611827 629386 650049 674437 702679 734921 771830 814078 861488
62254 861488 913097 967829 1024594 1081754 1137005 1187922 1232394 1268848 1296612 1316092 1328060
62243 1328060 1332727 1329893 1319849 1303409 1280917 1251825 1215586 1172590 1124189 1072306 1019177 966876
62231 966876 916667 869034 824358 783182 745861 712489 683222 658031 636123 616443 598933
62220 598933 584367 572582 561894 550985 540541 532092 525880 520860 516338 512456 509156 505761 501890
62207 501890 498084 495261 493905 493866 494519 495054 495011 494662 494678 495514 497343 500316 504409 509159 514094 519452 526083
62190 526083 534510 544374 554800 565105 575267 585933 597855 611041 624596 637536 649480 660283
62178 660283 669518 676879 682780 687922 692478 696428 700628 706787 716209 729076 745106 764380 787349
62165 787349 814402 845611 880553 918217 957292 996543 1034621 1069637 1099442 1122477 1138174
62154 1138174 1146701 1148780 1145689 1138761 1128553 1114685 1096554 1073963 1047251 1017323 985603 953441
62142 953441 921450 889806 859239 831206 806866 786265 768722 753669 740974 730811 723429 718759
62130 718759 716077 714297 712720 711330 710417 710232 711061 713270 717156 722933 730635 739532 747721 753083 754944
62115 754944 754418 753017 751476 750092 749330 749371 749315 747496 742602 734385 723551 711254 698489 685729 673272
62100 673272 661982 653241 647868 645458 645135 646532 649572 653639 657785 661806 666467 672416 679234 685848
62086 685848 691651 696896 702085 707334 712437 717378 722544 728482 735691 744680 755908 769450 784855
62073 784855 801552 819222 837621 856302 874901 893528 912519 931950 951865 972831 995687
62062 995687 1020570 1046561 1072371 1096933 1119256 1138196 1152682 1162020 1166015 1165183 1160742 1153834 1144538
62049 1144538 1132037 1115783 1095899 1072369 1044646 1012622 977493 941099 904715 868914 834221
62038 834221 801235 770162 740729 712623 685790 660379 636663 615000 595685 578832 564367
62027 564367 551931 540779 530080 519466 509137 499474 490900 483942 478724 474227 468777 461710 454014
62014 454014 446918 440485 434165 428097 423011 419155 416111 413593 411682 410381 409662 409944 411844 415309 419536
61999 419536 423839 428008 431733 434340 435537 435974 436607 437686 438646 438824 437941 436017 433122 429331 424746
61984 424746 419362 412979 405464 397268 389494 383094 377949 373059 367731 362296 357603 354206 352180 351237
61970 351237 350658 349566 347805 346286 345948 346577 347136 347056 346647 346419 346650 347685 349992 353641 358056 362408
61954 362408 366070 368760 370711 372732 375651 379541 383848 388320 393388 399483 406468 414019 422277 431799
61940 431799 443043 456075 470562 485851 501209 516219 530910 545419 559707 573666 587300
61929 587300 600577 613204 624718 634729 643021 649436 653727 655460 654134 649610 642448 633774 624740
61916 624740 616228 608889 603184 599275 597158 597107 599845 606079 615792 628083 641706 655793 670064 684338
61902 684338 697915 709579 718218 723329 724921 723207 718508 711131 701116 688405 673492 657649 642123
61889 642123 627328 613156 599734 587286 575500 563819 552341 541699 531956 522422 512872 504089
61877 504089 496584 489448 481318 472240 463732 457069 452238 448690 446363 445492 445863 446840 448104 449958 452862
61862 452862 456916 461919 467780 474666 482812 492410 503711 517087 532748 550500 569992 591207 614485
61849 614485 639919 666906 694499 722158 749904 777685 804731 829675 851270 868840 882099
61838 882099 890779 894611 893554 887889 878183 865419 851182 837445 825930 817652 812910 811573 813439
61825 813439 818636 827608 840264 855076 869523 881687 891057 897551 900382 898425 891291 879399 863236
61812 863236 843220 820177 795204 769056 742217 715563 690249 666757 644723 623931 604870
61801 604870 588012 573136 559802 547993 537835 529026 521084 513908 507592 501857 496146 490252 484513
61788 484513 479425 475291 472101 469467 466805 463905 461178 459039 457234 455134 452572 449915 447408 444926
61774 444926 442455 440315 438762 437782 437437 438011 439469 441127 442241 442741 443092 443584 444166 444874 445942 447385
61758 447385 448875 450237 451777 453779 455844 457070 456930 455725 454143 452558 450833 448641 445841 442634
61744 442634 439394 436365 433555 431027 429121 428111 427677 427130 426297 425811 426243 427250 428009 428286 428627 429517
61728 429517 430776 431878 432520 432735 432724 432780 433240 434350 436191 438696 441576 444287 446345 447725 448814 449927
61712 449927 451047 452025 452788 453252 453200 452353 450474 447439 443439 439065 434951 431227 427524 423504 419161 414667
61696 414667 410244 406230 402816 399622 395936 391662 387623 384632 382524 380447 377830 374690 371254 367760
61682 367760 364573 362026 360063 358319 356596 354963 353413 351691 349639 347493 345725 344611 343972 343265 341982
61667 341982 340107 338209 337002 336850 337697 339247 341048 342607 343793 345029 346782 348837 350411 351053 351127
61652 351127 351255 351541 351604 351250 350929 351463 353346 356257 359328 361981 364469 367469 371223 375301 379102 382244
61636 382244 384436 385374 385034 383798 382006 379589 376388 372664 368944 365466 362138 359009 356439 354692 353579
61621 353579 352556 351046 348746 345944 343563 342546 342974 343981 344661 344774 344439 343440 341319 338083 334495
61606 334495 331508 329475 327912 325949 323060 319439 315602 311675 307324 302530 298030 294625 292212 289953
61592 289953 287396 285035 283639 283296 283299 282814 281583 280037 278770 277916 277231 276759 276939 277716 278040 276976 275134
61575 275134 274186 274903 276421 277640 278528 279518 280335 280149 278683 276583 274819 274031 274238 274866 275252 275317 275490
61558 275490 275838 275827 275281 274961 275620 276966 278169 279011 279851 280864 282125 284062 286859 289589 290993 291176
61542 291176 291524 292739 293968 294213 293647 292966 292290 291457 290883 291303 292843 294914 296841 298186 298700 298457 297944
61525 297944 297599 297334 296835 296205 295911 296106 296292 295737 294114 291764 289464 287860 287017 286614 286536 287081 288449
61508 288449 290233 291605 291910 291078 289701 288768 289016 290285 291630 292247 292178 292029 292210 292615 292908 292912 292764 292764 293078
61489 293078 293642 294400 295459 296758 297795 298092 297879 297885 298446 299266 300114 301187 302592 303957 304889 305453 305931
61472 305931 306403 306753 306812 306332 305169 303689 302546 301899 301326 300737 300731 301538 302227 301684 300070 298612 298094 298197
61454 298197 298280 298151 297918 297587 297104 296568 296179 296027 296002 295960 296040 296700 298210 300151 301877 303462 305625 308579
61436 308579 311623 314237 316833 319845 322769 324990 327015 329806 333109 335572 336621 337152 338096 339256 340101
61421 340101 340885 342258 344241 346264 348040 349820 351882 354137 356219 357679 358206 357959 357598 357667 357953 357692
61405 357692 356456 354571 352607 350665 348377 345520 342375 339447 336994 335009 333509 332621 332390 332729 333593
61390 333593 334927 336349 337201 337192 336839 337030 338203 340072 342020 343586 344671 345533 346578 348089 350170 352930
61374 352930 356450 360451 364243 367246 369433 371072 372219 372703 372440 371538 370219 368860 367930 367612 367606 367518 367364
61357 367364 367535 368410 370263 373313 377528 382459 387597 392908 398774 405368 412212 418325 422811 425505 427187
61342 427187 428984 431431 434244 437015 439726 442469 445141 447737 450495 453384 455777 457083 457369 457004 456028
61327 456028 454326 452128 449791 447411 445143 443584 443193 443611 444247 445319 447577 451072 454983 458622 461981
61312 461981 465270 468697 472824 478447 485921 495103 505955 518550 532355 546178 559059 570639 580597
61299 580597 588351 593633 596786 598293 598465 597697 596364 594258 590741 585731 579885 573613 566636 558898 551150
61284 551150 544066 537302 530051 522079 513782 505729 498726 493782 491341 490760 491092 491976 493268 494351 494724
61269 494724 495033 496532 499441 502635 505159 507344 510112 513780 518046 522830 528570 535605 543519 551238
61255 551238 557759 562759 566461 569035 570391 570626 570326 570053 569687 568640 566776 564765 563329 562313 560742
61240 560742 557863 554000 550220 547246 544872 542528 540053 537671 535521 533681 532536 532576 533829 535960 538984
61225 538984 543215 548345 553239 557135 560568 564647 569766 575538 581662 588246 595418 603228 611831 621213
61211 621213 630618 638788 645058 649946 654522 659400 664528 669739 675172 681078 687409 693836 700291 707301
61197 707301 715635 725647 737204 750104 764165 778828 793041 805791 816571 825285 832008 836928
61185 836928 840196 841727 841483 840066 838534 837274 835487 832113 826929 820366 812802 804599 796377 788438
61171 788438 780062 770174 758774 747032 735883 725201 714522 703840 693220 682233 670445 658233
61159 658233 646553 635934 626145 616876 608383 601279 595931 592256 590051 589340 590262 592589 595401 597420
61145 597420 597754 596274 593173 588393 581847 574245 567211 562144 559049 556949 555424 555187 556906 560034 563505
61130 563505 567336 572787 580758 590666 601275 612145 623851 637109 652250 669420 688655 709580
61118 709580 731411 753620 776394 800255 825326 851263 877791 904941 932598 960183 987091
61107 987091 1013192 1038448 1062226 1083592 1102385 1119375 1134947 1148156 1157555 1162684 1164331 1163696
61095 1163696 1161784 1159204 1155836 1150801 1143436 1134282 1124588 1114982 1105265 1095436 1086137 1077970 1071040 1065386
61081 1065386 1061274 1058865 1058098 1058982 1061478 1065030 1068926 1073240 1078696 1085416 1092549 1099349 1105848 1112141
61067 1112141 1117857 1122813 1127377 1131613 1134787 1136363 1136863 1137081 1137056 1136523 1135808 1135473 1135467 1135365 1135052 1134544 1133573
61050 1133573 1132145 1131175 1131801 1134286 1138231 1143505 1150209 1158100 1166911 1177060 1189229 1203333 1218718
61037 1218718 1235292 1253754 1274734 1298405 1324870 1354271 1386356 1420429 1455600 1490888 1525611
61026 1525611 1560430 1597612 1639456 1686776 1739718 1799545 1868302 1946871 2034627 2131339 2238632
61015 2238632 2359845 2499778 2664897 2862825 3101443 3389314 3736945 4157081 4665210
61006 4665210 5282735 6040137 6974567 8122936 9516018 11168434 13049424 15038974 16912505
60997 16912505 18400434 19308926 19619511 19490816 19169326 18887000 18805533 18995383 19411285
60988 19411285 19873580 20107784 19857992 19008778 17627262 15904238 14054164 12245162 10580222
60979 10580222 9107786 7838502 6760987 5854962 5098493 4469556 3946772 3511593 3149395
60970 3149395 2847957 2595688 2381751 2197115 2035122 1891576 1764389 1652287 1553260 1464525
60960 1464525 1384015 1311316 1246937 1191108 1143396 1102835 1067984 1037095 1008589 981398 954917
60949 954917 928985 903975 880639 859619 841099 824847 810393 797271 785257 774285 763933
60938 763933 753209 741261 728221 714912 701738 688347 674462 660577 647485 635415 624004
60927 624004 613018 602774 593717 585802 578507 571464 564878 559156 554232 549591 544968 540656 536928 533486
60913 533486 529852 526167 523195 521540 521077 521198 521365 521373 521251 521051 520705 520089 519242 518467 518039 517925 517841 517519
60895 517519 516763 515321 512940 509567 505404 500713 495679 490454 485177 479861 474342 468518 462602 456979
60881 456979 451706 446324 440381 434114 428302 423450 419410 415908 412996 410749 408894 407207 406019 405834
60867 405834 406587 407767 409171 411038 413553 416721 420605 425082 429366 432535 434607 436459 438541 440467
60853 440467 442090 444055 446735 449394 451141 452124 453034 453821 453828 452956 451952 451532 451793 452392 452738 452021 449657
60836 449657 445772 440910 435349 429182 422937 417451 412963 408803 404131 398730 393021 387684 383301 379963
60822 379963 377104 374014 370604 367416 364878 362890 361120 359354 357475 355451 353418 351441 349167 346120
60808 346120 342475 339128 336759 335170 333760 332319 331070 330215 329815 329974 330740 331789 332567 332825 332922 333542
60792 333542 335128 337496 339842 341210 341216 340399 339790 340048 341060 342321 343499 344570 345580 346499 347283 347888
60776 347888 348235 348281 348152 348032 347917 347720 347639 348079 349015 349754 349703 349143 348785 348694 348224 347042 345692 344899 344743
60757 344743 344760 344509 343743 342276 340089 337512 335108 333423 332897 333796 336034 339137 342456 345328 347190 347870
60741 347870 347775 347352 346306 343830 339784 335050 330415 325692 320475 315304 311350 309090 307886 306864 305743
60726 305743 304842 304676 305507 306932 307984 308070 307704 307915 309018 310449 311765 313198 315027 316949 318466 319573
60710 319573 320720 322183 323755 325073 326053 326980 328192 329737 331313 332529 333145 333110 332499 331442 329968 327985
60694 327985 325656 323682 322816 322968 323267 323181 323077 323338 323534 323053 322206 321991 322922 324664 326703 328723 330334
60677 330334 331097 331028 330683 330581 330873 331562 332591 333606 334037 333571 332270 330252 327676 325082 323254 322493 322393
60660 322393 322475 322720 323265 323899 324187 323949 323406 322979 323111 324145 326222 329249 332968 336974 340794 344101 346850
60643 346850 348991 350168 349916 348124 345131 341453 337613 334116 331242 328929 327037 325583 324475 323316
60629 323316 321904 320683 320162 320024 319478 318440 317701 317842 318654 319799 321352 323328 325231 326500 327063 327152
60613 327152 326933 326619 326543 326789 327073 327265 327673 328517 329497 330258 330906 331633 332152 332022 331352 330715 330449 330476 330747
60594 330747 331422 332588 334090 335715 337325 338800 340059 341139 342094 342902 343627 344555 345904 347429 348580
60579 348580 349119 349398 349970 351061 352570 354541 357429 361681 367130 373127 379450 386779 395888 406597 418013
60564 418013 429608 441338 452606 461858 467695 469953 469327 466480 462007 456795 451612 446453 440961 435526
60550 435526 431416 429605 429879 431213 432828 434778 437769 442546 449285 457567 466981 477606 489728 503266
60536 503266 517843 533300 549663 566521 582798 597277 608966 616869 619987 618090 612348 604683
60524 604683 596518 588423 580823 574344 569087 564080 558158 551416 545281 541001 538485 536847 535686 535385
60510 535385 536347 538457 541362 544959 549553 555763 564316 575717 590143 607814 629332 655309 685747
60497 685747 720190 758406 800360 845362 891810 937953 982399 1023553 1059220 1087374 1106989
60486 1106989 1117521 1117880 1106727 1083902 1050995 1010404 964285 914538 863205 812328 763510 717886
60474 717886 676399 639787 608173 580872 556730 534755 514478 495895 479225 464748 452614
60463 452614 442543 433779 425615 417999 411395 406075 401805 398216 395065 391987 388474 384448 380501 377185
60449 377185 374312 371410 368575 366283 364487 362570 360254 357959 356089 354542 353241 352570 352790 353359 353446
60434 353446 352895 352159 351384 350237 348729 347539 347108 346917 346194 345064 344446 344874 346008 347319 348725 350317
60418 350317 351983 353603 355299 357099 358627 359528 359974 360378 360798 361086 361476 362479 364149 365922 367283 368206
60402 368206 368863 369330 369742 370374 371335 372449 373594 374898 376521 378478 380753 383282 385770 387943 390074
60387 390074 392843 396441 400219 403466 406079 408187 409617 410259 410651 411612 413397 415655 418123 420878 423888
60372 423888 426743 429035 430783 432391 434217 436204 437950 439233 440430 442131 444395 446758 449058 451759
60358 451759 455225 459235 463645 469055 476182 484891 494373 504033 513538 522179 528947 533328 535476 535580
60344 535580 533593 529626 524090 517359 509829 502295 495597 489646 483466 476679 470429 466216 464039 462260
60330 462260 459318 455137 450744 446899 443506 440339 437875 436933 437537 438678 439464 440107 441394 443598 446556
60315 446556 450537 456240 463885 472957 482983 493884 505347 516515 526663 535736 543927 551279 558058
60302 558058 564886 571864 577963 581939 583569 583305 580918 575318 565902 553476 539569 525240 510822
60289 510822 496590 483401 472647 465447 461671 459788 457968 455380 452298 449191 446186 443366 440987
60276 440987 439111 437383 435452 433308 430973 428213 424922 421546 418668 416292 413954 411501 409290 407527
60262 407527 405834 403765 401475 399611 398549 397988 397317 396318 395456 395445 396526 398241 399976 401553 403109 404632
60246 404632 406022 407583 409879 412895 415732 417447 417859 417293 416002 414346 413122 412991 413636 414160 414356 415005
60230 415005 416766 419356 422052 424484 426572 428163 429170 429833 430481 431233 432229 433914 436694 440480 444820
60215 444820 449371 453983 458539 463022 467633 472606 478005 483901 490435 497427 504163 510053 515329 520657
60201 520657 526181 531443 536220 540839 545501 549726 552862 554886 556421 557979 559361 559805 558693 556152
60187 556152 552930 549662 546389 542858 539030 535032 530790 526116 521138 516282 511827 507760 504084 500945
60173 500945 498336 495994 493748 491776 490371 489662 489570 489859 490168 490263 490341 490804 491566 491846 490916 488976 487095
60156 487095 486322 486914 488303 489652 490511 491079 491868 493084 494377 495246 495607 495932 496880 498777 501378 504158
60140 504158 506870 509828 513628 518677 525058 532713 541497 551083 561035 570997 580625 589371 596614 602106
60126 602106 606057 608697 609939 609628 607956 605471 602758 600199 597894 595718 593512 591314 589316 587589
60112 587589 586061 584807 584070 583702 582843 580664 577493 574721 573308 572666 571427 569071 566306 563855 561494
60097 561494 558628 555380 552597 550935 550352 550435 550840 551480 552593 554575 557353 560091 561992 563357 565272
60082 565272 568238 571734 575160 578385 581110 582559 582457 581630 580933 580025 577938 574351 569532 563377 555463
60067 555463 545944 535582 524944 514320 504382 495953 489010 482688 476525 470978 466452 462561 458778
60054 458778 455221 452351 450311 449008 448495 448932 450368 452779 456008 459492 462508 464918 467333 470281 473596
60039 473596 476918 480362 484220 488209 491464 493226 493397 492550 491512 490713 489863 488482 486778 485497 484717
60024 484717 483292 479891 474263 467151 459363 451417 443785 436839 430520 424491 418721 413631 409554 406272
60010 406272 403178 399845 396395 393317 390920 389062 387476 386235 385587 385414 385193 384559 383637 382823 382561 383287
59994 383287 385165 387743 390260 392427 394577 397010 399674 402550 405767 409081 411782 413431 414302 414780 414856
59979 414856 414524 414189 414172 414152 413573 412372 410991 409878 409274 409173 409287 409435 410127 412202 415642 419397 422769
59962 422769 426247 430426 434945 439284 443891 449429 455317 460117 463206 465072 466117 466121 464861 462387 458704
59947 458704 454035 449359 445750 443123 440489 437455 434460 431530 428011 423893 420242 417757 415905 414125
59933 414125 412934 413028 414111 415530 417484 420610 424785 429309 433929 438753 443302 446602 448291 448817 448450
59918 448450 446937 444393 441794 440123 439496 439583 440573 443167 447695 453637 460127 466699 473355 480011 486154
59903 486154 491208 495106 498233 500840 502779 503904 504352 504167 502951 500309 496573 492815 490105 488934 489170
59888 489170 490281 491604 492776 494043 495989 498957 502873 507589 513046 519031 525065 530747 536099 541414
59874 541414 546800 551974 556422 559689 561587 562283 562158 561577 560828 560303 560516 561741 563725 566019 568601 571848
59858 571848 575719 579315 581652 582806 583927 586097 589623 594493 600802 608080 614553 617983 617517 614256
59844 614256 609800 604816 599345 593995 589962 587795 586593 584635 580636 574398 566613 558308 550382 543444
59830 543444 537890 533979 531727 530801 530648 530711 530459 529383 527258 524399 521379 518437 515389 512208 509299
59815 509299 506917 504581 501514 497638 493792 490892 489170 488286 487868 487721 487734 487837 487997 488063 487722 486767 485346
59798 485346 483745 481978 479765 476943 473724 470495 467468 464547 461534 458483 455801 453889 452612 451344
59784 451344 449677 447886 446492 445638 445166 445056 445278 445373 444790 443747 443176 443651 444895 446529 448733 451678
59768 451678 454860 457649 460172 463013 466200 469207 471987 475271 479610 484713 490115 496025 502994 510947
59754 510947 519065 526692 533959 541425 549367 557707 566439 575767 585705 595781 605383 614328 622845 631045
59740 631045 638684 645539 651700 657270 661965 665280 666984 667234 666290 664333 661552 658206 654549 650805 647103
59725 647103 643305 638976 633819 628156 622765 618173 614238 610480 606613 602710 598991 595642 592759 590352
59711 590352 588322 586498 584714 582929 581286 580018 579249 578889 578728 578610 578501 578465 578597 578884 579141 579161 578948
59694 578948 578650 578287 577695 576772 575582 574140 572312 570084 567779 565887 564770 564475 564562 564100 562235 558996
59678 558996 555262 551722 548211 544280 539963 535481 530569 524712 517992 511152 504913 499638 495579 492792
59664 492792 490796 488933 487203 486198 486009 485856 485176 484486 484609 485405 485970 485962 486049 486925 488450 490024 491380
59647 491380 492603 493564 493784 492980 491471 489889 488557 487254 485498 482969 479793 476585 474161 472996 472892
59632 472892 473266 473710 474155 474545 474616 474057 472705 470549 467693 464382 460857 457173 453365 449706 446494 443602
59616 443602 440655 437712 435288 433526 431837 429695 427403 425708 425000 425195 426054 427213 428265 429267 430810
59601 430810 433153 435594 437194 437852 438111 438294 438493 439157 440820 443308 445909 448435 451416 455130 459037
59586 459037 462276 464257 464721 463835 462320 460944 459726 458127 455996 453733 451502 449042 446442 444367 443195
59571 443195 442572 442169 442218 442866 443626 444055 444510 445563 446967 447801 447572 446680 445796 445100 444205 442707 440852 439588
59553 439588 439711 441013 442574 443893 445217 446810 448555 450517 453269 457276 462458 468735 476511 486324
59539 486324 498587 514118 534074 558260 583459 604208 615688 616194 607624 594233 580507 569147
59527 569147 560516 553858 548768 545405 543917 544260 546282 549402 552421 554260 554824 554670 553969 552280 549208
59512 549208 544700 538751 531417 523215 515043 507475 500469 493783 487457 481783 477020 473110 469586 465921
59498 465921 462165 458970 456717 454911 452831 450489 448459 447029 446053 445449 445244 445253 445307 445709 446847 448402
59482 448402 449634 450482 451666 453613 455953 458309 460920 464163 468018 472338 477088 481965 486282 489647
59468 489647 492382 494856 496890 498302 499606 501505 503853 505775 506818 507533 508908 511672 516170 522367
59454 522367 529683 537080 543726 549592 555294 561298 567323 572564 576465 579183 581172 582374 582049 579459
59440 579459 574574 568074 560941 554189 548636 544506 541237 537989 534443 531057 528607 527666 528407 530685 534206
59425 534206 538820 544661 551911 560482 570223 581458 594972 611235 629856 650054 671607 695221
59413 695221 722087 753022 787324 821600 849919 866321 868320 858211 841055 821759 803960 790490
59401 790490 783498 783977 791732 805557 822466 836798 841732 833272 812952 786266 758614 732919 710165
59388 710165 690659 674294 660398 648171 637236 627519 618794 610713 603236 596741 591554 587502 583991
59375 583991 580499 576980 573871 571726 570792 570756 570949 570974 571153 572130 573956 575955 577740 579951 583476 588194
59359 588194 593200 598233 604091 611414 619786 628466 637425 647170 658002 670041 683576 698704 714791
59346 714791 730839 746321 761233 775519 788944 801375 812615 821990 828675 832462 833740 832675
59334 832675 828906 822105 812409 800240 786131 770839 755166 739460 723596 707572 691823 676833
59322 676833 662756 649525 637060 625370 614717 605602 598110 591384 584433 577580 572402 569947 569707
59309 569707 570776 573278 577958 584961 593948 605057 618569 633378 646609 655146 657248 652777 642734
59296 642734 629009 613873 598952 584751 571413 559460 549382 540987 533950 528718 526004 525390 525382
59283 525382 525136 525356 527013 529965 533520 537708 543047 549350 555908 562889 571545 582582 595090 607601
59269 607601 619621 631526 643414 654803 665347 675192 684447 692673 699042 702897 704159 703360 701309
59256 701309 698572 695264 691309 686767 681879 677039 672858 669987 668629 668383 668694 669309 670121 670873 671376 671922
59240 671922 673133 675289 677908 680003 680770 680158 678775 677136 675084 672198 668557 664560 660033 654246 647078
59225 647078 639417 631922 624047 614958 604912 594952 585610 576808 568810 562218 556860 551636 545864 540169
59211 540169 535646 532610 530568 528967 527449 525623 523221 520595 518726 518393 519351 520526 521106 521288 521755
59196 521755 522660 523619 524656 526462 529384 532727 535522 537571 539236 540665 541916 543424 545511 547548 548513
59181 548513 548496 548905 550915 554290 557906 560935 563253 565170 567074 569187 571458 573799 576342 579233 582300
59166 582300 585266 588103 590764 592799 593801 594114 594420 594671 594069 592146 589152 585286 580292 574118 567330
59151 567330 560562 554056 547955 542473 537457 532288 526557 520422 514136 507786 501765 496788 492949 489304
59137 489304 484909 479875 474977 470690 467151 464640 463384 463059 463096 463447 464599 466895 470230 474348 479050
59122 479050 484106 489287 494543 499950 505516 511170 516886 522736 528900 535674 543221 551248 559166 566704
59108 566704 574105 581593 588959 595852 602171 607919 612989 617320 621070 624388 627194 629304 630497 630330
59094 630330 628381 624997 621430 618760 616888 615025 612978 611427 610945 611180 611174 610199 608125 605063 600942 595603
59078 595603 589284 582715 576491 570581 564746 559218 554440 550287 546216 542257 539143 537173 535648 533845
59064 533845 531959 530514 529328 527696 525324 522457 519233 515531 511460 507508 504082 501174 498547 496077
59050 496077 493953 492581 492169 492346 492453 492323 492461 493225 494264 495067 495699 496523 497461 498054 498191 498382 499221 500901
59032 500901 503218 505854 508675 511898 515954 521184 527816 536202 546653 558915 572272 586429 601810
59019 601810 618557 635654 651589 665665 678037 688555 696169 699636 698515 693439 685702 676663 667312
59006 667312 658210 649753 642347 636293 631729 628791 627603 628008 629562 631932 635001 638418 641464 643660
58992 643660 645242 646723 648259 649638 650587 650770 649792 647588 644575 641238 637855 634923 633374 633857 636067
58977 636067 639237 643067 647767 653507 660282 668126 676996 686661 697079 708581 721141 733756 745202
58964 745202 755298 764804 774144 782930 790784 797938 804707 810796 815433 817954 818040 815552 810402 802665
58950 802665 792808 781621 769661 756780 742551 727238 711870 697257 683518 670939 660531 653011
58938 653011 647680 643088 638620 634709 631692 629326 627425 626182 625665 625607 625950 627089 629361 632610 636371
58923 636371 640130 643297 645325 645995 645372 643527 640629 637212 633861 630578 626898 622775 618975 616453 615645
58908 615645 616473 618708 622112 626472 631765 638261 646343 656185 667501 679545 691474 702852 713743
58895 713743 724412 735177 746532 758902 772037 785138 797997 811677 827548 845835 865403
58884 865403 884639 902154 917037 929059 938530 945616 950038 951695 951056 948393 943119 934621 923389
58871 923389 910595 896900 882598 868625 856379 846490 838631 832539 828285 825423 822790 819483 815357
58858 815357 810427 804551 797939 791123 784071 776022 766616 756568 746867 737966 730161 724078 720073 717447
58844 717447 714849 711289 706470 700386 692983 684129 673745 662118 650094 638631 628071 618229 609122
58831 609122 601061 593936 587138 580528 574915 571094 568830 567311 566288 566262 567768 570851 575095 579797 584251
58816 584251 588228 592164 596627 601648 606687 611168 614863 617873 620378 622383 623665 624037 623574 622432 620491
58801 620491 617499 613601 609408 605448 601725 597831 593283 587733 581139 573867 566484 559426 552982 547432
58787 547432 542916 539262 536270 534089 532926 532525 532368 532394 533050 534572 536671 539091 542000 545586 549470
58772 549470 552726 554352 553754 550970 546489 540810 534320 527632 521630 516760 512633 508781 505489 503391
58758 503391 502589 502858 504384 507478 511707 516212 520875 526178 531801 536336 538809 539709 540096 540388 540446 540297
58742 540297 540241 540637 541842 543976 546546 548802 550679 552866 555782 559123 562691 566986 572465 578784 585240
58727 585240 591577 597894 604170 610327 616432 622413 627856 632482 636639 641095 646553 653530 662264 672416
58713 672416 683124 693640 703709 713159 721486 728044 732358 734087 733092 729713 724554 717698 708444 696133
58699 696133 681020 664125 646487 628708 611019 593596 576920 561756 548576 537093 526677
58688 526677 517012 507994 499320 490855 483166 476862 471564 466336 461111 456702 453359 450416 447641 445833
58674 445833 445558 446227 447012 447931 449438 451758 455253 460710 468555 478275 489201 501264 514374 527597
58660 527597 539594 549459 556570 560256 560369 557806 553797 548927 543369 537596 532151 526965 521553 515746
58646 515746 509807 504034 498665 493958 489923 486217 482598 479279 476572 474526 473204 472909 473818 475644 477817
58631 477817 479660 480409 479648 477858 475844 473550 470301 466367 463148 461355 460149 458820 458173 459252 461688
58616 461688 464608 468501 474786 483716 493910 503820 512686 520139 525974 530404 533786 535983 536668 536225
58602 536225 535684 535704 536203 536908 537624 537958 537445 536096 534350 532413 530183 527907 526383 526212 527161 528609 530573
58585 530573 534006 539846 547756 556168 563800 570907 578570 587162 596154 605225 614619 624341 633916 643206
58571 643206 652644 662452 672474 683069 695202 709248 724636 741164 759720 781040 804619 829440
58559 829440 854923 880466 904872 927017 946378 962188 972996 977939 977884 974462 968626 960863 952010
58546 952010 942924 933862 924956 916679 909099 901363 892585 882496 870554 855604 837502 818129 799541
58533 799541 781942 764693 748403 734464 723131 713627 705702 699520 694289 688647 682483 677066 673221
58520 673221 670481 668057 665631 663165 660795 658891 657481 655834 653296 650116 646682 642635 637814 633387
58506 633387 630674 629215 627385 624697 622178 620661 620006 619895 620103 620018 619206 618466 619145 621288 623567 625055
58490 625055 626063 627231 628850 631160 634390 638443 643280 649401 657149 665901 674896 684474 695469 707863
58476 707863 721148 735387 750410 764348 774623 780320 782287 781136 776786 769874 761893 753674 745174
58463 745174 736940 730276 725677 722457 720287 719855 721736 725797 731968 740383 750502 761225 772085 783152
58449 783152 793608 801627 805995 806791 804378 798900 791051 782231 773635 765930 759700 755096 751219 747098
58435 747098 743248 741051 740721 741208 741982 743495 745917 748945 752850 758178 764390 770398 776475 783893 792513
58420 792513 800480 806572 811066 813928 814103 811353 807161 802973 798844 794389 789702 784690 778894 772579
58406 772579 766869 762309 758472 755220 752959 751393 749658 748147 748560 751554 755809 760065 764602 770071
58392 770071 776247 782541 788456 793048 795390 796104 797085 799221 801729 803997 806406 808883 810458 810923 811351
58377 811351 812259 812947 813326 814754 818238 823337 829500 836904 845270 853521 861403 869902 879400 889059 898691
58362 898691 909357 921278 932988 943570 953984 965166 976493 987131 997205 1006566 1014055 1019165
58350 1019165 1023003 1026665 1030117 1033421 1037328 1041839 1046008 1050066 1055833 1063971 1072846 1081207 1089998 1100314
58336 1100314 1111662 1123712 1137734 1154597 1172996 1191226 1209077 1226583 1242657 1256564 1269125
58325 1269125 1280944 1291039 1298688 1305012 1311193 1316829 1321617 1327010 1334441 1343249 1351983 1360465 1369207
58312 1369207 1378173 1387424 1397655 1408933 1420358 1431888 1444764 1459320 1474441 1490084 1507867 1527923
58300 1527923 1547809 1566062 1584263 1603905 1623905 1643246 1663353 1685500 1708263 1730005 1751727
58289 1751727 1775046 1799451 1823912 1849174 1876077 1903663 1931327 1960755 1993289 2027423 2061350
58278 2061350 2095936 2132745 2171197 2210217 2250639 2293465 2337770 2382726 2429495 2478660 2528167
58267 2528167 2576490 2625568 2677926 2733196 2790186 2849914 2913731 2980879 3050687 3124590 3203028
58256 3203028 3283038 3362029 3441233 3522375 3603986 3684520 3766194 3852023 3941810 4034692 4132708
58245 4132708 4238064 4349836 4467219 4592906 4729161 4873697 5023715 5180801 5347578
58236 5347578 5523141 5706530 5901255 6111311 6336014 6573648 6826587 7097654 7385352
58227 7385352 7688347 8010848 8357829 8728970 9123447 9546461 10004591 10498961 11029866
58218 11029866 11603916 12229775 12911655 13654473 14470590 15373826 16372298 17475472 18702509
58209 18702509 20074913 21607532 23317188 25234642 27399502 29852771 32647850 35862895
58201 35862895 39592039 43935554 49014849 54990768 62056892 70431883 80383359 92262087
58193 92262087 106520526 123740280 144667813 170175805 201106007 238053513 281047291
58186 281047291 328886412 378177680 422907580 455621758 470156847 464278551 440367675
58179 440367675 403863805 360857478 316376628 273822194 235111935 201046369 171705066
58172 171705066 146788746 125829486 108286386 93613606 81323575 71005882 62308618
58165 62308618 54933024 48645413 43268531 38654003 34672875 31224737 28233342 25628836
58157 25628836 23345266 21332473 19555343 17980610 16575462 15317385 14192851 13185877
58149 13185877 12277567 11455735 10714710 10045948 9437773 8883240 8378961 7916738 7485192
58140 7485192 7079532 6701731 6351543 6025072 5721504 5443012 5187699 4949853 4727385
58131 4727385 4522117 4332547 4153165 3981607 3820253 3670075 3528576 3394402 3268586
58122 3268586 3150587 3037902 2929984 2828054 2731151 2636883 2545819 2460478 2380377 2302821
58112 2302821 2228257 2159889 2097984 2039360 1982597 1929065 1878593 1828798 1779122 1731242 1685094
58101 1685094 1638777 1592797 1550201 1511922 1475884 1441192 1409277 1380373 1352705 1325752 1300721
58090 1300721 1277271 1253381 1228993 1206279 1185809 1165943 1146356 1128481 1111881 1093920 1073828
58079 1073828 1053588 1033956 1013146 990502 968024 947047 926580 906202 887465 871035 855289
58068 855289 839196 823928 810263 796969 783183 770063 758707 748555 739082 730933 724076 716871
58056 716871 708165 698530 688445 677218 664835 652959 642863 633939 625301 617284 610385 604212 598372
58043 598372 593000 587664 581207 573469 565816 559281 553494 547899 542563 537244 531151 524267 517579 511469
58029 511469 505157 498095 490555 482569 473694 464203 455144 446994 439572 433255 428622 424872 420387 415092
58015 415092 410447 406966 403686 400365 398105 397246 396623 395531 394539 393750 392220 389887 388163 387731 387576 387038
57999 387038 386956 387788 388445 388157 387827 388247 388452 387171 384672 381936 379098 375856 372346 368627 364278 359441
57983 359441 355288 352557 350557 348398 346180 344203 342065 339434 336746 334361 331897 329102 326412 324098
57969 324098 321875 319947 319230 319790 320291 319819 319138 319294 320118 321036 322268 324088 325804 326597 326654 326513 325881
57952 325881 324026 320773 316423 311290 306018 301644 298721 296930 296016 296274 297600 299042 300111 301725 305052
57937 305052 310103 316175 322967 330465 338358 346360 354575 362845 370126 375102 377078 375954 371946 365701
57923 365701 358169 349915 340993 331595 322140 312709 303262 294508 287462 281939 276674 271241 266605 263338
57909 263338 260716 258266 256847 257226 258739 260346 261985 263838 265170 265095 263862 262393 261064 259788 258739
57894 258739 258129 257760 257470 257552 258141 258831 259431 260374 261780 262968 263579 264369 266073 268286 270320 272378 274924
57877 274924 277552 279503 280785 281857 282645 282783 282445 282071 281624 280891 280227 280238 280930 281795 282498 283020 283472 284179
57859 284179 285530 287385 289124 290643 292655 295572 298835 301769 304357 306615 308031 308314 307936 307255 305817
57844 305817 303257 300118 296989 293597 289679 286069 283876 283053 282676 282293 282103 282148 282129 281933 281809 282252 283923
57827 283923 287124 291056 294368 296889 299925 304361 309419 313995 318148 322349 326183 328849 330080 329533
57813 329533 326140 319324 310248 300679 291180 281521 272136 263767 256139 248402 240667 233866 228264 223316
57799 223316 218842 215249 212691 210995 210235 210358 210476 209632 208133 207141 207053 207252 207276 207243 207267 207461 208365 210384
57781 210384 212934 215155 217370 220747 225552 230793 235606 239946 243839 247017 249488 251571 253157 253774
57767 253774 253534 253131 252711 251539 249118 245963 242961 240532 238627 237058 235567 233889 231860 229340 226272
57752 226272 223106 220767 219773 219779 220496 222445 226082 230750 235430 240082 245229 250556 255028 258205 260436
57737 260436 261898 262479 262487 262436 262156 261103 259411 257683 255889 253590 251180 249638 249017 248374 247381 246723 246594
57720 246594 246037 244312 241917 239709 237846 236076 234304 232375 230004 227370 225158 223633 222265 220560
57706 220560 218673 216934 215390 214063 213083 212318 211492 210868 211209 212828 215251 217923 220568 222751 223854
57691 223854 223763 222974 221811 220141 217950 215526 212988 210381 208273 207404 207587 207922 208349 209988 213524 218220
57675 218220 223185 228938 237081 248975 265222 286043 311678 342749 380341 424958 474726 524642
57663 524642 567611 596220 604695 591217 559318 516192 468854 421873 378136 339870 307991 281585
57651 281585 259267 240572 225460 213227 202920 194315 187604 182438 178052 174099 170672 167791 165425
57638 165425 163819 163187 163254 163527 163856 164368 165070 165851 166555 166778 165961 164034 161641 159430 157488 155749 154372
57621 154372 153300 151961 149941 147571 145357 143253 141054 139086 137917 137606 137782 138199 138657 138661 137743 136097
57605 136097 134405 133028 131752 130269 128612 127131 126221 125969 125939 125411 124012 121918 119421 116618 113557
57590 113557 110399 107263 104243 101610 99552 97687 95356 92586 90180 88640 87527 86188 84555 82924
57576 82924 81457 80260 79436 78709 77436 75320 72724 70078 67475 65048 63062 61335 59298 56976 55162
57561 55162 54182 53292 51899 50561 50002 49924 49647 49283 49239 49091 48078 46464 45338 45095 45025 44436 43436 42549
57543 42549 42205 42666 43880 45351 46568 47506 48353 48977 49096 48674 47583 45268 41490 37202 33871 31885
57527 31885 30277 27958 24639 20545 15917 10994 6027 1163 -3392 -7191 -9797 -11132 -11251 -9998 -7230
57512 -7230 -3128 2137 8696 16481 24908 33623 43046 53362 63418 71665 78016 83757 89700 95425
57498 95425 100403 104666 108120 110236 110929 110884 110482 109219 106768 103930 101817 100518 99207 97264 94723
57483 94723 91875 89014 86473 84494 83056 82067 81580 81635 82079 82787 83822 85105 86085 86108 85105 83727 82849
57466 82849 83042 84355 86302 88018 88717 88226 87157 86444 86540 87046 87192 86670 85759 84622 82954 80625 78357
57449 78357 77229 77529 78512 79284 79536 79361 78797 77790 76425 74986 73818 73066 72551 72019 71702 72366 74493
57432 74493 77536 80330 82132 82951 83000 82367 81271 80171 79398 78960 78846 79210 80047 80938 81374 81277 81044 81091
57414 81091 81490 82103 83038 84756 87461 90473 92674 93742 94468 95559 96540 96342 94690 92414 90564 89746
57398 89746 90133 91512 93257 94760 95918 96886 97540 97741 97978 99038 100900 102577 103247 103077 102755 102733 103178
57381 103178 104160 105576 107209 109145 111742 114973 118164 120666 122409 123538 123918 123506 122955 123223 124536
57366 124536 126208 127647 129196 131643 135007 138227 140249 141228 142351 144448 147154 149501 150953 151611 151806
57351 151806 151996 152837 154781 157539 160329 162687 164826 167242 170268 173846 177398 180070 181571 182715 184677
57336 184677 187765 191319 194715 197849 200695 203085 205162 207469 210330 213579 217081 220939 224929 228291
57322 228291 230557 232200 234043 236348 238922 241782 245171 248982 252650 255800 258740 262233 266806 272294
57308 272294 278055 283639 289169 294901 300595 305685 310059 314241 318699 323391 328250 333697 340221 347589
57294 347589 354849 361185 366602 371775 377395 383664 390342 397125 403864 410440 416719 422782 428967 435417
57280 435417 441831 447994 454320 461401 469203 477288 485728 495066 505271 515435 524875 533993 543612 553819
57266 553819 563920 573293 581946 590395 599317 609169 619846 630765 641450 652000 662881 674372
57254 674372 686307 698270 710024 721792 734000 746637 759105 771064 783098 796042 809785
57243 809785 823454 836746 850332 864731 879509 893960 907970 921893 936069 950909 966916
57232 966916 984129 1001899 1019639 1037400 1055392 1073413 1091292 1109488 1128670 1148889 1169634
57221 1169634 1190435 1210920 1230621 1249303 1267376 1285519 1304035 1322966 1342538 1362900 1383659
57210 1383659 1404358 1425310 1447354 1470754 1494930 1519312 1543787 1568236 1592321 1616060 1640052
57199 1640052 1664664 1689413 1713603 1737301 1761172 1785479 1809756 1833587 1857214 1881101 1905124
57188 1905124 1928601 1951081 1972744 1993982 2015008 2036137 2058038 2081180 2105152 2129090 2152754
57177 2152754 2176610 2200787 2224667 2247808 2270644 2293747 2316878 2339465 2361696 2384373 2407738
57166 2407738 2431184 2454354 2477951 2503147 2530531 2559888 2590802 2623130 2657004 2692603 2729976
57155 2729976 2768906 2808868 2849197 2889322 2928881 2967593 3005080 3040973 3075212 3108034 3139396
57144 3139396 3168524 3194274 3215930 3233386 3246654 3255604 3260321 3261340 3259319 3254711 3247916 3239506 3230161
57131 3230161 3220697 3212338 3206678 3204947 3207270 3212615 3219241 3225185 3228820 3229377 3226908 3221622 3213488 3202634
57117 3202634 3189974 3177397 3167582 3163571 3167883 3181532 3204007 3234378 3272311 3318244 3373523 3441060
57105 3441060 3525587 3632761 3768066 3936668 4143891 4395579 4698721 5062635 5499735 6025191
57095 6025191 6656408 7412971 8315639 9383233 10629219 12060449 13677435 15473578 17432880
57086 17432880 19527731 21717347 23947039 26151351 28264032 30230250 32009590 33564573
57078 33564573 34845286 35787441 36328775 36430426 36086266 35316960 34159432 32661966 30884530
57069 30884530 28897689 26777095 24596438 22422136 20309956 18302827 16430404 14710778
57061 14710778 13152811 11757639 10519798 9429154 8473172 7638349 6910859 6277331 5725608
57052 5725608 5244677 4824127 4454291 4127039 3836022 3575948 3341831 3129111 2934182
57043 2934182 2754592 2588798 2435877 2295391 2167301 2051819 1949274 1860091 1784832 1724073
57033 1724073 1678263 1647911 1633591 1634319 1644521 1652993 1646785 1617748 1565863 1496996 1418643 1337687
57021 1337687 1259822 1188684 1125227 1068815 1018967 975598 938096 905200 875744 848909 824001
57010 824001 800715 779470 760674 743711 727292 710749 694302 678300 662951 648677 635780
56999 635780 623726 611628 599588 588740 579733 571964 564597 557652 551720 547312 544894 544985 547677 552336
56985 552336 558150 564849 572714 581985 592097 601110 606051 604575 596529 583536 567253 548752 529498
56972 529498 511680 496857 484916 474916 466457 459749 454877 451689 450191 450573 453064 458155 466668
56959 466668 479237 495828 515938 538672 562063 582584 596137 599888 593266 577677 555758 530694
56947 530694 505451 482055 461380 443542 428444 416114 406739 400448 397120 396469 398370 403020 410896
56934 410896 422679 439054 460308 486055 515269 546069 574937 596643 606142 601311 583809 557442
56922 557442 526116 493102 461061 431842 406315 384699 366847 352133 339550 328357 318501 310194
56910 310194 303305 297315 291699 286210 281043 276781 273892 272210 271160 270500 270361 270615 270803 270926 271710 273777
56894 273777 277033 281273 286929 294780 305270 318581 335084 355217 378940 405481 433321 460066
56882 460066 482589 497954 504615 502968 494955 483158 469845 456558 444450 434713 428276 425182 424887
56869 424887 427298 433074 442840 456669 474600 497185 525285 559794 601741 651921 709618 771478
56857 771478 831469 881694 914010 922861 908188 875631 833223 787627 742983 701904 666264 637212
56845 637212 615346 601081 594595 595648 603924 619487 642699 674105 714773 766463 830929 908951
56833 908951 999623 1099044 1198455 1284241 1341830 1361525 1342046 1289783 1215361 1129876 1042308
56822 1042308 958680 882719 816696 761647 717519 683832 660093 645406 638426 638518 646730 664923
56810 664923 694122 734251 785046 845992 914709 985413 1048855 1094087 1111919 1098874 1058727
56799 1058727 999880 930934 858517 787875 723369 667475 620232 580514 547677 521816 503026
56788 503026 490942 484791 483697 487293 496210 511554 533696 561832 594472 629365 662456 687781
56776 687781 699622 695179 675253 643036 602913 559838 518255 480556 446662 415544 387097 362329
56764 362329 341959 325376 311159 298337 286853 276991 268731 261724 255568 249950 244649 239572 234688
56751 234688 229924 225218 220734 216893 214059 212263 211197 210418 209612 208795 208171 207662 206795 205318 203668 202390
56735 202390 201334 200024 198689 198137 198550 199189 199465 199492 199326 198568 197267 196383 196616 197425 197935 198237 198994 200308
56717 200308 201895 203977 206925 210164 212458 213391 213733 214238 214841 215253 215692 216664 218358 220449 222302 223359
56701 223359 223628 223774 224489 225825 227318 228511 229083 228860 228123 227617 227756 228103 228120 228081 228576 229425 229808 229358
56683 229358 228459 227498 226483 225347 224132 222890 221848 221381 221312 220616 218615 216190 214921 215153 215760 215729 215047
56666 215047 214072 213056 212480 212921 214305 216023 217943 220533 223814 227072 229921 232843 236340 240292 244435
56651 244435 248671 252519 255136 256453 257548 259269 261089 262039 262211 262564 263539 264621 265150 264976 264270 263174
56635 263174 261757 260083 258205 256160 253986 251774 249775 248235 246939 245210 242760 240407 239359 239861
56621 239861 240973 241576 241085 239341 236604 233705 231485 229946 228472 226908 225669 224857 224112 223527 223721 224657
56605 224657 225297 224911 223931 223021 222097 220895 219824 219454 219663 219959 220269 220805 221470 221979 222269 222268 221619 220186
56587 220186 218589 217703 217739 218206 218571 218614 218416 218397 219096 220595 222303 223615 224523 225372 226400 227823 229944
56570 229944 232723 235565 237927 239916 241952 244186 246646 249636 253476 258030 262938 268216 274290 281415
56556 281415 289175 296496 302119 305467 307226 308852 311291 314350 317235 319336 320459 320828 320928 320944 320292
56541 320292 318265 315177 312190 309874 307716 305232 302706 300398 297893 294836 291590 288586 285664 282702
56527 282702 280256 278882 278334 278092 278145 278543 278722 278022 276464 274293 271268 267245 263006 259602 257096 254787
56511 254787 252429 250394 248798 247355 245968 244755 243558 242155 240840 240047 239506 238474 236818 235152 234001
56496 234001 233484 233715 234746 236094 237112 237865 238907 240183 241001 241257 241796 243185 244863 245995 246541 246932
56480 246932 247193 247053 246655 246512 246728 246764 246157 245210 244739 245172 246112 246867 247259 247692 248501 249574 250692 251841
56462 251841 253008 253984 254661 255246 255924 256570 257052 257521 258036 258222 257755 257003 256732 257244 258211 259267 260396 261715
56444 261715 263145 264354 264944 264835 264524 264671 265274 265568 265010 263984 263275 263094 263026 262627 261784 260718 259972 260101
56426 260101 261055 262114 262743 263192 263905 264709 265059 264783 264156 263436 262796 262516 262811 263553 264419 265200 265829 266360
56408 266360 267040 267932 268362 267451 265567 264449 265243 266992 267895 267570 267197 267707 268742 269419 269376 268978 268919 269606
56390 269606 270686 271375 271521 271929 273260 275155 276969 278813 281064 283321 284731 285202 285442 285922 286520 287084
56374 287084 287678 288322 289067 290185 291798 293519 295047 296786 299256 302182 304878 307217 309447 311339 312440
56359 312440 313009 313797 314920 315837 316463 317396 318834 320013 320086 319136 318166 318332 320071 322610 324521 325158 325364
56342 325364 326321 328138 330094 331756 333011 333495 332951 332024 331825 332813 334836 337945 342189 346850 350950 354441
56326 354441 357900 361178 363488 364871 366419 368748 371306 373509 375613 378002 380378 382166 383133 383330 382948
56311 382948 382495 382589 383368 384516 385941 387922 390537 393495 396614 399988 403634 407461 411560 416050 420725
56296 420725 425297 429832 434501 439153 443656 448308 453345 458476 463580 469340 476330 483996 491538 499248
56282 499248 507783 516621 524635 531943 539723 548289 556895 565513 575274 586768 599339 612480 626731
56269 626731 642597 659702 677602 696555 716986 738945 762533 788188 816371 847597 882723
56258 882723 922401 966325 1014052 1066534 1125780 1193038 1268473 1352600 1446651 1551298 1666225
56247 1666225 1791089 1925633 2068675 2218307 2373221 2532411 2693313 2851692 3003653
56238 3003653 3146104 3274936 3384689 3471030 3532235 3567551 3575809 3556714 3512154 3444996 3357633
56227 3357633 3252600 3133416 3003723 2866491 2724842 2582406 2441801 2303869 2169474
56218 2169474 2040976 1920678 1808772 1704107 1606254 1515540 1431800 1354484 1283651 1219679
56208 1219679 1162179 1110097 1062673 1019501 979950 943333 909524 878867 851533 827257 805491
56197 805491 785688 767787 752339 739561 728400 717455 706709 697286 689519 682595 676247 671223
56185 671223 667619 664215 660181 656121 652799 650183 648388 648089 649080 649818 649416 648872 649370 650562 651595 652564
56169 652564 653798 654865 655580 657049 660457 665570 671459 677903 685019 692326 699218 705789 712414 719242
56155 719242 726736 735807 746744 758937 772262 787595 805414 825288 847526 873894 905725 942790
56143 942790 985087 1034330 1092392 1159440 1234573 1316741 1403636 1490960 1574253 1650513 1717388
56132 1717388 1772811 1817224 1854660 1889622 1923563 1955463 1984158 2008256 2025245 2033012 2031865 2023770
56120 2023770 2010580 1994098 1976087 1956015 1929809 1892869 1843657 1783184 1712756 1634595 1553458
56109 1553458 1474873 1401924 1335374 1276077 1225196 1182630 1147317 1118740 1096580 1079506 1066036
56098 1066036 1055929 1049169 1044439 1040364 1037452 1036955 1038613 1041243 1044666 1049170 1053980 1058302 1063098 1069798
56084 1069798 1077952 1086073 1094055 1102786 1112177 1121573 1131412 1142472 1154172 1165548 1177088 1189694 1202779
56071 1202779 1215442 1228538 1243364 1259261 1274809 1290452 1307572 1325877 1344187 1362900 1383054
56060 1383054 1403689 1422836 1440625 1458844 1477955 1496982 1515756 1534803 1553606 1571467 1589433
56049 1589433 1608922 1629146 1648508 1667768 1689061 1712500 1736537 1761032 1787169 1814895 1843271
56038 1843271 1872772 1904482 1937709 1971258 2006287 2044885 2086588 2129292 2172764 2218057 2264353
56027 2264353 2309951 2355754 2404219 2455236 2506493 2557527 2610040 2664768 2721456 2781359 2846168
56016 2846168 2914863 2984959 3056237 3129932 3205354 3281216 3359279 3442573 3530861 3621985 3716712
56005 3716712 3817854 3925629 4038528 4157713 4285585 4420914 4560653 4705874 4860611
55996 4860611 5025534 5198308 5379488 5572217 5776559 5990225 6214697 6454630 6711413
55987 6711413 6983365 7271895 7581215 7912383 8264273 8640001 9045682 9483446 9952816
55978 9952816 10458269 11007913 11605780 12253790 12960533 13739441 14599289 15546185 16594327
55969 16594327 17765087 19076793 20546725 22202887 24082951 26223749 28665763 31468455
55961 31468455 34709354 38472002 42852967 47982298 54023890 61162134 69612900 79655219
55953 79655219 91649868 106055477 123464914 144604863 170224535 200911517 236872221
55946 236872221 277505837 320629138 361811211 394812367 413570247 414736243 398999856
55939 398999856 370353397 334096258 295041372 256687428 221168552 189520339 162020988
55932 162020988 138517448 118653365 101978997 88013959 76309275 66480617 58198930
55925 58198930 51180049 45195331 40073142 35676475 31886500 28607352 25767291 23304012
55917 23304012 21156748 19275314 17624225 16172090 14885952 13739344 12715768 11799796
55909 11799796 10973053 10222071 9541430 8925340 8363455 7847750 7375988 6945251 6548799
55900 6548799 6182035 5845077 5536842 5252555 4989227 4747580 4526467 4321229 4129519
55891 4129519 3953091 3791949 3642320 3502179 3373058 3254291 3140746 3028354 2917069
55882 2917069 2806906 2696330 2586521 2482073 2385231 2293872 2206789 2126040 2052123 1981706
55872 1981706 1912558 1846485 1785218 1727549 1672620 1621905 1575634 1531108 1486824 1444699 1406111
55861 1406111 1369146 1331812 1294676 1258517 1222690 1187579 1155365 1126566 1099030 1072004 1047779
55850 1047779 1027489 1008583 988412 967180 945570 922779 898965 876546 856780 837796 817949
55839 817949 798354 780196 762405 744110 726723 711410 697049 682731 669807 659332 649939 640383
55827 640383 631843 625506 620071 613778 606856 599861 591703 581472 570323 559413 547856 534849 522011
55814 522011 511347 502429 493728 485395 478652 473646 469784 467088 465607 464675 464260 465784 470110 476023
55800 476023 482122 488886 497373 507145 516893 525866 533354 538117 539669 538970 536675 532174 525437 518182
55786 518182 511764 505453 498115 489949 481082 470227 456604 441800 428053 415943 405436 397734 394263
55773 394263 394984 399429 408095 420744 434173 443619 446029 440903 429183 413049 395909 380652 368017
55760 368017 357507 348971 342160 335873 329018 321796 314730 307523 299980 292839 286336 279129 270096 260137
55746 260137 250829 242445 234805 228793 225198 223043 220919 219158 218885 219610 219568 217919 215034 211195 206680
55731 206680 202606 200081 198847 198024 197558 197513 196730 193912 189569 185268 181437 177507 173778 171380 170573 170680
55715 170680 171613 173983 177831 182617 188341 195255 202526 208432 211961 213221 212588 210621 208547 207475 207098
55700 207098 206121 203853 200437 195912 190192 183785 177477 171517 165980 161432 158156 155208 151556 147783
55686 147783 145407 144791 145029 145633 146958 149112 151790 155167 159695 164943 169776 173740 177234 180322 182403
55671 182403 183144 182809 181687 180010 178311 176956 175491 173320 170807 168881 167838 167526 168239 170314 173093
55656 173093 175516 177568 180049 183136 186300 189400 192631 195570 197586 199040 200769 202396 202561 200869
55642 200869 198298 195476 191846 186811 180567 173558 166191 159302 153707 149004 143901 138077 132696 128822
55628 128822 126328 124674 123620 122775 121486 119712 118174 117235 116449 115508 114689 113909 112281 109254 105488 102070
55612 102070 99462 97655 96697 96469 96430 96079 95395 94546 93573 92554 91659 90811 89693 88236 86706 85312 84181
55595 84181 83661 84026 84793 85019 84423 83653 83313 83348 83489 83701 83926 83914 83622 83433 83821 84961 86584 87929 88176
55576 88176 87407 86858 87611 89322 90936 92255 93870 95811 97358 98181 98628 98843 98631 98211 98040 97753 96437
55559 96437 94233 92478 91889 91718 91262 91061 91797 92963 93537 93347 92941 92557 92063 91597 91526 91884 92291 92348 91919
55540 91919 91280 91150 92130 93886 95388 96143 96662 97454 98241 98612 98837 99348 99870 99771 99090 98550 98527 98464 97502
55521 97502 95468 93132 91486 90807 90563 90251 89985 89929 89566 88232 86260 84824 84465 84455 83899 82884 82123
55504 82123 81871 81656 80920 79669 78478 77917 77895 77725 77031 76270 75956 75717 74776 73181 71802 71152 70955 70964 71363
55485 71363 72087 72495 72136 71361 70830 70796 71111 71569 71988 72218 72228 72031 71566 70895 70317 69904 69229 68076 67082
55466 67082 66982 67530 67970 68306 69058 69990 70279 69973 70021 70662 71067 70926 71045 71717 71806 70437 68625 68185 69624
55447 69624 71984 74186 75590 75804 74922 73817 73373 73513 73499 72959 72119 71276 70617 70431 71010 72319 73936
55430 73936 75171 75343 74400 73318 73231 73962 74102 72829 70934 69710 69579 70293 71667 73425 74959 75956 76835
55413 76835 78017 79256 80237 81199 82279 82860 82312 80906 79218 77202 74691 72341 71072 70805 70610 69964
55397 69964 69086 68254 67629 67611 68495 69755 70407 70165 69634 69441 69731 70453 71463 72348 72746 72842 73013 73071 72472
55378 72472 71279 70268 69996 70310 70897 71813 73213 74871 76151 76372 75327 73634 72316 71797 71538 70919
55362 70919 70032 69189 68181 66757 65478 65236 66044 67022 67532 67654 67638 67623 67888 68618 69383 69550 69299 69469 70273
55343 70273 70952 70931 70572 70431 70463 70417 70456 70882 71595 72218 72508 72353 71719 70864 70277 70124 70100 70060 70381 71347 72494
55322 72494 73028 72734 72139 71893 72199 72708 72784 72038 70786 69792 69435 69452 69636 70326 71784 73419 74226 73925 73165
55303 73165 72668 72654 73177 74454 76540 78935 80867 81906 82137 81867 81312 80550 79608 78638 78061 78357 79493
55286 79493 80669 80876 79793 77957 76133 74742 73942 73852 74390 75078 75331 74949 74146 73171 72126 71153 70542
55269 70542 70535 71044 71587 71571 70830 69936 69775 70614 71815 72614 72943 73217 73657 74247 75108 76367 77747 78754 79261
55250 79261 79474 79478 79264 79081 79172 79260 78924 78402 78299 78525 78380 77779 77494 77852 78148 77786 77156 76819 76676 76586 76967
55229 76967 77907 78416 77575 75963 74922 74722 74544 74066 73951 74616 75516 75973 76023 76090 76308 76508 76554 76452 76331
55210 76331 76355 76492 76506 76399 76631 77550 78846 79997 80932 81746 82056 81419 80259 79580 79703 79932 79615 78876 78131
55191 78131 77473 76809 76164 75663 75513 76038 77324 78801 79682 79889 79988 80146 79805 78669 77400 76967 77665 79097
55173 79097 80712 82027 82733 82996 83422 84342 85379 85989 86211 86510 87115 87865 88595 89250 89635 89420 88562 87514
55155 87514 86822 86562 86284 85559 84489 83597 83288 83571 84234 85020 85541 85457 84997 85008 86087 87856 89416 90258
55137 90258 90307 89343 87139 84225 81825 80737 80656 80838 81028 81460 82241 83075 83521 83363 82839 82571 83070 84246
55119 84246 85507 86345 86632 86345 85381 83758 81778 79833 78209 77177 77022 77793 79050 80032 80177 79576 78950
55102 78950 79011 79788 80739 81588 82697 84361 86106 87178 87526 87791 88420 89312 90324 91537 92850 93818 94131
55085 94131 93995 93805 93670 93483 93316 93537 94448 95769 96611 96289 95212 94515 94564 94410 93187 91497 90684 91148
55067 91148 92254 93547 95002 96196 96453 96050 96202 97375 98568 98761 98257 97996 98264 98749 99215 99471 99153
55050 99153 98307 97742 98109 98935 99284 99007 98664 98424 97875 96926 96129 95915 96002 95770 94908 93612 92358 91559 91283
55031 91283 91288 91394 91675 92139 92579 92939 93514 94447 95338 95754 95873 96156 96589 96767 96631 96598 96958 97568 98157 98556
55011 98556 98621 98345 98051 98079 98269 98167 97755 97535 97762 98072 98118 98122 98477 99085 99524 99682 99835 100067 100029 99461 98675
54990 98675 98319 98659 99308 99703 99736 99789 100188 100743 100906 100337 99355 98779 99260 100680 102278 103407 104013 104282 104072
54971 104072 103152 101900 101246 101685 102686 103358 103445 103358 103397 103366 102999 102452 102117 102077 102006 101684 101463 101907 102980 103917
54951 103917 104100 103753 103459 103272 102856 102290 102122 102501 102886 102816 102471 102153 101746 101094 100566 100722 101567 102505 102995
54932 102995 103029 103082 103728 105126 106764 107942 108592 109330 110603 112313 114491 117723 122335 127645 132680 137350
54916 137350 142190 147086 151081 153506 154600 154750 153707 150957 146536 141147 135665 130755 126738 123521
54902 123521 120695 117926 115331 113425 112635 112793 113095 112733 111650 110510 109842 109465 109016 108749 109322 110862
54886 110862 112693 114115 115075 115955 117015 118299 119886 121961 124684 128069 132017 136419 141212 146257 151083
54871 151083 154903 157073 157521 156605 154701 152100 149149 146114 142969 139621 136295 133302 130457 127230 123681
54856 123681 120743 119200 118659 117996 116633 114982 113651 112661 111539 109894 107785 105685 104183 103485 103144
54841 103144 102441 101125 99617 98478 97951 98058 98713 99472 99575 98742 97708 97403 97740 97853 97535 97685 99088
54824 99088 101424 103853 105933 107461 108060 107670 107034 106881 106844 106033 104522 103426 103523 104582 106066 107638 108803
54807 108803 108984 108366 107902 108061 108249 107895 107425 107525 108049 108375 108464 108818 109595 110434 111036 111416 111643 111745 111769
54788 111769 111600 110921 109747 108758 108703 109562 110697 111661 112481 113346 114360 115477 116376 116629 116284 116016 116326 116970
54770 116970 117608 118638 120790 124186 128469 133572 139579 145920 151524 155873 159274 162032 163998 165051
54756 165051 165344 164842 163179 160271 156602 152675 148564 144245 139966 136075 132738 130026 127983 126570 125766
54741 125766 125709 126387 127222 127466 127043 126523 126220 125905 125488 125288 125356 125211 124657 124321 124861 126162 127864 130187
54723 130187 133544 137609 141545 145079 148674 152513 155975 158352 159651 160274 160192 158831 155783 151415 146711
54708 146711 142546 139121 136045 132937 129901 127406 125802 125014 124666 124353 123854 123186 122580 122314 122433 122624
54692 122624 122515 122099 121710 121410 120677 119012 116795 115070 114401 114352 114249 114032 114036 114305 114575 114693 114607 114160 113332
54673 113332 112549 112209 111992 111164 109629 108211 107755 108354 109517 110727 111638 112103 112232 112277 112372 112546 112923 113608
54655 113608 114380 114840 114937 115072 115578 116297 116713 116323 115020 113372 112427 112821 114115 115322 115988 116302 116348 115949
54637 115949 115262 114825 114803 114772 114489 114319 114603 115129 115501 115525 115031 113870 112451 111686 111929 112471 112548 112298 112255 112484
54617 112484 112881 113762 115250 116443 116215 114762 113435 113018 113066 113067 113281 113908 114246 113410 111518 109560 108310
54600 108310 107870 108037 108525 108841 108551 107851 107430 107565 107756 107501 107064 107018 107290 107321 107139 107563 109025 110783 111793
54581 111793 112014 112197 112618 112686 111876 110498 109373 109155 110013 111531 112817 113201 113014 113247 114251 115292 115614
54564 115614 115403 115215 114983 114226 112985 111919 111514 111709 112296 113198 114182 114727 114446 113605 113028 113420 114702 116030
54546 116030 116587 116423 116338 116941 118117 119441 120712 121782 122252 121790 120682 119710 119503 120167 121310 122133 121764
54529 121764 119965 117589 115935 115550 115902 116227 116436 117005 118192 119573 120395 120329 119787 119476 119745 120492 121489
54512 121489 122444 122768 121868 119950 118160 117515 117887 118357 118368 118165 118225 118660 119206 119551 119606 119553 119595 119649 119481 119175
54492 119175 119193 119781 120603 121208 121613 122164 123049 124195 125406 126345 126669 126490 126456 127066 128149 129300 130404 131303
54474 131303 131422 130417 128992 128294 128560 129025 129172 129339 129967 130922 131867 132770 133660 134293 134393 134013 133392 132634
54456 132634 131676 130392 128657 126656 125155 125095 126668 129030 131095 132377 132934 132904 132404 131695 131100 130740 130460
54439 130460 129993 129153 128030 127043 126623 126777 127100 127278 127435 127879 128688 129636 130395 130759 130812 130931 131521 132638
54421 132638 133918 134816 134889 134053 132771 131811 131490 131285 130516 129321 128519 128534 128975 129391 129926 130907 132153 133085
54403 133085 133437 133575 134188 135711 137898 139957 141266 141992 142760 143761 144573 144908 144997 145044 144754 143824 142586
54386 142586 141690 141340 141215 141083 141133 141693 142831 144191 145141 145291 145083 145663 147817 151115 154360 156772 158502
54369 158502 160139 162130 164690 167784 171028 173854 176003 177678 179052 179820 179479 178001 175966 173970 172074
54354 172074 169959 167501 164954 162549 160124 157331 154167 151132 148897 147834 147735 147854 147384 146140 144750
54339 144750 143970 143872 143930 143752 143386 142978 142640 142756 143825 145648 147083 147089 145815 144288 143247 142717 142518 142579
54321 142579 142702 142520 141919 141170 140508 139898 139363 139148 139303 139393 138933 137950 136806 135682 134638 134050 134424 135608
54303 135608 136663 136820 136320 135992 136263 136932 137715 138519 139168 139348 139062 138742 138687 138669 138378 138038 138234 139208 140592
54284 140592 141793 142444 142560 142422 142251 141854 140774 139051 137630 137587 138956 140704 141866 142350 142554 142699 142785
54267 142785 142895 143145 143449 143628 143749 144163 145199 146908 149089 151441 153648 155448 156701 157495 158142 158880
54251 158880 159533 159594 158858 157820 157225 157255 157442 157347 157104 157176 157799 158734 159472 159668 159494 159492 159914 160319 160083 159170
54231 159170 158067 157020 155825 154446 153348 152955 153055 153015 152367 151092 149551 148322 147853 148065 148444 148592
54215 148592 148500 148251 147801 147180 146564 145995 145351 144757 144623 145045 145586 145944 146370 147033 147371 146701 145249 143992
54197 143992 143563 143774 144106 144194 143861 143175 142483 142000 141447 140523 139580 139225 139285 138900 137841 137023 137322 138476 139620
54178 139620 140458 141329 142463 143782 145232 146734 147828 148007 147423 146772 146332 145688 144590 143550 143118 142989
54162 142989 142382 141147 139918 139193 138777 138392 138318 139078 140658 142422 143758 144549 145004 145259 145243 144892 144379 144080
54144 144080 144220 144594 144839 144968 145415 146417 147655 148680 149480 150302 151138 151767 152224 152824 153725 154763 155749
54127 155749 156606 157181 157230 156693 155786 154844 154305 154674 156102 158010 159563 160571 161508 162681 163938 165325 167384
54110 167384 170427 174022 177589 181141 185058 189516 194610 200588 207369 213981 218977 221470 221522 219839 217422
54095 217422 215182 213285 211000 207693 203844 200526 197983 195403 192220 188919 186229 184032 181579 178566
54081 178566 175537 173230 171804 170813 169770 168544 167203 165724 164137 162893 162689 163703 165315 166763 167783
54066 167783 168387 168453 168009 167632 167957 168893 169844 170595 171434 172422 173135 173304 173203 173265 173701 174669 176339 178548 180688
54047 180688 182250 183273 184209 185599 187920 191366 195610 200099 204633 209397 214416 219500 224842 231044
54033 231044 238172 245259 251223 255933 259919 263348 265853 267269 268008 268640 269479 270582 271822 272900 273548
54018 273548 273760 273640 273046 271605 269099 265623 261371 256484 251200 245972 241279 237286 233720 230137 226376
54003 226376 222750 219695 217297 215301 213536 212013 210582 208884 206886 205159 204257 203987 203532 202235 200035
53988 200035 197362 194855 193065 192162 192016 192675 194409 196927 199000 199569 199122 199257 200880 203589 207001 211769
53972 211769 218726 227663 237613 247833 257658 265659 269974 269734 265649 259069 251043 242397 233986 226418
53958 226418 219925 214785 211416 209639 208349 206552 204432 202869 202186 202110 202761 204726 207919 211204 213637
53943 213637 215549 217878 220856 223881 226437 228611 230883 233869 238121 243617 249453 254484 258387 261750
53929 261750 265160 268643 272108 275794 279982 284554 289198 293833 298566 303337 307973 312604 317760 323904
53915 323904 330956 338389 345695 352608 358912 364270 368454 371624 374087 375768 376190 375099 372887 370221
53901 370221 367509 364846 362240 359611 356776 353669 350371 346644 341802 335472 328242 320984 313706 305730
53887 305730 296996 288478 281091 274816 269271 264597 261218 259029 257328 255519 253507 251384 248990 245946
53873 245946 242110 237936 234157 230905 227434 223133 218665 215437 213844 212709 210737 207964 205322 203301
53859 203301 201646 200102 198822 198029 197669 197419 196897 195991 195110 194811 195013 194977 194295 193412 192797 192208 191393 190988
53841 190988 191778 193314 194227 193879 192878 191973 191385 191356 192267 193716 194358 193401 191683 190688 190891 191701 192529 193205
53823 193205 193610 193718 193964 194945 196690 198720 200794 203111 205729 208277 210350 211865 212993 214154 216059
53808 216059 219250 223433 227714 231661 235713 240315 245129 249502 253373 257319 261925 267439 273681 279798
53794 279798 284404 286663 287262 287765 288934 290298 291384 292570 294198 295486 295072 292509 288634 284495 280414
53779 280414 276117 271324 266096 260906 256429 252938 249890 246474 242637 239113 236309 233670 230479 226830
53765 226830 223291 219923 216291 212458 209295 207542 206886 206317 205229 203915 203061 202969 203364 203781 204002 204051 203863
53748 203863 203163 201753 199809 197773 196071 195027 194901 195701 196992 198214 199251 200425 201840 203097 203875
53733 203875 204500 205521 206851 207792 207888 207375 206641 205734 204708 204152 204846 206919 209674 212312 214566 216636
53717 216636 218812 221271 223905 226234 227739 228500 229230 230449 231845 232783 233235 233856 235190 237167 239393
53702 239393 241622 243911 246537 249795 253706 257933 262165 266455 270897 275110 278487 280966 283100 285274
53688 285274 287239 288548 288997 288526 287151 285313 283876 283325 283178 282555 281119 279235 277400 275944 275047 274687
53672 274687 274572 274439 274315 274325 274385 274342 274194 273908 273220 271953 270373 268934 267893 267464 267948 269197 270257 270267
53654 270267 269581 269306 269758 270180 270100 270167 271263 273447 276192 279083 281805 283910 285218 286163 287273 288553
53638 288553 289838 291440 293816 296779 299680 302364 305368 309045 313011 316652 319725 322221 324012 324956
53624 324956 325203 325085 324847 324684 324935 325929 327637 329692 331802 334038 336581 339310 341819 343904 345946 348601
53608 348601 352065 355824 359278 362467 365922 369868 373894 377496 380592 383230 385131 385994 386157 386476 387386
53593 387386 388469 389151 389486 389871 390204 389793 388121 385390 382238 379190 376508 374330 372763 371867 371599 371608 371185
53576 371185 369693 367151 364158 361216 358458 356150 354921 355031 355705 355747 354827 353717 353230 353376 353713 354078
53560 354078 354651 355482 356307 356825 356967 356878 356770 356835 357207 357830 358356 358335 357718 357121 357292 358329 359688 361013 362534
53541 362534 364404 366162 367399 368676 371133 375201 380251 385551 390984 396667 402410 408001 413752 420428
53527 420428 428666 438506 449293 460019 470054 479719 489887 501003 512819 525089 538022 551845
53515 551845 566427 581722 598171 616232 635776 656347 677687 699545 721302 742502 763654
53504 763654 785834 809354 833359 856870 879673 901846 922978 942501 960628 978435 996790
53493 996790 1015479 1033546 1050355 1066127 1081547 1097108 1112957 1129172 1145865 1162982 1180242
53482 1180242 1197404 1214489 1231655 1248974 1266324 1283290 1299134 1313148 1325235 1335905 1345415
53471 1345415 1353143 1358138 1360147 1359731 1357403 1353073 1346406 1337412 1326541 1314392 1301486 1288136 1274421
53458 1274421 1260336 1245985 1231534 1216956 1201977 1186283 1169680 1152087 1133602 1114669 1095972
53447 1095972 1078037 1060875 1044015 1026868 1009212 991546 974937 960357 948177 938414 931294 927087
53435 927087 925316 924531 923267 921201 919173 918145 918331 919357 921040 923772 928060 933892 940753 948318 956889
53420 956889 967008 978892 992465 1007707 1024585 1042748 1061751 1081635 1102854 1125541 1149232
53409 1149232 1173548 1198781 1225488 1253751 1283155 1313359 1344426 1376719 1410728 1446932 1485580
53398 1485580 1526583 1569692 1614674 1661207 1708802 1757139 1806388 1856957 1908888 1961626 2014280
53387 2014280 2065998 2116275 2165154 2213083 2260341 2306578 2351067 2393254 2432829 2469402 2502488
53376 2502488 2531865 2557643 2579918 2598519 2613082 2623167 2628286 2628147 2622889 2612765 2597487 2576200
53364 2576200 2548321 2514265 2475246 2432589 2387391 2340532 2292688 2244280 2195492 2146334 2096779
53353 2096779 2047129 1998281 1951363 1906998 1865200 1825947 1789278 1754544 1720157 1684714 1648170
53342 1648170 1611458 1575243 1539691 1505268 1472920 1443216 1415869 1390329 1366413 1344209 1323841
53331 1323841 1305640 1290051 1277006 1265639 1254945 1244490 1234179 1223601 1212011 1198844 1184077
53320 1184077 1168258 1152391 1137473 1123873 1111354 1099972 1090497 1083506 1078380 1073880 1069605 1066248
53308 1066248 1064394 1063743 1063712 1064243 1065698 1068320 1072222 1077654 1084960 1094313 1105607 1118505 1132553 1147539
53294 1147539 1163873 1182320 1203182 1225935 1249814 1274371 1299206 1323472 1346256 1367472 1387955
53283 1387955 1408446 1428631 1447329 1463522 1477108 1488629 1498347 1505678 1509634 1509777 1506635 1501180 1493989
53270 1493989 1484918 1473375 1458811 1441184 1421137 1399680 1377572 1354956 1331570 1307155 1281666
53259 1281666 1255335 1228683 1202346 1176747 1151913 1127615 1103521 1079314 1054929 1030780 1007477
53248 1007477 985160 963315 941320 918959 896276 873341 850459 828315 807443 787696 768617
53237 768617 750217 732973 717090 702176 687747 673787 660757 649289 639893 632628 626918 621845
53225 621845 616722 611268 605276 598391 590271 580794 569999 557993 545007 531407 517557 503722 490075
53212 490075 476723 463851 451961 441808 433785 427402 421614 415689 409436 402702 395131 386686 378028
53199 378028 370015 362848 355934 348539 340499 332393 325051 318837 313408 308235 303249 298738 294729 290880
53185 290880 287012 283346 280064 277005 274014 271236 268783 266425 263853 261008 257877 254321 250467 246971
53171 246971 244384 242455 240597 238845 237801 237652 237882 238002 237980 237757 237003 235699 234504 234060 234250 234574 234904
53154 234904 235416 235990 236228 235986 235418 234489 233012 231212 229791 229183 229117 229136 229184 229388 229575 229424 228975 228611 228517
53135 228517 228480 228325 228313 228902 230177 231624 232566 232852 233031 233716 234848 235847 236581 237729 239900 242662 244916
53118 244916 246132 246747 247357 248049 248689 249395 250306 251147 251384 250757 249453 247847 246245 244745 243153 241134
53102 241134 238676 236303 234640 233802 233386 232973 232468 232033 231908 232254 232927 233408 233209 232466 231963 232403 233649
53085 233649 234734 234662 233259 231317 229892 229448 229719 230214 230619 230757 230568 230320 230492 231070 231213 230074 227878
53068 227878 225797 224710 224453 224308 223880 223210 222353 221166 219663 218374 218123 219197 220787 221595 221151 220280
53052 220280 220025 220457 220913 221133 221506 222305 223297 224238 225195 226166 226792 226760 226169 225284 224265 223348 222955 223287 224012
53033 224012 224629 224952 225050 224948 224664 224338 224032 223566 222827 222135 221956 222339 222865 223151 223173 223156 223310 223647 223961 224000
53013 224000 223734 223379 223094 222837 222631 222762 223502 224726 225985 226868 227192 227063 226894 227215 228223 229548 230611
52996 230611 231059 230762 229645 227886 226169 225402 226051 227779 229741 231186 231966 232544 233402 234411 235044 235233
52980 235233 235600 236614 237911 238822 239228 239508 239888 240387 241226 242697 244596 246220 247038 247104 246850 246804 247387 248555
52962 248555 249648 250005 249745 249531 249613 249577 249058 248147 246936 245229 242997 240655 238630 236940 235485 234387
52946 234387 233731 233305 232920 232745 232977 233384 233529 233305 232928 232545 232096 231507 230769 229918 229112 228592 228356 228019 227274
52927 227274 226357 225772 225654 225705 225683 225664 225792 226018 226155 226018 225534 224874 224421 224439 224818 225300 225839 226488 227074 227351
52907 227351 227444 227730 228187 228303 227835 227353 227622 228657 229724 230189 230073 229782 229650 229843 230420 231256 232076 232751
52889 232751 233465 234413 235369 235748 235157 233799 232330 231398 231334 232048 233114 234003 234401 234311 233963 233731 234145 235703
52871 235703 238430 241722 244797 247260 249087 250250 250663 250513 250244 250091 249844 249227 248264 247096 245636 243660
52855 243660 241179 238489 235869 233407 231122 229062 227190 225307 223218 220981 218942 217444 216498 215765 214883
52840 214883 213802 212714 211726 210769 209874 209361 209558 210390 211448 212506 213835 215864 218512 221011 222456 222548
52824 222548 221706 220502 219157 217678 216252 215256 214888 215051 215596 216457 217497 218464 219249 220032 221031 222194 223259
52807 223259 224004 224317 224140 223469 222433 221224 219992 218809 217660 216384 214759 212780 210864 209631 209408
52792 209408 209913 210440 210409 209847 209362 209521 210306 211221 211878 212237 212337 212112 211632 211274 211413 212081 213035 213987 214637
52773 214637 214705 214223 213608 213201 212812 212049 211001 210264 210250 210706 211032 210919 210633 210751 211596 212822 213661 213750 213568
52754 213568 213873 214816 215912 216760 217373 217822 218075 218400 219460 221613 224318 226605 228050 229050 230223 231791
52738 231791 233481 234819 235484 235581 235498 235399 235053 234360 233873 234328 235622 236721 236755 235899 234917 234175 233475 232646 231807
52719 231807 231057 230305 229520 228824 228247 227727 227440 227776 228701 229508 229562 229056 228608 228358 228021 227722 228137 229586 231489
52700 231489 233047 234063 234774 235178 234941 233896 232281 230555 229213 228704 229246 230663 232498 234257 235507
52685 235507 235939 235551 234601 233278 231559 229564 227733 226385 225362 224484 224102 224697 225990 227030 227229 226881
52669 226881 226549 226437 226616 227382 228959 230989 232713 233699 234195 234795 235835 237194 238616 240164 242154 244589
52653 244589 246912 248580 249635 250337 250408 249251 246974 244623 243084 242202 241256 239951 238559 237392 236555 236082
52637 236082 235966 236098 236399 236953 237838 238981 240383 242296 244959 248241 251671 254643 256475 256642 255260 253167
52621 253167 251225 249705 248503 247543 246667 245515 244058 242945 242752 243090 243058 242395 241485 240335 238513 236283
52605 236283 234885 235178 236627 238126 239320 240508 241696 242474 242670 242530 242313 242238 242738 244175 246155 247628
52589 247628 247951 247519 247141 247106 247176 247284 247717 248565 249370 249616 249366 249106 249039 248976 248972 249505 250642 251439 250794 248780
52569 248780 246597 245277 245047 245876 247739 250019 251516 251685 251337 251461 251844 251535 250331 248880 247538 246043
52553 246043 244438 243471 243730 244914 246253 247189 247427 246852 245727 244625 243861 243252 242601 242026 241650 241355 241116
52536 241116 241208 241853 242984 244582 246740 249095 250654 250703 249590 248150 246726 245254 244012 243574 244108 245290
52520 245290 246832 248584 250129 250903 250849 250540 250513 250817 251202 251453 251582 252103 253989 257749 262506 266549 268917
52503 268917 269923 270118 269488 267943 265902 263919 262234 261064 260747 261091 261136 260181 258653 257330 256154 254586
52487 254586 252786 251501 250855 250202 249324 248985 249967 252129 254689 256919 258327 258730 258471 258129 257756 256892 255620
52470 255620 255000 255897 257850 259698 261021 262254 263602 264643 265149 265650 266788 268491 270091 271067 271415 271408
52454 271408 271211 270720 269686 268005 265921 263905 262316 261205 260405 259790 259450 259596 260173 260605 260175 258767
52438 258767 256983 255359 253771 251927 250165 249191 249114 249255 249012 248417 247700 246835 245854 245187 245252 245936 246861 248035
52420 248035 249796 252204 254828 257181 259064 260542 261895 263642 266350 270343 275787 282975 292183 303155
52406 303155 315061 327042 338408 348057 354172 355201 351309 344463 336864 329404 321797 313935 306630
52393 306630 300882 296746 293378 290189 287548 286130 285889 286065 285982 285445 284465 283143 281948 281565 282198 283410
52377 283410 284927 287165 290493 294327 297567 299872 302012 304923 308849 313446 318240 322789 326695 329725
52363 329725 331757 332561 331913 330039 327706 325718 324545 324459 325618 327784 330250 332398 334195 335975 337948
52348 337948 340198 342963 346513 350786 355337 359625 363235 366026 368316 370860 374367 379075 384870 391653
52334 391653 399339 407733 416783 426787 437989 450034 462313 474880 488595 504268 521977 541333
52322 541333 561956 583476 605464 627658 650019 672268 693675 713706 732734 751735 771244
52311 771244 790906 810014 828163 845315 861554 877057 892075 906690 920524 932904 943416
52300 943416 952266 959997 966929 972905 977524 980440 981457 980511 977698 973132 966696 958149 947717 936455
52286 936455 925712 916226 907926 900506 893920 888370 884178 881742 881301 882644 885311 889187 894631 901924
52272 901924 910937 921515 933735 947466 961905 976046 989480 1002435 1015141 1027566 1039822 1052398
52260 1052398 1065760 1079778 1093672 1106529 1117963 1128382 1138541 1148656 1157994 1165447 1170492 1173458
52248 1173458 1174938 1175075 1173374 1169044 1161639 1151560 1139946 1127872 1115554 1102426 1087935 1072211
52236 1072211 1056004 1040200 1025425 1011971 999960 989436 980184 971562 962878 954136 946139 939623
52224 939623 934483 930154 926490 923822 922239 921348 920838 920886 921820 923692 926392 929843 933928 938401 943119
52209 943119 948160 953511 958767 963353 966987 969810 972171 974380 976643 979138 982125 985850 990166 994397
52195 994397 997955 1001195 1005219 1010557 1016396 1021431 1025241 1028379 1031250 1033395 1033958 1032428 1028748 1023084
52181 1023084 1015854 1007830 999859 992308 984883 977085 968826 960636 953343 947538 943256 940079 937572 935697
52167 935697 934802 935206 936793 939056 941442 943558 945136 946098 946781 947844 949650 951825 953663 954892 955835
52152 955835 956961 958556 960752 963472 966275 968657 970659 972920 975940 979574 983327 986765 989452 990909
52138 990909 991106 990767 990805 991641 993424 996695 1002247 1010288 1020222 1031426 1043977 1058494 1075554 1095344
52124 1095344 1117584 1141629 1166895 1193318 1221231 1250659 1280886 1310759 1339234 1365637 1389782
52113 1389782 1412144 1433614 1454675 1474769 1492720 1507779 1520100 1530233 1538384 1544293 1547721 1548924
52101 1548924 1548591 1547316 1545189 1541920 1537301 1531336 1523846 1514218 1501738 1486192 1468073 1448317 1427954
52088 1427954 1407833 1388371 1369580 1351587 1335164 1321460 1311097 1303692 1298440 1294974 1293519 1294354
52076 1294354 1297427 1302495 1309442 1318393 1329550 1342876 1357830 1373472 1389072 1404590 1420375 1436375
52064 1436375 1451935 1466481 1480113 1493278 1506023 1517895 1528539 1538053 1546668 1554341 1560778 1565674
52052 1565674 1568705 1569357 1566939 1560922 1551365 1538975 1524628 1508702 1491024 1471511 1450657 1429097
52040 1429097 1406932 1383939 1360430 1337409 1315714 1295491 1276728 1259702 1244396 1229854 1214873
52029 1214873 1199236 1183689 1168713 1153917 1138839 1123732 1109202 1095484 1082483 1070228 1058791
52018 1058791 1047839 1036814 1025663 1015055 1005621 997119 988546 979017 968408 957112 945354 932907
52006 932907 919455 905028 889927 874334 858225 841665 824988 808582 792708 777666 763969
51995 763969 752110 742104 733344 724926 716111 706639 696746 686810 676939 666961 656943 647420 638711
51982 638711 630084 620048 607726 593700 579287 565341 552085 539809 529051 520038 512548 506605
51970 506605 502822 501577 502233 503735 505813 509037 513728 519423 525541 531873 538129 543567 547587 550331
51956 550331 552163 552782 551450 548032 543338 538418 533935 530210 527478 525975 526126 528651 534178 542782 554337
51941 554337 569310 588524 611932 638193 665799 693925 721472 745725 762997 770885 769494 760513
51929 760513 745705 726552 704691 681868 659256 637025 614769 592380 570511 550173 531811
51918 531811 514898 498608 482893 468682 456929 447640 439987 433250 427433 422970 420113 418789 418925
51905 418925 420622 423886 428367 433487 438750 443778 448128 451297 452928 452804 450620 446072 439268 430849
51891 430849 421547 411818 402121 393329 386505 382275 380592 381019 382976 385797 388958 392501 397058 403271
51877 403271 411156 420024 428886 436886 443549 448820 452924 456115 458445 459709 459502 457421 453331 447580
51863 447580 440982 434574 429195 425119 422098 419920 418966 419911 422770 426527 429967 432631 434633 435784 435494
51848 435494 433501 430172 425907 420728 414726 408473 402612 397318 392535 388472 385378 382987 380769 378719
51834 378719 377363 376926 377054 377589 378974 381332 383619 384463 383795 382897 382675 382594 381642 379747 377652 375779 373971
51817 373971 372270 371201 371126 371880 373281 375474 378386 381266 383265 384216 384431 383972 382692 380978 379817 379870
51801 379870 380792 381699 382034 381795 381076 379701 377364 374020 370153 366598 364011 362458 361554 361043 361092 362020 363825
51784 363825 366063 368138 369700 370773 371530 371998 372093 371923 371823 371993 372334 372832 373918 376143 379669 384385
51768 384385 390337 397584 405649 413574 420607 426466 430845 433150 432973 430510 426224 420401 413274 405303
51754 405303 396988 388608 380390 372757 366131 360616 356131 352645 350049 348002 346250 344968 344478 344794 345869
51739 345869 348116 352152 357938 364597 371187 377286 382663 386881 389613 391172 392340 393727 395531 397818
51725 397818 400627 403657 406060 406813 405377 401959 397230 391936 386850 382811 380480 379867 380240 380649 380550 379899
51709 379899 378890 377807 377112 377438 379335 382910 387637 392427 396014 397528 396876 394701 392043 389953 389145
51694 389145 389838 391881 395018 398774 402095 403517 402163 398565 394183 390060 386136 381897 377382 373370
51680 373370 370722 369735 370147 371619 374088 377598 381913 386459 390678 394293 397285 399861 402509 405733 409520
51665 409520 413272 416515 419339 421794 423103 422108 418536 413404 408128 403659 400589 399529 401028 405282
51651 405282 412095 420757 429696 436654 439771 438705 434538 428682 422064 415220 408703 403065 398551 394992
51637 394992 392064 389564 387407 385437 383392 381104 378648 376187 373750 371223 368479 365456 362113 358445
51623 358445 354471 350177 345624 341179 337462 334873 333261 332173 331220 330017 328124 325494 322813 320922
51609 320922 319985 319657 319978 321478 324311 327867 331435 334831 338188 341671 345689 350968 358068 367097 377972
51594 377972 390283 402453 411672 415532 413804 408270 401077 393651 386808 381172 377238 375400 375888 378458
51580 378458 382386 387234 393508 402070 412962 425262 438014 450767 463309 475564 487875 500683
51568 500683 513517 524749 532878 537891 541276 545100 551391 561975 578135 600178 627440 658678
51556 658678 692347 726646 759564 789078 813472 831788 844094 851130 853410 850684 842291 827955
51544 827955 808167 784044 757063 728796 700592 673362 647695 624104 602973 584209 567038
51533 567038 550366 533535 516859 501319 487631 475628 464626 454234 444543 435665 427505 420097
51521 420097 413738 408495 403817 399024 394073 389515 385712 382448 379418 376776 374866 373531 372026 369742
51507 369742 366858 364085 361938 360372 359055 357699 356179 354632 353502 353190 353528 353997 354585 355931 358189
51492 358189 360259 360889 360330 360048 360750 361618 361783 361709 362408 363868 365072 365335 364793 363556 361154 357181 352062
51475 352062 346762 341914 337530 333462 329793 326661 323890 321110 318237 315612 313541 311930 310611 309799
51461 309799 309776 310233 310495 310513 311045 312539 314406 315923 317456 320031 323859 328057 331987 336273 342150 350221
51445 350221 360249 371879 385042 399466 414053 426989 436657 442583 445544 446850 447526 448031 448284
51432 448284 447645 445065 439734 431726 421898 411158 400039 388976 378646 369848 363119 358458 355283
51419 355283 352678 349952 347105 344628 342854 341714 341146 341380 342573 344396 346289 348044 349834 351727 353484
51404 353484 354958 356471 358551 361399 364732 368104 371199 373810 375825 377425 379227 381966 385990 391166
51390 391166 397243 404120 411732 420030 429266 440128 453353 469341 488414 511240 538523 570244
51378 570244 605691 644470 686989 733359 781802 828638 870124 904253 930781 949917 961446
51367 961446 965051 960939 949728 931874 907536 877048 841234 801256 758447 714383 670815 629229
51355 629229 590519 555117 523252 495001 470365 449538 432825 420008 410038 401739 394708 389167
51343 389167 385088 381932 379234 376916 374923 373035 371234 369809 368785 367559 365461 362470 359064 355516
51329 355516 351739 347757 343975 340842 338451 336583 335078 334067 333775 334098 334484 334380 333817 333331 333273 333419
51313 333419 333385 333211 333300 333915 334906 335831 336129 335304 333249 330538 328226 327201 327665 329123 330813 332165 333016
51296 333016 333457 333580 333402 332999 332552 332235 332151 332368 332877 333563 334442 335956 338757 343036 348335 354154 360387
51279 360387 366880 372884 377482 380453 382197 382824 381916 379350 375933 372835 370711 369672 369804 371192 373438
51264 373438 375611 376881 377000 376100 374291 371696 368697 365849 363503 361638 360009 358253 355889 352554 348524
51249 348524 344779 342308 341339 341372 341847 342494 343152 343653 344026 344524 345250 345974 346518 347066 347852 348681 349044 348630
51231 348630 347456 345650 343429 341246 339566 338357 337115 335542 334025 333204 333279 333916 334689 335340 335664 335496
51215 335496 335020 334852 335653 337664 340748 344704 349260 353766 357385 359942 362351 365754 370180 374426 377296
51200 377296 378619 379008 379082 379205 379541 379853 379446 377794 375211 372555 370359 368670 367634 367599 368445 369323 369504
51183 369504 369205 369281 370299 372190 374599 377152 379390 380863 381423 381277 380641 379491 377737 375550 373381 371617
51167 371617 370256 369018 367800 366937 366860 367561 368553 369408 370079 370630 370883 370531 369487 367880 365787 363234 360479
51150 360479 358089 356570 355937 355642 354982 353652 351990 350642 349973 349914 350391 351608 353666 356046 357822 358492
51134 358492 358417 358325 358480 358399 357386 355386 353290 352289 352833 354367 356148 358044 360277 362695 364813 366560
51118 366560 368460 370910 373690 376328 378594 380406 381632 382307 382782 383381 384146 385195 386935 389521 392421
51103 392421 395032 397512 400335 403207 405191 406029 406559 407489 408397 408420 407496 406427 406006 406571 408159 410546
51087 410546 413153 415325 416752 417451 417478 416898 415932 414887 414037 413715 414229 415345 416186 416123 415646 415916 417579
51070 417579 420509 424498 429530 435334 441395 447681 454928 463965 475208 488996 505816 525659 547301
51057 547301 568516 586964 601064 610625 617080 622756 629490 637801 647150 656482 664473 670013 672929
51044 672929 673809 672787 668899 661064 649390 635286 620848 608423 599835 595023 591692 587023 579601
51031 579601 569317 556237 540795 524774 510690 499859 491856 485918 481897 479730 479115 480168 483494
51018 483494 489035 495705 502770 510860 520914 532761 545455 558426 571437 583816 594711 604043
51006 604043 612491 620549 628132 634957 640675 644676 646401 645987 644274 642129 640062 638349 637097 636268 635967
50991 635967 636539 638028 639900 641909 645004 650645 659275 670166 682733 697112 713196 729913 745934
50978 745934 760612 773941 786325 798932 813785 832726 856328 884198 916048 952025 992297
50967 992297 1036933 1086244 1140657 1200079 1263703 1330624 1400396 1472794 1547135 1621960 1695358
50956 1695358 1765490 1830854 1890175 1942360 1986744 2023275 2052239 2073847 2088406 2096754 2100120 2099503
50944 2099503 2095672 2089833 2083470 2076957 2068869 2057459 2042624 2025814 2008188 1989658 1969716 1948308
50932 1948308 1925597 1901474 1875665 1847806 1817087 1782377 1743184 1700151 1654130 1605185 1553107
50921 1553107 1498584 1443139 1388003 1333791 1281286 1231661 1185518 1142296 1101267 1062775 1027999
50910 1027999 997635 971290 948072 927239 908177 890249 873094 856966 842491 830021 819332
50899 819332 809889 801244 793151 785467 778207 771744 766738 763673 762447 762514 763328 764477 765558 766336 767153
50884 767153 768797 771703 775505 779639 784102 789284 795297 802034 809817 819357 830879 843794 857525
50871 857525 872250 888418 905904 924188 943289 964041 987323 1013379 1041967 1072874 1106083
50860 1106083 1141651 1179754 1220960 1266409 1317596 1375863 1441998 1516385 1599569 1692451 1795711
50849 1795711 1909105 2031597 2162198 2300453 2446122 2598638 2756926 2919375 3083661
50840 3083661 3246641 3404626 3553714 3689800 3808611 3906325 3980534 4030704 4057732 4063194
50830 4063194 4049005 4017586 3972136 3916666 3855686 3793660 3734571 3681859 3638505 3606640 3586627
50819 3586627 3576419 3571995 3568606 3561804 3547789 3523410 3486273 3434928 3368948 3288833 3195687 3090685
50807 3090685 2974778 2849210 2716380 2579873 2443392 2309851 2181576 2060826 1949467
50798 1949467 1848237 1756886 1675078 1602796 1539945 1486154 1441108 1404599 1376012 1354152 1337761
50787 1337761 1325909 1317744 1312335 1308979 1307183 1306048 1304156 1300540 1295376 1289297 1282424 1274587 1266070 1257360
50773 1257360 1248362 1238520 1227618 1215757 1202633 1187619 1170660 1152420 1133359 1113404 1092800 1072620
50761 1072620 1053951 1037014 1021468 1007201 994507 983849 975839 971051 969470 970370 973129 977950 985541
50748 985541 996353 1010419 1027622 1047699 1070324 1095603 1124225 1156731 1192905 1232358 1275390
50737 1275390 1322687 1374379 1430078 1489795 1554126 1623384 1696999 1773906 1853103 1933777 2015388
50726 2015388 2097726 2180524 2262823 2343017 2419442 2490395 2553516 2605828 2644754 2668711 2676666
50715 2676666 2667839 2642513 2602878 2552685 2496306 2438272 2382960 2333689 2291975 2258049 2232006
50704 2232006 2214009 2203577 2199328 2199525 2202288 2205172 2205130 2199311 2185612 2162379 2128094 2081979 2024858
50691 2024858 1959040 1887334 1812231 1735855 1660282 1587727 1520390 1459993 1407335 1362316 1324565
50680 1324565 1294005 1270755 1254620 1244982 1241310 1243621 1252345 1267686 1289061 1315053 1343898 1374111
50668 1374111 1404669 1434692 1463079 1488668 1510775 1529490 1545488 1559610 1572557 1584755 1596390
50657 1596390 1607611 1618711 1629989 1641412 1652609 1663346 1673900 1684827 1696466 1708876 1722268
50646 1722268 1737302 1754857 1775645 1800055 1828235 1860120 1895392 1933502 1973768 2015406 2057534
50635 2057534 2099283 2140040 2179664 2218487 2257129 2296265 2336458 2377942 2420036 2460222 2493552
50624 2493552 2513456 2514204 2493722 2454766 2403598 2347314 2291764 2240911 2197059 2161129 2132986 2112091
50612 2112091 2098152 2091104 2090383 2094411 2100978 2108149 2114663 2119449 2120902 2116786 2104926 2084032 2053898
50599 2053898 2014908 1967526 1912370 1850713 1784674 1716679 1648674 1581810 1516730 1454029 1394458
50588 1394458 1338773 1287422 1240354 1197189 1157693 1122052 1090668 1063742 1041166 1022691 1007985
50577 1007985 996492 987492 980553 975851 973896 974930 978744 985066 993914 1005370 1019092 1034306 1050366
50564 1050366 1067163 1084886 1103590 1123268 1144243 1167132 1192210 1219023 1246745 1274798 1303087
50553 1303087 1331909 1361769 1392954 1424901 1456208 1485660 1513209 1539577 1565090 1589477 1612904
50542 1612904 1636601 1662095 1690248 1721414 1756185 1795390 1839394 1887860 1940333 1996818 2057732
50531 2057732 2123626 2195157 2273182 2358560 2451677 2552092 2658604 2769621 2883451 2998238
50521 2998238 3111798 3221704 3325578 3421206 3506304 3578319 3634596 3672825 3691592 3690738 3671137
50510 3671137 3633834 3579423 3508554 3423093 3326440 3222670 3115752 3009631 2908270 2815017
50500 2815017 2732204 2661820 2606179 2567243 2545466 2539956 2549730 2574120 2611839 2660162 2715109 2771764
50488 2771764 2824219 2866051 2891721 2897552 2881336 2841758 2779068 2696277 2598803 2492395 2381282
50477 2381282 2268228 2155749 2046680 1943329 1846365 1754965 1668231 1586322 1510088 1439996
50467 1439996 1375947 1318024 1266737 1222203 1183534 1149486 1119555 1094160 1073851 1058592 1047737
50456 1047737 1040511 1036591 1036245 1039748 1046610 1055681 1066113 1077853 1091068 1105668 1121853 1140541 1162408
50443 1162408 1186608 1211077 1234064 1254696 1272111 1285058 1292879 1296337 1296897 1295525 1292590 1288622 1284526
50430 1284526 1281009 1278141 1275579 1273101 1270995 1270126 1271547 1275856 1282977 1292630 1304892 1320182 1338880
50417 1338880 1361216 1387466 1418062 1453525 1494310 1540473 1591327 1645694 1702769 1762485 1824565
50406 1824565 1887382 1948288 2005219 2057536 2105231 2147817 2184378 2214272 2237095 2251847 2256578
50395 2256578 2249161 2228463 2194789 2149432 2094042 2030486 1961095 1888729 1816333 1746351 1680565
50384 1680565 1620381 1567114 1521946 1485756 1459053 1441966 1434182 1435011 1443611 1459092 1480251 1505241
50372 1505241 1531606 1556649 1577694 1592099 1597409 1591904 1575213 1548406 1513538 1473099 1429694 1385834
50360 1385834 1343656 1304693 1269927 1239865 1214386 1192521 1172526 1152263 1129521 1102348 1069710
50349 1069710 1032238 992208 952533 915631 883001 855284 832381 813724 798854 787680 779978
50338 779978 774897 771402 769107 768322 769333 772045 776266 781837 788386 795377 802522 809807 817066 823997
50324 823997 830734 837883 845769 854068 862330 870319 877538 883103 886658 888998 891127 893004 893829 893280 891842
50309 891842 890102 888423 887258 887101 888010 889664 891886 894660 897735 900867 904482 909385 915674 922567 929484
50294 929484 936683 944547 952870 961208 969355 977047 983654 988621 991856 993293 992562 989598 985278 980898
50280 980898 977178 974209 972090 971089 971271 972468 974627 977754 981609 985833 990442 995916 1002737 1011014
50266 1011014 1020547 1031114 1042796 1056104 1071528 1088831 1107116 1125838 1145338 1165949 1186934
50255 1186934 1206929 1225310 1242653 1259967 1277982 1296949 1316339 1334549 1349442 1359425 1363762 1361952
50243 1361952 1353550 1338859 1319431 1297540 1275392 1254835 1237286 1223507 1213540 1206921 1202528 1198009
50231 1198009 1189840 1174617 1150663 1118681 1081255 1041781 1003248 967287 934117 903457 875381
50220 875381 850290 828263 808731 790803 773903 758130 744072 732155 722161 713441 705528 698388
50208 698388 692189 687133 683484 681394 680494 679888 678726 676734 674228 671791 669893 668524 667088 664891 661870
50193 661870 658673 655918 653510 650696 646748 641712 636686 633085 631205 629680 626930 623047 619535 617238
50179 617238 615429 613270 611214 610243 610465 611331 612845 615481 618979 622182 624293 625701 627328 629698 632869
50164 632869 636766 641185 645817 650600 655954 662483 670673 681026 694207 710647 729989 751271 773761
50151 773761 797543 823195 851055 880979 912836 947007 984077 1023967 1065556 1107303 1148186
50140 1148186 1187969 1226787 1264816 1302462 1340640 1380508 1422556 1465792 1507814 1545730 1577009
50129 1577009 1599493 1611037 1609794 1595089 1567918 1530478 1485389 1435260 1382533 1329295 1277169
50118 1277169 1227362 1180689 1137573 1098262 1063073 1032210 1005274 981241 958974 937563 916258
50107 916258 894672 873278 853188 835049 818508 803083 789131 777445 768163 760648 754357 749319
50095 749319 745758 743656 742785 742855 743568 744756 746546 749276 753275 758746 765661 773606 781865 789872 797462
50080 797462 804638 811356 817619 823410 828368 831935 834101 835579 836869 837635 837407 836356 834781 832312 828417
50065 828417 823430 818216 813005 807434 801682 796625 792707 789426 786174 782895 779751 776836 774597 773891
50051 773891 775260 778467 782921 788113 793603 799283 805822 814198 824490 835806 847643 860496 874613
50038 874613 889022 902614 915669 929438 944540 960489 976626 992765 1008999 1025559 1042952
50027 1042952 1061732 1082081 1103895 1127042 1151032 1174518 1195755 1213746 1228609 1240899 1251065
50016 1251065 1259697 1267781 1276305 1285610 1295156 1303674 1309362 1310073 1303633 1288398 1263933 1231350 1192815
50003 1192815 1150616 1106815 1063697 1023928 989666 961522 938634 919553 902907 887644 873302
49992 873302 860076 848205 837263 826415 815281 804069 792789 780792 767389 752649 737374
49981 737374 722451 708397 695375 683362 672200 661590 651228 641152 631880 624001 617541 612024
49969 612024 607218 603443 600890 598983 596806 593930 590460 586571 582569 579263 577653 578207 580845 585548
49955 585548 592389 600961 610422 620302 630725 641618 652262 661910 670362 677661 683750 688828 693461
49942 693461 697785 700942 701886 700496 697378 692783 686327 677557 666243 652310 636274 619730 604603
49929 604603 591651 580263 569896 561055 554540 550360 547907 546699 546444 546788 547629 549347 552101 555086
49915 555086 557230 558509 559868 561845 564076 566321 569221 573533 579214 585767 593040 601171 610128 619913
49901 619913 630964 643613 657068 669479 679197 685707 689444 691142 691502 691004 689604 686644 681276 673145
49887 673145 662830 651652 640831 630584 620194 609133 597819 587038 576964 567330 558274 550276
49875 550276 543292 536613 529845 523512 518457 515131 513592 513643 514744 516325 518563 522325 527948 534573 541174
49860 541174 547813 555311 564057 573850 584650 596665 609589 622370 633932 643687 651275 656353 659025
49847 659025 660155 660849 661524 661586 659960 655950 649707 642022 633674 624968 615811 606179 596503 587655 580465
49832 580465 575119 571114 567960 565750 564715 564468 564299 564222 565041 567269 570724 575507 582438 591824 602487
49817 602487 612910 622955 633522 644785 655706 665261 673245 679838 685168 689473 692938 695129 695230
49804 695230 693031 689102 683878 677268 669412 661062 652769 644328 635486 626672 618489 610898 603464 596082
49790 596082 589006 582459 576738 572409 569747 568108 566407 564175 561704 559242 556625 553818 551281 549528
49776 549528 548717 548972 550842 554949 561210 568738 576560 584177 591327 597555 602408 605944 608693 611091 613307
49761 613307 615571 618069 620249 620812 618942 615198 610591 605123 597988 589077 579404 569898 560601 551393
49747 551393 542797 535502 529553 524542 520333 517127 515029 513921 513635 513907 514258 514230 513742 513102 512790 513274
49731 513274 514764 517042 519746 522907 526938 531986 537715 543899 550823 558815 567766 577360 587354 597282
49717 597282 606301 613802 619855 624656 627923 629331 629211 628160 626189 622897 618361 613159 607488 600958
49703 600958 593471 585782 578926 573433 569257 566137 563808 562144 561252 561255 561957 562977 564284 566365 569714
49688 569714 574368 579987 586164 592552 598900 605134 611376 617833 624756 632459 641324 651787 664263 678784
49674 678784 694431 709327 721533 730010 734667 735856 734278 731159 727870 725167 723125 721819 721673 722908
49660 722908 724933 726419 725900 722376 715677 706311 694804 681299 666109 650477 636197 624302 614480
49647 614480 605919 598386 592380 588610 587434 588460 590593 592827 595090 597849 600829 602754 602703 601099 598895
49632 598895 596271 592805 588518 583946 579260 574062 568238 562432 557443 553500 550372 547806 545661 543816
49618 543816 542232 541010 540228 539773 539414 538981 538470 538053 538008 538511 539412 540314 540901 541146 541213 541230 541234 541312 541733 542810
49598 542810 544450 545918 546350 545682 544875 545001 546205 547784 549109 550148 551135 552068 552651 552555 551690 550356 549131
49581 549131 548386 547980 547691 547903 549426 552439 555989 558819 560540 561752 563321 565895 569911 575478 582105
49566 582105 588956 595712 603018 611786 622048 632632 641951 649042 653889 656956 658560 658710 657367 654695
49552 654695 651047 646928 642995 639885 637786 636298 634886 633395 631988 630775 629839 629476 629857 630448 630339
49537 630339 629420 628744 629375 631359 634326 638559 644686 652505 661114 670336 681229 694849 711175 729613
49523 729613 749813 771198 792047 809948 823294 831911 836318 837027 834776 830949 827280 825103 824957
49510 824957 826727 830042 834502 839526 844027 846558 846016 842126 835123 825264 813068 799767 786918 775429
49496 775429 765359 756547 748881 741851 734654 727199 720510 715580 712210 709527 707297 705990 705726 705978
49482 705978 706458 707558 709553 711936 714033 715879 717980 720375 722476 723800 724429 724770 725195 725968 727139
49467 727139 728405 729366 730095 731177 733041 735448 737779 739594 740736 741176 741037 740610 740007 738939 737099 734684
49451 734684 732220 729974 727874 725908 724175 722558 720772 718864 717218 715955 714756 713529 712826 713230 714614
49436 714614 716377 718230 720409 723310 727244 732416 738826 746302 754834 764687 775824 787421 798358
49423 798358 808127 816900 824696 830807 833964 832903 827065 817353 806196 796296 789095 784577 782321 782168
49409 782168 783929 787224 791932 798395 806913 817384 829543 843147 857721 872650 887777 903505
49397 903505 919952 936410 951956 966221 979247 991044 1001778 1011970 1021868 1030788 1037560 1041480
49385 1041480 1042403 1040202 1034824 1026863 1017453 1007467 997216 986907 976869 967188 957638 948264 939720
49372 939720 932914 928469 926609 927131 929375 932558 936356 940895 946003 950767 954093 955566 955593 954841 953697
49357 953697 952090 949622 945928 940939 934790 927549 919290 910412 901588 893287 885629 878767 873041 868526
49343 868526 864737 861052 857280 853598 850186 847224 845060 844065 844356 845881 848675 852856 858531 865897 875271
49328 875271 886788 900258 915511 932488 950363 966682 978044 982101 978864 970193 958451 945647
49316 945647 933113 921327 909895 898077 885508 872549 860091 849011 839646 831647 824438 817881
49304 817881 812401 808499 806256 805359 805443 806381 808292 811222 814704 817781 819710 820557 820832 820742 820198 819357 818433
49287 818433 816963 813995 809352 804117 799497 795784 792798 790690 789692 789644 790550 793116 797896 804182 810675
49272 810675 817074 824110 832116 840551 848975 857424 865587 872641 878317 883269 887904 891727 894466 897085
49258 897085 901039 907211 916205 928827 945234 964072 983422 1002151 1019363 1032919 1039933 1039024 1031166
49245 1031166 1018177 1001223 981157 959445 938053 918583 901722 887218 874379 862938 853495
49234 853495 846827 842953 841459 842524 846725 853697 861865 869921 877915 886496 895740 905272 915058 925424
49220 925424 936492 947953 959267 969845 979357 988027 996291 1004010 1010471 1015415 1019573 1023927 1029093
49207 1029093 1035777 1045060 1057397 1071791 1086772 1102007 1118278 1136053 1154825 1173738 1192160 1209588
49195 1209588 1225653 1240395 1254088 1266751 1278257 1288858 1299123 1309295 1319185 1328720 1338081 1347269
49183 1347269 1356057 1364611 1373717 1384263 1396821 1411840 1429806 1451123 1476264 1506258 1542491 1585532
49171 1585532 1634156 1685379 1734979 1777967 1809592 1827115 1831156 1825213 1813803 1800750 1788516 1778333
49159 1778333 1770635 1765462 1762560 1761300 1760881 1760847 1761319 1762694 1765328 1769609 1775982 1784549 1794764 1805823
49145 1805823 1817392 1829731 1843168 1857636 1872739 1888102 1903553 1919088 1934814 1951010 1968114
49134 1968114 1986380 2005408 2024220 2042063 2059048 2075707 2092090 2107768 2122793 2138119 2154801
49123 2154801 2173048 2192217 2211434 2230035 2247883 2265676 2284731 2306022 2329568 2355096 2383158
49112 2383158 2415286 2453401 2499703 2557094 2628695 2715773 2815342 2919598 3018669 3106192 3184068
49101 3184068 3261191 3344609 3429522 3498068 3529964 3516551 3466172 3397074 3324858 3254528 3181515
49090 3181515 3098779 3003863 2901264 2799570 2706649 2626810 2561058 2508576 2467514 2435287 2409323
49079 2409323 2388034 2370926 2357803 2348025 2340457 2333820 2327079 2319815 2312361 2305416 2299402 2294281 2289903
49066 2289903 2286204 2283000 2279953 2276976 2274381 2272293 2270155 2267195 2263334 2259222 2255413 2251922 2248734 2246248
49052 2246248 2244836 2244250 2243999 2244366 2246656 2252066 2260326 2269507 2277059 2281019 2280533 2275750 2267529 2257060 2245465
49037 2245465 2233604 2222270 2212455 2205198 2201110 2200135 2201729 2205100 2209290 2213405 2217065 2220551 2224237 2227959
49023 2227959 2231087 2233150 2234144 2234316 2233963 2233547 2233731 2235042 2237559 2241055 2245360 2250445 2256215 2262399 2268726
49008 2268726 2275163 2281896 2289072 2296599 2304262 2312017 2320077 2328615 2337377 2345623 2352456 2357284 2360077 2361245
48994 2361245 2361185 2359930 2357310 2353467 2349009 2344530 2340064 2335130 2329233 2322239 2314433 2306468 2299111 2292789
48980 2292789 2287325 2282308 2277683 2273750 2270599 2267839 2265043 2262236 2259751 2257646 2255476 2252639 2248991 2245067
48966 2245067 2241714 2239432 2238138 2237554 2237652 2238616 2240530 2243365 2247214 2252259 2258536 2265916 2274288 2283550 2293480
48951 2293480 2303979 2315443 2328569 2343700 2360637 2379114 2399018 2419959 2441139 2462096 2483430
48940 2483430 2506434 2532141 2560885 2592554 2626844 2663415 2702207 2743558 2787628 2833748 2880814
48929 2880814 2928445 2977355 3028443 3081880 3137299 3194469 3253361 3313697 3374839 3436154 3497179
48918 3497179 3557449 3616455 3673834 3729425 3783093 3834724 3884452 3932567 3979023 4023281 4064868
48907 4064868 4103948 4141075 4176535 4210266 4242392 4273449 4303939 4333850 4362651 4389480 4413329
48896 4413329 4433378 4449448 4462046 4471882 4479529 4485435 4489793 4492252 4492181 4489609 4485505 4480718 4474885 4466832
48882 4466832 4455675 4441108 4422963 4401323 4376910 4350446 4321403 4288140 4249594 4206259 4159230
48871 4159230 4108933 4055325 3998809 3940333 3880896 3821441 3762948 3706009 3650489 3596166 3543628
48860 3543628 3494007 3447798 3404417 3363053 3323549 3286309 3251643 3219476 3189570 3161901 3136848
48849 3136848 3114960 3096522 3081450 3069690 3061441 3056709 3054798 3054681 3055912 3058903 3064246 3072023 3081876
48836 3081876 3093491 3106833 3121968 3138717 3156526 3174718 3192885 3210898 3228560 3245563 3261974
48825 3261974 3278443 3295535 3313057 3330415 3347467 3364579 3381948 3399383 3416780 3434307 3451998
48814 3451998 3469573 3486783 3503575 3519892 3535756 3551660 3568326 3585920 3604009 3622576 3642371
48803 3642371 3663815 3686202 3708793 3732268 3758029 3786148 3814899 3842525 3868565 3893045 3915254
48792 3915254 3934216 3950068 3964084 3977280 3989574 4000490 4010179 4019378 4028516 4037088 4043792 4047107
48780 4047107 4045885 4039672 4028669 4013348 3994061 3970922 3943995 3913581 3880292 3844810 3807505 3768298
48768 3768298 3726997 3683666 3638549 3591762 3543406 3494099 3445016 3397124 3350542 3304974 3260614
48757 3260614 3218224 3178361 3140910 3105497 3072008 3040570 3011370 2984669 2960639 2938813 2917966
48746 2917966 2897007 2876065 2856476 2839699 2826430 2816583 2809752 2805532 2803604 2803638 2805095 2807152 2809033
48733 2809033 2810416 2811376 2812000 2812295 2812444 2812900 2814101 2816271 2819514 2823887 2829238 2835123 2840972 2846253 2850471
48718 2850471 2853275 2854673 2855014 2854608 2853564 2852096 2850760 2850175 2850569 2851788 2853629 2855930 2858347 2860289 2861230
48703 2861230 2861038 2860047 2858837 2857923 2857556 2857747 2858463 2859752 2861674 2864239 2867460 2871367 2875848 2880457 2884455
$$ [...]
##END NTUPLES=NMR SPECTRUM
##END=
