
##TITLE=AC1171_Tolima-ibage-TiCOAH12008_7165761_UmsBb4bDfb
##JCAMPDX= 6.0         $$ Bruker NMR JCAMP-DX V2.0
##DATA TYPE= NMR SPECTRUM
##DATA CLASS= NTUPLES
##ORIGIN= BRUKER
##OWNER= Administrator
$$ 1.72 TOPSPIN		Version 2.1
$$ 2012-12-02 00:29:47.642 -0500  Administrator@X
$$ Compression mode = diff/dup
##.OBSERVE FREQUENCY= 400.02188249412
##.OBSERVE NUCLEUS= ^1H
##.ACQUISITION MODE= SIMULTANEOUS (DQD)
##.ACQUISITION SCHEME= undefined
##.AVERAGES= 64
##.DIGITISER RES= 22
##SPECTROMETER/DATA SYSTEM= spect
##.PULSE SEQUENCE= noesygpps1d.comp
##.SOLVENT NAME= COFFEE_meoh
##.SHIFT REFERENCE= INTERNAL, COFFEE_meoh, 1, 14.96238
##AUDIT TRAIL= $$ (NUMBER, WHEN, WHO, WHERE, PROCESS, VERSION, WHAT)
$$ ##TITLE= Audit trail, TOPSPIN		Version 2.1
$$ ##JCAMPDX= 5.01
$$ ##ORIGIN= Bruker BioSpin GmbH
$$ ##OWNER= Administrator
$$ $$ E:\/data/COFFEE/nmr/AC1171_Tolima-ibage-TiCOAH12008_7165761_UmsBb4bDfb/12/pdata/1/auditp.txt
$$ ##AUDIT TRAIL=  $$ (NUMBER, WHEN, WHO, WHERE, PROCESS, VERSION, WHAT)
(   1,<2012-12-02 00:29:41.548 -0500>,<Administrator>,<X>,<go>,<TOPSPIN 2.1>,
      <created by zg
	started at 2012-12-02 00:18:11.689 -0500,
	POWCHK enabled, PULCHK disabled,
       configuration hash MD5:
       86 BA 57 50 F2 9D 5C 9B 26 00 A9 28 5F 66 2E 89
       data hash MD5: 64K
       53 2E 34 28 05 C6 F3 90 DF 60 A8 5C F3 2B 1A 70>)
(   2,<2012-12-02 00:29:44.689 -0500>,<Administrator>,<X>,<proc1d>,<TOPSPIN 2.1>,
      <Start of raw data processing
       efp LB = 0.3 FT_mod = 6 PKNL = 1 PHC0 = 0 PHC1 = 0 SI = 128K 
       data hash MD5: 128K
       50 3F 50 AF CB 0F 02 20 71 E2 AF 6B 9F 9A 70 2C>)
(   3,<2012-12-02 00:29:45.767 -0500>,<Administrator>,<X>,<proc1d>,<TOPSPIN 2.1>,
      <pk PHC0 = -78.55225 PHC1 = 0 
       data hash MD5: 128K
       94 88 97 3D 79 B8 37 26 54 78 0A 4C C7 96 02 6F>)
(   4,<2012-12-02 00:29:46.501 -0500>,<Administrator>,<X>,<proc1d>,<TOPSPIN 2.1>,
      <abs ABSG = 1 
       data hash MD5: 128K
       2E 4B 82 87 94 46 C6 6F 79 84 52 69 E8 7F D3 74>)
(   5,<2012-12-02 00:29:46.689 -0500>,<Administrator>,<X>,<proc1d>,<TOPSPIN 2.1>,
      <abs ABSG = 2 
       data hash MD5: 128K
       14 7F 2C D4 8A 34 F1 EF 8D D2 34 85 A7 79 9F 06>)
(   6,<2012-12-02 00:29:46.892 -0500>,<Administrator>,<X>,<proc1d>,<TOPSPIN 2.1>,
      <abs ABSG = 3 
       data hash MD5: 128K
       63 D9 D9 B4 DA 6D 31 27 B1 C6 25 47 79 75 1F 1A>)
(   7,<2012-12-02 00:29:47.079 -0500>,<Administrator>,<X>,<proc1d>,<TOPSPIN 2.1>,
      <abs ABSG = 4 
       data hash MD5: 128K
       18 65 07 72 6E B4 C3 F8 68 92 C3 A1 9C 6F 4F 82>)
(   8,<2012-12-02 00:29:47.267 -0500>,<Administrator>,<X>,<proc1d>,<TOPSPIN 2.1>,
      <abs ABSG = 5 
       data hash MD5: 128K
       15 F7 B6 03 15 25 14 60 C8 CD 2F F1 D0 C2 64 44>)
$$ ##END=
$$ 
$$ $$ hash MD5
$$ $$ 9C 42 F8 35 19 A2 21 DD 33 6B E4 19 73 9D 68 46
##$RELAX= 
##$RELAX= 
##$RELAX= 
##$RELAX= 
##$RELAX= 
##$RELAX= 
##$RELAX= 
##$RELAX= 
$$ Bruker specific parameters
$$ --------------------------
##$DU= <E:\>
$$ [...]
##$TP07= 0
##$TPNAME0= <>
##$TPNAME1= <>
##$TPNAME2= <>
##$TPNAME3= <>
##$TPNAME4= <>
##$TPNAME5= <>
##$TPNAME6= <>
##$TPNAME7= <>
##$TPOAL= (0..7)
0.5 0.5 0.5 0.5 0.5 0.5 0.5 0.5
##$TPOFFS= (0..7)
0 0 0 0 0 0 0 0
##$TUNHIN= 0
##$TUNHOUT= 0
##$TUNXOUT= 0
##$USERA1= <user>
##$USERA2= <user>
##$USERA3= <user>
##$USERA4= <user>
##$USERA5= <user>
##$V9= 5
##$VALIST= <valist>
##$VCLIST= <CCCCCCCCCCCCCCC>
##$VD= 0
##$VDLIST= <DDDDDDDDDDDDDDD>
##$VPLIST= <PPPPPPPPPPPPPPP>
##$VTLIST= <TTTTTTTTTTTTTTT>
##$WBST= 1024
##$WBSW= 4
##$XGAIN= (0..3)
0 0 0 0
##$XL= 0
##$YL= 0
##$YMAX_a= 8268462
##$YMIN_a= -17845113
##$ZGOPTNS= <>
##$ZL1= 120
##$ZL2= 120
##$ZL3= 120
##$ZL4= 120
##$ABSF1= 14.96238
##$ABSF2= -5.595801
##$ABSG= 5
##$ABSL= 3
##$ALPHA= 0
##$AQORDER= 0
##$ASSFAC= 0
##$ASSFACI= 0
##$ASSFACX= 0
##$ASSWID= 0
##$AUNMP= <proc_prof1d_extract.lims>
##$AXLEFT= 0
##$AXNAME= <>
##$AXNUC= <1H>
##$AXRIGHT= 0
##$AXTYPE= 0
##$AXUNIT= <>
##$AZFE= 0.1
##$AZFW= 0.1
##$BCFW= 0
##$BC_mod= 0
##$BYTORDP= 0
##$COROFFS= 0
##$CY= 15
##$DATMOD= 1
##$DC= 0
##$DFILT= <>
##$DTYPP= 0
##$F1P= 0
##$F2P= 0
##$FCOR= 0.5
##$FTSIZE= 131072
##$FT_mod= 6
##$GAMMA= 0
##$GB= 0
##$INTBC= 1
##$INTSCL= 1
##$ISEN= 128
##$LB= 0.3
##$LEV0= 0
##$LPBIN= 0
##$MAXI= 10000
##$MC2= 0
##$MEAN= 0
##$ME_mod= 0
##$MI= 0
##$NCOEF= 0
##$NC_proc= -2
##$NLEV= 6
##$NOISF1= 0
##$NOISF2= 0
##$NSP= 0
##$NTH_PI= 0
##$NZP= 0
##$OFFSET= 14.96238
##$PC= 1
##$PHC0= -78.55225
##$PHC1= 0
##$PH_mod= 1
##$PKNL= yes
##$PPARMOD= 0
##$PPDIAG= 0
##$PPIPTYP= 0
##$PPMPNUM= 2147483647
##$PPRESOL= 1
##$PSCAL= 4
##$PSIGN= 0
##$PYNMP= <proc.py>
##$REVERSE= no
##$SF= 400.020009085293
##$SI= 131072
##$SIGF1= 0
##$SIGF2= 0
##$SINO= 400
##$SIOLD= 131072
##$SPECTYP= <>
##$SREGLST= <1H.CDCl3>
##$SSB= 0
##$STSI= 131072
##$STSR= 0
##$SW_p= 8223.68421052631
##$SYMM= 0
##$S_DEV= 0
##$TDeff= 65536
##$TDoff= 0
##$TI= <>
##$TILT= no
##$TM1= 0
##$TM2= 0
##$TOPLEV= 0
##$USERP1= <user>
##$USERP2= <user>
##$USERP3= <user>
##$USERP4= <user>
##$USERP5= <user>
##$WDW= 1
##$XDIM= 131072
##$YMAX_p= 436338744
##$YMIN_p= -11914
##$CURPLOT= <Network HP LaserJet P1505>
##$CURPRIN= <$Network HP LaserJet P1505>
##$DFORMAT= <normdp>
##$LAYOUT= <+/1D_H.xwp>
##$LFORMAT= <normlp>
##$PFORMAT= <normpl>
##$SURQMSG= 1
$$ End of Bruker specific parameters
$$ ---------------------------------
##NTUPLES= NMR SPECTRUM
##VAR_NAME=  FREQUENCY,     SPECTRUM/REAL,   SPECTRUM/IMAG
##SYMBOL=    X,             R,               I
##VAR_TYPE=  INDEPENDENT,   DEPENDENT,       DEPENDENT
##VAR_FORM=  AFFN,          ASDF,            ASDF
##VAR_DIM=   131072,        131072,          131072
##UNITS=     HZ,            ARBITRARY UNITS, ARBITRARY UNITS
##FACTOR=    0.0627417313425164, 1,          1
##FIRST=     8223.62146879497, 2621,         -63734
##LAST=      0,             4743,            -63637
##MIN=       0,             -11914,          0
##MAX=       8223.62146879497, 436338744,    0
$$ Real data points
##PAGE= N=1
##DATA TABLE= (X++(R..R)), XYDATA
$$ [...]
63198A068318l6633l7540l7860l7259l5724l3592l0851k7259k3100j9081j5390
$$ 1068318 1031685 994145 956285 919026 883302 849710 818859 791600 768500 749419 734029
63187G34029j1620p683m024p28K661O113Q820J0518J2173J4644J7307J8912J9288
$$ 734029 722409 714726 710702 709974 712635 718748 727568 738086 750259 764903 782210 801122 820410
63174H20410J9353J9763K0499K1444K2487K3094K2685K1525K0474J9725J8502
$$ 820410 839763 859526 880025 901469 923956 947050 969735 991260 1011734 1031459 1049961
63163A049961J6232J3289J0303P279L683q11n959j1098j5602j9388k2896k6272
$$ 1049961 1066193 1079482 1089785 1097064 1100747 1099936 1093977 1082879 1067277 1047889 1024993 998721
63151I98721k8870k9959k9777k9233k8688k7688k5933k3842k1967k0371j8814
$$ 998721 969851 939892 910115 880882 852194 824506 798573 774731 752764 732393 713579
63140G13579j7078j5113j3204j1869j1153j0174q115n551l902l536l377k568j489
$$ 713579 696501 681388 668184 656315 645162 634988 626873 621322 617420 613884 610507 607939 606450
63127F06450p18n5Q32J603J876K012K544L290L773L960M028L897L667L994N172
$$ 606450 605732 605677 606509 608112 609988 612000 614544 617834 621607 625567 629595 633492 637159 641153 646325
63112F46325O301O268N309M687M932N301N020M250L660L629M112M796N205N019
$$ 646325 652626 658894 664203 668890 673822 679123 684143 688393 692053 695682 699794 704590 709795 714814
63098G14814M398L778L302K724J837P11m55j355j624j131l06J31j77r70j593j417
$$ 714814 719212 722990 726292 729016 730853 731564 731109 729754 728130 726999 726693 726824 726647 725677 724084 722667
63082G22667k60J376K740L571M177M678M786M616N014O403P990Q761Q972R687
$$ 722667 722407 723783 726523 730094 734271 738949 743735 748351 753365 759768 767758 776519 785491 795178
63068G95178J1155J2514J3210J3743J4839J6528J8274J9627K0511K1327K2750
$$ 795178 806333 818847 832057 845800 860639 877167 895441 915068 935579 956906 979656
63057I79656K5097K7925L0558L2891L5244L7684M0093M2743M5982M9391N1960
$$ 979656 1004753 1032678 1063236 1096127 1131371 1169055 1209148 1251891 1297873 1347264 1399224
63046A399224N3289N3975N4682N5486N6192N6654N6518N5415N3702N2397N1983
$$ 1399224 1452513 1506488 1561170 1616656 1672848 1729502 1786020 1841435 1895137 1947534 1999517
63035A999517N1890N1540N1308N1879N3017N3678N3101N1316M8566M4671L8979
$$ 1999517 2051407 2102947 2154255 2206134 2259151 2312829 2365930 2417246 2465812 2510483 2549462
63024B549462L0810K0000P124o794k0869l4538m7279n8388o7145p3140p6522p8011
$$ 2549462 2580272 2600272 2607396 2600602 2579733 2545195 2497916 2439528 2372383 2299243 2222721 2144710
63012B144710p8436p7906p5615p0873o4166n6671m9022m1148l3217k5768j8848
$$ 2144710 2066274 1988368 1912753 1841880 1777714 1721043 1672021 1630873 1597656 1571888 1553040
63001A553040j1849m553K414Q483J3838J8702K2718K5545K7557K9320L0835L1900
$$ 1553040 1541191 1536638 1539052 1547535 1561373 1580075 1602793 1628338 1655895 1685215 1716050 1747950
62989A747950L2730L3604L4202L4007L3161L2201L1081K9115K5844K1409J5997
$$ 1747950 1780680 1814284 1848486 1882493 1915654 1947855 1978936 2008051 2033895 2055304 2071301
62978B071301R536K042o150j4755k3759l3024m1924m9663n5918o0980o5177o8294
$$ 2071301 2080837 2082879 2076729 2061974 2038215 2005191 1963267 1913604 1857686 1796706 1731529 1663235
62966A663235o9710o9169o7170o4431o1187n7313n2982m8694m4707m0912l7268
$$ 1663235 1593525 1524356 1457186 1392755 1331568 1274255 1221273 1172579 1127872 1086960 1049692
62955A049692l3836l0386k6633k2974k0209j8263j6064j3206j0864j0207j0562
$$ 1049692 1015856 985470 958837 935863 915654 897391 881327 868121 857257 847050 836488
62944H36488j0262q931p810p835q483q762q494q187q277q871r877j0910j1374
$$ 836488 826226 817295 809485 801650 793167 784405 775911 767724 759447 750576 740699 729789 718415
62931G18415j0926r803q561p608p030o663o300n966n922o205o339n816m796l918
$$ 718415 707489 697686 689125 681517 674487 667824 661524 655558 649636 643431 637092 631276 626480 622562
62917F22562l470l193k887k764k989l303l335l036k605k204j899j744j713j665
$$ 622562 619092 615899 613012 610248 607259 603956 600621 597585 594980 592776 590877 589133 587420 585755
62903E85755j503j251r90p78o55n90m43r0L87P62Q76O15j52j368k593l281l292
$$ 585755 584252 583001 582011 581233 580578 579988 579545 579455 579842 580604 581480 582095 581943 580575 577982 574701 571409
62886E71409k954k690k733l136l771m359m655m543l848k445p92Q8k31p80l22Q70
$$ 571409 568455 565765 563032 559896 556125 551766 547111 542568 538720 536275 535483 535571 535340 534560 534238 535108
62870E35108J339M87o25q98o09o31j043j324j377j533j781j778j463j125r60j078
$$ 535108 536447 536934 536309 535411 534802 534171 533128 531804 530427 528894 527113 525335 523872 522747 521787 520709
62854E20709j750k991m037l982k895j781j346j384j408j223p90j74J57l63j468
$$ 520709 518959 515968 511931 507949 505054 503273 501927 500543 499135 497912 497122 496948 497105 496742 495274
62839D95274k017j300R6J136J545J630J423P61K6l5O69J314J147L12n06q64q22
$$ 495274 493257 491957 492053 493189 494734 496364 497787 498548 498574 498539 499208 500522 501669 501981 501475 500611 499789
62822D99789o46n39n66o82q65j163j518j641j306p28l46k70j79J68P03J341K175
$$ 499789 499143 498604 498038 497356 496491 495328 493810 492169 490863 490135 489789 489519 489340 489508 490211 491552 493727
62805D93727L148L904M197M276M610N325O141O782P254P770Q504R353R973J0201
$$ 493727 496875 500779 504976 509252 513862 519187 525328 532110 539364 547134 555638 564991 574964 585165
62791E85165J0457J1476J3508J6025J8350K0283K2020K3748K5639K7920L0702
$$ 585165 595622 607098 620606 636631 654981 675264 697284 721032 746671 774591 805293
62780H05293L3837L7260M1250M6089N1660N7642O3867P0205P6306Q1936Q7338
$$ 805293 839130 876390 917640 963729 1015389 1073031 1136898 1207103 1283409 1365345 1452683
62769A452683R2846R8102J02042J03613J02247R7813R0611Q1304P0371N7617M2631
$$ 1452683 1545529 1643631 1745673 1849286 1951533 2049346 2139957 2221261 2291632 2349249 2391880
62758B391880K5732P962r803k7178m3652n8335p0656q0783q8976r4852r7817r8040
$$ 2391880 2417612 2425574 2415771 2388593 2344941 2286606 2215950 2135167 2046191 1951339 1853522 1755482
62746A755482r6581r4478r1922q8409q3578p7858p2092o6630o1134n5475n0315
$$ 1755482 1658901 1564423 1472501 1384092 1300514 1222656 1150564 1083934 1022800 967325 917010
62735I17010m6242m2724l8729l4242l0306k7484k5256k3073k1107j9423j7359
$$ 917010 870768 828044 789315 755073 724767 697283 672027 648954 627847 608424 591065
62724E91065j4543j1875j0559j0482j0281q985o868m809l378k563j897p74R43
$$ 591065 576522 564647 554088 543606 533325 524340 517472 512663 509285 506722 504825 504051 504994
62711E04994K627L506L574L646M575O630R431J2260J4547J6307J8015K0000K2222
$$ 504994 507621 511127 514701 518347 522922 529552 538983 551243 565790 582097 600112 620112 642334
62698F42334K4780K8073L2202L6604M0750M4758M8912N3014N6801O0543O4500
$$ 642334 667114 695187 727389 763993 804743 849501 898413 951427 1008228 1068771 1133271
62687A133271O8086P0334P0999P0446O8628O4898N8872N0739M0732K9060J6356
$$ 1133271 1201357 1271691 1342690 1413136 1481764 1546662 1605534 1656273 1697005 1726065 1742421
62676A742421L459r376k2345l5033m6194n4900o1230o5702o8610p0178p0709p0194
$$ 1742421 1745880 1736504 1714159 1679126 1632932 1578032 1516802 1451100 1382490 1312312 1241603 1171409
62664A171409o8321o5177o1437n7488n3039m8018m3282l9743l7188l4578l1359
$$ 1171409 1103088 1037911 976474 918986 865947 817929 774647 734904 697716 663138 631779
62653F31779k7894k4741k2059j9768j7861j6409j5404j4680j3946j3002j1968
$$ 631779 603885 579144 557085 537317 519456 503047 487643 472963 459017 446015 434047
62642D34047j1083j0373r706r156q877q609p825o536n405m838m470l906l416l394
$$ 434047 422964 412591 402885 393729 384852 376243 368418 361882 356477 351639 347169 343263 339847 336453
62628C36453l573l409k906k471k162j784j490j614j940j847j249p15n16k04N15
$$ 336453 332880 329471 326565 324094 321932 320148 318658 317044 315104 313257 312008 311293 310777 310573 311088
62613C11088J196J374J428K060L167L910L945L896M431N341O036O578P659R558
$$ 311088 312284 313658 315086 317146 320313 324223 328168 332064 336495 341836 347872 354450 362109 371667
62599C71667J1676J3312J4494J5691J7114J8681K0520K2971K6140K9814L3836
$$ 371667 383343 396655 411149 426840 443954 462635 483155 506126 532266 562080 595916
62588E95916L8114M2286M5769M8334N0244N1674N2329N1839N0114M7140M2747
$$ 595916 634030 676316 722085 770419 820663 872337 924666 976505 1026619 1073759 1116506
62577A116506L6816K9449K0801J1081R83q430j6597k3874l0653l6432m0335m2290
$$ 1116506 1153322 1182771 1203572 1214653 1215636 1207206 1190609 1166735 1136082 1099650 1059315 1017025
62565A017025m3078m3299m2864m1545l9523l7219l4928l2760l0653k8415k5935
$$ 1017025 973947 930648 887784 846239 806716 769497 734569 701809 671156 642741 616806
62554F16806k3404k1110j9131j7494j6416j5985j5682j4813j3480j2516j2285
$$ 616806 593402 572292 553161 535667 519251 503266 487584 472771 459291 446775 434490
62543D34490j2120j1305j0102r228q674p704n997m197l144k962l145l193k904
$$ 434490 422370 411065 400963 391735 383061 375357 369360 365163 362019 359057 355912 352719 349815
62530C49815k177r82M49J708K627L406M230M945N403N875O787Q031R020R520J0097
$$ 349815 347638 346656 347105 348813 351440 354846 359076 364021 369424 375299 382086 390117 399137 408657 418754
62515D18754J1450J3605J6003J8218K0247K2330K4740K7653L0929L4087L6803
$$ 418754 430204 443809 459812 478030 498277 520607 545347 573000 603929 638016 674819
62504F74819L9280M1734M3659M4029M2384L9283L5535L1293K6113J9656J2143
$$ 674819 714099 755833 799492 843521 885905 925188 960723 992016 1018129 1037785 1049928
62493A049928M200l554j0874j7878k4584l0479l4828l7358l8435l8518l7780l6366
$$ 1049928 1054128 1050574 1039700 1021822 997238 966759 931931 894573 856138 817620 779840 743474
62481G43474l4581l2548l0031k6957k3858k1349j9324j7126j4505j1946r913q267
$$ 743474 708893 676345 646314 619357 595499 574150 554826 537700 523195 511249 501336 493069
62469D93069o653n174m225l773l185j932k32J215J981K242K443K831L485M495
$$ 493069 486416 481242 477017 473244 470059 468127 467895 469110 471091 473333 475776 478607 482092 486587
62455D86587N913P471Q617R030Q960Q957R246R574R673R685R955J0422J0489R540
$$ 486587 492500 499971 508588 517618 526578 535535 544781 554355 564028 573713 583668 594090 604579 614119
62441F14119P475M697J708j155l745o129q558j1175j3719j5727j7037j7885j8372
$$ 614119 621594 626291 627999 626844 623099 616970 608412 597237 583518 567791 550754 532869 514497
62428E14497j8212j7137j5364j3390j1546r989q908q308p702o519m817l238k132
$$ 514497 496285 479148 463784 450394 438848 428859 419951 411643 403941 397422 392605 389367 387235
62415C87235j157J33J561K598L077L372L926M820N773O433O700O805O998P158
$$ 387235 386078 386211 387772 390370 393447 396819 400745 405565 411338 417771 424471 431276 438274 445432
62401D45432O933O352N924N927N864N043L531K099J215N26n28j974l375m425n170
$$ 445432 452365 458717 464641 470568 476432 481475 485006 487105 488320 488846 488318 486344 482969 478544 473374
62386D73374n757o159o187n658m589l261k008r25J43J269K320L248M337N950Q099
$$ 473374 467617 461458 455271 449613 445024 441763 439755 438830 438973 440242 442562 445810 450147 456097 464196
62371D64196J0496J2927J5344J7700K0031K2711K6200L0385L4473L7868M0856
$$ 464196 474692 487619 502963 520663 540694 563405 589605 619990 654463 692331 733187
62360G33187M4112M7681N0982N3671N5907N7637N8158N6769N3411M8330M1481
$$ 733187 777299 824980 875962 929633 985540 1043177 1101335 1158104 1211515 1259845 1301326
62349A301326L2844K3111J3428M419l995j1757j8248k3077k6830l0544l4524l8080
$$ 1301326 1334170 1357281 1370709 1375128 1371133 1359376 1341128 1318051 1291221 1260677 1226153 1188073
62337A188073m0342m1102m0817m0110l9225l7910l5766l2870k9901k7522k5843
$$ 1188073 1147731 1106629 1065812 1025702 986477 948567 912801 879931 850030 822508 796665
62326G96665k4606k3691k3053k2318k0956j8927j6781j4926j3197j1338r571q336
$$ 796665 772059 748368 725315 702997 682041 663114 646333 631407 618210 606872 597301 588965
62314E88965p610o885n782m421l185k301j751j462j481j910k647l278l456l355
$$ 588965 581355 574470 568688 564267 561082 558781 557030 555568 554087 552177 549530 546252 542796 539441
62300E39441l553m343n341n995o137n882n203m066k778j797j185o18O6P38J454
$$ 539441 535888 531545 526204 520209 514072 508190 502987 498921 496143 494346 493161 492543 492609 493347 494801
62285D94801K463L627M313M260M119M656N726O585P034P581Q460R196R463R821
$$ 494801 497264 500891 505204 509464 513583 518239 523965 530550 537584 545165 553625 562821 572284 582105
62271E82105J0994J2794J4287J5036J5586J6635J8213J9983K1976K4547K7766
$$ 582105 593099 605893 620180 635216 650802 667437 685650 705633 727609 752156 779922
62260G79922L1355L5219L9521M4082M8171N1284N3772N6112N7702N6986N2946
$$ 779922 811277 846496 886017 930099 978270 1029554 1083326 1139438 1197140 1254126 1307072
62249A307072M6045L7553K8332J8593Q501j414j0502j8356k4944l0510l5382l9750
$$ 1307072 1353117 1390670 1419002 1437595 1446096 1444682 1434180 1415824 1390880 1360370 1324988 1285238
62237A285238m3608m6770m8839m9269m7772m4816m1391l8113l4824l1188k7352
$$ 1285238 1241630 1194860 1146021 1096752 1048980 1004164 962773 924660 889836 858648 831296
62226H31296k3717k0391j7247j4327j1747r395p148n283m147l486k630j439n36
$$ 831296 807579 787188 769941 755614 743867 734472 727324 722041 717894 714408 711778 710339 709803
62213G09803m19p92j096j228j421j671j659j151k15Q86J864K620L420M600N967
$$ 709803 709384 708592 707496 706268 704847 703176 701517 700366 700151 701037 702901 705521 708941 713541 719508
62198G19508O828O873O778P557R456J1835J4051J6002J7855J9633K1247K2671
$$ 719508 726336 733209 739987 747544 757000 768835 782886 798888 816743 836376 857623 880294
62186H80294K3863K4696K5019K4647K3295K0777J7466J4250J1847J0273R174Q464
$$ 880294 904157 928853 953872 978519 1001814 1022591 1040057 1054307 1066154 1076427 1085601 1094065
62174A094065Q350Q848R776J1262J3782J7375K1295K4819K8168L1957L5842L8493
$$ 1094065 1102415 1111263 1121039 1132301 1146083 1163458 1184753 1209572 1237740 1269697 1305539 1344032
62162A344032L9157L8444L7148L4837L0543K4469J8124J2667P954L449p31m201
$$ 1344032 1383189 1421633 1458781 1493618 1524161 1548630 1566754 1579421 1587375 1590824 1590093 1585892
62150A585892p165j0157j3171j5665j7354j8473j9176j9155j8070j6119j3880
$$ 1585892 1578727 1568570 1555399 1539734 1522380 1503907 1484731 1465576 1447506 1431387 1417507
62139A417507j1756r694p552n584m369m061l897k875r69P45J444J584K148L298
$$ 1417507 1405751 1396057 1388505 1382921 1378552 1374491 1370594 1367719 1366750 1367495 1368939 1370523 1372671 1375969
62125A375969M448N523P255R952J2721J4522J5457J6425J7725J8823J9439K0092
$$ 1375969 1380417 1385940 1393195 1403147 1415868 1430390 1445847 1462272 1479997 1498820 1518259 1538351
62113A538351K1270K2688K3786K4545K5329K6152K6758K7198K7796K8552K9184
$$ 1538351 1559621 1582309 1606095 1630640 1655969 1682121 1708879 1736077 1763873 1792425 1821609
62102A821609K9767L0702L1912L2757L3056L3466L4448L5563L6464L7862M0575
$$ 1821609 1851376 1882078 1913990 1946747 1979803 2013269 2047717 2083280 2119744 2157606 2198181
62091B198181M4033M6848M8645N0144N1363N1139M8917M5974M4050M3557M3904
$$ 2198181 2242214 2289062 2337707 2387851 2439214 2490353 2539270 2585244 2629294 2672851 2716755
62080B716755M4869M6669M9000N0940N1721N1001M8577M4618M0122L6522L4689
$$ 2716755 2761624 2808293 2857293 2908233 2959954 3010955 3059532 3104150 3144272 3180794 3215483
62069C215483L4717L6443L9600M3498M7292N0640N3683N6256N7686N7472N5726
$$ 3215483 3250200 3286643 3326243 3369741 3417033 3467673 3521356 3577612 3635298 3692770 3748496
62058C748496N2818M8941M4197L8692L2576K6318K0821J6694J3334R419M491n99
$$ 3748496 3801314 3850255 3894452 3933144 3965720 3992038 4012859 4029553 4042887 4052306 4056797 4056198
62046D056198n054r091j3082j6460j8373j9063j9695k0910k2206k2789k2442k1452
$$ 4056198 4051144 4042053 4028971 4012511 3994138 3975075 3955380 3934470 3912264 3889475 3867033 3845581
62034C845581k0208j9083j8277j7629j6869j6103j5655j5325j4411j2800j1505
$$ 3845581 3825373 3806290 3788013 3770384 3753515 3737412 3721757 3706432 3692021 3679221 3667716
62023C667716j1508j2311j2342j0814q605p085o618o528o108n182l872k314p67
$$ 3667716 3656208 3643897 3631555 3620741 3612136 3605051 3598433 3591905 3585797 3580615 3576743 3574429 3573662
62010C573662M88J478K557L933N371O540P430Q223Q829Q927Q473P918P679P516
$$ 3573662 3574150 3575628 3578185 3582118 3587489 3594029 3601459 3609682 3618511 3627438 3635911 3643829 3651508 3659024
61996C659024O646M527J378k258o240j0913j6407k2265k7931l3256l8234m2453
$$ 3659024 3665670 3670197 3671575 3669317 3663077 3652164 3635757 3613492 3585561 3552305 3514071 3471618
61984C471618m5303m6606m6717m6057m4988m4010m3478m3060m2052m0450l9091
$$ 3471618 3426315 3379709 3332992 3286935 3241947 3197937 3154459 3111399 3069347 3028897 2989806
61973B989806l8460l7997l6975l5508l4113l2819l1383k9974k8866k7695k5896
$$ 2989806 2951346 2913349 2876374 2840866 2806753 2773934 2742551 2712577 2683711 2656016 2630120
61962B630120k3868k2746k2834k3006k2072k0195j8513j7726j7431j6723j5140
$$ 2630120 2606252 2583506 2560672 2537666 2515594 2495399 2476886 2459160 2441729 2425006 2409866
61951B409866j3061j1348j0492j0205r915r427q813p827o092l857j933o59M49
$$ 2409866 2396805 2385457 2374965 2364760 2354845 2345418 2336605 2328778 2322686 2318829 2316896 2316237 2316686
61938B316686J772K957L639M309N718P708R399J0502J1811J4120J7116J9853K2023
$$ 2316686 2318458 2321415 2325054 2329363 2335081 2342789 2352188 2362690 2374501 2388621 2405737 2425590 2447613
61925B447613K4285K7218L0535L3779L7512M3042N0782N9665O8691P8453R0366
$$ 2447613 2471898 2499116 2529651 2563430 2600942 2643984 2694766 2754431 2823122 2901575 2991941
61914B991941J04735J20733J38216J58432J82515K10231K40953K75122L14021
$$ 2991941 3096676 3217409 3355625 3514057 3696572 3906803 4147756 4422878 4736899
61905D736899L58507M08707M64591N25825N90909O56913P19962P75365Q17126
$$ 4736899 5095406 5504113 5968704 6494529 7085438 7742351 8462313 9237678 10054804
61896A0054804Q37681Q28412P80849O88669N50480L71914J65483n1760k61403
$$ 10054804 10892485 11720897 12501746 13190415 13740895 14112809 14278292 14226532 13965129
61887A3965129m46907n96627p05464p73969q05992q07102p84263p45113o96302
$$ 13965129 13518222 12921595 12216131 11442162 10636170 9829068 9044805 8299692 7603390
61878G603390o42416n86492n30996m77928m28490l83125l41785l04082k69621
$$ 7603390 6960974 6374482 5843486 5365558 4937068 4553943 4212158 3908076 3638455
61869C638455k38599k11619j88632j68495j50071j33356j18927j06609r5479q4999
$$ 3638455 3399856 3188237 2999605 2831110 2681039 2547683 2428756 2322147 2226668 2141669
61859B141669p5404o6871n9067n1730m5027l9006l3208k7307k1688j6940j2990
$$ 2141669 2066265 1999394 1940327 1888597 1843570 1804564 1771356 1744049 1722361 1705421 1692431
61848A692431r277n641k631q92n21j033j795k490l325m631o159p036o665n431
$$ 1692431 1683154 1677513 1674882 1673990 1673469 1672436 1670641 1668151 1664826 1660195 1654036 1647000 1640335 1634904
61834A634904m153l050j701O7J884L483N070O768Q152Q669Q236P165N696L976
$$ 1634904 1630751 1627701 1626000 1626067 1627951 1631434 1636504 1643272 1651424 1660093 1668329 1675494 1681190 1685166
61820A685166K258P86m14j355j733j131L92K192L722N192P383J0760J4869J8787
$$ 1685166 1687424 1688210 1687796 1686441 1684708 1683577 1683969 1686161 1689883 1695075 1702458 1713218 1728087 1746874
61806A746874K2130K5398K9221L3527L7819M2102M6974N2767N9067O5354P1693
$$ 1746874 1769004 1794402 1823623 1857150 1894969 1937071 1984045 2036812 2095879 2161233 2232926
61795B232926P8528Q6060R4134J02459J10831J19444J29153J41000J55207J71115
$$ 2232926 2311454 2397514 2491648 2594107 2704938 2824382 2953535 3094535 3249742 3420857
61785C420857J88486K08276K31591K58495K88693L23063L63428M10857M65226
$$ 3420857 3609343 3817619 4049210 4307705 4596398 4919461 5282889 5693746 6158972
61776F158972N26668N96507O76224P66128Q65468R73037J086676J202104J312493
$$ 6158972 6685640 7282147 7958371 8724499 9589967 10563004 11649680 12851784 14164277
61767A4164277J408807J479758J511570J488879J397413J227694R78554O59586
$$ 14164277 15573084 17052842 18564412 20053291 21450704 22678398 23656952 24316538
61759B4316538K91514r6354m71508q04684j074962j271869j394630j449891j449103
$$ 24316538 24608052 24511698 24040190 23235506 22160544 20888675 19494045 18044154 16595051
61750A6595051j405856j333439j243201j143966j042079r41656q45233p54766
$$ 16595051 15189195 13855756 12612555 11468589 10426510 9484854 8639621 7884855
61742G884855o72018n97861n31727m72390m19271l72560l32169k97165k66281
$$ 7884855 7212837 6614976 6083249 5610859 5191588 4819028 4486859 4189694 3923413
61733C923413k38506k13140j89849j68846j50588j35023j21448j09222r8289q8897
$$ 3923413 3684907 3471767 3281918 3113072 2962484 2827461 2706013 2596791 2498502 2409605
61723B409605q1160p5001p0140o5997o1921n7740n3831n0529m7724m5099m2446
$$ 2409605 2328445 2253444 2183304 2117307 2055386 1997646 1943815 1893286 1845562 1800463 1758017
61712A758017l9662l6770l3998l1585k9459k7424k5590k4247k3326k2495k1656
$$ 1758017 1718355 1681585 1647587 1616002 1586543 1559119 1533529 1509282 1485956 1463461 1441805
61701A441805k0883k0024j9001j8382j8709j9324j8903j7371j6115j5896j5791
$$ 1441805 1420922 1400898 1381897 1363515 1344806 1325482 1306579 1289208 1273093 1257197 1241406
61690A241406j4924j4006j4047j4515j4159j3018j2161j1774j1005r667q674q491
$$ 1241406 1226482 1212476 1198429 1183914 1169755 1156737 1144576 1132802 1121797 1112130 1103456 1094965
61678A094965q371p660o809o539o693o553n867n054m661m929n644o192o133n713
$$ 1094965 1086594 1078934 1072125 1065586 1058893 1052340 1046473 1041419 1036758 1031829 1026185 1019993 1013860 1008147
61664A008147n510n577n485n278n596o596p410p207o273n526n281n083m498l541
$$ 1008147 1002637 997060 991575 986297 980701 974105 966695 959488 953215 947689 942408 937325 932827 929286
61650I29286k410j294m52j09k29n43p78o81k7J062J997K306K301K730L759M776
$$ 929286 926876 925582 925130 925021 924792 924249 923471 922790 922763 923825 925822 928128 930429 933159 936918 941694
61634I41694N353N845O646P309P068O046N294N476O050O027N069L577K012O54
$$ 941694 947047 952892 959538 966847 973915 979961 985255 990731 996781 1002808 1007877 1011454 1013466 1014120
61620A014120l31j064k037l555n177o167o401o380o470o702p208q207r391j0079
$$ 1014120 1013789 1012725 1010688 1007133 1001956 995789 989388 983008 976538 969836 962628 954421 945030 934951
61606I34951j0117j0034j0088r872r228q759q886r029q385p070n842n046m523
$$ 934951 924834 914800 904712 894840 885612 876853 867967 858938 850553 843483 837641 832595 828072
61593H28072m195l935l124j265J013K383K427K178K799M329O007P381Q665J0203
$$ 828072 823877 819942 816818 815553 816566 818949 821376 823554 826353 830682 836689 844070 852735 862938
61579H62938J1984J3695J5103J6334J7650J9090K0511K2044K4073K6555K8764
$$ 862938 874922 888617 903720 920054 937704 956794 977305 999349 1023422 1049977 1078741
61568A078741L0015L0429L0653L1097L1787L2644L3501L3985L3765L2763L0987
$$ 1078741 1108756 1139185 1169838 1200935 1232722 1265366 1298867 1332852 1366617 1399380 1430367
61557A430367K8527K5954K4121K3127K2039K0252J8424J7282J6133J3700J0111
$$ 1430367 1458894 1484848 1508969 1532096 1554135 1574387 1592811 1610093 1626226 1639926 1650037
61546A650037O753M204J579j834n464q521j1158j3959j6885j9307k0751k1142
$$ 1650037 1656790 1660994 1662573 1660739 1655275 1646754 1635596 1621637 1604752 1585445 1564694 1543552
61534A543552k0690j9773j8620j7057j4854j2350j0110q057n599k627L73L281
$$ 1543552 1522862 1503089 1484469 1467412 1452558 1440208 1430098 1422041 1416442 1413815 1414188 1417469
61522A417469O588J0469J4522J8705K3597K9351L5307M1267M8143N6576O5774
$$ 1417469 1424057 1434526 1449048 1467753 1491350 1520701 1556008 1597275 1645418 1701994 1767768
61511A767768P4725Q3991R5169J08867J24183J40137J56772J74761J94471K15499
$$ 1767768 1842493 1926484 2021653 2130520 2254703 2394840 2551612 2726373 2920844 3136343
61501C136343K36709K56650K74128K88046K96555K96865K86494K64482K31105
$$ 3136343 3373052 3629702 3903830 4191876 4488431 4785296 5071790 5336272 5567377
61492E567377J87164J34357P6031J6653l9599q9531j31018j63368j87401k04174
$$ 5567377 5754541 5888898 5964929 5981582 5941983 5852452 5721434 5558066 5370665 5166491
61482E166491k13690k15626k11113k02589j91734j78561j62926j45881j28886
$$ 5166491 4952801 4737175 4526062 4323473 4131739 3953178 3790252 3644371 3515485
61473C515485j12397r6028p9624o3536m8146l3758k0691q978J906J2501K2725
$$ 3515485 3403088 3307060 3227436 3163900 3115754 3081996 3061305 3052327 3054233 3066734 3089459
61462C089459L2174M0766M8540N4954N9148O1024O1462O1217O0103N7673N4320
$$ 3089459 3121633 3162399 3210939 3265893 3325041 3386065 3447527 3508744 3568847 3626520 3680840
61451C680840N1172M9026M7809M7003M6314M5833M5951M7123M9422N2184N4351
$$ 3680840 3732012 3781038 3828847 3875850 3922164 3967997 4013948 4061071 4110493 4162677 4217028
61440D217028N5342N5365N4730N3188N0262M5898M0443L4101K6854J8897J0671
$$ 4217028 4272370 4327735 4382465 4435653 4485915 4531813 4572256 4606357 4633211 4652108 4662779
61429D662779K419n956j4432k2605l0073l6802m2806m7671n0656n1362n0088m7563
$$ 4662779 4665198 4659242 4644810 4622205 4592132 4555330 4512524 4464853 4414197 4362835 4312747 4265184
61417D265184m4401m0755l6418l1200k5276j9196j3570q704m504q28K056L466
$$ 4265184 4220783 4180028 4143610 4112410 4087134 4067938 4054368 4045664 4041160 4040332 4042388 4045854
61405D045854K967Q83k144n961j0730j5977k0488k3526k5420k6470k5845k2446
$$ 4045854 4048821 4049704 4047560 4041599 4030869 4014892 3994404 3970878 3945458 3918988 3893143 3870697
61393C870697j6386q666L86J1420K4847M0330N7643P7027R8292J20504J43138
$$ 3870697 3854311 3845645 3846031 3857451 3882298 3922628 3980271 4057298 4155590 4276094 4419232
61382D419232J66772J91969K18004K43348K67001K88539L06959L20108L25374
$$ 4419232 4586004 4777973 4995977 5239325 5506326 5794865 6101824 6421932 6747306
61373F747306L20647L04721K77208K38376J89300J32417P1710J1705m4208r4422
$$ 6747306 7067953 7372674 7649882 7888258 8077558 8209975 8281685 8293390 8249182 8154760
61363H154760j38421j76095k07821k34408k56270k73044k84327k90377k91653
$$ 8154760 8016339 7840244 7632423 7398015 7141745 6868701 6584374 6293997 6002344
61354F002344k88225k80229k68682k55166k40780k25777k10086j93819j77364
$$ 6002344 5714119 5433890 5165208 4910042 4669262 4443485 4233399 4039580 3862216
61345C862216j61274j45893j30928j15646r9883q4475p0410n7784m5963l4451
$$ 3862216 3700942 3555049 3424121 3308475 3208592 3124117 3053707 2995923 2949960 2915509
61335B915509k3167j2213j745Q074J7331K6274L4682M1816M7362N1850N5583N7784
$$ 2915509 2892342 2880129 2878384 2886458 2903789 2930063 2964745 3006561 3053923 3105773 3161356 3219140
61323C219140N7714N6116N4523N3238N1181M7784M3877M0355L6999L3300K9706
$$ 3219140 3276854 3332970 3387493 3440731 3491912 3539696 3583573 3623928 3660927 3694227 3723933
61312C723933K7124K5555K3981K1634J8758J5900J2855Q708K910l940j0642j6647
$$ 3723933 3751057 3776612 3800593 3822227 3840985 3856885 3869740 3878448 3881358 3877418 3866776 3850129
61300C850129k2514k8949l5791m2239m7847n2859n7569o1744o4829o6477o6799
$$ 3850129 3827615 3798666 3762875 3720636 3672789 3619930 3562361 3500617 3435788 3369311 3302512
61289C302512o6177o4852o2597n8944n3835m7880m1791l5711k9484k3411j8293
$$ 3302512 3236335 3171483 3108886 3049942 2996107 2948227 2906436 2870725 2841241 2817830 2799537
61278B799537j4642j2178j0258q651p696p848r132j1107j3284j5424j7282j8320
$$ 2799537 2784895 2772717 2762459 2753808 2746112 2738264 2729132 2718025 2704741 2689317 2672035 2653715
61266B653715j8036j6548j4430j1948q856n069q99L573Q799J5085K2081K9518
$$ 2653715 2635679 2619131 2604701 2592753 2583897 2578828 2577929 2581502 2590301 2605386 2627467 2656985
61254B656985L7972M8294O0471P3663Q7127J00622J13974J26655J37700J45743
$$ 2656985 2694957 2743251 2803722 2877385 2964512 3065134 3179108 3305763 3443463 3589206
61244C589206J49325J47453J39607J25031J02695P2513L6248l357m3857q2899
$$ 3589206 3738531 3885984 4025591 4150622 4253317 4325830 4362078 4358721 4314864 4231965
61234D231965j17572j45194j64799j76967j82330j81301j75195j66369j56597
$$ 4231965 4114393 3969199 3804400 3627433 3445103 3263802 3088607 2922238 2765641
61225B765641j46038j34225j21398j08450r6170q5065p5521o7512o0413n3515
$$ 2765641 2619603 2485378 2363980 2255530 2159360 2074295 1998774 1931262 1870849 1817334
61215A817334m6733m0500l5099l0235k5337k0241j5484j1782r099o566l483L6
$$ 1817334 1770601 1730101 1695002 1664767 1639430 1619189 1603705 1591923 1582824 1576258 1572775 1572811
61203A572811L726P895J2777J7551K0859K2395K3089K3687K3742K2224J8559J3032
$$ 1572811 1576537 1584432 1597209 1614760 1635619 1658014 1681103 1704790 1728532 1750756 1769315 1782347
61191A782347O719J118k773n214p266r550j1906j4028j5815j7174j8203j9487
$$ 1782347 1789066 1790184 1787411 1782197 1774931 1765381 1753475 1739447 1723632 1706458 1688255 1668768
61179A668768k1412k3257k3852k3205k2528k2570k2966k3452k4489k6137k7396
$$ 1668768 1647356 1624099 1600247 1577042 1554514 1531944 1508978 1485526 1461037 1434900 1407504
61168A407504k7571k7393k7950k9156l0119l0515l0656l0657l0403l0037k9728
$$ 1407504 1379933 1352540 1324590 1295434 1265315 1234800 1204144 1173487 1143084 1113047 1083319
61157A083319k9075k7518k5217k2867k0812j8878j7026j5607j5016j5463j6923
$$ 1083319 1054244 1026726 1001509 978642 957830 938952 921926 906319 891303 875840 858917
61146H58917j8856k0208k0235j9223j7962j6739j5276j3508j1684r876p944o075
$$ 858917 840061 819853 799618 780395 762433 745694 730418 716910 705226 695350 687406 681331
61134F81331m686l636k132K81L021N084O116O612P154P828Q366Q704R130R865
$$ 681331 676645 673009 670877 671158 674179 679263 685379 691991 699145 706973 715339 724043 733173 743038
61120G43038J0654J1055J1065J1204J1887J2954J3974J4710J5130J5203J4974
$$ 743038 753692 764747 775812 787016 798903 811857 825831 840541 855671 870874 885848
61109H85848J4677J4467J4124J3243J1648R492P035M519K112j80k523n010p376
$$ 885848 900525 914992 929116 942359 954007 963499 970534 975053 977165 976985 974462 969452 962076
61096I62076r126r899r764r187q769q885r514j0438j1493j2534j3336j3732j3803
$$ 962076 952950 943051 933287 924100 915331 906446 896932 886494 875001 862467 849131 835399 821596
61083H21596j3666j3228j2407j1473j0779j0273r656r009q693q632q177o879n056
$$ 821596 807930 794702 782295 770822 760043 749770 740114 731105 722412 713780 705603 698724 693668
61070F93668l445k622k681l134l131k216q86JK35K34K08P3N5M47P45J8j600k753
$$ 693668 690223 687601 684920 681786 678655 676439 675553 675554 675789 676023 676231 676304 676359 676806 677551 677569 675969 673216
61052F73216k604j800j246q52j56N96Q66P31O68Q59J402K641M587O464P524P987
$$ 673216 670612 668812 667566 666714 666558 667154 668020 668751 669419 670278 671680 674321 678908 685372 692896 700883
61036G00883Q590R614J0924J2409J3734J4210J3779J3549J4491J5979J6558J5836
$$ 700883 709473 719087 730011 742420 756154 770364 784143 797692 812183 828162 844720 860556
61024H60556J4645J3646J2816J2112J1633J1091J0137R190R102R878J0683J1118
$$ 860556 875201 888847 901663 913775 925408 936499 946636 955826 964928 974806 985489 996607
61012I96607J1627J2496J3494J4675J6609J9355K2127K4428K6873L0266L4482
$$ 996607 1008234 1020730 1034224 1048899 1065508 1084863 1106990 1131418 1158291 1188557 1223039
61001A223039L8831M3149M7852N3005N7837O1354O3470O5563O9749P7254Q7542
$$ 1223039 1261870 1305019 1352871 1405876 1463713 1525067 1588537 1654100 1723849 1801103 1888645
60990A888645R9240J11702J25166J39665J54564J69349J84612K02300K25476K57573
$$ 1888645 1987885 2099587 2224753 2364418 2518982 2688331 2872943 3075243 3300719 3558292
60980C558292L01342L58706M32098N25360O42591P87230R63919J179637J438850
$$ 3558292 3859634 4218340 4650438 5175798 5818389 6605619 7569538 8749175 10188025
60971A0188025J736178K055728K375023K658118K836141K805838K478461J859223
$$ 10188025 11924203 13979931 16354954 19013072 21849213 24655051 27133512 28992735
60963B8992735J085201L70553j05423k76314j84023O9809L53202N10376L93688
$$ 28992735 30077936 30448489 30343066 30066752 29882729 29952538 30305740 30816116 31209804
60954C1209804o2871p85291j583041k248007k652019k777364k682830k452241
$$ 31209804 31146933 30361642 28778601 26530594 23878575 21101211 18418381 15966140
60946A5966140k160708j861657j585022j341652j131549r51294p97186o65780
$$ 15966140 13805432 11943775 10358753 9017101 7885552 6934258 6137072 5471292
60938E471292n54503m62130l87913l30090k85632k51208k24002k01798j82852
$$ 5471292 4916789 4454659 4066746 3736656 3451024 3199816 2975814 2774016 2591164
60929B591164j65995j50672j36672j23802j11871j00894r1112q2735p5792p0299
$$ 2591164 2425169 2274497 2137825 2014023 1902152 1801258 1710146 1627411 1551619 1481320
60919A481320o6387o3956o2329o0469n7624n3700m9082m4321l9870l5856l2103
$$ 1481320 1414933 1350977 1288648 1228179 1170555 1116855 1067773 1023452 983582 947726 915623
60908I15623k8539k5420k2948k0812j8520j6059j3818j1997j0521r463q940q517
$$ 915623 887084 861664 838716 817904 799384 783325 769507 757510 746989 737526 728586 720069
60896G20069p398n448l517k364j751r70J91J462K724M050N269O007O192O136O103
$$ 720069 712671 707223 703706 701342 699591 698621 698812 700274 702998 707048 712317 718324 724516 730652 736755
60881G36755O019N638M789L461J808J29j372k788m389o197p836q792q929q689
$$ 736755 742774 748412 753201 756662 758470 758599 757227 754439 750050 743853 736017 727225 718296 709607
60867G09607q703r161r587r402q559p518o619n781m798l698k675j769p80N18K107
$$ 709607 700904 691743 682156 672754 664195 656677 650058 644277 639479 635781 633106 631337 630557 631075 633182
60852F33182L640M730N361N910O741P916R368J1055J2824J4436J5861J7287J8550
$$ 633182 636822 641552 646913 652823 659564 667480 676848 687903 700727 715163 731024 748311 766861
60839G66861J9062J8707J8276J8357J8264J6849J4204J1549R580P929O328N284
$$ 766861 785923 804630 822906 841263 859527 876376 890580 902129 911709 919638 925966 931250
60827I31250N088N147M799M063L124J804J86r87j336j651k782m216m757m405m479
$$ 931250 936338 941485 946284 950347 953471 955275 955461 954474 953138 951487 948705 944489 939732 935327 930848
60812I30848n803p706r086r738j0224j1005j2107j3293j4216j4619j4590j4446
$$ 930848 925045 917339 908253 898515 888291 877286 865179 851886 837670 823051 808461 794015
60800G94015j4192j3357j1665r572p880o961o557o244n707m722l232j593l49M65
$$ 794015 779823 766466 754801 745229 737349 730388 723831 717587 711880 707158 703926 702333 701984 702449
60786G02449J569L576O059P947Q868R627J1069J2932J4229J4529J4388J4598J5422
$$ 702449 704018 707594 713653 721600 730468 740095 751164 764096 778325 792854 807242 821840 837262
60773H37262J6514J7213J6941J5709J4268J3455J3298J3047J2121J0651R148P987
$$ 837262 853776 870989 887930 903639 917907 931362 944660 957707 969828 980479 989627 997614
60761I97614P216O581N595M066K532J791J860J887J254L25j49M0M79O63L40l89
$$ 997614 1004830 1011411 1017006 1021072 1023604 1025395 1027255 1029142 1030396 1030721 1030572 1030612 1031091 1031754 1032094 1031705
60745A031705r85q96k96j18j033k664m153n230o304p709r256j0514j1202j1318
$$ 1031705 1030720 1029824 1029528 1029410 1028377 1025713 1021560 1016330 1010026 1002317 993061 982547 971345 960027
60731I60027j1104j0809j0387r600q457p377o667o094n166l742k127p58R6M90
$$ 960027 948923 938114 927727 918127 909670 902293 895626 889532 884366 880624 878497 877739 877835 878325
60717H78325Q20J471K326K798K532J824J195P47J23j044k743m454n439n439n119
$$ 878325 879145 880616 882942 885740 888272 890096 891291 892038 892161 891117 888374 883920 878481 873042 867923
60702H67923n297n755n405l840j991q60k79M69J338J577Q12o51k419m233n800
$$ 867923 862626 856871 851466 847626 845635 844775 844496 844965 846303 847880 848692 848041 845622 841389 835589
60687H35589o995q177r703j1288j2351j2959j3705j4641j5013j4296j2953j1855
$$ 835589 828594 820417 810714 799426 787075 774116 760411 745770 730757 716461 703508 691653
60675F91653j1252j0614r304p326n400m267l775k947j180R26K382L034L426L677
$$ 691653 680401 669787 660483 653157 647757 643490 639715 636768 635588 636514 638896 641930 645356 649033
60661F49033L423K817K699L440M323M495L918L067K190J335O72L36L01P54K049
$$ 649033 652456 655273 657972 661412 665735 670230 674148 677215 679405 680740 681412 681748 682049 682803 684852
60646F84852L886N069M813L947L957M996N691N049L726L086L604M656N455N725
$$ 684852 688738 693807 698620 702567 706524 711520 717211 722260 725986 729072 732676 737332 742787 748512
60632G48512N748O166P529R672J1625J2587J2842J3369J4605J6015J6855J6918
$$ 748512 754260 760426 767955 777627 789252 801839 814681 828050 842655 858670 875525 892443
60620H92443J6453J5761J5077J4487J3746J2393J0260P657N009K530L99j232k524
$$ 892443 908896 924657 939734 954221 967967 980360 990620 998277 1003286 1005816 1006215 1004983 1002459
60607A002459l870n131n558m855l912l846m639n458o016o775p924q993r692j0269
$$ 1002459 998589 993458 987900 983045 979133 975287 970648 965190 959174 952399 944475 935482 925790 915521
60593I15521j0863j1207j1222j1140j0778r457p106m711l070j803k74J127J514
$$ 915521 904658 893451 882229 871089 860311 850854 843748 839037 835967 834164 833890 835017 836531
60580H36531Q93J12m19j009j710j992j592r91o96n43j03O23J283J767K333L195
$$ 836531 837424 837536 837117 836108 834398 832406 830814 829823 829127 828584 828481 829104 830387 832154 834487 837682
60564H37682M187M876M956M475L697K841K003J296P82K33p22k094l391m145m313
$$ 837682 841869 846745 851701 856176 859873 862714 864717 866013 866795 867028 866306 864212 860821 856676 852363
60549H52363m029l228j855j52J590L439N682Q416J1454J4572J7682K0946K4806
$$ 852363 848334 845106 843251 843099 844689 848128 853810 862226 873680 888252 905934 926880 951686
60536I51686K9673L5377M1152M6225N0096N2111N1303M7029L9417K8929J6082
$$ 951686 981359 1016736 1057888 1104113 1154209 1206320 1257623 1304652 1344069 1372998 1389080
60525A389080J954j1658k3282l2527l9168m2216m0890l6196l0327k4498j8428
$$ 1389080 1391034 1379376 1356094 1323567 1284399 1242183 1201293 1165097 1134770 1110272 1091844
60514A091844j1988o064j383K459O049R007J0512J0556R903R176Q648Q762J0137
$$ 1091844 1079856 1073792 1072409 1074868 1080917 1089924 1100436 1110992 1120895 1130071 1138719 1147481 1157618
60501A157618J2976J6888K1410K6466L2245L8948M6718N5711O5970P7242Q9028
$$ 1157618 1170594 1187482 1208892 1235358 1267603 1306551 1353269 1408980 1474950 1552192 1641220
60490A641220J01036J13532J26981J41338J56065J71326J88853K11037K38995
$$ 1641220 1742256 1855788 1982769 2124107 2280172 2451498 2640351 2851388 3090383
60481C090383K71842L07609L44090L78141M04282M14596M00816L57598K84757
$$ 3090383 3362225 3669834 4013924 4392065 4796347 5210943 5611759 5969357 6254114
60472F254114J87056P2287n0109j69234k73691l54421m07384m33301m35457m18639
$$ 6254114 6441170 6513457 6463348 6294114 6020423 5666002 5258618 4825317 4389860 3971221
60462C971221l89353l54612l19057k83906k49305k16778j88351j64193j42677
$$ 3971221 3581868 3227256 2908199 2624293 2374988 2158210 1969859 1805666 1662989
60453A662989j22793j05258r1011p9621o9824o1001n3413m7154m1602l6000l0353
$$ 1662989 1540196 1434938 1343927 1264306 1194482 1133481 1080068 1032914 991312 955312 924959
60442I24959k5501k2262k0645j9878j9189j8406j7759j7291j6697j5690j4372
$$ 924959 899458 877196 856551 836673 817484 799078 781319 764028 747331 731641 717269
60431G17269j3091j2064j1164j0127q833p398o019m897m223l988l727k752r39
$$ 717269 704178 692114 680950 670823 661990 654592 648573 643676 639453 635465 631738 628986 628047
60418F28047Q59J612J298R06J207J921K299K195K144K483K822K586J861J406J784
$$ 628047 628906 630518 631816 632722 633929 635850 638149 640344 642488 644971 647793 650379 652240 653646 655430
60403F55430K676L287L339L274L533L940M156M302M744N418N856N925O017O413
$$ 655430 658106 661393 664732 668006 671539 675479 679635 683937 688681 694099 699955 705880 711897 718310
60389G18310O809O744O206N494M638L254J090j388l147l468k728k166k741m234
$$ 718310 725119 731863 738069 743563 748201 751455 752545 751157 748010 744542 741814 739648 736907 732673
60375G32673n489n468m043k002m31P3k32o66q44p54k76P79K083K819K704K439
$$ 732673 727184 721716 717673 715671 715240 715313 715081 714415 713571 712817 712541 713320 715403 718222 720926 723365
60359G23365K659L032L012K955L626M861N643N529N119N099N550O325P312Q133
$$ 723365 726024 729056 732068 735023 738649 743510 749153 754682 759801 764900 770450 776775 784087 792220
60345G92220Q284P909P831Q496R424R915R799R172P944O042L743J517k67j410
$$ 792220 800504 808413 816244 824740 834164 844079 853878 863050 870994 877036 880779 882296 882029 880619
60331H80619k000k411k771k510j044J114K655L041L016L319L663L336K092O1k489
$$ 880619 878619 876208 873437 870927 869883 870997 873652 876693 879709 883028 886691 890027 892119 892180 889691
60316H89691m832n912n510m687m574n145n676n820n516m533k899j380o88n02n2
$$ 889691 884859 878947 873437 868750 864176 859031 853355 847535 842019 837486 834587 833207 832519 832017 831965
60301H31965O31Q95O62N89J028J709K479L582M949N901N914N223M412L711K977
$$ 831965 832596 833491 834153 834742 835770 837479 839958 843540 848489 854390 860304 865527 869939 873650 876627
60286H76627K167J580J597K183K725K598J905J357J278J254J036J133K009L183
$$ 876627 878794 880374 881971 884154 886879 889477 891382 892739 894017 895271 896307 897440 899449 902632
60272I02632L900M249M902N905O745P366Q264R481J0485J1225J2429J4497J6900
$$ 902632 906532 910781 915683 921588 928333 935699 943963 953444 963929 975154 987583 1002080 1018980
60259A018980J9132K1551K4696K8273L1478L4076L6677M0043M4469M9672N5028
$$ 1018980 1038112 1059663 1084359 1112632 1144110 1178186 1214863 1254906 1299375 1349047 1404075
60248A404075O0162O5476P1886P9806Q8706R7860J07072J16265J24814J31867
$$ 1404075 1464237 1529713 1601599 1681405 1770111 1867971 1975043 2091308 2216122 2347989
60238B347989J37169J40914J42827J42027J38005J31231J22506J12055R9572Q4925
$$ 2347989 2485158 2626072 2768899 2910926 3048931 3180162 3302668 3414723 3514295 3599220
60228C599220O8508N0989L3056J5400j314j6591l0134m1662n0816n7342o1243
$$ 3599220 3667728 3718717 3751773 3767173 3765859 3749268 3719134 3677472 3626656 3569314 3508071
60217C508071o2617o1407n7407n0646m1640l1139j9586o888P187K2432L8184N3937
$$ 3508071 3445454 3384047 3326640 3275994 3234354 3203215 3183629 3176741 3183928 3206360 3244544 3298481
60205C298481O9725Q5668J01295J15680J28133J38288J45534J48970J48240J43848
$$ 3298481 3368206 3453874 3555169 3670849 3798982 3937270 4082804 4231774 4380014 4523862
60195D523862J36142J24510J08334Q8410O6565M4005K0857k679k5715m7505o7950
$$ 4523862 4660004 4784514 4892848 4981258 5047823 5091828 5112685 5110006 5084291 5036786 4968836
60184D968836q6714j02593j14277j21336j23890j21937j15673j06076r4318q0785
$$ 4968836 4882122 4779529 4665252 4543916 4420026 4298089 4182416 4076340 3982022 3901237
60174C901237o5265m7901k9359j0126R594K9266M7820O4289P8239Q9516R7805
$$ 3901237 3835972 3788071 3758712 3748586 3758180 3787446 3835266 3899555 3977794 4067310 4165115
60163D165115J02601J03379R9928R2646Q2335O9519N4270L7006J9148K314j2898
$$ 4165115 4267716 4371095 4471023 4563669 4646004 4715523 4769793 4806799 4825947 4828261 4815363
60152D815363k6704l8782m7745n2136n1468m6289l7638k6507j3350K102K0173
$$ 4815363 4788659 4749877 4702132 4649996 4598528 4552239 4514601 4488094 4474744 4476846 4497019
60141D497019M0328O1311Q2238J03160J24432J46150J68503J92271K18436K47221
$$ 4497019 4537347 4598658 4680896 4784056 4908488 5054638 5223141 5415412 5633848 5881069
60131E881069K77754L08592L38568L67137L93893M17800M37027M49716M54650
$$ 5881069 6158823 6467415 6805983 7173120 7567013 7984813 8421840 8871556 9326206
60122I326206M51090M38449M16649L86454L48796L03930K52084J94781J34496
$$ 9326206 9777296 10215745 10632394 11018848 11367644 11671574 11923658 12118439 12252935
60113A2252935P2746R350n5850j21288j84323k42854k95542l40727l76193m00108
$$ 12252935 12325681 12335031 12279181 12157893 11973570 11730716 11435174 11094447 10718254 10318146
60103A0318146m11812m11706m00942l81243l54475l22044k84854k43858k00381
$$ 10318146 9906334 9494628 9093686 8712443 8357968 8035924 7751070 7507212 7306831
60094G306831j55798j11138o7062k4096J7180N5923R0848J20310J42779J57275
$$ 7306831 7151033 7039895 6972833 6948737 6965917 7021840 7112688 7232998 7375777 7533052
60084G533052J63505J61654J52061J35104J11457Q2482N0232J6870j5998m7465
$$ 7533052 7696557 7858211 8010272 8145376 8256833 8339315 8389547 8406417 8390419 8342954
60074H342954p6972j03980j28078j49331j68259j85234j99761k10627k16996k19247
$$ 8342954 8265982 8162002 8033924 7884593 7716334 7531100 7331339 7120712 6903716 6684469
60064F684469k18483k15270k09296k00258j88522j74670j58725j40405j20000
$$ 6684469 6465986 6250716 6041420 5841162 5652640 5477970 5319245 5178840 5058840
60055E058840r8510p6844n5142l3027j0247J3098L6780O0524Q3759J05451J24498
$$ 5058840 4960330 4883486 4828344 4795317 4785070 4798168 4834948 4895472 4979231 5084682 5209180
60044E209180J40269J52553J60847J64024J61104J52151J37988J19167R5804O8535
$$ 5209180 5349449 5502002 5662849 5826873 5987977 6140128 6278116 6397283 6493087 6561622
60034F561622L8908Q339k2717n4026q4462j12334j36577j56743j71963j80986
$$ 6561622 6600530 6608869 6586152 6532126 6447664 6335330 6198753 6042010 5870047 5689061
60024E689061j83591j81168j75360j66648j54777j40037j23385j05639q7232o8495
$$ 5689061 5505470 5324302 5148942 4982294 4827517 4687480 4564095 4458456 4371224 4302729
60014D302729m9566l0065r594J1537L2711N4084P6520J00235J24273J47602J69894
$$ 4302729 4253163 4223098 4213504 4225041 4257752 4311836 4388356 4488591 4612864 4760466 4930360
60003D930360J90761K08787K22107K29516K30509K24637K11602J91882J66600
$$ 4930360 5121121 5329908 5552015 5781531 6012040 6236677 6448279 6640161 6806761
59994F806761J36862J03684O8412L2586k700l6909o9673j00645j29363j54602
$$ 6806761 6943623 7047307 7115719 7148305 7145605 7108696 7039023 6938378 6809015 6654413
59984F654413j74121j86003j90252j88324j81159j68674j51319j30938j09372
$$ 6654413 6480292 6294289 6104037 5915713 5734554 5565880 5414561 5283623 5174251
59975E174251q7092o3802l9687j5253R378L4040N7618P8463R5734J09713J20836
$$ 5174251 5087159 5023357 4983670 4968417 4977795 5011835 5069453 5147916 5243650 5353363 5474199
59964E474199J28980J33663J34509J31552J25340J16677J05967R3039P7943O1617
$$ 5474199 5603179 5736842 5871351 6002903 6128243 6244920 6350887 6443926 6521869 6583486
59954F583486M5369K9929J5472K318q854j7275k2109k2453j7897q838M295K1888
$$ 6583486 6628855 6658784 6674256 6676574 6667720 6650445 6628336 6605883 6587986 6579148 6583443 6605331
59942F605331M4563P2010J03260J38022J76833K19713K65481L12669L60214M06824
$$ 6605331 6649894 6721904 6825164 6963186 7140019 7359732 7625213 7937882 8298096 8704920
59932H704920M50334M88218N18265N38155N44684N34120N03485M51596L79333
$$ 8704920 9155254 9643472 10161737 10699892 11244576 11778696 12282181 12733777 13113110
59923A3113110K89419J85960P3936m0925j52112k53086l38874m06960m56594m87703
$$ 13113110 13402529 13588489 13662425 13621500 13469388 13216302 12877428 12470468 12013874 11526171
59913A1526171n01000m98814m84821m62387m33295l98247l58303l15447k71728
$$ 11526171 11025171 10526357 10041536 9579149 9145854 8747607 8389304 8073857 7802129
59904G802129k28167j84652j40804r6721n2968j0133L1402P1389J09610J45758
$$ 7802129 7573962 7389310 7248506 7151785 7098817 7088684 7120086 7191475 7301085 7446843
59894G446843J79066K08048K30779K45539K51135K46568K30648K02269J61290
$$ 7446843 7625909 7833957 8064736 8310275 8561410 8807978 9038626 9240895 9402185
59885I402185J09120M8420j7665q5891j52738k14441k67785l10901l43153l64488
$$ 9402185 9511305 9559725 9542060 9456169 9303431 9088990 8821205 8510304 8167151 7802663
59875G802663l75305l76737l70406l57663l39454l17025k92085k66036k39528
$$ 7802663 7427358 7050621 6680215 6322552 5983098 5666073 5373988 5107952 4868424
59866D868424k13064j87570j63787j41545j20254j00046q1992o7277n6383m8893
$$ 4868424 4655360 4467790 4304003 4162458 4042204 3942158 3860166 3792889 3736506 3687613
59856C687613m3942m0960m0150m1750m4775m7074m7078m4870m1187l6133k9539
$$ 3687613 3643671 3602711 3562561 3520811 3476036 3428962 3381884 3337014 3295827 3259694 3230155
59845C230155k1997j4596q039k867r0o34m245r948j7318k6375l6280m5268n2046
$$ 3230155 3208158 3193562 3185523 3182656 3182566 3181932 3177687 3167739 3150421 3124046 3087766 3042498 2990452
59832B990452n6447n8570n8227n5502n1060m5539l9189l2199k4764j6752p996
$$ 2990452 2934005 2875435 2817208 2761706 2710646 2665107 2625918 2593719 2568955 2552203 2544207
59821B544207J071R756J8043K6326L4228M0747M5794N0408N5242N9929O4388O9428
$$ 2544207 2545278 2555034 2573077 2599403 2633631 2674378 2720172 2770580 2825822 2885751 2950139 3019567
59809C019567P5212Q0123Q2140Q0570P5615O7180N5360M1545K7826J5392M438
$$ 3019567 3094779 3174902 3257042 3337612 3413227 3480407 3535767 3577312 3605138 3620530 3624968
59798C624968m677j1193j4889j6292j5844j3458q874j835Q051K0843L5603N0928
$$ 3624968 3620291 3609098 3594209 3577917 3562073 3548615 3539741 3537906 3545957 3566800 3602403 3653331
59786C653331O6472Q3421J03291J26698J53541J83850K18011K56312K98570L44033
$$ 3653331 3719803 3803224 3906515 4033213 4186754 4370604 4588615 4844927 5143497 5487530
59776E487530L91077M36723M76388N04277N14007M99153M54014L75588K66378
$$ 5487530 5878607 6315330 6791718 7295995 7810002 8309155 8763169 9138757 9405135
59767I405135J35880j325j29959k37896l17859l67584l89440l89115l73305l47744
$$ 9405135 9541015 9539690 9409731 9171835 8853976 8486392 8096952 7707837 7334532 6986788
59757F986788l16575k82634k47816k13390j80414j49684j21327r4877o9981m6714
$$ 6986788 6670213 6387579 6139763 5926373 5745959 5596275 5474948 5380071 5310090 5263376
59747E263376k5043m490J5378L4538N2922P0882Q9000J07759J27571J48667J70678
$$ 5263376 5238333 5233843 5249221 5283759 5336681 5407563 5496563 5604322 5731893 5880560 6051238
59736F051238J93013K16005K41185K69800L01587L35601L71791M10956M53424
$$ 6051238 6244251 6460256 6701441 6971241 7272828 7608429 7980220 8391176 8844600
59727H844600M98514N45215N92562O39171O82917P21273P51637P71419P78257
$$ 8844600 9343114 9888329 10480891 11120062 11802979 12524252 13275889 14047308 14825565
59718A4825565P70570P48044P12050O65942O14918N65058N22254M91566M76656
$$ 14825565 15596135 16344179 17056229 17722171 18337089 18902147 19424401 19915967 20392623
59709B0392623M78928M97164N28335N68735O14133O59258O97898P23793P31492
$$ 20392623 20871551 21368715 21897050 22465785 23079918 23739176 24437074 25160867 25892359
59700B5892359P16715O76704O10644N19969M08439K82097J48787J7077j04875
$$ 25892359 26609074 27285778 27896422 28416391 28824830 29106927 29255714 29272791 29167916
59691B9167916k10115k93571l52552l86469l95814l81482l45114k89414k17608
$$ 29167916 28957801 28664230 28311678 27925209 27529395 27147913 26802799 26513385 26295777
59682B6295777j32544l6432O9004J82555L03382M30539N62658O97905Q33487R64664
$$ 26295777 26163233 26126801 26195805 26378360 26681742 27112281 27674939 28372844 29206331 30170995
59672C0170995J084672J185781J259749J296991J286581J218805J088278Q94929
$$ 30170995 31255667 32441448 33701197 34998188 36284769 37503574 38591852 39486781
59664C9486781O43576L44462J4273l25001o49812r38809j175277j348774j456148
$$ 39486781 40130357 40474819 40489092 40164091 39514279 38575470 37400193 36051419 34595271
59655C4595271j500792j490382j435001j346510j237853j121741j009809r12936
$$ 34595271 33094479 31604097 30169096 28822586 27584733 26462992 25453183 24540247
59647B4540247q41357q03171q01699q33456q88050r50606j005990j042681j054460
$$ 24540247 23698890 22895719 22094020 21260564 20372514 19421908 18415918 17373237 16318777
59638A6318777j040107j002629r48192q83997q15736p46626o78514o13082n51813
$$ 16318777 15278670 14276041 13327849 12443852 11628116 10881490 10202976 9589894 9038081
59629I038081m95478m44224l97873l55830l17153k81300k48616k19654j94126
$$ 9038081 8542603 8098379 7700506 7344676 7027523 6746223 6497607 6277953 6083827
59620F083827j70969j49397j29417j11315r5066q0559o8143n8527n2074m8489
$$ 6083827 5912858 5763461 5634044 5522729 5427663 5347104 5278961 5220434 5168360 5119871
59610E119871m7271m8341n1960n8146o6349p5716q5431r4782j03000j09222j12699
$$ 5119871 5072600 5024259 4972299 4914153 4847804 4772088 4686657 4591875 4488875 4379653 4266954
59599D266954j13214j11277j07693j02814r6516q9051q1303p3707o5460n5706
$$ 4266954 4153740 4042463 3934770 3831956 3735440 3646389 3565086 3491379 3425919 3370213
59589C370213m5193l5667k7679k0135j2187m352K649Q988J4867J9648K2797K4927
$$ 3370213 3325020 3289353 3261674 3241539 3229352 3225000 3227649 3236637 3251504 3271152 3293949 3318876
59577C318876K6900K8527K9105K8745K8192K7703K7208K7230K8539L1137L4534
$$ 3318876 3345776 3374303 3403408 3432153 3460345 3488048 3515256 3542486 3571025 3602162 3636696
59566C636696L8949M5203N3364O2475P1715Q1164R1353J02770J15769J30219J45362
$$ 3636696 3675645 3720848 3774212 3836687 3908402 3989566 4080919 4183689 4299458 4429677 4575039
59555D575039J60806J77464J96625K18053K40011K61164K81445L00861L18567
$$ 4575039 4735845 4913309 5109934 5327987 5567998 5829162 6110607 6411468 6730035
59546F730035L33620L45667L54347L58677L57793L51721L40965L25826L06735
$$ 6730035 7063655 7409322 7763669 8122346 8480139 8831860 9172825 9498651 9805386
59537I805386K84872K61843K38761K15850J92687J68628J43479J18375R6002P9584
$$ 9805386 10090258 10352101 10590862 10806712 10999399 11168027 11311506 11429881 11525883 11605467
59527A1605467P1281P1367P8643R1545J08706J28392J47549J62056J68295J64128
$$ 11605467 11676748 11748115 11826758 11918303 12027009 12155401 12302950 12465006 12633301 12797429
59517A2797429J48186J19070P6111K0607m4509j15955j90363k63809l32331l93124
$$ 12797429 12945615 13064685 13140796 13161403 13116894 13000939 12810576 12546767 12214436 11821312
59507A1821312m44421m84377n11205n24622n26227n18063n01567m78090m49401
$$ 11821312 11376891 10892514 10381309 9856687 9330460 8812397 8310830 7832740 7383339
59498G383339m17208l82791l47469l12695k79303k47328k16866j88509j62619
$$ 7383339 6966131 6583340 6235871 5923176 5643873 5396545 5179679 4991170 4828551
59489D828551j38876j16881r6517p7400n8768m0411k2937o527R892K7495M6120
$$ 4828551 4689675 4572794 4476277 4398877 4340109 4299698 4276761 4270234 4280126 4307621 4353741
59478D353741O4742Q3052J01827J21912J43388J65703J88212K10608K32991K55364
$$ 4353741 4418483 4501535 4603362 4725274 4868662 5034365 5222577 5433185 5666176 5921540
59468E921540K76910K96048L11187L20961L23653L17155L00008K72114K34147
$$ 5921540 6198450 6494498 6805685 7126646 7450299 7767454 8067462 8339576 8573723
59459H573723J86667J30352O6872p81o8752j33170j91111k41083k82423l14331
$$ 8573723 8760390 8890742 8957614 8956833 8888081 8754911 8563800 8322717 8040294 7725963
59449G725963l35989l47609l50642l46750l37186l23225l06335k87499k67145
$$ 7725963 7389974 7042365 6691723 6344973 6007787 5684562 5378227 5090728 4823583
59440D823583k46074k25579k06256j87570j69294j52400j37614j23875j09539
$$ 4823583 4577509 4351930 4145674 3958104 3788810 3636410 3498796 3374921 3265382
59431C265382r4691q1065o9716n9924n0563m1503l3287k6091j9553j3253o958
$$ 3265382 3170691 3089626 3019910 2959986 2909423 2867920 2834633 2808542 2788989 2775736 2768778
59420B768778o47N427J0742J4900J8066K1016K4554K8748L2890L6383L9450M2486
$$ 2768778 2768131 2773558 2784300 2799200 2817266 2838282 2862836 2891584 2924474 2960857 3000307 3042793
59408C042793M4756M4491M0672L4444K8538K5550K6850L2494M1655N3302O6741
$$ 3042793 3087549 3132040 3172712 3207156 3235694 3261244 3288094 3320588 3362243 3415545 3482286
59397C482286Q1466R6537J10610J22812J33342J43241J54065J67827J86506K11096
$$ 3482286 3563752 3660289 3770899 3893711 4027053 4170294 4324359 4492186 4678692 4889788
59387D889788K41437K77036L17496L62076M09572M58966N09419N59259O05757
$$ 4889788 5131225 5408261 5725757 6087833 6497405 6956371 7465790 8025049 8630806
59378H630806O46389O79460P02831P13059P07071O84535O47803O00086N44583
$$ 8630806 9277195 9956655 10659486 11372545 12079616 12764151 13411954 14012040 14556623
59369A4556623M84962M25153L67989L14539K64864K18862J76132J35417R4484
$$ 14556623 15041585 15466738 15834727 16149266 16414130 16632992 16809124 16944541 17039025
59360A7039025N0699K125n1518j08965j68462k28292k86054l38130l80619m10864
$$ 17039025 17089724 17091849 17040331 16931366 16762904 16534612 16248558 15910428 15529809 15118945
59350A5118945m28061m33154m28753m18627m06415l94747l85793l81764l83888
$$ 15118945 14690884 14257730 13828977 13410350 13003935 12609188 12223395 11841631 11457743
59341A1457743l91184m01205m11888m21906m29551m32455m28910m18822m03211
$$ 11457743 11066559 10665354 10253466 9831560 9402009 8969554 8540644 8121822 7718611
59332G718611l83314l60325l35369l09303k82692k56048k29872k04564j80591
$$ 7718611 7335297 6974972 6639603 6330300 6047608 5791560 5561688 5357124 5176533
59323E176533j58500j38335j19351j00928q3559o8217n4802m2141k9610j7868
$$ 5176533 5018033 4879698 4760347 4659419 4575860 4507643 4452841 4410700 4381090 4363222
59313D363222p521K092J2158K2849L3228M2467N0581N7931O4464O9620P2778P3616
$$ 4363222 4355701 4357793 4369951 4392800 4426028 4468495 4519076 4577007 4641471 4711091 4783869 4857485
59301D857485P2146O8612O3411N6957M9358M0371K9903J8684Q109o80p296j1641
$$ 4857485 4929631 4998243 5061654 5118611 5167969 5208340 5238243 5256927 5265036 5264356 5257060 5245419
59289E245419j3484j2775r939n295J598J1479K4337L9275N5349P2104Q9344J06742
$$ 5245419 5231935 5219160 5209221 5203926 5205524 5217003 5241340 5280615 5335964 5408068 5497412 5604154
59277E604154J23889J40329J55404J68169J77521J82417J82068J76111J64560
$$ 5604154 5728043 5868372 6023776 6191945 6369466 6551883 6733951 6910062 7074622
59268G074622J47511J25073R7625O5956L0966o281m3798p8243j05909j24540j34218
$$ 7074622 7222133 7347206 7444831 7510787 7541753 7535472 7491674 7413431 7307522 7182982 7048764
59257G048764j36553j33313j25796j15166j02880r0499p9036o8799n9995n3117
$$ 7048764 6912211 6778898 6653102 6537936 6435056 6344557 6265521 6196722 6136727 6083610
59247F083610m8385m5167m2583m0514l9332l8673l7254l4025k8715k1064j0383
$$ 6083610 6035225 5990058 5947475 5906961 5867629 5828956 5791702 5757677 5728962 5707898 5697515
59236E697515L634K0512L9993O2855R0071J21647J56912J95476K37171K81283
$$ 5697515 5701149 5721661 5761654 5824509 5914580 6036227 6193139 6388615 6625786 6907069
59226F907069L26327L70345M10892M45058M69903M82708M80665M61019M22173
$$ 6907069 7233396 7603741 8014633 8459691 8929594 9412302 9892967 10353986 10776159
59217A0776159L64358K89046J98442R6063j2944j23055k29570l28042m13436m81206
$$ 10776159 11140517 11429563 11628005 11724068 11711124 11588069 11358499 11030457 10617021 10135815
59207A0135815n29228n57905n68698n63510n45270n17764m84314m47140m08034
$$ 10135815 9606587 9048682 8479984 7916474 7371204 6853440 6369126 5921986 5513952
59198E513952l68910l31397k96325k63871k33954k06521j81849j60502j42672
$$ 5513952 5145042 4813645 4517320 4253449 4019495 3812974 3631125 3470623 3327951
59189C327951j27653j14335j02197r1499q2605p5353o8947o2370n5162m7977m1933
$$ 3327951 3200298 3085963 2983766 2892267 2809662 2734309 2665362 2602992 2547830 2499853 2457920
59178B457920l7293l3239k9054k4822k0637j6126j1282o838l043J059O288J1990
$$ 2457920 2420627 2387388 2358334 2333512 2312875 2296749 2285467 2278629 2275586 2276645 2282933 2294923
59166B294923J7091K1693K6493L1346L5675L9781M4347M9038N3083N6901O1676
$$ 2294923 2312014 2333707 2360200 2391546 2427221 2467002 2511349 2560387 2613470 2670371 2732047
59155B732047O7389P2824P7572Q2511Q8019R3128R6955R9679J01530J01889J00029
$$ 2732047 2799436 2872260 2949832 3032343 3120362 3213490 3310445 3410124 3511654 3613543 3713572
59144C713572R5981R0068Q2281P2556O1101M8197L4161J9694N674p436j9328k9209
$$ 3713572 3809553 3899621 3981902 4054458 4115559 4163756 4197917 4217611 4223285 4215849 4196521 4167312
59132D167312l6192m0347m2402m2424l9791l4508k7426j8947q582L822J7497L1740
$$ 4167312 4131120 4090773 4048371 4005947 3966156 3931648 3904222 3885275 3876693 3880515 3898012 3929752
59120C929752M6614O2237P8347R4967J12586J31230J50172J69016J88245K08254
$$ 3929752 3976366 4038603 4116950 4211917 4324503 4455733 4605905 4774921 4963166 5171420
59110E171420K28613K48654K67832K85034K98320L05889L06587K99023K81243
$$ 5171420 5400033 5648687 5916519 6201553 6499873 6805762 7112349 7411372 7692615
59101G692615K52083K12275J63701J08386M8958j0785o6912j16852j59413j93897
$$ 7692615 7944698 8156973 8320674 8429060 8478018 8467233 8400321 8283469 8124056 7930159
59091G930159k20067k38776k51833k61031k67446k71327k72436k70637k66432
$$ 7930159 7710092 7471316 7219483 6958452 6691006 6419679 6147243 5876606 5610174
59082E610174k60780k54306k47022k38715k29170k18140k05779j93143j81464
$$ 5610174 5349394 5095088 4848066 4609351 4380181 4162041 3956262 3763119 3581655
59073C581655j70799j60133j48979j37968j27668j17750j07857r8415q9965q2284
$$ 3581655 3410856 3250723 3101744 2963776 2836108 2718358 2610501 2512086 2422121 2339837
59063B339837p4762o7203n9763n2490m5373l8475l1791k5309j9357j4421j0605
$$ 2339837 2265075 2197872 2138109 2085619 2040246 2001771 1969980 1944671 1925314 1910893 1900288
59052A900288p816o424o908q972j1884j5771k1333k8124l4293l8505m1001m2346
$$ 1900288 1892472 1886048 1879140 1870168 1858284 1842513 1821180 1793056 1758763 1720258 1679257 1636911
59040A636911m2323m0775l8304l5339l1469k6490k1257j6693j2822r479o907m808
$$ 1636911 1594588 1553813 1515509 1480170 1448701 1422211 1400954 1384261 1371439 1361960 1355053 1350245
59028A350245j920K363O826J0040J2185J4092J5319J4683J2217R158O284L561
$$ 1350245 1348325 1350688 1357514 1367554 1379739 1393831 1409150 1423833 1436050 1445208 1451492 1455053
59016A455053J125o34j868k956l443k446j08K404M441O453Q879J1329J3169J4203
$$ 1455053 1456178 1455544 1453676 1450720 1447277 1444831 1444723 1447127 1451568 1458021 1466900 1478229 1491398 1505601
59002A505601J4573J4444J3897J2765J0719P854M949K605N73j501l059l242k174
$$ 1505601 1520174 1534618 1548515 1561280 1571999 1579853 1584802 1587407 1587980 1586479 1583420 1580178 1578004
58989A578004q13L39J523K888M222N498O859Q038Q563Q625Q988R924J0931J1688
$$ 1578004 1577191 1577530 1579053 1581941 1586163 1591661 1598520 1606558 1615121 1623746 1632734 1642658 1653589 1665277
58975A665277J2595J4095J5975J7721J9216K0878K3160K6085K9105L1638L3780
$$ 1665277 1677872 1691967 1707942 1725663 1744879 1765757 1788917 1815002 1844107 1875745 1909525
58964A909525L6213L9178M1972M3840M4883M5500M5463M4332M2485M0858L9736
$$ 1909525 1945738 1984916 2026888 2070728 2115611 2161111 2206574 2250906 2293391 2334249 2373985
58953B373985L8645L7495L7081L8190M0814M4457M8694N3258N8061O3429O9919
$$ 2373985 2412630 2450125 2487206 2525396 2566210 2610667 2659361 2712619 2770680 2834109 2904028
58942B904028P7711Q6358R5319J04496J14108J24161J34297J44176J54075J65023
$$ 2904028 2981739 3068097 3163416 3267912 3382020 3506181 3640478 3784654 3938729 4103752
58932D103752J78085J93510K10767K29490K50042K73066K98854L27443L58988
$$ 4103752 4281837 4475347 4686114 4915604 5165646 5438712 5737566 6065009 6423997
58923F423997L93720M31669M72645N16387N62796O12123O64722P19949P75335
$$ 6423997 6817717 7249386 7722031 8238418 8801214 9413337 10078059 10798008 11573343
58914A1573343Q27478Q73699R11966R39210R50719R41650R08221Q47310P56555
$$ 11573343 12400821 13274520 14186486 15125696 16076415 17018065 17926286 18773596 19530151
58905A9530151O36127M89845L23733J44342m0796k22359l90832n39126o63100
$$ 19530151 20166278 20656123 20979856 21124198 21083402 20861043 20470211 19931085 19267985
58896A9267985p60347q29965q73225q93123q92993q76099q46058q06392p59595
$$ 19267985 18507638 17677673 16804448 15911325 15018332 14142233 13296175 12489783 11730188
58887A1730188p07620o53076n98914n46904m97476m51079m08685l70851l37281
$$ 11730188 11022568 10369492 9770578 9223674 8726198 8275119 7866434 7495583 7158302
58878G158302l07734k82577k62192k46380k34399k24966k16237k06611j95791
$$ 7158302 6850568 6567991 6305799 6059419 5825020 5600054 5383817 5177206 4981415
58869D981415j84433j72855j60833j48580j36873j25936j15150j04288r4165q5500
$$ 4981415 4796982 4624127 4463294 4314714 4177841 4051905 3936755 3832467 3738302 3652802
58859C652802p7825p0174o2391n5046m8378m1918l5136k8046k1049j4443q113
$$ 3652802 3574977 3504803 3442412 3387366 3338988 3297070 3261934 3233888 3212839 3198396 3190283
58848C190283j663N224J2555K0120K7649L4863M1583M7983N4524O1536O8976P6754
$$ 3190283 3188620 3193844 3206399 3226519 3254168 3289031 3330614 3378597 3433121 3494657 3563633 3640387
58836C640387Q4952R3609J02601J11872J21506J31507J42023J53806J67748J83645
$$ 3640387 3725339 3818948 3921549 4033421 4154927 4286434 4428457 4582263 4750011 4933656
58826D933656K00295K17281K35844K57351K81693L08159L37154L69932M06937
$$ 4933656 5133951 5351232 5587076 5844427 6126120 6434279 6771433 7141365 7548302
58817G548302M47540M91262N38292N88751O42133O97267P52080Q03439Q48019
$$ 7548302 7995842 8487104 9025396 9614147 10256280 10953547 11705627 12509066 13357085
58808A3357085Q83147R06077R12694Q97867Q57246P88284O90063N63489M12084
$$ 13357085 14240232 15146309 16059003 16956870 17814116 18602400 19292463 19855952 20268036
58799B0268036K41982O0975j22258k98544m59299n97984p10663p95629q53212
$$ 20268036 20510018 20570993 20448735 20150191 19690892 19092908 18382245 17586616 16733404
58790A6733404q85609q96031q87781q64423q30227p89387p44794o98231o51437
$$ 16733404 15847795 14951764 14063983 13199560 12369333 11579946 10835152 10136921 9485484
58781I485484o06001n62477n20584m80517m43062m08429l75943l45237l16944
$$ 9485484 8879483 8317006 7796422 7315905 6872843 6464414 6088471 5743234 5426290
58772E426290k91793k69702k50047k32411k16607k02274j88767j75488j62423
$$ 5426290 5134497 4864795 4614748 4382337 4165730 3963456 3774689 3599201 3436778
58763C436778j50235j39457j29540j19393j09082j00002r2784q6111p8532p0490
$$ 3436778 3286543 3147086 3017546 2898153 2789071 2689069 2596285 2510174 2431642 2361152
58753B361152o3352n7231n1296m5636m1120l7663l4270l0745k7772k5247k2180
$$ 2361152 2297800 2240569 2189273 2143637 2102517 2064854 2030584 1999839 1972067 1946820 1924640
58742A924640j8539j5611j4041j2901j1296r601q441p570o614n971o207p233q612
$$ 1924640 1906101 1890490 1876449 1863548 1852252 1842651 1834210 1826640 1820026 1814055 1807848 1800615 1792003
58729A792003j0050j1220j1849j2472j4279j7708k1795k5358k8234l0914l3598
$$ 1792003 1781953 1770733 1758884 1746412 1732133 1714425 1692630 1667272 1639038 1608124 1574526
58718A574526l6069l8049l9277l9607l9196l8243l6575l4033l1253k9239k8117
$$ 1574526 1538457 1500408 1461131 1421524 1382328 1344085 1307510 1273477 1242224 1212985 1184868
58707A184868k7016k5322k3285k1234j9066j6783j4823j3476j2475j1501j0595
$$ 1184868 1157852 1132530 1109245 1088011 1068945 1052162 1037339 1023863 1011388 999887 989292
58696I89292r888r403r189r211r126q569p585o345m741k834j261n41l85n23j551
$$ 989292 979404 970001 960812 951601 942475 933906 926321 919976 915235 912401 911140 910599 910214 909691 908140
58681I08140l888o500q051q869j0139j1527j1452r629p553o122m647k695j130
$$ 908140 904252 897752 889701 880832 870693 859166 847714 838085 830532 824410 819763 817068 815938
58668H15938n84m12L3M03M08O35J484K449L069L524L703K967J482N65Q56J390
$$ 815938 815354 814942 814975 815378 815786 816421 817905 820354 823423 826947 830650 833617 835099 835664 836520 837910
58652H37910J275J129J884L303M626N794P112Q538J0158J2417J5118J7178J8228
$$ 837910 839185 840314 842198 845501 850127 855921 863033 871571 881729 894146 909264 926442 944670
58639I44670J9377K1474K3705K5023K5998K7941L0976L4300L7807M2148M7404
$$ 944670 964047 985521 1009226 1034249 1060247 1088188 1119164 1153464 1191271 1233419 1280823
58628A280823N2909N8326O4078P0782P8816Q8262R8893J10486J23450J38613J56103
$$ 1280823 1333732 1392058 1456136 1526918 1605734 1693996 1792889 1903375 2026825 2165438 2321541
58617B321541J75073J94776K15090K35472K54399K70385K82729K90465K91234
$$ 2321541 2496614 2691390 2906480 3141952 3396351 3666736 3949465 4239930 4531164
58608D531164K82023K60627K26249J79652J23461O1490k710o6108j24868j74307
$$ 4531164 4813187 5073814 5300063 5479715 5603176 5664666 5661956 5595848 5470980 5296673
58598E296673k11285k35859k49890k55009k52703k45043k33934k20176k04288
$$ 5296673 5085388 4849529 4599639 4344630 4091927 3846884 3612950 3392774 3188486
58589C188486j87579j71355j55753j40377j25547j11868r9124q6673p4687o4042
$$ 3188486 3000907 2829552 2673799 2533422 2407875 2296007 2196883 2110210 2035523 1971481
58579A971481n5233m8092m2296l7576l3616l0345k8005k6625k5970k6069k7061
$$ 1971481 1916248 1868156 1825860 1788284 1754668 1724323 1696318 1669693 1643723 1617654 1590593
58568A590593k8267k8573k8118k8347k9757l0855l0310k8902k8152k8158k8055
$$ 1590593 1562326 1533753 1505635 1477288 1447531 1416676 1386366 1357464 1329312 1301154 1273099
58557A273099k7721k7623k7585k7006k5884k4496k2589j9934j7167j5068j3440
$$ 1273099 1245378 1217755 1190170 1163164 1137280 1112784 1090195 1070261 1053094 1038026 1024586
58546A024586j1736j0190r289q614p346n666m516m259m364m326m073l726l557
$$ 1024586 1012850 1002660 993371 984757 977411 971745 967229 962970 958606 954280 950207 946481 942924
58533I42924l900m643n289n860p029q936j0701j1690j2316j3037j3552j3726j4156
$$ 942924 939024 934381 929092 923232 916203 907267 896566 884876 872560 859523 845971 832245 818089
58520H18089j4970j5189j4296j3253j2800j1998r838p252n966o091o354o079n432
$$ 818089 803119 787930 773634 760381 747581 735583 725745 718493 712527 706436 700082 694003 688571
58507F88571m415l020j920j603j312j78J221J750J574J663J987J807J329J469
$$ 688571 684156 681136 679216 677613 676301 676123 677344 679094 680668 682331 684318 686125 687454 688923
58493F88923K152K424K107J976K301K535K460K458K623K663K685L082L785M431
$$ 688923 691075 693499 695606 697582 699883 702418 704878 707336 709959 712622 715307 718389 722174 726605
58479G26605N082N923O579O584O200N936N731N403N241N222M381K058q94l271
$$ 726605 731687 737610 744189 750773 756973 762909 768640 774043 779284 784506 788887 790945 790051 786780
58465G86780n173p163q638q670p899p846q557q653p657o724o834p623q222q201
$$ 786780 781607 774444 765806 757136 749237 741391 732834 724181 716524 709800 702966 695343 687121 678920
58451F78920p476o218n014m381m137l819l422l131k730k014j294p63j8J084J898
$$ 678920 671444 665226 660212 655831 651694 647875 644453 641322 638592 636578 635284 634521 634503 635587 637485
58436F37485K197K984M926O882P284O235M961L875K582J225L94P3r4J07J013K287
$$ 637485 639682 642666 647592 654474 661758 667993 672954 676829 679411 680636 681030 681103 681009 681116 682129 684416
58420F84416L541N041O827Q036Q207Q273Q971R419Q696P666P574P883P332O216
$$ 684416 687957 692998 699825 707861 716068 724341 733312 742731 751427 759093 766667 774550 781882 788098
58406G88098N666N506M710L356K230J187k72j466j569j513k832n105o506o439
$$ 788098 793764 799270 803980 807336 809566 810753 810481 809015 807446 805933 803101 797996 791490 785051
58392G85051n773n011m077l456l626l813l072j956j380p42Q60K456K503J643J728
$$ 785051 779278 774267 770190 766734 763108 759295 756223 754267 752887 752145 753005 755461 757964 759607 761335
58377G61335K830L572L870M749N962O339O169O785Q008Q494Q297Q586R140Q706
$$ 761335 764165 767737 771607 776356 782318 788657 794826 801611 809619 818113 826410 834996 844136 852842
58363H52842P588P302P875Q017P629P555P211N404L272L338N549P260P266O863
$$ 852842 860430 867732 875607 883624 891253 898808 906019 911423 914695 918033 923582 930842 938108 944971
58349I44971O707N770L987K850K732K286J148N47P43N81J34R49L003M282M184
$$ 944971 951678 957448 961435 964285 967017 969303 970451 970998 971741 972322 972456 973405 976408 980690 984874
58334I84874M540O328Q046Q511Q730R783J1020J1527J1571J1639J1737J2123J3039
$$ 984874 989414 995742 1003788 1012299 1021029 1030812 1041832 1053359 1064930 1076569 1088306 1100429 1113468
58321A113468J3595J2738J1321J1064J1728J1691J1101J1653J3310J4216J4015
$$ 1113468 1127063 1139801 1151122 1162186 1173914 1185605 1196706 1208359 1221669 1235885 1249900
58310A249900J4217J5059J5000J3719J2700J2368J1635J0549J0506J1391J1614
$$ 1249900 1264117 1279176 1294176 1307895 1320595 1332963 1344598 1355147 1365653 1377044 1388658
58299A388658J1230J1922J3626J4450J4261J5005J7040J8530J8946J9739K1067
$$ 1388658 1399888 1411810 1425436 1439886 1454147 1469152 1486192 1504722 1523668 1543407 1564474
58288A564474K1433K0956K1472K2880K3145K2370K2985K5313K6980K7332K8372
$$ 1564474 1585907 1606863 1628335 1651215 1674360 1696730 1719715 1745028 1772008 1799340 1827712
58277A827712L0584L2125L2885L5030L8521M0480M0173M0171M1560M2410M2158
$$ 1827712 1858296 1890421 1923306 1958336 1996857 2037337 2077510 2117681 2159241 2201651 2243809
58266B243809M2847M4732M5335M4235M4177M6116M7854M8792N1079N4808N7262
$$ 2243809 2286656 2331388 2376723 2420958 2465135 2511251 2559105 2607897 2658976 2713784 2771046
58255B771046N8350O1369O6835P1150P3108P5911Q0862Q5036Q7254R0364R5335
$$ 2771046 2829396 2890765 2957600 3028750 3101858 3177769 3258631 3343667 3430921 3521285 3616620
58244C616620R9267J01616J06025J13426J19798J23502J28320J36327J44530J51508
$$ 3616620 3715887 3817503 3923528 4036954 4156752 4280254 4408574 4544901 4689431 4840939
58234D840939J60387J72131J83020J92073K03645K19260K34592K48092K64436
$$ 4840939 5001326 5173457 5356477 5548550 5752195 5971455 6206047 6454139 6718575
58225F718575K85626L07142L27043L50135L78598M07741M35903M69080N10538
$$ 6718575 7004201 7311343 7638386 7988521 8367119 8774860 9210763 9679843 10190381
58216A0190381N55601O02279O56769P22798P96320Q76859R72491J087241J216089
$$ 10190381 10745982 11348261 12005030 12727828 13524148 14401007 15373498 16460739 17676828
58207A7676828J359589J530317J737645J981078K267194K617713L052454L582821
$$ 17676828 19036417 20566734 22304379 24285457 26552651 29170364 32222818 35805639
58199C5805639M233152N050475O083997P378562R000051J1039582J3577687J6672177
$$ 35805639 40038791 45089266 51173263 58551825 67551876 78591458 92169145 108841322
58191A08841322K0381566K4727544K9575531L4574575L9200782M2694167M3809128
$$ 108841322 129222888 153950432 183525963 218100538 257301320 299995487 343804615
58184C43804615M0818825L2288493J8314334J112477j5786365k9195068l7511735
$$ 343804615 384623440 416911933 435226267 436338744 420552379 391357311 353845576
58177C53845576m0843140m0337595l7429373l3364690k9008888k4846147k1091404
$$ 353845576 313002436 272664841 235235468 201870778 172861890 148015743 126924339
58170A26924339j7813094j5000509j2597948j0543729q796285p323503o083540
$$ 126924339 109111245 94110736 81512788 70969059 62172774 54849271 48765731
58163D8765731n031177m133231l363695k689956k076171j496326r32866l63990
$$ 48765731 43734554 39601323 36237628 33547672 31471501 29975175 29042309 28678319
58155B8678319K36687Q82961J562980K246565K894765L435415L711227L481200
$$ 28678319 28915006 29797967 31360947 33607512 36502277 39937692 43648919 47130119
58147D7130119K549029R54104r61693k714752l941863m539946m611287m332438
$$ 47130119 49679148 50633252 49671559 46956807 43014944 38474998 33863711 29531273
58139B9531273l870661l355412k865036k427979k047466j724358j456047j230544
$$ 29531273 25660612 22305200 19440164 17012185 14964719 13240361 11784314 10553770
58131A0553770j036300q71781p37256o25382n28727m49117l90376l47786l12939
$$ 10553770 9517470 8645689 7908433 7283051 6754324 6305207 5914831 5567045 5254106
58122E254106k83757k62101k46196k32482k20712k10888j99152j82560j64115
$$ 5254106 4970349 4708248 4462052 4229570 4008858 3797970 3598818 3416258 3252143
58113C252143j47891j33119j17843j04059r4170q6618p9839p6320p7877q0986
$$ 3252143 3104252 2971133 2853290 2749231 2655061 2568443 2488604 2412284 2334407 2253421
58103B253421q1613q0693q0165p7949p2019o5420o1749n9147n4079m7844m4013
$$ 2253421 2171808 2091115 2010950 1933001 1860982 1795562 1733813 1674666 1620587 1572743 1528730
58092A528730m2260l9993l7590l6870l6591l4415l1407l0014k9469k7664k5636
$$ 1528730 1486470 1446477 1408887 1372017 1335426 1301011 1269604 1239590 1210121 1182457 1156821
58081A156821k5771k7154k7100k5760k5085k4630k2572j9738j8525j8713j8058
$$ 1156821 1131050 1103896 1076796 1051036 1025951 1001321 978749 959011 940486 921773 903715
58070I03715j6321j5233j5109j4650j3513j2255j0530p944n785n431n981n854
$$ 903715 887394 872161 857052 842402 828889 816634 806104 798160 792375 786944 780963 775109
58058G75109n525o316p776q648r173j0081j0679j0240r783j0225j0350q992p515
$$ 775109 769584 763268 755492 746844 737671 727590 716911 706671 696888 686663 676313 667321 659806
58045F59806p513p841o714n013m532m439k789k86P43L32O16K175L496L791L686
$$ 659806 652293 644452 637738 632725 628193 623754 620965 620679 621422 621754 622370 624545 628041 631832 635518
58030F35518L378K471J397R17O22k10r64p07p8k20p31n87k06o34j580k265l150
$$ 635518 638896 641367 642764 643681 644303 644093 643129 642422 642344 642124 641393 640806 640600 639966 638386 636121 632971
58013F32971m826o250o197n442n439n919o019o469q190r805r282p249n975n727
$$ 632971 628145 621895 615698 610256 604817 598898 592879 586410 578220 568415 559133 551884 545909 540182
57999E40182m903l306k466k720k619j448j19P28J464K092J947J002J7o73j208
$$ 540182 535279 531973 529507 526787 524168 522720 522601 523329 524793 526885 528832 529834 529851 529178 527970
57984E27970j323p38p0qkP96J884K204J880J722J675J329J192J750K058J090l64
$$ 527970 526647 525909 525839 525831 525829 526625 528509 530713 532593 534315 535990 537319 538511 540261 542319 543409 543045
57967E43045r34j063k070l599m219l979m163m821m787l941l353l292l148l162
$$ 543045 542111 541048 538978 535379 531160 527181 523018 518197 513410 509469 506116 502824 499676 496514
57953D96514m227n941o883o769o492o086m670k443p60J0Q08J884K350K025J948
$$ 496514 492287 486346 479463 472694 466202 460116 455446 453003 452243 452253 453061 454945 457295 459320 461268
57938D61268K525K837K206J069p9j275k341k927l491m914o940q315q706q979r474
$$ 461268 463793 466630 468836 469905 469826 468551 466210 463283 459792 454878 447938 439623 430917 421938 412464
57923D12464r402q417p338o767o131m742k833r65P76K480L908M746N100N508O562
$$ 412464 403062 394645 387307 380540 374409 369667 366834 365869 366645 369125 373033 377779 382879 388387 394949
57908C94949Q282R754R940R076Q492Q672Q563P403O005N259M655L488K325J847
$$ 394949 403231 412985 422925 432001 440493 449165 457728 465131 471136 476395 481050 484538 486863 488710
57894D88710J361Q2j253j753k296m041o062o571n821n561o185o623o622o791o731
$$ 488710 490071 490153 488900 487147 484851 480810 474748 468177 462356 456795 450610 443987 437365 430574 423843
57879D23843n554m059l969m962m946l434k167j962j482J64J939K926L798N209
$$ 423843 418289 414230 410261 405299 400353 396919 394752 392790 391308 391472 393411 396337 400135 405344
57865D05344O505P072P417P910P879O875N564M591L782L055K831K893K208N68
$$ 405344 411849 418921 426338 434248 442127 449002 454566 459157 462939 465994 468825 471718 473926 474494
57851D74494q96j529k146l475m873n451n382n294n318n451n891o330n819m080
$$ 474494 473598 472069 469923 466448 461575 456124 450742 445448 440130 434679 428788 422458 416639 412559
57837D12559k161j284j588k452l249l619l653l998n050o117o295n965o280p297
$$ 412559 410398 409114 407526 405074 401825 398206 394553 390555 385505 379388 373093 367128 360848 353551
57823C53551q035q246q603r087q887q124p918q337q047o584n220m866m765m149
$$ 353551 345516 337270 328667 319580 310693 302569 294651 286314 278267 271683 266463 261597 256832 252683
57809B52683l544l394k900j422K11J007J309J888K565K894L341M603O365P751
$$ 252683 249139 245745 242845 241423 241634 242641 243950 245838 248403 251297 254638 259241 265606 273357
57795B73357Q513R001R438R813R955R297P299M477K178R28K2r53j379r84o85j195
$$ 273357 281870 290871 300309 310122 320077 329374 336673 341150 343328 344256 344278 343325 341946 340962 340277 339082
57779C39082j945k273k661l753n071n762n870n960o092o050n903n587m655l150
$$ 339082 337137 334864 332203 328450 323379 317617 311747 305787 299695 293645 287742 282155 277500 274350
57765B74350k024j826j733p20R53K289K933L143K952K307J645J514J891K429L036
$$ 274350 272326 270500 268767 268047 269000 271289 274222 277365 280317 282624 284269 285783 287674 290103 293139
57750B93139L688M139M246M183M011L547K944K721K923L043K980L184L592L479
$$ 293139 296827 300966 305212 309395 313406 316953 319897 322618 325541 328584 331564 334748 338340 341819
57736C41819K811K592L252L901L831L612L899M252M200M332N257O365O865P162
$$ 341819 344630 347222 350474 354375 358206 361818 365717 369969 374169 378501 383758 390123 396988 404150
57722D04150Q127R558J0633J1268J1918J2529J2744J2767J3041J3525J4137J5382
$$ 404150 412277 421835 432468 443736 455654 468183 480927 493694 506735 520260 534397 549779
57710E49779J7599K0048K1694K2485K3088K3854K4964K6969L0217L4089L7820
$$ 549779 567378 587426 609120 631605 654693 678547 703511 730480 760697 794786 832606
57699H32606M1630M6198N1512N7223O3597P1177P9948Q9781J01243J14832J29975
$$ 832606 874236 920434 971946 1029169 1092766 1163943 1243891 1333672 1434915 1549747 1679722
57688A679722J45945J63293J83055K04789K26718K47632K67197K84269K96262
$$ 1679722 1825667 1988960 2172015 2376804 2603522 2851154 3118351 3402620 3698882
57679C698882L00566K95554K79981K52600K13288J64191J09504N4377L891l7928
$$ 3698882 3999448 4295002 4574983 4827583 5040871 5205062 5314566 5368943 5372834 5334906
57669E334906o9026q9607j02033j10889j22376j41944j71118k06244k40173k65577
$$ 5334906 5265880 5176273 5074240 4963351 4840975 4699031 4527913 4321669 4081496 3815919
57659C815919k77765k75881k62231k40552k14622j87822j62677j40148j19802
$$ 3815919 3538154 3262273 3000042 2759490 2544868 2357046 2194369 2054221 1934419
57650A934419j01241q4938p1296n9645m8948l9035l0333k2787j5831r118k522
$$ 1934419 1833178 1748240 1676944 1617299 1568351 1529316 1498983 1476196 1460365 1451247 1448725
57639A448725M311J1642J9176K6597L4311M2959N2459O2359P2867Q4712R8104
$$ 1448725 1453036 1464678 1483854 1510451 1544762 1587721 1640180 1702539 1775406 1860118 1958222
57628A958222J12572J27754J43714J60569J78255J96406K13880K28714K39126
$$ 1958222 2070794 2198548 2342262 2502831 2681086 2877492 3091372 3320086 3559212
57619C559212K44140K42542K31811K09262J74274J28721P5528J7771m1042r6983
$$ 3559212 3803352 4045894 4277705 4486967 4661241 4789962 4865490 4883261 4842219 4745236
57609D745236j46514j86986k16698k35375k44494k46282k42246k33172k20281
$$ 4745236 4598722 4411736 4195038 3959663 3715169 3468887 3226641 2993469 2773188
57600B773188k05366j89802j74187j59039j44983j32074j19691j07439r5731q5315
$$ 2773188 2567822 2378020 2203833 2044794 1899811 1767737 1648046 1540607 1444876 1359561
57590A359561p6625o9520o3328n7234n1054m5431m0872l6962l3162k9815k7538
$$ 1359561 1282936 1213416 1150088 1092854 1041800 996369 955497 918535 885373 855558 828020
57579H28020k5936k3986k1541j9427j8000j6681j5058j3499j2335j1215r643p658
$$ 828020 802084 778098 756557 737130 719130 702449 687391 673892 661557 650342 640699 633041
57567F33041n673m077l107k621j985o75J012K388L404M617O249P975R623J1286
$$ 633041 627368 623291 620184 617563 615578 614903 615915 618303 621707 626324 632573 640548 650171 661457
57553F61457J2685J3297J3307J3809J5612J8386K1164K3382K5317K7848L1714
$$ 661457 674142 687439 700746 714555 730167 748553 769717 793099 818416 846264 877978
57542H77978L6683M1645M6048N0853N7360O5474P4054Q2830R2761J04370J16890
$$ 877978 914661 956306 1002354 1053207 1110567 1176041 1250095 1332925 1425686 1530056 1646946
57531A646946J29467J42281J55840J69808J83013J94010K01220K02985J97939
$$ 1646946 1776413 1918694 2074534 2244342 2427355 2621365 2822585 3025570 3223509
57522C223509J85137J63789J33478R4895N0097J937m6318r1045j28915j58060
$$ 3223509 3408646 3572435 3705913 3800808 3850905 3852842 3806524 3715479 3586564 3428504
57512C428504j78229j89826j93422j90357j82916j73248j62399j50661j38333
$$ 3428504 3250275 3060449 2867027 2676670 2493754 2320506 2158107 2007446 1869113
57503A869113j25759j13094j00529q8512p7504o7680n9007n1365m4445l7880l1591
$$ 1869113 1743354 1630260 1529731 1441219 1363715 1296035 1237028 1185663 1141218 1103338 1071747
57492A071747k5800k0606j5864j1430p245l216O90M363P913J1896J6652K1701
$$ 1071747 1045947 1025341 1009477 998047 990802 987586 988276 992639 1000552 1012448 1029100 1050801
57480A050801K6418L1179L7126M4792N3670O3087P2833Q2949R3608J05348J18666
$$ 1050801 1077219 1108398 1145524 1190316 1243986 1307073 1379906 1462855 1556463 1661811 1780477
57469A780477J33231J47981J61970J74466J84268J89783J89846J83657J69924
$$ 1780477 1913708 2061689 2223659 2398125 2582393 2772176 2962022 3145679 3315603
57460C315603J47115J14887P4680K8808k0052o8391j12205j48528j76163j94797
$$ 3315603 3462718 3577605 3652285 3681093 3661041 3592650 3480445 3331917 3155754 2960957
57450B960957k04417k06005k01716j93509j82304j68951j55022j41823j29247
$$ 2960957 2756540 2550535 2348819 2155310 1973006 1804055 1649033 1507210 1377963
57441A377963j16570j03937r2261q2105p3458o6215o0188n4777m9416m4213l9669
$$ 1377963 1261393 1157456 1065195 983090 909632 843417 783229 728452 679036 634823 595154
57430E95154l5902l2620k9666k7093k4780k2441k0013j7725j5895j4731j4179
$$ 595154 559252 526632 496966 469873 445093 422652 402639 384914 369019 354288 340109
57419C40109j3826j3178j2170j1130j0207r249q293p618p210o723o154o012o474
$$ 340109 326283 313105 300935 289805 279598 270349 262056 254438 247228 240505 234351 228339 221865
57406B21865o950o810o111n258m400l469k466j397l53K87J74l22m06pP1n75j296
$$ 221865 214915 208105 201994 196736 192336 188867 186401 185004 184651 184938 185112 184790 184384 184377 184448 183873 182577
57389A82577j411j127q99o25j31J57k40j040j592j733j710j541j024k23M54N19
$$ 182577 181166 180039 179140 178515 178384 178541 178301 177261 175669 173936 172226 170685 169661 169438 169892 170411
57373A70411k87j587k300j652l69Kr00j841j926j735j985k236j852j219r40p07
$$ 170411 170124 168537 166237 164585 164216 164218 163318 161477 159551 157816 155831 153595 151743 150524 149584 148877
57357A48877n3N10L80J67P40J537J282R7n63q6N74N04k0k70N6Q57J777K152J630
$$ 148877 148824 149334 149714 149881 150621 152158 153440 153537 152974 152888 153462 153966 153946 153676 153732 154589 156366 158518 160148
57338A60148R20J064J990K638K551K391K705L161L332L300L160K640J747J111
$$ 160148 161068 162132 164122 166760 169311 171702 174407 177568 180900 184200 187360 190000 191747 192858
57324A92858J219J826K370K601K489K043J490J252J554K374L710N428O788O922
$$ 192858 194077 195903 198273 200874 203363 205406 206896 208148 209702 212076 215786 221214 228002 234924
57310B34924N981N199N508O632P779Q634R246R521R406R271R631J0524J1504J2208
$$ 234924 240905 246104 251612 258244 266023 274657 283903 293424 302830 312101 321732 332256 343760 355968
57296C55968J2716J3404J4547J6002J7327J8273J9072K0072K1356K2908K4909
$$ 355968 368684 382088 396635 412637 429964 448237 467309 487381 508737 531645 556554
57285E56554K7309K9431L0534L0735L0780L0968L0921L0396K9532K8070K5113
$$ 556554 583863 613294 643828 674563 705343 736311 767232 797628 827160 855230 880343
57274H80343K0130J3719O975L82o219j2841j8958k4009k7992l1408l4531l6903
$$ 880343 900473 914192 921167 921549 915330 902489 883531 859522 831530 800122 765591 728688
57262G28688l7783l7054l5351l3159l0380k7075k3949k1496j9126j6073j2714
$$ 728688 690905 653851 618500 585341 554961 527886 503937 482441 463315 447242 434528
57251D34528j0114q500p105n500m012k869j869j049p21o28k5J166K205K779L406
$$ 434528 424414 415914 408809 403309 399297 396428 394559 393510 392789 392161 392136 393302 395507 398286 401692
57236D01692M282M849M987N543O852P831P436O284N758O143O651O861P000P091
$$ 401692 405974 410823 415810 421353 428205 436036 443472 449756 455514 461657 468308 475169 482169 489260
57222D89260O838O344O102O296O729P364Q245R072R554J0048J1093J2433J3276
$$ 489260 496098 502442 508544 514840 521569 528933 537178 546250 555804 565852 576945 589378 602654
57209F02654J3498J3827J4647J5471J5774J5747J5860J6252J6846J7626J8405
$$ 602654 616152 629979 644626 660097 675871 691618 707478 723730 740576 758202 776607
57198G76607J8721J8363J7737J7405J7460J7619J7792J8203J8998J9878K0220
$$ 776607 795328 813691 831428 848833 866293 883912 901704 919907 938905 958783 979003
57187I79003J9648J8551J7901J8360J9590K0690K1270K1686K2326K3036K3558
$$ 979003 998651 1017202 1035103 1053463 1073053 1093743 1115013 1136699 1159025 1182061 1205619
57176A205619K4088K5060K6479K7859K8879K9804L1094L2718L4032L4465L4162
$$ 1205619 1229707 1254767 1281246 1309105 1337984 1367788 1398882 1431600 1465632 1500097 1534259
57165A534259L3799L3819L4115L4507L5192L6346L7552L8022L7449L6336L5392
$$ 1534259 1568058 1601877 1635992 1670499 1705691 1742037 1779589 1817611 1855060 1891396 1926788
57154A926788L4873L4639L4461L4083L3179L1655K9941K8707K8086K7442K6056
$$ 1926788 1961661 1996300 2030761 2064844 2098023 2129678 2159619 2188326 2216412 2243854 2269910
57143B269910K3961K1771J9771J7572J4925J2413J0872J0266R738Q790P776P124
$$ 2269910 2293871 2315642 2335413 2352985 2367910 2380323 2391195 2401461 2411199 2419989 2427765 2434889
57131B434889O788O865Q052J0862J4770J8863K2921K7118L0876L3056L3338L2522
$$ 2434889 2441677 2448542 2456594 2467456 2482226 2501089 2524010 2551128 2582004 2615060 2648398 2680920
57119B680920L1342K9798K8006K6801K6989K8610L1498L5912M1967M8953N5958
$$ 2680920 2712262 2742060 2770066 2796867 2823856 2852466 2883964 2919876 2961843 3010796 3066754
57108C066754O2884P0288P8693Q8799J02224J21335J48490J85757K35011K97824
$$ 3066754 3129638 3199926 3278619 3367418 3469642 3590977 3739467 3925224 4160235 4458059
57098D458059L75811M71723N89573P32795R02699J099226J321414J564932J819747
$$ 4458059 4833870 5305593 5895166 6627961 7530660 8629886 9951300 11516232 13335979
57089A3335979K072501K310436K520073K683149K780446K804209K764089K675607
$$ 13335979 15408480 17718916 20238989 22922138 25702584 28506793 31270882 33946489
57081C3946489K542217K351206K087187J747491J345559R03090M39416l5202n18091
$$ 33946489 36488706 38839912 40927099 42674590 44020149 44923239 45362655 45327453 44809362
57072D4809362j004147j475504j902415k255913k519587k690504k773250k776118
$$ 44809362 43805215 42329711 40427296 38171383 35651796 32961292 30188042 27411924
57064B7411924k710539k589610k425746k230617k016556j795978j579221j373952
$$ 27411924 24701385 22111775 19686029 17455412 15438856 13642878 12063657 10689705
57056A0689705j185980j018945q73407p47862o40886n51370m77274m15867l65275
$$ 10689705 9503725 8484780 7611373 6863511 6222625 5671255 5193981 4778114 4412839
57047D412839l24390k91322k63495k39401k18881k01397j85531j70616j57267
$$ 4412839 4088449 3797127 3533632 3294231 3075350 2873953 2688422 2517806 2360539
57038B360539j45654j34556j23024j11848j02340r4446q7061p9641p2557o6161
$$ 2360539 2214885 2080329 1957305 1845457 1743117 1648671 1561610 1481969 1409412 1343251
57028A343251o0327n4809m9530m4588m0189l6437l3087k9827k6831k4550k2876
$$ 1343251 1282924 1228115 1178585 1133997 1093808 1057371 1024284 994457 967626 943076 920200
57017I20200k1044j8611j5965j3711j2006j0681r514q149o200l574k93L952R579
$$ 920200 899156 880545 864580 850869 838863 828182 818668 810519 804319 800745 800452 804404 813983
57004H13983J6501K4448L3865M5651O0093P7014R7154J22057J51508J80978K01393
$$ 813983 830484 854932 888797 934448 994541 1071555 1168709 1290766 1442274 1623252 1824645
56993A824645K01270J70983J08839K5294o0026j28106j69277j84241j79304j61992
$$ 1824645 2025915 2196898 2305737 2331031 2271005 2142899 1973622 1789381 1610077 1448085
56983A448085j39340j17067r8692q5485p7100p2098o8590o5319o2009n8424n3695
$$ 1448085 1308745 1191678 1092986 1007501 930401 858303 789713 724394 662385 603961 550266
56972E50266m7271l9840l2520k5603j8934j2903q092m200k41M264R036J3700J8074
$$ 550266 502995 463155 430635 405032 386098 373195 365103 360903 360662 364926 373962 387662 405736
56959D05736K2028K5641K9112L1895L2338K8957K1801J2141J453q583j6031j9971
$$ 405736 427764 453405 482517 514412 546750 575707 597508 609649 611102 602519 586488 566517
56947E66517k1412k1896k1585j9706j6416j2856r654o682l971j526J547O210J1771
$$ 566517 545105 523209 501624 481918 465502 452646 442992 436310 432339 430813 432360 438570 450341
56934D50341J6568K0430K4854L0299L4838L6046L2839K5021J2781k177j6377k6795
$$ 450341 466909 487339 512193 542492 577330 613376 646215 671236 684017 681840 665463 638668
56922F38668l2857l5515l5415l3049k9704k6759k4295k1474j8083j4821j2307
$$ 638668 605811 570296 534881 501832 472128 445369 421074 399600 381517 366696 354389
56911C54389j0634r724r334q915q085p108o377n779n075m523m322l905k619q33
$$ 354389 343755 334031 324697 315782 307697 300589 294212 288433 283358 278835 274513 270608 267989 267156
56897B67156N20J366K469M074N535O508P670R859J3216J7429K2145K6690K9850
$$ 267156 267676 269042 271511 275585 281120 287628 295298 305157 318373 335802 357947 384637 414487
56884D14487L0521K8382K3695J6843Q438l45q055j3608j6574j7032j5421j2374
$$ 414487 445008 473390 497085 513928 522366 522021 513966 500358 483784 466752 451331 438957
56872D38957q410l841Q80N087Q508J1844J6223K2040K8747L5833M3478N1903O0394
$$ 438957 430547 426706 427586 432673 441181 453025 469248 491288 520035 555868 599346 651249 711643
56859G11643O7311P0682O8337N8117L9302J4310j1652l3390m8139n5604n6670
$$ 711643 778954 849636 917973 976090 1015392 1029702 1018050 984660 936521 880917 824247
56848H24247n2800m5921l7722k8891j9608j0472k145N849J4949K5949L8292N1217
$$ 824247 771447 725526 687804 658913 639305 628833 626688 632537 647486 673435 711727 762944
56836G62944O4792P9235R3637J05808J12825J11263R7776P0852L2804j0180n0255
$$ 762944 827736 906971 1000608 1106416 1219241 1330504 1428280 1499132 1531936 1521756 1471501
56825A471501q0831r8575j03934j00159r1214p9970o7829n5520m3680l2588k1867
$$ 1471501 1390670 1292095 1188161 1088002 996788 916818 848989 793469 749789 717201 695334
56814F95334j0867O54J2408K4090L5814M7839N9878P0653P8015P9304P1909N4301
$$ 695334 684467 685121 697529 721619 757433 805272 865150 935803 1013818 1093122 1165031 1219332
56802A219332K7407m791l6350o1690p7626q4020q2985p7305o9063n9483m9656
$$ 1219332 1246739 1241948 1205598 1143908 1066282 982262 899277 821972 752909 693426 643770
56791F43770m0711l2929k5301j6801p875J42O987J3879K1702K9703L6401M0911
$$ 643770 603059 570130 544829 528028 520153 520295 527282 541161 562863 592566 628967 669878
56779F69878M2637M0255L2176J8246N23j7664l3150m3881m9341n0442m8668m4991
$$ 669878 712515 752770 784946 803192 803715 786051 752901 709020 659679 609237 560569 515578
56767E15578l9771l3598k7759k3462k0744j8537j5891j2941j0498q998q069p080
$$ 515578 475807 442209 414450 390988 370244 351707 335816 322875 312377 303379 295310 288230
56755B88230n790m397l245k604k471k450k100j495j128j069p33J24P35K04j189
$$ 288230 282440 278043 274798 272194 269723 267273 265173 263678 262550 261481 260748 260872 261607 261811 260622
56740B60622k323k620k376j918j272p44q71j619k238k265j991j791j648j588j861
$$ 260622 258299 255679 253303 251385 250113 249369 248498 246879 244641 242376 240385 238594 236946 235358 233497
56725B33497k296k274j707j387j811k383k382k064k026k080j658j030j076j923
$$ 233497 231201 228927 227220 225833 224022 221639 219257 217193 215167 213087 211429 210399 209323 207400
56711B07400k706k737k248j769j397q97j87N17Q13M03m62r44m02P84J600J652
$$ 207400 204694 201957 199709 197940 196543 195646 195459 195976 196789 197192 196730 195786 195384 196168 197768 199420
56695A99420J572K059K864L083K324J259R34J584K380K394J672J046J026J323
$$ 199420 200992 203051 205915 208998 211322 212581 213515 215099 217479 219873 221545 222591 223617 224940
56681B24940J476J439J309R93M86R8J0p1m15p16n58j70k03q40j531j663j166n02
$$ 224940 226416 227855 229164 230157 230643 230741 230751 230680 230265 229549 228991 228821 228618 227778 226247 224584 223418 222916
56663B22916k78p88j674k231k203k024k098k180j876j414j332j636j821j665j470
$$ 222916 222638 221850 220176 217945 215742 213718 211620 209440 207564 206150 204818 203182 201361 199696 198226
56648A98226j533j765j903j716j063j27N42N88L99O34J287J695J510J104R18Q76
$$ 198226 196693 194928 193025 191309 190246 190119 190661 191249 191648 192282 193569 195264 196774 197878 198796 199672
56632A99672O58K73k5j21j68l04m49l33J58P01P95M32J96M66P95N81Q4J60J010
$$ 199672 200330 200603 200578 200457 200289 199985 199536 199203 199361 200062 200857 201289 201485 201951 202746 203327 203411 203571 204581
56613B04581J749J511N29k16j39M44Q36P04K81jJ6J47J60k4l69q19j192j172n81
$$ 204581 206330 207841 208370 208154 208015 208459 209295 209999 210280 210279 210295 210442 210602 210578 210209 209390 208198 207026 206445
56594B06445L99J362J913J877J462J162J251J346R03J51o9M45Q37M20l32n29p4
$$ 206445 206844 208206 210119 211996 213458 214620 215871 217217 218120 218271 218202 218647 219484 219904 219572 219043 218969
56577B18969N65J320K353L274L433K981K776L164L681M053M677N740O651O880
$$ 218969 219534 220854 223207 226481 229914 232895 235671 238835 242516 246569 251246 256986 263637 270517
56563B70517O862P451Q802J0248J1191J1552J1493J1078J0391R688R201Q812Q141
$$ 270517 277379 284830 293632 303880 315071 326623 338116 349194 359585 369273 378474 387286 395427
56550C95427P032N813M904M246L339J897J67j439k808m062n333o690q032r016
$$ 395427 402459 408272 413176 417422 420761 422658 422825 421386 418578 414516 409183 402493 394461 385445
56536C85445r366r377r631j0126j0129r207p883o894o297n764n289n076n051n037
$$ 385445 376079 366702 357071 346945 336816 327609 319726 312832 306535 300771 295482 290406 285355 280318
56522B80318n134n323n120m153k919k323k523k873k816k420k032j896k017k117
$$ 280318 275184 269861 264741 260588 257669 255346 252823 249950 247134 244714 242682 240786 238769 236652
56508B36652j877j426j283j521j571j178r40j254j464q21L31J172J651K100K152
$$ 236652 234775 233349 232066 230545 228974 227796 226856 225602 224138 223317 223648 224820 226471 228571 230723
56493B30723J277N1l51J88P58R44J044R60K98l74J59J804L013K961K584K789L039
$$ 230723 232000 232051 231700 231888 232646 233590 234634 235594 235892 235518 235677 237481 240494 243455 246039 248828 251867
56476B51867K536J691J392J637J929K335L184M214M777M610L825K591J437J268
$$ 251867 254403 256094 257486 259123 261052 263387 266571 270785 275562 280172 283997 286588 288025 289293
56462B89293K397L931M747M712M358L867L108K290J793J550J214Q24O62N77J20
$$ 289293 291690 295621 300368 305080 309438 313305 316413 318703 320496 322046 323260 324084 324746 325323 325443
56447C25443o44j045o75J04P00R99J255J428J067L2r40q79P4N75l17j920k843
$$ 325443 324799 323754 323079 323183 323883 324882 326137 327565 328632 328664 327724 326845 326919 327494 327177 325257 322414
56430C22414k731k366k341k477k539k640k847l085l465m071m448m049l218k848
$$ 322414 319683 317317 314976 312499 309960 307320 304473 301388 297923 293852 289404 285355 282137 279289
56416B79289l065l170k902k728k684k161j169o23q66r71k34O25N99j46p64r75
$$ 279289 276224 273054 270152 267424 264740 262579 261410 260787 259921 258950 258716 259341 259940 259794 259030 258055
56400B58055r40o00N3M95K85k39n12n42n72m47k8K98K51L37J197K592L661L911
$$ 258055 257115 256515 256568 257063 257348 257109 256597 256055 255483 255036 255008 255306 255557 255894 257091 259683 263344 267255
56382B67255L450K625J978K090K819L186K635J897J966K622K852K379J857J752
$$ 267255 270705 273330 275308 277398 280217 283403 286038 287935 289901 292523 295375 297754 299611 301363
56368C01363J874K015K306K778L175L312L263L065K562J722Q69M88P11J088J049
$$ 301363 303237 305252 307558 310336 313511 316823 320086 323151 325713 327435 328304 328792 329503 330591 331640
56353C31640P55J045K188L088K462N37j224j864j464k51J551K979K907J672Q92
$$ 331640 332395 333440 335628 338716 341178 341715 340491 338627 337163 336912 338463 341442 344349 346021 346913
56338C46913J196J478R28L48O71J566K422L543N218O745P479P923Q669R245R157
$$ 346913 348109 349587 350515 350863 351534 353100 355522 359065 364283 371028 378507 386430 395099 404344 413501
56323D13501R062R684J0400J0256R631R498R790R823R756J0088J0257R238P192
$$ 413501 422563 432247 442647 452903 462534 472032 481822 491645 501401 511489 521746 530984 538176
56310E38176N200L621J994K70j169k393l652m440m102l061k257j665o68M95J039
$$ 538176 543376 546997 548991 549261 548092 545699 542047 537607 533505 530444 528187 526522 525854 526349 527388
56295E27388J195J992L475M570M851N081N908P145Q498R901J0981J1273J1213
$$ 527388 528583 530575 534050 538620 543471 548552 554460 561605 570103 580004 590985 602258 613471
56282F13471J1901J3708J5999J8245K0513K2837K5047K7301K9938L2807L5540
$$ 613471 625372 639080 655079 673324 693837 716674 741721 769022 798960 831767 867307
56271H67307L8405M2033M6433N1081N5954O1610O8480P6792Q6836R8352J10161
$$ 867307 905712 947745 994178 1045259 1101213 1162823 1231303 1308095 1394931 1493283 1603444
56260A603444J21470J33153J46505J61142J75489J88904K01757K13568K22697
$$ 1603444 1724914 1858067 2004572 2165714 2341203 2530107 2731864 2945432 3168129
56251C168129K27998K29317K26214K17682K03388J83900J59503J30209R7177O2809
$$ 3168129 3396127 3625444 3851658 4069340 4272728 4456628 4616131 4746340 4843517 4906326
56241D906326K8981l629l4270o1493q4245j02451j16130j25117j30001j32231
$$ 4906326 4935307 4931678 4897408 4835915 4751670 4649219 4533089 4407972 4277971 4145740
56231D145740j32799j31767j29388j26606j24158j22193j21038j21204j22347
$$ 4145740 4012941 3881174 3751786 3625180 3501022 3378829 3257791 3136587 3014240
56222C014240j23361j23849j24355j24812j24042j21402j17843j14582j11579
$$ 3014240 2890879 2767030 2642675 2517863 2393821 2272419 2154576 2039994 1928415
56213A928415j07963j03199r7334r0731q4035p7866p2168o6350o0186n4043m8288
$$ 1928415 1820452 1717253 1619919 1529188 1445153 1367287 1295119 1228769 1168583 1114540 1066252
56202A066252m3094l8766l5420l2477k9288k6143k3750k1956j9906j7323j4634
$$ 1066252 1023158 984392 948972 916495 887207 861064 837314 815358 795452 778129 763495
56191G63495j2122r990q897r121r534q708o775m850l070q98J062J593J128J502
$$ 763495 751373 741383 732486 723365 713831 705123 698348 693498 690428 689530 690592 692185 693313 694815
56177F94815L278N217O595P983R437J0072R955J0395J1639J2234J1480J0551J0292
$$ 694815 698093 703310 709905 717888 727325 737397 747352 757747 769386 781620 793100 803651 813943
56164H13943R784Q147O127M585L056R33j197k489k961k813j886n25L39Q12K317
$$ 813943 823727 831874 838001 842586 845642 846575 845378 842889 839928 837115 835229 834704 835043 835855 838172
56149H38172N410Q711J0909J2472J4439J7006K0265K4902L1166L8352M6279N5950
$$ 838172 843582 852293 863202 875674 890113 907119 927384 952286 983452 1021804 1068083 1124033
56137A124033O7786Q0570R3095J05327J16857J25668J29756J28840J23396J13497
$$ 1124033 1191819 1272389 1365484 1470811 1587668 1713336 1843092 1971932 2095328 2208825
56127B208825R9976Q5605P3470O4756N8829N4382M9509M1983L0895J7505L700
$$ 2208825 2308801 2394406 2467876 2532632 2591461 2645843 2695352 2737335 2768230 2785735 2789435
56116B789435r412k0852k9284l4615l9150m5854n6005o9007q3396r7104j07764
$$ 2789435 2780023 2759171 2729887 2695272 2656122 2610268 2554263 2485256 2401860 2304756 2196992
56105B196992j13892j15335j12301j04933r4176q1876o9505n7851m7949m0721
$$ 2196992 2083100 1967765 1855464 1750531 1656355 1574479 1504974 1447123 1399174 1358453
56095A358453l5469l0536k5798k2680k1315j9957j7725j5750j4737j3648j1799
$$ 1358453 1322984 1292448 1266650 1243970 1222655 1202698 1184973 1169223 1154486 1140838 1129039
56084A129039j0023q688o807m263k604k330j728J80J946K491L086M795O292O324
$$ 1129039 1119016 1110328 1103521 1099258 1096654 1094324 1092596 1092776 1094722 1097213 1100299 1105094 1111386 1117710
56070A117710O141P306R016R795J0150J1251J2595J3098J3118J3456J3708J3414
$$ 1117710 1123851 1131157 1140173 1149968 1160118 1171369 1183964 1197062 1210180 1223636 1237344 1250758
56058A250758J3463J4560J5705J5780J5266J4984J4766J4625J5482J7331J8664
$$ 1250758 1264221 1278781 1294486 1310266 1325532 1340516 1355282 1369907 1385389 1402720 1421384
56047A421384J8964J9623K1121K1812K1056K0870K2600K4623K5298K5641K6961
$$ 1421384 1440348 1459971 1481092 1502904 1523960 1544830 1567430 1592053 1617351 1642992 1669953
56036A669953K8468K9416L0950L3684L5950L6710L7518L9573M1559M2570M3972
$$ 1669953 1698421 1727837 1758787 1792471 1828421 1865131 1902649 1942222 1983781 2026351 2070323
56025B070323M6274M7590M7548M8931N2656N5226N4402N3354N5415N8666N9866
$$ 2070323 2116597 2164187 2211735 2260666 2313322 2368548 2422950 2476304 2531719 2590385 2650251
56014B650251O0080O1899O4486O5988O7798P1789P6325P9376Q2594Q7877R3156
$$ 2650251 2710331 2772230 2836716 2902704 2970502 3042291 3118616 3197992 3280586 3368463 3461619
56003C461619R6135R8971J04524J11317J16914J22829J31128J39894J47113J55241
$$ 3461619 3557754 3656725 3761249 3872566 3989480 4112309 4243437 4383331 4530444 4685685
55993D685685J66585J78276J87395J96818K10000K24452K36800K49601K66335
$$ 4685685 4852270 5030546 5217941 5414759 5624759 5849211 6086011 6335612 6601947
55984F601947K84404L00492L18000L41374L68015L93978M22581M58661M99626
$$ 6601947 6886351 7186843 7504843 7846217 8214232 8608210 9030791 9489452 9989078
55975I989078N41643N89183O48452P16915P90134Q73258R74328J092281J223939
$$ 9989078 10530721 11119904 11768356 12485271 13275405 14148663 15122991 16215272 17439211
55966A7439211J376881J562536J783347K041105K351345K735039L204905L777254
$$ 17439211 18816092 20378628 22161975 24203080 26554425 29289464 32494369 36271623
55958C6271623M489354N388714O517816P930284R707339J1933096J4668774J7970930
$$ 36271623 40760977 46149691 52667507 60597791 70305130 82238226 96907000 114877930
55950A14877930K1887903K6364213L1144166L5786434L9664625M1774425M0587263
$$ 114877930 136765833 163130046 194274212 230060646 269725271 311499696 352086959
55943C52086959L4508213K2988836P424820r132743k3379812l3185579l8091489
$$ 352086959 386595172 409584008 417008828 407876085 384496273 351310694 313219205
55936C13219205l8887551l6886434l3371114k9311563k5294631k1602736j8341518
$$ 313219205 274331654 237445220 204074106 174762543 149467912 127865176 109523658
55929A09523658j5523094j3104673j1028900r258541p770718o531829n499724
$$ 109523658 94000564 80895891 69866991 60608450 52837732 46305903 40806179
55922D0806179m643865l943537l370935k894396k495482k166932j896422j666820
$$ 40806179 36162314 32218777 28847842 25953446 23457964 21291032 19394610 17727790
55914A7727790j469780j304874j166699j045096r36569q43764p64739o93061o27295
$$ 17727790 16258010 14953136 13786437 12741341 11804772 10961008 10196269 9503208 8875913
55905H875913n70515n21548m75713m32920l96466l65134l34637l05548k81788
$$ 8875913 8305398 7783850 7308137 6875217 6478751 6113617 5778980 5473432 5191644
55896E191644k62593k43609k24732k09434j97410j84991j71878j60769j51310
$$ 5191644 4929051 4685442 4460710 4251276 4053866 3868875 3696997 3536228 3384918
55887C384918j40909j30450j22938j17491j10746j03080r7415r3121q7164q0208
$$ 3384918 3244009 3113559 2990621 2873130 2762384 2659304 2561889 2468768 2381604 2301396
55877B301396p5552p2893o9022o3922o0385n8331n5149n1025m8441m6912m3715
$$ 2301396 2225844 2152951 2083929 2020007 1959622 1901291 1846142 1795117 1746676 1699764 1656049
55866A656049l9385l7087l6910l5975l3920l3047l3235l1738k8055k4231k0444
$$ 1656049 1616664 1579577 1542667 1506692 1472772 1439725 1406490 1374752 1346697 1322466 1302022
55855A302022j4994q542l680m53L047N758M191k006r488j6322k3050k8656l0351
$$ 1302022 1287028 1278486 1274806 1274353 1277400 1283158 1287349 1285343 1275855 1259533 1236483 1207827 1177476
55842A177476k8061k4737k1615j7348j2341r525r948j1491j2846j4977j7942k0087
$$ 1177476 1149415 1124678 1103063 1085715 1073374 1063849 1053901 1042410 1029564 1014587 996645 976558
55830I76558k1210k2904k5028k5449k4034k3256k3901k3758k1664j9456j8755
$$ 976558 955348 932444 907416 881967 857933 834677 810776 787018 765354 745898 727143
55819G27143j8871j8960j9295j9427j7975j5212j3182j2441j1331r068o807n025
$$ 727143 708272 689312 670017 650590 632615 617403 604221 591780 580449 571381 564574 559549
55807E59549k761j43J202J050J180K332L199L133L120L363K608O14j298k858n348
$$ 559549 556788 556645 557847 558897 560077 562409 565608 568741 571861 575224 577832 578446 577148 574290 568942
55792E68942q826j1519j2657j3292j3711j2929j1377j1091j2216j2319j0284q037
$$ 568942 560116 548597 535940 522648 508937 496008 484631 473540 461324 449005 438721 430684
55780D30684p097o240m121j679k38M56P44l06l176o528r025j0800j2072j2095
$$ 430684 423587 417347 413226 411547 411309 411765 412509 412203 409027 402499 393474 382674 370602 358507
55766C58507j0607q710p214n647l689j939o48N53J116j42k612l981l491k898l395
$$ 358507 347900 339190 331976 326329 322640 320701 320053 320606 321722 321580 318968 314987 311496 308598 305203
55751C05203l899l468l085l758m884n837p173q979r943r386q493q245p870o558
$$ 305203 301304 297836 294751 290993 286109 280272 273099 264120 254177 244791 236298 228053 220183 213625
55737B13625m983l918k916j564m58J00Q41J997K601K180J397L88j608m188n552
$$ 213625 208642 204724 201808 200244 199786 199886 200727 202724 205325 207505 208902 209290 207682 203494 197942
55722A97942n309n264o273o714n452l859l209k472o29R39O85l17j01J215K296
$$ 197942 192633 187369 181096 174382 168930 165071 161862 159390 158761 159700 160385 160068 159967 161182 163478
55707A63478L037M004M732M729N052O765Q795R251P969O030L809J460J99J017
$$ 163478 166515 170519 175251 179980 185032 191797 200592 209843 217812 223842 227651 229111 229310 230327
55693B30327K877M018M356M789N071M346L010J999R44r62k818l002j913j523k348
$$ 230327 233204 237222 241578 246367 251438 255784 258794 260793 261737 260775 257957 254955 253042 251519 249171
55678B49171k936k452j741j506j312r22j041k002k929k885k073j368j293j706
$$ 249171 246235 243783 242042 240536 239224 238302 237261 235259 232330 229445 227372 226004 224711 223005
55664B23005j980j493l89L20j8p11o09L35J277J868K460L084L165K410J261L27
$$ 223005 221025 219532 219143 219463 219445 218734 218125 218460 219737 221605 224065 227149 230314 232724 233985 234312
55648B34312k27p04j607l150m813n770n961o214o993p729p813p548p465p430p108
$$ 234312 234085 233381 231774 228624 223811 218041 212080 205866 198873 191144 183331 175783 168318 160888 153780
55633A53780o642o210n527m521l883m141m721m729m147l504k917k239j746j762
$$ 153780 147138 140928 135401 130880 126997 122856 118135 113406 109259 105755 102838 100599 98853 97091
55619I7091j944j741j257j011j073j072q35n22l66n41j024j371j145o77p25j218
$$ 97091 95147 93406 92149 91138 90065 88993 88158 87636 87270 86729 85705 84334 83189 82512 81787 80569
55603H0569j251n69j1j14l34k14k14p05j144j001n38k3P30J405J013m48j389p73
$$ 80569 79318 78749 78738 78624 78290 78076 77862 77157 76013 75012 74474 74451 75181 76586 77599 77151 75762 74989
55585G4989L34M55k01o00o75q80r17l85R9j15l64J83Q34M18o52r46k08O61J359
$$ 74989 75323 75778 75577 74977 74302 73422 72505 72120 72219 72104 71740 71923 72757 73175 72523 71577 71369 72030 73389
55566G3389K306L226L341K870K879L565M023L794L323K836J956O08q03k159l577
$$ 73389 75695 78921 82262 85132 88011 91576 95599 99393 102716 105552 107508 108116 107313 105154 101577
55551A01577m667m794m152l568l277k822k058j309o09K31R14R23N12M62R04J229
$$ 101577 96910 92116 87964 84396 81119 78297 76239 74930 74321 74552 75466 76389 76901 77363 78267 79496
55535G9496J118Q62P42P85J050J463J640J509J680K446L016K597J648J032N75
$$ 79496 80614 81476 82218 83003 84053 85516 87156 88665 90345 92791 95807 98404 100052 101084 101659
55520A01659l51j397j810j926k631l611l715k894k279k334k457k369k481k764
$$ 101659 101308 99911 98101 96175 93544 89933 86218 83324 81045 78711 76254 73885 71404 68640
55506F8640k695k470k846l609l612k637j768j627j622j313j138j268j098m89k76
$$ 68640 65945 63475 60629 57020 53408 50771 49003 47376 45754 44441 43303 42035 40937 40448 40172
55491D0172q72j454j242n72r6J25J32l99j412k051j683p25P9N06N89K81j39q2
$$ 40172 39300 37846 36604 36032 35936 36061 36193 35794 34382 32331 30648 29923 30002 30508 31097 31378 31239 31157
55473C1157M72P97N15J18o5m59j311j955j712r09l17j13mR5P5k6j62m04o36n24
$$ 31157 31629 32426 32941 33059 32994 32535 31224 29269 27557 26648 26331 26218 26214 26309 26384 26358 26196 25792 25156 24632
55453B4632k4N02Q29R89P47k03j331j480l58R29J356J174J079J034O40M2l42n38
$$ 24632 24608 25110 25939 26928 27675 27472 26141 24661 24303 25232 26588 27762 28841 29875 30515 30557 30215 29677
55435B9677p50p66l60P7L7k08O3Q89J450J054q1j102j271n46M01Q15N81K25J27
$$ 29677 28927 28161 27801 27878 27915 27707 27770 28659 30109 31163 31082 29980 28709 28163 28564 29379 29960 30185 30312
55416C0312J47J13K18O16R72P71m2r90j450j086r4Q82J359J527J785J916J229
$$ 30312 30459 30572 30790 31406 32378 33149 33107 32117 30667 29581 29487 30369 31728 33255 35040 36956 38185
55399C8185k99j683j989j295l03N02R89J120R79Q30P95P10M96L96N42O11K00o07
$$ 38185 37886 36203 34214 32919 32616 33118 34107 35227 36206 37036 37831 38541 39037 39433 39975 40586 40786 40179
55381D0179j296j489j303j191j449j824j729j055m62n55j013j089p28n09n38k53
$$ 40179 38883 37394 36091 34900 33451 31627 29898 28843 28381 27826 26813 25724 24996 24487 23949 23696
55365B3696N48J224J155N05j79n99o72l65M4Q3k50l88n4K40l0n73p13l35P3J54
$$ 23696 24244 25468 26623 27128 26949 26350 25678 25313 25357 25440 25190 24802 24748 24988 24958 24385 23672 23337 23410 23564
55345B3564L3j6J03L06N06P15R24R00L20o69j302j038k97J04Pj46k99p77j360
$$ 23564 23597 23581 23684 23990 24496 25211 26135 27035 27355 26686 25384 24346 24049 24153 24160 24014 23715 22938 21578
55326B1578j277m29K54J62j38J08O18O51K68K25P56J235J038K73m89q75r53j014
$$ 21578 20301 19872 20126 20288 20150 20258 20876 21527 21795 22020 22776 24011 25049 25322 24833 23958 23005 21991
55308B1991j175j188p58k6M61L96J10J68O71J124R80K40n09p02l95n5J63N14R79
$$ 21991 20816 19628 18870 18844 19305 19701 19811 19979 20650 21774 22754 22994 22485 21783 21388 21333 21496 22010 22989
55289B2989R98L42l14k66J97L09K8o6K04M85O31O93L69o02j577j645j067r23j176
$$ 22989 23987 24329 24015 23749 23946 24255 24283 24217 24421 24906 25537 26230 26599 25997 24420 22775 21708 20785 19609
55270A9609n24J355K781K287P34O4O60J185P37j10m87m27m74p29p07p1P98J087
$$ 19609 19085 20440 23221 25508 26242 26306 26966 28151 28888 28778 28291 27864 27390 26661 25954 25883 26681 27768
55252B7768M48m80p27j50M61M53L4k46l06m44p30q38m53L53J122J382J060M69
$$ 27768 28216 27736 27009 26859 27320 27773 27807 27561 27255 26811 26081 25243 24790 25143 26265 27647 28707 29176
55234B9176j41p29j115r67m69m17j068j492q50K01M30k5L4Q01J163O70L60J054
$$ 29176 29035 28306 27191 26224 25755 25338 24270 22778 21928 22129 22559 22534 22568 23369 24532 25202 25562 26616
55216B6616K050K255J663R66M95K53L40O39O75L46J88M60O02J45m77o45m28k06
$$ 26616 28666 30921 32584 33550 34045 34298 34638 35277 35952 36298 36486 36946 37548 37693 37216 36571 36143 35937
55198C5937L0L73N47L49L9j41l62o51o02j06K69J53jK37M97L05j04l60o15j011
$$ 35937 35967 36340 36887 37236 37275 37134 36772 36121 35519 35413 35682 35835 35834 36071 36568 36873 36769 36409 35794 34783
55178C4783j108o83l76p75j333j172l59L53O56O62L39j93k70M01R28M13n09m76
$$ 34783 33675 32992 32616 31841 30508 29336 28977 29330 29986 30648 30987 30794 30524 30925 31853 32266 31757 31281
55160C1281N42J190P12j87n60l17J04L03l0q98j637j506p11j68j99j82L04Q21
$$ 31281 31823 33013 33725 33538 32978 32661 32765 33068 33038 32140 30503 28997 28286 28118 27919 27737 28041 28862
55142B8862Q44N93N94Q01O35k07j281j802j436o39n1K98P94J342J309O04L4K25
$$ 28862 29706 30299 30893 31694 32329 32122 30841 29039 27603 26964 26913 27211 28005 29347 30656 31260 31294 31519
55124C1519P19Q36P52J020J482J552J257J172J456J699J587J089J74r89j781j727
$$ 31519 32238 33074 33826 34846 36328 37880 39137 40309 41765 43464 45051 46140 46314 45325 43544 41817
55108D1817j137n74PQ88J712J887J570J356J197O32j01k19K58M98L28N92J634
$$ 41817 40680 40106 40113 41001 42713 44600 46170 47526 48723 49355 49254 49035 49293 49791 50119 50711 52345
55091E2345K454K051Q40N6K01P17R17P05M51N10Q69J170J128Q73P06O42M43O0
$$ 52345 54799 56850 57690 57746 57947 58664 59581 60286 60737 61247 62116 63286 64414 65287 65993 66635 67078 67138
55073F7138l38o20o84l69K44N55J7j096j885j813j104k84K67L81J42j02q3Q9J75
$$ 67138 66800 66180 65496 65127 65371 65926 65943 64847 62962 61149 60045 59761 60028 60409 60551 60449 60366 60455 60630
55054F0630J41l9m97j061j140m99K42M33K65K01K1o85j542j752j240m97L46J314
$$ 60630 60771 60732 60235 59174 58034 57535 57777 58210 58475 58676 58697 58012 56470 54718 53478 52981 53327 54641
55036E4641J748R33n02j075m94L4k89q33q52n89m93l43Q1L09n3n57o15l71k39
$$ 54641 56389 57322 56820 55745 55251 55285 54996 54163 53311 52722 52229 51886 51967 52276 52223 51666 51051 50680 50441
55017E0441m3N62J279J504J271J163J433J707J549R71L48P3J62R6o49j796k254
$$ 50441 50398 50960 52239 53743 55014 56177 57610 59317 60866 61837 62185 62258 62420 62516 61867 60071 57817
55000E7817j264O74K214K423J467K41m95o50n50l10K46R32R74Pj126j240l22N38
$$ 57817 56553 57227 59441 61864 63331 63572 63077 62427 61877 61567 61813 62745 63719 63726 62600 61360 61038 61576
54982F1576N96P4n83j148j262n66N20R92O22L17P78J483J621J281J057J052R79
$$ 61576 62172 62246 61663 60515 59253 58687 59207 60199 60821 61138 61916 63399 65020 66301 67358 68410 69389
54965F9389R11J201J782K157K068J771J702K028K492K596K176J838K469M158O037
$$ 69389 70300 71501 73283 75440 77508 79279 80981 83009 85501 88097 90273 92111 94580 98738 104775
54950A04775P343Q215R171J0292J1276J1931J2096J1371R464O702L807J164j437
$$ 104775 112118 120333 129504 139796 151072 163003 175099 186470 195934 202636 206443 207607 206170
54937B06170m318p342r870j1245j1349j0718r988r363q725q069p515o997o298
$$ 206170 201852 194510 184640 173395 162046 151328 141340 131977 123252 115183 107668 100671 94373
54924I4373n285l851j933N8J098N40q65j625j123QR88J575J724J490J459K423
$$ 94373 89088 85237 83304 83362 84460 85000 84135 82510 81387 81395 82383 83958 85682 87172 88631 91054
54908I1054M305O122P283Q174R225J0188J0722J0929J0781R759P566M697J788
$$ 91054 95359 101481 108764 116938 126163 136351 147073 158002 168783 178542 186108 190805 192593
54895A92593j004l614n679p066q218r371r980r489q280p278o939p052p152o762
$$ 192593 191589 187975 182296 175230 167012 157641 147661 138172 129892 122614 115675 108623 101471 94709
54881I4709n648m239l388l344l387k832j809p71P7M52q9j283j937j339k70J93
$$ 94709 89061 84822 81434 78090 74703 71871 70062 69291 69368 69820 69731 68448 66511 65172 64902 65095
54865F5095J69M05P97O03j83p85q31o99p28q96j229j738k053j812j287r38n60
$$ 65095 65264 65669 66466 67069 66886 66101 65270 64571 63843 62947 61718 59980 57927 56115 54828 53890 53330
54848E3330K72J124J065J00p91j106j322j671j490l69Q97J211N44j96m04k36r0
$$ 53330 53602 54726 55791 55891 55100 53994 52672 51001 49511 49142 50039 51250 51794 51598 51194 50958 50868
54831E0868q1k8L07R90J770K210K086J566J022P60R02J290J548J407R81N91M13
$$ 50868 50787 50759 51066 52056 53826 56036 58122 59688 60710 61470 62372 63662 65210 66617 67598 68189 68602
54814F8602N02R09J475J654J077K62J90J153K427L198L374L274L019K650K524
$$ 68602 69104 70013 71488 73142 74219 74481 74671 75824 78251 81449 84823 88097 91116 93766 96290
54799I6290L081M336N876P304Q458R267R772J0241J0987J1858J2199J1493R903
$$ 96290 99371 103707 109583 116887 125345 134612 144384 154625 165612 177470 189669 201162 211065
54786B11065P934N700K913m31l753o442q306r332r423q748p976p614p393o754
$$ 211065 218999 224699 227612 227181 223428 216986 208680 199348 189925 181177 173201 165587 158194 151440
54772A51440n727m746l807k653j579j203j329j033p8O93P92R24J812K999L707
$$ 151440 145713 140967 137160 134507 132928 131725 130396 129363 129285 129978 130770 131694 133506 136505 140212
54757A40212M170N165O739Q335R843J1552J3226J4306J4957J6030J7658J8738
$$ 140212 144382 149547 156286 164621 174464 186016 199242 213548 228505 244535 262193 280931
54745B80931J8139J5838J2501Q492L781j435o531j0885j4276j6721j8108j8230
$$ 280931 299070 314908 327409 335901 339682 338247 331716 320831 306555 289834 271726 253496
54733B53496j7229j5800j4636j3730j2556j0917r172p648o294n107m303l843l313
$$ 253496 236267 220467 205831 192101 179545 168628 159456 151808 145514 140407 136104 132261 128948
54720A28948k577k012j784j500r91p83j221j745j758j596j834k088j549l48N22
$$ 128948 126371 124359 122575 121075 120084 119301 118080 116335 114577 112981 111147 109059 107510 107162 107684
54705A07684O13L44N2l51p09n40J49P00P45O60Q35J107J145R50P18N57N66P98
$$ 107684 108297 108641 108693 108342 107633 107093 107242 107942 108687 109347 110182 111289 112434 113384 114102 114659 115225 116023
54687A16023J100J231J167R43M12m62j219j375j150j056r41j93J086J961J953
$$ 116023 117123 118354 119521 120464 120876 120414 119195 117820 116670 115614 114673 114480 115566 117527 119480
54672A19480J638J764K402L266M187M840M717L843L088L263M148M862M863M247
$$ 119480 121118 122882 125284 128550 132737 137577 142294 146137 149225 152488 156636 161498 166361 170608
54658A70608L336K405J709J417J520J880K238K285J957J669J901K590L314M046
$$ 170608 173944 176349 178058 179475 180995 182875 185113 187398 189355 191024 192925 195515 198829 202875
54644B02875N178O777Q364R604J0690J1823J2869J3776J4716J5428J4991J2736
$$ 202875 208053 214830 223194 232798 243488 255311 268180 281956 296672 312100 327091 339827
54632C39827R000M575j74n135r785j3361j5549j6616j6899j6623j6034j5286j4214
$$ 339827 348827 353402 353228 348093 338308 324947 309398 292782 275883 259260 243226 227940 213726
54619B13726j2542j0345q059o088m633l745l294k916k299j464o11J84Q58J135
$$ 213726 201184 190839 182780 176692 172059 168314 165020 162104 159805 158341 157730 157914 158772 159907
54605A59907P89J44j10K49O16K44q35j824k098j938k155l065m022m142l398k733
$$ 159907 160696 160840 160730 160979 161595 161839 161004 159180 157082 155144 152989 149924 145902 141760 138362 135629
54589A35629k979l878m374l839k791k278k696l428l699l523l502l802l796k957
$$ 135629 132650 128772 124398 120559 117768 115490 112794 109366 105667 102144 98642 94840 91044 88087
54575H8087j673q16o15n06o8L30R3p04j285j034j48O35Q53P33P10P93O26J11m00
$$ 88087 86414 85598 84983 84477 84409 84739 84832 84128 82843 81809 81661 82296 83149 83882 84592 85385 86011 86122 85722
54556H5722n99n58m40k20J14L72M78O66J100J548J707J565J165M16m25n01P83
$$ 85722 85123 84565 84125 83905 84019 84391 84869 85535 86635 88183 89890 91455 92620 93036 92611 92110 92893
54539I2893K765M068M056L321K825L020L803M772N454N711N923O488P192P432
$$ 92893 95658 99726 103782 107103 109928 112948 116751 121523 126977 132688 138611 145099 152291 159723
54525A59723O920N729L860J412r62k463l163l939n230o450o811o295n574n352
$$ 159723 166643 172372 176232 177644 176682 174219 171056 167117 161887 155437 148626 142331 136757 131405
54511A31405n863o685o880n812l976k584k211k272j968j308r21j173j789k166
$$ 131405 125542 118857 111977 106165 102189 99605 97394 95122 93154 91846 90925 89752 87963 85797
54497H5797j908j182n23k42j41l5k10q91j582j530p11K13Q86J495K102K471K567
$$ 85797 83889 82707 82184 81942 81801 81766 81556 80665 79083 77553 76842 77055 77941 79436 81538 84009 86576
54480H6576K590K507K130J674J503J415R63N01Q95K026K626J979P80p5o02j084
$$ 86576 89166 91673 93803 95477 96980 98395 99358 99859 100754 102780 105406 107385 108165 108090 107488 106404
54464A06404j298j052p40o39l61K98O55R4q49j218j000r06j285j898k424k435
$$ 106404 105106 104054 103314 102675 102314 102612 103267 103361 102512 101294 100294 99388 98103 96205 93781 91346
54448I1346j408M36J712J230m16j546j491j041r56j005p58m11l64n59o07l86j73
$$ 91346 89938 90374 92086 93316 92900 91354 89863 88822 87866 86861 86103 85692 85328 84769 84162 83776 83603
54431H3603l54r92j600j448l55R91J709J623J256J075J121J162R88O08L70O47
$$ 83603 83249 82257 80657 79209 78854 79845 81554 83177 84433 85508 86629 87791 88779 89387 89757 90404
54415I0404J241J453R83L60J88M63R50J698K640L202K945K282J906J917K089K592
$$ 90404 91645 93098 94081 94441 94629 95092 96042 97740 100380 103582 106527 108809 110715 112632 114721 117313
54399A17313L582M443M399L650L051K818K464J964J890K297K491K177J868J797
$$ 117313 120895 125338 129737 133387 136438 139256 141720 143684 145574 147871 150362 152539 154407 156204
54385A56204J343R1j338k160k460k763l023k855k437k388k814l118k849k318k228
$$ 156204 157547 157638 156300 154140 151680 148917 145894 143039 140602 138214 135400 132282 129433 127115 124887
54370A24887k888l846m223l486k012p94l87l71j22J59l50j745k835k328m28J324
$$ 124887 121999 118153 113930 110444 108432 107638 107251 106880 106758 106917 106567 104822 101987 99659 99231 100555
54354A00555J838J621J819K530K754J930P84L97R19J709K300K708L041L314L633
$$ 100555 102393 104014 105833 108363 111117 113047 113831 114228 115147 116856 119156 121864 124905 128219 131852
54339A31852M142M725N016M736L848K487R93j55p46j085j547k093k435k573k694
$$ 131852 135994 140719 145735 150471 154319 156806 157799 157644 156898 155813 154266 152173 149738 147165 144471
54324A44471k760k613k441k638l218l857m441n085n522n140l917k765k507k892
$$ 144471 141711 139098 136657 134019 130801 126944 122503 117418 111896 106756 102839 100074 97567 94675
54310I4675l076k825k599k569k202j142J8L47k09p92q46p54j077j611j755j440
$$ 94675 91599 88774 86175 83606 81404 80262 80280 80627 80418 79626 78780 78026 76949 75338 73583 72143
54294G2143j115r62q12p26r26j105o34L23P52K49l14r2M46L86j18j29N56J098
$$ 72143 71028 70066 69254 68528 67602 66497 65863 66186 66938 67187 66873 66781 67227 67613 67495 67366 67922 69020
54276F9020Q06n5p45p83j83O41J191J384J543J706J416O38K01O61J179N60q75
$$ 69020 69826 69771 69026 68243 68060 68701 69892 71276 72819 74525 75941 76579 76780 77441 78620 79180 78305
54259G8305j532n65J223K559K788J789j59k053k636j695l20L89L18j57q21j364
$$ 78305 76773 76208 77431 79990 82778 84567 84408 82355 79719 78024 77704 78093 78411 78254 77433 76069
54243G6069j238l25P16J165Q95Q8j032j799j273N38K193K345J358O06N29L39m12
$$ 76069 74831 74506 75222 76387 77282 77370 76338 74539 73266 73804 75997 78342 79700 80306 80835 81174 80762
54226H0762r94o09L74Q40K77p54j373j216n28K44P20O80J82l82o03m77l17k20
$$ 80762 79768 79159 79533 80373 80650 79896 78523 77307 76779 77023 77743 78423 78605 78223 77620 77143 76826 76606
54208G6606Q9P19J264J270Q13K71j62m40l81L2L41Q7n12q68q47q02q40o68j38
$$ 76606 76695 77414 78678 79948 80761 81032 80870 80430 80049 80081 80422 80509 79997 79129 78282 77480 76640 75972 75834
54189G5834N15R62R04P1j310k274k067j160o21n78l03L38O03K69P2L26K82n02
$$ 75834 76349 77311 78215 78286 76976 74702 72635 71475 70854 70276 69973 70311 70914 71183 71255 71581 71863 71361
54171G1361j142p14K89P49N43L56L79K24j29k74j47m5N9M31Q80R02N45M00O56
$$ 71361 70219 69505 69794 70543 71086 71442 71821 72045 71916 71642 71495 71450 71509 71940 72820 73722 74267 74667 75323
54152G5323Q42O38K98M2l28q96j188p15K98J105J273J006P23N37L15O7Q8N36J056
$$ 75323 76165 76803 77101 77143 76815 75919 74731 74016 74314 75419 76692 77698 78421 78958 79273 79340 79428 79964 81020
54133H1020J073M30n08j397k203k841k959k354j362n35j31j17l93p43q34o15m96
$$ 81020 82093 82523 82015 80618 78415 75574 72615 70261 68899 68364 68233 68116 67723 66980 66146 65531 65035
54116F5035q17j262j212n40K42O18N53L93M65P96J077J000O63M91O47Q06O34K54
$$ 65035 64218 62956 61744 61204 61446 62064 62617 63010 63475 64271 65348 66348 67011 67502 68149 68955 69589 69843
54098F9843k2j20q7J29N03P64P40O53P28P33K79n33j224j554j664j655j363o48
$$ 69843 69821 69701 69614 69743 70246 71010 71750 72403 73131 73864 74143 73610 72386 70832 69168 67513 66150 65502
54080F5502L14J124J417J122N24nl91p55r89q19m19l79q29j039l41R04J740J654
$$ 65502 65816 66940 68357 69479 70003 69998 69607 68852 67863 67044 66625 66246 65417 64378 64037 64941 66681 68335
54062F8335Q22l68j413j683q92M51J603K355K864L029K639J953J464J201Q99O92
$$ 68335 69157 68789 67376 65693 64801 65252 66855 69210 72074 75103 77742 79695 81159 82360 83259 83951
54046H3951R11J263J067L65J5M55J148J507J651J892K095K100K200K682L280L648
$$ 83951 84862 86125 87192 87557 87572 88027 89175 90682 92333 94225 96320 98420 100620 103302 106582 110230
54030A10230M013M800N784O232N860N200M868M913N014N020N039N092M990M593
$$ 110230 114243 119043 124827 131059 136919 142119 146987 151900 156914 161934 166973 172065 177055 181648
54016A81648M080L710L436K983K358J957K030K299K347K076J506M49j085k451
$$ 181648 185728 189438 192874 195857 198215 200172 202202 204501 206848 208924 210430 210879 209794 207343
54002B07343k915k635k470k869l439l726l781l837l895l893l862l756l478l136
$$ 207343 204428 201793 199323 196454 193015 189289 185508 181671 177776 173883 170021 166265 162787 159651
53988A59651k927k657j973j110q29j318j772j460p02l52p63j638k517k885k288
$$ 159651 156724 154067 152094 150984 150155 148837 147065 145605 144903 144551 143788 142150 139633 136748 134460
53973A34460q96L22N38qn00o58p54p82l39O42J650K185K157J668Q54P3j90J82
$$ 134460 133564 133886 134424 134416 133916 133258 132504 131722 131383 132025 133675 135860 138017 139685 140539 140612 140422 140604
53955A40604Q14J315J554J546J376J302J547J935K084K044K255K763K919K250
$$ 140604 141418 142733 144287 145833 147209 148511 150058 151993 154077 156121 158376 161139 164058 166308
53941A66308J371J479L026N165O564O621N811M955M318L516K254Q25l08j161k063
$$ 166308 167679 169158 172184 177349 183913 190534 196345 201300 205618 209134 211388 212213 211905 210744 208681
53926B08681k944l284k840k027j390j040p11j38P98J984K998L362L128K868K952
$$ 208681 205737 202453 199613 197586 196196 195156 194445 194307 195105 197089 200087 203449 206577 209445 212397
53911B12397L182L306L570M392N741P120P955P856O808N469M781M873M692L304
$$ 212397 215579 218885 222455 226847 232588 239708 247663 255519 262327 267796 272577 277450 282142 285446
53897B85446J246j19l60l09p24j426k001k526l172l678l693l346l136l433m207
$$ 285446 286692 286573 286213 285904 285180 283754 281753 279227 276055 272377 268684 265338 262202 258769 254562
53882B54562n078n546n550n722o598p652p796o958o224o178o043n097l909l364
$$ 254562 249484 243938 238388 232666 226068 218416 210620 203662 197438 191260 185217 180120 176211 172847
53868A72847l210k714k134k342l178l505k942k381k555l100l330l104k548j737
$$ 172847 169637 166923 164789 162447 159269 155764 152822 150441 147886 144786 141456 138352 135804 134067
53854A34067j037j069j834k502k481k151k125k329k324k117k055k276k616k848
$$ 134067 133030 131961 130127 127625 125144 122993 120868 118539 116215 114098 112043 109767 107151 104303
53840A04303k707j975q69O8O40J090J361R40q7o27nQ88Q05J1j27P88J636J411
$$ 104303 101596 99621 98752 98820 99460 100550 101911 102851 102764 102137 102132 103020 103825 103836 103709 104497 106133 107544
53822A07544M11n31j071j276j172q70o62n62k05N02J036J029R08J255J794J709
$$ 107544 107955 107424 106353 105077 103905 103035 102373 101811 101606 102108 103144 104173 105081 106336 108130 109839
53806A09839Q32m7j36O01J749L009M161M852M845M404M054L974L951L930M240
$$ 109839 110671 110624 110488 111089 112838 115847 120008 124860 129705 134109 138163 142137 146088 150018 154258
53791A54258N133O262O925O657N516L912K391J398J029J030J184J496J867J846
$$ 154258 159391 165653 172578 179235 184751 188663 191054 192452 193481 194511 195695 197191 199058 200904
53777B00904J118L6p14r13r40j151j574k129k701l026k963k791k802k729k163
$$ 200904 202022 202058 201344 200431 199491 198340 196766 194637 191936 188910 185947 183156 180354 177625 175462
53762A75462j450j336j699j590p83l02r14j970k369j948j255n87o1k7n78j049
$$ 175462 174012 172676 170977 169387 168604 168302 167388 165418 163049 161101 159846 159259 159198 159171 158593 157544
53746A57544q63m60n37q02m89K09K65n81j417j451r14m34k56k48j24M05J213J547
$$ 157544 156681 156221 155684 154882 154393 154602 154867 154286 152869 151418 150504 150070 149814 149566 149442 149847 151060 152607
53728A52607Q79k12p42p63j137j883j895o22R90J780J724J421J027L98k44n35
$$ 152607 153486 153274 152532 151769 150632 148749 146854 146232 147222 149002 150726 152147 153174 153572 153328 152793
53712A52793n53o19p71q63q53o71j54N69J004J024J185J856K492K362J674J334
$$ 152793 152240 151621 150850 149987 149134 148463 148309 148878 149882 150906 152091 153947 156439 158801 160475 161809
53696A61809J707K285K533K559K819L491M266M625M292L496K724K201J874J824
$$ 161809 163516 165801 168334 170893 173712 177203 181469 186094 190386 193882 196606 198807 200681 202505
53682B02505K268K993L337L014K544K508K749K750K389J869J213M04k01j53M30
$$ 202505 204773 207766 211103 214117 216661 219169 221918 224668 227057 228926 230139 230543 230342 230189 230619
53667B30619R44R73M51n59j753k385j922q80m56j107k100k593k593k521k408k030
$$ 230619 231563 232536 232987 232428 230675 228290 226368 225488 225032 223925 221825 219232 216639 214118 211710 209680
53651B09680j586j556j933k072j523o97m10q69j424j328n63K61O56O26M32K24
$$ 209680 208094 206538 204605 202533 201010 200313 199903 199034 197610 196282 195719 195980 196636 197262 197694 197918
53635A97918M3j09k96n32n50l3Q13J287J055P34J096J962K406J982J270J004J260
$$ 197918 197961 197852 197556 197024 196474 196441 197254 198541 199596 200330 201426 203388 205794 207776 209046 210050 211310
53618B11310J699K206K825L325L320K807K252K034K162K553L175L766L814L258
$$ 211310 213009 215215 218040 221365 224685 227492 229744 231778 233940 236493 239668 243434 247248 250506
53604B50506K876L461M683N421N248M922N101N301M775L869L631M205M551L902
$$ 250506 253382 256843 261526 266947 272195 277117 282218 287519 292294 296163 299794 303999 308550 312452
53590C12452K807K359K900L850M438M321L703L075K747K534K155J846K127K852
$$ 312452 315259 317618 320518 324368 328806 333127 336830 339905 342652 345186 347341 349187 351314 354166
53576C54166L062K158P61k5P0L78L08OkM68J022J102O24J37J81N35N38Q3j38L20
$$ 354166 357228 359386 360147 360122 360192 360570 360878 360884 360882 361350 362372 363474 364098 364235 364416 364951 365489 365572 365434 365754
53556C65754R46R70L72j99k29L43J312K207K363J529L28l11j05M97J026J381J634
$$ 365754 366700 367670 368042 367843 367614 367957 369269 371476 373839 375368 375696 375385 375280 375777 376803 378184 379818
53539C79818J925K456L179L538L011J909J185J362K072K685K961K998K987L196
$$ 379818 381743 384199 387378 390916 393927 395836 397021 398383 400455 403140 406101 409099 412086 415282
53525D15282L863M809N526N841O230P161Q344R048R118R218R956J1069J1856J2213
$$ 415282 419145 423954 429480 435321 441551 448712 457056 466104 475222 484440 494396 505465 517321 529534
53511E29534J2745J3758J4654J4845J4838J5672J7286J8442J8503J8453J9496
$$ 529534 542279 556037 570691 585536 600374 616046 633332 651774 670277 688730 708226
53500G08226K1363K2901K3790K4592K5364K5535K5327K5981K7947K9796K9854
$$ 708226 729589 752490 776280 800872 826236 851771 877098 903079 931026 960822 990676
53489I90676K8301K6683K5823K5267K4653K4481K5092K5814K5699K4749K3769
$$ 990676 1018977 1045660 1071483 1096750 1121403 1145884 1170976 1196790 1222489 1247238 1271007
53478A271007K3340K3445K3944K4777K5557K5590K4589K3123K1978K1264K0432
$$ 1271007 1294347 1317792 1341736 1366513 1392070 1417660 1442249 1465372 1487350 1508614 1529046
53467A529046J9104J7494J5994J4655J3263J1740J0274R089Q203P334O034L911
$$ 1529046 1548150 1565644 1581638 1596293 1609556 1621296 1631570 1640659 1648862 1656196 1662230 1666141
53455A666141R43k450n600q013r675j0993j2338j3692j4831j5829j7047j8534
$$ 1666141 1667084 1664634 1659034 1651021 1641346 1630353 1618015 1604323 1589492 1573663 1556616 1538082
53443A538082j9856k0719k1482k2578k3774k4479k4643k4742k4963k5021k4797
$$ 1538082 1518226 1497507 1476025 1453447 1429673 1405194 1380551 1355809 1330846 1305825 1281028
53432A281028k4487k3985k2924k1543k0788k0910k0675j8696j5218j1872r828
$$ 1281028 1256541 1232556 1209632 1188089 1167301 1146391 1125716 1107020 1091802 1079930 1070102
53421A070102q913q385p808o966n618l784k001p96MJ117K925M930O382P274Q374
$$ 1070102 1061189 1052804 1044996 1038030 1032412 1028628 1026627 1025831 1025835 1026952 1029877 1034807 1041189 1048463 1056837
53406A056837J0131J2042J3550J5044J7235J9751K1405K1980K2717K4552K6862
$$ 1056837 1066968 1079010 1092560 1107604 1124839 1144590 1165995 1187975 1210692 1235244 1262106
53395A262106K8638L0120L2187L4719L6720L7914L9186M1298M3969M6490M8532
$$ 1262106 1290744 1320864 1353051 1387770 1424490 1462404 1501590 1542888 1586857 1633347 1681879
53384A681879N0136N1396N2479N3617N4919N6345N7833N9182N9908N9608N8544
$$ 1681879 1732015 1783411 1835890 1889507 1944426 2000771 2058604 2117786 2177694 2237302 2295846
53373B295846N7496N6992N6873N6547N5400N3125M9900M6236M2359L7929L2690
$$ 2295846 2353342 2410334 2467207 2523754 2579154 2632279 2682179 2728415 2770774 2808703 2841393
53362B841393K7149K2232J8353J5131J1775P483J900m371j0050j4575j8818k3772
$$ 2841393 2868542 2890774 2909127 2924258 2936033 2943516 2945416 2941045 2930995 2916420 2897602 2873830
53350B873830k8959l2988l5481l7452l9819m2520m5193m7844n0509n2936n4842
$$ 2873830 2844871 2811883 2776402 2738950 2699131 2656611 2611418 2563574 2513065 2460129 2405287
53339B405287n5951n5796n4182n1836m9871m8528m7315m6287m6116m6648m6590
$$ 2405287 2349336 2293540 2239358 2187522 2137651 2089123 2041808 1995521 1949405 1902757 1856167
53328A856167m5219m3361m2015m0865l9021l6464l3870l1499k9112k6695k4457
$$ 1856167 1810948 1767587 1725572 1684707 1645686 1609222 1575352 1543853 1514741 1488046 1463589
53317A463589k2334k0147j8133j6777j6228j6250j6577j6965j7153j7006j6519
$$ 1463589 1441255 1421108 1402975 1386198 1369970 1353720 1337143 1320178 1303025 1286019 1269500
53306A269500j5500j3710j1477r643q499p409n857m237l002j750J15K243L728
$$ 1269500 1254000 1240290 1228813 1219170 1210671 1203262 1197405 1193168 1190166 1188416 1188531 1190774 1194502
53293A194502M343M680N239O102P296Q853J0584J2344J4365J6867J9495K1687
$$ 1194502 1198845 1203525 1208764 1214866 1222162 1231015 1241599 1253943 1268308 1285175 1304670 1326357
53281A326357K3381K4841K6113K7138K8057K8888K9214K8780K8037K7432K6600
$$ 1326357 1349738 1374579 1400692 1427830 1455887 1484775 1513989 1542769 1570806 1598238 1624838
53270A624838K4986K2820K0622J8216J5237J2297J0363R162P471N002K738J176
$$ 1624838 1649824 1672644 1693266 1711482 1726719 1739016 1749379 1758541 1766012 1771014 1773752 1774928
53258A774928m34k742n303p513r475j1416j3166j4814j6933j9525k1610k2645
$$ 1774928 1774494 1771752 1766449 1758936 1749461 1738045 1724879 1710065 1693132 1673607 1651997 1629352
53246A629352k3488k5115k7072k8186k8219k7904k7661k7292k6718k6182k5787
$$ 1629352 1605864 1580749 1553677 1525491 1497272 1469368 1441707 1414415 1387697 1361515 1335728
53235A335728k5484k5380k5497k5433k4849k4006k3277k2451k1200j9892j9142
$$ 1335728 1310244 1284864 1259367 1233934 1209085 1185079 1161802 1139351 1118151 1098259 1079117
53224A079117j8769j8109j7227j6847j7097j7160j6400j5068j3663j2331j1133
$$ 1079117 1060348 1042239 1025012 1008165 991068 973908 957508 942440 928777 916446 905313
53213I05313j0305r962r970j0300j0952j1579j1771j1809j2403j3530j4337j4423
$$ 905313 895008 885046 875076 864776 853824 842245 830474 818665 806262 792732 778395 763972
53201G63972j4329j4436j4254j3368j2251j1479j0920j0405j0440j1309j2133
$$ 763972 749643 735207 720953 707585 695334 683855 672935 662530 652090 640781 628648
53190F28648j1908j1085j0984j1896j2942j3596j4102j4361j3755j2471j1798
$$ 628648 616740 605655 594671 582775 569833 556237 542135 527774 514019 501548 489750
53179D89750j2400j3244j2999j1781j0710j0235r805q937p896p276p425q206r008
$$ 489750 477350 464106 451107 439326 428616 418381 408576 399639 391743 384467 377042 368836 359828
53166C59828r066q109o691n681n502n914o301o076n163m215m011m456m661m212
$$ 359828 350762 342653 335962 330281 324779 318865 312564 306488 301325 297110 293099 288643 283982 279770
53152B79770l769l993m514m539m005l410k920k402k076k227k460k057j168p54
$$ 279770 276001 272008 267494 262955 258950 255540 252620 250218 248142 245915 243455 241398 240230 239476
53138B39476j179j643j318m41R2j82r67j627j657j013j86K72L26K99K91J78J74
$$ 239476 238297 236654 235336 234895 234987 234805 233838 232211 230554 229541 229355 229627 229953 230252 230543 230721 230895
53121B30895P09J656K319K417K492K979L514L600L453L559L775L480K496J244
$$ 230895 231604 233260 235579 237996 240488 243467 246981 250581 254034 257593 261368 264848 267344 268588
53107B68588O1j108k313l339l968m263m421m552m629m543m198l644l171l148l713
$$ 268588 268649 267541 265228 261889 257921 253658 249237 244685 240056 235513 231315 227671 224500 221352 217639
53092B17639m555n060m798l946l153k829k716k344j760j455j640j992k121j949
$$ 217639 213084 208024 203226 199280 196127 193298 190582 188238 186478 185023 183383 181391 179270 177321
53078A77321j591j252j242j701k201k094j379p57o93q85q80p53q10r72r51p17
$$ 177321 175730 174478 173236 171535 169334 167240 165861 165104 164411 163526 162646 161893 161083 160111 159160 158443
53062A58443n29n75q66j280j546j442j077p77o51n65o00r89j504j527r69m89n13
$$ 158443 157914 157339 156473 155193 153647 152205 151128 150351 149700 149135 148535 147546 146042 144515 143546 143057 142544
53045A42544o07l08P3J9k65k11J93M22J52m60j018j026k38P52Q05l52j563j704
$$ 142544 141937 141629 141702 141721 141456 141245 141438 141860 142012 141552 140534 139508 139270 140022 140827 140475 138912 137208
53027A37208j096p35p23n22k18l80q51q70l60k5j10j58j6k6j03K34O78K95q12
$$ 137208 136112 135377 134654 134132 133914 133534 132683 131813 131453 131428 131318 131160 131144 131118 131015 131249 131927 132222 131410
53008A31410j235l32O97O26N9L14J295J805J466J000P86L75l73p59k44P17J292
$$ 131410 130175 129843 130540 131166 131225 131539 132834 134639 136105 137105 137891 138266 137893 137134 136890 137607 138899
52991A38899J253R12N44K16L5J52M85O72M21o7j96L85J314J921K058K187K596
$$ 138899 140152 141064 141608 141824 141859 142011 142496 143168 143589 143522 143326 143711 145025 146946 149004 151191 153787
52974A53787K937K835K549K685L418M389N199N603N372M419L202K524K712L186
$$ 153787 156724 159559 162108 164793 168211 172600 177799 183402 188774 193193 196395 198919 201631 204817
52960B04817L085K221J175M57j73j280k744l609l166j908j022j053j494j704j719
$$ 204817 207902 210123 211298 211755 211582 210302 207558 203949 200783 198875 197853 196800 195306 193602 191883
52945A91883j927k353k629k487k028j584j430j530j515j086m44q4j10j46j6p1
$$ 191883 189956 187603 184974 182487 180459 178875 177445 175915 174400 173314 172870 172786 172676 172530 172514 172443
52929A72443n35j032j064p19l94j80N3J86Kk63j30L52O16M36K95O25J140J320
$$ 172443 171908 170876 169812 169093 168699 168519 168572 168758 168760 168497 168367 168719 169335 169771 170066 170691 171831 173151
52911A73151J169J059R84N16l77r87o90J30M25j85r19q48q0M71L52J23N46J569
$$ 173151 174320 175379 176363 176879 176502 175515 174825 174955 175380 175195 174276 173428 173348 173819 174171 174294 174840 176409
52893A76409K329K058Q70k65l82M89J357J429J071J097J427J212L07k94M9N91
$$ 176409 178738 180796 181666 181401 181019 181508 182865 184294 185365 186462 187889 189101 189408 189114 189163 189754
52877A89754L77k25r8Q88J760J868J529J173P73L38J90M20O62P82J118J752K119
$$ 189754 190131 189906 189808 190696 192456 194324 195853 197026 197799 198137 198327 198747 199409 200191 201309 203061 205180
52860B05180J832J284R99Q52N69M74J006J803K019J486Q90Q59J492K700M265N498
$$ 205180 207012 208296 209295 210147 210716 211190 212196 213999 216018 217504 218394 219253 220745 223445 227710 233208
52844B33208N615M726L859L721L993M056L828L415K546R69r47k517l431l767l630
$$ 233208 238823 243549 247408 251129 255122 259178 263006 266421 268967 269936 268989 266472 263041 259274 255644
52829B55644l256l130l447l663l219k475k284k809l443l823m120m316m059l429
$$ 255644 252388 249258 245811 242148 238929 236454 234170 231361 227918 224095 219975 215659 211600 208171
52815B08171l097l341l600l299k600j947j448j107j049j173j063p36q50j669k438
$$ 208171 205074 201733 198133 194834 192234 190287 188839 187732 186683 185510 184447 183711 182861 181192 178754
52800A78754k417j948j779j839j577j123j100j501j657j320r30p30n03k33l15
$$ 178754 176337 174389 172610 170771 169194 168071 166971 165470 163813 162493 161563 160833 160330 160097 159782
52785A59782q33j318j447j438j513j454r73j44N64M83q12k723l673k677p21L70
$$ 159782 158949 157631 156184 154746 153233 151779 150806 150662 151226 151709 150897 148174 144501 141824 141103 141473
52769A41473K19M2M98Q12L53k31k35j50o98j493j663j212q64r46j327j999k811
$$ 141473 141692 141734 142232 143044 143397 143166 142931 142781 142083 140590 138927 137715 136851 135905 134578 132579 129768
52752A29768l018k071o75j17o69j448j797j893j969j781j151m05M9R7k12p88j390
$$ 129768 126750 124679 124004 123887 123218 121770 119973 118080 116111 114330 113179 112774 112823 112920 112708 111920 110530
52735A10530j706j673j471j226r88q37o69j29Q43J596J452O52J8j29j36j55P8
$$ 110530 108824 107151 105680 104454 103466 102629 101960 101831 102674 104270 105722 106374 106392 106263 106127 105972 106050
52718A06050N56P67M39n4l04m21o91j082j271j010l10M22N25j90q71l75J311L011
$$ 106050 106606 107373 107812 107758 107454 107033 106342 105260 103989 102979 102669 103091 103616 103426 102555 102180 103491 106502
52700A06502L825M021M196M262L859L194K771K562K082J214M26J41K54L56J54
$$ 106502 110327 114348 118544 122806 126665 129859 132630 135192 137274 138488 138914 139055 139309 139665 139819
52685A39819l65j017j633k183k668k917k712k192j829j866k030j991j831j756
$$ 139819 139454 138437 136804 134621 131953 129036 126324 124132 122303 120437 118407 116416 114585 112829
52671A12829j686j496j449j874k471k508j789j027r61j424j643j268o90l90l47
$$ 112829 111143 109647 108198 106324 103853 101345 99556 98529 97568 96144 94501 93233 92543 92153 91806
52656I1806k66l9K61N83Q17O81J08l90k69J47n0r37j363m98Q49J185K97n94n13
$$ 91806 91540 91501 91762 92345 93162 93843 93951 93561 93292 93439 93389 92452 91089 90591 91440 92625 92922 92328 91815
52637I1815K34P70O76J54j59M90K239L936M018K342M58l58n86j365k627l222k596
$$ 91815 92049 92819 93495 93649 93490 93980 96219 100155 104173 106515 106973 106615 106029 104664 102037 98815 96219
52620I6219j437o85o02q68j070r98p96q54j214j348r12m01m84r09q33j82K38J03
$$ 96219 94782 94097 93495 92627 91557 90559 89763 88909 87695 86347 85435 85034 84550 83641 82808 82626 82864 82967
52602H2967J69J048K097K258J438M61j09l37l56l5O56J433K004K280K244J965
$$ 82967 83136 84184 86281 88539 89977 90438 90329 89992 89636 89601 90257 91690 93694 95974 98218 100183
52586A00183J702J685J750J545J140J028J359J595J182L31k44j49M03J009J423
$$ 100183 101885 103570 105320 106865 108005 109033 110392 111987 113169 113500 113256 113107 113510 114519 115942
52571A15942J566J471J294J189J148J105J108J201J209R72O65N90O64N72M27Q21
$$ 115942 117508 118979 120273 121462 122610 123715 124823 126024 127233 128205 128870 129460 130124 130696 131123 131944
52555A31944J908K920K992K151J160N59L27L02M25O21Q07J011J196J009J96q01
$$ 131944 133852 136772 139764 141915 143075 143634 143961 144263 144688 145309 146116 147127 148323 149332 149528 148727
52539A48727j171p32j56k3j69j87p7J6K48P78J268J156M21l81p37n41R1Q77J332
$$ 148727 147556 146824 146668 146645 146476 146289 146212 146228 146476 147254 148522 149678 150099 149718 148981 148440 148531 149408 150740
52520A50740J107M42q9k95m50o35n14o8J02l96j044j105p61p98j235j112N5J318
$$ 150740 151847 152289 152200 151905 151455 150820 150306 150238 150340 149944 148900 147795 147034 146236 145001 143889 143944 145262
52502A45262J438N37j41L1L52J0p08r09l48M16Q97J076R57M15k84l17Q09K457
$$ 145262 146700 147237 147096 147127 147479 147489 146781 145872 145524 145940 146837 147913 148870 149285 149001 148684 149493 151950
52484A51950L388L044J933Q78K67J09K71M70L98J76L58J154J876J696P94J95M43
$$ 151950 155338 158382 160315 161193 161460 161569 161840 162310 162708 162884 163242 164396 166272 167968 168762 168957 169400
52467A69400R73J047O82L36Q7k65n55l29M50J240J530J275P20J59j05L7K18m2
$$ 169400 170373 171420 172102 172438 172525 172260 171705 171376 171826 173066 174596 175871 176591 176750 176645 176682 176900 176858
52449A76858o20p73n8J092J971K400K597K561K055J152M04L62J027J817K031J476
$$ 176858 176238 175465 175407 176499 178470 180870 183467 186028 188083 189235 189639 190001 191028 192845 194876 196352
52433A96352O78L32N32P27M62j25o35q86q74o50m69p01j303j675j415r44r54j525
$$ 196352 197030 197362 197894 198621 199083 198958 198323 197437 196563 195913 195444 194743 193440 191765 190350 189406 188452 186927
52415A86927k150k422k275j751j050o39p32q48l67N28J049Q71M36K16K28L81O78
$$ 186927 184777 182355 180080 178329 177279 176640 175908 175060 174693 175221 176270 177141 177577 177793 178021 178402 179080
52398A79080R10P38K33j00m4N1j06l08k31J88Q78J741K363K194J260L10j00j46
$$ 179080 179990 180728 180961 180861 180817 180868 180762 180454 180223 180411 181289 183030 185393 187587 188847 189157 189057 188911
52380A88911j26R8O24R94Q25N55Q68J617K056K026K091K432K346J321L7k74O88
$$ 188911 188785 188883 189507 190501 191326 191881 192749 194366 196422 198448 200539 202971 205317 206638 206675 206401 207089
52363B07089J875K118J373O03N58J066J555J904K389L002L343L268L172L359L523
$$ 207089 208964 211082 212455 213058 213616 214682 216237 218141 220530 223532 226875 230143 233315 236674 240197
52348B40197L228K609K168K026J825J412J246J900L218M214L977K617J231P36
$$ 240197 243425 246034 248202 250228 252053 253465 254711 256611 259829 264043 268020 270637 271868 272604
52334B72604J029J473J878K462K973K687J570P06J042K152K810K549J998J856
$$ 272604 273633 275106 276984 279446 282419 285106 286676 287382 288424 290576 293386 295935 297933 299789
52320B99789K124K431K639K902L357L857M033L747L478M000N412O769P118O592
$$ 299789 301913 304344 306983 309885 313242 317099 321132 324879 328357 332357 337769 344538 351656 358248
52306C58248O155O460P374Q474R454J0055J0201J0319J1047J2473J3922J4743
$$ 358248 364403 370863 378237 386711 396165 406220 416421 426740 437787 450260 464182 478925
52294D78925J5042J5425J6222J7152J7732J7848J7895J8335J9144J9840K0154
$$ 478925 493967 509392 525614 542766 560498 578346 596241 614576 633720 653560 673714
52283F73714K0394K0916K1505K1573K0950K0060J9288J8529J7490J6219J5113
$$ 673714 694108 715024 736529 758102 779052 799112 818400 836929 854419 870638 885751
52272H85751J4438J3955J3115J1669R985Q530P231N652L838K363J387K56j532
$$ 885751 900189 914144 927259 938928 948913 957443 964674 970326 974164 976527 977914 978170 976638
52259I76638l419m492m688m650m625m305l708l459l968m911n604n528m459k600
$$ 976638 973219 968727 964039 959389 954764 950459 946751 943292 939324 934413 928809 923281 918822 916222
52245I16222p15M34Q97J412K474M010N840P803R383J0084J0373J1382J3288J4849
$$ 916222 915507 915941 916838 918250 920724 924734 930574 938377 947760 957844 968217 979599 992887 1007736
52231A007736J5142J4836J4983J5245J4417J2343J0214R034Q707Q669Q539P917
$$ 1007736 1022878 1037714 1052697 1067942 1082359 1094702 1104916 1113950 1122657 1131326 1139865 1147782
52219A147782O449M450K820J908R88o62k642l984m568n289o847q920j0707j1861
$$ 1147782 1154231 1158681 1161501 1163409 1164397 1163735 1161093 1157109 1152541 1147252 1140405 1131485 1120778 1108917
52205A108917j2592j3106j3381j3448j3568j3975j4467j4525j3798j2454j1024
$$ 1108917 1096325 1083219 1069838 1056390 1042822 1028847 1014380 999855 986057 973603 962579
52194I62579r962r320q756p876o643n466m809m722m831m812m672m510m130l221
$$ 962579 952617 943297 934541 926665 920022 914556 909747 905025 900194 895382 890710 886200 882070 878849
52180H78849j878p44m63j017j683j729j076k69P7k46j054j988k695l027l183l492
$$ 878849 876971 876227 875764 874747 873064 871335 870259 869990 870067 869821 868767 866779 864084 861057 857874 854382
52164H54382l937m073l556k615j765j237r60r32j299k090l146m243m994m907l958
$$ 854382 850445 846372 842816 840201 838436 837199 836239 835307 834008 831918 828772 824529 819535 814628 810670
52149H10670k964k859l588m195m121l753l594l527l299l144l396l859m066l919
$$ 810670 807706 804847 801259 797064 792943 789190 785596 782069 778770 775626 772230 768371 764305 760386
52135G60386l670l488l426l592l974m314m489m711m984m769l793k790k727l446
$$ 760386 756716 753228 749802 746210 742236 737922 733433 728722 723738 718969 715176 712386 709659 706213
52121G06213l899l601l068k682k096j141m76p25j447j635q97L57J701L022M215
$$ 706213 702314 698713 695645 692963 690867 689726 689250 688525 687078 685443 684546 684903 686604 689626 693841
52106F93841N075N642O250P165Q381R746J1101J2262J3157J4043J5315J7046J8835
$$ 693841 698916 704558 710808 717973 726354 736100 747201 759463 772620 786663 801978 819024 837859
52093H37859K0219K1108K1796K2628K3729K4863K5583K5587K5008K4251K3526
$$ 837859 858078 879186 900982 923610 947339 972202 997785 1023372 1048380 1072631 1096157
52082A096157K2684K1633K0642K0039J9608J8627J6682J4241J2126J0572R117
$$ 1096157 1118841 1140474 1161116 1181155 1200763 1219390 1236072 1250313 1262439 1273011 1282128
$$ [...]
##END NTUPLES=NMR SPECTRUM
##END=
