
##TITLE=AC1172_Tolima-ibage-TFiAH12005_5975045_X3r5J5SXQw
##JCAMPDX= 6.0         $$ Bruker NMR JCAMP-DX V2.0
##DATA TYPE= NMR SPECTRUM
##DATA CLASS= NTUPLES
##ORIGIN= BRUKER
##OWNER= Administrator
$$ 1.72 TOPSPIN		Version 2.1
$$ 2012-04-16 19:00:55.953 -0500  Administrator@TOPSPIN
$$ Compression mode = diff/dup
##.OBSERVE FREQUENCY= 400.13188235
##.OBSERVE NUCLEUS= ^1H
##.ACQUISITION MODE= SIMULTANEOUS (DQD)
##.ACQUISITION SCHEME= undefined
##.AVERAGES= 64
##.DIGITISER RES= 22
##SPECTROMETER/DATA SYSTEM= spect
##.PULSE SEQUENCE= noesygpps1d.comp
##.SOLVENT NAME= COFFEE_meoh
##.SHIFT REFERENCE= INTERNAL, COFFEE_meoh, 1, 14.96844
##AUDIT TRAIL= $$ (NUMBER, WHEN, WHO, WHERE, PROCESS, VERSION, WHAT)
$$ ##TITLE= Audit trail, TOPSPIN		Version 2.1
$$ ##JCAMPDX= 5.01
$$ ##ORIGIN= Bruker BioSpin GmbH
$$ ##OWNER= Administrator
$$ $$ C:\Bruker\TOPSPIN/data/COFFEE/nmr/AC1172_Tolima-ibage-TFiAH12005_5975045_X3r5J5SXQw/12/pdata/1/auditp.txt
$$ ##AUDIT TRAIL=  $$ (NUMBER, WHEN, WHO, WHERE, PROCESS, VERSION, WHAT)
(   1,<2012-04-15 20:09:46.390 -0500>,<Administrator>,<TOPSPIN>,<go>,<TOPSPIN 2.1>,
      <created by zg
	started at 2012-04-15 19:58:14.703 -0500,
	POWCHK enabled, PULCHK disabled,
       configuration hash MD5:
       1A 1E CE 29 27 FD 77 03 67 4E F0 E3 C4 B2 CB 90
       data hash MD5: 64K
       62 1C 75 8C 70 BD E5 11 D7 67 43 A2 76 B3 ED BE>)
(   2,<2012-04-15 20:09:49.078 -0500>,<Administrator>,<TOPSPIN>,<proc1d>,<TOPSPIN 2.1>,
      <Start of raw data processing
       efp LB = 0.3 FT_mod = 6 PKNL = 1 PHC0 = 0 PHC1 = 0 SI = 128K 
       data hash MD5: 128K
       B3 93 DE F3 FA A6 12 12 77 F2 4C 00 77 04 1F AF>)
(   3,<2012-04-15 20:09:50.296 -0500>,<Administrator>,<TOPSPIN>,<proc1d>,<TOPSPIN 2.1>,
      <pk PHC0 = 33.23914 PHC1 = 0 
       data hash MD5: 128K
       2B 34 D8 64 02 78 52 A3 DD 60 7E 32 47 66 59 6C>)
(   4,<2012-04-15 20:09:50.828 -0500>,<Administrator>,<TOPSPIN>,<proc1d>,<TOPSPIN 2.1>,
      <abs ABSG = 1 
       data hash MD5: 128K
       78 03 2B AC 2E 7A D8 0F 04 32 CA 44 DC 67 DB B7>)
(   5,<2012-04-15 20:09:50.890 -0500>,<Administrator>,<TOPSPIN>,<proc1d>,<TOPSPIN 2.1>,
      <abs ABSG = 2 
       data hash MD5: 128K
       A2 9C BF A6 B3 54 69 74 07 7A C5 D8 9F 35 C7 63>)
(   6,<2012-04-15 20:09:50.953 -0500>,<Administrator>,<TOPSPIN>,<proc1d>,<TOPSPIN 2.1>,
      <abs ABSG = 3 
       data hash MD5: 128K
       91 FE B9 99 3D F3 68 37 A0 F5 03 FF 3E E5 FB B0>)
(   7,<2012-04-15 20:09:51.000 -0500>,<Administrator>,<TOPSPIN>,<proc1d>,<TOPSPIN 2.1>,
      <abs ABSG = 4 
       data hash MD5: 128K
       6B 79 9B C4 98 1A A1 9D 2C 09 1F 0D DC E0 86 9C>)
(   8,<2012-04-15 20:09:51.046 -0500>,<Administrator>,<TOPSPIN>,<proc1d>,<TOPSPIN 2.1>,
      <abs ABSG = 5 
       data hash MD5: 128K
       DB C7 91 7D A0 9B FB F2 3B 99 FF 74 8C CA 8B 9C>)
(   9,<2012-04-15 20:09:51.281 -0500>,<Administrator>,<TOPSPIN>,<audit>,<TOPSPIN 2.1>,
      <user comment:
       ICON-NMR User ID: COFFEE
       data hash MD5: 128K
$$ [...]
##$TP07= 0
##$TPNAME0= <>
##$TPNAME1= <>
##$TPNAME2= <>
##$TPNAME3= <>
##$TPNAME4= <>
##$TPNAME5= <>
##$TPNAME6= <>
##$TPNAME7= <>
##$TPOAL= (0..7)
0.5 0.5 0.5 0.5 0.5 0.5 0.5 0.5
##$TPOFFS= (0..7)
0 0 0 0 0 0 0 0
##$TUNHIN= 0
##$TUNHOUT= 0
##$TUNXOUT= 0
##$USERA1= <user>
##$USERA2= <user>
##$USERA3= <user>
##$USERA4= <user>
##$USERA5= <user>
##$V9= 5
##$VALIST= <valist>
##$VCLIST= <CCCCCCCCCCCCCCC>
##$VD= 0
##$VDLIST= <DDDDDDDDDDDDDDD>
##$VPLIST= <PPPPPPPPPPPPPPP>
##$VTLIST= <TTTTTTTTTTTTTTT>
##$WBST= 2048
##$WBSW= 25
##$XGAIN= (0..3)
0 0 0 0
##$XL= 0
##$YL= 0
##$YMAX_a= 9152313
##$YMIN_a= -8791735
##$ZGOPTNS= <>
##$ZL1= 120
##$ZL2= 120
##$ZL3= 120
##$ZL4= 120
##$ABSF1= 14.96844
##$ABSF2= -5.58409
##$ABSG= 5
##$ABSL= 3
##$ALPHA= 0
##$AQORDER= 0
##$ASSFAC= 0
##$ASSFACI= 0
##$ASSFACX= 0
##$ASSWID= 0
##$AUNMP= <proc_prof1d_extract.lims>
##$AXLEFT= 0
##$AXNAME= <>
##$AXNUC= <1H>
##$AXRIGHT= 0
##$AXTYPE= 0
##$AXUNIT= <>
##$AZFE= 0.1
##$AZFW= 0.1
##$BCFW= 0
##$BC_mod= 0
##$BYTORDP= 0
##$COROFFS= 0
##$CY= 15
##$DATMOD= 1
##$DC= 0
##$DFILT= <>
##$DTYPP= 0
##$F1P= 0
##$F2P= 0
##$FCOR= 0.5
##$FTSIZE= 131072
##$FT_mod= 6
##$GAMMA= 0
##$GB= 0
##$INTBC= 1
##$INTSCL= 1
##$ISEN= 128
##$LB= 0.3
##$LEV0= 0
##$LPBIN= 0
##$MAXI= 10000
##$MC2= 0
##$MEAN= 0
##$ME_mod= 0
##$MI= 0
##$NCOEF= 0
##$NC_proc= -1
##$NLEV= 6
##$NOISF1= 0
##$NOISF2= 0
##$NSP= 0
##$NTH_PI= 0
##$NZP= 0
##$OFFSET= 14.96844
##$PC= 1
##$PHC0= 33.23914
##$PHC1= 0
##$PH_mod= 1
##$PKNL= yes
##$PPARMOD= 0
##$PPDIAG= 0
##$PPIPTYP= 0
##$PPMPNUM= 2147483647
##$PPRESOL= 1
##$PSCAL= 4
##$PSIGN= 0
##$PYNMP= <proc.py>
##$REVERSE= no
##$SF= 400.130004868977
##$SI= 131072
##$SIGF1= 0
##$SIGF2= 0
##$SINO= 400
##$SIOLD= 131072
##$SPECTYP= <>
##$SREGLST= <1H.CDCl3>
##$SSB= 0
##$STSI= 131072
##$STSR= 0
##$SW_p= 8223.68421052632
##$SYMM= 0
##$S_DEV= 0
##$TDeff= 65536
##$TDoff= 0
##$TI= <>
##$TILT= no
##$TM1= 0
##$TM2= 0
##$TOPLEV= 0
##$USERP1= <user>
##$USERP2= <user>
##$USERP3= <user>
##$USERP4= <user>
##$USERP5= <user>
##$WDW= 1
##$XDIM= 131072
##$YMAX_p= 110932865
##$YMIN_p= -358847897
##$CURPLOT= <Network HP LaserJet P1505>
##$CURPRIN= <$Network HP LaserJet P1505>
##$DFORMAT= <normdp>
##$LAYOUT= <+/1D_H.xwp>
##$LFORMAT= <normlp>
##$PFORMAT= <normpl>
##$SURQMSG= 1
$$ End of Bruker specific parameters
$$ ---------------------------------
##NTUPLES= NMR SPECTRUM
##VAR_NAME=  FREQUENCY,     SPECTRUM/REAL,   SPECTRUM/IMAG
##SYMBOL=    X,             R,               I
##VAR_TYPE=  INDEPENDENT,   DEPENDENT,       DEPENDENT
##VAR_FORM=  AFFN,          ASDF,            ASDF
##VAR_DIM=   131072,        131072,          131072
##UNITS=     HZ,            ARBITRARY UNITS, ARBITRARY UNITS
##FACTOR=    0.0627417313425165, 1,          1
##FIRST=     8223.62146879498, 1814,         -16549
##LAST=      0,             2087,            -16096
##MIN=       0,             -358847897,      0
##MAX=       8223.62146879498, 110932865,    0
$$ Real data points
##PAGE= N=1
##DATA TABLE= (X++(R..R)), XYDATA
$$ [...]
62303B99710J3187J4142J5267J6587J7790J8526J8785J8781J8537J7899J6790
62292D86001J5180J2933J0002O745L665Q95j755m312o504q189r498j0568j1415
62279D83180j2172j3096j4167j4946j5011j4402j3511j2687j2023j1404j0659
62268C39102r829r194q914q702q153p319o660o346o049n494m905m609m526m259
62254B44143l557k488j333m41j3R2J98L33K34j52m84o24r72j818k651k655j840
62237B25972j088j045j384j387r00l70j56j51o6K19O48J149J625J919J978K001
62221B28964K276K812L308L537L599L659L644L460L348L745M737N916O813P278
62207B87096P440P541P857Q569R614J0765J1915J3073J4139J4940J5499J5971
$$ y = [299710, 312897, 327039, 342306, 358893, 376683, 395209, 413994, 432775, 451312, 469211, 486001, 501181, 514114, 524116, 530861, 534526, 535421, 533666, 529354, 522850, 514661, 505163, 494595, 483180, 471008, 457912, 443745, 428799, 413788, 399386, 385875, 373188, 361165, 349761, 339102, 329273, 320079, 311165, 302463, 294310, 286991, 280331, 273985, 267936, 262442, 257537, 252928, 248402, 244143, 240586, 238098, 236765, 236324, 236311, 236403, 236601, 236934, 237168, 237016, 236532, 235908, 234936, 233118, 230467, 227812, 225972, 224884, 223839, 222455, 221068, 220168, 219798, 219642, 219491, 219425, 219644, 220292, 221441, 223066, 224985, 226963, 228964, 231240, 234052, 237360, 240897, 244496, 248155, 251799, 255259, 258607, 262352, 267089, 273005, 279818, 287096, 294536, 302077, 309934, 318503, 328117, 338882, 350797, 363870, 378009, 392949, 408448, 424419]
62195D24419J6267J6038J5164J3905J2453J0635Q287N619K968M74j789l653n149
62182E15638o697q634j0738j2506j3757j4578j4918j4627j3868j3032j2283j1451
62170C68549j0438r363q374p506o773o101n275m202l167k536k261j992j626j326
62156B97609j064n95N6M93N11L59K89K17O0j7J67N33R37J372J734J800J657J830
62138C07948K585L427L690L469L425L813M242M412M565N025N698O288O724P065
62124C72376P179O867O248N798N866O304O680O791O866P209P750Q126Q220Q443
62110D70723R266J0594J1851J2658J3151J3566J3796J3546J2773J1681J0404Q900
62098F12909P222N618M266L046J687J22j404k583l321l778m164m529m751m710
$$ y = [424419, 440686, 456724, 471888, 485793, 498246, 508881, 517168, 522787, 525755, 526229, 524440, 520787, 515638, 508941, 500307, 489569, 477063, 463306, 448728, 433810, 419183, 405315, 392283, 380000, 368549, 358111, 348748, 340374, 332868, 326095, 319994, 314719, 310517, 307350, 304814, 302553, 300561, 298935, 297609, 296545, 295950, 296006, 296499, 297010, 297369, 297658, 297875, 297935, 297918, 298085, 298618, 299555, 300927, 302661, 304461, 306118, 307948, 310533, 313960, 317650, 321119, 324544, 328357, 332599, 337011, 341576, 346601, 352299, 358587, 365311, 372376, 379555, 386422, 392670, 398468, 404334, 410638, 417318, 424109, 430975, 438184, 445934, 454060, 462280, 470723, 479989, 490583, 502434, 515092, 528243, 541809, 555605, 569151, 581924, 593605, 604009, 612909, 620131, 625749, 630015, 633061, 634748, 634870, 633466, 630883, 627562, 623784, 619620, 615091, 610340, 605630]
62084F05630m465m197l955l540k728j586n05R4J32r9k26j24P2J90L04O53J356
62067E87006K239L011L563M022M563N245O047O911P666Q094Q151Q120Q336Q843
62053F71817R370R714R937J0206J0544J0887J1236J1643J2025J2228J2262J2371
62041H04240J2771J3417J4087J4646J5108J5546J6018J6576J7188J7669J7784
62030I75050J7501J7037J6607J6239J5904J5706J5805J6254J6910J7536J7856
62019A158405J7642J6932J6077J5451J5103J4831J4615J4708J5289J6197J7142
62008A332392J8025J8926J9848K0642K1152K1311K1098K0517J9595J8366J6854
61997A548726J5107J3264J1506R976Q726P661O486M865K817Q39n30j325k081l123
$$ y = [605630, 601165, 596968, 593013, 589473, 586745, 585159, 584654, 584748, 584880, 584781, 584555, 584431, 584503, 584693, 584997, 585650, 587006, 589245, 592256, 595819, 599841, 604404, 609649, 615696, 622607, 630273, 638367, 646518, 654638, 662974, 671817, 681187, 690901, 700838, 711044, 721588, 732475, 743711, 755354, 767379, 779607, 791869, 804240, 817011, 830428, 844515, 859161, 874269, 889815, 905833, 922409, 939597, 957266, 975050, 992551, 1009588, 1026195, 1042434, 1058338, 1074044, 1089849, 1106103, 1123013, 1140549, 1158405, 1176047, 1192979, 1209056, 1224507, 1239610, 1254441, 1269056, 1283764, 1299053, 1315250, 1332392, 1350417, 1369343, 1389191, 1409833, 1430985, 1452296, 1473394, 1493911, 1513506, 1531872, 1548726, 1563833, 1577097, 1588603, 1598579, 1607305, 1614966, 1621452, 1626317, 1629134, 1629973, 1629443, 1628118, 1626037, 1622914]
61983A622914m114m558m544m685n287n909n925n284m477l955l848m185m920n706
61969A555517n975n531m798m282m045l901l875m068m249m005l353k771k571k561
61955A499532k436k153j808j424j049q11p24o00l63k06l24o29r43j269j620j836
61939A481337j791j688j866k414l189m080n027n917o743p750r129j0578j1563
61926A409602j2006j2363j2949j3504j3640j3419j3234j3251j3257j3016j2600
61915A266363j2260j2143j2148j2089j1897j1677j1514j1351j1066j0652j0182
61904A139384r691r139q556q073p779p585p289o791o189n697n382n088m667m218
61890A043240l965l922l812l425k872k393k085j878j672j319o69K49J175J954
$$ y = [1622914, 1618800, 1614242, 1609698, 1605013, 1599726, 1593817, 1587892, 1582608, 1578131, 1574176, 1570328, 1566143, 1561223, 1555517, 1549542, 1544011, 1539213, 1534931, 1530886, 1526985, 1523110, 1519042, 1514793, 1510788, 1507435, 1504664, 1502093, 1499532, 1497096, 1494943, 1493135, 1491711, 1490662, 1489851, 1489127, 1488527, 1488164, 1487958, 1487634, 1487005, 1486062, 1484793, 1483173, 1481337, 1479546, 1477858, 1475992, 1473578, 1470389, 1466309, 1461282, 1455365, 1448622, 1440872, 1431743, 1421165, 1409602, 1397596, 1385233, 1372284, 1358780, 1345140, 1331721, 1318487, 1305236, 1291979, 1278963, 1266363, 1254103, 1241960, 1229812, 1217723, 1205826, 1194149, 1182635, 1171284, 1160218, 1149566, 1139384, 1129693, 1120554, 1111998, 1103925, 1096146, 1088561, 1081272, 1074481, 1068292, 1062595, 1057213, 1052125, 1047458, 1043240, 1039275, 1035353, 1031541, 1028116, 1025244, 1022851, 1020766, 1018888, 1017216, 1015897, 1015228, 1015477, 1016652, 1018606]
61876A018606K738L707M757N695O598P697R024J0447J1978J3730J5610J7380J9065
61863A147032K0981K3317K5949K8710L1601L4686L8017M1765M6131N1083N6420
61852A545692O2209O8859P6614Q5314R4778J05167J16723J29374J42880J57089
61842B584699J71820J86567K00613K13247K23588K30185K31097K24285K07905
61833D474006J80543J41907R3585L9007j7497p1649j19753j59137j88656k08708
61823D163648k20478k25111k23673k17551k08396j97531j85610j72988j60195
61814B352115j47793j35979j24640j13882j04159r5748q8321q1307p4519o8177
61804A317590o2424n7134n2223m7814m3932m0336l6781l3319l0151k7325k4800
$$ y = [1018606, 1021344, 1025051, 1029808, 1035503, 1042101, 1049798, 1058822, 1069269, 1081247, 1094977, 1110587, 1127967, 1147032, 1168013, 1191330, 1217279, 1245989, 1277590, 1312276, 1350293, 1392058, 1438189, 1489272, 1545692, 1607901, 1676760, 1753374, 1838688, 1933466, 2038633, 2155356, 2284730, 2427610, 2584699, 2756519, 2943086, 3143699, 3356946, 3580534, 3810719, 4041816, 4266101, 4474006, 4654549, 4796456, 4890041, 4929048, 4911551, 4839902, 4720149, 4561012, 4372356, 4163648, 3943170, 3718059, 3494386, 3276835, 3068439, 2870908, 2685298, 2512310, 2352115, 2204322, 2068343, 1943703, 1829821, 1725662, 1629914, 1541593, 1460286, 1385767, 1317590, 1255166, 1198032, 1145809, 1097995, 1054063, 1013727, 976946, 943627, 913476, 886151, 861351]
61793H61351k2589k0683j8916j7108j5324j3757j2403j1068r749q713q131p760
61781F95150p160o132m855l643k707k102j767j527j186o87j69K23N48J026J752
61766F66764K581L281L753M033M236M537N125N985O803P266P456P826Q719J0021
61752G48386J1371J2583J3793J5238J6984J8853K0570K2016K3353K4907K6912
61741I54966K9320L1904L4470L7069L9912M3094M6448M9730N2986N6501O0422
61730A436822O4642O9140P4186P9984Q6367R3122J00463J08807J18259J28697
61720B360489J40300J53570J68729J85598K04102K24447K46648K70258K94802
61711D248943L20034L45425L69705L91166M08038M18040M17872M03664L72158
$$ y = [861351, 838762, 818079, 799163, 782055, 766731, 752974, 740571, 729503, 719754, 711041, 702910, 695150, 687990, 681858, 677003, 673360, 670653, 668551, 666784, 665257, 664071, 663384, 663215, 663438, 663986, 665012, 666764, 669345, 672626, 676379, 680412, 684648, 689185, 694310, 700295, 707098, 714364, 721820, 729646, 738365, 748386, 759757, 772340, 786133, 801371, 818355, 837208, 857778, 879794, 903147, 928054, 954966, 984286, 1016190, 1050660, 1087729, 1127641, 1170735, 1217183, 1266913, 1319899, 1376400, 1436822, 1501464, 1570604, 1644790, 1724774, 1811141, 1904263, 2004726, 2113533, 2231792, 2360489, 2500789, 2654359, 2823088, 3008686, 3212788, 3437235, 3683883, 3954141, 4248943, 4568977, 4914402, 5284107, 5675273, 6083311, 6501351, 6919223, 7322887, 7695045]
61702G695045L21467K51456J64494O6083l5870j33157k19209k89751l42731l78216
61692G099611l98033m04905m01570l90446l73808l53788l32087l09726k87142
61683C848106k64650k42860k22539k04074j87216j71542j57051j43967j32154
61674B122053j21108j10594j00897r2298q4646p7681p1406o5911o0972n6228n1659
61663A228653m7613m4324m1621l9111l6475l3672l0969k8774k7192k5814k4146
61652H48942k2210k0515j9402j8652j7856j6883j5839j4810j3847j3094j2641
61641F63193j2287j1704j0892j0205r900r807r591r183q793q587q494q320p979
61628E37451p554p205o980o747o330n726n150m817m767m880m976m892m588m228
$$ y = [7695045, 8016512, 8267968, 8432462, 8498545, 8462675, 8329518, 8110309, 7820558, 7477827, 7099611, 6701578, 6296673, 5895103, 5504657, 5130849, 4777061, 4444974, 4135248, 3848106, 3583456, 3340596, 3118057, 2913983, 2726767, 2555225, 2398174, 2254207, 2122053, 2000945, 1890351, 1789454, 1697156, 1612510, 1534829, 1463423, 1397512, 1336540, 1280312, 1228653, 1181040, 1136716, 1095095, 1055984, 1019509, 985837, 954868, 926094, 898902, 873088, 848942, 826732, 806217, 786815, 768163, 750307, 733424, 717585, 702775, 688928, 675834, 663193, 650906, 639202, 628310, 618105, 608205, 598398, 588807, 579624, 570831, 562244, 553750, 545430, 537451, 529897, 522692, 515712, 508965, 502635, 496909, 491759, 486942, 482175, 477295, 472319, 467427, 462839, 458611]
61614D58611m012l917l720l371l126l195l411l474l352l222l144l045k936k854
61600D11832k676k322k066k253k730k941k686k336k196k057j633j065o03j78L57
61585C84447P83P70M29J46jk52n76n46O1R08J474J572J315Q67M06J47J86L87N80
61566C93103P55R87J174J076N48k80j085j566j666j600j646j877k101k105j875
61551C81842j586j458j626k019k399k543k472k424k559k735k667k282j825j576
61537C51671j522j414j101p02l93j19K73P40J076J267J551K052K552K831L025
61522C61787L399L957M493M969N521O123O553O765P036P588Q305Q894R270R550
61508D54210R862J0248J0710J1196J1574J1720J1660J1527J1408J1258J0995J0613
$$ y = [458611, 454599, 450682, 446962, 443591, 440465, 437270, 433859, 430385, 427033, 423811, 420667, 417622, 414686, 411832, 409156, 406834, 404768, 402515, 399785, 396844, 394158, 391822, 389626, 387569, 385936, 384871, 384268, 384090, 384447, 385230, 386000, 386429, 386575, 386574, 386322, 385746, 385200, 385261, 386169, 387643, 389215, 390530, 391397, 391803, 391950, 392136, 392523, 393103, 393858, 394845, 396019, 397095, 397643, 397363, 396278, 394712, 393046, 391446, 389800, 387923, 385822, 383717, 381842, 380256, 378798, 377172, 375153, 372754, 370211, 367739, 365315, 362756, 360021, 357354, 355072, 353247, 351671, 350149, 348735, 347634, 346932, 346539, 346420, 346693, 347433, 348509, 349776, 351327, 353379, 355931, 358762, 361787, 365186, 369143, 373636, 378605, 384126, 390249, 396802, 403567, 410603, 418191, 426496, 435390, 444660, 454210, 464072, 474320, 485030, 496226, 507800, 519520, 531180, 542707, 554115, 565373, 576368, 586981]
61496E86981J0172R678R075Q372P723P256O848O210N251M214L323K491J493L72
61482F69459o04j310j868k385k783k974k983k867k634k335k067j802j333n31M65
61467F41448J413K282L222M353N676P182Q891J0776J2727J4657J6587J8638K0911
61454G68763K3435K6169K9086L2247L5792L9786M4103M8506N2905N7447O2312
61443A220551O7444P2532P7259Q1483Q5057Q7580Q8367Q6678Q1977P4036O3027
61432B085991M9557L4556J9068M012r949k2467l3381m2484m9478n4235n7051n8398
61420A865741n8500n7318n4937n1678m7783m3334l8571l4012k9941k6041k1758
61409A401868j6998j2180p757l870m54K608N445Q146J0731J3172J5391J7193J8364
$$ y = [586981, 597153, 606831, 615906, 624278, 632001, 639257, 646105, 652315, 657566, 661780, 665103, 667594, 669087, 669459, 668855, 667545, 665677, 663292, 660509, 657535, 654552, 651685, 649051, 646716, 644649, 642847, 641514, 640983, 641448, 642861, 645143, 648365, 652718, 658394, 665576, 674467, 685243, 697970, 712627, 729214, 747852, 768763, 792198, 818367, 847453, 879700, 915492, 955278, 999381, 1047887, 1100792, 1158239, 1220551, 1287995, 1360527, 1437786, 1519269, 1604326, 1691906, 1780273, 1866951, 1948928, 2022964, 2085991, 2135548, 2170104, 2189172, 2193184, 2183235, 2160768, 2127387, 2084903, 2035425, 1981190, 1924139, 1865741, 1807241, 1749923, 1694986, 1643308, 1595525, 1552191, 1513620, 1479608, 1449667, 1423626, 1401868, 1384870, 1372690, 1364933, 1361063, 1360609, 1363217, 1368662, 1376808, 1387539, 1400711, 1416102, 1433295, 1451659]
61396A451659J8990J9446J9971K0348K0249J9671J8852J7953J7110J6624J6674
61385A657547J6956J7037J6983J7260J7907J8311J7891J6740J5351J4059J2911
61374A838953J1820J0580Q923O740M243J729p06l110n488p750r758j1326j2254
61361A832596j2515j2358j2093j1814j1316j0336q885p357o174n318m376l119
61349A726935j836r23l85m5J3l93j121j814k425l105l653l625l062k516k116j159
61333A698770J079M508Q583J3029J7857K2966K8189L3580L9313M5378N1674N8233
61321B023159O5037P1794P8124Q3818Q8638R2063R3531R2765Q9564Q3515P4289
61310B936297O2130M7738L1816J5119j264j6248k9463m1314n2253o2274p1061
$$ y = [1451659, 1470649, 1490095, 1510066, 1530414, 1550663, 1570334, 1589186, 1607139, 1624249, 1640873, 1657547, 1674503, 1691540, 1708523, 1725783, 1743690, 1762001, 1779892, 1796632, 1811983, 1826042, 1838953, 1850773, 1861353, 1870276, 1877016, 1881259, 1882988, 1882282, 1879172, 1873684, 1865934, 1856176, 1844850, 1832596, 1820081, 1807723, 1795630, 1783816, 1772500, 1762164, 1753279, 1745922, 1739748, 1734430, 1730054, 1726935, 1725099, 1724176, 1723791, 1723746, 1723759, 1723366, 1722245, 1720431, 1718006, 1714901, 1711248, 1707623, 1704561, 1702045, 1699929, 1698770, 1699849, 1704357, 1712940, 1725969, 1743826, 1766792, 1794981, 1828561, 1867874, 1913252, 1964926, 2023159, 2088196, 2159990, 2238114, 2321932, 2410570, 2502633, 2596164, 2688929, 2778493, 2862008, 2936297, 2998427, 3046165, 3077981, 3093100, 3091836, 3075588, 3046125, 3004811, 2952558, 2890284, 2819223]
61299B819223p8258q3595q7091q9157r0213r0192q8783q6122q2837p9316p5431
61288A888228p1077o6562o2132n7566n2596m7452m2572l7961l3297k8546k4054
61277A364413j9987j6089j2095q128m470j155K015N103P915J0240J2090J3622
61265A353474J4899J5853J6442J6734J6762J6394J5492J4171J2792J1629J0708
61254A515350R959R389Q937Q315P198N636M083K894J887N52j354l587n796p931
61240A555532j0106j2235j4040j5410j6538j7621j8614j9409k0043k0568k0856
61229A370092k0727k0206j9456j8514j7301j5868j4389j2902j1308r731q539p909
61217A193242p511o904o133n614n551n694n771n864o144o485o482n891m844l641
$$ y = [2819223, 2740965, 2657370, 2570279, 2481122, 2390909, 2300717, 2211934, 2125812, 2042975, 1963659, 1888228, 1817151, 1750589, 1688457, 1630891, 1578295, 1530843, 1488271, 1450310, 1417013, 1388467, 1364413, 1344426, 1328337, 1316242, 1308114, 1303644, 1302489, 1304504, 1309607, 1317522, 1327762, 1339852, 1353474, 1368373, 1384226, 1400668, 1417402, 1434164, 1450558, 1466050, 1480221, 1493013, 1504642, 1515350, 1525309, 1534698, 1543635, 1551950, 1559148, 1564784, 1568867, 1571761, 1573648, 1574200, 1572846, 1569259, 1563463, 1555532, 1545426, 1533191, 1519151, 1503741, 1487203, 1469582, 1450968, 1431559, 1411516, 1390948, 1370092, 1349365, 1329159, 1309703, 1291189, 1273888, 1258020, 1243631, 1230729, 1219421, 1209690, 1201151, 1193242, 1185731, 1178827, 1172694, 1167080, 1161529, 1155835, 1150064, 1144200, 1138056, 1131571, 1125089, 1119198, 1114354, 1110713]
61203A110713k464j282Q5J785L742N712P619R760J2453J5549J8586K1438K4496
61190A228192K8039L1747L5034L7601L9390M0231L9914L8420L5658L1085K4096
61179A609407J4842M296o563j7252k7398l6328m3318m8098n0922n2276n2673n2343
61167A241374n1107m8722m5481m2189l9380l6901l4386l1824k9322k6734k3915
61156H31413k1126j8790j6940j5288j3697j2244j0927r629q337p097n776m224
61144F87338k559j061K23J469K719L802M600N141N404N334M959M306L248J738
61130G26661J30j071j800k449l304m268n169o001o787p508q186q817r163r032
61116F53236q700q687r003r111q792q531q757r176r325r347r704j0310j0577j0312
$$ y = [1110713, 1108249, 1106967, 1107052, 1108837, 1112579, 1118291, 1125910, 1135670, 1148123, 1163672, 1182258, 1203696, 1228192, 1256231, 1287978, 1323012, 1360613, 1400003, 1440234, 1480148, 1518568, 1554226, 1585311, 1609407, 1624249, 1628545, 1621982, 1604730, 1577332, 1541004, 1497686, 1449588, 1398666, 1346390, 1293717, 1241374, 1190267, 1141545, 1096064, 1053875, 1014495, 977594, 943208, 911384, 882062, 855328, 831413, 810287, 791497, 774557, 759269, 745572, 733328, 722401, 712772, 704435, 697338, 691562, 687338, 684779, 683718, 683941, 685410, 688129, 691931, 696531, 701672, 707076, 712410, 717369, 721675, 724923, 726661, 726791, 725720, 723920, 721471, 718167, 713899, 708730, 702729, 695942, 688434, 680248, 671431, 662268, 653236, 644536, 635849, 626846, 617735, 608943, 600412, 591655, 582479, 573154, 563807, 554103, 543793, 533216, 522904]
61102E22904r986j0053j0407j0660j0631j0335r787r042q301p778p525p473p549
61089D03377p632p577p388p278p396p546p391o899o402o160o022n630m847l866
61075C11343k979k335j911j586j188n94J24P11J002J129J404J950K527K758K528
61060C14883K124J950K163K608L078L468L709L709L551L553L928M484M834M858
61046C62900M676M227L302K030R71M74K54j35o93j073j134j020q78p69q28j159
61030C71145j620j971k221k592l096l454l474l289l118l028l011l106l317l457
61016C30391l285k784k270k116k331k462k072j286o83n64o52n92n11p23j155j348
61000C05557j038l67L68R57J281J334J279J295J389J505J689J959K163K182K179
$$ y = [522904, 512918, 502865, 492458, 481798, 471167, 460832, 451045, 442003, 433702, 425924, 418399, 410926, 403377, 395745, 388168, 380780, 373502, 366106, 358560, 351169, 344270, 337868, 331708, 325686, 320056, 315209, 311343, 308364, 306029, 304118, 302532, 301344, 300750, 300874, 301585, 302587, 303716, 305120, 307070, 309597, 312355, 314883, 317007, 318957, 321120, 323728, 326806, 330274, 333983, 337692, 341243, 344796, 348724, 353208, 358042, 362900, 367576, 371803, 375105, 377135, 378106, 378580, 378834, 378699, 378006, 376933, 375799, 374779, 373901, 373132, 372304, 371145, 369525, 367554, 365333, 362741, 359645, 356191, 352717, 349428, 346310, 343282, 340271, 337165, 333848, 330391, 327106, 324322, 322052, 319936, 317605, 315143, 313071, 311785, 311102, 310538, 309886, 309294, 308783, 308060, 306905, 305557, 304519, 304152, 304520, 305477, 306758, 308092, 309371, 310666, 312055, 313560, 315249, 317208, 319371, 321553, 323732]
60985C23732K327K508K552K620K990L546L938M146M477N029N599O110O683P235
60971C83492P509P555P754Q248Q797R275R860J0538J0976J1071J1220J1754J2451
60958E10500J2943J3226J3502J3822J4245J5074J6536J8417K0241K1769K3128
60947F93403K4653K6680K9329L2281L5067L7590M0136M2856M5635M8552N1930
60936A108112N5806N9924O4480P0218P7375Q5143R2728J00406J09079J19361J31773
60925B074405J47255J66636J89959K17146K48834K85549L26717L71761M21898
60916D450160M79316N45036O19304P02350P88042Q52496Q54450P59372N71846
60907A0622372L43143J41624J2476l6849k1429L7153J07528J41386Q9044o6124
$$ y = [323732, 326059, 328567, 331119, 333739, 336729, 340275, 344213, 348359, 352836, 357865, 363464, 369574, 376257, 383492, 391001, 398556, 406310, 414558, 423355, 432630, 442490, 453028, 464004, 475075, 486295, 498049, 510500, 523443, 536669, 550171, 563993, 578238, 593312, 609848, 628265, 648506, 670275, 693403, 718056, 744736, 774065, 806346, 841413, 879003, 919139, 961995, 1007630, 1056182, 1108112, 1163918, 1223842, 1288322, 1358540, 1435915, 1521058, 1613786, 1714192, 1823271, 1942632, 2074405, 2221660, 2388296, 2578255, 2795401, 3044235, 3329784, 3656501, 4028262, 4450160, 4929476, 5474512, 6093816, 6796166, 7584208, 8436704, 9291154, 10050526, 10622372, 10965515, 11107139, 11119615, 11082766, 11061337, 11098490, 11206018, 11347404, 11436448, 11370324]
60897A1370324k89034n12901o80455p70020p91315p66271p15334o53771n91585
60888E599638n33394m79651m29272l81540l36488k94840k57782k26154j99721
60879B460796j77578j59039j43631j30524j18756j08068r8854r1151q4284p7637
60869A271274p1266o5447o0090n5072n0707m7459m5249m3436m1443l9117l6535
60858G15453l3847l1327k9217k7416k5557k3542k1754k0509j9538j8323j6781
60847D47642j5279j4005j2761j1417j0219r413q886q401p949p586p144o442n652
60834C22488n071m633l964k978k054j547j353j162q35m07R0O15J005J119J025
60819C02338R23R13R03Q14O66M75J21n24j341j926j980j683j547j875k469k912
$$ y = [11370324, 11081290, 10568389, 9887934, 9117914, 8326599, 7560328, 6844994, 6191223, 5599638, 5066244, 4586593, 4157321, 3775781, 3439293, 3144453, 2886671, 2660517, 2460796, 2283218, 2124179, 1980548, 1850024, 1731268, 1623200, 1524346, 1433195, 1348911, 1271274, 1200008, 1134561, 1074471, 1019399, 968692, 921233, 875984, 832548, 791105, 751988, 715453, 681606, 650279, 621062, 593646, 568089, 544547, 522793, 502284, 482746, 464423, 447642, 432363, 418358, 405597, 394180, 383961, 374548, 365662, 357261, 349312, 341726, 334582, 328140, 322488, 317417, 312784, 308820, 305842, 303788, 302241, 300888, 299726, 298891, 298484, 298574, 299189, 300194, 301313, 302338, 303261, 304174, 305077, 305891, 306557, 307032, 307153, 306629, 305288, 303362, 301382, 299699, 298152, 296277, 293808, 290896]
60803B90896k976k689k176j636j305j288j397j366j113p08j90M07R64J412J861
60788B78696K399K883L167L439L999M790N418N673N675N529N175M719M461M506
60774C40529M555M317L889L494L145K749K366K103J887J602J308J089Q20L36k25
60759C73964n06l84p7J81L31L38Q4m37j015j441j722j979k259k569k993l598m247
60742C51671m683m827m795m666m357l881l497l403l376k995k198j376q65n64k17
60727C05971J61L50K89K06L88R71J863K752L261L290L182L360L864M377M723N088
60711C44096N712O510P099P179O779O179N648N265M961M671M339L821L030K158
60697D17447J600J503J570J479J265J100R41O39K93J27P5j46n88r96j189j276
$$ y = [290896, 287920, 285231, 283055, 281419, 280114, 278826, 277429, 276063, 274950, 274242, 274052, 274459, 275423, 276835, 278696, 281095, 283978, 287145, 290584, 294583, 299373, 304791, 310464, 316139, 321668, 326843, 331562, 336023, 340529, 345084, 349401, 353290, 356784, 359929, 362678, 365044, 367147, 369034, 370636, 371944, 373033, 373853, 374189, 373964, 373458, 373074, 372997, 373178, 373509, 373847, 373931, 373494, 372479, 371038, 369316, 367337, 365078, 362509, 359516, 355918, 351671, 346988, 342161, 337366, 332700, 328343, 324462, 320965, 317562, 314186, 311191, 308993, 307617, 306752, 306188, 305971, 306132, 306482, 306771, 306977, 307365, 308336, 310199, 312951, 316212, 319502, 322684, 326044, 329908, 334285, 339008, 344096, 349808, 356318, 363417, 370596, 377375, 383554, 389202, 394467, 399428, 404099, 408438, 412259, 415289, 417447, 419047, 420550, 422120, 423599, 424864, 425964, 426905, 427544, 427837, 427964, 428039, 427893, 427305, 426309, 425120, 423844]
60681D23844j376j425j373j349j498j810k193k582k942l262l589l923m073l855
60667C88594l404l094l076l104k910k501k010j498r81n53k79p9J61M48O89P88
60651C67191P30O10N46M98L06k2k68l78o45j169j455j002j47K64Rl54n03q14j505
60632C61892k089k087j845k000k499k747k543k323k508l078l787m410m793m944
60618C20239n066n266n351n099m620m137l601k888k196j868j790j499q75l37j82
60603B75464j55R0M68O72O72P46R92J155R71N71M14P21J158J162P03M04P45J370
60585B88323J481Q75K08J59O72J171J280J125J028J122J326J539J778K128K575
60570C06790K980L245L423L659M028M507N019N448N708N894O229O753P159P097
$$ y = [423844, 422468, 421043, 419670, 418321, 416823, 415013, 412820, 410238, 407296, 404034, 400445, 396522, 392449, 388594, 385190, 382096, 379020, 375916, 373006, 370505, 368495, 366997, 366016, 365463, 365184, 365105, 365266, 365714, 366403, 367191, 367921, 368531, 369077, 369575, 369881, 369859, 369591, 369213, 368568, 367399, 365944, 364942, 364795, 365059, 365068, 364714, 364211, 363397, 361892, 359803, 357716, 355871, 353871, 351372, 348625, 346082, 343759, 341251, 338173, 334386, 329976, 325183, 320239, 315173, 309907, 304556, 299457, 294837, 290700, 287099, 284211, 282015, 280147, 278357, 276858, 275983, 275646, 275464, 275309, 275399, 275867, 276539, 277211, 277957, 278949, 280104, 281075, 281646, 282060, 282781, 283939, 285101, 285804, 286208, 286953, 288323, 289804, 290679, 290887, 291046, 291718, 292889, 294169, 295294, 296322, 297444, 298770, 300309, 302087, 304215, 306790, 309770, 313015, 316438, 320097, 324125, 328632, 333651, 339099, 344807, 350701, 356930, 363683, 370842, 377939]
60556C77939O603O017N562N171M724M267L937L754L568L204K647K030J376M86
60542D31285p68k094l018l545m174n123n930o122n924n868n959n756n145m467
60528C67392l920l360k726k171j654r39j36K37Qk85j51J38j1o30j198j356j176
60511C48062q01k71K92O78Q75J090J395J629J699J781K086K576L008L200L128
60496C70427K883K669K722L084L465L521L270L101L255L520L542L387L473M029
60482D16348M881N843P019Q489R998J1272J2447J3777J5021J5533J4991J3620
60470E49239J1637Q904N360J408k386n683q236r701r965r463q744p819o313m218
60456E04020k093m38P83J910L103M269N278O076O689P237P891Q738R764J0979
$$ y = [377939, 384542, 390559, 396121, 401292, 406016, 410283, 414220, 417974, 421542, 424746, 427393, 429423, 430799, 431285, 430517, 428423, 425405, 421860, 417686, 412563, 406633, 400511, 394587, 388719, 382760, 377004, 371859, 367392, 363472, 360112, 357386, 355215, 353561, 352622, 352486, 352723, 352731, 352446, 352295, 352433, 352422, 351792, 350594, 349238, 348062, 347261, 346990, 347282, 347960, 348835, 349925, 351320, 352949, 354648, 356429, 358515, 361091, 364099, 367299, 370427, 373310, 375979, 378701, 381785, 385250, 388771, 392041, 395142, 398397, 401917, 405459, 408846, 412319, 416348, 421229, 427072, 434091, 442580, 452578, 463850, 476297, 490074, 505095, 520628, 535619, 549239, 560876, 569780, 575140, 576548, 574162, 568479, 560243, 550542, 540577, 531114, 522370, 514551, 508238, 504020, 501927, 501489, 502272, 504182, 507285, 511554, 516832, 522908, 529597, 536834, 544725, 553463, 563227, 574206]
60442E74206J2474J4286J6333J8530K0918K3579K6517K9718L3248L7179M1411
60431H48399M5669M9750N3722N7831O2192O6753P1626P7336Q4472R2987J01955
60420A612692J10024J15831J17834J14146J03121Q4328N8776K8303m932l8284
60410B301839o8638r3214j10614j20969j25272j24786j20866j14768j07343r9002
60400A216367r0108q1272p3118o5907n9548n3859m8679m3864l9369l5345l1921
60389E93377k8951k6142k3467k1199j9439j7850j6069j4197j2679j1732j1103
60378C90549j0415r575q773q211p916p730p428o912o303n786n395m982m470l977
60364B92676l632l396l116k722k240j707j162o99l93k39j80j86k08j63l3K9j05
$$ y = [574206, 586680, 600966, 617299, 635829, 656747, 680326, 706843, 736561, 769809, 806988, 848399, 894068, 943818, 997540, 1055371, 1117563, 1184316, 1255942, 1333278, 1417750, 1510737, 1612692, 1722716, 1838547, 1956381, 2070527, 2173648, 2257976, 2316752, 2345055, 2340123, 2301839, 2233201, 2139987, 2029373, 1908404, 1783132, 1658346, 1537480, 1422712, 1315369, 1216367, 1126259, 1044987, 971869, 905962, 846414, 792555, 743876, 700012, 660643, 625298, 593377, 564426, 538284, 514817, 493618, 474179, 456329, 440260, 426063, 413384, 401652, 390549, 380134, 370559, 361786, 353575, 345659, 337929, 330501, 323589, 317286, 311500, 306105, 301123, 296653, 292676, 289044, 285648, 282532, 279810, 277570, 275863, 274701, 274002, 273609, 273370, 273190, 273004, 272796, 272633, 272600, 272629, 272524]
60347B72524l18l58j54J49M42P70J122J321J272J166J285J647K018K215K256K258
60331B89615K325K524K771K795K353J579R05N53K88j82p24r39p52n91q37j312
60315C00371j487j130n71k53k52l27l44l87m81m25r7K78L93L26M79J003J564J757
60297C00417J573J319J259J476J935K436K676K549K354K508L083L737M116M084
60283C35522L725L280L083L260L494L318K663J925J449J232J152J198J330J432
60269C68063J564K017K880L786M277M283L979L386K420J217Q8q39j670k457l091
60254C89903l528l813l931l794l470l165k994k889k809k769k646k184j371n88
60240C49952k44l44n73o22l61J78P95J206J255J074R23R19J048J271J523J664
$$ y = [272524, 272206, 271848, 271694, 271843, 272285, 273055, 274177, 275498, 276770, 277936, 279221, 280868, 282886, 285101, 287357, 289615, 291940, 294464, 297235, 300030, 302383, 303962, 304867, 305420, 305708, 305526, 304802, 303863, 303111, 302520, 301683, 300371, 298884, 297754, 297183, 296930, 296678, 296351, 296007, 295620, 295139, 294714, 294617, 294895, 295288, 295614, 296093, 297096, 298660, 300417, 301990, 303309, 304568, 306044, 307979, 310415, 313091, 315640, 317994, 320502, 323585, 327322, 331438, 335522, 339247, 342527, 345610, 348870, 352364, 355682, 358345, 360270, 361719, 362951, 364103, 365301, 366631, 368063, 369627, 371644, 374524, 378310, 382587, 386870, 390849, 394235, 396655, 397872, 397960, 397121, 395451, 392994, 389903, 386375, 382562, 378631, 374837, 371367, 368202, 365208, 362319, 359510, 356741, 354095, 351911, 350540, 349952, 349708, 349364, 348791, 348169, 347808, 347986, 348781, 349987, 351242, 352316, 353239, 354158, 355206, 356477, 358000, 359664]
60224C59664J624J538J567J649J604J502J677K283L014L436L460L333L278L355
60210C92984L576L952M366M649M855N287O103P054P790Q326Q949R793J0693J1536
60196D89913J2421J3432J4479J5517J6696J8114J9637K1195K3048K5424K8025
60185F97901L0242L1967L3755L6070L8686M1067M3026M4688M5978M6565M6298
60174A136243M5398M4094M2333L9960L6937L3259K8847K3765J8433J3381Q777
60163A471427M418K37l460o350q499j0216j1544j2120j1608j0096p967n463k568
60150A386191P42M286P899J1720J6028K0768K5446K9581L3163L6496L9670M2406
60138A654396M4321M5123M4600M2701L9684L5906L1379K5811J9250J2411O040
$$ y = [359664, 361288, 362826, 364393, 366042, 367646, 369148, 370825, 373108, 376122, 379558, 383018, 386351, 389629, 392984, 396560, 400512, 404878, 409527, 414382, 419669, 425772, 432826, 440616, 448942, 457891, 467684, 478377, 489913, 502334, 515766, 530245, 545762, 562458, 580572, 600209, 621404, 644452, 669876, 697901, 728143, 760110, 793865, 829935, 868621, 909688, 952714, 997402, 1043380, 1089945, 1136243, 1181641, 1225735, 1268068, 1308028, 1344965, 1378224, 1407071, 1430836, 1449269, 1462650, 1471427, 1475845, 1476082, 1472622, 1466272, 1457773, 1447557, 1436013, 1423893, 1412285, 1402189, 1394222, 1388759, 1386191, 1386933, 1391219, 1399118, 1410838, 1426866, 1447634, 1473080, 1502661, 1535824, 1572320, 1611990, 1654396, 1698717, 1743840, 1788440, 1831141, 1870825, 1906731, 1938110, 1963921, 1983171, 1995582, 2001622]
60127B001622J76n657j1680j7588k2933k7376l0579l2235l2381l1407k9662k7218
60115A733082k4067k0259j5814j0708n120N23N877J0872J5538J9808K3615K6936
60103A760283K9598L1227L1562L0677K8776K5922K2149J7706J3010Q470M395R62
60091B004737j846m091n582n909m850k565P08M898R882J5294K0823K6511L2547
60078B090557L8947M5666N2835O0590O8811P7291Q5956R4686J03092J10859J18113
60067B947403J25094J31497J36542J39690J40884J40110J37087J31566J23603
60058D153476J13447J01309Q7371P1860N5048L7304J9082P04j7808l6364n4328
60047D531101p0696q4777r6450j05682j12167j15584j15996j13795j09364j02979
$$ y = [2001622, 2001798, 1996141, 1984461, 1966873, 1943940, 1916564, 1885985, 1853750, 1821369, 1789962, 1760300, 1733082, 1709015, 1688756, 1672942, 1662234, 1657114, 1657637, 1663514, 1674386, 1689924, 1709732, 1733347, 1760283, 1789881, 1821108, 1852670, 1883347, 1912123, 1938045, 1960194, 1977900, 1990910, 1999380, 2003775, 2004737, 2002891, 1998800, 1993218, 1987309, 1982459, 1979894, 1980602, 1985500, 1995382, 2010676, 2031499, 2058010, 2090557, 2129504, 2175170, 2228005, 2288595, 2357406, 2434697, 2520653, 2615339, 2718431, 2829290, 2947403, 3072497, 3203994, 3340536, 3480226, 3621110, 3761220, 3898307, 4029873, 4153476, 4266923, 4368232, 4455603, 4527463, 4582511, 4619815, 4638897, 4639601, 4621793, 4585429, 4531101, 4460405, 4375628, 4279178, 4173496, 4061329, 3945745, 3829749, 3715954, 3606590, 3503611]
60037C503611r4873q5353p4847o3795n2415m0606k8357j6160m854N039J3565K0909
60025C081864K6908L1063L2926L2410K9837K5712K0351J3770O055k292j0587j8470
60013C269547k5938l2977l9466m5426n1000n6115o0467o3875o6368o7933o8439
60002B691543o7866o6302o3658n9773n4885m9606m4233l8455l1909k4749j7424
59991B172683j0197l095L863J0644J7196K3303K8632L3112L6974M0193M2219M2506
59979B438033M1063L8193L3982K8360K1526J3898N733k866j1639k0107k7876l4750
59967B523550m0655m5591m9588n2478n3826n3318n1152m7842m3749l9055l4041
59956B012255k9015k3960j8551j2618o344L2O519J3236K0188K7225L4148M0753
$$ y = [3503611, 3408738, 3323385, 3248538, 3184743, 3132328, 3091722, 3063365, 3047205, 3042351, 3047390, 3060955, 3081864, 3108772, 3139835, 3172761, 3205171, 3235008, 3260720, 3281071, 3294841, 3300896, 3298604, 3288017, 3269547, 3243609, 3210632, 3171166, 3125740, 3074740, 3018625, 2958158, 2894283, 2827915, 2759982, 2691543, 2623677, 2557375, 2493717, 2433944, 2379059, 2329453, 2285220, 2246765, 2214856, 2190107, 2172683, 2162486, 2159391, 2163254, 2173898, 2191094, 2214397, 2243029, 2276141, 2313115, 2353308, 2395527, 2438033, 2479096, 2517289, 2551271, 2579631, 2601157, 2615055, 2620788, 2617922, 2606283, 2586176, 2558300, 2523550, 2482895, 2437304, 2387716, 2335238, 2281412, 2228094, 2176942, 2129100, 2085351, 2046296, 2012255, 1983240, 1959280, 1940729, 1928111, 1921767, 1921799, 1928318, 1941554, 1961742, 1988967, 2023115, 2063868]
59944B063868M6888N2507N7572O1914O5160O6783O6273O3406N8503N2273M5238
59933B700385L7389K8546J8951R197l62r868j9460k8707l6786m3120m7687n0686
59921B557792n2070n1662m9600m6398m2457l7662l1769k5005j7981j1013l953
59910B188222L254J0166J6306K1704K6693L1360L5464L8803M1348M3021M3628
59899B499969M3020M1216L8403L4917L1192K7560K4086K0687J7392J4414J2065
59888B804921J0682J0502J1511J3507J6418K0471K5935L2826M0977N0247O0483
59877C098480P1427Q2795R4414J06056J17300J27662J36758J44155J49165J51000
59867D279212J49049J42866J31965J15961R4879O9326M0457R957k0273m8671p4309
$$ y = [2063868, 2110756, 2163263, 2220835, 2282749, 2347909, 2414692, 2480965, 2544371, 2602874, 2655147, 2700385, 2737774, 2766320, 2785271, 2794468, 2794106, 2784238, 2764778, 2736071, 2699285, 2656165, 2608478, 2557792, 2505722, 2454060, 2404460, 2358062, 2315605, 2277943, 2246174, 2221169, 2203188, 2192175, 2188222, 2191476, 2201642, 2217948, 2239652, 2266345, 2297705, 2333169, 2371972, 2413320, 2456341, 2499969, 2542989, 2584205, 2622608, 2657525, 2688717, 2716277, 2740363, 2761050, 2778442, 2792856, 2804921, 2815603, 2826105, 2837616, 2851123, 2867541, 2888012, 2913947, 2946773, 2987750, 3037997, 3098480, 3169907, 3252702, 3347116, 3453172, 3570472, 3698134, 3834892, 3979047, 4128212, 4279212, 4428261, 4571127, 4703092, 4819053, 4913932, 4983258, 5023715, 5033672, 5013399, 4964728, 4890419]
59856D890419r6479j14336j27274j35485j39695j40377j37629j31830j23932j14898
59846C628484j05095r4452q2969p0898n8597m6345l4272k2360j0585Q93J1797
59835C115601K1881L0949L8769M5124M9894N2877N3532N1153M5392L6427K4696
59824C566295J0632n242k2215l9467n6141p1372q4464r5093j03202j08746j11676
59813B879309j12259j11039j08377j04249r8681r2172q5483p9055p2791o6429
59803A948774n9971n3725m7963m2679l7733l3202k9392k6470k4260k2558k1444
59792A549377k1009k0904k0507j9526j8148j6615j4969j3320j1874j0661r444
59781A372400q157p197p034p741r126j1006j3133j4991j6095j6484j6604j6691
$$ y = [4890419, 4793940, 4679604, 4552330, 4416845, 4277150, 4136773, 3999144, 3867314, 3743382, 3628484, 3523389, 3428937, 3345968, 3275070, 3216473, 3170128, 3135856, 3113496, 3102911, 3103804, 3115601, 3137482, 3168431, 3207200, 3252324, 3302218, 3355095, 3408627, 3459780, 3505172, 3541599, 3566295, 3576927, 3571685, 3549470, 3510003, 3453862, 3382490, 3298026, 3202933, 3099731, 2990985, 2879309, 2767050, 2656011, 2547634, 2443385, 2344704, 2252532, 2167049, 2087994, 2015203, 1948774, 1888803, 1835078, 1787115, 1744436, 1706703, 1673501, 1644109, 1617639, 1593379, 1570821, 1549377, 1528368, 1507464, 1486957, 1467431, 1449283, 1432668, 1417699, 1404379, 1392505, 1381844, 1372400, 1364243, 1357046, 1350012, 1342271, 1333145, 1322139, 1309006, 1294015, 1277920, 1261436, 1244832, 1228141]
59769A228141j6483j5573j3880j1672r288o931m599k206K16K396M033N174O260
59756A165588P757R802J2278J5030J7869K0438K2334K3401K3815K3839K3615K3172
59744A388938K2450K1295J9599J7560J5566J3762J1869R695P643O417O300P033
59732A548127Q357J0302J2924J6069J9578K3462K7793L2611L8067M4397N1607
59721A833294N9402O7587P6325Q5800R5825J05988J15910J25139J32881J38008
59711B836159J39195J34806J23017J02687P4442M0979O212k5957n2649p2439q5196
59700C221256r1597r2761r0092q4961p8255p0324o1468n2203m2941l3754k4702
59689B498198j6057p974j82P602J5233K2461K9456L6586M3880N1132N8455O6213
$$ y = [1228141, 1211658, 1196085, 1182205, 1170533, 1161245, 1154314, 1149715, 1147509, 1147725, 1150121, 1154154, 1159328, 1165588, 1173345, 1183147, 1195425, 1210455, 1228324, 1248762, 1271096, 1294497, 1318312, 1342151, 1365766, 1388938, 1411388, 1432683, 1452282, 1469842, 1485408, 1499170, 1511039, 1520734, 1528377, 1534794, 1541094, 1548127, 1556484, 1566786, 1579710, 1595779, 1615357, 1638819, 1666612, 1699223, 1737290, 1781687, 1833294, 1892696, 1960283, 2036608, 2122408, 2218233, 2324221, 2440131, 2565270, 2698151, 2836159, 2975354, 3110160, 3233177, 3335864, 3410306, 3451285, 3457497, 3431540, 3378891, 3306452, 3221256, 3129659, 3036898, 2946806, 2861845, 2783590, 2713266, 2651798, 2599595, 2556654, 2522900, 2498198, 2482141, 2474167, 2473985, 2481587, 2496820, 2519281, 2548737, 2585323, 2629203, 2680335, 2738790, 2805003]
59677B805003P4525Q3215R2232J01677J11489J21484J31785J42771J54603J67165
59667C985949J80436J94481K08985K23202K36514K48696K59563K68573K74948
59658F081347K77963K77163K72588K64912K55093K43964K32408K21801K13768
59649H341007K09322K08472K10658K15124K20877K26704K31474K34185K33662
59640A0331485K28608K18084K01757J79717J52506J21430Q8368N5117K3165n870
59630A1594367l0213m8630o0829o6945o6999o1156n0107l4697j5410P485L3445
59619A1200311O1638R1431J22574J54899J87921K20659K51754K79788L03414L21049
59609A3195438L30546L29454L15699K87880K45156J87493J16328L4885n2250j39713
$$ y = [2805003, 2879528, 2962743, 3054975, 3156652, 3268141, 3389625, 3521410, 3664181, 3818784, 3985949, 4166385, 4360866, 4569851, 4793053, 5029567, 5278263, 5537826, 5806399, 6081347, 6359310, 6636473, 6909061, 7173973, 7429066, 7673030, 7905438, 8127239, 8341007, 8550329, 8758801, 8969459, 9184583, 9405460, 9632164, 9863638, 10097823, 10331485, 10560093, 10778177, 10979934, 11159651, 11312157, 11433587, 11521955, 11577072, 11600237, 11594367, 11564154, 11515524, 11454695, 11387750, 11320751, 11259595, 11209488, 11174791, 11159381, 11166866, 11200311, 11261949, 11353380, 11475954, 11630853, 11818774, 12039433, 12291187, 12570975, 12874389, 13195438, 13525984, 13855438, 14171137, 14459017, 14704173, 14891666, 15007994, 15042879, 14990629, 14850916]
59599A4850916k21928k93995l52714l96832m26376m42052m45301m38307m23595
59590A1409816m03687l81140l58557l38407l23026l14619l14539l22078l34328
59581H319435l47468l58147l63952l63561l57029l45585l30683l13364k94551
59572E245095k75265k56167k37301k18724k00940j84378j68881j54205j40665
59563C408569j28731j18243j08526r9142r0083q1468p3475o6400o0346n5020n0101
59552B477034m5697m2093l9375l7573l6870l7245l8199l9250m0417m1787m2962
59541B035566m3518m3610m3597m3206m1832l9543l7101l4998l3001l0711k8056
59530A616393k5146k2089j9026j6000j2866r637o767m594k682l05K464M809O347
$$ y = [14850916, 14628988, 14334993, 13982279, 13585447, 13159071, 12717019, 12271718, 11833411, 11409816, 11006129, 10624989, 10266432, 9928025, 9604999, 9290380, 8975841, 8653763, 8319435, 7971967, 7613820, 7249868, 6886307, 6529278, 6183693, 5853010, 5539646, 5245095, 4969830, 4713663, 4476362, 4257638, 4056698, 3872320, 3703439, 3549234, 3408569, 3279838, 3161595, 3053069, 2953927, 2863844, 2782376, 2708901, 2642501, 2582155, 2527135, 2477034, 2431337, 2389244, 2349869, 2312296, 2275426, 2238181, 2199982, 2160732, 2120315, 2078528, 2035566, 1992048, 1948438, 1904841, 1861635, 1819803, 1780260, 1743159, 1708161, 1675160, 1644449, 1616393, 1591247, 1569158, 1550132, 1534132, 1521266, 1511629, 1504862, 1500268, 1497586, 1497281, 1499745, 1504554, 1510901]
59517A510901P597R110J0709J1916J2680J3334J4165J5240J6501J7838J9244K0954
59505A680189K3209K5929K8831L1868L5183L8762M2443M6288N0485N4960N9483
59494B117630O4244O9754P6038Q2392Q8175R3488R8789J04182J09237J13316J15898
59483C133143J16870J16582J15375J13037J09068J03587R7417R1087Q4162P5915
59473D156243O6374N6376M6887L8547L1670K6317K2399J9932J9066J9783K1781
59462D525375K4830K8980L4071L9215M3093M4771M3966M0531L3979K3699R579
59451D892089p690k6926m7098o7579q7810j06879j23724j37655j48433j55893
59441C982402j59784j60128j57455j52460j45628j37312j27964j18102j08102
$$ y = [1510901, 1518498, 1527608, 1538317, 1550233, 1562913, 1576247, 1590412, 1605652, 1622153, 1639991, 1659235, 1680189, 1703398, 1729327, 1758158, 1790026, 1825209, 1863971, 1906414, 1952702, 2003187, 2058147, 2117630, 2181874, 2251628, 2327666, 2410058, 2498233, 2591721, 2690510, 2794692, 2903929, 3017245, 3133143, 3250013, 3366595, 3481970, 3595007, 3704075, 3807662, 3905079, 3996166, 4080328, 4156243, 4222617, 4278993, 4325880, 4364427, 4396097, 4422414, 4444813, 4464745, 4483811, 4503594, 4525375, 4550205, 4579185, 4613256, 4652471, 4695564, 4740335, 4784301, 4824832, 4858811, 4882510, 4892089, 4884399, 4857473, 4810375, 4742796, 4654986, 4548107, 4424383, 4286728, 4138295, 3982402, 3822618, 3662490, 3505035, 3352575, 3206947, 3069635, 2941671, 2823569, 2715467]
59432B715467r8188q8508p9146p0102o1396n3110m5309l7909l0720k3561j6346
59421B111172r172k240M366J0769J7129K3464K9829L6429M3334N0201N6615O2618
59409B434514O8532P4287P9326Q3192Q5744Q6655Q5186Q0820P3754O4439N2907
59398C269356L8945K2796N326j2459k9829m6303o1497p4992q6251r4735j00343
59387B830014j03603j05169j05197j03430r9939r5454r0809q6266q1553p6485
59377A882109p1215o5949o0657n5318n0185m5580m1443l7415l3338k9420k5826
59366A365763k2434j9166j6188j3532j0828p776m673k066l1J821L680N342O723
59353A286635Q128R936J2186J4495J6181J6587J5681J4369J3856J4629J6330J8557
$$ y = [2715467, 2617279, 2528771, 2449625, 2379523, 2318127, 2265017, 2219708, 2181799, 2151079, 2127518, 2111172, 2102000, 2099760, 2104126, 2114895, 2132024, 2155488, 2185317, 2221746, 2265080, 2315281, 2371896, 2434514, 2503046, 2577333, 2656659, 2739851, 2825595, 2912250, 2997436, 3078256, 3152010, 3216449, 3269356, 3308301, 3331097, 3336423, 3323964, 3294135, 3247832, 3186335, 3111343, 3025092, 2930357, 2830014, 2726411, 2621242, 2516045, 2412615, 2312676, 2217222, 2126413, 2040147, 1958594, 1882109, 1810894, 1744945, 1684288, 1628970, 1578785, 1533205, 1491762, 1454347, 1421009, 1391589, 1365763, 1343329, 1324163, 1307975, 1294443, 1283615, 1275839, 1271166, 1269100, 1269069, 1270890, 1274570, 1279912, 1286635, 1294763, 1304699, 1316885, 1331380, 1347561, 1364148, 1379829, 1394198, 1408054, 1422683, 1439013, 1457570]
59341A457570K1336K4792K8826L3267L7882M2084M5132M6944M8428N0745N4465
59330A891471N9585O5980P3476Q1794R0753J00422J10861J21916J33516J45841
59320B875615J58909J72176J84933J96880K07929K17469K24282K27283K26177
59311D691653K21327K13206K02090J88196J72051J54644J37115J20233J04237
59302F204752Q9133P4914O1390M7998L3991J8882K601j4660l2668n1215o9949
59291F365169q8107j04553j18356j29353j37960j44556j49344j52784j55683j58597
59281E025876j61478j64060j66228j67814j68341j67385j65000j61470j56824
59272C547276j50904j43816j35961j27701j19176j10478j01744r3139q4855p7085
$$ y = [1457570, 1478906, 1503698, 1532524, 1565791, 1603673, 1645757, 1690889, 1737833, 1786261, 1837006, 1891471, 1951056, 2017036, 2090512, 2172306, 2263059, 2363481, 2474342, 2596258, 2729774, 2875615, 3034524, 3206700, 3391633, 3588513, 3796442, 4013911, 4238193, 4465476, 4691653, 4912980, 5126186, 5328276, 5516472, 5688523, 5843167, 5980282, 6100515, 6204752, 6293885, 6368799, 6430189, 6478187, 6512178, 6531060, 6533661, 6519001, 6486333, 6435118, 6365169, 6277062, 6172509, 6054153, 5924800, 5786840, 5642284, 5492940, 5340156, 5184473, 5025876, 4864398, 4700338, 4534110, 4366296, 4197955, 4030570, 3865570, 3704100, 3547276, 3396372, 3252556, 3116595, 2988894, 2869718, 2759240, 2657496, 2564357, 2479502, 2402417]
59262B402417o9836o2873n6006m9371m3243l7671l2451k7382k2434j7722j3413
59251A970015r548n898k132J746N322Q301J0856J3327J5717J7714J9108J9879
59239B064407K0052J9678J8914J7899J6554J4764J2650J0519Q577O887N548M770
59227B221219M736N540P200R551J2279J5193J8439K2249K6503L0760L4712L8422
59215B446803M2084M5623M8639N0598N1113M9993M7071M2073L4836K5695J5518
59204B900046N266m358j2915k0150k6060l0795l4306l6223l6311l4889l2590k9862
59192B606853k6849k3663k0471j7423j4672j2404j0688r353q216p331o782o331
59180B442670n506m111k356l87K052N394R773J4947K0675K7027L4274M2522N1557
$$ y = [2402417, 2332581, 2269708, 2213702, 2164331, 2121088, 2083417, 2050966, 2023584, 2001150, 1983428, 1970015, 1960467, 1954569, 1952437, 1954183, 1959505, 1967806, 1978662, 1991989, 2007706, 2025420, 2044528, 2064407, 2084459, 2104137, 2123051, 2140950, 2157504, 2172268, 2184918, 2195437, 2204014, 2210901, 2216449, 2221219, 2225955, 2231495, 2238695, 2248246, 2260525, 2275718, 2294157, 2316406, 2342909, 2373669, 2408381, 2446803, 2488887, 2534510, 2583149, 2633747, 2684860, 2734853, 2781924, 2823997, 2858833, 2884528, 2900046, 2905312, 2900954, 2888039, 2867889, 2841829, 2811034, 2776728, 2740505, 2704194, 2669305, 2636715, 2606853, 2580004, 2556341, 2535870, 2518447, 2503775, 2491371, 2480683, 2471330, 2463114, 2455783, 2449001, 2442670, 2437164, 2433053, 2430697, 2430310, 2432362, 2437756, 2447529, 2462476, 2483151, 2510178, 2544452, 2586974, 2638531]
59167B638531O1125P1217Q1894R2878J03538J13225J21427J27528J30689J30145
59157C672197J25438J16277J02397Q3779O0964L4939O781k2492n1777p9732j04856
59146C943915j25842j42081j53769j61345j64879j64332j60352j54272j47134
59137B569909j39116j30155j20672j11334j02386r3742q5511p7968p1125o4788
59127A573112n8949n3760m9147m4840m0774l7126l3877l0753k7607k4611k1933
59116A149735j9486j7086j4673j2294j0041q055o391m847l094j050J027K852M417
59103A061014N912P557R436J1452J3312J4775J5886J6953J8260J9862K1621K3343
59091A239383K4850K6051K6969K7708K8404K9197L0103L0842L0920L0017K8230
$$ y = [2638531, 2699656, 2770873, 2852767, 2945645, 3049183, 3162408, 3283835, 3411363, 3542052, 3672197, 3797635, 3913912, 4016309, 4100088, 4161052, 4195991, 4202772, 4180280, 4128503, 4048771, 3943915, 3818073, 3675992, 3522223, 3360878, 3195999, 3031667, 2871315, 2717043, 2569909, 2430793, 2300638, 2179966, 2068632, 1966246, 1872504, 1786993, 1709025, 1637900, 1573112, 1514163, 1460403, 1411256, 1366416, 1325642, 1288516, 1254639, 1223886, 1196279, 1171668, 1149735, 1130249, 1113163, 1098490, 1086196, 1076155, 1068100, 1061709, 1056862, 1053768, 1052718, 1053745, 1056597, 1061014, 1066926, 1074483, 1083919, 1095371, 1108683, 1123458, 1139344, 1156297, 1174557, 1194419, 1216040, 1239383, 1264233, 1290284, 1317253, 1344961, 1373365, 1402562, 1432665, 1463507, 1494427, 1524444, 1552674]
59080A552674K5859K3104K0057J6887J3812J0898Q078N316K688L43j450k418k481
59067A673367j869q50M97K227M379P041J0357J4292J8451K2473K6453L0784L5595
59054A843197M0550M5265M9677N3966N8281O2637O6971P1194P5119P8409Q0595
59043B525861Q1303Q0380P7740P3082O5958N6169M3996K9987J4749r95j6381l0620
59031C001229m3210n3919o2725o9843p5584q0078q3234q5036q5728q5667q5151
59020B191054q4382q3355q1764p9373p6455p3587p0913o8092o5018o2050n9335
59009A386730n6450n3070m9544m6366m3505m0696l8036l5758l3690l1487k9168
58998I28960k6972k4906k2879k1089j9723j8505j7051j5539j4468j3872j3351
$$ y = [1552674, 1578533, 1601637, 1621694, 1638581, 1652393, 1663291, 1671369, 1676685, 1679373, 1679716, 1678266, 1675848, 1673367, 1671498, 1670648, 1671145, 1673372, 1677751, 1684792, 1695149, 1709441, 1727892, 1750365, 1776818, 1807602, 1843197, 1883747, 1929012, 1978689, 2032655, 2090936, 2153573, 2220544, 2291738, 2366857, 2445266, 2525861, 2607164, 2687544, 2765284, 2838366, 2904324, 2960493, 3004489, 3034476, 3049225, 3048230, 3031849, 3001229, 2958019, 2904100, 2841375, 2771532, 2695948, 2615870, 2532636, 2447600, 2361872, 2276205, 2191054, 2106672, 2023317, 1941553, 1862180, 1785725, 1712138, 1641225, 1573133, 1508115, 1446065, 1386730, 1330280, 1277210, 1227666, 1181300, 1137795, 1097099, 1059063, 1023305, 989615, 958128, 928960, 901988, 877082, 854203, 833114, 813391, 794886, 777835, 762296, 747828, 733956, 720605]
58987G20605j2787j2441j2376j2320j2181j2108j2010j1562j0791j0165r882r557
58975E82425q840p889o998o171n301m486l834l240k552j803j109n00L6M68P83
58960E30989R87J017Q31N94N89Q41J085J110R75Q56Q33R40J212J658K254K936
58944E49707L548L932M154M464M838M842M210L383L048L285L596L655L600L606
58930F03868L631L667L832M121M386M638N052N630O170O591P000P358P449P251
58916F80644P068P178P578Q169Q940R877J0892J1912J2853J3543J3879J4011J4215
58903H20759J4640J5311J6207J7086J7511J7373J7195J7528J8238J8871J9454
58892A010173K0370K1597K2728K3748K5078K6816K8572L0227L2182L4622L7158
$$ y = [720605, 707818, 695377, 683001, 670681, 658500, 646392, 634382, 622820, 612029, 601864, 591982, 582425, 573585, 565696, 558698, 552527, 547226, 542740, 538906, 535666, 533114, 531311, 530202, 529702, 529738, 530206, 530989, 531976, 532993, 533824, 534418, 535007, 535848, 536933, 538043, 539018, 539874, 540707, 541647, 542859, 544517, 546771, 549707, 553255, 557187, 561341, 565805, 570643, 575485, 579695, 583078, 586126, 589411, 593007, 596662, 600262, 603868, 607499, 611166, 614998, 619119, 623505, 628143, 633195, 638825, 644995, 651586, 658586, 665944, 673393, 680644, 687712, 694890, 702468, 710637, 719577, 729454, 740346, 752258, 765111, 778654, 792533, 806544, 820759, 835399, 850710, 866917, 884003, 901514, 918887, 936082, 953610, 971848, 990719, 1010173, 1030543, 1052140, 1074868, 1098616, 1123694, 1150510, 1179082, 1209309, 1241491, 1276113, 1313271]
58881A313271L9501M1965M4954M8392N1998N5759N9726O3733O7672P1816P6533
58870A935320Q1874Q7666R3841J00456J07581J15322J23785J32926J42581J52727
58860C074079J63477J74806J86572J98841K11777K25117K38107K50119K60926
58851D983821K70175K76945K80105K78874K72727K60928K42464K16515J83009
58842G265563J42834R7627M9214o50n0089r6973j39410j76243k06807k30544k47321
58831F407201k57855k63195k63887k60250k53283k44457k34523k23308k10831
58822D195612j97858j85081j72626j60628j49602j39768j30652j21885j13817
58813B823695j06865j00807r5142q9748q4635p9525p4221o9023o4262n9750n5128
$$ y = [1313271, 1352772, 1394737, 1439691, 1488083, 1540081, 1595840, 1655566, 1719299, 1786971, 1858787, 1935320, 2017194, 2104860, 2198701, 2299157, 2406738, 2522060, 2645845, 2778771, 2921352, 3074079, 3237556, 3412362, 3598934, 3797775, 4009552, 4234669, 4472776, 4722895, 4983821, 5253996, 5530941, 5811046, 6089920, 6362647, 6623575, 6866039, 7082554, 7265563, 7408397, 7506024, 7555238, 7554588, 7504499, 7407526, 7268116, 7091873, 6885066, 6654522, 6407201, 6149346, 5886151, 5622264, 5362014, 5108731, 4864274, 4629751, 4406443, 4195612, 3997754, 3812673, 3640047, 3479419, 3329817, 3190049, 3059397, 2937512, 2823695, 2716830, 2616023, 2520881, 2431133, 2346498, 2266973, 2192752, 2123729, 2059467, 1999717, 1944589]
58802A944589n0523m6330m2585l9042l5633l2457k9452k6478k3570k0783j7945
58791A579791j4863j1585q231m829j501J466M047O675R673J2867J5994J9171K2607
58778A631282K6116K9412L2588L5981L9721M3732M7957N2270N6434O0456O4725
58767B120674O9553P4807Q0297Q6154R2549R9348J06482J14305J23205J33078
58757C100452J43547J54504J66051J78180J90821K03947K17258K30016K41519
58748D826295K51514K59717K65209K66729K63303K54216K38635K15802J85590
58739G027010J48587J05816N8701R205m0427q8051j31785j70119k02204k27848
58729F488885k47070k59930k66910k68976k67026k61605k53427k43585k32858
$$ y = [1944589, 1894066, 1847736, 1805151, 1766109, 1730476, 1698019, 1668567, 1642089, 1618519, 1597736, 1579791, 1564928, 1553343, 1545112, 1540283, 1538782, 1540248, 1544295, 1550970, 1560643, 1573510, 1589504, 1608675, 1631282, 1657398, 1686810, 1719398, 1755379, 1795100, 1838832, 1886789, 1939059, 1995493, 2055949, 2120674, 2190227, 2265034, 2345331, 2431485, 2524034, 2623382, 2729864, 2844169, 2967374, 3100452, 3243999, 3398503, 3564554, 3742734, 3933555, 4137502, 4354760, 4584776, 4826295, 5077809, 5337526, 5602735, 5869464, 6132767, 6386983, 6625618, 6841420, 7027010, 7175597, 7281413, 7340114, 7349319, 7308892, 7220841, 7089056, 6918937, 6716733, 6488885, 6241815, 5981885, 5714975, 5445999, 5178973, 4917368, 4663941, 4420356, 4187498]
58720D187498k21337k09159j97053j85593j74489j63289j52403j42686j34275
58711B607214j26565j19108j11882j04876r8097r1815q6230q0985p5641p0431
58701A641584o5936o2118n8331n4251n0162m6358m2857l9734l7132l4879l2572
58690A117254l0113k7773k5696k3796k2063k0592j9295j7996j6759j5756j4929
58679H82486j4152j3515j3082j2487j1403j0205r587r601r663r477r296r307r309
58666G41402r178r140r391r872j0483j1166j1751j2096j2380j2845j3322j3383
58654F06395j2952j2340j1755j1219j0923j1092j1460j1391j0667r692q867q181
58642D75856p518o967o634o474o437o527o639o584o284n777n135m601m536m922
$$ y = [4187498, 3966161, 3757002, 3559949, 3374356, 3199867, 3036578, 2884175, 2741489, 2607214, 2480649, 2361541, 2249659, 2144783, 2046686, 1954871, 1868641, 1787656, 1712015, 1641584, 1575648, 1513530, 1455199, 1400948, 1350786, 1304428, 1261571, 1221837, 1184705, 1149826, 1117254, 1087141, 1059368, 1033672, 1009876, 987813, 967221, 947926, 929930, 913171, 897415, 882486, 868334, 854819, 841737, 829250, 817847, 807642, 798055, 788454, 778791, 769314, 760018, 750711, 741402, 732224, 723084, 713693, 703821, 693338, 682172, 670421, 658325, 645945, 633100, 619778, 606395, 593443, 581103, 569348, 558129, 547206, 536114, 524654, 513263, 502596, 492904, 484037, 475856, 468338, 461371, 454737, 448263, 441826, 435299, 428660, 422076, 415792, 410015, 404880, 400279, 395743, 390821]
58628C90821n169m774l990l327k713j741n94L6lj04J46M08K20l17p59q88q07p46
58610C65699r16j317j695j806j699j488j098n10n4po5K22O59O50J73j10K10Q44
58592C57692J372J727J951J989J928K112K791L907N241O519P439P920Q253Q754
58578D19595R407J0112J1084J2466J3845J4739J5353J6263J7498J8674J9889K1668
58566F00593K3953K6037K7716K9688L2516L5863L9149M2425M6118N0341N4880
58555A009279N9550O4197O8588P2522P5966P8897Q1109Q2103Q1038P6936O9363
58544A819548N8787M6036L1516J5436j413j7733l2499m5197n5411o2820o7643
58533A688607p0464p1584p1049o9216o6662o3551n9714n5363n1047m6895m2649
$$ y = [390821, 385652, 380878, 376888, 373561, 370848, 369107, 368513, 368549, 368546, 368442, 368588, 368996, 369216, 368899, 368140, 367252, 366445, 365699, 364783, 363466, 361771, 359965, 358266, 356778, 355680, 355170, 355116, 355109, 355044, 355266, 355925, 356575, 356748, 356638, 356848, 357692, 359064, 360791, 362742, 364731, 366659, 368771, 371562, 375469, 380710, 387229, 394668, 402588, 410841, 419595, 429002, 439114, 450198, 462664, 476509, 491248, 506601, 522864, 540362, 559036, 578925, 600593, 624546, 650583, 678299, 707987, 740503, 776366, 815515, 857940, 904058, 954399, 1009279, 1068829, 1133026, 1201614, 1274136, 1350102, 1428999, 1510108, 1592211, 1673249, 1750185, 1819548, 1878335, 1924371, 1955887, 1971323, 1969910, 1952177, 1919678, 1874481, 1819070, 1756250, 1688607, 1618143, 1546559, 1475510, 1406294, 1339632, 1276081, 1216367, 1161004, 1109957, 1063062, 1020413]
58522A020413l8457l4879l1905k8833k5401k2290k0161j8866j7966j7385j7113
58511G47157j6817j6238j5573j5089j4684j4157j3583j3140j2846j2697j2771
58500E89562j3024j3215j3170j2861j2317j1721j1506j1839j2147j1676j0477
58489D55609r299q574q110p716p384o930o144n328m977m876m381l593l325l761
58475C71211m088l772l237k917k511j761j110j019j213j248j253j567k082k452
58461C40981k593k613k587k683l123l749m086l990l833l853l888l854l892l890
58447B92347l447k605j980j951k239k489k629k528j989j291j022j205j291j131
58433B64550j119j239r91m40l26p62q86l52J0m28j043j057p35o76p21m56q1L0
$$ y = [1020413, 981956, 947077, 915172, 886339, 860938, 838648, 818487, 799621, 781655, 764270, 747157, 730340, 714102, 698529, 683440, 668756, 654599, 641016, 627876, 615030, 602333, 589562, 576538, 563323, 550153, 537292, 524975, 513254, 501748, 489909, 477762, 466086, 455609, 446310, 437736, 429626, 421910, 414526, 407596, 401452, 396124, 391147, 386271, 381890, 378297, 374972, 371211, 367123, 363351, 360114, 357197, 354686, 352925, 351815, 350796, 349583, 348335, 347082, 345515, 343433, 340981, 338388, 335775, 333188, 330505, 327382, 323633, 319547, 315557, 311724, 307871, 303983, 300129, 296237, 292347, 288900, 286295, 284315, 282364, 280125, 277636, 275007, 272479, 270490, 269199, 268177, 266972, 265681, 264550, 263431, 262192, 261201, 260761, 260435, 259673, 258787, 258435, 258445, 258017, 256974, 255917, 255182, 254506, 253785, 253329, 253248, 253278]
58415B53278P4L51O08N39L73L05Oo73j069o37J45N11M91N32O11N18N47J046J679
58396B59235J886J720J563J373R19L56o5m94j125j718k057k373k800k934k519
58381B50967k046k023k144j894j456j304j341j200j006j121j451j613j506j204
58367B29658p12k45k20n03l10N85J247Q98J58P8O56J142J332J534J750J759J784
58350B40591K158K624K747K727L053L599L843L727L602L537L341L085K969K918
58336B84521K738K452K068J439P33M54O06M89k11q71r71r11j056r40k01M74L79
58319B91192nJ44O06O55M32N93J065J247J162J301J643J742J637J732J972J985
58303C09103J836J857J993J992J990K205K394K236J874J583J305J027J065J406
$$ y = [253278, 253352, 253703, 254311, 254850, 255223, 255528, 255534, 254861, 253792, 253155, 253300, 253811, 254302, 254834, 255445, 255963, 256510, 257556, 259235, 261121, 262841, 264404, 265777, 266696, 267052, 266987, 266493, 265368, 263650, 261593, 259220, 256420, 253486, 250967, 248921, 246898, 244754, 242860, 241404, 240100, 238759, 237559, 236553, 235432, 233981, 232368, 230862, 229658, 228946, 228701, 228481, 227978, 227668, 228253, 229500, 230398, 230556, 230634, 231290, 232432, 233764, 235298, 237048, 238807, 240591, 242749, 245373, 248120, 250847, 253900, 257499, 261342, 265069, 268671, 272208, 275549, 278634, 281603, 284521, 287259, 289711, 291779, 293218, 293951, 294405, 295011, 295500, 295289, 294418, 293447, 292536, 291480, 290540, 290339, 290813, 291192, 291187, 291331, 291937, 292592, 293024, 293617, 294682, 295929, 297091, 298392, 300035, 301777, 303414, 305146, 307118, 309103, 310939, 312796, 314789, 316781, 318771, 320976, 323370, 325606, 327480, 329063, 330368, 331395, 332460, 333866]
58289C33866J480J094Q67J106J185P90P17J524K400K414J959J871K008J880J804
58274C56965K220K644K577K596L300M012L911L595M070M944N153M819M828N132
58260D10766N033M679M755N091N062M932N353N966N931N421N228N340N215N041
58246D83813N300N656N550N411N891O549O677O741P529Q553Q891Q879R382J0094
58232E84916J0219J0151J0736J1589J1865J2026J2955J4085J4284J3929J4173
58221G20928J4813J4894J4725J5283J6209J6498J6575J7558J9064J9893K0312
58210I06752K1439K3013K3999K4849K6732K9149L0656L1472L2928L4899L6250
58199A222138L7240L9034M1293M2860M4177M6462M9113N0694N1818N4164N7261
$$ y = [333866, 335346, 336440, 337307, 338413, 339598, 340388, 341105, 342629, 345029, 347443, 349402, 351273, 353281, 355161, 356965, 359185, 361829, 364406, 367002, 370302, 374314, 378225, 381820, 385890, 390834, 395987, 400806, 405634, 410766, 415799, 420478, 425233, 430324, 435386, 440318, 445671, 451637, 457568, 462989, 468217, 473557, 478772, 483813, 489113, 494769, 500319, 505730, 511621, 518170, 524847, 531588, 539117, 547670, 556561, 565440, 574822, 584916, 595135, 605286, 616022, 627611, 639476, 651502, 664457, 678542, 692826, 706755, 720928, 735741, 750635, 765360, 780643, 796852, 813350, 829925, 847483, 866547, 886440, 906752, 928191, 951204, 975203, 1000052, 1026784, 1055933, 1086589, 1118061, 1150989, 1185888, 1222138, 1259378, 1298412, 1339705, 1382565, 1426742, 1473204, 1522317, 1573011, 1624829, 1678993, 1736254]
58188A736254N9263O0371O2401O5456O8171P0789P4756P9723Q4173Q8550R4457
58177B544364J01295J07092J12123J18201J25092J31288J37601J46028J55853
58168C678937J64984J74395J86802K01719K16523K31660K49789K70407K90634
58159E665850L10871L34233L60691L87456M14777M45570M79594N14157N50177
58150I463376N91158O36695O83920P34839P94955Q65406R44560J036668J150332
58141A6901909J289233J453594J649524J886487K167313K492439K871310L314715
58133C4026524L817332M363519M948043N576926O261495P034770P929783Q833968
58125H2792360R323882Q757467O702917L356239m88722l914835o356735p714970
$$ y = [1736254, 1795517, 1855888, 1918289, 1983745, 2051916, 2122705, 2197461, 2277184, 2361357, 2449907, 2544364, 2645659, 2752751, 2864874, 2983075, 3108167, 3239455, 3377056, 3523084, 3678937, 3843921, 4018316, 4205118, 4406837, 4623360, 4855020, 5104809, 5375216, 5665850, 5976721, 6310954, 6671645, 7059101, 7473878, 7919448, 8399042, 8913199, 9463376, 10054534, 10691229, 11375149, 12109988, 12904943, 13770349, 14714909, 15751577, 16901909, 18191142, 19644736, 21294260, 23180747, 25348060, 27840499, 30711809, 34026524, 37843856, 42207375, 47155418, 52732344, 58993839, 66028609, 73958392, 82792360, 92116242, 100873709, 107576626, 110932865, 110444143, 106529308, 100172573, 92457603]
58117I2457603q174334q003986p466871o782076o091648n455245m880858m356822
58109D1245763l866904l401263k964725k569760k221531j915057j643062j398851
58101B1264610j174370r62744p61868n72219l93929k25533n8435J22439L10063
58092A7548014M38988M04560J50482k62197o90301j012606j191693j251105j226673
58083A2907469j148854j045905r39875q40378p49598o69469n99961n37055m78214
58074E898160m25833l81754l43243l07702k76665k51725k30855k11831j95483
58065C273069j82603j71270j59907j49562j40904j32212j22477j13336j05915
58056A994883r8820r1088q4053p8587p3550o8676o5850o5711o5897o4436o2188
$$ y = [92457603, 84283269, 76279283, 68812412, 62030336, 55938688, 50483443, 45602585, 41245763, 37378859, 33977596, 31012871, 28443111, 26221580, 24306523, 22663461, 21264610, 20090240, 19127496, 18365628, 17793409, 17399480, 17173947, 17115512, 17237951, 17548014, 17987002, 18391562, 18542044, 18279847, 17589546, 16576940, 15385247, 14134142, 12907469, 11758615, 10712710, 9772835, 8932457, 8182859, 7513390, 6913429, 6376374, 5898160, 5472327, 5090573, 4747330, 4439628, 4162963, 3911238, 3680383, 3468552, 3273069, 3090466, 2919196, 2759289, 2609727, 2468823, 2336611, 2214134, 2100798, 1994883, 1896063, 1804975, 1720922, 1642335, 1568785, 1500109, 1434259, 1368548, 1302651, 1238215, 1176027]
58045A176027o0187n7383n2908m8047m4104m0527l6743l3628l1621k9568k6879
58034G14432k4769k3964k3302k1922k0747k0422j9891j8412j7002j6456j5879
58023D91666j4530j3265j2842j2512j1612j0807j0546j0021q855q138q526q928
58011C61084q369p517p194o924o191n624n687n644m947m314m339m368l853l455
57997B82658l753m143m040l920m161m148l504k943k951k899k331j886k001k075
57983B37903j728j632k099k231j456o05m36m05R6N54M22K18M34N12m6o75q29r70
57965B27027j468j671j114n02n02o24l77l64j121j955k048j780j820j913j651
57950B08117j493j900k350k276k116k353k504k146j939k480l065k810k176k073
$$ y = [1176027, 1115840, 1058457, 1005549, 957502, 913398, 872871, 836128, 802500, 770879, 741311, 714432, 689663, 665699, 642397, 620475, 599728, 579306, 559415, 541003, 524001, 507545, 491666, 477136, 463871, 451029, 438517, 426905, 416098, 405552, 395531, 386676, 378538, 370012, 361084, 352715, 345198, 338004, 331080, 324889, 319265, 313578, 307934, 302987, 298673, 294334, 289966, 286113, 282658, 278905, 274762, 270722, 266802, 262641, 258493, 254989, 252046, 249095, 246196, 243865, 241979, 239978, 237903, 236175, 234543, 232444, 230213, 228757, 228152, 227716, 227311, 227407, 227961, 228383, 228601, 229035, 229547, 229501, 228826, 227997, 227027, 225559, 223888, 222774, 222272, 221770, 221146, 220769, 220405, 219284, 217329, 215281, 213501, 211681, 209768, 208117, 206624, 204724, 202374, 200098, 197982, 195629, 193125, 190979, 189040, 186560, 183495, 180685, 178509, 176436]
57936A76436k278k032j515j397j565j517j454j753j872j091J29P32O52O73J040
57921A63188J308J331J328J224Q24M38M74O70N44K51K19K80on19q54j066j374
57904A68260j554j370j159j264j316r33o08r91j740k034j850j783j893j718j258
57889A46789r89j022j020q39n90k60J54L60K23J85O02J056R99O33M80M86K80m3
57871A47484k49n78j280j917k028j998k388k810k516j755j435j619j481p40l7
57856A24653J99K53L96N07O17J011J580J814J594J363J434J647J833K006K065
57841A42972J850J530J435J459J215P23L27J2n46j234j533j374j329j718k167
57826A41622k277k196k215k270k131j798j478j338j394j499j407j029n67k26O2
$$ y = [176436, 174158, 172126, 170611, 169214, 167649, 166132, 164678, 162925, 161053, 159962, 160091, 160823, 161475, 162148, 163188, 164496, 165827, 167155, 168379, 169203, 169641, 170115, 170785, 171329, 171580, 171799, 172079, 172073, 171554, 170700, 169634, 168260, 166706, 165336, 164177, 162913, 161597, 160664, 160056, 159065, 157325, 155291, 153441, 151658, 149765, 148047, 146789, 145800, 144778, 143758, 142919, 142329, 142069, 142223, 142583, 142806, 142991, 143593, 144649, 145648, 146281, 146761, 147247, 147527, 147484, 147235, 146657, 145377, 143460, 141432, 139434, 137046, 134236, 131720, 129965, 128530, 126911, 125430, 124690, 124653, 124852, 125105, 125501, 126008, 126625, 127636, 129216, 131030, 132624, 133987, 135421, 137068, 138901, 140907, 142972, 144822, 146352, 147787, 149246, 150461, 151184, 151511, 151523, 150977, 149743, 148210, 146836, 145507, 143789, 141622, 139345, 137149, 134934, 132664, 130533, 128735, 127257, 125919, 124525, 123026, 121619, 120590, 120023, 119797, 119859]
57811A19859M26P10P01N35N39P59R76J068J109J172J299J524J709J589J175Q25
57795A35975O62L17l63q35n85J2J53l31r39j330j576j760j892k101k470k737k623
57778A17577k328k230k288k228k094k072j980j523q90n48n28n60p40j382k266
57763I3920k699k472k080j971k046k067k014j885j625j379j430j750j989j961
57749F6552j802j653j472j268j069p88l67k0L1kK42P02J037J226J553J969K090
57732F6961J821J502J355J203Q91N41L24K92N04R26J207R62L06k52m63n42o82
57715G6856q02q10p77p33o48o40q46j068q95l07K25L18Q5q1P9N16R20R23N28J96
57695G3039L41Q02J173J349J464J464J247J075J292J665J570R06K87K56O82J123
$$ y = [119859, 120285, 120995, 121696, 122231, 122770, 123529, 124505, 125573, 126682, 127854, 129153, 130677, 132386, 133975, 135150, 135975, 136637, 136954, 136591, 135756, 135171, 135183, 135336, 135005, 134066, 132736, 131160, 129400, 127508, 125407, 122937, 120200, 117577, 115249, 113019, 110731, 108503, 106409, 104337, 102357, 100834, 99944, 99396, 98868, 98308, 97568, 96186, 93920, 91221, 88749, 86669, 84698, 82652, 80585, 78571, 76686, 75061, 73682, 72252, 70502, 68513, 66552, 64750, 63097, 61625, 60357, 59288, 58500, 58133, 58113, 58144, 58142, 58384, 59086, 60123, 61349, 62902, 64871, 66961, 68782, 70284, 71639, 72842, 73733, 74274, 74598, 74890, 75394, 76320, 77527, 78489, 78795, 78543, 78080, 77538, 76856, 76054, 75244, 74467, 73734, 73086, 72446, 71600, 70532, 69637, 69330, 69555, 69873, 69958, 69877, 69956, 70472, 71392, 72315, 72843, 73039, 73380, 74182, 75355, 76704, 78168, 79632, 80879, 81954, 83246, 84911, 86481, 87387, 87674, 87930, 88612, 89735]
57679H9735J321J271J121J119J412J808J988J945J946K108K324K542K760K899
57665A16299K960L215L836M463M612M382M320M601M908N048N162N318N455N726
57651A80305O367P163P614P689P890Q437Q996R396R977J0976J2069J2896J3587
57638C03362J4451J5496J6613J7922J9602K1550K3523K5428K7316K9286L1516
57627E46065L4231L7455M0983M4660M8561N2811N7372O2009O6283O9681P1899
57616A132010P2940P2615P0253O5269N7922M9079L9405K9297J9312R863K78j0932
57604A607311k4486l9320n3312o4567p1927p5047p4511p1582o7415o2606n7528
57593I45010n2563m7799m2943l7905l3124k9032k5526k2281j9234j6465j3893
$$ y = [89735, 91056, 92327, 93448, 94567, 95979, 97787, 99775, 101720, 103666, 105774, 108098, 110640, 113400, 116299, 119259, 122474, 126310, 130773, 135385, 139767, 144087, 148688, 153596, 158644, 163806, 169124, 174579, 180305, 186672, 193835, 201449, 209138, 217028, 225465, 234461, 243857, 253834, 264810, 276879, 289775, 303362, 317813, 333309, 349922, 367844, 387446, 408996, 432519, 457947, 485263, 514549, 546065, 580296, 617751, 658734, 703394, 751955, 804766, 862138, 924147, 990430, 1060111, 1132010, 1204950, 1277565, 1347818, 1413087, 1471009, 1520088, 1559493, 1588790, 1608102, 1617965, 1618243, 1607311, 1582825, 1543505, 1490193, 1425626, 1353699, 1278652, 1204141, 1132559, 1065144, 1002538, 945010, 892447, 844648, 801705, 763800, 730676, 701644, 676118, 653837, 634603, 618138, 604245]
57582F04245j1443r250p354n435l193q27J224K899M617O745R230J1769J4219J6743
57568F34189J9569K2622K5564K8256L0971L3963L7100M0200M3391M6706M9537
57557A012068N1094N1214N0092M7378M2358L5002K6064J5985M598p783j9797l0114
57545A278159l8424m4977m9783n2822n4457n5025n4385n2491m9961m7494m5045
57534G33295m2260l9327l6777l4628l2401k9957k7662k5742k4006k2245k0492
57523C97798j8793j7088j5419j3938j2717j1727j0987j0473r979r273q360p448
57511B51596o674o045n540n061m465l801l338l161k961k433j699j065n53L5P34
57496B05569J417K040K613L047L278L501L945M567N131N611O186O939P723Q375
$$ y = [604245, 592802, 583552, 576198, 570763, 567570, 566743, 567967, 570866, 575483, 582228, 591458, 603227, 617446, 634189, 653758, 676380, 701944, 730200, 761171, 795134, 832234, 872434, 915825, 962531, 1012068, 1063162, 1114376, 1164468, 1211846, 1254204, 1289206, 1315270, 1331255, 1335853, 1328070, 1308273, 1278159, 1239735, 1194758, 1144975, 1092153, 1037696, 982671, 928286, 875795, 825834, 778340, 733295, 691035, 651708, 614931, 580303, 547902, 517945, 490283, 464541, 440535, 418290, 397798, 379005, 361917, 346498, 332560, 319843, 308116, 297129, 286656, 276677, 267404, 259044, 251596, 244922, 238877, 233337, 228276, 223811, 220010, 216672, 213511, 210550, 208117, 206418, 205353, 204800, 204835, 205569, 206986, 209026, 211639, 214686, 217964, 221465, 225410, 229977, 235108, 240719, 246905, 253844, 261567, 269942]
57482B69942Q879R432J0318J1658J3180J4471J5500J6666J8245K0056K1908K3972
57470D54227K6445K9088L1479L3533L5468L7355L9017M0231M0794M0475L9074
57459H47186L6451L2377K6518J8886J0090R60p929j6173k3309k8966l3131l6024
57447H26936l7797l8598l8640l7950l6329l3854l1150k8807k6727k4497k2189
57436D70398k0269j8760j7113j5024j2924j1375j0339r286p904o390n041l810
57424C32163k397p39Q52K129L285M621O030P187Q194R539J1379J3374J5319J7398
57410D28334J9644K1718K3530K5525K7957L0392L2391L4123L5773L6788L6434
57399G52609L4679L1822K7580K1317J3135L950n400j4479k2794k9760l5226l9442
$$ y = [269942, 278821, 288253, 298571, 310229, 323409, 337880, 353380, 370046, 388291, 408347, 430255, 454227, 480672, 509760, 541239, 574772, 610240, 647595, 686612, 726843, 767637, 808112, 847186, 883637, 916014, 942532, 961418, 971508, 972468, 964539, 948366, 925057, 896091, 862960, 826936, 789139, 750541, 711901, 673951, 637622, 603768, 572618, 543811, 517084, 492587, 470398, 450129, 431369, 414256, 399232, 386308, 374933, 364594, 355308, 347404, 341014, 335973, 332163, 329766, 329027, 329879, 332008, 335293, 339914, 345944, 353131, 361325, 370864, 382243, 395617, 410936, 428334, 447978, 469696, 493226, 518751, 546708, 577100, 609491, 643614, 679387, 716175, 752609, 787288, 819110, 846690, 868007, 881142, 885092, 879692, 865213, 842419, 812659, 777433, 737991]
57387G37991m2402m3853m3913m3105m1684l9565l6969l4512l2469l0522k8433
57376C20564k6449k4765k3183k1523j9942j8546j7130j5617j4322j3441j2670
57365A12976j1640j0467r519q895q407p884p240o469n746n332n201n029m673m384
57351A2090m352C385g40l794l609l557l452l286l140k979k726k492k397k329k093
57336c6594j750j563j632j797j836j645j237p40l65k86n16r01j203j258j138j117
57320e5578j343j585j517j173q91q11p94p67q67j131j391j542j625j580j251p64
57304g4610n34p00r08q80q33j002j156r54n33l27m00m17k28n3j01k54l00k06j19
57285h4515j85m06o27o44m00p4J26J34L2q4j02M4K90M64N00M94N32O16P47R13
$$ y = [737991, 695589, 651736, 607823, 564718, 523034, 483469, 446500, 411988, 379519, 348997, 320564, 294115, 269350, 246167, 224644, 204702, 186156, 169026, 153409, 139087, 125646, 112976, 101336, 90869, 81350, 72455, 64048, 56164, 48924, 42455, 36709, 31377, 26176, 21147, 16474, 12090, 7738, 3385, -740, -4534, -8143, -11700, -15152, -18438, -21578, -24557, -27283, -29775, -32172, -34501, -36594, -38344, -39907, -41539, -43336, -45172, -46817, -48054, -48794, -49159, -49445, -49961, -50862, -52065, -53323, -54461, -55578, -56921, -58506, -60023, -61196, -62087, -62898, -63692, -64459, -65326, -66457, -67848, -69390, -71015, -72595, -73846, -74610, -75144, -75844, -76752, -77632, -78465, -79467, -80623, -81577, -82110, -82437, -82837, -83254, -83482, -83535, -83636, -83890, -84190, -84396, -84515, -84700, -85106, -85733, -86377, -86777, -86851, -86725, -86591, -86559, -86643, -86745, -86701, -86411, -85947, -85447, -84953, -84421, -83805, -83058, -82145]
57265h2145R40O30J41q4J18L97M22L40M76P93R57P71L34r8j91K12Q14R80M86j66
57245g3873m19l69m19n25l02K96Q89J256J489J619J554J438J636K251K970L495
57229e7014L853M186M586N172N972O747P207P436d132C896Q068P877P820P863
57215C5524P443O331M970L707K209J08k256m322o110p967r759j1030G067e382
57200a8505j3343j2903j2165j1536j1017j0488r979r486q900q327q102q294q444
57187a51489q169p679p432p506p602p565p507p488p452p392p372p304o996o474
57173b55427o044n860n721n405n049m985n228n424n346n186n211n287n058m520
57159c29751m102m032l951l358k255j061k1J019K215L364M083M215L984L774L724
$$ y = [-82145, -81205, -80575, -80434, -80518, -80400, -80003, -79581, -79241, -78765, -77972, -77015, -76244, -75910, -76008, -76199, -75987, -75173, -74193, -73707, -73873, -74292, -74661, -75080, -75605, -75907, -75611, -74722, -73466, -71977, -70358, -68804, -67366, -65730, -63479, -60509, -57014, -53161, -48975, -44389, -39217, -33245, -26498, -19291, -11855, -4132, 3896, 11964, 19841, 27661, 35524, 42967, 49298, 54268, 57975, 60184, 60292, 58036, 53714, 47604, 39637, 29878, 18848, 7067, -5382, -18505, -31848, -44751, -56916, -68452, -79469, -89957, -99936, -109422, -118322, -126649, -134751, -143045, -151489, -159658, -167337, -174769, -182275, -189877, -197442, -204949, -212437, -219889, -227281, -234653, -241957, -248953, -255427, -261471, -267331, -273052, -278457, -283506, -288491, -293719, -299143, -304489, -309675, -314886, -320173, -325231, -329751, -333853, -337885, -341836, -345194, -347449, -348510, -348531, -347512, -345297, -341933, -337850, -333635, -329651, -325877, -322153]
57144c22153L556K940K025J426J386J369P63k17q80j155j673k707l695m169m502
57129c27686n300o460p383p887q348r043r835j0505j1084j1772j2755j4062j5402
57116d57522j6285j6492j6356j6373j6712j7296j8164j9397k0861k2336k3874
57105f61668k5631k7523k9342l1155l3204l5409l7361l8853m0132m1578m3403
57094a045259m5679m8357n1250n4254n7638o1798o6723p1907p6875q1548q6125
57083a747413r0807r5661j00587j05360j09878j14353j19105j24334j30169j36791
57073b874458j44244j52271j60693j69790j80032j91520k04016k17371k31670
57064d526065k47039k63634k81730l01527l23050l46502l72567m02100m35787
$$ y = [-322153, -318597, -315657, -313632, -312206, -310820, -309451, -308688, -308905, -309785, -310940, -312613, -315320, -319015, -323184, -327686, -332986, -339446, -346829, -354716, -363064, -372107, -381942, -392447, -403531, -415303, -428058, -442120, -457522, -473807, -490299, -506655, -523028, -539740, -557036, -575200, -594597, -615458, -637794, -661668, -687299, -714822, -744164, -775319, -808523, -843932, -881293, -920146, -960278, -1001856, -1045259, -1090938, -1139295, -1190545, -1244799, -1302437, -1364235, -1430958, -1502865, -1579740, -1661288, -1747413, -1838220, -1933881, -2034468, -2139828, -2249706, -2364059, -2483164, -2607498, -2737667, -2874458, -3018702, -3170973, -3331666, -3501456, -3681488, -3873008, -4077024, -4294395, -4526065, -4773104, -5036738, -5318468, -5619995, -5943045, -6289547, -6662114, -7064214, -7500001]
57055g500001m74355n18686n69393o26721o91353p64894q49054r44836j053021
57046a3992314j174903j311925j465558j638736j837227k068917k342640k668963
57038b8501183l061694l537780m116723m821188n676169o703917p918180r322723
57030g3659557j0911672j2666243j4550070j6509278j8475127k0362763k2068951
57023a89203661k3474375k4440092k4784407k4263240k2609832j9652681j5443378
57016c43871666j0292754m683477Q76481N973189J0343309J3879409J6601771
57009c11173738J8607613K0013691K0912142K1350798K1339243K0876899J9990096
57002a68083256J8753781J7280835J5689002J4073180J2498841J1009355R633195
$$ y = [-7500001, -7974356, -8493042, -9062435, -9689156, -10380509, -11145403, -11994457, -12939293, -13992314, -15167217, -16479142, -17944700, -19583436, -21420663, -23489580, -25832220, -28501183, -31562877, -35100657, -39217380, -44038568, -49714737, -56418654, -64336834, -73659557, -84571229, -97237472, -111787542, -128296820, -146771947, -167134710, -189203661, -212678036, -237118128, -261902535, -286165775, -308775607, -328428288, -343871666, -354164420, -358847897, -357971416, -351998227, -341654918, -327775509, -311173738, -292566125, -272552434, -251640292, -230289494, -208950251, -188073352, -168083256, -149329475, -132048640, -116359638, -102286458, -89787617, -78778262, -69145067]
56995f9145067Q386778P275998O298358N445535M706337M069429L524242L060123
56987b6378267K666052K331631K047772J806213J599302J420765J266153J132149
56979a2108230J015822R14662Q26646P49758O81769O20750N65607N15971M71677
56970e745568M32355L97171L64976L34985L07256K82216K59838K39633K21292
56961b905846K04820J90096J76814J64875J54339J44903J35837J26651J17419
56952a490092J08384R9488R0457Q1091P1353O1332N1176M0831K9957J8413O944
56941h30666l007j0457j5674j9543k2040k1619j6501o771M928J5175K2167K6263
56929h77745K8487K9291K8841K7662K6286K4666K2525K0039J7649J5408J3074
$$ y = [-69145067, -60758289, -53482291, -47183933, -41738398, -37032061, -32962632, -29438390, -26378267, -23712215, -21380584, -19332812, -17526599, -15927297, -14506532, -13240379, -12108230, -11092408, -10177746, -9351100, -8601342, -7919573, -7298823, -6733216, -6217245, -5745568, -5313213, -4916042, -4551066, -4216081, -3908825, -3626609, -3366771, -3127138, -2905846, -2701026, -2510930, -2334116, -2169241, -2014902, -1869999, -1734162, -1607511, -1490092, -1381708, -1282220, -1191763, -1110672, -1039319, -977987, -926811, -885980, -856023, -837610, -830666, -833673, -844130, -859804, -879347, -901387, -923006, -939507, -946278, -941350, -926175, -904008, -877745, -849258, -819967, -791126, -763464, -737178, -712512, -689987, -669948, -652299, -636891, -623817]
56918f23817J0767Q960P817O993O197N561N368N699O438P388Q362R291J0302J1530
56904e13144J2863J4013J4775J5174J5379J5569J5721J5551J4855J3916J3223
56893c52105J2757J1993J0772R635Q975Q386P326O012N079M643M330M018L960
56880b54219M259M716N171N580N826N825N764N854O020O135O363O785O958O341
56866a72622N064L708K526J384M11l7k0pq8J63R03J624J792J508J263J339J628
56849a49461J822J667J221Q70R01J128J229J286J606K113K421K480K667L181L807
56834a21062M360M915N469N843O028O291O766P289P745Q202Q570Q429P458N805
56820b7892L939K323J227O49L46J25R6M08R23J447K078K956L787c424H03M521
$$ y = [-623817, -613050, -604090, -596273, -589280, -583083, -577522, -572154, -566455, -560017, -552629, -544267, -534976, -524674, -513144, -500281, -486268, -471493, -456319, -440940, -425371, -409650, -394099, -379244, -365328, -352105, -339348, -327355, -316583, -306948, -297973, -289587, -282261, -276249, -271170, -266527, -262197, -258179, -254219, -249960, -245244, -240073, -234493, -228667, -222842, -217078, -211224, -205204, -199069, -192706, -185921, -178963, -172622, -167558, -163850, -161324, -159940, -159529, -159566, -159586, -159593, -159681, -159518, -158615, -156991, -155199, -153691, -152428, -151089, -149461, -147639, -145972, -144751, -143881, -142980, -141852, -140623, -139337, -137731, -135618, -133197, -130717, -128050, -124869, -121062, -116702, -111787, -106318, -100475, -94447, -88156, -81390, -74101, -66356, -58154, -49584, -41155, -33697, -27892, -23953, -21630, -20403, -19754, -19408, -19283, -19187, -18779, -17856, -16409, -14331, -11375, -7588, -3424, 803, 5324]
56804E324N131N666O009O565P558Q584R040Q571O964M251J045j620l153l773l931
56789F2231l749l211k415j462l94O01J311J922K889M256N597O731P962R454J0856
56774A02579J1849J2469J2649J1937J0010P069L481m41m074o538p585p888q081
56761A37436q034p501o844o426n837m486k618r65L94J966L795N284O181O993Q120
56746A27458R133R218Q003N690K690n52l491n636o812p255p342p230o831o126
56732A10917n370m749m020k839j415l53K19Q41J869K932L538L827M246M757M832
56717A19232M043K375J35k116l770m614m930n008m803m354m048m136m247l912
56703G9847l260k734k372j884j296r45q69p80n99n60p34q49p28n04l82l62l60
$$ y = [5324, 10455, 16121, 22130, 28695, 36253, 44837, 53877, 62448, 69412, 73663, 74708, 73088, 69935, 66162, 62231, 58482, 55271, 52856, 51394, 51000, 51601, 52912, 54834, 57723, 61979, 67576, 74307, 82269, 91723, 102579, 114428, 126897, 139546, 151483, 161493, 168562, 172043, 171602, 167528, 160990, 153405, 145517, 137436, 129402, 121901, 115057, 108631, 102794, 98308, 95690, 94725, 95119, 97085, 100880, 106164, 112345, 119338, 127458, 136591, 145809, 153812, 159502, 162192, 161640, 158149, 152513, 145701, 138446, 131104, 123874, 117043, 110917, 105547, 100798, 96778, 93939, 92524, 92171, 92390, 93231, 95100, 98032, 101570, 105397, 109643, 114400, 119232, 123275, 125650, 125785, 123669, 119899, 115285, 110355, 105347, 100544, 96190, 92142, 88006, 83759, 79847, 76587, 73853, 71481, 69597, 68301, 67356, 66487, 65707, 65108, 64548, 63814, 62965, 62237, 61733, 61351, 60989, 60629]
56686F0629l10j51Q9K48K11P3j4m3m1M5J31n1n01p48m79r7j88o33q35o58n66p55
56664E5356q57o10l09k84l77k24J78N12N37K92l3k38k62j99j59j29j45l65q25
56645E1859j177j011l96J91M15L40J27j79n18p68r16j060j168j079p69m62l60
56628D3069m33m80l27M1M48O63O83P13Q40Q66O83N28O07P14N87M19N82R40J007
56609E2150P12N42Q01J160J135O88J48j76j95k2P0j14m88p74q11o42l69j18n0
56590E3647j59j90K3K96M17N22P74R03N69Nk03M5L03L63M85P55Q26N71L75N13
56570F0840O81N32K62K51M40M53K02l2k6J50L00L39L54M95P79J005J016R42R69
56551F9952R73O81K17N3L33O36N54J61k44n33o56n11j40J72K30J48J07P4j4m6
$$ y = [60629, 60319, 60168, 60257, 60505, 60716, 60789, 60775, 60732, 60691, 60736, 60867, 60816, 60315, 59567, 59088, 58991, 58803, 58170, 57335, 56677, 56111, 55356, 54499, 53889, 53580, 53296, 52919, 52695, 52873, 53385, 53922, 54214, 54181, 53943, 53681, 53482, 53323, 53194, 53049, 52684, 51859, 50682, 49671, 49275, 49466, 49881, 50221, 50348, 50169, 49651, 48883, 47967, 46907, 45739, 44660, 43891, 43429, 43069, 42636, 42156, 41829, 41870, 42318, 42981, 43664, 44377, 45217, 46083, 46766, 47294, 47901, 48615, 49202, 49621, 50203, 51143, 52150, 52862, 53404, 54205, 55365, 56500, 57188, 57336, 57160, 56965, 56943, 57013, 56899, 56411, 55637, 54826, 54184, 53815, 53697, 53647, 53488, 53298, 53321, 53617, 54034, 54556, 55330, 56233, 56802, 56807, 56604, 56649, 56952, 57315, 57800, 58555, 59381, 59952, 60327, 60840, 61521, 62053, 62315, 62566, 63006, 63459, 63661, 63629, 63603, 63753, 64053, 64392, 64746, 65241, 66020, 67025, 68041, 68983, 69952, 70925, 71606, 71823, 71876, 72209, 72845, 73399, 73560, 73316, 72783, 72127, 71616, 71476, 71648, 71878, 72026, 72133, 72207, 72193, 72147]
56531G2147P9K95N12P65J000R84O17J28j79k59k40j59k8O9Q3Q6J61L29O07R74
56511G7971J234J196R86R34J066J116J098J417K190K884K986K661K449K537K736
56496A05461K922L072L035K666K152J879J976K193K199J829J152M25r0l76o71
56481A29824j051j338j437j536j789k052k174k242k316k212j911j794k077k281
56467A03614j862j135r47j452j862j589r87o98p39o77l94j77k01l45n12p96j156
56450H8085j293j040o92o81j001j180r17m79l19n62r59j258j385j342j192j076
56434G2709j065j045q80o42m95m45l96k98j04K97Q02R66O08L05P59J747K305K019
56416G7147J475J304J404J416J377J462J496J282J057J216J680J983J844J413
$$ y = [72147, 72226, 72521, 73033, 73798, 74798, 75782, 76399, 76527, 76348, 76089, 75849, 75690, 75662, 75731, 75814, 75900, 76061, 76390, 76997, 77971, 79205, 80401, 81387, 82321, 83387, 84503, 85601, 87018, 89208, 92092, 95078, 97739, 100188, 102725, 105461, 108383, 111455, 114490, 117156, 119308, 121187, 123163, 125356, 127555, 129384, 130536, 130961, 130871, 130495, 129824, 128773, 127435, 125998, 124462, 122673, 120621, 118447, 116205, 113889, 111677, 109766, 107972, 105895, 103614, 101752, 100617, 99670, 98218, 96356, 94767, 93780, 93082, 92343, 91666, 91272, 91095, 90894, 90549, 90037, 89241, 88085, 86792, 85752, 85060, 84379, 83378, 82198, 81281, 80802, 80483, 79921, 78962, 77704, 76319, 74977, 73785, 72709, 71644, 70599, 69719, 69077, 68582, 68137, 67741, 67443, 67339, 67636, 68438, 69404, 70012, 70317, 71076, 72823, 75128, 77147, 78622, 79926, 81330, 82746, 84123, 85585, 87081, 88363, 89420, 90636, 92316, 94299, 96143, 97556]
56402I7556J034J010J384J824J902J643J533J786J960J594Q80M07M50P85J034
56387A16782R24M44n5j46J36K94J03j40k08l49p49j076j009p74o95o42l93k23
56369A12224m71q58q40m60k49m21p31r85j136j022n90k59m63r17r23m03mj46n40
56350A00806p51p39o74o66p73r81j083q67m65j63M5L12M79K29k49l52J18O59P15
56331I5600K95k35n92o76n31l01p3K26O06Q04O34L53L30M37K81q5j75K00P05J045
56311I8848J236J320J232J043R27Q40O07L66M42P86J020J022R91Q92M85k9l9N85
56293A12574J227J421J441J635J757J405P57L72M86Q67J185J253J041P44O44Q22
56277A29631J094J324J510J532J206O66M30P83J474K082K422K438K140J809J940
$$ y = [97556, 98590, 99600, 100984, 102808, 104710, 106353, 107886, 109672, 111632, 113226, 114106, 114513, 114963, 115748, 116782, 117706, 118150, 118095, 117949, 118085, 118379, 118482, 118342, 118134, 117785, 117036, 115960, 114951, 114177, 113482, 112840, 112447, 112224, 111753, 110895, 110055, 109595, 109346, 108925, 108194, 107209, 106073, 105051, 104461, 104202, 103739, 102822, 101899, 101496, 101492, 101346, 100806, 100055, 99316, 98642, 97976, 97203, 96222, 95139, 94272, 93807, 93644, 93689, 94001, 94480, 94709, 94460, 94108, 94226, 94885, 95600, 95895, 95660, 95068, 94392, 93861, 93560, 93487, 93713, 94319, 95123, 95757, 96110, 96440, 96877, 97158, 97073, 96898, 97098, 97803, 98848, 100084, 101404, 102636, 103679, 104606, 105446, 106053, 106419, 106861, 107647, 108667, 109689, 110680, 111572, 112057, 112028, 111989, 112574, 113801, 115222, 116663, 118298, 120055, 121460, 122217, 122589, 123075, 123942, 125127, 126380, 127421, 128165, 128809, 129631, 130725, 132049, 133559, 135091, 136297, 136963, 137393, 138176, 139650, 141732, 144154, 146592, 148732, 150541, 152481]
56262A52481K656L480L896L867L665L447L267L231L369L492L440L265L083K893
56248A99532K705K606K609K571K389K067J600J042O65P60J138J262R55O22O75
56233B23198J038J415J726K084K583L212L849M265M401M584N186O079O827P350
56219B77797P900Q489Q900R310J0212J1591J2817J3563J4250J5283J6519J7818
56207D24449J9445K1503K3516K5132K6719K8816L1395L4186L7255M0688M4063
56196G57167M6923M9492N2294N5231N7642N9194O0105O0456N9775N7523N3676
56185A369478M8648M2810L6215K8774K0650J2371M461k951r895j6127k1248k5257
56173A487929k8493l1013l2568l3269l3738l4405l5116l5682l6231l6825l7222
$$ y = [152481, 155137, 158617, 162513, 166380, 170045, 173492, 176759, 179990, 183359, 186851, 190291, 193556, 196639, 199532, 202237, 204843, 207452, 210023, 212412, 214479, 216079, 217121, 217786, 218546, 219684, 220946, 221901, 222523, 223198, 224236, 225651, 227377, 229461, 232044, 235256, 239105, 243370, 247771, 252355, 257541, 263620, 270447, 277797, 285697, 294186, 303086, 312396, 322608, 334199, 347016, 360579, 374829, 390112, 406631, 424449, 443894, 465397, 488913, 514045, 540764, 569580, 600975, 635161, 672416, 713104, 757167, 804090, 853582, 905876, 961107, 1018749, 1077943, 1138048, 1198504, 1258279, 1315802, 1369478, 1418126, 1460936, 1497151, 1525925, 1546575, 1558946, 1563407, 1560456, 1550561, 1534434, 1513186, 1487929, 1459436, 1428423, 1395855, 1362586, 1328848, 1294443, 1259327, 1223645, 1187414, 1150589, 1113367]
56162A113367l7363l7624l8169l8569l8422l7934l7532l7218l6718l5878l4644
56151G03296l2968l1094k9483k8216k6837k5064k3172k1424j9659j7850j6439
56140D31090j5662j5090j4257j3236j2133j0695q948p631p258p279o856n998n255
56127C00792m719m110l489l130k905k516k064j790j483p99O4O59R81J299J577
56112B78367J711J990K618L151L123K925L304M147M649M532M290M271M260M032
56098C27370L660L262K911K791K951L079K917K739K915L308L647M129N052O150
56084C76881P014P828R043J0577J2086J3745J5976J8625K1235K3862K6843K9908
56072E73623L2395L4143L5352L5706L4578L2069K9074K6269K3831K1993K0961
$$ y = [1113367, 1076004, 1038380, 1000211, 961642, 923220, 885286, 847754, 810536, 773818, 737940, 703296, 670328, 639234, 609751, 581535, 554698, 529634, 506462, 485038, 465379, 447529, 431090, 415428, 400338, 386081, 372845, 360712, 350017, 341069, 333438, 326180, 318901, 312045, 306047, 300792, 296073, 291963, 288474, 285344, 282439, 279923, 277859, 276069, 274586, 273787, 273851, 274510, 275491, 276790, 278367, 280078, 282068, 284686, 287837, 290960, 293885, 297189, 301336, 305985, 310517, 314807, 319078, 323338, 327370, 331030, 334292, 337203, 339994, 342945, 346024, 348941, 351680, 354595, 357903, 361550, 365679, 370731, 376881, 383895, 391723, 400766, 411343, 423429, 437174, 453150, 471775, 493010, 516872, 543715, 573623, 606018, 640161, 675513, 711219, 745797, 777866, 806940, 833209, 857040, 879033, 899994]
56061H99994K0213J8678J5732J1524O461J098l668p105r407j1312j3198j5147
56049I13863j7580k0849k4439k7454k9687l1312l1888l0790k8482k6150k4124
56038F21108k1846j9279j7116j5453j3583j1394r723q975q474p652o813o306n878
56025D68616n353n059n114n059m587l977l451k786j851r29k16L77Q20R78J081
56010D33490J480J980K174K341L104M234M814M671M582M993N517N874O268O678
55996D92200O735O566O763P363P794P963Q392R201R879J0274J0722J1197J1352
55983F06401J1436J2042J2954J3381J3337J3587J4179J4423J4372J4849J5936
55972G56897J6841J7489J8700K0558K2130K3084K4155K5687K7209K8689L0616
$$ y = [899994, 920207, 938885, 954617, 966141, 972602, 973700, 970032, 962927, 953520, 942208, 929010, 913863, 896283, 875434, 850995, 823541, 793854, 762542, 730654, 699864, 671382, 645232, 621108, 599262, 579983, 562867, 547414, 533831, 522437, 512714, 503739, 495265, 487613, 480800, 474494, 468616, 463263, 458204, 453090, 448031, 443444, 439467, 436016, 433230, 431379, 430450, 430234, 430611, 431431, 432409, 433490, 434970, 436950, 439124, 441465, 444569, 448803, 453617, 458288, 462870, 467863, 473380, 479254, 485522, 492200, 498935, 505501, 512264, 519627, 527421, 535384, 543776, 552977, 562856, 573130, 583852, 595049, 606401, 617837, 629879, 642833, 656214, 669551, 683138, 697317, 711740, 726112, 740961, 756897, 773738, 791227, 809927, 830485, 852615, 875699, 899854, 925541, 952750, 981439, 1012055]
55961A012055L2622L3675L3983L4948L6967L8949M0397M2048M4064M5587M6572
55950A441867M8161N0577N2628N3913N5517N7938O0325O2483O5457O9422P3109
55939B091397P6146P9818Q4744Q9958R5020J00713J06971J12579J17731J24266
55929C079343J32503J40675J48421J57841J69966J83240J96733K11665K28433
55920D648820K45455K62436K81387L02903L25088L47746L73648M03770M35496
55911G626749M67606N02710N42419N84906O29864O81082P41287Q09721Q88001
55902A3474345R83123J101350J244771J416796J624150J870089K153523K478714
55894B6346861K856464L291595L781021M329565M953451N661535O447909P293293
$$ y = [1012055, 1044677, 1078352, 1112335, 1147283, 1184250, 1223199, 1263596, 1305644, 1349708, 1395295, 1441867, 1490028, 1540605, 1593233, 1647146, 1702663, 1760601, 1820926, 1883409, 1948866, 2018288, 2091397, 2167543, 2247361, 2332105, 2422063, 2517083, 2617796, 2724767, 2837346, 2955077, 3079343, 3211846, 3352521, 3500942, 3658783, 3828749, 4011989, 4208722, 4420387, 4648820, 4894275, 5156711, 5438098, 5741001, 6066089, 6413835, 6787483, 7191253, 7626749, 8094355, 8597065, 9139484, 9724390, 10354254, 11035336, 11776623, 12586344, 13474345, 14457468, 15558818, 16803589, 18220385, 19844535, 21714624, 23868147, 26346861, 29203325, 32494920, 36275941, 40605506, 45558957, 51220492, 57668401, 64961694]
55886F4961694Q106030Q604020Q307105O790252M052697O40482k639975n165333
55878I3656972o720730p414181p478863p149308o619035o019979n417778m836529
55870D2000569m288589l782400l320307k904763k542772k237306j980224j759985
55862A9184223j570981j410258j271325j147621j037741r41955q57200p79980
55854A0167162p10476o49504n94641n43245m96148m54735m17377l82134l50154
55845E568748l23000k99196k76628k55961k38630k23646k09317j96010j84505
55836C361855j73635j62194j51272j42167j33797j24675j15624j08176j01916
55827B148399r5771r0298q6331q2851p8545p4052p0601o7673o4194o0672n8063
$$ y = [64961694, 73067724, 81671744, 89978849, 96769101, 100821798, 101462280, 98822305, 93656972, 86936242, 79522061, 72043198, 64893890, 58274855, 52254876, 46837098, 42000569, 37711980, 33929580, 30609273, 27704510, 25161738, 22924432, 20944208, 19184223, 17613242, 16202984, 14931659, 13784038, 12746297, 11804342, 10947142, 10167162, 9456686, 8807182, 8212541, 7669296, 7173148, 6718413, 6301036, 5918902, 5568748, 5245748, 4946552, 4669924, 4413963, 4175333, 3951687, 3742370, 3546360, 3361855, 3188220, 3026026, 2874754, 2732587, 2598790, 2474115, 2358491, 2250315, 2148399, 2052628, 1962330, 1875999, 1793148, 1714603, 1640551, 1569950, 1502277, 1438083, 1377411, 1319348]
55816A319348n5728n2614m9356m7151m5601m3660m1691m0645m0088l8949l7413
55805H26452l6191l4727l1996k8402k5182k2498j9757j7171j5387j4082j2537
55794E68522j1067j0506j0761j1177j1770j2768j3537j3349j2603j2035j1335
55783D37614r863q083o938o303n468m546m058l690k855k053k194k998l447l521
55769C71597m072n221o161o546o803p149p360p447p646p839p788p691p714p413
55755B74747o448n403m989m912m554m180m374m733m398l467k742k313j661q45
55741B19728l94j71M13J158J259O83J85m4n96j667k669l166l312l238k952k819
55725B02398l262l934m010l376k675k212j686j065p25p21p04p35j323k497l604
$$ y = [1319348, 1263620, 1211006, 1161650, 1114499, 1068898, 1025238, 983547, 942902, 902814, 863865, 826452, 790261, 755534, 723538, 695136, 669954, 647456, 627699, 610528, 595141, 581059, 568522, 557455, 546949, 536188, 525011, 513241, 500473, 486936, 473587, 460984, 448949, 437614, 427751, 419668, 412730, 406427, 400959, 396413, 392355, 388665, 385810, 383757, 381563, 378565, 375118, 371597, 367525, 362304, 356143, 349597, 342794, 335645, 328285, 320838, 313192, 305353, 297565, 289874, 282160, 274747, 268299, 262896, 257907, 252995, 248441, 244261, 239887, 235154, 230756, 227289, 224547, 222234, 220573, 219728, 219334, 219163, 219576, 220734, 221993, 222676, 222861, 222817, 222221, 220554, 217885, 214719, 211407, 208169, 205217, 202398, 199136, 195202, 191192, 187816, 185141, 182929, 181243, 180178, 179453, 178732, 178028, 177293, 175970, 173473, 169869]
55710A69869m204m460m546m359l948l566l193k613j980j691j721j720j759k249
55696A27860l067l561l524l440l628l829l809l685l497l024k266j554j032n42
55682H7402j11l9l60p63j131j595j971j762r30j70r7n72r59q26k20M00M77j15
55664G6658q93j303j337j280j153q46n35m66m27j11K57K19q9q7L06O48P77R68
55646G1306J213J144P80O41R18J169J054P86O24M95L67M33O86P91O48O14R19J310
55628H5898J503J616J820J987J931J710J457J107N93Q1j59n3J92K57n9n63q25
55611I8493p09n36n39m97k37j09m01o69l34L22M92R0j93j7J94J29O8K59M84N03
55591I6793M48M45L34K7l07n76q81j170j240j203j441j941k198j993j737j820
$$ y = [169869, 165665, 161205, 156659, 152300, 148352, 144786, 141593, 138980, 137000, 135309, 133588, 131868, 130109, 127860, 124793, 121232, 117708, 114268, 110640, 106811, 103002, 99317, 95820, 92796, 90530, 88976, 87944, 87402, 87291, 87252, 86892, 86129, 84998, 83403, 81432, 79670, 78740, 78570, 78473, 77901, 76942, 76116, 75896, 76296, 76773, 76658, 75765, 74462, 73125, 71845, 70692, 69846, 69311, 68845, 68418, 68307, 68564, 68783, 68694, 68607, 68913, 69561, 70338, 71306, 72519, 73663, 74443, 75084, 76002, 77171, 78225, 79011, 79635, 80130, 80497, 80930, 81616, 82407, 83055, 83669, 84588, 85898, 87401, 89017, 90837, 92824, 94755, 96465, 97922, 99029, 99622, 99703, 99544, 99491, 99683, 99940, 99881, 99318, 98493, 97784, 97248, 96709, 96212, 95975, 95866, 95465, 94796, 94462, 94784, 95276, 95366, 95173, 95156, 95350, 95479, 95547, 95806, 96290, 96793, 97241, 97686, 98020, 98047, 97740, 97164, 96283, 95113, 93873, 92670, 91229, 89288, 87090, 85097, 83360, 81540]
55575H1540k088k234k301k499k808l034l015k672k114j745j846k131k081j760
55561D9212j686j945j996j553r93p00n92n39o55q53o87OO99Q52N50J82j09l62
55543C8831n16n64o86r32j080r62o69k75J91M20oq82j406j184p21n51m54OO75
55524B9235J057J050Q87O54K83j28m30o06o10k65L75Q65R16P71P57P83O81O55
55506C6930R18J195J096P47N92P27Q76Q70P22L43l56j153j650j700j441j002m91
55489C7223j13K5Q3J86J53j97o13o85l85m6J50K70L51L06R8k00m78n66k68L30
55469C5624Q40J027J152J481J782J643J117O31L83K21P8M0M8q1k90l28j81j73
55451D5014m95r67j341j578j714j706j544j374j374j535j676j614j329r92p59
$$ y = [81540, 79452, 77218, 74917, 72418, 69610, 66576, 63561, 60889, 58775, 57030, 55184, 53053, 50972, 49212, 47526, 45581, 43585, 42032, 41039, 40339, 39747, 39208, 38553, 37700, 37013, 37019, 37718, 38570, 39120, 39302, 39193, 38831, 38315, 37751, 37065, 36133, 35053, 34091, 33422, 33147, 33338, 33758, 33752, 32870, 31464, 30280, 29559, 29008, 28554, 28560, 29235, 30292, 31342, 32229, 32883, 33166, 33038, 32608, 32002, 31392, 31127, 31502, 32367, 33283, 34054, 34811, 35594, 36275, 36930, 37848, 39043, 40139, 40886, 41478, 42205, 43081, 43951, 44673, 45016, 44660, 43507, 41857, 40157, 38716, 37714, 37223, 37110, 37135, 37218, 37404, 37557, 37360, 36747, 36062, 35677, 35631, 35781, 36051, 36402, 36708, 36806, 36606, 36128, 35562, 35294, 35624, 36464, 37491, 38643, 40124, 41906, 43549, 44666, 45297, 45680, 45901, 45979, 46019, 46067, 45986, 45696, 45368, 45187, 45014, 44519, 43552, 42211, 40633, 38919, 37213, 35669, 34295, 32921, 31386, 29710, 28096, 26767, 25775, 25016]
55436B5016n86l52j77l31p90j127j067q56p95p19l18K04K91j57o22o92n21m18
55418A5983l52j51N7n9n20q99p88k73J46J10k51n09m48k36j48k39l72m04k91p9
55398A0277J07J46Q9R2J50J7m35r24r89n25J07M99N97O30O94N91J51l86n30j40
55378A0218L44M41K07N9J36J63p1m32o53n96k47L08Q18J009Q73O21L84J85J52
55359A3919M31Q17Q45L82j74m08l44k65l19m67n56l73J37O51P12L25n5j49j13
55340A4996p3P3K68J57k97n66l02R5O3k44k46J51M37K71q4k05k1K10K56J14p0
55319A4983j95k99l99l47l9L08L73J65Lmj1o3l0kk11n22m80q0J28j16l75l16k29
55296A2242l83m30l7M16L89K1j81j56j83k64k44k63n11p32n55j47L5p4k13l28
$$ y = [25016, 24430, 24078, 23901, 23570, 22780, 21653, 20586, 19730, 18935, 18216, 17898, 18102, 18393, 18236, 17614, 16922, 16401, 15983, 15631, 15480, 15537, 15478, 14958, 14059, 13271, 12998, 13144, 13254, 13003, 12494, 12046, 11810, 11662, 11423, 11051, 10647, 10356, 10277, 10384, 10530, 10619, 10711, 10861, 10878, 10443, 9519, 8530, 8005, 8112, 8611, 9208, 9838, 10532, 11123, 11274, 10888, 10358, 10218, 10562, 11003, 11210, 11269, 11405, 11568, 11497, 11065, 10412, 9816, 9569, 9877, 10695, 11704, 12577, 13198, 13582, 13767, 13919, 14350, 15167, 16012, 16394, 16220, 15812, 15468, 15203, 14884, 14417, 13861, 13488, 13625, 14276, 14988, 15313, 15258, 15109, 14996, 14923, 14996, 15264, 15421, 15124, 14558, 14256, 14351, 14414, 14170, 13924, 14075, 14512, 14783, 14699, 14494, 14473, 14683, 14939, 15053, 14983, 14788, 14489, 14090, 13743, 13704, 14012, 14385, 14550, 14553, 14549, 14538, 14475, 14445, 14443, 14232, 13710, 13230, 13150, 13278, 13162, 12787, 12471, 12242, 11859, 11429, 11392, 11808, 12197, 12218, 12037, 11881, 11698, 11434, 11190, 10927, 10416, 9684, 9129, 8982, 9017, 8943, 8730, 8402]
55276H402m57l63J34O54O76L29J38J63P3j23j35q9l73q54r62n96k12l0J71L99
55256F945L48J13J88N82O53J09n24p22o31n39l46K7K73J52o8o8M1N0O9K44L91
55235G287L35K59M00O79R24J192J488J503R84J33o06j039j154r50n75l73m68n06
55217I513j70L35N99N88N17L73Mm57o61n00j77J68N04O71M52l7l41j97J58L04
55197A1646J56l5r0j28l22n37m87j65Q7P6L4J87L27J56j46j60O6O6k26l27J8L70
55175A0566K47k01m91m82l78l02k40k27k72k23N5M04N54M81L82L56L33K18Qk07
55155A0581k44N3N77R79J035Q59O65M75K16l1j13m7pr7k26k14kK32J94k09p19
55134A3957r91r92q68n89l2O31R78Q49M93J57j33l02j99Pj21n87p60k19N57Q15
$$ y = [8402, 7945, 7582, 7716, 8370, 9046, 9375, 9513, 9676, 9749, 9626, 9491, 9402, 9029, 8175, 7213, 6617, 6405, 6375, 6546, 6945, 7293, 7406, 7594, 8176, 8829, 8938, 8414, 7692, 7061, 6522, 6176, 6203, 6476, 6628, 6560, 6492, 6533, 6583, 6652, 6896, 7287, 7622, 7881, 8281, 8960, 9884, 11076, 12564, 14067, 15051, 15184, 14578, 13539, 12385, 11435, 10860, 10487, 10019, 9513, 9343, 9678, 10277, 10865, 11382, 11755, 11759, 11302, 10641, 10141, 9964, 10132, 10636, 11307, 11759, 11722, 11381, 11184, 11342, 11646, 11802, 11767, 11677, 11549, 11227, 10690, 10203, 10038, 10125, 10201, 10235, 10422, 10749, 10905, 10759, 10599, 10665, 10731, 10505, 10178, 10196, 10566, 10813, 10612, 10121, 9639, 9261, 8959, 8719, 8492, 8220, 7997, 8052, 8456, 9010, 9491, 9873, 10229, 10562, 10780, 10788, 10581, 10337, 10390, 10967, 11946, 12981, 13840, 14505, 14980, 15196, 15165, 15052, 15005, 14998, 14901, 14675, 14461, 14459, 14691, 14885, 14676, 13957, 12966, 11974, 11106, 10517, 10485, 11116, 12094, 12943, 13436, 13593, 13460, 13158, 12959, 12966, 12845, 12258, 11498, 11279, 11836, 12651]
55114A2651N03J75J13R3m3j18qP4j14n08q15q17n15j26P8k5l15o08q15q97p82
55093G181m77j08K33O02J007J207R47L07l57p32p36m63q2K22L65M08M31M22L32
55074A0709J62o4k72k85L2M91O97N33L10L04L93L42J90J05L7j82m71n24k11K56
55054A2552N73O22N31N38P47R76R49O55L69K12Nl69o06l26L97J035J138P11J63
55035B0872m4K26O06N83J09l35l26J4L12M01L51K22N6k4N8K34M24N99O30L63j5
55014B5316m7L02M33l1o04n97j45P8p8j51K5N0k90o28o34m92m88n04k79J26M06
54993B1768M23K60M4j31k09k65m27o43o78m65k38j73q5K64P18Q71N51K3l40l88
54973B0880j91R4K87K56L4j66j05K17N70P09N72K63j04l89m18j22K55L74K00M6
$$ y = [12651, 13154, 13329, 13442, 13535, 13492, 13374, 13366, 13440, 13326, 12818, 12003, 11186, 10671, 10545, 10623, 10598, 10283, 9675, 8860, 7963, 7181, 6704, 6596, 6829, 7431, 8438, 9645, 10592, 10899, 10542, 9810, 9074, 8611, 8529, 8751, 9116, 9524, 9955, 10377, 10709, 10871, 10807, 10535, 10250, 10282, 10773, 11470, 12003, 12313, 12617, 13010, 13352, 13542, 13647, 13684, 13502, 13031, 12507, 12296, 12552, 13125, 13747, 14278, 14816, 15563, 16539, 17488, 18143, 18512, 18724, 18729, 18360, 17754, 17428, 17825, 18860, 19998, 20709, 20872, 20828, 21054, 21660, 22243, 22352, 22017, 21691, 21705, 22017, 22418, 22769, 22991, 23047, 23023, 23081, 23315, 23739, 24338, 24968, 25331, 25316, 25269, 25571, 26004, 25973, 25369, 24772, 24627, 24705, 24627, 24476, 24501, 24551, 24261, 23633, 22999, 22507, 22019, 21515, 21236, 21362, 21768, 22191, 22451, 22495, 22364, 22155, 21890, 21463, 20820, 20142, 19677, 19439, 19266, 19181, 19445, 20163, 21034, 21585, 21608, 21268, 20880, 20689, 20783, 21070, 21326, 21360, 21194, 21089, 21306, 21876, 22585, 23157, 23420, 23316, 22927, 22509, 22387, 22642, 23016, 23216, 23262]
54953B3262J10K16J66P1J56L86N27N04M05K54L2j38q0J47K88K25O6p4j88k52k43
54932B5840k71m72p30o95k56K36L51O7k46k69o2R8L9j29k15j86j61j34N8M70Q87
54911B4220J062R80P76N28K59P7M0O4O8J76N17R40J189J252J328J456J487J430
54893C7849J502J770J987J990J947K101K409K689K958L406M025M524M628M321
54879G8106L724K845J631K33j003j903k662l508m279m604m417l997l533k953k285
54864E1395j821j702j659j409j067r15r65r86q60o07k69L8J24M8J95P84J494J929
54846D3747K164K476K759K738K604K798L270L490L302L077K949K484J413J58p72
54831G8657j475k331l290l928m053l864l574l251k951k779k719k636k422k057
$$ y = [23262, 23372, 23588, 23754, 23825, 23981, 24367, 24894, 25398, 25803, 26057, 26089, 25951, 25871, 26018, 26306, 26531, 26597, 26523, 26335, 26083, 25840, 25569, 25097, 24367, 23672, 23416, 23652, 24003, 24070, 23824, 23555, 23493, 23591, 23630, 23501, 23286, 23100, 22939, 22805, 22863, 23333, 24220, 25282, 26262, 27038, 27566, 27825, 27902, 27942, 28006, 28074, 28250, 28767, 29707, 30896, 32148, 33476, 34932, 36419, 37849, 39351, 41121, 43108, 45098, 47045, 49146, 51555, 54244, 57202, 60608, 64633, 69157, 73785, 78106, 81830, 84675, 86306, 86539, 85536, 83633, 80971, 77463, 73184, 68580, 64163, 60166, 56633, 53680, 51395, 49574, 47872, 46213, 44804, 43737, 42822, 41857, 40871, 40011, 39404, 39135, 39173, 39297, 39345, 39540, 40324, 41818, 43747, 45911, 48387, 51146, 53884, 56488, 59286, 62556, 66046, 69348, 72425, 75374, 77858, 79271, 79429, 78657, 77182, 74851, 71561, 67633, 63580, 59716, 56142, 52891, 49940, 47161, 44442, 41806, 39384, 37327]
54817C7327j603j156q13n77l93l04m22o85q26o80m03k93m32o26o26l54qJ30J7
54798B7273p5P4K56J23k81n30m15j82r6j15j14j28j83j69m8J4o1r8K0Q6j02m17
54776B4832o07o75p20o43l46p8j88n22n11M7O47P02K85mK17P10R77Q36N59N15
54756B6033P69J051J050P25L37K01L92O61P27O14O12Q64J124J103Q53O44N72N70
54738C8902O68J012J566K146K731L456M219M650M572M247M008L881L712L428K953
54723H6151K191J216L10m06j115j864k306k165j775j739k161k558k501k046j520
54708F7712j171j026r25o59k28R1J09K4J28L42L54K07L05Q44J577K226K828L448
54690G6186L881L983M056M570N569O582P144P147O683N816M644L398K241J109
$$ y = [37327, 35724, 34568, 33755, 33178, 32785, 32481, 32059, 31374, 30548, 29868, 29465, 29172, 28740, 28114, 27488, 27134, 27126, 27256, 27273, 27198, 27272, 27528, 27651, 27370, 26840, 26425, 26243, 26147, 26032, 25918, 25790, 25607, 25438, 25390, 25404, 25343, 25245, 25265, 25351, 25249, 24832, 24225, 23550, 22830, 22187, 21841, 21763, 21575, 21053, 20542, 20589, 21236, 21938, 22223, 22219, 22436, 23146, 24123, 24959, 25518, 26033, 26802, 27853, 28903, 29628, 29965, 30166, 30558, 31219, 31946, 32560, 33172, 34036, 35160, 36263, 37116, 37760, 38332, 38902, 39570, 40582, 42148, 44294, 47025, 50481, 54700, 59350, 63922, 68169, 72177, 76058, 79770, 83198, 86151, 88342, 89558, 89868, 89462, 88347, 86483, 84177, 82012, 80237, 78498, 76337, 73779, 71278, 69232, 67712, 66541, 65515, 64590, 63931, 63703, 63794, 63903, 63927, 64055, 64397, 64751, 64958, 65263, 66107, 67684, 69910, 72738, 76186, 80067, 84050, 88106, 92676, 98245, 104827, 111971, 119118, 125801, 131617, 136261, 139659, 141900, 143009]
54676A43009j77j639l104m415n481o204o472o352o082n825n515n072m621m341
54662G7709m174l868l309k641k068j656j356j104q67o70o08p55j061j389j616
54647E0567j610j254o27q0P7p8k54l45m34m24j09L71N10J36k45r3M28P18N26J49
54627D7929o6l6J98N70Q25O34L9m42l55J57N66O02M59M02M36M44M74O51R20J054
54607E5461J001R92J233J611J844J829J676J496J330J195J127J104J090J099J144
54592G5232J196J240J271J174Q34M75O44J497K399K598K209K081K699L718M570
54577A03837N093N385N541N697O033O457O609O337N828N153M028K296K54j690
54563A66858l443m987o123o737o990p023o726o122n591n345n048m402l723l437
$$ y = [143009, 142832, 141193, 138089, 133674, 128193, 121989, 115517, 109165, 103083, 97258, 91743, 86671, 82050, 77709, 73535, 69667, 66358, 63717, 61649, 59993, 58637, 57533, 56666, 55996, 55388, 54633, 53572, 52183, 50567, 48957, 47703, 47076, 46996, 47073, 46995, 46741, 46396, 45962, 45538, 45429, 45800, 46310, 46446, 46201, 46108, 46536, 47254, 47780, 47929, 47863, 47827, 48025, 48595, 49420, 50054, 50093, 49651, 49296, 49453, 50019, 50621, 51080, 51482, 51918, 52362, 52836, 53487, 54407, 55461, 56462, 57454, 58687, 60298, 62142, 63971, 65647, 67143, 68473, 69668, 70795, 71899, 72989, 74088, 75232, 76428, 77668, 78939, 80113, 80947, 81422, 82066, 83563, 85962, 88560, 90769, 92850, 95549, 99267, 103837, 108930, 114315, 119856, 125553, 131586, 138043, 144652, 150989, 156817, 161970, 165998, 168294, 168548, 166858, 163415, 158428, 152305, 145568, 138578, 131555, 124829, 118707, 113116, 107771, 102723, 98321, 94598, 91161]
54549I1161l324k888k264k030k207k172j628j019p70p69q01r71j375j744j779
54534F5420j614j556j625j610j404j087q24q06j161j700j944j665j219j132j424
54519D4649j623j380q31l80k97n77j021j328j258p94k44Jj89n35o61n08l17k07
54501C2500k0L37O17N69L59L43N00M36J8l66l02J41N66P29O70N31M42M88O43P55
54481C9956P04N56M38L78L65M79P96J185J403J416J450J679K001K268K567L065
54465F0706L617L833L562L083K664K208J578R73O64M22k56j362k283k629k673
54450G4107k765k788k572k426k739l205l098k274j372r89j064j237j387j569j716
54435D2906j695j501j208q48m44j09K8p9l90p54q84n27K07Q58J033P99N46N22
$$ y = [91161, 87837, 84949, 82685, 80655, 78448, 76276, 74648, 73629, 72859, 72090, 71289, 70318, 68943, 67199, 65420, 63806, 62250, 60625, 59015, 57611, 56524, 55700, 54894, 53733, 52033, 50089, 48424, 47205, 46073, 44649, 43026, 41646, 40815, 40435, 40138, 39561, 38540, 37212, 35954, 35160, 34916, 34917, 34728, 34193, 33532, 33024, 32707, 32500, 32480, 32817, 33434, 34003, 34362, 34705, 35205, 35641, 35659, 35293, 34991, 35132, 35698, 36427, 37097, 37628, 38070, 38558, 39201, 39956, 40660, 41216, 41654, 42032, 42397, 42876, 43672, 44857, 46260, 47676, 49126, 50805, 52806, 55074, 57641, 60706, 64323, 68156, 71718, 74801, 77465, 79673, 81251, 82224, 82888, 83310, 83054, 81692, 79409, 76780, 74107, 71342, 68554, 65982, 63556, 60817, 57612, 54514, 52240, 50868, 49879, 48815, 47578, 46191, 44622, 42906, 41211, 39710, 38502, 37654, 37210, 37101, 37129, 37050, 36660, 35906, 35022, 34495, 34702, 35560, 36593, 37392, 37938, 38460]
54417C8460O24O00M21L27N34R01J026P20K53M4J95M27M39J78j51k54k2K86K80
54398D5288o7l40k63j11k59n35m81r7J13q2l48l93m04o52r82j081r63q80q87p97
54378C5779n76m35n03n62k96L08Q83J047P37J89l50p37q38n64q4K21J62n0j57
54359C4174j69j62l2K44L66J55j9K86Q10Q96N04K74N20Q48R46J092J443J515R07
54340D4598J15k8N19J067J222J237J338J343J117R01R17R42O14qm68m88k96l22
54322E4320o75j019j033q01o86q26r85r48q17q13q87q54p32p45r60j139j028o83
54304C8689l72k52k28j62j12k44n07n88l26J0P1o5k2K50L51N4l05k53K13O79Q74
54283C7755Q80Q92R61J019R91Q97Q28Q39Q55P54N38L28J64Mr8m9M2j21o21j166
$$ y = [38460, 39084, 39684, 40105, 40432, 40966, 41867, 42893, 43613, 43866, 43910, 44105, 44532, 44971, 45149, 44998, 44744, 44722, 45008, 45288, 45221, 44881, 44618, 44507, 44248, 43713, 43232, 43135, 43248, 43166, 42818, 42425, 42021, 41369, 40387, 39306, 38343, 37463, 36576, 35779, 35203, 34768, 34265, 33703, 33407, 33715, 34598, 35645, 36382, 36571, 36221, 35484, 34646, 34082, 33998, 34219, 34381, 34331, 34174, 34005, 33843, 33811, 34055, 34421, 34576, 34557, 34843, 35653, 36549, 37053, 37327, 37847, 38695, 39641, 40733, 42176, 43691, 44598, 44713, 44685, 45204, 46271, 47493, 48730, 50068, 51411, 52528, 53429, 54346, 55288, 55902, 55894, 55426, 54938, 54642, 54320, 53645, 52626, 51593, 50792, 50106, 49280, 48295, 47347, 46530, 45717, 44830, 43976, 43244, 42499, 41539, 40400, 39372, 38689, 38317, 38065, 37837, 37675, 37563, 37319, 36812, 36224, 35898, 35908, 35979, 35914, 35892, 36142, 36493, 36547, 36242, 35989, 36202, 36881, 37755, 38635, 39527, 40488, 41507, 42498, 43395, 44223, 45062, 45917, 46671, 47209, 47537, 47701, 47705, 47607, 47558, 47600, 47479, 46858, 45692]
54263D5692j414j344j127q85o60m95l98l48l76n09o26n88n43q10j294j499j210
54246C1566q43q41j053j088r24p76o37m08k81m97q10p52l48j07k50m40l76k06
54228B0929j46j01R4L33M30M07M11M35L49J43k0K6K49L97K32j27k56P0N28O45
54208B5028M32K98M18N37M65L61L79L92K77K00L61O40P03L94j49o13o77k64K81
54189B9463M22Rn21o81m51j46Pk7k43n37o24k79L40Q26R32P00L00l7o1K50N18
54168C0160L43j39l90k31o2k19m22k02L57O84M67J6k14j50n9j19k74l69l52k71
54148B8554j46O3M14Q17J014Q07L31m7j30j19k73m87m53j56mk94p68q99n23j0
54128B7691K21J58R7K03L04J73j22k78j87j46m56r53j105p30k77k94o99r24o74
$$ y = [45692, 44278, 42934, 41807, 40922, 40262, 39767, 39369, 39021, 38645, 38136, 37510, 36922, 36379, 35569, 34275, 32776, 31566, 30723, 29882, 28829, 27741, 26817, 26041, 25404, 24996, 24715, 24218, 23408, 22656, 22308, 22201, 21951, 21511, 21135, 20929, 20783, 20682, 20776, 21109, 21539, 21946, 22357, 22792, 23141, 23284, 23264, 23290, 23539, 23936, 24168, 24041, 23785, 23855, 24383, 25028, 25460, 25758, 26176, 26713, 27178, 27539, 27918, 28310, 28587, 28787, 29148, 29788, 30491, 30885, 30736, 30123, 29446, 29182, 29463, 29885, 29894, 29373, 28692, 28241, 28095, 28102, 28075, 27832, 27295, 26671, 26392, 26732, 27558, 28490, 29190, 29490, 29453, 29392, 29642, 30160, 30503, 30364, 29974, 29743, 29681, 29462, 29040, 28838, 29195, 29879, 30346, 30362, 30148, 29998, 29939, 29820, 29546, 29177, 28825, 28554, 28408, 28471, 28885, 29702, 30716, 31523, 31854, 31807, 31677, 31558, 31285, 30798, 30345, 30189, 30185, 29891, 29123, 28224, 27701, 27691, 27912, 28070, 28167, 28370, 28674, 28847, 28725, 28447, 28260, 28114, 27658, 26705, 25600, 24870, 24593, 24299, 23600, 22676, 22002]
54109B2002k43pR2L21O26O86M20J49J40K45J39k00n06o02n31l33M3N17Q14P90
54089B4562O25N40M62J91k06m70n44o48q37q47m89KK53K42K69M63N62K54l88r11
54069B3085r58o36l33k21j11J44L34J58k80n21l32M5K95L83M21L87J86j09l16
54050B1621l52k65j01R7K35K12M5j28j66m4J09R3j03k08M8N22P76O09K86J02K7
54029B3415r7j94q6J95M02L55R0j97k33J03N55O45K37k54m07l03k93m37n22m15
54009B2559j77J16L40K56j54m67k63K86O28N98M92M50K78k7r6K31N73N68L90M00
53989B6981N61O08N63O72R46J081R40P48P74R71J054Q61N56N14R45J645K171K272
53971D4863K083J868J663J342Q86N29N92J171J985K510K423J904J454J351J462
$$ y = [22002, 21759, 21752, 21844, 22165, 22791, 23477, 23897, 24046, 24186, 24431, 24570, 24370, 23864, 23262, 22731, 22398, 22441, 22958, 23772, 24562, 25187, 25727, 26189, 26380, 26174, 25704, 25160, 24512, 23675, 22828, 22339, 22341, 22594, 22836, 23105, 23568, 24130, 24384, 23996, 23085, 22127, 21491, 21158, 20937, 20826, 20970, 21304, 21462, 21182, 20661, 20329, 20374, 20669, 21052, 21473, 21860, 22046, 21937, 21621, 21269, 21004, 20903, 21000, 21235, 21447, 21492, 21364, 21198, 21154, 21263, 21356, 21253, 21045, 21093, 21615, 22391, 23000, 23286, 23388, 23415, 23318, 23124, 23038, 23233, 23635, 23990, 24080, 23883, 23650, 23753, 24308, 24953, 25190, 24936, 24529, 24226, 23933, 23496, 22974, 22559, 22382, 22498, 22838, 23094, 22940, 22473, 22210, 22496, 23124, 23722, 24214, 24664, 24942, 24915, 24819, 25050, 25623, 26191, 26581, 26981, 27542, 28150, 28713, 29385, 30331, 31412, 32352, 33100, 33874, 34845, 35899, 36760, 37316, 37830, 38775, 40420, 42591, 44863, 46946, 48814, 50477, 51819, 52705, 53234, 53826, 54997, 56982, 59492, 61915, 63819, 65273, 66624, 68086]
53956F8086J535J481J292R18M16O0Q2L72O34P47P56O12J66n10j096j400j536j585
53938G1030j361p30m1J70j74o27q83j116j516j822j696j333j230j445j528j242
53922E4456q71o86n34k22N5K7j58k06k05m33q00q80n06K8M18N77M61J1n41p11
53902D9280k92L30N95L48j04l42j26M26R07R67P11N60P22R71J024R07P82P07O53
53883E9026O68Q14J056J362J733K063K138J896J549J358J377J489J553J405R59
53868H0446M22J60K49L19O4l48n33m00j62J2R6R2R5L35R19J583J934J912J803
53849H8998J848K024K172K119J755J236R90J306J858J977J414N96M3j86l55o11
53833A07184q66r81q91o03k70j64m50r97j513j857k097k306k433k421k334k290
$$ y = [68086, 69621, 71102, 72394, 73312, 73728, 73788, 73870, 74242, 74876, 75623, 76379, 76991, 77157, 76647, 75551, 74151, 72615, 71030, 69669, 68939, 68898, 69068, 68894, 68267, 67384, 66268, 64752, 62930, 61234, 59901, 58671, 57226, 55698, 54456, 53585, 52899, 52365, 52143, 52198, 52225, 52067, 51861, 51656, 51223, 50423, 49543, 49037, 49065, 49483, 50060, 50521, 50532, 49991, 49280, 48988, 49318, 49913, 50261, 50157, 49815, 49689, 50115, 51022, 51989, 52700, 53260, 53982, 54953, 55977, 56884, 57666, 58373, 59026, 59694, 60508, 61564, 62926, 64659, 66722, 68860, 70756, 72305, 73663, 75040, 76529, 78082, 79487, 80446, 80868, 81028, 81277, 81596, 81660, 81312, 80779, 80379, 80217, 80229, 80325, 80417, 80512, 80847, 81766, 83349, 85283, 87195, 88998, 90846, 92870, 95042, 97161, 98916, 100152, 101142, 102448, 104306, 106283, 107697, 108293, 108336, 108150, 107795, 107184, 106318, 105337, 104446, 103843, 103573, 103409, 102959, 101962, 100449, 98592, 96495, 94189, 91756, 89335, 87001, 84711]
53817H4711k261k123j876j715j771j893j837j641j545j531j247n84n5k67j093
53802F3272j798j943j786j706j618j301r18q40j044j127r41p94q82r65p79n60
53786D4270p04j158j459j369j089q51o35m02k31j11J30N04P12N63K69R2p3l91
53768C8067o08k89M78J059J022N62J14j63l24l79k95j09J10L10M26M02L28L76
53750D1087N26N90N14M50M99N55N33N13N90P50R93J326J605J594J376J374J730
53733E6605J993J706J094Q06J073J485J562J252Q32N46M60M83M90M54M47M60L28
53716G2076m6m42n17k00J99K84o1o04r76j011r42j103j451j568j266q82p80q32
53698E9878o63l09j75m31q26j092j224j247j043n90j23J03J04P4J00J31J15R7
$$ y = [84711, 82450, 80327, 78451, 76736, 74965, 73072, 71235, 69594, 68049, 66518, 65271, 64687, 64632, 64365, 63272, 61474, 59531, 57745, 56039, 54421, 53120, 52202, 51362, 50318, 49191, 48250, 47456, 46574, 45609, 44830, 44270, 43566, 42408, 40949, 39580, 38491, 37640, 37005, 36603, 36372, 36261, 36391, 36895, 37607, 38170, 38439, 38531, 38458, 38067, 37459, 37170, 37648, 38707, 39729, 40291, 40405, 40242, 39918, 39539, 39244, 39135, 39245, 39555, 39981, 40383, 40711, 41087, 41613, 42203, 42717, 43167, 43666, 44221, 44754, 45267, 45857, 46607, 47600, 48926, 50531, 52125, 53501, 54875, 56605, 58598, 60304, 61398, 62204, 63277, 64762, 66324, 67576, 68408, 68954, 69414, 69897, 70387, 70841, 71288, 71748, 72076, 72030, 71588, 71071, 70871, 71070, 71354, 71293, 70689, 69713, 68702, 67760, 66657, 65206, 63638, 62372, 61490, 60710, 59878, 59215, 58906, 58731, 58300, 57474, 56382, 55158, 53911, 52868, 52278, 52155, 52258, 52362, 52436, 52536, 52667, 52782, 52879]
53680E2879J66L32M96N60N74O53P25M92j43q03j009p60m61k85pM96Q92Q05L32
53661E5934q4j93j31j18j91k54k31j53r7j52l21m89n16l90k37j62r4J35N70J020
53641E3846J245J165Q71M85J26m1R0L86N68N50N19O19P18O66N70O33Q04Q72Q20
53622F5512Q40R98J094R59P35P21R84J226J122P13L92M08N15L02j82m39k37K1
53604G5684j24n37p06m54j03pk39o72j107j295j149r11q69r15p02k06K02K52J01
53585F6243j8p5o8J51O14J003R49M70o0l47l72k50o8J20K13J38m5j37L3M08P32
53564F9634Q44Q14P66O44L74J41K49P09J187J388J319J156J033J021J154J346
53548H3779J459J442J368J270J117R44Q58Q66Q79Q86R67J094J121J010Q77Q03
$$ y = [52879, 53045, 53377, 53873, 54433, 55007, 55660, 56385, 56877, 56734, 55931, 54922, 54162, 53701, 53416, 53409, 53905, 54797, 55602, 55934, 55850, 55657, 55526, 55408, 55217, 54963, 54732, 54579, 54482, 54330, 54009, 53520, 53004, 52614, 52377, 52215, 52121, 52256, 52826, 53846, 55091, 56256, 57127, 57612, 57738, 57697, 57787, 58173, 58741, 59291, 59810, 60429, 61147, 61813, 62383, 63016, 63820, 64692, 65512, 66352, 67350, 68444, 69403, 70138, 70859, 71843, 73069, 74191, 74904, 75296, 75704, 76219, 76521, 76339, 75900, 75663, 75684, 75560, 75023, 74317, 73863, 73760, 73753, 73514, 72842, 71735, 70440, 69291, 68380, 67511, 66596, 65894, 65688, 65890, 66142, 66243, 66225, 66150, 66082, 66233, 66847, 67850, 68799, 69269, 69209, 68862, 68490, 68240, 68172, 68292, 68505, 68643, 68598, 68461, 68494, 68902, 69634, 70478, 71292, 72058, 72702, 73076, 73217, 73466, 74175, 75362, 76750, 78069, 79225, 80258, 81279, 82433, 83779, 85238, 86680, 88048, 89318, 90435, 91379, 92237, 93103, 93982, 94868, 95835, 96929, 98050, 99060, 99937, 100740]
53532A00740P87Q90J161J408J358J078R40J033R84N79J98K84O62P87N37L44N16
53515A14286P85P00J96l12l77O4O48R81R78Q24O34L67R6P3L89P45P80N24K65J65
53495A22811J95L42O01P97P53O15P30J123J344J073N94M95R41J524J810J821J831
53478A39400J874J714J340J151J462J998K185J915J647J748K069K326K534K805
53464A66168L014L000K961L243L803M206M209M018L954M108M367M604M699M640
53450B20994M620M902N457N903N928N663N514N767O410P197P806Q021P942P930
53436C10054Q237Q724R011Q898Q551Q316Q395Q708Q976Q965Q680Q311Q013P834
53422D29673P800P964Q264Q476Q476Q377Q321Q214P903P526P388P488P445P037
$$ y = [100740, 101527, 102417, 103578, 104986, 106344, 107422, 108362, 109395, 110379, 110958, 111156, 111440, 112102, 112889, 113426, 113770, 114286, 115071, 115771, 115967, 115655, 115278, 115342, 115990, 116971, 117949, 118773, 119407, 119774, 119870, 119943, 120332, 121077, 121857, 122381, 122646, 122811, 123006, 123348, 123949, 124746, 125499, 126114, 126844, 127967, 129311, 130384, 130978, 131473, 132414, 133938, 135748, 137569, 139400, 141274, 142988, 144328, 145479, 146941, 148939, 151124, 153039, 154686, 156434, 158503, 160829, 163363, 166168, 169182, 172182, 175143, 178386, 182189, 186395, 190604, 194622, 198576, 202684, 207051, 211655, 216354, 220994, 225614, 230516, 235973, 241876, 247804, 253467, 258981, 264748, 271158, 278355, 286161, 294182, 302124, 310054, 318291, 327015, 336026, 344924, 353475, 361791, 370186, 378894, 387870, 396835, 405515, 413826, 421839, 429673, 437473, 445437, 453701, 462177, 470653, 479030, 487351, 495565, 503468, 510994, 518382, 525870, 533315, 540352]
53408E40352O497O139N870N398M747M227L962L737L339K761K044J175K80l92q26
53393E89310j338k162l103l836m309m615m696m482m216m322m902n700o447p031
53379E28151p353p369p257p227p182o883o467o340o529o553o134n545n047m422
53365D37843l491k666k433k553k375j796j332j186r75m29J07K78L29O99J341J853
53349D23214K148K541L150L670L870L972M383N205O201P113P836Q355Q690Q962
53335D99310R322R802J0327J0863J1443J2045J2543J2940J3432J4158J4971J5601
53323F46757J5979J6223J6373J6366J6267J6271J6411J6479J6304J5976J5685
53312H25091J5445J5140J4707J4116J3282J2145J0800R453Q207P010N804M584
$$ y = [540352, 546849, 552988, 558858, 564256, 569003, 573230, 577192, 580929, 584268, 587029, 589073, 590248, 590528, 590136, 589310, 587972, 585810, 582707, 578871, 574562, 569947, 565251, 560769, 556553, 552231, 547329, 541629, 535182, 528151, 520798, 513429, 506172, 498945, 491763, 484880, 478413, 472073, 465544, 458991, 452857, 447312, 442265, 437843, 434352, 431686, 429253, 426700, 424325, 422529, 421197, 420011, 419036, 418607, 418714, 418992, 419321, 420020, 421361, 423214, 425362, 427903, 431053, 434723, 438593, 442565, 446948, 452153, 458354, 465467, 473303, 481658, 490348, 499310, 508632, 518434, 528761, 539624, 551067, 563112, 575655, 588595, 602027, 616185, 631156, 646757, 662736, 678959, 695332, 711698, 727965, 744236, 760647, 777126, 793430, 809406, 825091, 840536, 855676, 870383, 884499, 897781, 909926, 920726, 930179, 938386, 945396, 951200, 955784]
53300I55784L358K101P81o33k144l689n162o545p932r376j0735j1801j2531j3044
53286H78432j3422j3589j3533j3458j3627j4023j4297j4149j3715j3380j3275
53275G27964j3142j2748j2241j1920j1846j1853j1853j1800j1553j1034j0483
53264E97491j0188r966r318q168p088o584o497o348n926n372m876m600m641m843
53250E03076m844m534m246m253m296m017l520l157k938k617k247k092k037j626
53236D56652p83K6M75P91J289J887K359K746L206L694M103M495M952N395N786
53221D97073O313P091P803Q057P919P785P742P431O638N690N090M953M964M765
53207E89314M223L434K585J812J113M13k58p30r61j199j775k725l737m509n006
$$ y = [955784, 959142, 961243, 962024, 961391, 959247, 955558, 950396, 943851, 935919, 926543, 915808, 904007, 891476, 878432, 865010, 851421, 837888, 824430, 810803, 796780, 782483, 768334, 754619, 741239, 727964, 714822, 702074, 689833, 677913, 666067, 654214, 642361, 630561, 619008, 607974, 597491, 587303, 577337, 568019, 559851, 552763, 546179, 539682, 533334, 527408, 522036, 517160, 512560, 507919, 503076, 498232, 493698, 489452, 485199, 480903, 476886, 473366, 470209, 467271, 464654, 462407, 460315, 458278, 456652, 455869, 455895, 456370, 457161, 458450, 460337, 462696, 465442, 468648, 472342, 476445, 480940, 485892, 491287, 497073, 503386, 510477, 518280, 526337, 534256, 542041, 549783, 557214, 563852, 569542, 574632, 579585, 584549, 589314, 593537, 596971, 599556, 601368, 602481, 602894, 602636, 601906, 600945, 599746, 597971, 595246, 591509, 587000, 581994]
53192E81994n389n759o099o394o650o852o992p172p491p882q096p995p725p555
53178D83943p561p554p303o780o222n924n990o252o421o295n866n298m868m814
53164C96795n050n118m614l704l002k904l171l278k971k384j845j655j942k501
53150C52656k979l225l366l454l359l157l248l748m126l845l231l076l516l845
53136C04481l589l166l213l699m134m337m531m817m970m820m514m315m310m446
53122B45620m650m867m985m885m574m267m230m481m707m562m098l712l690l900
53108A84012l982l759l351k994k848k969l267l504l440l055k634k519k744k963
53094A39983k814k354k009k053k342k544k526k337k025j647j414j489j731j825
$$ y = [581994, 576605, 570846, 564747, 558353, 551703, 544851, 537859, 530687, 523196, 515314, 507218, 499223, 491498, 483943, 476382, 468828, 461525, 454745, 448523, 442599, 436609, 430357, 423936, 417641, 411775, 406477, 401609, 396795, 391745, 386627, 382013, 378309, 375307, 372403, 369232, 365954, 362983, 360599, 358754, 357099, 355157, 352656, 349677, 346452, 343086, 339632, 336273, 333116, 329868, 326120, 321994, 318149, 314918, 311842, 308326, 304481, 300892, 297726, 294513, 290814, 286680, 282343, 277812, 272995, 268025, 263205, 258691, 254376, 250066, 245620, 240970, 236103, 231118, 226233, 221659, 217392, 213162, 208681, 203974, 199412, 195314, 191602, 187912, 184012, 180030, 176271, 172920, 169926, 167078, 164109, 160842, 157338, 153898, 150843, 148209, 145690, 142946, 139983, 137169, 134815, 132806, 130753, 128411, 125867, 123341, 121004, 118979, 117332, 115918, 114429, 112698, 110873]
53080A10873j680j464j274j000n96k99l82q51j424j733j534r25l82l56p76j145
53064I5052j147r48p81o06l31j31k38n61q03q44p31m61j5M07M90K16j33l18l17
53045H7800j25K84P62J018R71Q71Q94Q59N32L1l04l37k58k84m53o87r17j100j268
53026H8289j518j825j942j647j147r62j318j820j925j552j098q99r30r85r55q78
53010F6888q31q71r45q97o65m25m01n86p65q56r61j101j100q69n78l93k89k16
52992E4139k78n14o65m62n7J48Nk45l78m13m09l23j55n6j38k99l26j71J5Pk95
52971D9130p93j240j404j239q47l42J74N84P38N97K88J4j30k15l60n16m70j21
52953D3848L14N10M52M21N66P23P08N43K61j84o65q21m82N2M11N55N37K11m15
$$ y = [110873, 109193, 107729, 106455, 105455, 104859, 104560, 104178, 103327, 101903, 100170, 98636, 97711, 97329, 96973, 96197, 95052, 93905, 92957, 92176, 91570, 91239, 91108, 90870, 90309, 89506, 88662, 87931, 87470, 87455, 87862, 88352, 88568, 88435, 88117, 87800, 87675, 87959, 88721, 89739, 90710, 91581, 92475, 93334, 93866, 93897, 93593, 93256, 92998, 92714, 92261, 91574, 90657, 89557, 88289, 86771, 84946, 83004, 81357, 80210, 79248, 77930, 76110, 74185, 72633, 71535, 70636, 69706, 68721, 67766, 66888, 66057, 65186, 64241, 63344, 62679, 62254, 61853, 61267, 60502, 59646, 58685, 57584, 56484, 55615, 55037, 54644, 54355, 54139, 53861, 53347, 52682, 52220, 52163, 52311, 52316, 52071, 51693, 51280, 50871, 50548, 50393, 50337, 50199, 49900, 49574, 49403, 49418, 49425, 49130, 48337, 47097, 45693, 44454, 43607, 43265, 43439, 44023, 44761, 45358, 45646, 45660, 45530, 45315, 44955, 44439, 43969, 43848, 44162, 44672, 45124, 45545, 46111, 46834, 47542, 48085, 48346, 48162, 47497, 46676, 46194, 46246, 46657, 47212, 47749, 47960, 47545]
52934D7545q52o38KM63N84O18N70J82l81n59k23J06M2j47j13M9J21J83L60N32
52914D8444N94O60P30N50J29n9K27N22L57P3L53J130J644J489J037Q02Q56J011
52896F0549J177J335J439J471J487J531J592J648J606J310P35J47j69k37k79l64
52880G4978m06m10m51m82l83k04j27j98k65k38j98k49m13o07o96n84l69k95m05
52861F7998m28j55K20L39J29k32n83q16p60l82J4P6j27k41j37J5J13K37L85M75
52841F6140N65P79R69Q25L54r7k97l07j31L66J038J366J050L93j00k82k85j47
52823G2199J38M08M30K33P2J15K94M69N88O44O23M71J64k40n60o10l18K00P09
52804G6029R18O32K6l70j79L42O05M21J68J75L03K33j3j34N6M29O66N30J10j81
$$ y = [47545, 46693, 46055, 46057, 46520, 47104, 47722, 48292, 48474, 48093, 47534, 47311, 47417, 47459, 47312, 47199, 47248, 47369, 47552, 47912, 48444, 49038, 49698, 50428, 50978, 51107, 51048, 51275, 51797, 52154, 52227, 52580, 53710, 55354, 56843, 57880, 58682, 59538, 60549, 61726, 63061, 64500, 65971, 67458, 68989, 70581, 72229, 73835, 75145, 75880, 76027, 75858, 75621, 75342, 74978, 74572, 74162, 73711, 73229, 72846, 72642, 72515, 72317, 72052, 71814, 71616, 71367, 70954, 70347, 69651, 69067, 68698, 68403, 67998, 67570, 67415, 67635, 67974, 68103, 67871, 67288, 66472, 65712, 65330, 65344, 65420, 65293, 65052, 64915, 64930, 65043, 65280, 65665, 66140, 66705, 67484, 68453, 69278, 69632, 69535, 69238, 68931, 68800, 69166, 70204, 71570, 72620, 73013, 72913, 72631, 72346, 72199, 72337, 72745, 73175, 73408, 73480, 73595, 73889, 74358, 74946, 75590, 76213, 76684, 76848, 76608, 76048, 75438, 75120, 75320, 76029, 76947, 77579, 77605, 77235, 77056, 77398, 78003, 78424, 78592, 78767, 79070, 79303, 79290, 79156, 79212, 79641, 80307, 80837, 80947, 80766]
52784H0766J9N96J092J251J218J158J036Q50P85R49J161J212J146J076R36O52
52768I5903L18K5l47q39j178j084p11m48m05m30n03p75j148j293j128r31q88q51
52750H3287p51q20j171j446j279q70p26r00r61o91m14m35o07o51o63q68j089q94
52732F8051k99J25l3m86o76m90k82l23n89r00j125j154r88q11q01q78p78m74k35
52713E6854l11o29r51j079r82p72o51o96p09m44J4K92K61J89L06L81N8o39j273
52694D9219j507j367j097r00q40q40p48m82j51J7q5l53n62n78m66m07m72n40m87
52675C7354m28n77q98j087r60o67m28k36KK11K01l3k89l62k35l9O9M5MR6K87L80
52653C2410K78J05k1j11j40K2L27M14M3n04p50o28m48l30r1K99N16L63R0P4L57
$$ y = [80766, 80785, 81381, 82473, 83724, 84942, 86100, 87136, 87986, 88771, 89720, 90881, 92093, 93239, 94315, 95251, 95903, 96221, 96246, 95899, 95060, 93882, 92798, 92087, 91639, 91234, 90804, 90301, 89526, 88378, 87085, 85957, 85026, 84138, 83287, 82536, 81716, 80545, 79099, 77820, 76950, 76224, 75324, 74363, 73672, 73258, 72823, 72216, 71565, 70902, 70034, 68945, 68051, 67752, 67877, 67844, 67358, 66682, 66192, 65910, 65587, 64998, 64098, 62973, 61819, 60831, 60020, 59219, 58341, 57563, 57089, 56854, 56543, 55914, 54963, 53884, 52902, 52130, 51479, 50783, 50074, 49630, 49644, 49936, 50197, 50386, 50692, 51073, 51131, 50492, 49219, 47712, 46345, 45248, 44348, 43508, 42668, 41920, 41438, 41287, 41304, 41219, 40866, 40304, 39726, 39260, 38853, 38381, 37841, 37354, 36926, 36349, 35451, 34364, 33404, 32737, 32309, 32073, 32075, 32286, 32487, 32454, 32165, 31803, 31568, 31529, 31598, 31643, 31647, 31743, 32030, 32410, 32688, 32793, 32772, 32661, 32521, 32543, 32870, 33284, 33327, 32823, 32073, 31445, 30997, 30667, 30576, 30875, 31391, 31754, 31844, 31918, 32275]
52632C2275O88Q53P89N34K57K14M64P80R49J077J346J621J597J233P87L91m4n04
52614D5307p31o34m84n22n84m45k93n20j050j335j065n44j96n9L0Kl03o97p63
52595C5114m16n5n7l31n46n42m12k81k08j99j89n7J92L22J07l30n89m75k14j07
52575C0727q2J52N56O70K39k83j70O35J367J327O48k3l45n01o98q88r45q61o65
52556C0860l80j77k56n15n60k27J44K11R7J52L29K59j33m21j98M09R27J024P24
52537C2269K54j19j89P3M74P60Q39P92O75M28L7k83k53J11M15L18m7j86J57O87
52517C7212R04O29R9l29m63k96P1M85P78Q85Q37P03N67N41O88Q89R18P11M88M83
52497D6800O04N65L27J92L72O23N72K43RJ8L4q4q3K40N76M43j10m71k10M45R60
$$ y = [32275, 32963, 33816, 34605, 35139, 35396, 35610, 36074, 36854, 37803, 38880, 40226, 41847, 43444, 44677, 45464, 45855, 45811, 45307, 44576, 43942, 43458, 42936, 42352, 41907, 41614, 41094, 40044, 38709, 37644, 37100, 36904, 36845, 36875, 36877, 36574, 35877, 35114, 34698, 34643, 34586, 34255, 33709, 33167, 32755, 32474, 32266, 32067, 31878, 31821, 32013, 32335, 32442, 32112, 31523, 31048, 30834, 30727, 30645, 30797, 31353, 32023, 32262, 31979, 31809, 32444, 33811, 35138, 35786, 35763, 35418, 34917, 34219, 33331, 32386, 31525, 30860, 30480, 30303, 30047, 29532, 28972, 28745, 28889, 29100, 29197, 29349, 29678, 29937, 29804, 29383, 29185, 29594, 30521, 31545, 32269, 32523, 32404, 32215, 32288, 32762, 33522, 34361, 35153, 35828, 36256, 36293, 36010, 35757, 35868, 36283, 36601, 36554, 36368, 36525, 37212, 38116, 38745, 38844, 38515, 38052, 37756, 37827, 38312, 39090, 39975, 40812, 41515, 42082, 42623, 43311, 44200, 45118, 45829, 46317, 46800, 47404, 47969, 48296, 48488, 48860, 49483, 50055, 50298, 50307, 50325, 50359, 50275, 50192, 50432, 51008, 51451, 51341, 50870, 50660, 51105, 52065]
52476E2065J067Q54N38L06K98M97O90O59M28K36K55L93L75O0l73n93m89k69j74
52457E6823j56l5J93L67M67O05P62P45N08K60J75J79J32M7k7j44l09l10M0N92
52437F0914R46Q61M31r0m99p04p09o17n05l20K6M35N93K91k57n19j73N03Q75O25
52417F2107R2j84n9J63K31J79J18M8mQ9L66O37O81N23L71M11O48R04R07N34K7
52396F8789j68J15N73Q12P43N45L40J10j74m28m66j39M66R88J127R73Q01O28K44
52377G5879k27l18J17N78N72K45N0L4p0k46j79J68L98K22j63l46j62K01M56M43
52357G7652K18o0l16n73p36o09k07J45K38L02O08R69R83O53L84L79M49M33M05
52338H1317L86J92k22n81o45n47n40n95m80j67J11J75J21J22J44j5l79o25m38
$$ y = [52065, 53132, 53986, 54524, 54830, 55128, 55625, 56315, 56974, 57402, 57638, 57893, 58286, 58661, 58721, 58348, 57755, 57266, 56997, 56823, 56667, 56632, 56825, 57192, 57659, 58264, 59026, 59771, 60279, 60539, 60714, 60893, 61025, 61072, 61045, 60901, 60592, 60282, 60322, 60914, 61860, 62721, 63152, 63062, 62563, 61859, 61150, 60533, 60028, 59708, 59734, 60169, 60762, 61053, 60796, 60277, 60104, 60607, 61482, 62107, 62199, 62015, 61956, 62119, 62350, 62529, 62647, 62695, 62691, 62780, 63146, 63783, 64464, 64987, 65358, 65769, 66417, 67321, 68228, 68762, 68789, 68621, 68736, 69309, 70121, 70864, 71409, 71749, 71859, 71685, 71257, 70791, 70652, 71118, 72106, 73233, 74206, 75007, 75635, 75879, 75652, 75334, 75451, 76029, 76601, 76846, 76896, 76930, 76860, 76614, 76435, 76603, 77001, 77223, 77060, 76714, 76552, 76753, 77209, 77652, 77870, 77810, 77494, 76921, 76185, 75576, 75369, 75514, 75752, 76054, 76662, 77631, 78614, 79267, 79651, 80030, 80479, 80912, 81317, 81703, 81895, 81673, 81092, 80447, 79900, 79360, 78765, 78285, 78118, 78229, 78404, 78525, 78647, 78791, 78776, 78397, 77772, 77334]
52319G7334J8K28ol02k14J81M59M59L73L92N10O70Q06P70M61O4j20pK63N99R58
52298H3896J135Q96M14J85M51R26J211J224J133J094J167J306J332J131R02R76
52282I9379J360J681J693J535J399J236R83Q06Q92J148J333J351J261J096Q64
52267A18017O70O61Q91J273J620J722J500J194J218J698K310K624K509K185J952
52252A42044J990K239K483K582K673K963L411L825M190M623N012N055M794M706
52238A92590N056N506N611N454N463N790O183O345O245O080O156O651P360P834
52224B78324P900P831P846P704P133O405O091O281O479O234N622M997M572M345
52210C67764M192L972L585L029K373J709J225J124J335J460J179O39K17J9j02
$$ y = [77334, 77352, 77580, 77574, 77272, 77058, 77239, 77698, 78157, 78530, 78922, 79432, 80102, 80908, 81678, 82139, 82203, 82083, 82076, 82339, 82938, 83896, 85031, 85927, 86341, 86526, 86977, 87903, 89114, 90338, 91471, 92565, 93732, 95038, 96370, 97501, 98403, 99379, 100739, 102420, 104113, 105648, 107047, 108283, 109266, 110072, 110964, 112112, 113445, 114796, 116057, 117153, 118017, 118687, 119348, 120239, 121512, 123132, 124854, 126354, 127548, 128766, 130464, 132774, 135398, 137907, 140092, 142044, 144034, 146273, 148756, 151338, 154011, 156974, 160385, 164210, 168400, 173023, 178035, 183090, 187884, 192590, 197646, 203152, 208763, 214217, 219680, 225470, 231653, 237998, 244243, 250323, 256479, 263130, 270490, 278324, 286224, 294055, 301901, 309605, 316738, 323143, 329234, 335515, 341994, 348228, 353850, 358847, 363419, 367764, 371956, 375928, 379513, 382542, 384915, 386624, 387849, 388973, 390308, 391768, 392947, 393586, 393803, 393822, 393720]
52195C93720j82q5J70L49L32K49K49L63O07J000J370J440J211J130J624K598L559
52178D09704M080M142M043M132M539N056N305N078M520L995L789L935M182M135
52164D70635L562K650J850J424J208Q87M04p4m62q62j343j776k078k418l022l787
52148D66798m330m494m571m857n172n112m681m349m454m784m902m666m292m016
52134D02118l874l711l359k837k416k319k374k180j686j320j351j490j351j068
52120C70782j052j305j428j287j186j318j408j138o48l85n72j009j362j487j470
52105C53727j483j551j515j256r58r73j386j809j812j450j214j421j793j796j330
52090C31980q50p51q69q23o31o54r53j149j014q09q04q19n90k85l02o62j009j080
$$ y = [393720, 393538, 393453, 393623, 393972, 394304, 394553, 394802, 395165, 395772, 396772, 398142, 399582, 400793, 401923, 403547, 406145, 409704, 413784, 417926, 421969, 426101, 430640, 435696, 441001, 446079, 450599, 454594, 458383, 462318, 466500, 470635, 474197, 476847, 478697, 480121, 481329, 482216, 482620, 482546, 482084, 481222, 479879, 478103, 476025, 473607, 470585, 466798, 462468, 457974, 453403, 448546, 443374, 438262, 433581, 429232, 424778, 419994, 415092, 410426, 406134, 402118, 398244, 394533, 391174, 388337, 385921, 383602, 381228, 379048, 377362, 376042, 374691, 373201, 371850, 370782, 369730, 368425, 366997, 365710, 364524, 363206, 361798, 360660, 360012, 359627, 359055, 358046, 356684, 355197, 353727, 352244, 350693, 349178, 347922, 346964, 345991, 344605, 342796, 340984, 339534, 338320, 336899, 335106, 333310, 331980, 331130, 330379, 329510, 328687, 328056, 327402, 326449, 325300, 324286, 323477, 322673, 321854, 321264, 320979, 320677, 320015, 319006, 317926]
52072C17926r18o19k61m4j67n47q69r82r73r24q27p88r17j048r02n54m36o79q50
52053C04621m41N09J498K074K120J877J738J922K243K415K546L036L926M761N249
52038C40094N639O255O985P552P967Q327Q494Q384Q362Q839R579R877R482Q901
52024D54737Q656Q630Q352P676O913O375O001N465M597L626K922K534K136J488
52010E30108P63K07k95r85j725k114k120k223k793l590m096m114l851l560l283
51995D96329k944k572k352k372k426k125j391o53l69m38l61N9N25P58Q73J104
51979D81645J440J728J902J928J781J645J834K354K714K523J995J579J294Q38
51965E07200K16k32l93n67r32j232j228j122j348k094l163m195m872n109n142
$$ y = [317926, 317008, 316389, 316128, 316084, 315917, 315370, 314501, 313519, 312546, 311622, 310795, 310007, 309090, 308042, 307140, 306586, 306150, 305471, 304621, 304180, 304689, 306187, 308261, 310381, 312258, 313996, 315918, 318161, 320576, 323122, 326158, 330084, 334845, 340094, 345733, 351988, 358973, 366525, 374492, 382819, 391313, 399697, 408059, 416898, 426477, 436354, 445836, 454737, 463393, 472023, 480375, 488051, 494964, 501339, 507340, 512805, 517402, 521028, 523950, 526484, 528620, 530108, 530871, 531078, 530783, 529798, 528073, 525959, 523839, 521616, 518823, 515233, 511137, 507023, 503172, 499612, 496329, 493385, 490813, 488461, 486089, 483663, 481538, 480147, 479494, 479125, 478687, 478326, 478385, 478910, 479668, 480541, 481645, 483085, 484813, 486715, 488643, 490424, 492069, 493903, 496257, 498971, 501494, 503489, 505068, 506362, 507200, 507416, 507184, 506791, 506224, 505292, 504060, 502832, 501710, 500362, 498268, 495105, 490910, 486038, 480929, 475787]
51950D75787n315n711o069o213o297o566p027p533q046q612r184r616r794r662
51936C70142r244q728q389q304q290q252q372q768r165r177q827q497q439q546
51922B49144q538q191p449o568o052o139o430o326n792n345n310n425n282m820
51908A61477m251l791l572l598l645l469l180l143l395l476l037k353j996k152
51894A16419k517k692k510k103j796j822k025k007j654j293j206j249j151r34
51880I1460p78p23p12p41p25m34P2K96j12p75j057r11q22r67j016p79n28n19o22
51861G9607o19n61n71n92n16m07l89m58n33n77n87n26m10l53m77q16j297j685
51843F8233j687j282q69q39j036r46l88K60N54M13Mm84q16p76m17o2Q4Q9pl18
$$ y = [475787, 470472, 464761, 458692, 452479, 446182, 439616, 432589, 425056, 417010, 408398, 399214, 389598, 379804, 370142, 360898, 352170, 343781, 335477, 327187, 318935, 310563, 301795, 292630, 283453, 274626, 266129, 257690, 249144, 240606, 232415, 224966, 218398, 212346, 206207, 199777, 193451, 187659, 182314, 177004, 171579, 166297, 161477, 157226, 153435, 149863, 146265, 142620, 139151, 135971, 132828, 129433, 125957, 122920, 120567, 118571, 116419, 113902, 111210, 108700, 106597, 104801, 102979, 100954, 98947, 97293, 96000, 94794, 93545, 92394, 91460, 90682, 89959, 89247, 88506, 87781, 87347, 87419, 87715, 87603, 86828, 85771, 84860, 84038, 83071, 82055, 81276, 80748, 80229, 79607, 78988, 78427, 77856, 77264, 76748, 76341, 75952, 75494, 74961, 74384, 73797, 73271, 72861, 72508, 72031, 71215, 69918, 68233, 66546, 65264, 64395, 63556, 62520, 61574, 61186, 61446, 62000, 62413, 62417, 61933, 61117, 60341, 59924, 59862, 59946, 60035, 60028, 59710]
51823E9710p71r59o44j46N9n0j24LJ65J96J11k8j82k54j58J4M3j49m03n13l89
51802E5531r7K12M06N25P65J159J386J082L35l02l81lL48L58J90K33O26J079J186
51783F4638Q56L62M9J9J62K84K36N4m3J10L38K83j18m96n05j97J35K98K32q4n18
51762F6095p33n09n5K07J36o3j85j85o0J94M40M75K92J18J20K10K39K02J91K16
51742F7345K17J37n6l61o76p75n33r1K29K99K87L58L93J49l15o17m93j39J04J40
51722F5602P9j09m89q49p91k61L25N87N84N53N35M58L70L32K83K12L18P04J051
51703F9494Q92K42l69m67r9L59N48L58j6j79J25P15J138J122Q04M88L60M71P57
51684G6743J024J082J022J178J701K233K260J774J332J441J970K375K432K452
$$ y = [59710, 58939, 57980, 57336, 57190, 57249, 57199, 57075, 57078, 57243, 57439, 57550, 57522, 57340, 57086, 56928, 56942, 56985, 56836, 56433, 55920, 55531, 55434, 55646, 56052, 56577, 57342, 58501, 59887, 60969, 61304, 61002, 60621, 60618, 60966, 61324, 61514, 61747, 62373, 63452, 64638, 65494, 65856, 65905, 65924, 66086, 66370, 66606, 66660, 66617, 66727, 67065, 67348, 67230, 66734, 66229, 66032, 66167, 66465, 66697, 66613, 66095, 65362, 64853, 64798, 65005, 65141, 65078, 64893, 64708, 64648, 64842, 65282, 65757, 66049, 66167, 66287, 66497, 66736, 66938, 67129, 67345, 67562, 67699, 67643, 67282, 66606, 65831, 65298, 65207, 65436, 65735, 66022, 66380, 66773, 66922, 66607, 65990, 65497, 65358, 65462, 65602, 65681, 65572, 65083, 64234, 63443, 63182, 63507, 64094, 64678, 65231, 65766, 66224, 66594, 66926, 67209, 67421, 67739, 68443, 69494, 70386, 70628, 70259, 69792, 69693, 70052, 70600, 70958, 70942, 70763, 70888, 71603, 72741, 73863, 74667, 75155, 75515, 75986, 76743, 77767, 78849, 79871, 81049, 82750, 84983, 87243, 89017, 90349, 91790, 93760, 96135, 98567, 101019]
51670A01019K757L165L242K966K739K749K695K256J589J082Q05M73r7p22j021
51655A25697q20l64j67n07j026j087n91j58k64o09o16k72nJ05L80Q48J010N58
51637A22112j42m95l34O5M02N57N64N57O64Q32R09Q71Q70R66J045J107J361J889
51619A33800K434K607K272J576Q09K46oj27l95p72r60q50o97o31l65L52J199J567
51601A42059J298Q00N33O00Q55J094J148R52O05K36j84p27j285j634j722j746
51585A42882j879k083k172j993j558j118j034j440k047k439k498k373k170j869
51571A16209j555j412j472j552j546j551j598j556j369j201j142r99o17k05j25
51556I8309m14q01j119j393j564j432r95n61m03m69n25m33j77K15N66N76J77k85
$$ y = [101019, 103776, 106941, 110183, 113149, 115888, 118637, 121332, 123588, 125177, 126259, 127064, 127537, 127440, 126718, 125697, 124877, 124513, 124346, 123839, 122813, 121726, 121135, 120977, 120713, 120104, 119488, 119216, 119211, 119316, 119696, 120544, 121554, 122112, 121970, 121475, 121141, 121206, 121608, 122165, 122729, 123286, 123950, 124782, 125691, 126562, 127432, 128398, 129443, 130550, 131911, 133800, 136234, 138841, 141113, 142689, 143498, 143744, 143738, 143611, 143216, 142444, 141484, 140634, 139937, 139306, 138941, 139293, 140492, 142059, 143357, 144157, 144690, 145290, 146145, 147239, 148387, 149339, 149944, 150180, 149996, 149269, 147984, 146350, 144628, 142882, 141003, 138920, 136748, 134755, 133197, 132079, 131045, 129605, 127558, 125119, 122621, 120248, 118078, 116209, 114654, 113242, 111770, 110218, 108672, 107121, 105523, 103967, 102598, 101397, 100255, 99256, 98639, 98434, 98309, 97895, 97094, 95975, 94582, 93018, 91586, 90591, 90030, 89627, 89158, 88633, 88200, 88023, 88238, 88804, 89380, 89557, 89272]
51538H9272l88j80j01l86p63q34n26q6K41L86M25M60N44O10N80N15N97Q89J232
51519I2487J430J463J423J362J295J263J284J268J125R19P96P95P91O44L35j2
51503A08668k45l30m20p26j250j741j917j687j139m72RQ7j19k02QK32J95J03L19
51484I9373P73J069J094J113J257J331J252J249J424J537J411J268J323J330R39
51469A17743K66k14k93k09j99k41k66l18l91l42j16J08J53J08J96M41O00M61J03
51450A17590j50m0L97Q61J037Q19L29j89n33o58o99q40j131j475j799k096k296
51433A09127k206j737j066n17k91m10p85j230j463j341j030q29p79o31k34K32
51417I4810M91M94M11L70L52L32L51M64O63R01J145J365J506J527J488J527J752
$$ y = [89272, 88884, 88704, 88603, 88217, 87454, 86620, 86094, 86008, 86249, 86635, 87060, 87520, 88064, 88674, 89254, 89769, 90366, 91255, 92487, 93917, 95380, 96803, 98165, 99460, 100723, 102007, 103275, 104400, 105319, 106115, 106910, 107701, 108345, 108680, 108668, 108423, 108093, 107673, 106947, 105697, 103956, 102039, 100352, 99213, 98741, 98750, 98837, 98718, 98516, 98524, 98756, 98951, 99054, 99373, 100146, 101215, 102309, 103422, 104679, 106010, 107262, 108511, 109935, 111472, 112883, 114151, 115474, 116804, 117743, 118009, 117795, 117502, 117293, 117094, 116853, 116587, 116269, 115878, 115536, 115420, 115528, 115681, 115789, 115985, 116426, 117026, 117487, 117590, 117440, 117400, 117797, 118658, 119695, 120514, 120843, 120654, 120121, 119463, 118764, 117924, 116793, 115318, 113519, 111423, 109127, 106921, 105184, 104118, 103601, 103310, 102900, 102115, 100885, 99422, 98081, 97051, 96222, 95443, 94812, 94578, 94810, 95301, 95795, 96206, 96576, 96928, 97260, 97611, 98075, 98738, 99639, 100784, 102149, 103655, 105182, 106670, 108197, 109949]
51400A09949K127K501K769K925K991K936K725K414K127J935J798J665J531J447
51386A41840J419J373J194Q43M19R8k2M4K07L75M43L54J69R7K82O63J037J233
51368A52068J196R47N78L05L35N89O85L26l02o90n51j29J40J08p7l29p20j201
51350A53278j494j433j227j138j070p74l84l29o99j033r69p12o46p34o99n48n67
51333A38822p74q68p26n87n70l99J49P90J032P98M25J92M4j61m36p13r27j014
51315A35077r69r49j168j618k022k167k190k429k980l508l549k997k281j991k290
51300A01969k781k980k823k562k317k016j692j528j531j448j147q50p41o68m54
51285G6431l15n67j043j228r48n52l71l30k40j03kQ1J07m3l19m44l25k40l95n79
$$ y = [109949, 112076, 114577, 117346, 120271, 123262, 126198, 128923, 131337, 133464, 135399, 137197, 138862, 140393, 141840, 143259, 144632, 145826, 146669, 147088, 147186, 147164, 147208, 147415, 147790, 148233, 148587, 148756, 148853, 149135, 149798, 150835, 152068, 153264, 154211, 154789, 155094, 155429, 156018, 156703, 157029, 156727, 156037, 155486, 155357, 155497, 155605, 155528, 155199, 154479, 153278, 151784, 150351, 149124, 147986, 146916, 146142, 145758, 145429, 144730, 143697, 142728, 142016, 141370, 140636, 139937, 139389, 138822, 138048, 137180, 136454, 135867, 135297, 134898, 135047, 135837, 136869, 137667, 138092, 138284, 138328, 138167, 137731, 137018, 136091, 135077, 134108, 133159, 131991, 130373, 128351, 126184, 123994, 121565, 118585, 115077, 111528, 108531, 106250, 104259, 101969, 99188, 96208, 93385, 90823, 88506, 86490, 84798, 83270, 81739, 80291, 79144, 78294, 77553, 76885, 76431, 76116, 75549, 74506, 73278, 72330, 71778, 71407, 71077, 70837, 70734, 70732, 70813, 70920, 70877, 70558, 70114, 69789, 69549, 69154, 68575]
51265F8575n11l04k28k14MM15P70J007J201J193P55J46l9L22O70O12M62O67J064
51246G6567J159Q91O86P91J011J065R35P87P66Q80R73Q22M02m6l16n20q38j154
51228H4861j224j133j212j514j695j548j307j281j415j474j440j409j286r12m77
51213F5534m12p81j116j032p34o76q61q56m85j57l39r60j506j613j335r21n59
51196E1191k99j12N1J62J27o3k44k52j26k9K0J11K49L16K82K53L14M62O65Q36
51176E3914P52K78l35o20m29j03K7j9o0j13k57m10m66m68m49k87O8L54K93J0j02
51155E1578Q1L22M22M19L79K79J35M2J9J2N9K39M55M72L06K89O14J019J090P61
51135E8992L23M6m3n5j20l04n75p77p73n96m14l52l50l01j49P8L01M07K57j80
$$ y = [68575, 68064, 67760, 67532, 67318, 67322, 67737, 68507, 69514, 70715, 71908, 72663, 72809, 72770, 73092, 73762, 74374, 74836, 75503, 76567, 77726, 78617, 79303, 80094, 81105, 82170, 83105, 83892, 84658, 85538, 86511, 87333, 87735, 87689, 87373, 86853, 86015, 84861, 83637, 82504, 81292, 79778, 78083, 76535, 75228, 73947, 72532, 71058, 69618, 68209, 66923, 66011, 65534, 65122, 64341, 63225, 62193, 61459, 60783, 59922, 59066, 58581, 58424, 58085, 57125, 55619, 54006, 52671, 51750, 51191, 50892, 50780, 50831, 50993, 51120, 51057, 50813, 50561, 50435, 50406, 50426, 50537, 50786, 51102, 51384, 51637, 51951, 52413, 53078, 53914, 54666, 54944, 54609, 53989, 53560, 53457, 53484, 53465, 53405, 53292, 53035, 52625, 52159, 51691, 51242, 50955, 51023, 51377, 51670, 51680, 51578, 51659, 51981, 52403, 52822, 53201, 53480, 53615, 53657, 53676, 53688, 53747, 53986, 54441, 54913, 55219, 55508, 56122, 57141, 58231, 58992, 59315, 59361, 59318, 59263, 59143, 58839, 58264, 57487, 56714, 56118, 55704, 55352, 55002, 54701, 54552, 54630, 54931, 55338, 55595, 55415]
51115E5415p13r99q47m36j13j1M3K07L88M09K68M6k93p54j078q95k18M68P39O64
51095E2290N29L92J33j60k04K0J37j09m45m38j59j25n48r77q89l93m6j22l88n62
51075D7936o33o35m80j68O4N9k4K5J27Q2m2k5J19J61Q5J95O64J221J416J111O12
51054E1870L50N06Q81J087R19N40K24K5k24n48p04m83l5K51J48j82l53j71K07
51035E4308M78N07L44L7l59n92l48L25Q74Q51M31J30J35K08J29l5j41j17M0K40
51015E7445K47k5k57m1N33R38Q86N75K70L1p5P8K87Q2n78j026p21J0M75N42N88
50994F0264P28O61K84j23l90o24p97o03J5O56R80J124J314J414J213R26R37J146
50976F9125J074O01K12L20P33R67R02P99Q53R58Q90N66R4k64k57R7M41M30J10
$$ y = [55415, 54702, 53703, 52856, 52420, 52307, 52296, 52339, 52546, 52934, 53343, 53611, 53657, 53364, 52610, 51532, 50637, 50419, 50887, 51626, 52290, 52819, 53211, 53344, 53184, 52980, 53000, 53137, 53028, 52583, 52145, 51986, 51861, 51313, 50336, 49447, 49054, 49008, 48886, 48498, 47936, 47303, 46668, 46188, 46020, 46084, 46143, 46119, 46144, 46271, 46353, 46311, 46286, 46405, 46566, 46651, 46846, 47510, 48731, 50147, 51258, 51870, 52220, 52726, 53607, 54694, 55613, 56153, 56377, 56402, 56178, 55630, 54926, 54443, 54408, 54659, 54807, 54625, 54272, 54101, 54308, 54786, 55293, 55637, 55674, 55315, 54723, 54375, 54700, 55574, 56425, 56856, 56986, 57121, 57329, 57458, 57423, 57282, 57165, 57205, 57445, 57692, 57667, 57410, 57369, 57902, 58840, 59726, 60301, 60571, 60602, 60527, 60605, 60892, 60974, 60396, 59370, 58649, 58659, 59134, 59676, 60264, 60992, 61653, 61937, 61814, 61424, 60800, 60003, 59400, 59415, 60071, 61051, 62175, 63489, 64903, 66116, 67042, 67979, 69125, 70199, 70800, 71012, 71332, 72065, 73032, 73934, 74733, 75586, 76544, 77434, 78000, 78094, 77830, 77573, 77670, 78111, 78541, 78651]
50957G8651j91k55j11J96O45J044J122R06P60Q88J034Q96O15N49P39R24R53R28
50939I0293R56J057J311J817K473L013L308L421L396L269L223L455L841M071M164
50924A33068M495N164N706N672N286N183N733O785P967Q948R530R806J0192J1088
50910B34623J2475J3973J5254J6256J7089J7917J8924K0184K1562K2853K3987
50899D35097K4971K5679K5910K5653K5137K4534K3724K2425K0472J7969J5222
50888F86793J2573J0146P787N271K680L91j303k527l658m839n781o115n894n593
50874F89931n628o007o467o821p070p344p914r097j0906j2844j4306j5199j5964
50861E64364j6944j8039j9006j9750k0199k0168j9595j8741j7910j7145j6336
$$ y = [78651, 78460, 78205, 78094, 78290, 78935, 79979, 81101, 82007, 82767, 83655, 84689, 85585, 86200, 86749, 87488, 88412, 89365, 90293, 91249, 92306, 93617, 95434, 97907, 100920, 104228, 107649, 111045, 114314, 117537, 120992, 124833, 128904, 133068, 137563, 142727, 148433, 154105, 159391, 164574, 170307, 177092, 185059, 194007, 203537, 213343, 223535, 234623, 247098, 261071, 276325, 292581, 309670, 327587, 346511, 366695, 388257, 411110, 435097, 460068, 485747, 511657, 537310, 562447, 586981, 610705, 633130, 653602, 671571, 686793, 699366, 709512, 717299, 722570, 725250, 725641, 724338, 721811, 718153, 713314, 707533, 701418, 695524, 689931, 684303, 678296, 671829, 665008, 657938, 650594, 642680, 633583, 622677, 609833, 595527, 580328, 564364, 547420, 529381, 510375, 490625, 470426, 450258, 430663, 411922, 394012, 376867, 360531]
50850C60531j5494j4646j3663j2448j1212j0269r596q840p784o650n809n337m941
50837B33842m287l374k551k101j882j511q79k51J62M25O43P58Q32J182J905K572
50821B25485K708K431K239K329K504K690L087L777M560N225N754O154O398O594
50807B81935O980P692Q650R739J0859J1847J2582J3182J3928J4976J6363J8170
50795D26903K0392K2681K4651K6428K8557L1292L4351L7484M0809M4317M7556
50784G85421N0085N2032N3790N5369N6415N6710N6294N5182N3190N0093M5733
50773A370314M0046L3242K5926J8788J2150N934M6n337r866j3267j5485j6685
50761A445806j7103j6845j5927j4504j2980j1773j1122j1160j2071j3978j6780
$$ y = [360531, 345037, 330391, 316728, 304280, 293068, 282799, 273203, 264363, 256579, 249929, 244120, 238783, 233842, 229555, 226181, 223630, 221529, 219647, 218136, 217257, 217006, 217168, 217593, 218236, 218994, 219826, 221008, 222913, 225485, 228193, 230624, 232863, 235192, 237696, 240386, 243473, 247250, 251810, 257035, 262789, 268943, 275341, 281935, 288915, 296607, 305257, 314996, 325855, 337702, 350284, 363466, 377394, 392370, 408733, 426903, 447295, 469976, 494627, 521055, 549612, 580904, 615255, 652739, 693548, 737865, 785421, 835506, 887538, 941328, 996697, 1053112, 1109822, 1166116, 1221298, 1274488, 1324581, 1370314, 1410360, 1443602, 1469528, 1488316, 1500466, 1506400, 1506446, 1501109, 1491243, 1477976, 1462491, 1445806, 1428703, 1411858, 1395931, 1381427, 1368447, 1356674, 1345552, 1334392, 1322321, 1308343, 1291563]
50750A291563k0222k4017k7825l1270l4208l6885l9634m2454m4961m6680m7248
50739H96159m6569m4997m3185m1493l9618l7085l3976l0906k8259k5896k3576
50728E00599k1331j9258j7317j5512j3991j2774j1568j0141q688p581o817o044
50716C49577n077m161l621l501l570l602l488l212k809k382k041j818j610j289
50702C07396q18l26QR7Nj22j18J79Q22J700K597L346L922M382M840N500O545P857
50684C47812R022R755J0329J1279J2695J4108J5177J6197J7657J9517K1319K2938
50672E27805K4723K6848K8911L0506L1809L3215L4592L5399L5462L5120L4554
50661H78944L3404L1299K8382K4985K1107J6548J1460O326J436l273p811j1882
$$ y = [1291563, 1271341, 1247324, 1219499, 1188229, 1154021, 1117136, 1077502, 1035048, 990087, 943407, 896159, 849590, 804593, 761408, 719915, 680297, 643212, 609236, 578330, 550071, 524175, 500599, 479268, 460010, 442693, 427181, 413190, 400416, 388848, 378707, 370019, 362438, 355621, 349577, 344500, 340339, 336718, 333217, 329647, 326045, 322557, 319345, 316536, 314154, 312113, 310295, 308685, 307396, 306578, 306252, 306260, 306357, 306362, 306240, 306122, 306301, 307123, 308823, 311420, 314766, 318688, 323070, 327910, 333410, 339955, 347812, 356834, 366589, 376918, 388197, 400892, 415000, 430177, 446374, 464031, 483548, 504867, 527805, 552528, 579376, 608287, 638793, 670602, 703817, 738409, 773808, 809270, 844390, 878944, 912348, 943647, 972029, 997014, 1018121, 1034669, 1046129, 1052455, 1053891, 1050618, 1042807, 1030925]
50649A030925j5136j7440j8787j9119j8474j7177j5629j4038j2438j0958r850
50638H61879r254r066r168r666j0834j2795j5332j8029k0580k2911k5051k6895
50626F72298k8135k8450k7809k6593k5308k4161k2948k1438j9689j7914j6110
50615D13743j4124j2061j0319r070q010o813n628m782m218l546k636j755j011
50602C29770j28J094K341L138L447L655M062M630N197N699O176O711P368Q119
50588C91279Q840R455J0059J0749J1507J2332J3412J4878J6463J7703J8459J9044
50576E54180J9720K0418K1034K1655K2274K2537K2146K1307K0442J9558J8301
50565G83572J6585J4727J2856J0647P929N214L178J816N56q41j916k191j813j318
$$ y = [1030925, 1015789, 998349, 979562, 960443, 941969, 924792, 909163, 895125, 882687, 871729, 861879, 852625, 843559, 834391, 824725, 813891, 801096, 785764, 767735, 747155, 724244, 699193, 672298, 644163, 615713, 587904, 561311, 536003, 511842, 488894, 467456, 447767, 429853, 413743, 399619, 387558, 377239, 368169, 360159, 353346, 347718, 342936, 338718, 335172, 332536, 330781, 329770, 329642, 330736, 333077, 336215, 339662, 343317, 347379, 352009, 357206, 362905, 369081, 375792, 383160, 391279, 400119, 409574, 419633, 430382, 441889, 454221, 467633, 482511, 498974, 516677, 535136, 554180, 573900, 594318, 615352, 637007, 659281, 681818, 703964, 725271, 745713, 765271, 783572, 800157, 814884, 827740, 838387, 846316, 851530, 854708, 856524, 857080, 856239, 854323, 852132, 850319, 849001]
50551H49001r74n89O7R49J768K193K037J398O24k1o98j841l666n927q275j0668
50535H25378j3252j5973j8459k0392k1766k2736k3336k3473k3170k2668k2230
50524E97923k1884k1410k0585j9401j8052j6737j5519j4401j3394j2447j1390
50513D12703j0079q637p339o251n149l884k676j827j285p51p9O12J304K178L280
50498C72120M297M905N176N503O127O976P832Q550R093R542J0034J0609J1116
50485D71880J1379J1387J1287J1203J1215J1390J1734J2116J2442J2826J3439
50474F02298J4203J4879J5493J6430J7960J9866K1712K3384K5114K7052K9053
50463H27444L0905L2640L4433L6317L8023L9169L9502L9009L7843L6182L4097
$$ y = [849001, 848027, 847438, 847505, 848454, 850222, 852415, 854452, 855850, 856474, 856453, 855755, 853914, 850248, 844321, 836046, 825378, 812126, 796153, 777694, 757302, 735536, 712800, 689464, 665991, 642821, 620153, 597923, 576039, 554629, 534044, 514643, 496591, 479854, 464335, 449934, 436540, 424093, 412703, 402624, 393987, 386648, 380397, 375248, 371364, 368688, 366861, 365576, 364825, 364746, 365358, 366662, 368840, 372120, 376417, 381322, 386498, 392001, 398128, 405104, 412936, 421486, 430579, 440121, 450155, 460764, 471880, 483259, 494646, 505933, 517136, 528351, 539741, 551475, 563591, 576033, 588859, 602298, 616501, 631380, 646873, 663303, 681263, 701129, 722841, 746225, 771339, 798391, 827444, 858349, 890989, 925422, 961739, 999762, 1038931, 1078433, 1117442, 1155285, 1191467, 1225564]
50452A225564L1467K8020K3584J8365J2875P498K153l453r286j4837j9537k3150
50440A279263k5777k7617k8778k9204k8686k7082k4573k1561j8259j4541j0349
50429A022836o053k229Q37L219M984N993O045M979K628j058n770j0891j5901k0600
50415I89019k4901k8618l1568l3723l5054l5416l4775l3491l2103l0824k9448
50404F39098k7742k5745k3695k1803k0181j8746j7201j5210j2806j0447q618p405
50392D29499o544n708m674l358j894n70M56J336K277L251M124M930N822O750P493
50377D43190Q001Q465Q998R506R897J0202J0428J0535J0606J0780J0895J0547
50365E62050R686Q843Q456Q274P778O964O261N818N343M699M186M084M326M783
$$ y = [1225564, 1257031, 1285051, 1308635, 1327000, 1339875, 1347373, 1349526, 1346073, 1336787, 1321950, 1302413, 1279263, 1253486, 1225869, 1197091, 1167887, 1139201, 1112119, 1087546, 1065985, 1047726, 1033185, 1022836, 1016783, 1014554, 1015391, 1018610, 1023594, 1029587, 1035632, 1040611, 1043239, 1042181, 1036411, 1025520, 1009619, 989019, 964118, 935500, 903932, 870209, 835155, 799739, 764964, 731473, 699370, 668546, 639098, 611356, 585611, 561916, 540113, 519932, 501186, 483985, 468775, 455969, 445522, 436904, 429499, 422955, 417247, 412573, 409215, 407321, 406751, 407207, 408543, 410820, 414071, 418195, 423125, 428947, 435697, 443190, 451191, 459656, 468654, 478160, 488057, 498259, 508687, 519222, 529828, 540608, 551503, 562050, 571736, 580579, 589035, 597309, 605087, 612051, 618312, 624130, 629473, 634172, 638358, 642442, 646768, 651551]
50351F51551N548O672P864Q785R480J0257J1203J2072J2643J2894J2827J2357
50339G74153J1499J0479R493Q454P101N336L281J023j558m568p853j1100j4118
50326G91622j6883j9297k1133k2241k2693k2646k2170k1225j9706j7502j4703
50315E71423j1809r448p742o166m185j885K61J935L036L423L012K032P93p54k881
50300E41045n450p860r671j0960j1947j2583j2750j2609j2495j2553j2598j2302
50288D07267j1487j0387r537r224r103q572p505o317n373m712m310m193m152l798
50274C08597l063k311j765j182l47N63J315J969K566K900K920L009L460L994M260
50259C26885M498N130N961O375O285O232O525O824O742O384O125O133O312O454
$$ y = [651551, 657099, 663771, 671635, 680420, 689900, 700157, 711360, 723432, 736075, 748969, 761796, 774153, 785652, 796131, 805624, 814078, 821179, 826515, 829796, 830819, 829261, 824693, 816840, 805740, 791622, 774739, 755442, 734309, 712068, 689375, 666729, 644559, 623334, 603628, 586126, 571423, 559614, 550166, 542424, 536258, 532073, 530188, 530449, 532384, 535420, 538843, 541855, 543887, 544680, 543926, 541045, 535595, 527735, 518064, 507104, 495157, 482574, 469824, 457215, 444720, 432167, 419569, 407267, 395780, 385393, 375856, 366632, 357529, 348957, 341452, 335135, 329762, 325050, 320740, 316547, 312395, 308597, 305534, 303223, 301458, 300276, 299929, 300492, 301807, 303776, 306342, 309242, 312162, 315171, 318631, 322625, 326885, 331383, 336513, 342474, 348849, 355134, 361366, 367891, 374715, 381457, 387841, 393966, 400099, 406411, 412865]
50245D12865O346N921N329M746M122L341K532J897J328N80k38p77j074j588k481
50230D42849l315l678l757l966m360m674m784m833n002n335n727n969n932n794
50216C75723n855o102o151n774n233m890m766m713m772n038n275n095m453l754
50202C03852l346l162k902k417j765j068m13P5K57J26q3o4K58O43Q40Q26P07N11
$$ y = [412865, 419211, 425132, 430461, 435207, 439329, 442670, 445202, 447099, 448427, 449007, 448769, 447992, 446918, 445330, 442849, 439534, 435856, 432099, 428133, 423773, 419099, 414315, 409482, 404480, 399145, 393418, 387449, 381517, 375723, 369868, 363766, 357615, 351841, 346608, 341718, 336952, 332239, 327467, 322429, 317154, 312059, 307606, 303852, 300506, 297344, 294442, 292025, 290260, 289192, 288779, 288854, 289111, 289237, 289154, 289090, 289348, 289991, 290831, 291657, 292364, 292875]
$$ [...]
##END NTUPLES=NMR SPECTRUM
##END=
