
##TITLE=AC1172_Tolima-ibage-TFiAH12005_5975045_X3r5J5SXQw
##JCAMPDX= 6.0         $$ Bruker NMR JCAMP-DX V2.0
##DATA TYPE= NMR SPECTRUM
##DATA CLASS= NTUPLES
##ORIGIN= BRUKER
##OWNER= Administrator
$$ 1.72 TOPSPIN		Version 2.1
$$ 2012-04-16 19:00:47.468 -0500  Administrator@TOPSPIN
$$ Compression mode = diff/dup
##.OBSERVE FREQUENCY= 400.13188235
##.OBSERVE NUCLEUS= ^1H
##.ACQUISITION MODE= SIMULTANEOUS (DQD)
##.ACQUISITION SCHEME= undefined
##.AVERAGES= 8
##.DIGITISER RES= 22
##SPECTROMETER/DATA SYSTEM= spect
##.PULSE SEQUENCE= zg30
##.SOLVENT NAME= COFFEE_meoh
##.SHIFT REFERENCE= INTERNAL, COFFEE_meoh, 1, 14.98061
##AUDIT TRAIL= $$ (NUMBER, WHEN, WHO, WHERE, PROCESS, VERSION, WHAT)
$$ ##TITLE= Audit trail, TOPSPIN		Version 2.1
$$ ##JCAMPDX= 5.01
$$ ##ORIGIN= Bruker BioSpin GmbH
$$ ##OWNER= Administrator
$$ $$ C:\Bruker\TOPSPIN/data/COFFEE/nmr/AC1172_Tolima-ibage-TFiAH12005_5975045_X3r5J5SXQw/10/pdata/1/auditp.txt
$$ ##AUDIT TRAIL=  $$ (NUMBER, WHEN, WHO, WHERE, PROCESS, VERSION, WHAT)
(   1,<2012-04-15 19:56:09.296 -0500>,<Administrator>,<TOPSPIN>,<go>,<TOPSPIN 2.1>,
      <created by zg
	started at 2012-04-15 19:55:02.484 -0500,
	POWCHK enabled, PULCHK disabled,
       configuration hash MD5:
       1A 1E CE 29 27 FD 77 03 67 4E F0 E3 C4 B2 CB 90
       data hash MD5: 64K
       55 4F 17 98 07 ED B8 7C A0 5A 37 36 2E D7 E5 D9>)
(   2,<2012-04-15 19:56:12.203 -0500>,<Administrator>,<TOPSPIN>,<proc1d>,<TOPSPIN 2.1>,
      <Start of raw data processing
       efp LB = 0 FT_mod = 6 PKNL = 1 PHC0 = 0 PHC1 = 0 SI = 32K 
       data hash MD5: 32K
       6E 80 13 DE 61 1C 74 06 9D 0B D4 FC 53 F3 80 62>)
(   3,<2012-04-15 19:56:12.546 -0500>,<Administrator>,<TOPSPIN>,<proc1d>,<TOPSPIN 2.1>,
      <pk PHC0 = 211.4319 PHC1 = 0 
       data hash MD5: 32K
       E3 90 6A 89 29 61 09 33 4B C2 EB 1C 9A 8E 4C C8>)
(   4,<2012-04-15 19:56:12.609 -0500>,<Administrator>,<TOPSPIN>,<proc1d>,<TOPSPIN 2.1>,
      <abs ABSG = 1 
       data hash MD5: 32K
       9F A9 47 35 5B CF B5 18 D6 F7 DD 40 BC E0 BC 35>)
(   5,<2012-04-15 19:56:12.640 -0500>,<Administrator>,<TOPSPIN>,<proc1d>,<TOPSPIN 2.1>,
      <abs ABSG = 2 
       data hash MD5: 32K
       4F C3 29 80 82 71 8D 50 AF 8B 2F 23 C6 2C A7 A1>)
(   6,<2012-04-15 19:56:12.671 -0500>,<Administrator>,<TOPSPIN>,<proc1d>,<TOPSPIN 2.1>,
      <abs ABSG = 3 
       data hash MD5: 32K
       D2 E0 C6 F8 50 C4 66 77 CE 17 33 DF 9E 83 00 56>)
(   7,<2012-04-15 19:56:12.703 -0500>,<Administrator>,<TOPSPIN>,<proc1d>,<TOPSPIN 2.1>,
      <abs ABSG = 4 
       data hash MD5: 32K
       61 66 C8 21 FB 69 D2 B7 A2 11 23 42 54 0A AB 4E>)
(   8,<2012-04-15 19:56:12.781 -0500>,<Administrator>,<TOPSPIN>,<proc1d>,<TOPSPIN 2.1>,
      <abs ABSG = 5 
       data hash MD5: 32K
       0B 5A 78 B1 29 3A 5F A2 6B 97 32 3C 57 4E F1 E2>)
(   9,<2012-04-15 19:56:16.765 -0500>,<Administrator>,<TOPSPIN>,<audit>,<TOPSPIN 2.1>,
      <user comment:
       ICON-NMR User ID: COFFEE
       data hash MD5: 32K
$$ [...]
##$TP= (0..7)
150 150 150 150 150 150 150 150
##$TP07= 0
##$TPNAME0= <>
##$TPNAME1= <>
##$TPNAME2= <>
##$TPNAME3= <>
##$TPNAME4= <>
##$TPNAME5= <>
##$TPNAME6= <>
##$TPNAME7= <>
##$TPOAL= (0..7)
0.5 0.5 0.5 0.5 0.5 0.5 0.5 0.5
##$TPOFFS= (0..7)
0 0 0 0 0 0 0 0
##$TUNHIN= 0
##$TUNHOUT= 0
##$TUNXOUT= 0
##$USERA1= <user>
##$USERA2= <user>
##$USERA3= <user>
##$USERA4= <user>
##$USERA5= <user>
##$V9= 5
##$VALIST= <valist>
##$VCLIST= <CCCCCCCCCCCCCCC>
##$VD= 0
##$VDLIST= <DDDDDDDDDDDDDDD>
##$VPLIST= <PPPPPPPPPPPPPPP>
##$VTLIST= <TTTTTTTTTTTTTTT>
##$WBST= 2048
##$WBSW= 25
##$XGAIN= (0..3)
0 0 0 0
##$XL= 0
##$YL= 0
##$YMAX_a= 450550
##$YMIN_a= -550925
##$ZGOPTNS= <>
##$ZL1= 120
##$ZL2= 120
##$ZL3= 120
##$ZL4= 120
##$ABSF1= 14.98061
##$ABSF2= -5.57192
##$ABSG= 5
##$ABSL= 3
##$ALPHA= 0
##$AQORDER= 0
##$ASSFAC= 0
##$ASSFACI= 0
##$ASSFACX= 0
##$ASSWID= 0
##$AUNMP= <proc_prof1d_extract_pilot.lims>
##$AXLEFT= 0
##$AXNAME= <>
##$AXNUC= <1H>
##$AXRIGHT= 0
##$AXTYPE= 0
##$AXUNIT= <>
##$AZFE= 0.1
##$AZFW= 0.1
##$BCFW= 0
##$BC_mod= 0
##$BYTORDP= 0
##$COROFFS= 0
##$CY= 15
##$DATMOD= 1
##$DC= 0
##$DFILT= <>
##$DTYPP= 0
##$F1P= 0
##$F2P= 0
##$FCOR= 0.5
##$FTSIZE= 32768
##$FT_mod= 6
##$GAMMA= 0
##$GB= 0
##$INTBC= 1
##$INTSCL= 1
##$ISEN= 128
##$LB= 0
##$LEV0= 0
##$LPBIN= 0
##$MAXI= 10000
##$MC2= 0
##$MEAN= 0
##$ME_mod= 0
##$MI= 0
##$NCOEF= 0
##$NC_proc= -8
##$NLEV= 6
##$NOISF1= 0
##$NOISF2= 0
##$NSP= 0
##$NTH_PI= 0
##$NZP= 0
##$OFFSET= 14.98061
##$PC= 1
##$PHC0= 211.4319
##$PHC1= 0
##$PH_mod= 1
##$PKNL= yes
##$PPARMOD= 0
##$PPDIAG= 0
##$PPIPTYP= 0
##$PPMPNUM= 2147483647
##$PPRESOL= 1
##$PSCAL= 4
##$PSIGN= 0
##$PYNMP= <proc.py>
##$REVERSE= no
##$SF= 400.13
##$SI= 32768
##$SIGF1= 0
##$SIGF2= 0
##$SINO= 400
##$SIOLD= 32768
##$SPECTYP= <>
##$SREGLST= <1H.CDCl3>
##$SSB= 0
##$STSI= 32768
##$STSR= 0
##$SW_p= 8223.68421052632
##$SYMM= 0
##$S_DEV= 0
##$TDeff= 65536
##$TDoff= 0
##$TI= <>
##$TILT= no
##$TM1= 0
##$TM2= 0
##$TOPLEV= 0
##$USERP1= <user>
##$USERP2= <user>
##$USERP3= <user>
##$USERP4= <user>
##$USERP5= <user>
##$WDW= 1
##$XDIM= 32768
##$YMAX_p= 421701195
##$YMIN_p= -739801
##$CURPLOT= <Network HP LaserJet P1505>
##$CURPRIN= <$Network HP LaserJet P1505>
##$DFORMAT= <normdp>
##$LAYOUT= <+/1D_H.xwp>
##$LFORMAT= <normlp>
##$PFORMAT= <normpl>
##$SURQMSG= 1
$$ End of Bruker specific parameters
$$ ---------------------------------
##NTUPLES= NMR SPECTRUM
##VAR_NAME=  FREQUENCY,     SPECTRUM/REAL,   SPECTRUM/IMAG
##SYMBOL=    X,             R,               I
##VAR_TYPE=  INDEPENDENT,   DEPENDENT,       DEPENDENT
##VAR_FORM=  AFFN,          ASDF,            ASDF
##VAR_DIM=   32768,         32768,           32768
##UNITS=     HZ,            ARBITRARY UNITS, ARBITRARY UNITS
##FACTOR=    0.250966925370066, 1,           1
##FIRST=     8223.43324360095, -740,         -85326
##LAST=      0,             27956,           -34457
##MIN=       0,             -739801,         0
##MAX=       8223.43324360095, 421701195,    0
$$ Real data points
##PAGE= N=1
##DATA TABLE= (X++(R..R)), XYDATA
$$ [...]
19490F4067a65650d2134m51205a52605o7632A48936a06952l3717L396I3355d437
19478B03218a23568j78973L8916d6785J7063r0131j13703r0099k23369H874b9804
19466d17557a44567K4669o6188G3999A7031g2740b952k29806J16269K7199b2695
19454c7478A75161J9129B5087c79703C5751c1290m4475G0698b58198G0730k1724
19443D9006b4425p0953l09135A4478b38407A92398a22808A7381K23197a37833
19432a42519j12590h9649j69633q0451J01926A89397N2643b81349D5825a80166
19421B72602a75806l1467M3394e5016A46032a31581j21307b1837r2497A92789
19410b76959B95715a20034D6260c64977P4579A47763a73423B49380C8193a00919
$$ y = [64067, -165650, -42134, -493339, -152605, -220237, 148936, -106952, -140669, -137273, 93355, -4437, 203218, -123568, -302541, -263625, -46785, -29722, -119853, -233556, -323655, -547024, 8874, -29804, -417557, -144567, -119898, -186086, 73999, 17031, -72740, -2952, -232758, -116489, -89290, -22695, -37478, 175161, 194290, 25087, -379703, 35751, -31290, -75765, 70698, -258198, 70730, 49006, -24425, -95378, -404513, 14478, -238407, 192398, -122808, 17381, 240578, -137833, -142519, -255109, -89649, -259282, -339733, -237807, 189397, 242040, -281349, 45825, -180166, 272602, -175806, -207273, -163879, -55016, 146032, -131581, -252888, -21837, -114334, 192789, -276959, 295715, -120034, 46260, -364977, -290398, 147763, -173423, 249380, 38193, -100919]
19399A05254g3894q5371j65939N6051a1128p6987j33710C5893K7485a03918k47021
19388c50939j40741a04417k62555Q5022J1951B7766b14798Q0139L6158A08205
19377A20439C7170b04621b4939n0271k98380N9241a6301A02981b89242B901K0997
19366B3898d79642Q0154d9791K0896D7465b21258B49587I6246D0982a96936o0523
19355b57459e9144a6526A30977b2087j2565k05102E0845a48011j54790m7359b0194
19343b13762A94405a15125F0510k6033g8183A48304b05975j43190G8867b23834
19332c0204A7056g6926j45493C63136d28637f2246C9068d35381A95166a1781k06507
19321b18288M8206F0073Q2775o6685b54884G8611J83845b12029h4726K0704n11
$$ y = [105254, -73894, -159265, -325204, -269153, -11128, -88115, -221825, 35893, 63378, -103918, -350939, -491680, -104417, -366972, -281950, -269999, 27766, -214798, -134659, -98501, 108205, 120439, 37170, -204621, -24939, -75210, -373590, -314349, -16301, 102981, -289242, 2901, 23898, -479642, -399488, -49791, -28895, 47465, -221258, 249587, 96246, 40982, -196936, -257459, -59144, -16526, 130977, -22087, -34652, -239754, 50845, -148011, -302801, -350160, -20194, -213762, 194405, -115125, 60510, 34477, -78183, 148304, -205975, -349165, 78867, -223834, -30204, 17056, -76926, -222419, 363136, -428637, -62246, 39068, -435381, 195166, -11781, -218288, -170082, 60073, 142848, 76163, -254884, 78611, 262456, -212029, -84726, -64022, -64533]
19310f4533K9043k2891I9208n487a93440O743R2681a9234l9973A76370b1907j24372
19298a46279e0134d138n5058D1896D279K60645j18532a0078A2379O2852b78278
19286d3503k48679d7675A86805a69970B59493j17780E1775R3281g2129k31382
19276c03511J8160j27352H7894b84624a9182k08955f8188k10632L025I0654b37275
19264a41365A35240c50740P9955A54957K54275b05027B7705d7099k6666m2736
19254a16501A80246a24290O7K7106B8391K1910b1947k48203a27483C04146a66090
19242c6438p8245K3580E7687a52730k83802C63251A68249p5631l9083c56472J41404
19231b15068c1423A02143E0722K29269a0074B49732D211M1023f2998J9335l62523
$$ y = [-64533, -35490, -58381, 99208, 93721, -193440, -186697, -94016, -19234, -59207, 176370, -21907, -146279, -50134, -4138, -59196, 41896, 4279, 264924, 146392, -10078, 12379, 75231, -278278, -43503, -292182, -47675, 186805, -169970, 259493, 141713, 51775, 145056, -72129, -303511, -285351, -412703, 87894, -284624, -19182, -228137, -68188, -278820, -275795, 90654, -237275, -141365, 135240, -350740, -270785, 154957, 409232, -205027, 27705, -47099, -73765, -116501, 180246, -124290, -124223, -97117, 28391, 50301, -21947, -270150, -127483, 304146, -166090, -36438, -114683, -91103, 57687, -152730, -436532, 363251, 168249, 92618, 53535, -356472, -215068, -31423, 102143, 50722, 279991, -10074, 249732, 4211, 45234, -62998, -43663, -406186]
19220d06186a39267n1346b7056J1811j19224A37396o2179j8936c62296J19836
19210b42460b9703H0394a48837j21635A3372K72788e1914l5706j43556P0413L4188
19199a26575C77859C4243a12233j8029I6847J03696h4843I1007b72321D5416a81566
19187B37060j12410n9953a99375L6917L5336A37882g0983I4789k7805a80380H0259
19175d4391B37491m8987b13106d762k09949H7159k0299j0818a74243f6544l15497
19164c82041B60765a57450k73067K07784O8079k8865B33061c06739b0597k09654
19154b30251A73865o6322c60187G4134a2068j46926C4478j2022J01186E0712d018
19142b33675A95402q2241a17352k24610O1260N7024b1202o2224A55732B9679J39038
$$ y = [-406186, -139267, -190613, -27056, -15245, -134469, 137396, 75217, 56281, -362296, -242460, -29703, 80394, -148837, -270472, 13372, 286160, -51914, -87620, -231176, -160763, -126575, 377859, 34243, -112233, -130262, 96847, 200543, -84843, 91007, -272321, 45416, -181566, 237060, 124650, 64697, -199375, -162458, -127122, 137882, -70983, 94789, 66984, -180380, 80259, -44391, 237491, 188504, -213106, -4762, -214711, 87159, 66860, 56042, -174243, -66544, -382041, 260765, -157450, -430517, -222733, -154654, -183519, 233061, -306739, -20597, -230251, 173865, 107543, -360187, 74134, -12068, -158994, 34478, 22456, 123642, 50712, -4018, -233675, 195402, 113161, -117352, -341962, -280702, -223678, -21202, -83426, 155732, 29679, 168717]
19131A68717O6748E461O8591h728j4638q6170j83515B22398f4755B15507d5027
19119a13019L8104A22774L958a03219b5686j86158B30007b3098j66782c291I7084
19107h1480l3571m226J6275j38478h3415k35052B10165f2542B98662c39518a49112
19095a02694B1132E34b9136j11816k15944F7035P6367a66660C5873b1467k95896
19084c17363a41803N4085J8959j99202C765a45436C46594I5255b45496a10259
19073b20574J02987d5186B27876m8282d7050k1953H9936a65678c6350A73514b5074
19061E4055d77l14250J27207j5784G2269a03678c5435D7349c9014k8316j00799
19050a68129F180J67980a44273d0380m779m3274B02103a67743a3221A59124a82236
$$ y = [168717, 235465, 5461, 74052, -8728, -23366, -109536, -293051, 222398, -64755, 215507, -45027, -113019, -74915, 122774, 126732, -103219, -25686, -211844, 230007, -23098, -189880, -3291, 97084, -81480, -115051, -119277, -103002, -241480, -83415, -318467, 210165, -62542, 298662, -339518, -149112, -102694, 21132, 534, -29136, -140952, -356896, 67035, 143402, -166660, 35873, -21467, -317363, -141803, -87718, -68759, -267961, 3765, -145436, 346594, 95255, -245496, -110259, -220574, -117587, -45186, 227876, 179594, -47050, -69003, 89936, -165678, -36350, 173514, -25074, 54055, -477, -314727, -187520, -203304, 72269, -103678, -35435, 47349, -39014, -67330, -168129, 6180, 174160, -144273, -40380, -45159, -88433, 202103, -167743, -13221, 159124, -182236]
19038D25731B6215J57959f5449J3201n0398M0181b6989C4198a4809k3334m5720
19027h3863q5985I6856g1805F2207a36752A7292g9455A54506p1471f2828j35208
19016a98036i399m64015a4912A25748D7621h2253H0207K56211D7137j702e8358
19004b70157E8616O0142a03936C6276J8141a09785L1962I6122C7183b5324A43517
18992b50987g4735A4469a08206B23349g3117E9440a49607H1483f1459j53764f1333
18980A16260d12968J63115C8698a97858n1428A10590F571a53385O4260A15132
18969a34476I9665B7403b837E9629b527k67357a24274j61232C10373A40213L6943
18958A77156q8141N51984q4927j67901A18931L6872f9898j57123A81760c08518
$$ y = [425731, 26215, 184174, -65449, -52248, -102646, -62465, -26989, 34198, -14809, -38143, -83863, -169848, 96856, -71805, 62207, -136752, 17292, -79455, 154506, 83035, -62828, -198036, -9399, -473414, -14912, 125748, 47621, -82253, 80207, 336418, 47137, 45435, -58358, -270157, 58616, 118758, -103936, 36276, 54417, -109785, -77823, 96122, 37183, -25324, 143517, -250987, -74735, 14469, -108206, 223349, -73117, 59440, -149607, 81483, -61459, -215223, -61333, 116260, -412968, -249853, 38698, -197858, -249286, 110590, 6571, -153385, -89125, 115132, -134476, 99665, 27403, -2837, 59629, -2527, -269884, -124274, -285506, 310373, 140213, 177156, 89015, 640999, 556072, 388171, 118931, 155803, -69898, -227021, 181760, -308518]
18947C3890b73739M7790J11899D6301O6827L583E022c1832l5348m47740A17851
18935A59116h0217j8846I599b93316e984A81789K50C6409i4199o7408M1108j13132
18923b33631k38193h111q988j21775A33186m145m6331l3271L9335m1894e4666
18911A7723K58876B5886b7333j97018E792a09908B43560f8360n7042C36958D5876
18899A52036K85839b8722B08834b0311B16638M0485N5118a23608I9002O692D3356
18887a65879A55860g3992a6918e56A1702L1717c0318n660E8871K6457a61785A26468
18874e6240A78121b11357e3992a9400j13898H0819d8552J1582I9136a13306m4317
18863a57623j38430B4669f7506m3214j59003A97563e08606A30571b24184a8085
$$ y = [33890, -273739, -225949, -114050, 46301, 113128, 116711, 5022, -31832, -67180, -514920, 117851, 159116, -80217, -99063, 9599, -293316, -5984, 181789, 182039, 36409, -94199, -161607, -120499, -233631, -471824, -8111, -17099, -138874, 133186, 129041, 82710, 49439, 88774, 46880, -54666, 17723, 276599, 25886, -27333, -224351, 5792, -109908, 243560, -68360, -125402, 336958, 45876, 152036, 437875, -28722, 208834, -20311, 216638, 257123, 312241, -123608, 99002, 105694, 43356, -165879, 155860, -73992, -16918, -556, 11702, 43419, -30318, -35978, 58871, 85328, -161785, 126468, -56240, 178121, -211357, -53992, -19400, -133298, 80819, -48552, -36970, 99136, -113306, -157623, -296053, 24669, -67506, -110720, -269723, 197563, -508606, 130571, -224184, -18085]
18852a46138D7032A332K68250A29383c9812o6483N1695m8558c3141j14262I8341
18840c49698G7952K32996e314j61710B31642A09726a17511j84043a5337C5263
18829d2152D402e4888m2004k00245A50629b08745B13722k6485R2158B4667d09167
18817C0435e3986r5492E3703J59280K1367c24607G0851h9574J146B24464n4296
18806A70168d6704i111A14754c33338G8111P9343h6344B68535a34566D1623O6352
18795A07975b4950B55023g8588A09385i8903B69720E6106b4164k52483I5176h4026
18783a59604d3041p759q6005j11757K8040F8048a83032j73125I3964b88516A28882
18771b65683A94837M6894d1028a8623h339j73971j03390B42208b00426C8645c31436
$$ y = [-146138, 47032, 1332, 269582, 129383, -39812, -106295, -54600, -103158, -33141, -147403, 98341, -349698, 77952, 310948, -5314, -167024, 231642, 109726, -117511, -301554, -15337, 35263, -42152, 4402, -54888, -96892, -297137, 150629, -208745, 213722, 187237, 279395, 24667, -409167, 30435, -53986, -149478, 53703, 212983, 234350, -324607, 70851, -89574, -88428, 224464, 170168, -46704, -9111, 114754, -333338, 78111, 157454, -86344, 268535, -134566, 41623, 107975, -24950, 255023, -78588, 109385, -98903, 269720, 56106, -24164, -276647, 95176, -84026, -159604, -43041, -50800, -136805, -248562, -220522, 68048, -183032, -356157, 93964, -288516, 128882, -265683, 194837, 241731, -41028, -18623, -8339, -182310, -285700, 242208, -200426, 38645, -331436]
18759e0793B02774i790k7278l5684H0496C3309a27551D6041c2058k36791A2223
18747F932L18176b84702a15311A38180a49787l5615A09507Q7427a96506H7414
18736A67587C6883b08301J01974k0419j29753L5192g8319D8296c37517G0435c66672
18724c11830b4308l37681P3086H827O2466c89745a37032l305p289M4642k34382
18713c37366a23621b4585A7654K52541a65691k21150C3862O1291b42588O5862
18703a76726k7682i6760k0699C2797a64584N4061m443j18444l7780B2135b48249
18691b04775P3473k31603d6374I527J30701b01385B13115K9268b70377h2759o1517
18680a44276A02406Q9318a99099A63490d98339A66996a7423A21079c65451A84847
$$ y = [-50793, 202774, -9790, -37068, -72752, 80496, 33309, -127551, 46041, -32058, -268849, 12223, 6932, 325108, -284702, -115311, 138180, -149787, -185402, 109507, 196934, -196506, 87414, 167587, 36883, -208301, -106327, -126746, -256499, -221307, -78319, 48296, -337517, 70435, -366672, -311830, -24308, -361989, -288903, 8827, 71293, -389745, -137032, -140337, -147626, -102984, -337366, -123621, -24585, 17654, 270195, -165691, -386841, 33862, 95153, -242588, -176726, -204408, -96760, -117459, 32797, -164584, -110523, -114966, -233410, -271190, 22135, -248249, -204775, -131302, -362905, -46374, 9527, 140228, -201385, 213115, 242383, -270377, -82759, -144276, 102406, 191724, -199099, 163490, -498339, 166996, -17423, 121079, -365451, 184847]
18669b25320b8485o9864r631J7421A53574d8717j0624K010D993g9097j30103A1593
18656A82115J9771I5348c2646A78316j2658c56163M6520I5918a23758a0286F288
18644a24791f0017j87600B40862b31059P3917I748a7455j5138j1763I2736k3788
18633F8948L05296j82980c3589A5829b1314j33672L0308B25763b9076j00966k7070
18622a57112B22366f6042J2313A53685n6044k7496a57671A43292c62022a77311
18611c7917p2651c4700H2660a39055I2586a80697j03682b2519o7p7501F2056b12451
18598a55818B11739b12927A49810o4878k4520f6112E9569d2434B771Q4532L8384
18587A25687a66777q8115g1956q2707D27147e3365p960E5152b76222E8061b81541
$$ y = [-225320, -28485, -98349, -107980, -90559, 153574, -48717, -59341, -57331, 4993, -79097, -209200, 11593, 182115, 201886, 95348, -32646, 178316, 165658, -356163, -309643, 95918, -123758, -10286, 6288, -124791, -60017, -247617, 240862, -231059, -157142, 9748, -17455, -32593, -44356, 92736, 68948, 374244, 191264, -33589, 15829, -21314, -154986, -124678, 225763, -29076, -130042, -157112, 222366, -66042, -53729, 153685, 97641, 70145, -157671, 143292, -362022, -177311, -37917, -110568, -34700, 82660, -139055, 92586, -180697, -284379, -22519, -22586, -100087, 62056, -212451, -155818, 211739, -212927, 149810, 84932, 60412, -66112, 59569, -42434, 2771, 87303, 125687, -166777, -254892, -71956, -154663, 427147, -53365, -61325, 55152, -276222, 58061, -281541]
18575A5082Q4554h1915j07083j26007B91566a61877B11124J45820G4531l2723
18565D1808b68458d6134j47321E2024i2590H5201d85112b13215b0207k29969A2845
18553b80281a04140B78028r6363L5133H9560q909e2682j7915q8130C8200J33050
18542A71250d34232b02963R9431B78845b5049j72216A18110a22901d2953A15329
18531C3555M6071a6735G845a61813d0974F5823f6923H1246c3107i252o2115m1048
18519a12415L934j6635j81752E4974g5800j97315J19239k81091A09366D678d7733
18507a5521j98927A65454a83977K264O6985r5786a01862l04653a87348C7469a65345
18495b57334A4025b35673A51113b26447d9194i387A37317a25614K5577d8539c037
$$ y = [15082, 99636, -81915, -188998, -315005, 291566, -161877, 211124, 356944, 74531, 41808, -268458, -46134, -193455, 52024, -92590, 85201, -485112, -213215, -20207, -250176, 12845, -280281, -104140, 278028, 181665, 216798, 89560, 80651, -52682, -70597, -158727, 38200, 171250, -434232, -202963, -103532, 278845, -25049, -197265, 118110, -122901, -42953, 115329, 33555, 79626, -16735, 7845, -161813, -40974, 65823, -66923, 81246, -33107, -9252, -71367, -112415, -108481, -125116, -306868, 54974, -75800, -273115, -153876, -434967, 109366, 4678, -47733, -15521, -214448, 165454, -183977, -181713, -114728, -210514, -101862, -406515, -187348, 37469, -165345, -257334, 14025, -235673, 151113, -226447, -49194, -9387, 137317, -125614, -100037, -48539, -3037]
18483A05058d8208H0599k9633a05564j17610H9590C6069a9403A2406b36262a18051
18471A75073q7385a30884j54951M2067c5188q4509l329A15216B7828b6572k6217
18460e2789B3000R1479d75987K37790L0623A37379K04889c5390F1418B1466N0373
18449G1839b14526C78187f5355A854O4543c02344c8495l4512B8113a40349J931
18438a38418f4789A20475h3712a4884B06296I9248a40529C6561Q8340B2983I382
18426C52169j13385g2006F9480c70802h7540A4198J13909h7846B31732f9564B1139
18414c03080B9848J16525h7667c9212C5711c06661a12475A6522J09849a96554
18403A2117a7282D3169a20450c0866l04182H0951O09230a62260A44810c767A1890
$$ y = [105058, -48208, 80599, 50966, -105564, -223174, 89590, 36069, -19403, 12406, -236262, -118051, 175073, 87688, -130884, -285835, -243768, -35188, -119697, -123026, 115216, 27828, -26572, -52789, 23000, 114479, -475987, -238197, -207574, 137379, 342268, -35390, 61418, 21466, 71839, -214526, 378187, -65355, 1854, 66397, -302344, -38495, -73007, 28113, -140349, -138418, -64789, 120475, -83712, -14884, 206296, 99248, -140529, 36561, 124901, 22983, 9382, 352169, 238784, -72006, 69480, -370802, -87540, 14198, 128107, -87846, 231732, -69564, 21139, -303080, 29848, 146373, -87667, -39212, 35711, -306661, -112475, 16522, 126371, -196554, 12117, -17282, 43169, -120450, -30866, -335048, 80951, 690181, -162260, 144810, -3767, 11890]
18391a77062o498l3842C5160K29287H8895J97902e1632A19239n4624e6377j93483
18380b49860B24355e5572A109K01675b18662A22587n1102P3162A3023N4942c3174
18368D830b6285j43533k7443g869B4390a39934b8101k60479C10133A04265l3583
18357G0682d54880B21309F4939A8640a66520J3028F9394a25698i219o0500A2180
18345A20697K11553b52750A4702n303b34488j0772B4850b00283E8495b08267I3406
18333A55093F4618b8398p7884c5765A03247a61964N0904A29632a78185o5528F2469
18321a51712e8054j94611D4201b19170a03370k65526D0285d10606a6026k27956
18311b43982o3065g5406D92660b9511J2522B05207g6003j62621h2105A20982l2962
$$ y = [-177062, -183560, -217402, 35160, 264447, 88895, 286797, -51632, 119239, 64615, -56377, -249860, 224355, -55572, 1109, 202784, -218662, 122587, 71485, 144647, 13023, 67965, -33174, 4830, -26285, -169818, -197261, -7869, 24390, -139934, -28101, -288580, 310133, 104265, 70682, -454880, 221309, 64939, 18640, -166520, -153492, 69394, -125698, -9219, -69719, 12180, 120697, 332250, -252750, 14702, 9399, -234488, -245260, 24850, -200283, 58495, -208267, 93406, 155093, 64618, -28398, -106282, -35765, 103247, -161964, -111060, 129632, -178185, -243713, 62469, -151712, -58054, -252665, 44201, -219170, -103370, -368896, 40285, -410606, -16026, -243982, -307047, -75406, 492660, -29511, -16989, 205207, -76003, -238624, -82105, 120982, 88020]
18300H8020B3716e8165j35569g114l2313m6437D208j353b43243p9639R1453O2982
18288a68447b5686B37341n027o9855E0693a36577c8512A54085d92796A8829N3398
18277G2227c2844l28996J75530L4438f0106m8709o9143m0978B35047c0123A57767
18265A59574a32378n3717B6218J74332q1580a38855I4269j3973b8811k53441A661
18253b35716D8946j3003L3468P691C7180L0682a81127c9568B22745E6283a14781
18241E509c3924A44402a8371n0204C7989a54096j0194j00344N8864G2578g3955
18229A12776B3507N2400A6972a75732A18298A562J25982b39251a02122k61272
18219c63394B63989a12907L6632j77984F5564k3799Q1257b9530j9421j32877L8062
$$ y = [88020, 23716, -58165, -193734, -7114, -39427, -85864, 4208, 2855, -243243, -322882, -231429, -168447, -25686, 237341, 232314, 162459, 50693, -136577, -38512, 154085, -492796, 18829, 72227, -32844, -361840, -186310, -151872, -60106, -108815, -177958, -218936, 235047, -30123, 157767, 159574, -132378, -186095, 26218, 200550, 118970, -138855, 94269, 80296, -28811, -282252, 1661, -235716, 48946, 35943, 69411, 77102, 37180, 67862, -181127, -39568, 222745, 56283, -114781, 5509, -33924, 144402, -18371, -68575, 37989, -154096, -164290, -264634, -205770, 72578, -73955, 112776, 23507, 75907, 16972, -175732, 118298, 1562, 127544, -239251, -102122, -363394, 263989, -112907, -76275, -254259, 65564, 41765, 123022, -29530, -48951, -181828, -143766]
18208a43766j17712P9085J9020p3068p9550I2629l0850f5323A69809A7689a49252
18196g1609r6023I7775c11313a19405m8580J9210A28051c2929D4192a83404c7638
18184h0563I3669b13560A19567g4881E3880a63417k4377n8716B37276a16497A23251
18172D9557L8776P9493J8948I282c5453j05290O2251E2611c31646A00131a48879
18160e3710A81314i1322l3153K2695A12467J46244p8167a50032O5702B5693a46765
18148E14431a77246L9412A22882J14552G5455h8876b2502j30833c3711j60710
18138a94421B72559b55951J08251C06996C2914e2447J401D8316b49180A60062
18127A37800b84316O3504H7970e8771D511J09678a04125A00929a3955l4324Q514
$$ y = [-143766, -261478, -182393, -163373, -236441, -315991, 92629, 61779, -65323, 169809, 17689, -149252, -71609, -167632, 97775, -311313, -119405, -167985, -148775, 128051, -32929, 44192, -183404, -37638, -80563, 93669, -213560, 119567, -74881, 53880, -163417, -187794, -246510, 237276, -116497, 123251, 49557, 88333, 167826, 186774, 9282, -35453, -140743, -78492, 52611, -331646, 100131, -148879, -53710, 181314, -91322, -124475, -101780, 112467, 258711, 180544, -150032, -84330, 25693, -146765, 514431, -177246, -137834, 122882, 237434, 75455, -88876, -22502, -153335, -33711, -194421, 272559, -255951, -147700, 306996, 32914, -52447, -51046, 48316, -249180, 160062, 137800, -284316, -220812, 87970, -58771, 4511, 114189, -104125, 100929, -13955, -48279, -39765]
18116c9765l6706E3908R6527o1932K11076a9087A0610h6175B25258A6119d7681
18104H2970K6970i2695Q815p4725C12085h8123C00155a87798B0495J40157a19815
18092b41071e7625K577m2675D1496I983c651j75977d9672k921E3666a07165A24957
18079h3269A68514J05470a41312D2144O2166b05531A373R0297a73199B67093b30025
18067b90313E5891j3094b14108e238A88004c38876a59166A11619a18078A2036
18056a54443q9141D4448b53256f8577H0152P8796h1806A61217a06575H7214R8460
18045A85674F7142b55800A05707m5636a15304N2681K6867A34429a68784B78905
18034c8072A25674a79663f9913b8596B660a5048j66483P0101l5087h707o9191
$$ y = [-39765, -76471, 53908, 150435, 88503, 299579, -19087, 10610, -86175, 225258, 16119, -47681, 82970, 109940, -92695, -83880, -158605, 312085, -88123, 300155, -187798, 20495, 160652, -119815, -241071, -57625, -55048, -97723, 41496, 9983, -3651, -179628, -49672, -52593, 53666, -107165, 124957, -83269, 168514, 273984, -141312, 42144, 104310, -205531, 1373, 91670, -173199, 267093, -230025, -290313, 55891, 42797, -214108, -5238, 188004, -338876, -159166, 111619, -118078, 12036, -154443, -243584, 44448, -253256, -68577, 80152, 158948, -81806, 161217, -106575, 87214, 185674, 67142, -255800, 105707, 60071, -115304, -62623, -35756, 134429, -168784, 278905, -38072, 125674, -179663, -69913, -28596, 2660, -15048, -181531, -111430, -146517, -8707, -77898]
18023g7898D6177C793a01029B6163b52113J1542P6416O4774G7079k1178J53792
18012B09693p8799c3430A01454a69264N6787n5459A1068d8946C76051H8515a1949
18000A02663m2107a94162f9948J0613O522J5180G1086a57525D5615L6971f375
17988C1344L5377b79631H2338Q8168n7356p685d18499F127J25618c41768J06956
17977b34812d6303B24680a04954H7251c0746A08614C8253J89290d7944C1917i302
17965D42159P4073A58984K2087a9484j75209e7084B41198J65146f3633q9873D1557
17953H7997a92673g0751l85268f1181j44667j17603A03714M6190N2042e03451
17942e5079j10117e0783C11153j01406b7456A41536f8290A55608b59225f5824
$$ y = [-77898, 46177, 3793, -101029, 26163, -252113, -240571, -164155, -99381, 77079, 55901, 209693, 130894, -33430, 101454, -169264, -112477, -167936, 11068, -48946, 376051, 88515, -11949, 102663, 60556, -194162, -69948, -59335, -52813, -37633, 71086, -157525, 45615, 82586, -6375, 31344, 66721, -279631, 82338, 170506, 113150, 105465, -418499, 6127, 131745, -341768, -234812, -46303, 224680, -104954, 87251, -30746, 108614, 38253, 227543, -47944, 31917, -9302, 442159, 516232, 158984, 181071, -19484, -194693, -57084, 241198, 406344, -63633, -153506, 41557, 87997, -192673, -70751, -456019, -61181, -205848, -323451, 103714, 149904, 201946, -503451, -55079, -165196, -50783, 311153, 209747, -27456, 141536, -68290, 155608, -259225, -65824]
17931d6979n780A55395c26291H062K21994b67240h9167E1017a967A6465a03839
17919A52946A7835K43809B125Q6635J70636H4342B2983J02543e5698j29611q2042
17908b67351j4831A65784c0392k12039H1998L86912b1911B0370a74088C2436e4911
17896D1921b47219A84302F4467a05322F8151b27073A7941R7331D403J11053j4374
17885A01082a2084m763B6207j2371N7883A4400b70790D3623d397F9772a70937
17873e5404B56656g6427G9660e6148B1717Q0497r427D5122J1585a72635B20366
17861a48080o2332J1449G9938a94768B5898J85221d1241k61503E6101a08139D4869
17849B25542c0650p1947G7787f769A08695J18965E7668P5791d4739o5780n3876
$$ y = [-46979, -52759, 155395, -326291, 8062, 230056, -267240, -89167, 51017, -1967, 16465, -103839, 152946, 17835, 261644, 2125, 88760, 259396, 84342, 22983, 125526, -55698, -185309, -267351, -282182, 165784, -30392, -242431, 81998, 468910, -21911, 20370, -174088, 32436, -54911, 41921, -247219, 184302, 64467, -105322, 68151, -227073, 17941, 115272, 4403, 115456, 101082, -12084, -16847, 26207, 13836, 71719, 14400, -270790, 43623, -4397, 69772, -170937, -55404, 256656, -76427, 79660, -56148, 21717, 102214, 92787, 45122, 56707, -172635, 220366, -148080, -210412, -198963, 79938, -194768, 25898, 211119, -41241, -302744, 56101, -108139, 44869, 225542, -30650, -102597, 77787, -6769, 108695, 227660, 57668, 133459, -44739, -110519, -164395]
17838a64395K204O2094o4421A92139b63899P7790k685N4633D35256j91158B84
17826g3616J4177D15870A00604e0646o6848K0447B72195r1846m9118b43214B40313
17814I4407A3215J22704F5012h3216A93401h3666A38213g1945A13220R8690g9068
17802B82862F0747b61207i3704D33402B04735d4738H5378b2992B23381I2329b6494
17790C5298q004c5542j74129O0293F2930J1292b88824A3279L06513J4638h4994
17778e1666A03606k183a6483j28584p9568f0172A80685b62582A00828C9859L19722
17767C59581j79294a7779A63216P6229b8976j09411A23268L39285b52848N0812
17757b02036M7085A43098b69143G3840J52027D9122L9948C9288d9665A71122J7358
$$ y = [-164395, -162191, -100097, -164518, 192139, -263899, -186109, -188794, -134161, 435256, 244098, 284, -73616, -59439, 415870, 100604, -50646, -117494, -97047, 272195, 180349, 131231, -243214, 240313, 94407, 13215, 135919, 65012, -83216, 193401, -83666, 138213, -71945, 113220, 211910, -79068, 282862, 60747, -261207, -93704, 433402, 204735, -44738, 85378, -22992, 223381, 92329, -26494, 35298, 27294, -35542, -209671, -149378, 62930, 74222, -288824, 13279, 319792, 334430, -84994, -51666, 103606, 101423, -16483, -145067, -224635, -60172, 180685, -262582, 100828, 39859, 359581, 180287, -17779, 163216, 239445, -28976, -138387, 123268, 462553, -252848, -202036, -154951, 143098, -269143, 73840, 225867, 49122, 89070, 39288, -49665, 171122, 188480]
17746A88480d9212m1767A54025a1975n2438B3289n868b9844p3078J1833A62962
17734B53201j24219e3436I0906d9000o3915B12072G1258L543b86608I9911J20252
17723B20163a13598A61575h8877K127F8521j8032a60773b4673l2661D48207A13789
17711d7353G5435c7599D21196b8068A08074j3129A4542f0396O103j55972a00499
17699A41249D9794f2466A45327J16570E7341A0898a4442C05231L0534E9511f2981
17687F9573J19130b06209C21406a4502B01638H0992J51667K8730a00264A23502
17676C04969A19046d3971A03274a5994B03869a09337A70465H0495K1001c19646
17665a60788F1263b06732E03886a01571m6839A48050Q5653o2636m1593J91244
$$ y = [188480, -49212, -90979, 154025, -11975, -64413, 23289, 17421, -29844, -102922, -91089, 162962, 253201, 128982, -53436, 90906, -49000, -112915, 212072, 71258, 74801, -286608, 99911, 220163, -113598, 161575, -88877, -86750, 68521, 50489, -160773, -24673, -57334, 448207, 113789, -47353, 75435, -37599, 421196, -28068, 108074, 94945, 14542, -60396, -54293, -210265, -100499, 141249, 49794, -62466, 145327, 261897, 57341, 10898, -14442, 305231, 335765, 59511, -62981, 69573, 188703, -206209, 321406, -14502, 201638, 80992, 232659, 261389, -100264, 123502, 304969, 119046, -43971, 103274, -15994, 203869, -109337, 170465, 80495, 101496, -319646, -160788, 61263, -206732, 503886, -101571, -148410, 148050, 233703, 171067, 129474, 320718]
17655C20718A17914D3354P3394d4803C04934A11948K51526f2739A54321A471M09970
17644D11441j16952A34436C665J49286J28448K4530a75598A48623a18881I7160
17633E0842J75943J16024g7744A15344J25235b36783A28346E6056a84420J2947
17623a71473D37898D2252L74737A17548O6058b57779C68061G927L07518k3322
17613B92123I7389K62777A5082g2189j16702d0505A03g6495E285c6924C95421
17601A84261j0021d6372D39201b6281j81754d405E8857a15022b3717B42737f368
17589A94048F537g8226b2190B89376b66717R7505A6514J18445L03479j78941A14907
17577C5081J40744n5903B5851J24793Q3284r2381K7473D2656e6675B36847E0694
$$ y = [320718, 117914, 43354, 116748, -44803, 304934, 111948, 363474, -62739, 154321, 1471, 411441, 294489, 134436, 3665, 152951, 281399, 305929, -175598, 148623, -118881, 97160, 50842, 226785, 342809, -77744, 115344, 240579, -236783, 128346, 56056, -184420, -171473, 437898, 42252, 416989, 117548, 183606, -257779, 368061, 7927, 315445, 292123, 97389, 360166, 15082, -72189, -188891, -40505, 103, -76495, 5285, -36924, 395421, 184261, 174240, -46372, 439201, -26281, -208035, -4405, 58857, -115022, -23717, 242737, -6368, 194048, 6537, -78226, -22190, 289376, -266717, -169212, 16514, 134959, 438438, 259497, 114907, 35081, 175825, 119922, 25851, 150644, 233928, 141547, 169020, 42656, -56675, 236847, 50694]
17565a47205b6106C97728h5762H5517R6935q4922J00868q154L3372n3786J92544
17554C62374A47708n2332b74203A26518H62M5993j7988L3141L61267R74j09606
17543C14643D2074a43217D0258N3442a29479A61108J3555J5838f1150B52646E7380
17531E9129B9171Q031J03979g234A57910C4517a87606F936J57387g4491A76517
17519A18981k9086J30071l7191M5486K45630q3271p1089N7792L66751J16157L477
17508H63708k43373J63434B37574L29970k52611A07326J10230K47377j19234N9239
17498D04938J92608k82687j03328R43921n34238J28896R0796C32441J06801J3627
17488D52869m312q7825j53218M0456N7911j00694j2478J61158M8006A76158L54035
$$ y = [-147205, -26106, 397728, -85762, 85517, 182452, 97530, 198398, 190244, 223616, 169830, 362374, 147708, 95376, -274203, 126518, 862, 46855, 28867, 62008, 423275, 424249, 314643, 42074, -143217, 40258, 93700, -129479, 161108, 174663, 190501, -61150, 252646, 57380, 59129, 29171, 37202, 141181, -7234, 157910, 34517, -187606, 6936, 164323, -74491, 176517, 118981, 89895, 219966, 182775, 228261, 473891, 390620, 319531, 377323, 744074, 860231, 863708, 620335, 783769, 237574, 567544, 314933, 107326, 217556, 464933, 345699, 404938, 597546, 314859, 211531, 1155452, 621214, 750110, 840906, 332441, 439242, 452869, 448557, 360732, 207514, 247970, 305881, 205187, 192709, 353867, 401873, 176158, 530193]
17477E30193j63837A08136K44106a02471A63727K85938k0485e7704A92663D5922
17466F00102B27715o1501M0634g5224D31834O6242B39852J40621J4627j59225
17456B35875L51r2444R5437j1084J51245H7721a17721B52440f4390G23315A66583
17444B86782l8382p0634m0664K34498A72021M1947q1700Q1715Q0283I7672P47977
17433H45649C27902H8466J05075O5140J64822l8260A71210Q7993j9964J19317
17423C58556L0868O3174l8054i6597B20500J36993J6014j35535A17091n7426N2179
17412A11844J29566K06234H2508j091M73208k17239o3028H3211L15675m7245K6991
17401C78632J21437R1547j68623j32437H0242K70425J45749P928k31869j07857
$$ y = [530193, 366356, 108136, 352242, -102471, 163727, 449665, 429180, -57704, 192663, 45922, 600102, 227715, 166214, 206848, -75224, 431834, 498076, 239852, 380473, 395100, 235875, 236226, 143782, 239219, 228135, 379380, 87721, -117721, 252440, -64390, 723315, 166583, 286782, 248400, 177766, 137102, 371600, 172021, 213968, 132268, 213983, 294266, 97672, 845649, 327902, 88466, 193541, 258681, 423503, 385243, 171210, 259203, 239239, 358556, 389424, 452598, 414544, -96597, 220500, 357493, 373507, 237972, 117091, 59665, 111844, 241410, 447644, 82508, 81417, 554625, 337386, 274358, 83211, 398886, 351641, 378632, 500069, 591616, 422993, 290556, 80242, 350667, 496416, 504344, 272475, 164618]
17391A64618b42388D75055K6604k46252N9173A47728J69475K26393H8518J28575
17381B17093J38398o9456i397C64022a21459B5460J13675L05386j99758j1003
17371B33760L46863B07516m3546p8592k6936K00667q8681D357J81395O3723q5969
17360A63506C5394L97994j8641n9881a74114I5831R2242M51549k93399A26213
17349A46847a22406A54174R0018j2130b17338D25765A09926J54616h9232B75131
17338B49309Q7097G3881K61420F3203a25750B59067M6727a47138H9709K56977
17328C46686e6950B69939J34200A49864J69777A2269M6274O8831J57443m896m6300
17317B33621K25946E8051K3243C1584L09334p3749n6947a5745A73348g8556H6592
$$ y = [164618, -242388, 475055, 501659, 255407, 314580, 147728, 317203, 543596, 88518, 217093, 355491, 286035, -9397, 364022, -121459, 25460, 139135, 444521, 244763, 233760, 580623, 207516, 163970, 85378, 58442, 259109, 170428, 4357, 185752, 249475, 163506, 35394, 433388, 414747, 354866, -174114, 95831, 188073, 639622, 346223, 126213, 146847, -122406, 154174, 244192, 232062, -217338, 425765, 109926, 264542, -89232, 275131, 249309, 336406, 73881, 335301, 63203, -125750, 259067, 305794, -147138, 89709, 346686, -56950, 269939, 404139, 149864, 319641, 12269, 58543, 127374, 284817, 279921, 233621, 459567, 58051, 81294, 31584, 340918, 267169, 210222, -15745, 173348, -78556, 86592]
17305D85813j92980L4486c09559B62892K96949j66130i8159G2875A6690L45711
17295C62401B9325K32341Q9937j14012n249K87744H0450L87342r568A15791K53106
17284C68897j56312F2863L74215F7295K2851L17998p603A64739c2133B20976j08740
17273A12236M2605Q031K7309J70041j68210l6101O7684M9906l3831n5072K74496
17262D59094E9730L03633j77658I1587M32255j10586F2889J60736a67654B93322
17251B68217N0010N2468r5799F4712K63564A30735L17673j86130J33425J57846
17241E53549a81471D42702j25137k044a20446D9157k2384B049J04663K60742j39765
17230B27689H0820Q6510P6420K06914A46950l1201J88101I5443J04756q7607G480
$$ y = [485813, 292833, 327319, -309559, 262892, 559841, 393711, -98159, 72875, 16690, 362401, 29325, 261666, 351603, 237591, 232342, 520086, 80450, 467792, 458224, 115791, 368897, 212585, 62863, 437078, 67295, 90146, 408144, 400541, 164739, -32133, 220976, 112236, 154841, 162872, 190181, 360222, 192012, 155911, 223595, 273501, 239670, 184598, 459094, 59730, 363363, 185705, 91587, 523842, 413256, 62889, 223625, -167654, 293322, 268217, 318227, 370695, 274896, 64712, 328276, 130735, 448408, 262278, 395703, 553549, -181471, 442702, 317565, 315521, -120446, 49157, 26773, 2049, 106712, 367454, 227689, 80820, 167330, 243750, 450664, 146950, 115749, 303850, 95443, 200199, 112592, 7480]
17218A05336P9599K2909j6854K12427q8280R2636A93916M7734K35301k27794J59296
17207D08453n2892J8995P0467p2819K52983C4201L03821O2341K0661o6623j28950
17196B25451j0536N1593K31043J86166G3831J69354P3850j26833R7888D1044N3175
17185I4219K99788j07437J6965L83775N4930B32495J9286k974N9321l0870P4644
17174C51902j03682N3207A30353K53984A55481K39693k590M5373j68456K623K6449
17163B98573K04488J09022j9792k53152A41530O29861A12438J46875N7296O8631
17153C85240k1113r977K40055j67736L09766C40839r207J10231Q9167j00412n6441
17142C74177k1237K18949p5736p0072q3279I1277K02041A37963J44637K14942
$$ y = [105336, 184935, 207844, 190990, 403417, 315137, 407773, 193916, 241650, 476951, 249157, 408453, 355561, 374556, 445023, 372204, 625187, 34201, 338022, 400363, 421024, 354401, 225451, 214915, 266508, 497551, 683717, 73831, 243185, 317035, 190202, 288090, 41044, 94219, 394007, 286570, 303535, 687310, 742240, 232495, 251781, 248807, 308128, 277258, 351902, 248220, 301427, 130353, 384337, 155481, 395174, 392584, 437957, 269501, 272124, 298573, 503061, 612083, 592291, 339139, 141530, 771391, 112438, 259313, 316609, 385240, 364127, 354150, 594205, 426469, 736235, 340839, 331632, 441863, 531030, 430618, 374177, 352940, 571889, 496153, 426081, 342802, 91277, 293318, 137963, 282600, 497542]
17132D97542q985A13338L78828J2832j62970j86K91240k1933k21151J54030j86125
17121C57903K60782p7106K6046j75398l4539l526q6991l2787N1433L35913k06760
17110D14970K78310C24421N2626K11636p1592J15580j53556j14431K62001k01555
17100D25130K1341M7943k40240M57706k8734j02904j9095k32550M36867J7481
17090G82945j46320j96496Q6728p6317J18000K61055B67889L5171P0524K9542
17080D03126L99014k91548j62484M42054q4345R1623j37367q988j4924N9518m9713
17069F45966m5045k16831L97508j17206j86876M73688j58691l86405L95240p8587
17059G22761k83866L82041j30365l07993m4116L19306n6756L9246k17525L01578
$$ y = [497542, 488557, 113338, 492166, 504998, 342028, 341842, 633082, 611149, 389998, 544028, 357903, 618685, 541579, 567625, 392227, 357688, 354162, 267171, 234384, 285817, 621730, 414970, 693280, 324421, 377047, 588683, 517091, 632671, 479115, 364684, 626685, 425130, 446471, 494414, 254174, 711880, 683146, 580242, 561147, 328597, 765464, 782945, 636625, 440129, 526857, 450540, 568540, 829595, 267889, 303060, 373584, 403126, 802140, 510592, 348108, 790162, 705817, 797440, 660073, 651085, 636161, 695679, 645966, 600921, 384090, 781598, 664392, 477516, 951204, 792513, 406108, 801348, 722761, 438895, 820936, 690571, 382578, 338462, 657768, 601012, 640258, 422733, 724311]
17049G24311p0024N1487J38471q0420k59724K38406j93341J90232j41082J95364
17039G93680q6717M3362j35178R4822Q9038N4276o486l58256J90333J12482J00453
17028H91809j41730j43756r991O1473r7937J81323k14124L09096l2290J7092L05063
17017A126028k15521J84157l63119p0278k6557o3012K61138k52821J96436J86619
17007I63070P0593j57383J22234J3298k88636P3968K27442J52935l41820J43891
16997I79592p6997n1519J08498M081k16882l5840O47188n24233j42315J63102
16987H54675q4631K49938J47491j62423K5022J62679l49830K23838l92920M25443
16977A099282k01016J34814l99546O59742n86861M20767k02447O8414J70910m0346
$$ y = [724311, 654287, 705774, 844245, 763825, 504101, 742507, 549166, 739398, 598316, 793680, 706963, 750325, 615147, 709969, 799007, 853283, 846797, 488541, 678874, 791356, 891809, 750079, 606323, 596332, 657805, 559868, 741191, 527067, 836163, 803873, 820965, 1126028, 910507, 1094664, 731545, 661267, 634710, 571698, 832836, 580015, 776451, 963070, 1033663, 876280, 998514, 1011812, 723176, 797144, 1024586, 1177521, 835701, 979592, 902595, 851076, 959574, 963655, 746773, 710933, 1358121, 833888, 691573, 854675, 770044, 1019982, 1167473, 1005050, 1030072, 1192751, 842921, 1066759, 673839, 1099282, 898266, 1033080, 633534, 1293276, 706415, 1127182, 924735, 993149, 1164059, 1123713]
16967A123713j91839J33413J44812j05100J21833N1660k81693O9249K86234N9533
16957A411815j79955j72346j345j54112L72496M7534n4543k3211J54318j27966
16947A272685M30314m35261J97187P1284k59980j36194L77796j53297J06399r7781
16937A373152K69393k95908M3154K53951l723l60427N09365k92548J71476j827
16927A666058J77390m35299L11812l15116q3035J99144l53941M26603j8836n2993
16917A521787K57784q4392j47558K21543r4987R8143J2014k1308k92150N01172
16907A972048n8299m7781L20554k20501J11027O6246O4795r7304j66478K78979
16897B223286j35170K84944l58942j04004M46486l80727M35249l62580J70828
$$ y = [1123713, 931874, 1065287, 1210099, 1104999, 1226832, 1278492, 996799, 1066048, 1352282, 1411815, 1231860, 1059514, 1058169, 904057, 1276553, 1324087, 1269544, 1246333, 1400651, 1272685, 1702999, 1267738, 1464925, 1536209, 1276229, 1140035, 1517831, 1364534, 1470933, 1373152, 1642545, 1346637, 1389791, 1643742, 1640019, 1279592, 1788957, 1496409, 1667885, 1666058, 1843448, 1408149, 1719961, 1404845, 1321810, 1520954, 1167013, 1593616, 1574780, 1521787, 1779571, 1695179, 1547621, 1769164, 1674177, 1772320, 1784334, 1763026, 1470876, 1972048, 1913749, 1865968, 2186522, 1966021, 2077048, 2143294, 2208089, 2110785, 1944307, 2223286, 2088116, 2373060, 2014118, 1910114, 2356600, 1975873, 2411122, 2048542, 2219370]
16888B219370k13459M52404j54042k11891L82728m5950j02004L16862m23216N18574
16878B739376n78382J28253j42688O21062k16972K77478j77909M1642k3770J92216
16868B860306J7697q6570O561L05946k35953K8177Q9135M34571l76605Q3197j97016
16857B929446K67002m9968J2373L84666P868o4568r2378M73257j95855L64010
16847D035853o86461K77706L25181J9228j23983M30775j39419R170j85823L52013
16837D314240j76575L86424k57175O99R864J93229j13404N79265k34728M61974
16827E163813k64312K15597K7456R3857j17477K56323Q7284J47441k05362M38596
16817E843216k69618N05994k1187k54732L79484J60933j18828M28993r104J08070
$$ y = [2219370, 2005911, 2458315, 2304273, 2092382, 2475110, 2429160, 2327156, 2644018, 2220802, 2739376, 2160994, 2289247, 2146559, 2767621, 2550649, 2828127, 2650218, 2691860, 2668090, 2860306, 2878003, 2791433, 2797994, 3103940, 2867987, 2896164, 2985299, 3419870, 3043265, 3126462, 2929446, 3196448, 3146480, 3158853, 3543519, 3551387, 3486819, 3394441, 3867698, 3671843, 4035853, 3349392, 3627098, 3952279, 3971507, 3847524, 4278299, 4138880, 4148050, 3962227, 4314240, 4137665, 4524089, 4266914, 4267613, 4277477, 4470706, 4357302, 4936567, 4701839, 5163813, 4899501, 5115098, 5142554, 5236411, 5118934, 5375257, 5462541, 5609982, 5404620, 5843216, 5573598, 6079592, 6058405, 5803673, 6183157, 6344090, 6225262, 6654255, 6645151, 6753221]
16807F753221J27922J24243K32151J88811J70911M9190Q4255K23064m6959M63120
16797H369929j72346N47181k38246M20923J45683M40273l1736J01658M87358J39371
16787A0210048L56714q0769M85901j02219M98321M28770M29956M4257Q35153J7491
16777A3123623J59363K58728K76089R02087J45936j74473R91485r1008P14775
16768A6306605N54376K37806P87911O12118M15415K84774P10159J053284J05240
16759B1067688N99296N49204J110823N89038P56390J260650N20022R60331R03108
16750B8316550Q59990J020843J000432R41925J603851R38301J123186J720606
16742C7525684J565949J055085J514411K248579J419668J643384J802626J745110
$$ y = [6753221, 6881143, 7005386, 7237537, 7426348, 7597259, 7646449, 7730704, 7953768, 7906809, 8369929, 8197583, 8744764, 8506518, 8927441, 9073124, 9513397, 9481661, 9583319, 10070677, 10210048, 10566762, 10485993, 10971894, 10869675, 11367996, 11796766, 12226722, 12270979, 13106132, 13123623, 13282986, 13541714, 13817803, 14719890, 14865826, 14691353, 15682838, 15591830, 16306605, 16860981, 17098787, 17886698, 18498816, 18914231, 19199005, 19909164, 20962448, 21067688, 21666984, 22216188, 23327011, 23916049, 24672439, 25933089, 26453111, 27413442, 28316550, 29176540, 30197383, 31197815, 32139740, 33743591, 34681892, 35805078, 37525684, 39091633, 40146718, 41661129, 43909708, 45329376, 46972760, 48775386, 50520496]
16734E0520496J973876K354876K236546K095754K321320K382394K658113K524753
16726F9068128K805591K493440K849425K602093L007369K732583L029912K333708
16718I0922249L037925K568871K007470K696169K128411K243038J690673J395939
16710A08690745J759081P28483R87959J06024j14884n98784r0297q66738j446049
16701A09155540j302122j594260k060719k239778k402970k660385k332841k756089
16693I1806376k808724k870980k647972k974926k927480k585844k679510l010819
16685F9300121k428326k542070k586971k379474k014708j944306k441299j934980
16677E1027987k208396j909247j744819j334867k108213j433368j687101j475631
$$ y = [50520496, 52494372, 54849248, 57085794, 59181548, 61502868, 63885262, 66543375, 69068128, 71873719, 74367159, 77216584, 79818677, 82826046, 85558629, 88588541, 90922249, 93960174, 96529045, 98536515, 101232684, 103361095, 105604133, 107294806, 108690745, 110449826, 111178309, 112166268, 112272292, 112157408, 111558624, 111468327, 110601589, 109155540, 107853418, 106259158, 104198439, 101958661, 99555691, 96895306, 94562465, 91806376, 88997652, 86126672, 83478700, 80503774, 77576294, 74990450, 72310940, 69300121, 66871795, 64329725, 61742754, 59363280, 57348572, 55404266, 52962967, 51027987, 48819591, 46910344, 45165525, 43830658, 41722445, 40289077, 38601976, 37126345]
16669C7126345j447293j237424q12406j464039j195595j171924p65035j354598
16661B7678031o66952r12141j141438o73653p81768o99669n10349r64119m40481
16652B0887461j031063j29981n94093q38917n48459k64668o28346k44060p52027
16643A5855847q52552L9716n49518j81360q37171n8066m26647n0865k48033p84075
16633A1907276k03632l59931J17912q87376K31550o51433k14068M74754m11820
16624A0003232p98490N5643m9022o1786k49791k80466m7603p07556K6275k64605
16614G625831j03352M32044n30669l59006J59599k43081o797r6006j96534j18866
16604F563163n24886L73414m05310j98764m5707K72415l94290l06700j70630M52683
$$ y = [37126345, 35679052, 34441628, 33629222, 32165183, 30969588, 29797664, 29032629, 27678031, 27011079, 26098938, 24957500, 24283847, 23502079, 22802410, 22292061, 21327942, 20887461, 19856398, 19726417, 19132324, 18293407, 17744948, 17480280, 16851934, 16607874, 15855847, 15003295, 15043011, 14493493, 14312133, 13474962, 13416896, 12990249, 12939384, 12691351, 11907276, 11703644, 11343713, 11461625, 10574249, 10805799, 10154366, 9940298, 10415052, 10003232, 9204742, 9260385, 9211363, 9149577, 8899786, 8619320, 8571717, 7864161, 7890436, 7625831, 7522479, 7954523, 7423854, 7064848, 7224447, 6981366, 6974569, 6878563, 6682029, 6563163, 6038277, 6411691, 6006381, 5807617, 5761910, 6034325, 5640035, 5333335, 5162705, 5615388]
16594E615388n69063q6192o8936L9508R008l00474J76740l76024J81109k08365
16584D412699J72076J28489l27165j21179K20058o92747K34252p2111M258j1865
16574C946765k51324J50188N0488k32472P2221J09918k31116k15949K19641k76902
16564C341458J11478j41608j49183J12774k77298Q3510j34629j98403K45965J22694
16554C116758l46677J60992J0569q9497l27995J80516k47192J24763L3851r718
16544B606370j93435q2328j7354M01647j44481j96374J95603l78947K0352N16974
16534B728027n65795K26020j72910r0222N9783L19443n13880J56758j96428l9490
16524A911306m3074J20411J34676r0519K3111m8753j8967j7052m70787L38435
$$ y = [5615388, 5046325, 4960133, 4891197, 4930705, 4939713, 4639239, 4815979, 4439955, 4621064, 4412699, 4584775, 4713264, 4386099, 4264920, 4484978, 3792231, 4026483, 3954372, 3958630, 3946765, 3695441, 3845629, 3896117, 3663645, 3735866, 3845784, 3614668, 3398719, 3618360, 3341458, 3452936, 3311328, 3162145, 3274919, 2997621, 3081131, 2946502, 2748099, 2994064, 3116758, 2770081, 2931073, 2941642, 2852145, 2524150, 2704666, 2457474, 2582237, 2616088, 2606370, 2412935, 2330607, 2313253, 2714900, 2570419, 2374045, 2569648, 2190701, 2211053, 2728027, 2162232, 2388252, 2215342, 2125120, 2184903, 2504346, 1990466, 2147224, 1950796, 1911306, 1868232, 1988643, 2123319, 2032800, 2055911, 2007158, 1988191, 1971139, 1500352, 1838787]
16514A838787J44089O2759m34033k89885K25883L37119k75034J97520j0572L1555
16504A828188p667q1670n9630J53658j66554m28201L64691n1467L56908k69274
16494A638982j77400m8364J27984r5524J15099k37460K17844j17713R9371j06180
16484A416639r3069J02220R8792k45193j00677j401J25882M3663j54247j46853
16474A045756O6186K24531j30916j53047K02506L18838p0079j20813m93267K63203
16464A152898K67775m41019L87407n49152M21283l05255K77922m53817M62987
16455A221029l68965L11359n8202Q5553j94160M005j91864K66798j06185j05775
16445H63593N8148R797m21320M54535K99941l42209J2958K20986m64926N54780
$$ y = [1838787, 1982876, 2045635, 1611602, 1321717, 1547600, 1884719, 1609685, 1807205, 1796633, 1828188, 1820521, 1738851, 1679221, 1832879, 1666325, 1238124, 1602815, 1551348, 1908256, 1638982, 1461582, 1413218, 1541202, 1445678, 1560777, 1323317, 1541161, 1423448, 1522819, 1416639, 1323570, 1425790, 1524582, 1279389, 1178712, 1177311, 1303193, 1346856, 1192609, 1045756, 1111942, 1336473, 1205557, 1052510, 1255016, 1573854, 1503775, 1382962, 889695, 1152898, 1420673, 979654, 1367061, 817909, 1239192, 933937, 1211859, 758042, 1221029, 852064, 1163423, 1105221, 1190774, 996614, 1000619, 808755, 1075553, 969368, 863593, 921741, 931538, 510218, 964753, 1264694, 922485, 935443, 1156429, 691503, 1246283]
16435A246283o0731k98526j15965L60086l63276C22041O60092j57621p5800m3387
16425G05325J80590j59139J75251J01262l93180K30005J969k16129K02217l44554
16415D83617L51940K18898k41983p578m0348J35763J30072k93296P9193j76216
16405F40062j64500K21954L01034m19484J36116J03679l34072R1028q5968J59924
16395F49773Q6292L1747k33646J34607J60313k23579j89246K30274K20076m4601
16385H22010l24883K80052l68922J10741J33724j85922Q3165K87656j37689k83986
16375D15946M33397j17704j61305K87546A80810N71769k17614j62287j28086K03120
16365D47712j09664K61271r2928j65770K07547L16371k49495m6103K46147j07440
$$ y = [1246283, 1185552, 887026, 771061, 1131147, 767871, 322041, 982133, 824512, 748712, 705325, 885915, 726776, 902027, 1003289, 610109, 840114, 842083, 625954, 828171, 483617, 835557, 1054455, 812472, 804894, 764546, 900309, 1030381, 737085, 816278, 640062, 475562, 697516, 998550, 579066, 715182, 818861, 484789, 575817, 489849, 649773, 736065, 767812, 534166, 668773, 829086, 605507, 416261, 646535, 866611, 822010, 497127, 777179, 408257, 518998, 652722, 466800, 549965, 837621, 699932, 415946, 849343, 731639, 570334, 857880, 180810, 752579, 534965, 372678, 244592, 447712, 338048, 599319, 506391, 340621, 548168, 864539, 615044, 568941, 815088, 707648]
16355G07648A8327N28021Q2990Q0571k66952K34156K0639C06868K27199R6823
16345F30890j34330B37269O9711n3130J08911J55971L7380Q1505k63262J64513
16335E38868k020K07780j77416p6754L6795m8734K75264j63599j29346K7293J65928
16324F54059A49457L16535o7392J4577j82623I3665L24512L79516n6789j1948
16314G28956k52381k30934M37835l23337R7122k8585a3956E99551j81263L17055
16304G35343l09944l640l0850n9436J5131J44878n6789A75016M39379J64997l73201
16293D06191k8495K14728k13103j14719p0081M5507L11065k27505P7573J26551
16283E27712j07763K2834L9769k12861n9376K11731j9400j01714J32035R7523
$$ y = [707648, 18327, 546348, 629338, 709909, 442957, 677113, 697752, 306868, 534067, 630890, 496560, 237269, 306980, 253850, 362761, 518732, 556112, 637617, 374355, 538868, 536848, 744628, 567212, 490458, 527253, 478519, 753783, 590184, 460838, 488131, 654059, 149457, 465992, 398600, 413177, 230554, 93665, 418177, 797693, 740904, 728956, 476575, 245641, 683476, 360139, 457261, 428676, -13956, 599551, 418288, 735343, 425399, 421759, 390909, 331473, 346604, 491482, 434693, 175016, 614395, 779392, 406191, 377696, 592424, 379321, 264602, 194521, 240028, 551093, 323588, 401161, 527712, 419949, 442783, 482552, 269691, 210315, 422046, 402646, 300932, 432967, 530490]
16273E30490k14289L4496A48295K32377A48173J93352L3181l309j12536K95448
16263E54309j4982K18907k22043k63929J92136p9479K8657q7139K60173j41502
16253D45108K1796k12656N5216j33230K6177J21542L0351J26703e1093A90340
16242F75571k36362B07379O5171L32550k68448k8651L99091k3743B63896M2955
16232C06851O5686A82652J60293A12360J90003p6330K44052K0664o5274j36581
16222B88894m1008j23905a0716A90776R857m6732n5458Q6069J99247A89539L2424
16211B21963K24422a58085D08816A11951L5297K49508j30663K57709B14815m6363
16201A68452D187M89400E1529d6478p9041C56900j9876o1806p4879f6082D12037
$$ y = [530490, 316201, 350697, 148295, 380672, 148173, 341525, 374706, 371397, 258861, 554309, 539327, 758234, 536191, 272262, 464398, 384919, 413576, 326437, 586610, 445108, 466904, 254248, 309464, 176234, 202411, 323953, 354304, 481007, -51093, 190340, 675571, 439209, 207379, 272550, 605100, 336652, 308001, 707092, 683349, 263896, 306851, 372537, 182652, 342945, 112360, 302363, 226033, 470085, 490749, 425475, 288894, 247886, 123981, -10716, 190776, 200633, 153901, 98443, 184512, 383759, 189539, 221963, 446385, -158085, 408816, 111951, 147248, 396756, 266093, 523802, 214815, 168452, 4187, 493587, 51529, -46478, -125519, 356900, 337024, 275218, 200339, -66082, 412037]
16189B71249C4510M4089K07377C3411K02075A06497L9840J53477D0915K74472
16179C15387A02025a05251b2113A42833g0625J3103J6324A43372J84936j53817
16169A74491a35187q7905C24430K8422A49065q660a47461E8624J63302H8115M07041
16158D95156A96289I0999D3048m23K1353L28980F906L52669O4900A76556J10236
16147B86792r0520b40313F2166L20861o5346m8274J13767n5424G2167C2609Q251
16136D0860j5066J26770c1371A05156N0421a8146D11972j22745b78079A95395
16125A43021n8307J82392f556k1936A36106J10557A7844f1918r0675A8553b6854
16113B01886A6589P3412l3142K40160A04451J07021g8135B30934b5449F4114l1896
$$ y = [271249, 34510, 78599, 285976, 33411, 235486, 106497, 146337, 299814, 40915, 315387, 102025, -105251, -22113, 142833, -70625, -57522, -41198, 143372, 328308, 174491, -135187, -223092, 324430, 352852, 149065, 140405, -147461, 58624, 221926, 88115, 495156, 196289, 90999, 43048, 42625, 63978, 392958, 6906, 359575, 424475, 176556, 286792, 196272, -240313, 62166, 383027, 317681, 269407, 383174, 327750, 72167, 32609, 40860, 25794, 152564, -31371, 105156, 155577, -18146, 411972, 289227, -278079, 195395, 143021, 84714, 267106, -6556, -28492, 136106, 246663, 17844, -61918, -152593, 18553, -26854, 201886, 16589, 90001, 56859, 297019, 104451, 211472, -78135, 230934, -25449, 64114, 32218]
16102C2218c0765G8830J40159I6855A4886L84602B0313K57027R7758A45028d7308
16090D1811g0263C7893a35260B50626J91987a27288C86034a54351A80731H3729
16079B0530a7029j39452C65834j66068H6658P6417a48563A58180G0879a64791
16068B22672C5808L0618L08494B0050b60121g4160B24495F6417K00547E7486O5754
16057A23240e16l5443q8699g656a84C05621G0375C4125c815E7874M6542K1435
16045A25851a51696F8020A0086e955r902B58395B0917K09426O6042D4487L4475
16034G8962J27242l5460J4081L99680B35951d4628I5362D3317K6480Q5225p3421
16023H1601k4919K43465e4573j02933B45377b27075D6709B1809b55435A49285
$$ y = [32218, -30765, 78830, 218989, 96855, 14886, 399488, 20313, 277340, 375098, 145028, -47308, 41811, -70263, 37893, -135260, 250626, 442613, -127288, 386034, -154351, 180731, 83729, 20530, -17029, -156481, 365834, 199766, 86658, 163075, -148563, 158180, 70879, -164791, 222672, 35808, 66426, 374920, 20050, -260121, -74160, 224495, 66417, 266964, 57486, 123240, -516, -35959, -124658, -7656, -184, 305621, 70375, 34125, -3815, 57874, 104416, 125851, -151696, 68020, 10086, -5955, -15857, 258395, 20917, 230343, 296385, 44487, 78962, 206204, 170744, 184825, 584505, 235951, -44628, 95362, 43317, 69797, 155022, 81601, 56682, 300147, -54573, -157506, 245377, -227075, 46709, 21809, -255435, 149285]
16012H5067J69289a30983B72656A04857C6097J20125c2036F6547a12905a8517
16001A09664a6477B58561i6194j4648C0292a7337l31491C4361d1360A37922a58301
15989d8528A19638P4906a52550b3681D1118a61766l8677L3749d3623G0481L28494
15978C98975C5108R7065J25533a30645b0203E20744j89562L21351L33191O4547
15968A050271m10733K52292B62562L7065j22084N6505d7414e289B09746c2715
15957A14333n736N6980b49093R2297j57050I9374b14556Q2348j28184R7980A11003
15945B57385q7905e8960m5667I5545l6283a5302l14261B1363c27226B60619r5688
15934A64931J4756J17098F3366J81634A10518k0889b05409A6895e532j25505B3786
$$ y = [85067, 254356, -130983, 272656, 104857, 36097, 156222, -32036, 66547, -112905, -18517, 109664, -16477, 258561, -96194, -110842, 30292, -17337, -348828, 34361, -41360, 137922, -158301, -48528, 119638, 194544, -152550, -23681, 41118, -161766, -200443, -166694, -43623, 70481, 398975, 35108, 132173, 257706, -130645, -20203, 520744, 331182, 652533, 985724, 1050271, 639538, 891830, 262562, 299627, 177543, 234048, -47414, -5289, 209746, -32715, 114333, 108597, 165577, -249093, -156796, -313846, 99374, -214556, -132208, -260392, -162412, 111003, 257385, 169480, -58960, -104627, 95545, 59262, -15302, -329563, 21363, -327226, 260619, 164931, 179687, 296785, 63366, 245000, 110518, 89629, -205409, 16895, -5532, -131037, 23786]
15922a88874d2823F7685e731A47978b99728A11813e7883j05348F2258k0391i2404
15910a65100N8425l7733F1151a46026a8576A16135a32129C09597j42161J78519
15900C45955b91646C35488A4433a28644B3568a42427l9327I0500b10883B29282
15889F7514A7334e9255B32412f4558r822D1060d8903A93912a0534A6859a11276
15877B26686J22417b20679a03509A53060a41244A24981I789K96309b36345a272
15866A33384b1457j95815f9580A1549f9084A47645a0120j39691j14182a20727
15855f4132k31503b4045k75479N4830L9321d4186j89654D5123b12907o436L7771
15844a81572a7166l50778D04212b80570d4914j57360Q982K2989k0822k7890a04471
$$ y = [-188874, -42823, 67685, -5731, 147978, -299728, 111813, -57883, -163231, 62258, 41867, -92404, -165100, -106675, -144408, 61151, -146026, -18576, 116135, -132129, 309597, 167436, 345955, -291646, 335488, 14433, -128644, 23568, -142427, -181754, 90500, -210883, 229282, 67514, 17334, -59255, 232412, -64558, -74380, 41060, -48903, 193912, -10534, 16859, -111276, 226686, 349103, -220679, -103509, 153060, -141244, 124981, 9789, 306098, -236345, -1272, 133384, -21457, -217272, -69580, 11549, -69084, 147645, -10120, -149811, -263993, -120727, -64132, -295635, -24045, -299524, -244694, -205373, -44186, -233840, 45123, -212907, -219343, -181572, -17166, -367944, 404212, -280570, -44914, -202274, -193292, -170303, -191125, -219015, -104471]
15832A39407a37223c5841H8867b0445C37377j41004a26288A21497O7230K22869
15822D11596j78503b13524B94703E0647J0522b34561O4921B21964b5732B04873
15811a89192d9561A71754E7722P4679a85719P7455I8281J09568i5396A98237G2322
15799B01007a48249A9608K8955a09626M248a3700F4650c34593A43348o746O0735
15788A97337G415e8285B39074a28461c6378j98892j05314A47064a21349D8534
15777A51663G139a08919j3116h891j45676N7839l19341A23046a26390F5940e3757
15765A91234c4682C48149A39026N4257Q319d0349H667b08546q4925O2077A05455
15753B6288b18884b3495A1317a65413G8521A0808J9002J38884I559K36419a19742
$$ y = [139407, -137223, -35841, 88867, -20445, 337377, 196373, -126288, 121497, 188727, 411596, 233093, -213524, 294703, 50647, 61169, -234561, -169640, 221964, -25732, 204873, -189192, -49561, 171754, 57722, 132401, -185719, -108264, 98281, 207849, -95396, 198237, 72322, 201007, -148249, 19608, 48563, -109626, -105378, -13700, 64650, -334593, 143348, 136602, 197337, 7415, -58285, 239074, -128461, -36378, -235270, -340584, 147064, -121349, 48534, 151663, 7139, -108919, -122035, -8891, -154567, -96728, -416069, 123046, -126390, 65940, -53757, 191234, -34682, 348149, 139026, 193283, 201602, -40349, 8667, -208546, -293471, -231394, 105455, 26288, -218884, -23495, 11317, -165413, 78521, 10808, 29810, 168694, 9559, 245978, -119742]
15741b1358H2532N2770a36726k0022A60890b65921A65080a04833H6120L75a31884
15729B67902g6142C3674g2696B81185p3370a16037A45379n6847d0516A17949c1094
15717B84645a60407k998C5133a33071G2951d0521C01960D6247L07334F3321k8425
15706C4896J79240i2679g471o0356K8432l64630I3713a24451k06953a13877B56122
15694b06658A58449f8254j1637L5763F589J19988f1192j87148A0715M8973N0949
15683A10637m0300O834B5791f5654C6185R734d6549B46701k0257a47401B29307
15671A93391b62456P9550A86123c23165J25926k24371e7245F1297E361b45625
15660a56931f0520F7660L2305M874a2776l2623A15792C2894b17661A59524d16074
$$ y = [-21358, 82532, 135302, -136726, -156748, 160890, -265921, 165080, -104833, 86120, 86495, -131884, 267902, -76142, 33674, -72696, 281185, 207815, -116037, 145379, 88532, -40516, 117949, -31094, 284645, -160407, -163405, 35133, -133071, 72951, -40521, 301960, 46247, 353581, 63321, 34896, 214136, -92679, -7471, -67827, -39395, -404025, 93713, -124451, -331404, -113877, 256122, -206658, 158449, -68254, -79891, -44128, 6589, 126577, -61192, -248340, 10715, 59688, 110637, 70337, 77171, 25791, -65654, 36185, 45919, -46549, 246701, 226444, -147401, 229307, 193391, -262456, -182906, 186123, -323165, -197239, -421610, -57245, 61297, 5361, -245625, -156931, -60520, 67660, 99965, 104839, -12776, -45399, 115792, 32894, -217661, 159524, -416074]
15648e484B0972b8501J1705B6586J88046g4245j659j67102Q9407k76909E6555
15636i1806A17163a55978p0015E8249J41698b03750Q7510A569b34945B54767b86726
15624b74459B7671A179d7651k06027a26416I6648a5311j27207j28182h4769I1111
15612a60039A65378a18125o440c185l44839A88935i2226M2380b396l22144J31850
15601a92690N4523C654c2601B8268J86691d4835J6745a096j58250A48187E3700
15589A41889N7970I2315k4777A7258O9518e4818b3097H6199c23036P9386A51317
15577b41720j48994a09072A23900a42919J0413j74166f0008p4622C3687f5742
15566A17413a46390C14104a69412f2195p4954j51088C6384b5904n7365p020E7417
$$ y = [-5484, 20972, -28501, -16796, 26586, 214632, -74245, -75904, -243006, -153599, -430508, 56555, -91806, 117163, -155978, -225993, 58249, 199947, -203750, -116240, 1569, -234945, 254767, -286726, -274459, 27671, 1179, -47651, -253678, -126416, 96648, -15311, -142518, -270700, -84769, 91111, -160039, 165378, -118125, -124565, -3185, -348024, 188935, -92226, -49846, -2396, -324540, -192690, -138167, 3654, -32601, 28268, 214959, -44835, -28090, -1096, -159346, 148187, 53700, 141889, 199859, 92315, 67538, 17258, 86776, -54818, -23097, 86199, -323036, -243650, 151317, -241720, -390714, -109072, 123900, -142919, -132506, -306672, -60008, -134630, 33687, -65742, 117413, -146390, 314104, -169412, -62195, -137149, -288237, 36384, -25904, -83269, -90289, 57417]
15554d4308J8103j64178C681a49031f553B13127g481C0091D646M8894a05427G5698
15541a70241C36757h1342g258B71703a7546A09287c90022C41483E7038a66416
15530C759b63181j8420F6645K29291a31541E4993K42155H7736l2004K11942r7959
15519A69715b446m5778A91532a76821r8550A81299k0875K0050A4384Q5490a24691
15507d4494B42870b79271E8771J5515N3777J3904a54337B8073a1992l3000G5874
15495B630J64103a11830C32619a47366f9417j61333e374I3695K74413a09463H9546
15483E3089M6230c085C18406j21200a44148A06185L6231O9407E9782J67887e31639
15471b23546h324A56000f6243a9227B36277M9138K4874a37077c9754A54031J6600
$$ y = [-44308, -26205, -190383, 3681, -149031, -6553, 213127, -7481, 30091, 4646, 53540, -105427, 75698, -170241, 336757, -81342, -7258, 271703, -17546, 109287, -390022, 341483, 57038, -166416, 3759, -263181, -281601, 66645, 295936, -131541, 54993, 297148, 87736, 55732, 267674, 169715, -2446, -48224, 191532, -176821, -275371, 181299, 160424, 180474, 14384, 99874, -124691, -44494, 242870, -279271, 58771, 74286, 128063, 141967, -154337, 28073, -11992, -44992, 75874, 2630, 166733, -111830, 332619, -147366, -69417, -230750, -5374, 93695, 368108, -109463, 89546, 53089, 99319, -3085, 318406, 197206, -144148, 106185, 142416, 211823, 59782, 227669, -531639, -223546, -8324, 156000, -66243, -19227, 236277, 285415, 310289, -137077, -39754, 154031, 170631]
15460A70631K91808M2322K3173j24366q9741G3499L8572h3045F7445f8983n5111
15449a24094A59417N6987b2229B13526m4130O5845o0082J07171f8819j24368j88834
15438c82021H8476b57871G0992J88441A27739c0706A35523l9639J89014J35665
15428D20563M7537K67355k02480K71074j11597q2013l00663j34774Q5921H0637
15417B12504B0071J53301b73549C35104d5893G3584a45755G7720b29231B51483
15406a77489A6227b6858A54272n0709b71800J28027c7706B02320c829r4723m948
15395a03500H8644j5200c08297J22037o4386g0480E6733L9903a92032A33710c9830
15383A1750J05759b59895f302B71607h3158A78558b67575A94206k1962b26947
$$ y = [170631, 462439, 504761, 527934, 403568, 313827, 73499, 112071, -83045, 67445, -68983, -124094, 159417, 216404, -22229, 213526, 169396, 235241, 175159, 282330, -68819, -193187, -382021, 88476, -257871, 70992, 259433, 127739, -30706, 135523, 95884, 284898, 420563, 468100, 735455, 532975, 804049, 692452, 610439, 309776, 175002, 260923, 80637, 212504, 20071, 173372, -273549, 335104, -45893, 73584, -145755, 77720, -229231, 251483, -177489, 16227, -26858, 154272, 103563, -271800, -143773, -37706, 202320, -3829, -98552, -103500, 88644, 73444, -308297, -186260, -250646, -70480, 56733, 96636, -192032, 133710, -39830, 11750, 117509, -259895, -6302, 271607, -83158, 178558, -267575, 194206, 172244, -226947]
15372e5693E0846Q4977a12305A29516e857D0083M15229I9985g8000J1233B58724
15360B68477N2925A31060h7636B20546I9593e7631B28208k8027q5818h9652F7551
15348a2173A38713a70684A99933E4090a37901C41499E0659O5402b0992A02400
15337C05039f5679C77597A87424c19656A86461J1473K5320a13293A87415l834
15327A83581p0465G036M88995j92489r8056I1306N627J28035M3413G6638a22020
15315a78555A30542b14698D2868J90405J09894o8562n1423m2358A0823a58275
15304A13780M28942c0322A28695b8156I7650J12952K632r8832M1253m6859a80634
15292A94267L07206g5562j6816D5465c0883A62520a01674D6314Q2925e68359h1118
$$ y = [-55693, 50846, 135823, -112305, 129516, -5857, 40083, 455312, 99985, -78000, -66767, 258724, 268477, 321402, 131060, -87636, 220546, 99593, -57631, 228208, 200181, 114363, -89652, 67551, -12173, 138713, -170684, 199933, 54090, -137901, 341499, 50659, 116061, -20992, 102400, 305039, -65679, 377597, 187424, -319656, 186461, 197934, 223254, -113293, 187415, 183581, 113116, 7036, 496031, 303542, 205486, 91306, 96933, 224968, 268381, 76638, -122020, -178555, 130542, -214698, 42868, 233273, 343167, 274605, 223182, 180824, 10823, -158275, 113780, 542722, -30322, 128695, -28156, 97650, 210602, 213234, 114402, 155655, 108796, -180634, 194267, 501473, -75562, -92378, 45465, -30883, 162520, -101674, 46314, 129239, -568359, -81118]
15280G5346a06724B15412O9209O0184c4141A44003a3900A92532d4007A45871a84213
15268c31489A34548e2352l32631a54049i635C0815Q09b83669C2844M6329O0661
15257A39834a66456r8098C46566f873m78549a6370A43665C0747f1154A60675p6385
15246H4290h8490A41383F1005b57927B01528b26499A23599E4784K11924B0264
15235a02746C52729B7017g5041A18537K57684P6437K23029L50440L14689l21308
15225A019508k04272K58167m77832r1120A84970J49226D2943e8249E0674A4256
15214I4107p78J1048J44999E4915p134O0959d724A41160J60668a1652A63079A2014
15201A2881K04964j06333a40568A40622B6266a18356j05706E3604a63672F5087
$$ y = [75346, -106724, 215412, 284621, 344805, -34141, 144003, -13900, 192532, -44007, 145871, -184213, -331489, 134548, -52352, -384983, -154049, -9635, 30815, 31624, -283669, 32844, 79173, 139834, -166456, -264554, 346566, -6873, -485422, -16370, 143665, 30747, -61154, 160675, 84290, -88490, 141383, 61005, -257927, 201528, -226499, 123599, 54784, 266708, 20264, -102746, 352729, 27017, -75041, 118537, 376221, 452658, 675687, 1026127, 1340816, 1019508, 815236, 1073403, 595571, 504451, 184970, 334196, 42943, -58249, 50674, 14256, 94107, 93329, 104377, 249376, 54915, 47781, 108740, -4724, 141160, 301828, -11652, 163079, 12014, 12881, 217845, 111512, -140568, 140622, 26266, -118356, -224062, 53604, -163672, 65087]
15190c81252B3038N9858O8232a58905e4721R912E0345b1849B31444J18194n9993
15179B89645b5512A99117k6157b3494A77460c08055B04435d2595A50986E7522
15168A78787G2314a9351A59370J06434j19849m8098b6225B8497R1132J97807d5913
15156A16384d05852a73245B27159C4637N2123f8616A22979b00275B07797I240
15145a11815n5219H8318J04201H765K01689A5347J21741F7760J22545o1955Q1950
15134B10300n9732b34714D47471A57886b51616D1806J10380k9501a95725L6157
15124a59568I0543J56909h2415G7808k9572c4964E38838A3012c8458E8996b03507
15112A19659O8035Q4967B7206P9103L8813o2911L0831C3290M66638N115d800H0605
$$ y = [-381252, 23038, 82896, 151128, -158905, -54721, -44809, 50345, -21849, 231444, 349638, 289645, -25512, 199117, 172960, -23494, 177460, -308055, 204435, -42595, 150986, 57522, 178787, 72314, -19351, 159370, 265804, 145955, 97857, -26225, 28497, 119629, 317436, -45913, 116384, -405852, -173245, 227159, 34637, 86760, -68616, 122979, -200275, 207797, 9240, -111815, -167034, 88318, 192519, 8765, 210454, 15347, 137088, 67760, 190305, 128350, 210300, 150568, -234714, 447471, 157886, -251616, 41806, 152186, 122685, -195725, -159568, 90543, 247452, -82415, 77808, 48236, -34964, 538838, 13012, -38458, 58996, -203507, 119659, 187694, 272661, 27206, 106309, 145122, 82211, 113042, 33290, 499928, 505043, -4800, 80605]
15099C72011j47499a2304B08846k6517E2685M2797a19073M4250B39492I7082J12539
15088B09621p6917J75646d0294G8181e7911B18480F1116a6295C88030A11133C5498
15076D49474A62233E8595j4292a02679B09718K04415A88295A5309J9770f7288
15065C36838H1652M14814A82459B8587J87374M2550c8245C15179A10132J23692
15055B33824C7901K87851a90A30946j3783Q5241E766J81929H0395l3792R2025
15044A38628d0013A61151J51636R5192C8295J06946J1400J5661B3441K37667L26247
15033E87355A68117K03223J42256B36283M2036a22697D1447a42945D57450j40382
15023C17068A49815L79353R84k27990L3457k0398M4981Q7718J32895J25192R5951
$$ y = [372011, 224512, -12304, 208846, 182329, 52685, 95482, -119073, -74823, 239492, 97082, 209621, 132704, 308350, -40294, 78181, -57911, 218480, 61116, -16295, 388030, 111133, 35498, 449474, 162233, 58595, 44303, -102679, 209718, 414133, 188295, 15309, 35079, -67288, 336838, 81652, 496466, 182459, 28587, 215961, 258511, -38245, 315179, 110132, 233824, 37901, 325752, -190, 130946, 117163, 202404, 5766, 187695, 80395, 46603, 138628, -40013, 161151, 312787, 407979, 38295, 145241, 156641, 172302, 23441, 261108, 587355, 168117, 371340, 513596, 236283, 278319, -122697, 41447, -142945, 457450, 317068, 149815, 529168, 530152, 302162, 335619, 315221, 360202, 447920, 580815, 706007, 801958]
15012H01958k88813J19965r7222j92065q7887J82588p6663K10312k19922J34908
15002D87159O3483q8106j16348R8088B01418m9362L23853k03036k259K4302J12060
14991D06976j77873m4120M80586k68032B1452J70540I752M30599m9936J261J44725
14980E36401j50089A88319L34826n7980J55255j32676B36994J77003Q0180F6897
14969B11272L25907q6777J0627J81720J52919j23815K7497l08145K09624j8056
14959E82773K32313k28663j70382o5564J87333q1956J3160B02479K55399j44365
14949C13513J61645j11124A72765a4779B91678J83280j81243G2110A1447L78863
14939C90310p5534K2134J64911A02279M10454j57643b0601A29100M68577j44555
$$ y = [801958, 513145, 633110, 535888, 343823, 255936, 438524, 361861, 572173, 352251, 487159, 550642, 462536, 346188, 444276, 201418, 152056, 475909, 272873, 270614, 294916, 406976, 229103, 184983, 665569, 397537, 21452, 191992, 9752, 440351, 390415, 391676, 536401, 386312, 188319, 523145, 465165, 620420, 487744, 236994, 413997, 494177, 66897, 211272, 537179, 450402, 461029, 642749, 795668, 671853, 699350, 391205, 600829, 582773, 815086, 586423, 416041, 350477, 537810, 455854, 469014, 202479, 457878, 313513, 475158, 364034, 172765, -14779, 291678, 474958, 293715, 72110, 11447, 390310, 314776, 336910, 501821, 102279, 512733, 355090, -20601, 129100, 597677, 453122]
14929D53122l4202J70419P6919B33284J72930J62920r8135M1653k25534L6045
14919C23163J83983l1807k32600J60576l5886N17150J96132L06371m96178N01220
14909A392124l27344M91765J31728o21277P2968J33153P5389M14188J81448M9077
14899A993219p51527K45456k57803l88393M36609n38626J37593J02365l80259
14890E98634k28212n9830N7926L3401O7600n7828R4323B22720P6794J79584A45246
14878C04336K41531l3104j17743j9602j16207L10162k25637M38575j71119Q8427
14868F99619j5136k99486N45151j48648K2607r4604l02494J95772j83570O4930
14858D84141j08019J14725Q2195M6874B47161K30257N2420J54111p7762j5107
$$ y = [453122, 418920, 589339, 666258, 233284, 406214, 569134, 470999, 512652, 287118, 323163, 507146, 475339, 242739, 403315, 367429, 884579, 1080711, 1387082, 890904, 1392124, 1064780, 1556545, 1688273, 1066996, 1139964, 1273117, 1348506, 1762694, 1944142, 1993219, 1241692, 1487148, 1229345, 840952, 1277561, 738935, 876528, 978893, 598634, 370422, 310592, 368518, 401919, 469519, 411691, 506014, 222720, 299514, 479098, 145246, 304336, 545867, 512763, 395020, 375418, 259211, 569373, 343736, 782311, 611192, 699619, 684483, 384997, 930148, 781500, 804107, 709503, 407009, 602781, 419211, 484141, 376122, 490847, 573042, 619916, 247161, 477418, 529838, 683949, 606187, 591080]
14848E91080k73846L06488j34022K00928B51033m0012N8186K44666j89658J89329
14838E13544B12909R7768k0607r6592L56736o3829j2647r8425J39861J24022n0756
14827E88440K29545J3490r7898K00221j92667J67055j3978k41743K86951l69580
14817E69836K214k19731G8968M39930k38615J17555N3569j14676M11825l62497
14807C86059J0607O3052L02536m1274J13968C66973L43794l47654J01292N8544
14797E22949j53141K44598k62930J48469R5244J46633N3226r2632P0319K3664
14787G96399J5056j14553O005r6972q9174j54327K75410l11014j01746J11753
14777C36837L6964P1384J16305k63519K00302J38694D3182L46916K01048K10779
$$ y = [591080, 317234, 623722, 489700, 690628, 251033, 211021, 269207, 513873, 324215, 513544, 212909, 310677, 290070, 193478, 550214, 486385, 473738, 375313, 515174, 639196, 588440, 817985, 831475, 733577, 933798, 741131, 908186, 894208, 652465, 939416, 569836, 572050, 352319, 78968, 518898, 280283, 397838, 451407, 336731, 748556, 386059, 396666, 459718, 762254, 720980, 834948, 366973, 710767, 363113, 464405, 522949, 369808, 614406, 351476, 499945, 595189, 741822, 795048, 702416, 772735, 796399, 811455, 696902, 702907, 605935, 516761, 362434, 637844, 326830, 225084, 336837, 373801, 445185, 561490, 297971, 498273, 636967, 43182, 390098, 591146, 801925]
14767H01925j50397q782j99690K78260j45340J8544j23944J03703L01365J34790
14757A010434m77500K41680L6301l58052n7109Q7230o949j95273J44237Q4189
14747E09188j3278L08623l11581j60962L7833J94481L9097J11162k59309K32925
14737F88179Q857m6319j66280l4199m1902K10749j08189L41554B89606K35613
14727E25219M46221l81815B5564N60708K11449j48275J76199j5666r0869R2884
14717H11994L687L1099J64222r0038M23204k64822P5657L81981j86115q0999j66294
14706A103576L1734l69678L46183l28218L5422r5389L4583k80419J32866L29158
14696I39818m9105J59979B77179J10883K61253j619L85452O5832k00921L87635
$$ y = [801925, 651528, 642746, 443056, 721316, 575976, 594520, 470576, 574279, 875644, 1010434, 532934, 774614, 810915, 452863, 395754, 482984, 476035, 280762, 424999, 509188, 495910, 804533, 492952, 331990, 369823, 564304, 603401, 714563, 455254, 688179, 697036, 650717, 484437, 450238, 408336, 619085, 510896, 852450, 289606, 525219, 971440, 589625, 25564, 586272, 797721, 649446, 825645, 809979, 719110, 811994, 815681, 846780, 1011002, 920964, 1344168, 1079346, 1155003, 1536984, 1350869, 1269870, 1103576, 1135310, 765632, 1111815, 783597, 819019, 723630, 758213, 477794, 610660, 939818, 890713, 1050692, 277179, 388062, 649315, 647696, 1033148, 1098980, 898059, 1285694]
14686A285694P0929J63804j97863r9482J08042j4291k25654M7772m71104J09360
14676G77207K303o9641O4734k37098J59876o0475N9867J13069j11279j9834Q0553
14665G59282J58122m6216l50912K32290j01504Q3912M07194l00749j00738j90706
14655E49975L01976r0225J40059q3031J58491j01555J19462k61116L55298j32094
14645I57240p698M7406K19233m58022l0048O03263K7249j91073m76020L48646
14635A040176r5153L30561j39590J57962j18651k87635J27595k30299J52681J615
14625I39262k41998N16538l76386M6041M35353k49977j41363R490L51119j79680
14615A108399K43506j18718k23564o7058K83568j99610j78418L91027k41496K72827
$$ y = [1285694, 1356623, 1520427, 1322564, 1223082, 1331124, 1316833, 1091179, 1138951, 667847, 777207, 779510, 709869, 774603, 537505, 697381, 636906, 696773, 809842, 698563, 678729, 759282, 917404, 871188, 520276, 752566, 651062, 734974, 1142168, 841419, 740681, 549975, 851951, 761726, 901785, 818754, 977245, 875690, 995152, 734036, 1089334, 957240, 949542, 996948, 1216181, 758159, 728111, 1331374, 1358623, 1167550, 691530, 1040176, 945023, 1275584, 1135994, 1293956, 1175305, 887670, 1015265, 784966, 937647, 939262, 697264, 1213802, 837416, 883457, 1318810, 1068833, 927470, 936960, 1288079, 1108399, 1351905, 1233187, 1009623, 942565, 1226133, 1026523, 848105, 1239132, 997636, 1270463]
14605A270463j52888j06780j16860M58820j91603J72572J55812m33831J36204
14596A191909R3192k95094L82511j76712J95731n03618L94173K04955Q2915j52591
14586A417371j88284J19023j00591L13841l98453Q5275J48169k64636J83130k66095
14576A048750M24287r1946K85690k35561j77986J78338R6649J1991P0471J00637
14566A711320n27883O65577r4686l67122L62362j16501L6445j55121M73293p8363
14556A909321n01379K56440p913K07436j33968M23737l01837J61734j85549L48517
14546B176539j4016L64329o8387j03378L19057J79385k1181P50900K08202P01794
14536D493244L22018Q72080K195260L012622O364925R507742J044412j2151809
$$ y = [1270463, 1117575, 1010795, 893935, 1352755, 1161152, 1333724, 1489536, 1055705, 1191909, 1285101, 990007, 1372518, 1195806, 1391537, 887919, 1282092, 1487047, 1569962, 1417371, 1229087, 1348110, 1247519, 1561360, 1162907, 1248182, 1396351, 1131715, 1314845, 1048750, 1473037, 1381091, 1666781, 1431220, 1253234, 1431572, 1528221, 1540212, 1610683, 1711320, 1183437, 1849014, 1754328, 1387206, 1749568, 1633067, 1669512, 1514391, 1987684, 1909321, 1407942, 1664382, 1656469, 1863905, 1729937, 2153674, 1851837, 2013571, 1828022, 2176539, 2162523, 2526852, 2458465, 2355087, 2674144, 2853529, 2832348, 3583248, 3791450, 4493244, 4815262, 5687342, 7882602, 10895224, 17260149, 26767891, 27812303, 15660494]
14528A5660494o383734l434625j373483o54094l86211N01668M52204j071069r47265
14519B363885k68662r7618K13561l77529p8149N16228k67853j93396L7634l1911
14509A816190K28832j0520j53972L08691k22876k5095P2461j55499M6080j9754
14499A884538m9407M88787k63715M08788k92106O1388N6147J49729j18745K44254
14489B569658l08680n1710M21161q0800j74870l7255Q3770K18891L13787n2017
14479B901935j29040l47600M14267l61190K33464J79403k25842K39796K89574
14470C194767l10858J87175k30134J53319J01437R1283J9179k09162L01851R4724
14460C393581j43298j24356N94228j38931j50199K93117l55110L22812j6483p2595
$$ y = [15660494, 9276760, 5842135, 4468652, 3814558, 3428347, 3930015, 4382219, 3311150, 2363885, 2095223, 1997605, 2211166, 1833637, 1755488, 2271716, 2003863, 1810467, 1848101, 1816190, 2045022, 2034502, 1880530, 2189221, 1966345, 1941250, 2013711, 1858212, 1904292, 1884538, 1835131, 2323918, 2060203, 2468991, 2176885, 2238273, 2294420, 2444149, 2325404, 2569658, 2260978, 2209268, 2630429, 2549629, 2374759, 2337504, 2421274, 2640165, 2953952, 2901935, 2772895, 2425295, 2839562, 2478372, 2711836, 2891239, 2665397, 2905193, 3194767, 2883909, 3071084, 2840950, 2994269, 3095706, 3186989, 3206168, 2997006, 3298857, 3393581, 3250283, 3125927, 3720155, 3581224, 3431025, 3724142, 3369032, 3691844, 3675361, 3602766]
14450C602766K49557j98876L15782k14694R4658K05223j60247L31884l92186N24783
14440D358650l48505L76613o4947k096j17513P2586j11317L33313L30742k92582
14430D534944J15694j71471N29320P2810k87507P0433m2257M21283j21288K81504
14420E403465j93928R6724J97575L63426m77564M98454m05793M43387O0569N1615
14410F037930j16056M35643J32967K05556j94641J29390K01167l0608L18272R1852
14400G211472K76641l86925J2624L92219k90138J70444K32177K12580J24718Q4283
14390H040095L2495J48762N23433P1514K77400k71587L5678J45462K43078q3130
14380I163200Q8433M00684K52691J07719J34363M0148L31228L44249J54386M15904
$$ y = [3602766, 3852323, 3653447, 3969229, 3754535, 3849193, 4054416, 3894169, 4226053, 3833867, 4358650, 4010145, 4386758, 4321811, 4319715, 4202202, 4274788, 4163471, 4496784, 4827526, 4534944, 4650638, 4479167, 5008487, 5081297, 4793790, 4864223, 4821966, 5243249, 5121961, 5403465, 5209537, 5306261, 5503836, 5867262, 5389698, 5888152, 5482359, 5925746, 5986315, 6037930, 5921874, 6357517, 6490484, 6696040, 6501399, 6630789, 6831956, 6801348, 7119620, 7211472, 7488113, 7101188, 7113812, 7506031, 7215893, 7386337, 7618514, 7831094, 7955812, 8040095, 8072590, 8221352, 8744785, 8816299, 9093699, 8822112, 8857790, 9003252, 9246330, 9163200, 9251633, 9652317, 9905008, 10012727, 10147090, 10187238, 10518466, 10862715, 11017101, 11433005]
14370A1433005J52108J886l2846Q4889N91564K14642N67096Q729J67387J01021
14360A3289481M9066N47568k08132N11069M76613J74183K07548O57327K97785
14351A6002508J23848N68768J64440M48889J13747L89308M63195N80316J97096
14342A9052115M75667L84197J18075P62312N16210M37390M44185P75188N74613
14333B3539952M17435P35358L74934J122557N88318O92821O78386Q12977J016086
14324B9978824P69824P00561O69005J404002Q98109J191704Q57282Q82595J260691
14315C8612597J406402J126934J282205J323521J849208J843490J064493K431988
14307E0940838J533191J640121K067873J845512K381799K667146J807489K980685
$$ y = [11433005, 11585113, 11586999, 11554153, 11639042, 12230606, 12445248, 13012344, 13021073, 13188460, 13289481, 13338547, 13886115, 13677983, 14189052, 14665665, 14839848, 15047396, 15704723, 16002508, 16126356, 16695124, 16859564, 17308453, 17422200, 17811508, 18274703, 18855019, 19052115, 19527782, 19911979, 20030054, 20792366, 21308576, 21745966, 22190151, 22965339, 23539952, 23957387, 24692745, 25067679, 26190236, 26778554, 27471375, 28149761, 28962738, 29978824, 30748648, 31449209, 32118214, 33522216, 34420325, 35612029, 36469311, 37351906, 38612597, 40018999, 41145933, 42428138, 43751659, 45600867, 47444357, 48508850, 50940838, 52474029, 54114150, 56182023, 58027535, 60409334, 63076480, 64883969, 67864654]
14299F7864654K671591K915988K759596L191977L525771L184660M496344L796835
14291I4407416M242493N003302M574786N726387N581020O533738O470336O877342
14283A39416820P303435P805828Q282492Q677735R532090R895297J0398291J1276107
14275B12588095J1840278J2138525J2715042J2976104J3113829J3665270J3794153
14268C02831296J3728387J3718409J3705312J3172714J2161151J1171607R476237
14261C89965113Q867528P797492P145039N116893J687557K21588Q99985j882287
14253D19818908j0033197p717380q187496j1068503j0109672j1421787j2397720
14246C48883153j3279187j3483877j3403197j3664155j3527909j3246957j2963998
$$ y = [67864654, 70536245, 73452233, 76211829, 79403806, 82929577, 86114237, 90610581, 94407416, 98649909, 103653211, 108227997, 113954384, 119535404, 126069142, 132539478, 139416820, 146720255, 154526083, 162808575, 171486310, 181018400, 190913697, 201311988, 212588095, 224428373, 236566898, 249281940, 262258044, 275371873, 289037143, 302831296, 316559683, 330278092, 343983404, 357156118, 369317269, 380488876, 389965113, 398832641, 406630133, 413775172, 418892065, 420579622, 420801210, 421701195, 419818908, 409785711, 402068331, 393880835, 382812332, 372702660, 361280873, 348883153, 335603966, 322120089, 308716892, 295052737, 281524828, 268277871, 255313873]
14239B55313873j2026061j2216254j1206719j0687891j0916107j0860567r706781
14232A77693493r887873q808681q067243p771712o852445o794025o534032n961716
14224A17015766n447230n150074m928725m968456l895406m143232l505287m058193
14216H0919163k682446k957276l724497k841993k681277k381985k808717j842689
14208E8998283k151742k411976j540165j790953j949401j812306j470738j615139
14200D4255863j283010j230062j243892j413941j224166j296408o34951r34691
14192C4994742r86941q82394j201811j130704p31994o22408q92972n34049p95847
14183B7215622o59104p79221q19908p61664l70010p04312k89220p92150n33672
$$ y = [255313873, 243287812, 231071558, 219864839, 209176948, 198260841, 187400274, 177693493, 167805620, 158996939, 150929696, 143157984, 136305539, 129511514, 122977482, 117015766, 111568536, 106418462, 101489737, 96521281, 92625875, 88482643, 84977356, 80919163, 78236717, 75279441, 71554944, 68712951, 66031674, 63649689, 60840972, 58998283, 56846541, 54434565, 52894400, 51103447, 49154046, 47341740, 45871002, 44255863, 42972853, 41742791, 40498899, 39084958, 37860792, 36564384, 35929433, 34994742, 34007801, 33125407, 31923596, 30792892, 30060898, 29438490, 28545518, 28011469, 27215622, 26556518, 25777297, 24957389, 24195725, 23825715, 23121403, 22832183, 22040033, 21506361]
14174B1506361n52646o43582k36806j72617m04805o12624o15581n12256n06024
14165A7249420J14696o49767m82098P686o05451N7184o40928k94206l64164M5037
14155A4437409n49842j59038m21149l89698j08056j14636k90313j12390k79975
14146A2012312n11443J35749k06605j90697j43437n10283m14977K06748R9492
14137A0476859m10613p9344k12590m1797k06021N22m87854j45112j63029l4144
14127H696877n9242m4004j99239k50905l05953p5875J59000l30345j36700J02454
14117G556068J43498m45212J5152n4223l36479Q8325Q2352j15446k97669j64821
14107F471545P8408n6824l55977k43281K52935j66392K54312j90427l94847N3631
$$ y = [21506361, 20953715, 20310133, 20073327, 19900710, 19495905, 18883281, 18267700, 17755444, 17249420, 17364116, 16714349, 16232251, 16239937, 15634486, 15691670, 15050742, 14756536, 14392372, 14437409, 13887567, 13728529, 13307380, 12917682, 12809626, 12694990, 12404677, 12292287, 12012312, 11500869, 11636618, 11430013, 11239316, 11095879, 10585596, 10170619, 10377367, 10476859, 10066246, 9986902, 9774312, 9732515, 9526494, 9527016, 9039162, 8894050, 8731021, 8696877, 8637635, 8593631, 8394392, 8143487, 7837534, 7761659, 7920659, 7590314, 7453614, 7556068, 7699566, 7254354, 7269506, 7215283, 6878804, 6967129, 7049481, 6934035, 6636366, 6471545, 6549953, 6493129, 6137152, 5893871, 6146806, 5980414, 6234726, 6044299, 5649452, 5703083]
14097E703083j24743J37919M8550l12731j41423l4793J96835k03243j77646j72482
14087D919326j72052M77906k45010P7786l99052K76383m18467K4046l76327J76640
14077D341179J27195l51113L95474m54162L13433l40400N4874j64469j91952J02959
14067C833018J94021j22109k0576j62192L50797l64231k25372K6515j94014M27798
14057C743655J3883k87959k43914P73669l83027j07269k44323L9719R0393J4704
14047C409531J22674q5432J8302o5548j7106J9972l94780J47022k8305m39782
14037B686548M72975l36829P1882j71646j65313N02523o6500j43517l11903K1581
14027B559801j6674K1414O5889L3177m0436k41888M23988m01153R5492P2332J09584
$$ y = [5703083, 5578340, 5716259, 5764809, 5452078, 5310655, 5275862, 5472697, 5269454, 5091808, 4919326, 4747274, 5225180, 4980170, 5057956, 4658904, 4935287, 4516820, 4540866, 4164539, 4341179, 4468374, 4117261, 4512735, 4058573, 4372006, 4031606, 4086480, 3922011, 3730059, 3833018, 4027039, 3904930, 3884354, 3722162, 4072959, 3708728, 3483356, 3509871, 3315857, 3743655, 3757538, 3469579, 3225665, 3999334, 3616307, 3509038, 3264715, 3304434, 3394827, 3409531, 3532205, 3446773, 3465075, 3399527, 3382421, 3402393, 3007613, 3154635, 3126330, 2686548, 3159523, 2822694, 2894576, 2722930, 2557617, 3060140, 2993640, 2850123, 2538220, 2559801, 2543127, 2564541, 2630430, 2663607, 2623171, 2381283, 2805271, 2404118, 2499610, 2571942, 2681526]
14016B681526j06678k44617N4132l6559J5435j41228L72530m42775O2664N2666
14006B267096K20735m65763j48026L25678L78914o25124J80088J96634p34902
13997A595330L74815l36556M45001l20124q2819K80392j99007K97445P660l78271
13987A683866n8767N46828l85518R971L16744j77605j51799K63903K00961J63762
13977B412346K40423J44799P00355J445410K424099N076210R661248P223042j0870944
13968A8456988o516220l731708j710440j666095j075670r1228n95093p0715l87536
13959B612283l12497P9582N3293k71166N1168j00349M4982k15289J49548o8855
13949B022700l40223j07641L20191l46545L98961k21601j5659L81371k8749m6325
$$ y = [2681526, 2574848, 2330231, 2384363, 2347804, 2363239, 2222011, 2594541, 2151766, 2214430, 2267096, 2487831, 2022068, 1874042, 2199720, 2578634, 1953510, 2133598, 2330232, 1595330, 1970145, 1633589, 2078590, 1758466, 1675647, 1956039, 1757032, 2054477, 2062137, 1683866, 1625099, 2171927, 1786409, 1796380, 2113124, 1935519, 1783720, 2047623, 2248584, 2412346, 2652769, 2797568, 3497923, 4943333, 7367432, 12443642, 22104890, 29327932, 18456988, 11940768, 8209060, 6498620, 4832525, 3756855, 3665627, 3070534, 2999819, 2612283, 2299786, 2379368, 2432661, 2161495, 2212663, 2112314, 2157296, 1942007, 2091555, 2022700, 1682477, 1574836, 1895027, 1548482, 1947443, 1725842, 1710183, 2091554, 2062805, 2016480]
13939B016480m08350o6759N468J92676q1421k13005J32217K0494n2444j05766
13929A439590J25505l92207K69075K5013o0097R354J1472K24581k48755j10733
13919A292798M3263O2529N7371K81303l84762M3839j23388j78786L3033J42880
13909A270080m8944J76139m6142j23096j77158J58656k8879L89243m57018J90204
13899A303085l50713p5282L28006O931j41293P9915l0306Q4581l97988L34545
13889A141481j36486J6262L8977Q4586j13996R3831O8525L0355m27172J76873
13879I73236K84931k95803J04170J57337n35578J34570P5034J57646N2572k09577
13869H98538K87120l19945J17459j62453K36489m2538j76513J45092L5816m16436
$$ y = [2016480, 1608130, 1541371, 1546839, 1739515, 1658094, 1445089, 1577306, 1597800, 1545356, 1439590, 1565095, 1172888, 1441963, 1466976, 1406879, 1416233, 1427705, 1652286, 1403531, 1292798, 1336061, 1398590, 1455961, 1737264, 1352502, 1396341, 1272953, 1094167, 1127200, 1270080, 1221136, 1397275, 1351133, 1228037, 1050879, 1209535, 1180656, 1569899, 1112881, 1303085, 952372, 877090, 1205096, 1212027, 1070734, 1150649, 1120343, 1204924, 806936, 1141481, 1004995, 1021257, 1060234, 1144820, 1030824, 1124655, 1193180, 1223535, 796363, 973236, 1258167, 962364, 1066534, 1223871, 688293, 822863, 897897, 1055543, 1108115, 898538, 1185658, 865713, 983172, 820719, 1057208, 1014670, 838157, 983249, 1019065, 602629]
13859F02629M35534k74281o314J98893l00831K38701o2183J8768K4065j84977
13849F90004J98823J7170q5889M3291r5383J58461j56057K87347j90070P804k01564
13838F73937r7037R0280j7546N5833J8976k53244L37730k2381R844l0214J63577
13827I29755o1799k2262j9070K47090j61489k9339k84045J16061O8999q4188K14289
13816I14002M5346k10337k65290J61486L17056k37435K0107n8760q1012J7526
13806F22689j43872j393J57122J92351M9955l59202m3996M30278m6002C36978
13795D90973J7549K6185K79684l36509R1195J64803P9802j53702K06418k12204
13785F54194j06605Q6110j95900Q7335K53937j34087P983J25882k0520l76667
$$ y = [602629, 1038163, 763882, 757568, 956461, 655630, 894331, 832148, 850916, 874981, 690004, 888827, 905997, 820108, 863399, 768016, 926477, 770420, 1057767, 867697, 875501, 673937, 576900, 667180, 649634, 705467, 724443, 471199, 808929, 786548, 796392, 766178, 929755, 867956, 845694, 826624, 1073714, 912225, 882886, 598841, 714902, 783901, 699713, 914002, 959348, 749011, 483721, 645207, 962263, 724828, 744935, 686175, 605163, 622689, 478817, 477424, 634546, 826897, 876852, 517650, 473654, 903932, 857930, 336978, 490973, 508522, 534707, 814391, 477882, 569077, 733880, 813682, 659980, 866398, 654194, 547589, 633699, 437799, 525134, 779071, 644984, 652967, 778849, 758329, 381662]
13775C81662J2789J38782R2953L22666l22650J37151n0240M3313l72833M6713
13765D30306K07036J71744l58857p2838L48408r7548K1158n0894j79204K81796
13755G01107N6743C42631j44299O36261k29314k17779J79675O0765j07005K43582
13745G64517k67035L61728l98679L78379l17244J30800C24625K33799N343J50902
13735G14669J45913k69900j61763L03215k99338l6968k6151N4823j90065K08058
13725D42493l0032L0161K7392j2463k8000n2264j4220L45045j72921j27210J745
13714D09726J14608k38420L59386k84641j25371J43341J11075L0078l1597k8206
13704D59979l8572J39424n6640q3868j7066m2109J10180J44163B99172k4321M23923
$$ y = [381662, 394451, 533233, 626186, 948852, 626202, 763353, 713113, 756426, 383593, 430306, 637342, 809086, 450229, 377391, 725799, 628251, 649409, 598515, 419311, 701107, 757850, 342631, 198332, 834593, 605279, 387500, 567175, 627940, 520935, 764517, 497482, 859210, 460531, 838910, 521666, 652466, 324625, 558424, 563767, 714669, 860582, 590682, 428919, 732134, 432796, 395828, 369677, 424500, 234435, 442493, 412461, 442622, 470014, 457551, 429551, 377287, 363067, 708112, 535191, 407981, 409726, 524334, 285914, 645300, 360659, 235288, 378629, 489704, 519782, 488185, 459979, 421407, 560831, 504191, 420323, 403257, 361148, 471328, 615491, 299172, 274851, 698774]
13693F98774k6523C13725K42772k57221j2582A23202M02318j41888m0439L5065
13683C78258k449J56045j8598J5550A72304K52395j06982J28976m6082A89923
13672A13725J68986L63078j09091J01503k57572a22838A24441K10607m6842N523
13662B93729K6433J17024L02759A80180M8688J15012m7847J68821j90907j33190
13652A40757L14651A88023J99094M1263j93164Q4606j34818J41272K23315j57433
13642C92158J88074B61823A16821L32966B3104N36186B71173n1831G3533K52945
13632C26478J12828j32328R5708L5824j03800a22555C74876j82948B5920M32960
13622D58880C6499J69363D7218L73763F5475N50450a9760I7730J3238M17795j49475
$$ y = [698774, 672251, 313725, 556497, 299276, 286694, 123202, 525520, 383632, 343193, 378258, 375809, 531854, 513256, 528806, 172304, 424699, 317717, 446693, 400611, 189923, 113725, 282711, 645789, 536698, 638201, 380629, -122838, 124441, 335048, 288206, 293729, 320162, 437186, 739945, 180180, 228868, 343880, 296033, 464854, 273947, 140757, 455408, 188023, 387117, 428380, 235216, 319822, 185004, 326276, 549591, 392158, 580232, 261823, 116821, 449787, 23104, 559290, 271173, 219342, 73533, 326478, 439306, 306978, 402686, 438510, 334710, -122555, 374876, 191928, 25920, 458880, 36499, 205862, 47218, 420981, 65475, 615925, -19760, 97730, 110968, 528763, 379288]
13611C79288A65964F7911L22384A50539R4727k2852A09410J46367F922L79433
13601C86355J01846F0851J22766K78037f0291A83954N6892o399N9592K5333J06316
13590D25688K5913j84596J9026E3793J81303N7238m6408J77314j5488A11205J12857
13579B24062q0113K97744j32120K24575B49538J38066J25686q8710j08343q2381
13569B33856O051L3720g738D96980J74118h2787D40242n5838o9709j14476f1178
13557A57102K15240q3397a3307A20793n167M6370K03512A78505J139J27363k0114
13546B86893K72688A50231m0883E030M26418A54652L50591b4600A99385q1817
13536A17568O0595l4048r812j1686J34694l2113H5773L22317j34200d3615D69074
$$ y = [379288, 165964, 67911, 390295, 150539, 245266, 222414, 109410, 255777, 6922, 386355, 488201, 60851, 183617, 461654, -60291, 183954, 240846, 234447, 294039, 319372, 425688, 451601, 267005, 286031, 53793, 235096, 292334, 245926, 423240, 407752, 111205, 224062, 143949, 441693, 309573, 534148, 249538, 387604, 513290, 424580, 316237, 233856, 239907, 273627, -7738, 496980, 671098, -82787, 440242, 384404, 314695, 200219, -61178, 157102, 372342, 288945, -13307, 120793, 115626, 161996, 365508, 178505, 179644, 307007, 286893, 559581, 150231, 109348, 5030, 431448, 154652, 505243, -24600, 199385, 117568, 178163, 144115, 134303, 122617, 257311, 225198, 85773, 408090, 273890, -43615, 469074]
13524A26883g0684E62381Q980B28227A10401L60339D3415A1250K67632K80753
13514E59635k31954J16110A09650J21496a35405B66759j01816A3402J64666K8299
13504B06367H0804J6889J60758E7389J14242C0086L49148d0180C0851K26897b3088
13492b187E02989B20493N1677J4657H9462K63649a10760C68939j16113J98379
13482D51205A5797L48220j77147a20694b1448I6329J38616J90494L1969I8013
13471C45772A47885C7840L00474F839Q239R6040e5220B65253b8662B57002l0926
13460B26076K51141G3969L79782a54685A16198K02159d378B08673L48449j36952
13450D20170A78986J31347O7711j37657L6413K73062k37167C6366Q3148K810N1759
$$ y = [126883, -70684, 562381, 571361, 228227, 110401, 470740, 43415, 11250, 278882, 559635, 327681, 443791, 109650, 231146, -135405, 266759, 164943, 13402, 178068, 206367, 80804, 97693, 258451, 57389, 171631, 30086, 379234, -40180, 30851, 257748, -23088, -2187, 502989, 220493, 272170, 286827, 89462, 353111, -110760, 368939, 252826, 451205, 15797, 364017, 186870, -120694, -21448, 96329, 234945, 425439, 457408, 98013, 345772, 147885, 37840, 338314, 6839, 15078, 111118, -55220, 265253, -28662, 257002, 226076, 477217, 73969, 453751, -154685, 116198, 318357, -4378, 208673, 557122, 420170, 178986, 310333, 378044, 240387, 276800, 549862, 312695, 36366, 119514, 122324, 174083]
13439A74083n5670L1151a7036j8413j4205D55329i5016B57969C1145e0424B6641
13427B81813j11240d3121J0285B93343K87747B32467K12243D1961a05054A3511
13416A68533a37836C57630G1331L1078R72L04280A07492f3021H9176M5732B685
13404I5219P6015D1455R9714C0215a70790B1726K1531Q659M94565j99995j45330
13393B01156R8263L476I8824i1210A9452M9443L826L742R1072l8077b1076D53321
13380D17645j77477a0290B96643A06389O3113j7689a99401P7224o6343C69162
13369a5577A11640D809J65911K71884A83404K8907m5313m3403b73223A95475k079
13358A93396K06117A66756K33637A12402k7596j0428L1442R3634J20606A11525
$$ y = [174083, 118413, 149564, -17036, -35449, -49654, 455329, -95016, 257969, 31145, -50424, 26641, 281813, 170573, -43121, -32836, 293343, 581090, 232467, 444710, 41961, -105054, 13511, 168533, -137836, 357630, 71331, 102409, 103381, 407661, 107492, -63021, 89176, 134908, 2685, 95219, 171234, 41455, 141169, 30215, -170790, 21726, 43257, 51916, 546481, 346486, 201156, 299419, 302895, 98824, -91210, 19452, 68895, 72721, 76463, 167535, 129458, -21076, 453321, 417645, 240168, -10290, 296643, 106389, 169502, 151813, -199401, -122177, -188520, 369162, -15577, 111640, 4809, 170720, 442604, 183404, 212311, 166998, 123595, -273223, 195475, 193396, 399513, 166756, 400393, 112402, 84806, 74378, 105820, 199454, 320060, 111525]
13347B40999P2795P7530a6725B54219D8519K49153F2478J00146F4335J04846K26178
13336C95359A39714c3245B02796m2467O4239m0473m783H8878I878L91068a62887
13324E4456J3604h8705A74322J78971m0432l5685J10187A45527K7551J5590R6894
13313B85562I8040J04248J19120a7394j4673E8872B113K20493G4326J04463K02691
13302C81480j47492d6024J8315A58961l4746f1747D72491b25835F0441a82329
13291g402B30382P6126H6173b07064D41219A69460J66056f9251n1003B05166q9959
13280A15207m3146b4018j93567f9385G9625a06577C69303a79036b1364B9619J32191
13269A61810p6208m4J30686P853b14910L133A37687a58592F854M0505K58390h531
$$ y = [240999, 313794, 391324, -16725, 254219, 48519, 297672, 62478, 162624, 64335, 169181, 395359, 139714, -33245, 202796, 160329, 224568, 184095, 179312, 88878, 9878, 400946, -162887, 54456, 68060, -88705, 174322, 353293, 312861, 277176, 387363, 145527, 173078, 188668, 285562, 98040, 202288, 321408, -17394, -32067, 58872, 2113, 222606, 74326, 178789, 381480, 233988, -46024, -27709, 158961, 124215, -61747, 472491, -225835, 60441, -182329, -7402, 230382, 306508, 86173, -207064, 441219, 169460, 335516, -69251, -120254, 205166, 115207, 72061, -24018, -217585, -69385, 79625, -106577, 369303, -179036, -21364, 29619, 161810, 85602, 85558, 216244, 224097, -214910, -211777, 137687, -158592, 6854, 47359, 305749, -8531]
13256a45753C8939a33915O5809E27458F097a15634F8717L0292Q2973I416O1527
13245G0943a91317B81262c62569B51217H9269a7807I2924N310a77728a9930R571
13234a0359E7211N1607m207h431B6711J80473j7457n1218c25686C9371a9378F8975
13221B31086p0412K00435j31511l1798O0725D6222a28230D22398B03658r87b00742
13209f8136j89960B0128b5798l0076g81j6121o7354q9354B83586j11088R0165
13198B62663J26610A52353N8734B7601a92671A13308i5514D53860G8629J60600
13188B39229p2293J92349A17752n0204K43665a19021A6876e3872a3259k70649
13178b83908B4902P3144a24131B4128i4283A118N9507a19336C65640j44402D2534
$$ y = [-145753, 38939, -133915, -68106, 527458, 6097, -115634, 68717, 99009, 181982, 9416, 70943, -191317, 281262, -362569, 251217, 89269, -17807, 92924, 98234, -177728, -19930, -10359, 57211, 108818, 104611, -8431, 26711, 207184, 189727, 138509, -325686, 39371, -19378, 68975, 231086, 160674, 361109, 229598, 197800, 258525, 46222, -128230, 422398, 203658, 202671, -200742, -68136, -258096, 20128, -25798, -55874, -781, -16902, -84256, -173610, 283586, 172498, 262663, 389273, 152353, 211087, 27601, -192671, 113308, -95514, 453860, 78629, 239229, 166936, 359285, 117752, 67548, 311213, -119021, 16876, -53872, -13259, -283908, 24902, 98046, -124131, 24128, -94283, 1118, 60625, -119336, 365640, 221238, 42534]
13166a83829A22353c8449j68697a7929m9206A74178f8573e265k9945A63213p6888
13155H6325e3217D3600b35143j2942A17062b21279d8599m0535a2877r9506D082
13143A13692a56886B58637j00191D5991K16292j13550j5446b10577B6984a45823
13132a26053F8402f4185a608A30719N6902K9945c01239D73544a47419D7955R0556
13121A38511E635N8886j2044J76576L5981j25152K20961a03063j11330A86868
13110d1506A57617R5387M1943B2602b2203k0618B25935d2617D5453M65312A87157
13098B13544a32405f2355C75118c6374a2949D586K06296E3918b09630A4425a9023
13086A29434b02818c1615B26098H2809l6629j1262a4909C1479L2998J45926i1105
$$ y = [-183829, 122353, -38449, -207146, -17929, -67135, 174178, -68573, -5265, -35210, 163213, 86325, -53217, 43600, -235143, -248085, 117062, -221279, -48599, -89134, -12877, -112383, 4082, 113692, -156886, 258637, 158446, 45991, 262283, 148733, 133287, -210577, 26984, -145823, -126053, 68402, -64185, -1608, 130719, 187621, 217566, -301239, 473544, -147419, 47955, 138511, 5635, 64521, 52477, 229053, 265034, 139882, 360843, -103063, -214393, 186868, -41506, 157617, 253004, 294947, 22602, -22203, -42821, 225935, -42617, 45453, 510765, 187157, 213544, -132405, -62355, 375118, -36374, -12949, 4586, 210882, 53918, -209630, 14425, -19023, 129434, -202818, -31615, 226098, 82809, 46180, 34918, -14909, 31479, 64477, 210403, -91105]
13074C2279J71456A00791B4653P3971G297b1394L338I7524N7196a07422C07042
13062B64437a03491l4105f4344j21095N8914A50390a3969n0987D06201A02911
13051e0398R759A72663g6395B6562a27211A08140K94159f0866B80775D1249K38662
13040B79911E0550a32943A49497b0352F1451F474f5493e168A32176l6956d8624
13028A51854N1640a76531C2498O5808D4235K66873A02358P6528f0566D7546a27761
13016E8949e0741k2683b554A32535a77600A9081J35675a17851B95311G1354d7953
13004I6476k2580J60424R9035f4968B46967J25816H9919J15167C9105c16888a2292
12992i3209O742B66937l5908o3296L33469d8897m14535O7233A16777b918B1238
$$ y = [32279, 203735, 100791, 24653, 98624, 7297, -21394, -18056, 97524, 154720, -107422, 307042, 264437, -103491, -137596, -64344, -185439, -126525, 150390, -13969, -64956, 406201, 102911, -50398, -40639, 172663, -76395, 26562, -127211, 108140, 402299, -60866, 280775, 41249, 279911, 50550, -132943, 149497, -20352, 61451, 6474, -65493, -5168, 132176, 95220, -48624, 151854, 203494, -176531, 32498, 98306, 44235, 311108, 102358, 178886, -60566, 47546, -127761, 58949, -50741, -73424, -2554, 132535, -177600, 19081, 154756, -117851, 295311, 71354, -47953, 96476, 73896, 234320, 333355, -64968, 246967, 372783, 89919, 205086, 39105, -316888, -12292, -93209, -86467, 266937, 231029, 167733, 501202, -48897, -463432, -396199, 116777, -2918, 21238]
12980D2988J51328L5597j9313k0783b1284A83719F6179K28416A44954E4642K66594
12969C21236F6404O5015M0068c1444F4709Q188a9007n5266A27348K03612A39984
12957B28498G0306a13037B60625b7690m7376l3423j87567J30804F854J21487a84991
12945b11258D8461l860a54994M5036k22885C12869B4346a5927A13333J65849b3543
12933b33491h1616I839h3159H8088a83A00656D4536K28644d5502A0681J31209
12922A41890b68939J22557C28946f3514k15596c1408A77767m4368m6633e0950
12911A93913d5265c367E1860J20367a42690B8264a62073r125f7255A28259a38444
12899g6385o9540H6206d1539j95020O5834A34689a16115k750B22747b01959F7245
$$ y = [42988, 194316, 229913, 210600, 189817, -21284, 183719, 66179, 294595, 144954, 54642, 321236, 66404, 131419, 171487, -31444, 64709, 72897, -19007, -74273, 127348, 330960, 139984, 228498, 70306, -113037, 260625, -27690, -75066, -108489, -296056, -165252, 6854, 128341, -184991, -211258, 48461, 44601, -154994, -109958, -332843, 312869, 24346, -15927, 113333, 279182, -23543, -233491, -81616, 9839, -83159, 88088, -183, 100656, 44536, 273180, -45502, 10681, 141890, -268939, -146382, 328946, -63514, -279110, -31408, 177767, 133399, 86766, -50950, 193913, -45265, -3367, 51860, 172227, -142690, 28264, -162073, -171198, -67255, 128259, -138444, -76385, -145925, 86206, -41539, -236559, -170725, 134689, -116115, -118865, 222747, -201959, 67245]
12887a43304j05210C26862A37633j8829D6402K06962a02078M1086i341k9565H014
12875a88845B15871c69040i9259d3834M395l008C30989g5044n56327A16118a47994
12863D0124a60098q0251E7580Q173A8363O2296d6550j01483N2904j7727A15910
12851a98381A03820J96106c66515a12390D1309K60502i3773j1142C1482Q898b07670
12839a0271j5862n1520B62c95154e2018B02484C4434R5812g5292k78212D8269
12827A33287b0911q999j48879j36553g9361K868m2490o1281a5212p419j092A93833
12814A30815K29220A61552c70819C0478J41588c0664A08515g719F8262i7025l2661
12803a29686j02623a05246C887Q5923J65700a11631C68359j03405B6567c15416
$$ y = [-143304, -248514, 326862, 137633, 118804, 46402, 253364, -102078, -60992, -9341, -38906, 8014, -188845, 215871, -369040, -99259, -43834, -39439, -42447, 330989, -75044, -631371, 116118, -147994, 40124, -160098, -240349, 57580, 65753, 18363, 80659, -46550, -148033, -95129, -112856, 115910, -198381, 103820, 299926, -366515, -112390, 41309, 301811, -93773, -104915, 31482, 40380, -207670, -10271, -26133, -77653, 262, -395154, -52018, 202484, 34434, 130246, -75292, -353504, 48269, 133287, -20911, -29910, -178789, -315342, -79361, -76493, -118983, -180264, -15212, -22631, -23723, 193833, 130815, 360035, 161552, -370819, 30478, 172066, -30664, 108515, -7719, 68262, -97025, -129686, -232309, -105246, 3887, 89810, 255510, -111631, 368359, 264954, 26567, -315416]
12792B32428b69422f1383B71818i4668D5612a2539o6907D30165I1366c7110j08727
12781a45837E0973P0587C9974a24168A48132B6223O3104J00402d1669j2819j83019
12770b37507b5779A3404g7801m3468j03913a519l3640B34653n8161J1266g124
12758G9038j9755Q1210F8680a20869j6500k59976a56295b7392j89336A56268b0229
12746C7111a81555f2008C37868g3792p7520c0682A59689a40111N0777L9030k52001
12735c02305A1676J8209b65563A25314Q7158n0895j4226a73691J6051A31147E2462
12723e685B78607A21038D2637a66003B24826g5896A87886f6810e67j42964b6243
12711h8893o626F4043M11128a4708k07609A44721c5044q9078O0357a393B52491
$$ y = [232428, -269422, -61383, 271818, -94668, 45612, -12539, -79446, 430165, 91366, -37110, -145837, 50973, 121560, 39974, -124168, 148132, 26223, 89327, 189729, -41669, -54488, -237507, -25779, 13404, -77801, -121269, -225182, -1519, -35159, 234653, 176492, 187758, -7124, 79038, 59283, 140493, 68680, -120869, -137369, -397345, -156295, -27392, -216728, 156268, -20229, 37111, -181555, -62008, 337868, -73792, -151312, -30682, 159689, -140111, -89334, -50304, -302305, 11676, 29885, -265563, 125314, 212472, 161577, 147351, -173691, -157640, 131147, 52462, -5685, 278607, 121038, 42637, -166003, 224826, -75896, 187886, -66810, -567, -143531, -26243, -88893, -95519, 64043, 475171, -14708, -222317, 144721, -35044, -124122, -63765, -1393, 252491]
12699e1471j52431P2624F1254b28645q290a6285A04663L353l913L18279A55685
12687d20633A22958g3002q7051g989A15325h955H3134L0802R5767c3145A21329
12675D92K96977a12734C0356j2506K37068a63097A21157d2409B04553H38L54019
12664C54857d005I4709a58311B97420B7382b684H7325N7572d0393a3477n8444
12653g1921A66198n9699m5311J31604c59344A26567C9571g7786B02241C3645g3245
12641B08101K1254J41881a78241e1981b0897A88415c2547D4690R1753b06262R2530
12630a13732K6105r7986d7801A15768n7624J12572k2771o641L4667l0431a75249
12618A87055l7158h0611c5935B48487h2346A01969A2117c9025A54501a30140B5796
$$ y = [-51471, -203902, -131278, 61254, -228645, -236935, -16285, 104663, 108016, 104103, 422382, 155685, -420633, 122958, -73002, -160053, -7989, 115325, -8955, 83134, 113936, 209703, -33145, 121329, 492, 297469, -112734, 30356, 17850, 254918, -163097, 121157, -42409, 204553, 838, 354857, -4005, 94709, -158311, 297420, 27382, -2684, 87325, 144897, -40393, -13477, -71921, 166198, 106499, 61188, 192792, -359344, 126567, 39571, -77786, 202241, 33645, -73245, 208101, 229355, 371236, -178241, -51981, -20897, 188415, -32547, 44690, 136443, -206262, -113732, -87627, -185613, -47801, 115768, 58144, 170716, 147945, 141304, 175971, 145540, -175249, 187055, 149897, -80611, -35935, 248487, -82346, 101969, 12117, -39025, 154501, -130140, 25796]
12606D1383J91908b51879A38938J89828I1019f6796b4598j38073m4006B9521K7601
12595E7122K98220I5334K1073a18760A17205A9554d4686I8725J38623K9933K36475
12584E03756C0655a4213j08581A34765K23225n0899e580H2026a5158l08920e2297
12572E2809d8250B58074j3198a46024B9066J50472G0466K69850D8732a47042j03100
12561b50142J23139d3705D1830J80818l6763g554A95022c866k5540k38274d2480
12549a03408D9143J7739B2754K8660e6061h064j47770c0658F3265b02172j39499
12538c41671J49078k7116j13625A07711C7918a92745L8123n1804M6890A6135K89095
12527C05230e4817B9729b7795D3530R0234m5347i4999d2803B03328H0751a80968
$$ y = [41383, 233291, -251879, 138938, 328766, 91019, -66796, -24598, -162671, -206677, 29521, 57122, 355342, 95334, 116407, -118760, 117205, 19554, -44686, 98725, 237348, 267281, 503756, 30655, -14213, -122794, 134765, 357990, 307091, -5580, 82026, -15158, -324078, -52297, 52809, -48250, 258074, 244876, -146024, 29066, 179538, 70466, 340316, 48732, -147042, -250142, -127003, -43705, 41830, 222648, 185885, -7554, 195022, -3866, -29406, -267680, -42480, -103408, 49143, 66882, 22754, 51414, -56061, -8064, -155834, -30658, 63265, -202172, -341671, -192593, -219709, -333334, 107711, 37918, -192745, -154622, -206426, -159536, 16135, 305230, -54817, 29729, -27795, 43530, 133764, 88417, -94999, -42803, 203328, 80751, -180968]
12515b66506R2054E4072Q2153J5085i5716K9769B19283D2555r168K8091a65927
12503b36880D6972J21714b68631M1139B67630M2638A39747k0312L0189a8626I012
12491A2420e0427A71751D8310J31836d46727D5489N6821c15102h3840A1504M8580
12480F0084J33212q0386b4526E4482J6759a30869q1410J5925f8802A03690b02332
12468g9995q0275L2375j74965a23348O140A27868b72116g7263h662I9894g5295
12456a04075A8182K17894b96541B1010J8082d7002A80365B5345d1479j38022D0664
12444i0275C2781a51241j02548j32782a91122j10685h4906r8341Q3399A83924
12433a75507H9112a94748c3375k25750a11767C1058K82257A53501o0784k3010
$$ y = [-266506, -174452, 54072, 136225, 151310, -95716, -65947, 219283, 42555, 33387, 61478, -165927, -236880, 46972, 168686, -268631, -227492, 267630, 310268, 139747, 119435, 149624, -18626, 9012, 12420, -50427, 171751, 48310, 180146, -446727, 45489, 102310, -315102, -83840, 11504, 60084, 193296, 112910, -24526, 54482, 71241, -130869, -212279, -196354, -68802, 103690, -202332, -79995, -160270, -127895, -302860, -123348, -117208, 127868, -272116, -77263, -8662, 99894, -75295, -104075, 18182, 236076, -296541, 21010, 39092, -47002, 180365, 25345, -41479, -179501, 40664, -90275, 32781, -151241, -253789, -386571, -191122, -301807, -84906, -183247, -99848, 183924, -175507, 89112, -194748, -33375, -259125, -111767, 31058, 313315, 153501, 92717, 69707]
12423F9707K24880C2261J5870a63166B70681G0368J01410F0726K3062J21975c839
12411A39365E8322Q1804D933h8983F4029M755a2741p8526k08147a06618G4693
12399D3552b79466a32634A36643Q6602d16591C6463N2782e7591n0255k1430A31950
12387d11586J53506A44911n4654H20J26186C5840h4464A39569M4386g6977A397
12375b59242O6161F5056a5150A3587b18609A38213l1665b1494A39442a50487B21267
12363A82394A0815J16754M2368F2723b7685B65333L9380i7757C56200A4859i8183
12351A30074a25886j26853C55775F499J66198a76366A76742Q1352d7960k5202
12341g3162p9374K3822j96023l5980A4386P5311a22868l89447a0631A4061J06344
$$ y = [69707, 294587, 32261, 48131, -163166, 270681, 70368, 171778, 60726, 83788, 205763, -3839, 139365, 58322, 140126, 4933, -88983, 64029, 68784, -12741, -91267, -299414, -106618, 74693, 43552, -279466, -132634, 136643, 223245, -416591, 36463, 89245, -57591, -107846, -129276, 131950, -411586, -258080, 144911, 90257, 820, 127006, 35840, -84464, 139569, 183955, -76977, 1397, -259242, -193081, 65056, -15150, 13587, -218609, 138213, 106548, -21494, 139442, -150487, 221267, 182394, 10815, 127569, 169937, 62723, -27685, 265333, 304713, -97757, 356200, 14859, -98183, 130074, -125886, -252739, 355775, 6499, 172697, -176366, 176742, 258094, -47960, -73162, -152536, -128714, -324737, -360717, 14386, 89697, -122868, -512315, -10631, 14061, 120405]
12330A20405d4486A39131L273C1759a20713j18531H9071c13531A5313L4952a56233
12318E335Q1302J39781F239N2291h1579B71066j33718O9473J44589A74504P9849
12307B54353r1303a63195A49967j4310L8260e5250m6072D31790i635C2859P2920
12296A05779A690a2024F2364b050B4854P1117a20328A26284J05642E2693J31827
12285A84520c1476A74935D9830K07735b00489Q2302A58019p2655C6105Q5153I086
12273B59636p4531k770M2952a67337A15488a63166B97977A20108J32425a29830
12262A97960c10186a1449C1568j5226b51653C59287j33451N0536p581K92235H0237
12250C94745b6999B25970G9622N8820K13135j08175G3978J46467p9388K71561
$$ y = [120405, -44486, 139131, 142404, 31759, -120713, -239244, 89071, -313531, 15313, 50265, -156233, 5335, 86637, 226418, 6239, 58530, -81579, 271066, 137348, 206821, 351410, 174504, 254353, 163050, -163195, 149967, 135657, 173917, -55250, -101322, 431790, -9635, 32859, 105779, 1690, -12024, 62364, -2050, 24854, 95971, -120328, 126284, 231926, 52693, 184520, -31476, 174935, 49830, 257565, -200489, -118187, 158019, 85364, 36105, 121258, 9086, 259636, 185105, 182335, 225287, -167337, 115488, -163166, 297977, 120108, 252533, -129830, 197960, -310186, -11449, 31568, 16342, -251653, 359287, 225836, 276372, 268791, 561026, 80237, 394745, -26999, 225970, 79622, 138442, 351577, 243402, 73978, 220445, 141057, 412618]
12240D12618q3762p0783J65358A9306K45518J6784G8561K21509p9777b2422B79878
12228A45591D9488K4284J87690E3078a556m1466A83149N1132l3513p9114j8035
12217A03619a0477B35307A516g342C52807H8086J38763k1800L6385j16395M14620
12206E39659G6036J37162n2943R7493N2404G2489K51671H9637N5089e1809A49702
12194H4834J52172B0121L25521e5936A10067J95949A44528O3959o5528J24309
12184B67268B8035h8168L7493l6147I6012C5485R897A2854M8433J52712J16393
12173C30392j28097a11172o8388B71974b8403B57758a02464C13092C050g2439
12162D9546p045N3160L36527H0928J40707q9180K37097A01427K86638f6196D27664
$$ y = [412618, 328856, 258073, 423431, 19306, 264824, 281608, 78561, 300070, 220293, -22422, 279878, 145591, 49488, 73772, 261462, 53078, -1556, -43022, 183149, 234281, 200768, 121654, 103619, -10477, 235307, 1516, -7342, 352807, 88086, 226849, 205049, 241434, 125039, 539659, 76036, 213198, 160255, 257748, 310152, 72489, 324160, 89637, 144726, -51809, 149702, 84834, 237006, 20121, 345642, -55936, 110067, 306016, 144528, 208487, 142959, 267268, 28035, -88168, -50675, -86822, 96012, 35485, 45382, 12854, 61287, 213999, 330392, 202295, -111172, -179560, 271974, -28403, 257758, -102464, 313092, 3050, -72439, 49546, 42501, 95661, 432188, 80928, 221635, 132455, 369552, 101427, 388065, -66196, 427664]
12150a56660g8134B30265K4493a28571j23538Q7169c0580A81714J13131a12434
12139a76048I5132J14237D9681b13503E6668L0775a88835E3964a31713A75474
12128c61391A61853J04762i2917I8143a3167H2763m0897p541J42847a28559o8649
12117a97208e6602F5190P4878m4767l9643J74254m1865c63861a55031M3009A78966
12105a53356a7358A16305R4520c9988B52700A4258R7451R5653N7179n1901q5984
12094A26656M7397O7757f4876m1411c5508F6992p633a7907D29112A76524B1296
12082A51260C6306N07056A11175M8858n7097a23602N7964m9021I0301O6501J29884
12071B86686J7755j19526j1016f827A48863g6568B13825K04953A7504J08507f2482
$$ y = [-156660, -78134, 230265, 254758, -128571, -252109, -164940, -30580, 181714, 294845, -112434, -176048, 95132, 209369, 49681, -213503, 56668, 87443, -188835, 53964, -131713, 175474, -361391, 161853, 266615, -92917, 98143, -13167, 82763, 41866, 34325, 177172, -128559, -197208, -56602, 65190, 140068, 95301, 55658, 229912, 188047, -363861, -155031, -112022, 178966, -153356, -17358, 116305, 210825, -39988, 252700, 14258, 111709, 207362, 264541, 212640, 126656, 174053, 241810, -64876, -106287, -35508, 66992, 59359, -17907, 429112, 176524, 21296, 151260, 36306, 543362, 111175, 160033, 102936, -123602, -65638, -114659, 90301, 156802, 286686, 304441, 184915, 173899, -6827, 148863, -76568, 213825, 418778, 17504, 126011, -62482]
12059F4409h80A00488L22426A74361A0770J19096g2953n3721C03023p6596j07415
12048A19012j9597a94453B65140K6534P9247e5900C7648E49J90253j0711B3569
12036A35203j7496D8106J920a06279k71409A78809a17550j97542G0886j921N9804
12025A28769a11476G7466b8178C27531A39437K7770a53310M7979F4321a03759
12014c4688B06047m0300c8099B56795p2217H9618b4416Q09C03560j22671E3274
12002D73678B32679A10261g654A24469d0815k9129a5540E2651D817J23033Q2298
11991B10148A812K48736h1571G9916C4122a96427f5369a267j42210C1883N1694
11980H3577b6839A87168q3504K5108i1362B12565c9062B7780N9871j5305L5833
$$ y = [64409, -880, 100488, 422914, 174361, 10770, 129866, -72953, -126674, 303023, 226427, 119012, 99415, -194453, 265140, 291674, 370921, -55900, 37648, 549, 190802, 180091, 23569, 135203, 117707, 48106, 50026, -106279, -377688, 178809, -117550, -315092, 70886, 68965, 128769, -111476, 77466, -28178, 327531, 139437, 167207, -153310, -105331, 64321, -103759, -34688, 206047, 165747, -38099, 256795, 184578, 89618, -24416, -23607, 303560, 180889, 53274, 473678, 232679, 110261, -7654, 124469, -40815, -69944, -15540, 52651, 4817, 127850, 210148, 1812, 250548, -81571, 79916, 34122, -196427, -65369, -1267, -143477, 31883, 83577, -26839, 187168, 103664, 128772, -91362, 212565, -39062, 27780, 87651, 72346, 108179]
11969A08179c92909A36056a86628M6564q8719A42712a97398A64738K31373a07301
11958b12333h3556E4119c102l46422b9462H5758b78636h0651k39203J24673c4179
11946a5037j8401j15118k4053J9640A4526L95032G4412i6324C1085c9000A99108
11934A0220M5191A2325O681a94562D5764J0924a66087m0665B6013J19991B0988
11922a93095B77505A32505b52661O4668J4993e8473k1060C8687B747R6731n401
11911I4077A0889a37385A16392b44537a6650E9300M6512h6077K436J6372A16807
11899c1193k15459l1593B05927k9374g8695A86695a06200l7923E5419K24120H5865
11887B24447f2294l11297D8969F293L93688a80425Q3564A62192c48179J45035
$$ y = [108179, -392909, 136056, -186628, -140064, -228783, 142712, -197398, 164738, 396111, -107301, -212333, -83556, 54119, -3102, -349524, -29462, 85758, -278636, -80651, -319854, -195181, -34179, -15037, -33438, -148556, -172609, -152969, 14526, 409558, 74412, -96324, 31085, -39000, 199108, 10220, 55411, 12325, 19006, -194562, 45764, 56688, -166087, -206752, 26013, 146004, 20988, -193095, 277505, 132505, -252661, -187993, -173000, -58473, -79533, 38687, 2747, 99478, 94077, 10889, -137385, 116392, -244537, -16650, 59300, 105812, -86077, -83641, -67269, 116807, -31193, -246652, -278245, 205927, 176553, -78695, 186695, -106200, -144123, 55419, 279539, 85865, 224447, -62294, -373591, 48969, 6293, 399981, -180425, -96861, 162192, -348179, -203144]
11877b03144g3651l96589A42726E8430b94866J34226o472k52080a00447A55897
11866G7117b66026j220A7974h3677A91688i0700n9399c8846p0050A05589c22541
11854G8787j3652f8840j79273C05385b37388l0675a10027K1393p032B8012q72
11843B7140g943j38947A10488K3926c10969A53295a91113k672O7755r9119F4973
11831b56276F7939Q9139d8679K1128o0429A86516a28920O4163l39514i3245m3147
11820a36392A36537d12609G073a56536G0407b5363B9958a25788C76535a61497
11809I6220c19788A45262a4473C22464e2091D6265d56285I4073M0203h1290b8694
11797g4832q3249A47436a10861I2767h4054a0820B24204a39224k52533g0656A70910
$$ y = [-203144, -73651, -470240, 142726, 58430, -294866, -160640, -167112, -419192, -100447, 155897, 77117, -266026, -267246, 17974, -83677, 191688, -90700, -150099, -38846, -108896, 105589, -322541, 78787, 65135, -68840, -248113, 305385, -237388, -268063, -110027, -88634, -95666, 28012, 27140, -7943, -146890, 110488, 134414, -310969, 153295, -191113, -193785, -126030, -225149, 64973, -256276, 67939, 157078, -48679, -27551, -87980, 186516, -128920, -64757, -404271, -93245, -136392, 136537, -412609, 7073, -156536, 70407, -25363, 29958, -125788, 376535, -161497, 96220, -319788, 145262, -14473, 322464, -52091, 46265, -456285, 94073, 134276, -81290, -28694, -74832, -158081, 147436, -110861, 92767, -84054, -10820, 224204, -139224, -391757, -70656, 170910]
11785A28044m2155a16170D6449c14448f7798I8778b01180o7961A0434P9325P1738
11774A61497d6692D9777a78923k3503J00314b2735o1912L4487m8507A79188g0270
11762B8908A4336a5454l72877G5921c37057b3700c471D61g5954B7512a3169A43355
11749a87151B41695a84423Q0631I7010a10129L9891A28133a40937G8063O3825
11739A41888d5698A06215l4030j8554N6793K53658a78232A3328d6807A71540m9676
11728A21864o603c03726K6957B82068I3069c9486A93577d14152A3838M8581k167
11717F0252K7127g7569G0679L5106a29493c8638L264q6855M5555C04620c5933
11705h1091a0005j51515B7922J20553K0832a90944O4402b4629B04058c79793J42516
$$ y = [128044, 85889, -116170, 46449, -314448, -67798, 98778, -201180, -269141, 10434, 89759, 161497, -46692, 49777, -178923, -202426, -102112, -22735, -84647, -50160, -98667, 179188, -70270, 28908, 14336, -15454, -388331, 75921, -337057, -23700, -3471, 461, -75954, 27512, -13169, 143355, -187151, 241695, -184423, -103792, 97010, -110129, -70238, 128133, -140937, 78063, 141888, -45698, 106215, 72185, 53631, 110424, 364082, -178232, 13328, -46807, 171540, 121864, 115261, -303726, -276769, 282068, 93069, -39486, 193577, -414152, 13838, 62419, 60252, 87379, -77569, 70679, 105785, -129493, -38638, -35374, -122229, -76674, 304620, -35933, -81091, -10005, -161520, 27922, 148475, 169307, -190944, -126542, -24629, 204058, -379793, -237277]
11694b37277A23902D8115P1432a56513F7749O0934a70549H1707f6867A61752a00392
11682D15524a12463A99898g1138C71961A82710d95770J05755A79483a06866A32132
11671B2135K0287J70598a01947D936M3244J02463J04955A2835P3418b1133A61209
11659I9766m2065L16120j84244d3668A85038L4710b62788j178b5126k40235J04515
11648a60846q8690c5888k48669i9266M2650B08001L9212h9922k60866J21957O7874
11637a60957n5365A14994a3768r4123c673m3313k23588c4173j43566E8822b03835
11625A15652B2447J2979b17394j7375P2587A96721c14735B00153c9588B30471
11614h1574A61228h2000B00032D5913J81933a04972B37152b5119m498G6072k0591
$$ y = [-237277, 123902, 48115, 119547, -156513, 67749, 128683, -170549, 81707, -66867, 161752, -100392, 415524, -112463, 199898, -71138, 371961, 182710, -495770, -390015, 179483, -106866, 132132, 22135, 42422, 213020, -101947, 4936, 48180, 150643, 255598, 12835, 86253, -21133, 161209, 99766, 57701, 373821, 189577, -43668, 185038, 219748, -262788, -263966, -25126, -265361, -160846, -249536, -35888, -284557, -99266, -56616, 208001, 247213, -89922, -350788, -228831, -160957, -216322, 114994, -13768, -107891, -3673, -46986, -270574, -34173, -177739, 58822, -203835, 115652, 22447, 35426, -217394, -234769, -162182, 196721, -314735, 200153, -39588, 230471, -81574, 161228, -82000, 200032, 45913, 227846, -104972, 237152, -25119, -29617, 76072, 55481]
11603E5481b8140C32201C1854N0437J98103j21006C7414a49936C44927j38962
11593B05965k9164a56304B19957a41445q9317g2618j26447p9395H7094C230a35578
11581d6650A23205J63585j43316K094o3781J22217e8321j29013C493J7660F432
11569B15c5693F3985M9595g8262B93584a56582H9073j3694K87840b39844B94216
11557F0161j7483J22867k578n4071a41617q7397m8631i1993j70603f651A60589
11545a01304d3998A96188a34788A21383a45019A48931k8583b9792D7882b07358
11534A4868J8154Q6842B9199J5466J45799n1974J67859A23693N3612a43508M3887
11523i9621I8073b04526F5857i2760G7138J06040c55230I5919b29620B5343J01172
$$ y = [55481, -28140, 332201, 31854, 82291, 280394, 159388, 37414, -149936, 344927, 205965, 176801, -156304, 219957, -141445, -230762, -72618, -199065, -278460, 87094, 3230, -135578, -46650, 123205, 286790, 143474, 145568, 81787, 204004, -58321, -187334, 3493, 21153, 6432, 215, -35693, 63985, 113580, -78262, 293584, -156582, 89073, 75379, 363219, -239844, 294216, 60161, 42678, 165545, 162967, 108896, -141617, -229014, -277645, -91993, -262596, -6651, 160589, -101304, -43998, 196188, -134788, 121383, -145019, 148931, 120348, -29792, 47882, -207358, 14868, 33022, 119864, 29199, 44665, 190464, 138490, 306349, 123693, 177305, -143508, -99621, 98073, -204526, 65857, -92760, 77138, 183178, -355230, 95919, -229620, 25343, 126515]
11512A26515A7810M1433a49934c5669A03586b0423A07586D4732p384a65468j1555
11501a77023Q6938B53460G1661J55998c8369g260o5000B01063E1174K68370A1603
11489A21319a29412M6005J4287B25786b6033l3777j17274e290j05121B20249o8248
11478A52001c3181l3909C96089a66060A92812n1917d4936k6611B28098A06210
11467I3849J60302j01324a6223j1159c685B58073J34391D2877K05764l2200H2424
11455d8224C03515a37351A31335a01574A29219j0149A9223f3677C04573F7878
11444B77695i26m846F0051O6411a53890n485B26370c4008j26878H3592f337F8624
11431A08830D9333a16829m4320C08962a51216M8214b1060l4198B42979B8503b31183
$$ y = [126515, 17810, 59243, -149934, -35669, 103586, -20423, 107586, 44732, 37348, -165468, -177023, -90085, 253460, 71661, 227659, -38369, -7260, -72260, 201063, 51174, 319544, 11603, 121319, -129412, -83407, -69120, 225786, -26033, -59810, -177084, -5290, -110411, 220249, 152001, -33181, -67090, 396089, -166060, 192812, 140895, -44936, -71547, 228098, 106210, 93849, 254151, 152827, -16223, -27382, -3685, 258073, 392464, 42877, 248641, 216441, 82424, -48224, 303515, -137351, 131335, -101574, 129219, 119070, 19223, -63677, 304573, 67878, 277695, -926, -5772, 60051, 126462, -153890, -159375, 226370, -34008, -160886, 83592, -6337, 68624, 108830, 49333, -116829, -161149, 308962, -151216, -103002, -21060, -55258, 242979, 28503, -231183]
11419I1450h9245A17288J7449a50623h247C58289A2572c3605A78020c0471C5064
11407B19737B3435g0622c1111A54423e3609n8802A21318c5626A42544F7527h9708
11395a18534K8593C45940l4565a14809k9505j38709A98548e7840j46425A45354
11384f5582j30973Q7921b5935j69336E153J33299J34159F5630O5546b2772E0073
11372C730a30314k78709A17044a12717j04689A27321b21501j4002N6993D47471
11361I0723R7065a4165A04214b3435j50259Q3967B1808L12020D428L9168f4421
11349a24653A83563b03061n2281E30546j27103b51735A27030a90683e4396n9286
11339a13682j48993J8089j36336a88513J6313o4131a11484L5051j05715k78339
$$ y = [91450, -89245, 117288, 134737, -150623, -8247, 358289, 12572, -33605, 178020, -30471, 35064, 219737, 23435, -70622, -31111, 154423, -53609, -112411, 121318, -35626, 142544, 67527, -89708, -118534, -89941, 345940, 311375, -114809, -144314, -283023, 198548, -57840, -204265, 145354, -65582, -196555, -108634, -25935, -195271, 5153, 138452, 272611, 65630, 131176, -22772, 50073, 3730, -130314, -409023, 117044, -112717, -217406, 127321, -221501, -235503, -178510, 447471, 90723, 187788, -14165, 104214, -23435, -173694, -89727, 21808, 333828, 4428, 43596, -64421, -124653, 183563, -203061, -255342, 530546, 403443, -251735, 127030, -190683, -54396, -113682, -262675, -244586, -380922, -188513, -172200, -236331, -111484, -76433, -182148, -460487]
11329d60487a09416J9031j64283A76014g1310B86863C8041J3803b07883P6198
11319a31685L1694p6077A07186j4223d771j74252M7716f1545j95423d6534a8642
11307c7825k07948c6599j42701A5728J92552d07576A17946c60242h7831L4748
11297e3083l29802c6419p1242C9074J4876b923j42478d8346E8221J80371i183
11285h062b129j61490l1830D3665d2338j15905j03176a9785l6458A89255F4401
11273a76751A72534d45089H1167A1608a26797A94037b88478R8961e0226j032l9026
11262i0284j14468A39695a78785A34798b75966a10520j25601J04980C01556g8793
11251a27846A80778b28352A61867K0339B0585a92249l3220a7207G5545j5078a04732
$$ y = [-460487, -109416, -90385, -254668, 176014, -71310, 286863, 38041, 51844, -207883, -131685, -99991, -176068, 107186, 92963, -4771, -179023, -131307, -61545, -256968, -46534, -18642, -37825, -245773, -36599, -179300, 15728, 208280, -407576, 117946, -360242, -87831, -53083, -382885, -36419, -107661, 39074, 53950, -2923, -145401, -48346, 58221, 238592, -9183, -8062, -2129, -163619, -195449, 43665, -42338, -158243, -261419, -19785, -56243, 189255, 64401, -176751, 172534, -445089, 81167, 11608, -126797, 194037, -288478, -189517, -50226, -51258, -90284, -204752, 139695, -178785, 134798, -275966, -110520, -236121, -131141, 301556, -78793, -127846, 180778, -228352, 161867, 182206, 20585, -192249, -225469, -17207, 75545, 60467, -104732]
11239b43347B60458b72155B53062c0800B16085L4743b17823l8352C00183c00265
11228a49471C4847h2109r1895D544a60728k4679a6791H7896d56073A14444l4965
11217G9479k9441L23839j73496I6600D7726J97286a1j4827B0688a92839g9558
11205B39562a06191c028I4995B8957K9378J44010J72629b2546k07406A85558H1143
11193b26881I2477a60685c0510k16860P8074L447a1315j4114B6156a27287L2179
11182i5108K6611j43237j0193a2422B65345a13436H9306b68693B0066K4359J59813
11171B04238a97110A76890A1846a18619I1475K7100d1698m00885K17386F6116
11160b60491F1793a32366d4957B24615a34656B25537l520g0747A43623m0101A5347
$$ y = [-243347, 260458, -272155, 253062, -30800, 216085, 250828, -217823, -256175, 300183, -300265, -149471, 34847, -82109, -174004, 4544, -160728, -185407, -16791, 87896, -456073, 114444, 79479, 50038, 373877, 200381, 96600, 47726, 245012, -11, -14838, 20688, -192839, -79558, 239562, -106191, -3028, 94995, 28957, 58335, 202345, 374974, -22546, -229952, 185558, 81143, -226881, 92477, -160685, -30510, -247370, -169296, -165849, -11315, -25429, 26156, -127287, -95108, -68497, -211734, -221927, -12422, 265345, -113436, 89306, -268693, 20066, 44425, 204238, -197110, 176890, 11846, -118619, 91475, 118575, -41698, -442583, -225197, 66116, -260491, 61793, -132366, -44957, 224615, -134656, 225537, 222017, -70747, 143623, 103522, 15347]
11148C5431b20853a2794o2562j17600e7830B5977g5875A67252p0424C119a12479
11136A15991d88030e2712K756l45559B05634c225j57525H2234h3009F8964A2815
11124A23963a71978m10284a43663I2475a65045J7244C3602a95468D5355L10952
11114C56307A55534a73135d8265A3225J14394a44516A14695N5441p7509d040j47405
11103a51445C0384d7140A45085K29035A38999a75n9314A69212c49520a5967C7987
11091A07428i2589c1290i138A67382i3280B38347A3519M29516A87858L7554e3697
11079B62871b90828A15972c2794C82871j60328n9802C0919d7358F5108f3850B78288
11067A56464o9776M0040d7200B75998K13049G1192r425h9752B55472K513m7404
$$ y = [35431, -220853, -12794, -75356, -192956, -57830, 25977, -75875, 167252, 96828, 3119, -112479, 115991, -488030, -52712, -49956, -395515, 205634, -3225, -160750, 82234, -83009, 68964, 12815, 123963, -171978, -582262, -143663, 92475, -165045, -147801, 33602, -195468, 45355, 356307, 155534, -173135, -48265, 13225, 127619, -144516, 114695, 170136, 92627, -4040, -151445, 30384, -47140, 145085, 374120, 138999, -175, -59489, 169212, -349520, -15967, 37987, 107428, -92589, -31290, -9138, 167382, -93280, 238347, 13519, 443035, 187858, 225412, -53697, 262871, -290828, 115972, -32794, 382871, 222543, 162741, 30919, -47358, 65108, -63850, 278288, 156464, 86688, 126728, -47200, 275998, 489047, 71192, 61767, -89752, 255472, 257985, 210581]
11056B10581C5644d3502B00066L7056K66106L8492B47059A21588a04808B82225
11045g9910B63423J55567A81110M44262E6103L98502K4730j66972L66210n6124
11035F22449A64213L50285J57671j31618j24908K75908j91112j68705J47960j08548
11025C71146L57425p2299L702j51482k06958k9811J64394j73075J23634J5714
11015D02390m2616j19272N04062k07051A42167L83746l1678K588A58665L79810
11005E38475K8054B22782L15278j17030J84570k01731J13226B48444J70101K35035
10995F53580k58720J6336K63063B69741N42612k53846k54609K02459j33817j09878
10985B62662k3591M46062k09576j98133O6691L04402m6234J70385C76631Q8833
$$ y = [210581, 35644, -43502, 200066, 237122, 503228, 541720, 247059, 121588, -104808, 282225, -79910, 263423, 418990, 181110, 625372, 56103, 454605, 479335, 312363, 678573, 622449, 164213, 514498, 672169, 540551, 415643, 691551, 500439, 331734, 479694, 371146, 728571, 656272, 659974, 508492, 301534, 271723, 436117, 263042, 386676, 402390, 359774, 240502, 744564, 537513, 142167, 525913, 494235, 496823, 158665, 538475, 566529, 222782, 538060, 421030, 605600, 403869, 517095, 248444, 418545, 653580, 394860, 411196, 674259, 269741, 812353, 558507, 303898, 506357, 372540, 262662, 239071, 685133, 475557, 277424, 344115, 648517, 602283, 772668, 376631, 465464]
10975D65464r2363K87738k80113O1052k18410M79722J3410j33942J79053k11983
10965E49628J54074j21829K07571O5320O5810k1622Q1581j16199M47324L75122
10955A686780j88461j3552J65297j24679K5201m5648K05505J71312o69737r4167
10945A117851R0544K31345n06907L30268p9313M65811j55009j18885N9477j37897
10935A297285j24296L03595m31894k20153j6598j57233k52325J0829O8939k03772
10925B74377a8553B37529A01123M510R0115L4495E3110a34320B42130a33647E2237
10913B81765A28249G259M33676b00669e1625I637c46234g772A88418g2384r5972
10902a68356G8704Q6384A5856b9136m8801G3229b40127E1638a84519Q1297n9795
$$ y = [465464, 373101, 660839, 380726, 441778, 223368, 703090, 716500, 582558, 761611, 549628, 703702, 581873, 789444, 854764, 920574, 898952, 980533, 864334, 1311658, 1686780, 1498319, 1484767, 1650064, 1525385, 1550586, 1504938, 1710443, 1881755, 1212018, 1117851, 1208395, 1439740, 932833, 1263101, 1183788, 1649599, 1494590, 1375705, 1435182, 1297285, 1172989, 1476584, 1044690, 824537, 807939, 650706, 398381, 409210, 478149, 274377, -18553, 237529, 101123, 105633, 195748, 230243, 53110, -134320, 242130, -133647, 52237, 281765, 128249, 7259, 440935, -200669, -51625, 9637, -346234, -7772, 188418, -72384, -168356, 78704, 165088, 15856, -29136, -77937, 73229, -240127, 51638, -184519, -103222, -163017]
10891a63017A92919R2442a18248k2206b1081q6829M2782A29506K802a75315g2064
10879a27191c210A23618a93761c3987B00697I5865e1824C35811F3416M8175b76069
10867A04104j8858a48189G5493b4723l19082a02232b4331D0111e0323A04411b12516
10855a63095E0082a28899b29k48224a21745q9292c6063l2630p6365f6773C47416
10843a47037e4485M611A65815j8098b48225B34795l1865d5678E3648b68947b9182
10831B04191d5878j23804f5520A58590d44077e1230j92082N9187a2234k7192A13806
10819A84132g4969B25285j03151l1499M3374D4175J37894d9233q8325J6017A76831
10807a37872B10117b80924J15686f2436k82150P0429j22112a81625A80950J30406
$$ y = [-163017, 192919, 285361, -118248, -140454, -21081, -107910, -65128, 129506, 132308, -175315, -72064, -127191, -3210, 123618, -193761, -33987, 200697, 95865, -51824, 335811, 63416, 111591, -276069, 104104, 85246, -148189, 75493, -24723, -343805, -102232, -24331, 40111, -50323, 104411, -212516, -163095, 50082, -128899, -229, -248453, -121745, -211037, -36063, -68693, -145058, -66773, 347416, -147037, -54485, -49874, 165815, 147717, -248225, 234795, 202930, -45678, 53648, -268947, -29182, 204191, -45878, -169682, -65520, 158590, -444077, -51230, -243312, -184125, -12234, -39426, 113806, 184132, -74969, 225285, 122134, 90635, 134009, 44175, 182069, -49233, -137558, -121541, 176831, -137872, 210117, -280924, -165238, -62436, -344586, -274157, -396269, -181625, 180950, 311356]
10797C11356l1851a41968C76638A19669i5926B26564a09432k7419C6374J5079
10787E1453f0679m663B08197D5833b79448E4223b43357A18923D0407c07131D3301
10775b27836N9291N9484A34327D1017d18481b5439F9842g8988q5250H8740a2859
10763d2585G8810a67759N3123j67256F1847g5802A3934b18637C0380a47353A95296
10751a9400p2200B27709C6059b21724D0887a81054j18877A80635b2403j82777
10741b05180C7556J36722l0870a39124E0905a78580J3799d0120A5474g048j00265
10730a07313i728A05815B0466a80131I8582a92427Q3572d5296m0917D11959m2739
10719C69220b86185J30249d8212b0292j10114A0288f464k07589l7624a05567B09101
$$ y = [311356, 279505, -141968, 376638, 119669, -95926, 226564, -109432, -136851, 36374, 51453, -60679, -65342, 208197, 45833, -279448, 54223, -243357, 118923, 40407, -307131, 43301, -227836, -168545, -109061, 134327, 41017, -418481, -25439, 69842, -78988, -164238, 88740, -12859, -42585, 78810, -167759, -114636, -281892, 61847, -75802, 13934, -218637, 30380, -147353, 195296, -19400, -91600, 227709, 36059, -221724, 40887, -181054, -299931, 180635, -22403, -205180, 37556, 174278, 143408, -139124, 50905, -178580, -164781, -40120, 15474, -7048, -107313, -9728, 105815, 20466, -180131, 98582, -192427, -108855, -45296, -86213, 411959, 369220, -286185, -155936, -48212, -20292, -130406, 10288, -6464, -214053, -251677, -105567, 209101]
10707f9051A02345a30888c6485C34251D0745d63125I341e3775D38947a50138a7803
10695a3927n00962b1051A39562c22531d7648k3449I4798e8765k8310l3464o52
10684a21191B49500I250b57177M0154d1614j00562J5614j65556R8229m0034g1958
10672A57101J9276g3303j14271j8074i6353N7q5166O6272N472B22411c2177Q628
10660b3549A02328a05700n3530j49943A99114a22370q9785a7928n6702A44724
10649h3007j42986A1422K67034H0723b92290J14907H919d45813B7255a24088m1429
10638a65517c7182I9461a63275N4706J5141R405J7438j69055f2528j27318M0086
10627a49760j798O1669H0141a69585k4691E02774B4107J08042b00914F6434L0497
$$ y = [-69051, 102345, -130888, -36485, 334251, 40745, -463125, 9341, -53775, 438947, -150138, -17803, -13927, -514889, -21051, 139562, -322531, -47648, -71097, 94798, -58765, -87075, -120539, -121191, 249500, 9250, -257177, -217023, -41614, -142176, -126562, -292118, -193889, -233923, -71958, 157101, 176377, -73303, -187574, -205648, -96353, -96296, -181462, -115190, -109718, 222411, -32177, -23549, 102328, -105700, -159230, -309173, 199114, -122370, -212155, -17928, -74630, 144724, -83007, -225993, 11422, 278456, 80723, -292290, -177383, 8919, -445813, 27255, -124088, -165517, -37182, 99461, -163275, -108569, -93428, -84023, -66585, -235640, -62528, -189846, -149760, -151558, -89889, 80141, -169585, -194276, 502774, 24107, 132149, -200914, 66434, 96931]
10616I6931p089A3954a62554E9845h3506r7835k035g037l8796G6978a00452D3878
10603d7518k05725J9602r5941a53358j45329H0209A0147J30147N106b65903j22298
10592c88201k635D8775a2407A409K6434L22447A5658a41976j25075B68268a41770
10580D6836J4868b72066I4214h2517n7617d6977m85766b53669b3572F342J8890
10569B5232K4876c12242K8563h6968n9792N7202A17080g3243l13189a60062N1902
10558a08160j16162A54299c9807o1252b1292j08954A03318J02128k6523C7464
10547i7563D4219i9889A42138a82264f6405I2809a99826n5295A18256R937J3152
10536A41345b01342K2940B41410r376H1348a71472A99015a72145G4227f2049j04205
$$ y = [96931, 89842, 13954, -162554, 59845, -83506, -181341, -183376, -7037, -45833, 76978, -100452, 43878, -47518, -253243, -233641, -329582, -153358, -298687, 80209, 10147, 140294, 145400, -265903, -388201, -390836, 48775, -12407, 1409, 27843, 350290, 15658, -141976, -267051, 268268, -141770, 46836, 61704, -272066, 94214, -82517, -140134, -46977, -532743, -253669, -23572, 6342, 25232, 50108, -312242, -283679, -86968, -146760, -89558, 117080, -73243, -386432, -160062, -108160, -224322, 154299, -39807, -101059, -21292, -130246, 103318, 205446, 178923, 37464, -97563, 44219, -99889, 142138, -182264, -66405, 92809, -199826, -255121, 118256, 128193, 141345, -201342, -178402, 241410, 232034, 81348, -171472, 199015, -172145, 74227, -62049, -166254]
10525a66254C58481D9525h4778j30846d5468l9648j44708f0296B31850F4045J27286
10514A91331p9431d2405C09304a84685A14555e1359B26669n9089b5995A11508
10503a12896M6509C01649e7119j79162A77662e4832k43762A30736c30350J00056
10493b30294j08981F2069a17636a7175o2776j7478k96100A10538a8479I9363J05361
10482B04724a06100o2255k50152A035R0108m0003K15398o6297I468J15013J98239
10471C22720E5214b38630a18761k61410A35597a46130l7059A09397a0542A86962
10460B3035L80154o6706A34775K89352j32082b47768a8612A24057M2276a33022
10449a9700k49806A32187a22040K8030A54923p6773b18879g0055a6609A15031
$$ y = [-166254, 358481, 49525, -84778, -215624, -45468, -85116, -229824, -60296, 231850, 64045, 191331, 111900, -42405, 309304, -184685, 114555, -51359, 226669, 167580, -25995, 111508, -112896, -66387, 301649, -57119, -236281, 177662, -54832, -298594, 130736, -330350, -230294, -339275, 62069, -117636, -17175, -79951, -97429, -393529, 110538, -18479, 99363, 204724, -106100, -168355, -418507, 1035, 91143, 51140, 266538, 200241, 9468, 124481, 322720, 55214, -238630, -118761, -380171, 135597, -146130, -183189, 109397, -10542, 186962, 23035, 403189, 336483, 134775, 424127, 292045, -247768, -18612, 124057, 166333, -133022, -19700, -269506, 132187, -122040, -94010, 154923, 78150, -218879, -70055, -16609, 115031]
10438A8814a14874A14682i8001p4653G1014M1761c43804J51286j15441D6231d343
10426b991A3355d03992d7373j59894e3023a3008j79371H2465J35850d8172l1676
10415g9848A45304C9136i6406K6354G4603a03510C29590a8026A65912b77753B2011
10403b29529M1838A81972P7251q0070H5564L2042K4166r249l4901a15859C5241
10391a31571A03949h5518A87133G3863M8768c662j44183e13A11600A4642c85134
10379C76182h7794A66839F1405a79564P7991C19279k6532a96613C18955f1001
10368C5000K2509k3878N5632l0443b73945A9051a61858B02758j1109H3664J74987
10357B58651p9236h9838J0957A85643C9032E365J57516e0047I5947K39006e443
$$ y = [18814, -114874, 114682, -98001, -172654, 71014, 112775, -343804, -192518, -307959, 46231, -4343, -2991, 13355, -403992, -47373, -207267, -53023, -13008, -192379, 82465, 218315, -48172, -79848, 145304, 39136, -96406, -70052, 74603, -103510, 329590, -18026, 165912, -277753, 22011, -229529, -187691, 181972, 259223, 179153, 85564, 117606, 141772, 132523, 97622, -115859, 35241, -131571, 103949, -85518, 187133, 73863, 122631, -3662, -147845, -513, 111600, 14642, -385134, 376182, -87794, 166839, 61405, -179564, -101573, 319279, 292747, -196613, 318955, -61001, 35000, 57509, 33631, 89263, 58820, -273945, 19051, -161858, 202758, 191649, 83664, 258651, 179415, -89838, -78881, 185643, 39032, 5365, 162881, -50047, 95947, 334953, -5443]
10345B13347N2183A9898J27085e8372B82277j0775j08045B405P1983q784j4102
10334E1502K43189J18711k2259N5099k19794k0624p0172o3474K08283K31436j81730
10323C30167o9268B3904J5031J02951J22786a46932f6398I8135q933B4909J7008
10312D1917N7932h2853A99773I238J14935a30823F4896b6752A6222M3424J04215
10301A63861G866J81984E3501N2233g2654B16618C4393a51282a4956A51029O3867
10290B14896b2162A32387L9877m6966e5291H2631a67315O1252E7350A2903a4299
10278C07703b70710A38246A1447a99165o5590A66187a43609p3800o9141B08565
10267a35261A43669d3839A07393a81759f1371r5179j37983k9051R1140B2626b05898
$$ y = [213347, 265530, 19898, 146983, -58372, 282277, 271502, 163457, 2405, 74388, 65604, 51502, 294691, 413402, 391143, 446242, 226448, 205824, 135652, 72178, 280461, 511897, 330167, 260899, 23904, 38935, 141886, 264672, -146932, -66398, 98135, 89202, 24909, 41917, 99849, -82853, 199773, 9238, 124173, -130823, 64896, -26752, 16222, 59646, 163861, 7866, 189850, 53501, 105734, -72654, 216618, 34393, -151282, -14956, 151029, 214896, -22162, 132387, 172264, 125298, -55291, 82631, -167315, -106063, 57350, 12903, -14299, 307703, -270710, 138246, 11447, -199165, -264755, 166187, -143609, -217409, -286550, 208565, -135261, 143669, -43839, 107393, -181759, -61371, -156550, -294533, -323584, -232444, 22626, -205898]
10255A16170a0975j86163E0002A5343J9612d3109C52812D1496K39498c7236n9998
10244i7234j5811N5830C0415K41142A05344J1291M57837a12302N3294C88599p0534
10233C18065H8884a53131B18993a31534O0927A51764R1749a17496A5474e5595
10222g9920r6192J0004k29564c7263A80775a87058G4093a25586j13520d6388A5997
10210B5495J21295b83788J11489J8548E31998a23269G672d05850O1112a8349j07288
10199a25637A05900m0669a35595A26047A7157J2481d5591H9010b51413f6503L3005
10188c3498j23655k32944A7903h6226A23892e4979j2295c2505j71516a00406j68501
10177b68907e4834R499k42393N6957j6677j1887J25336c4285J7088A91686b35127
$$ y = [116170, -10975, -197138, 50002, 15343, 34955, -43109, 352812, 41496, 280994, -37236, -97234, -113045, -57215, 30415, 271557, 105344, 116635, 574472, -112302, -59008, 388599, 318065, 88884, -153131, 218993, -131534, -70607, 151764, 243513, -117496, 15474, -55595, -79920, -176112, -166108, -395672, -37263, 180775, -187058, 74093, -125586, -239106, -46388, 15997, 25495, 146790, -283788, -172299, -153751, 531998, -123269, 7672, -405850, -344738, -18349, -125637, 105900, 65231, -135595, 126047, 17157, 29638, -45591, 89010, -251413, -66503, -33498, -157153, -390097, 17903, -86226, 123892, -54979, -67274, -32505, -204021, -100406, -268907, -54834, -45335, -287728, -230771, -247448, -259335, -133999, -34285, -17197, 191686, -235127]
10165D7382e2217k4493n91397B8849c6598j05742A63892e9924k7837m1253A0947
10153F3305h7927l21029a72036a8584E072a44208N9712A51302b43562B93065b5774
10141i683l6819G724a31963j9583C1818c97195g1585D6928g4982A9977c19038
10129b69610c5121B09634b00206b315j51559A62767a76705f7971j20440A71071
10118A54629P375B01a81368M1341j61608C2411a31163b1375G6336h1073m6614
10107a27687l96748J3150D010N1976b06399B41983b20331J08423A31886n5209
10097G6677J66725a68749n0977A59657c21389c0890j29463A8216e2532A13554
10086b56247J5911J09465a2543B05191q0664a09958a8213I9460h3956q555I3101
$$ y = [47382, -52217, -76710, -668107, 28849, -36598, -142340, 163892, -59924, -87761, -129014, 10947, 63305, -87927, -408956, -172036, -18584, 5072, -144208, -84496, 151302, -243562, 293065, -25774, -9683, -46502, 7724, -131963, -151546, 31818, -397195, -71585, 46928, -74982, 19977, -319038, -269610, -35121, 209634, -200206, -2315, -153874, 162767, -176705, -67971, -188411, 171071, 154629, 162004, 201, -181368, -140027, -301635, 32411, -131163, -21375, 76336, -81073, -127687, -524435, -511285, 4010, 55986, -206399, 241983, -220331, -111908, 131886, 76677, 243402, -168749, -219726, 159657, -321389, -30890, -160353, 18216, -52532, 113554, -256247, -240336, -130871, -12543, 205191, 124527, -109958, -18213, 99460, -83956, -92511, 93101]
10074a74260E369J39772e5918j53737P1315r4372d5464P800I8454R8930b02818
10062A24736b09170Q6189C4212h3922j99588J01058j38781C3373a42269m0206
10052a82475j19711D27633A34166c48879B01452F8885b55145a25621A12639J807
10042A14446m4193l4910a83718H720d3454o6479m5017r3782i6330d802p5322c350
10029A7989a12572j91422h9133A03884c10514N2824O4701F5829i215B97666b59431
10017B16521a54855L6768d9482q537P367B61334h5149j56683A2367i0385C56787
10005A89832b59494i7871G1345f7017p340r8531D7722i6621B04400p012k2403
9994A74985g8810c6697A36015b26434H0212M2070h9530f690k31241a14449f244
$$ y = [-174260, 5369, 145141, -55918, -209655, -138340, -232712, -45464, -37664, 98454, 197384, -202818, 124736, -209170, -122981, 34212, -83922, -283510, -182452, -321233, 33373, -142269, -182475, -302186, 427633, 134166, -348879, 201452, 68885, -255145, -125621, 112639, 114446, 70253, 35343, -183718, 8720, -43454, -109933, -154950, -248732, -96330, -4802, -80124, -3350, 17989, -112572, -303994, -89133, 103884, -310514, -257690, -192989, 65829, -9215, 297666, -259431, 216521, -154855, -118087, -49482, -58019, -50652, 261334, -85149, -241832, 12367, -90385, 356787, 189832, -259494, -97871, 71345, -67017, -74357, -172888, 47722, -96621, 204400, 197388, 174985, -78810, -36697, 136015, -226434, 80212, 122282, -89530, -6690, -237931, -114449, -6244]
9982B66524J40065f2795D0520a63205a5525B1761a0452l7342j57712E7586g4258
9970a54949o7456a1452l42306i8380r4015A73547c8170j29127C5589c53451B24902
9958a0616A48400J6582h5096j13451b5176A57782h1597A79131O932D0389J04384
9947A44773a53109E0556c96778g8397G4864a17314J1288K250c2800A56635c85737
9935a39545H9659Q265J8467J32562h8530j8824A35646b06905F7457f141j62720
9924a68861Q3102j27214C5630g3800j43720N1285d4906n4476G1934J3458a5432
9912I6169R1484e8867k60129n1928b4474q4294A30998c28806A96016F2360a13355
9900b0535N487j824j48422Q0778o4763A0179a67066I3688b25714H394J76431k2335
$$ y = [266524, 406589, -62795, 40520, -163205, -15525, 21761, -10452, -47794, -205506, 57586, -74258, -154949, -222405, -11452, -353758, -98380, -192395, 173547, -38170, -167297, 35589, -353451, 224902, -10616, 148400, 164982, -85096, -198547, -25176, 157782, -81597, 179131, 186063, 40389, 144773, -153109, 50556, -396778, -78397, 74864, -117314, -106026, -103776, -32800, 156635, -385737, -139545, 89659, 97924, 116391, 248953, -88530, -107354, 135646, -206905, 67457, -6141, -168861, -85759, -212973, 35630, -73800, -217520, -166235, -44906, -99382, 71934, 85392, -15432, 96169, 187653, -58867, -318996, -370924, -24474, -108768, 130998, -328806, 196016, 62360, -113355, -20535, -15048, -16872, -165294, -84516, -149279, 10179, -167066, 93688, -225714, 8394, 184825, 162490]
9888A62490b16302a01196r1137l2964A24632f4246E208c51714a31218c7735A03823
9876C3216e3922a6909B3463L0908b12889K6385A15647a39251j58799H5193e5442
9864a05213D1072A4947M6451b93810M7717J04721j45032j27519a29674d6727l19158
9853c65885h3923B7729a91236A6785b2060k69421A15575J03211e0311k3422A88874
9841b29591d2299q7678c5992H4997d25975H3895O1933b26288g5551G0163k3384
9830D6779a85135J3442p848G117J5444b53549f7808A42676e73944a83663A61944
9818A3463a00754A56189c15559J30039f2459k62378h6030b3937l86605H9250c37552
9806C80553h4108D5393a63509B64980a6019k22619b2324H3779a27229r4785j55443
$$ y = [162490, -216302, -101196, -192333, -225297, 124632, -64246, 5208, -351714, -131218, -37735, 103823, 33216, -53922, -16909, 23463, 54371, -212889, -186504, 115647, -139251, -298050, 85193, -55442, -105213, 41072, 14947, 61398, -293810, -246093, -141372, -286404, -413923, -129674, -46727, -365885, -83923, 27729, -191236, 16785, -22060, -291481, 115575, 218786, -50311, -73733, 188874, -229591, -42299, -129977, -35992, 84997, -425975, 83895, 145828, -226288, -75551, 70163, 46779, -185135, -171693, -179541, 7117, 22561, -253549, -67808, 142676, -573944, -183663, 161944, 13463, -100754, 156189, -315559, -185520, -62459, -324837, -86030, -23937, -410542, 89250, -337552, 380553, -84108, 45393, -163509, 264980, -16019, -238638, -22324, 83779, -127229, -222014, -377457]
9795c77457J62454n1488f4558n9145L7133d301n4672j25144h1306C1662J9541
9784E1203c17974f0716a1279G7841B4115h5638a9675n8513A68081i2244j91866
9773b84110B9005a98268k24996b0627j21193j4471B48979b04555G4141j1515b11915
9761b5946j38193A76352a79506K3938n0229Q054d8803C0190c03749h6622j22352
9750b08974i264H5992c621Q60j68097a7867j39838e1474n5431K1917b4780n2425
9738g7205j39149J015D1742M5539c1832k7615j38088j6708Q2747I3522i957B03420
9725a94062l7957e0034A00940i6276l8318j21893I9850A9596R975a29604B89771
9713F2687B859b69999k53284e5724B37684C2857n158a0241G7444c1248j64470
$$ y = [-377457, -215003, -266491, -64558, -123703, -86570, -4301, -58973, -184117, -81306, 31662, 51203, -317974, -60716, -11279, 77841, 24115, -85638, -19675, -78188, 168081, -92244, -284110, 29005, -198268, -423264, -20627, -141820, -156291, 248979, -204555, 74141, 62626, -211915, -25946, -164139, 176352, -179506, -155568, -205797, -197743, -48803, 30190, -303749, -86622, -208974, -9264, 85992, -3621, -2761, -170858, -17867, -157705, -51474, -106905, -84988, -24780, -77205, -216354, -215339, 41742, 87281, -31832, -59447, -197535, -214243, -131496, 93522, -9957, 203420, -194062, -232019, -50034, 100940, -96276, -134594, -256487, 99850, 19596, 29571, -129604, 289771, 62687, 2859, -269999, -523283, -55724, 237684, 32857, 27699, -10241, 77444, -31248, -195718]
9702a95718Q1090l71492g5400k0217L5591E8152c3703A19665b93026n3404B14211
9690f8979o4170k62120O6682F9170b35763G7983a51081C52657a94298B77553e45189
9678D7703d04584a98971b8755J1012r5530J8849D46129e690A11056m6280a3211
9666A06816K04311a828j24224a8100l26272i8960q7935F5894K32866H4487c58221
9654a6048E9254b73678a760k00780B46760A16911a85520n6791o3157g8421q1824
9643a60245k84384m7793R4563a41225k46810L4405h4497c5146P542j6758k19749
9632b64111A12298a07485C6442c80930a36958L0731C6612a64792A6796L3163c05744
9620i3454l8498O83n3688j5352e6212j6662j92891B37415G8300B2121a01096I6235
$$ y = [-195718, -114628, -486120, -75400, -95617, -60026, 58152, -33703, 119665, -293026, -346430, 214211, -68979, -133149, -395269, -328587, 69170, -235763, 77983, -151081, 352657, -194298, 277553, -545189, 47703, -404584, -198971, -28755, -17743, -113273, -94424, 446129, -5690, 111056, 64776, -13211, 106816, 311127, -1828, -126052, -18100, -344372, -98960, -186895, 65894, 298760, 84487, -358221, -16048, 59254, -273678, -1760, -202540, 246760, 116911, -185520, -242311, -305468, -78421, -160245, -444629, -492422, -397859, -141225, -388035, -353630, -84497, -35146, -27604, -44362, -264111, 112298, -107485, 36442, -380930, -136958, -106227, 36612, -164792, 16796, 49959, -305744, -93454, -131952, -131269, -184957, -200309, -56212, -72874, -265765, 237415, 78300, 22121, -101096, 96235]
9607B41710j09315b66255J14472h088k09152B74435C2482b15602F6125K90627
9597C56752G289J26135a75724E5021f5893B94973f3738B10843a75059D8089d2113
9585B9639i2371I950K38430A03183a76827q4323C7088a24230B53806b9214A6354
9573E6708f0820q9638D7896e3543J0741j25799I6718d20655F7701b0015G2645
9561c6385A9932a80328C5435b37094i117A48285B7334J7894d8721G2521e4701
9549e2526k37325a01429L1405K9346k40983A90849a40025j24127b6670m6557B25672
9537F27951a31458E2905M7146d57721K22875j7709j90971B1726b18967E604J74554
9526A80158K73471c73461A42733p1255J9343d9324p3059b7288j83405A07286J16690
$$ y = [241710, 132395, -266255, -151783, -8088, -217240, 274435, 32482, -215602, 66125, 356752, 7289, 133424, -175724, 55021, -65893, 294973, -63738, 210843, -175059, 48089, -42113, 29639, -92371, 9950, 248380, 103183, -176827, -261150, 37088, -124230, 253806, -29214, 16354, 56708, -60820, -150458, 47896, -53543, -42802, -168601, 96718, -420655, 67701, -20015, 72645, -36385, 19932, -180328, 35435, -237094, -9117, 148285, 27334, 45228, -48721, 72521, -54701, -52526, -289851, -101429, -70024, -40678, -281661, 190849, -140025, -264152, -26670, -73227, 225672, 627951, -131458, 52905, 100051, -457721, -234846, -252555, -443526, 21726, -218967, 5604, 180158, 453629, -373461, 142733, 71478, 90821, -49324, -122383, -27288, -210693, 107286, 223976]
9515B23976c23985B8332P2344a60942H412b69773b1445j94390R4043R19k01151
9504c22024B2833a45122j25734J2274E3623Q7260A6183Q1472O3888G7638M789
9493H2427a57711g0452l32515h5999K9226P261j58945d8280n4993j06512B87476
9481G8831b04376k24945a31197f2318D8378j1010b5677j4629A11995J1131J11565
9470B34691e657j51727k5532C2984K4220b109F7606j3837i6798G7928a62489j39477
9458c01966C2114L5459k4507c99739a17690a3743q0019l18863G5469a0430j86116
9447a96546R2481N1317n2073j7307j79598C52621b82195m3953G3709a38044B27306
9435A49649c6991D5036d0242j84862i0589A31003c048j63236P5154k59302J44929
$$ y = [223976, -323985, 28332, 100676, -160942, 8412, -269773, -21445, -215835, -121792, -120873, -322024, 22833, -145122, -270856, -258582, 53623, 140883, 16183, 97655, 161543, 77638, 82427, -157711, -70452, -402967, -85999, -56773, -49512, -208457, -48280, -103273, -209785, 287476, 78831, -204376, -429321, -131197, -62318, 48378, 37368, -25677, -40306, 111995, 123126, 234691, -5657, -157384, -182916, 32984, 57204, -2109, 67606, 53769, -96798, 77928, -162489, -301966, 32114, 67573, 43066, -399739, -117690, -13743, -93762, -412625, 75469, -10430, -196546, -104065, -52748, -104821, -122128, -301726, 352621, -282195, -326148, 73709, -138044, 227306, 149649, -36991, 45036, -40242, -225104, -90589, 131003, -3048, -166284, -91130, -350432, -205503]
9424b05503i6114d0653D0288M1159P92h1494A5614c2931A25515b3709H7095K46981
9412C34076F5725a77635n3415b5956A44939a17186o4743I3092a27565j16329R5659
9401a48235f9249m23249C57185I7865a48436k35293J27831d6687k22206Q714B0435
9389d25595J29953P2997E290c04422K3266A93941F1313g5684b0635k23597N2649
9378a91583b626l0434k3807m31365F8386K1127o727M4985A0040J29572e1620m05695
9366d57315e8439b1066C9410J16831a45004a2022l7412p5229H3148a58774a6799
9354a50091B30633a14071n7744G1996b73119i5887J0052B00408c62078a26053
9343I4450a81987K2618A53923b29368O2375F0109B8453a46709M6161k52775J64613
$$ y = [-205503, -96114, -40653, 40288, 81447, 82239, -81494, 15614, -32931, 125515, -23709, 87095, 334076, 65725, -177635, -231050, -25956, 144939, -117186, -181929, 93092, -127565, -243894, -148235, -69249, -492498, 357185, 97865, -148436, -383729, -255898, -46687, -268893, -260179, 20435, -425595, -295642, -222645, 5290, -304422, -281156, 193941, 61313, -75684, -20635, -244232, -191583, -2626, -33060, -56867, -488232, 68386, 89513, 82786, 127771, 10040, 139612, -51620, -457315, -58439, -21066, 39410, 156241, -145004, -12022, -49434, -124663, 83148, -158774, -16799, -150091, 230633, -114071, -171815, 71996, -273119, -95887, -85835, 200408, -362078, -126053, 94450, -181987, -159369, 153923, -229368, -166993, 60109, 28453, -146709, -100548, -353323, -188710]
9332a88710p8620O9333C57825b53711c0762j3541C09030q7587F4712d8399l7850
9321h6249m5991F5114O0804g1551A10607a69764e3963C350J44197a93278l2690
9310b25968L1263j14297e6992m9413B3632O302a38309a5178C6081k8J72933c18473
9297C8559c89300a46828j0704n4122C81330a62741c0858l1504B27533i8441a9036
9285A92355E204b12041c4455n8115m3844A30356c8901A5199i8913k8519C0809
9273C32319A04425J74254a41240k22807a5259j00728J6924j08887j59036b3415
9262h9991A16725c14904a23629B899P8431a13747F0763a2904j3024n49B12537
9250G788a22332c7374A8145p123c24011K8951F6657b9268j91091J00946K1749
$$ y = [-188710, -267330, -197997, 357825, -253711, -30762, -44303, 309030, 221443, 64712, -48399, -86249, -132240, 65114, 125918, -71551, 110607, -169764, -53963, 3350, 147547, -193278, -225968, -194705, -309002, -56992, -106405, 23632, 29934, -138309, -15178, 36081, 36053, 208986, -318473, 38559, -389300, -146828, -157532, -211654, 381330, -162741, -30858, -62362, 227533, -98441, -19036, 192355, 5204, -212041, -34455, -92570, -136414, 130356, -38901, 15199, -98913, -127432, 30809, 332319, 104425, 278679, -141240, -364047, -15259, -115987, -99063, -207950, -366986, -23415, -89991, 116725, -314904, -123629, 2899, 81330, -113747, 60763, -12904, -25928, -26477, 212537, 7788, -122332, -37374, 18145, 11022, -324011, -295060, 66657, -29268, -220359, -119413, -97664]
9239i7664m5537o5278h673o4685j52966b442A0980J73901E8182a48850L9463C89068
9226A948a34912j59768A16862a54388A52952j9849b53177b4974j21808l2278A75639
9214c8905A84025j8020c2248k7517K4358A3942J30778P337c43432A30561g372
9202a00435j37457J04704M3813p2464b9661k975C2762A5502a27617d1299L29A58854
9189b35321N6723B14493q9772Q7578b7089H6720K7769i8858n8119E6302a16737
9177d6062B65515a77743k1236k21313a34860j02179q6891d5885j80059J5504f3587
9165b28901a14202J8672j14825k45470h8908k05568I3427b43488a2364j50683
9155a63047F8144a25467K103j07640p6178q3825G2749a09286j37950A700c5517
$$ y = [-97664, -143201, -208479, -8673, -73358, -226324, -2442, 10980, 184881, 58182, -148850, -109387, 389068, 1948, -134912, -294680, 116862, -154388, 152952, 133103, -253177, -24974, -146782, -179060, 175639, -38905, 184025, 166005, -32248, -59765, -35407, 13942, 144720, 152057, -343432, 130561, -7372, -100435, -237892, -133188, -89375, -161839, -29661, -32636, 32762, 15502, -127617, -41299, -40970, 158854, -235321, -178598, 214493, 124721, 212299, -27089, 86720, 114489, -98858, -156977, 56302, -116737, -46062, 265515, -177743, -198979, -420292, -134860, -237039, -323930, -45885, -225944, -210440, -63587, -228901, -114202, -95530, -210355, -455825, -88908, -294476, 93427, -243488, -12364, -163047, 68144, -125467, -123364, -231004, -307182, -391007, 72749, -109286, -247236, 1700, -35517]
9143A10780R074J3167R3621B3330J57432b71662B9478n333c04991H0921g6138
9131b67158e3475j14908r8938a24046B48103b1319j04176o486B92122b13037Q9752
9120a23285k35419B37950A1347L19274A27788A4686d70918a83966A02736B4596
9109a09738j91417J37754N3263n6090f8210G0852a66103f4409F5024i9766M1954
9098e7812l3446A88246J6953E4504N6520i5879L813D9700g9025j40131K3930j46955
9086c42181a34750M4473K7482j3038c5576j18916m9893B19679N4745c0369k18140
9075b48509G0742L1480a10970J8584G6563D913b643A48570m2957a23082j63612
9064b86694h0705a9162j45798D0608R892e3181A66328i0780m969b0297A45872
$$ y = [110780, 119854, 133021, 226642, 23330, 180762, -271662, 29478, 24145, -304991, 80921, -76138, -267158, -53475, -168383, -267321, -124046, 248103, -21319, -125495, -131981, 292122, -213037, -123285, -358704, 237950, 11347, 330621, 127788, 14686, -470918, -183966, 102736, 24596, -109738, -301155, -163401, -110138, -166228, -68210, 70852, -166103, -64409, 65024, -99766, -57812, -91258, 188246, 205199, 54504, 111024, -95879, -92066, 49700, -79025, -219156, -195226, -342181, -134750, -90277, -62795, -75833, -35576, -154492, -204385, 219679, 274424, -30369, -248509, 70742, 102222, -110970, -92386, 76563, 4913, -2643, 148570, 105613, -123082, -286694, -80705, -19162, -164960, 40608, 50500, -53181, 166328, -90780, -95749, -20297, 145872]
9052H3398a81288g3490A7624L7072e0415g604A88109d10191d3603l0962m5660
9041a20225A90436a29972p0087O8579b6999j36499j3260O1140k15205R8281K2993
9030b09549J4475f6722b2453A19809d46640A11425c02570i8853C24020D7201b40877
9018A30771a31591k17617b5671j82688a03635j14774D7506a19p0528B20856b34572
9006c2723a4568r8015j21217L6721F0628f9181K1187G1253J14805q0641b53503
8994i5060H1715b68640L7492B24860a49241p8338C527h7145k83866a0167j92743
8983b02910B89421d8864a367H4418P8053a55279A30067L9242i6758j55904A22016
8971B63305b01295P7356n159r299M1707J8446q5532D2440c05008f2394a7518G571
$$ y = [83398, -181288, -73490, 17624, 54696, -50415, -7604, 188109, -410191, -43603, -74565, -120225, 190436, -129972, -200059, -131480, -26999, -163498, -176758, -115618, -330823, -232542, -209549, -195074, -66722, -22453, 119809, -446640, 111425, -302570, -98853, 324020, 47201, -240877, 130771, -131591, -349208, -25671, -208359, -103635, -218409, 47506, -119, -70647, 220856, -234572, -32723, -14568, -112583, -233800, -197079, 60628, -69181, -47994, 71253, 186058, 105417, -253503, -95060, 81715, -268640, -231148, 224860, -149241, -227579, 3527, -87145, -371011, -10167, -202910, 289421, -48864, -1367, 84418, 162471, -155279, 130067, 169309, -96758, -252662, 122016, 263305, -201295, -123939, -129098, -138397, -96690, -78244, -163776, 42440, -305008, -62394, -17518, 7571]
8958c6984k31350A35085a5411l56799H1349M8707a95279R0768N1321E6345a63476
8946c04052G926b6212B2366b08869Q4946q4376j9548J13793A08347a57943B9559
8934h5905K9485j40485f6232A15489J4727b74943A59780f2133J4994l891B34293
8922A13288k6144f8884b7179l9109j30464N5019A45902a33671A07650K9652c2169
8910I2149K50467O363q1840L09099K00118M85261J582132K918081B737616A351327
8899G09984j70444j57716K3051H25N6884J36649i5159D14615J26979C4378b0807
8887c3629l7569b1944E6476a35370j61620g4971B3590J49758o3732B1422J59487
8876A80909b99644E6173a07433B1093M0304A2777a21197d8309k61110h9061l43972
$$ y = [-36984, -268334, 135085, -15411, -372210, 81349, 130056, -195279, -104511, -53190, 56345, -163476, -304052, 7926, -26212, 22366, -208869, -123923, -208299, -227847, -114054, 108347, -157943, 29559, -85905, -56420, -196905, -66232, 115489, 130216, -274943, 159780, -62133, -47139, -51030, 234293, 113288, 87144, -68884, -27179, -66288, -196752, -141733, 145902, -133671, 107650, 137302, -32169, 92149, 342616, 348979, 267139, 576238, 776356, 1261617, 2843749, 5761830, 2737616, 1351327, 709984, 539540, 381824, 404875, 825, 57709, 194358, -95159, 414615, 541594, 34378, -20807, -33629, -71198, -21944, 56476, -135370, -296990, -74971, 23590, 173348, 109616, 21422, 180909, -299644, 56173, -107433, 21093, 61397, 12777, -121197, -48309, -309419, -89061, -433033]
8865d33033J47365b9201j21243E7608i18j88564r372K4362p9463F9114J74363
8854B43477G1404J4539g9721A61921o9072c80472Q2759B4856e7497A2686N0419
8843F3105K18795a18814L8611o4519A40872O8440G9140d6962k42687B12106F2939
8831E0296O7719j2896J64382a01644a4660j52611C319f5777A08567j9872J98456
8820B87151b56841J4047R8300H5315a54251p4788N1104c8576k01580g5247j83891
$$ y = [-433033, -285668, -29201, -150444, 57608, -918, -189482, -198854, -174492, -253955, 69114, 243477, 71404, 85943, -79721, 161921, 92849, -380472, -297713, 24856, -57497, 12686, 63105, 281900, -118814, -80203, -144722, 140872, 209312, 79140, -46962, -289649, 212106, 62939, 50296, 118015, 105119, 269501, -101644, -14660, -167271, 3319, -65777, 108567, 88695, 287151, -256841, -242794, -144494, 85315, -154251, -229039, -177935, -38576, -240156, -75247, -259138]
$$ [...]
##END NTUPLES=NMR SPECTRUM
##END=
