
##TITLE=AC1172_Tolima-ibage-TFiAH12005_7180122_D8ISGGaKJD
##JCAMPDX= 6.0         $$ Bruker NMR JCAMP-DX V2.0
##DATA TYPE= NMR SPECTRUM
##DATA CLASS= NTUPLES
##ORIGIN= BRUKER
##OWNER= Administrator
$$ 1.72 TOPSPIN		Version 2.1
$$ 2012-12-04 21:37:32.750 -0500  Administrator@X
$$ Compression mode = diff/dup
##.OBSERVE FREQUENCY= 400.02188249412
##.OBSERVE NUCLEUS= ^1H
##.ACQUISITION MODE= SIMULTANEOUS (DQD)
##.ACQUISITION SCHEME= undefined
##.AVERAGES= 8
##.DIGITISER RES= 22
##SPECTROMETER/DATA SYSTEM= spect
##.PULSE SEQUENCE= zg30
##.SOLVENT NAME= COFFEE_meoh
##.SHIFT REFERENCE= INTERNAL, COFFEE_meoh, 1, 14.98509
##AUDIT TRAIL= $$ (NUMBER, WHEN, WHO, WHERE, PROCESS, VERSION, WHAT)
$$ ##TITLE= Audit trail, TOPSPIN		Version 2.1
$$ ##JCAMPDX= 5.01
$$ ##ORIGIN= Bruker BioSpin GmbH
$$ ##OWNER= Administrator
$$ $$ E:\/data/COFFEE/nmr/AC1172_Tolima-ibage-TFiAH12005_7180122_D8ISGGaKJD/10/pdata/1/auditp.txt
$$ ##AUDIT TRAIL=  $$ (NUMBER, WHEN, WHO, WHERE, PROCESS, VERSION, WHAT)
(   1,<2012-12-04 21:37:24.687 -0500>,<Administrator>,<X>,<go>,<TOPSPIN 2.1>,
      <created by zg
	started at 2012-12-04 21:36:18.203 -0500,
	POWCHK enabled, PULCHK disabled,
       configuration hash MD5:
       86 BA 57 50 F2 9D 5C 9B 26 00 A9 28 5F 66 2E 89
       data hash MD5: 64K
       AD B4 93 BB 0C 97 EB 01 F7 80 D0 2F A9 DA C9 8F>)
(   2,<2012-12-04 21:37:27.734 -0500>,<Administrator>,<X>,<proc1d>,<TOPSPIN 2.1>,
      <Start of raw data processing
       efp LB = 0 FT_mod = 6 PKNL = 1 PHC0 = 0 PHC1 = 0 SI = 32K 
       data hash MD5: 32K
       64 8C D4 3D B8 49 72 93 0E F5 52 4D 06 8D D0 6D>)
(   3,<2012-12-04 21:37:28.203 -0500>,<Administrator>,<X>,<proc1d>,<TOPSPIN 2.1>,
      <pk PHC0 = 102.6837 PHC1 = 0 
       data hash MD5: 32K
       0D B2 57 8F 81 71 3E 74 24 69 58 19 21 98 CA 1D>)
(   4,<2012-12-04 21:37:28.437 -0500>,<Administrator>,<X>,<proc1d>,<TOPSPIN 2.1>,
      <abs ABSG = 1 
       data hash MD5: 32K
       61 BD 2F 02 1C 1C A9 7E 45 9D C4 30 5C A3 27 8F>)
(   5,<2012-12-04 21:37:28.594 -0500>,<Administrator>,<X>,<proc1d>,<TOPSPIN 2.1>,
      <abs ABSG = 2 
       data hash MD5: 32K
       2F A2 ED AC 32 D9 1F 46 CC 82 4C BC 55 E8 0A 40>)
(   6,<2012-12-04 21:37:28.734 -0500>,<Administrator>,<X>,<proc1d>,<TOPSPIN 2.1>,
      <abs ABSG = 3 
       data hash MD5: 32K
       83 50 2A F6 EA 71 03 46 A6 0C B3 5B D7 09 3E 1B>)
(   7,<2012-12-04 21:37:28.891 -0500>,<Administrator>,<X>,<proc1d>,<TOPSPIN 2.1>,
      <abs ABSG = 4 
       data hash MD5: 32K
       41 90 74 61 07 7E 85 81 0C D6 F1 29 AA 78 31 21>)
(   8,<2012-12-04 21:37:29.047 -0500>,<Administrator>,<X>,<proc1d>,<TOPSPIN 2.1>,
      <abs ABSG = 5 
       data hash MD5: 32K
       58 76 71 EA 0A A3 66 66 A6 C1 3E EF B9 FC DE CF>)
$$ ##END=
$$ 
$$ $$ hash MD5
$$ $$ B4 36 D5 C7 A0 A6 31 DA 6F 23 56 DA 69 80 E6 D4
##$RELAX= 
##$RELAX= 
##$RELAX= 
##$RELAX= 
##$RELAX= 
##$RELAX= 
##$RELAX= 
$$ Bruker specific parameters
$$ --------------------------
##$DU= <E:\>
##$EXPNO= 10
$$ [...]
##$TP= (0..7)
150 150 150 150 150 150 150 150
##$TP07= 0
##$TPNAME0= <>
##$TPNAME1= <>
##$TPNAME2= <>
##$TPNAME3= <>
##$TPNAME4= <>
##$TPNAME5= <>
##$TPNAME6= <>
##$TPNAME7= <>
##$TPOAL= (0..7)
0.5 0.5 0.5 0.5 0.5 0.5 0.5 0.5
##$TPOFFS= (0..7)
0 0 0 0 0 0 0 0
##$TUNHIN= 0
##$TUNHOUT= 0
##$TUNXOUT= 0
##$USERA1= <user>
##$USERA2= <user>
##$USERA3= <user>
##$USERA4= <user>
##$USERA5= <user>
##$V9= 5
##$VALIST= <valist>
##$VCLIST= <CCCCCCCCCCCCCCC>
##$VD= 0
##$VDLIST= <DDDDDDDDDDDDDDD>
##$VPLIST= <PPPPPPPPPPPPPPP>
##$VTLIST= <TTTTTTTTTTTTTTT>
##$WBST= 2048
##$WBSW= 25
##$XGAIN= (0..3)
0 0 0 0
##$XL= 0
##$YL= 0
##$YMAX_a= 644212
##$YMIN_a= -551513
##$ZGOPTNS= <>
##$ZL1= 120
##$ZL2= 120
##$ZL3= 120
##$ZL4= 120
##$ABSF1= 14.98509
##$ABSF2= -5.573092
##$ABSG= 5
##$ABSL= 3
##$ALPHA= 0
##$AQORDER= 0
##$ASSFAC= 0
##$ASSFACI= 0
##$ASSFACX= 0
##$ASSWID= 0
##$AUNMP= <proc_prof1d_extract_pilot.lims>
##$AXLEFT= 0
##$AXNAME= <>
##$AXNUC= <1H>
##$AXRIGHT= 0
##$AXTYPE= 0
##$AXUNIT= <>
##$AZFE= 0.1
##$AZFW= 0.1
##$BCFW= 0
##$BC_mod= 0
##$BYTORDP= 0
##$COROFFS= 0
##$CY= 15
##$DATMOD= 1
##$DC= 0
##$DFILT= <>
##$DTYPP= 0
##$F1P= 0
##$F2P= 0
##$FCOR= 0.5
##$FTSIZE= 32768
##$FT_mod= 6
##$GAMMA= 0
##$GB= 0
##$INTBC= 1
##$INTSCL= 1
##$ISEN= 128
##$LB= 0
##$LEV0= 0
##$LPBIN= 0
##$MAXI= 10000
##$MC2= 0
##$MEAN= 0
##$ME_mod= 0
##$MI= 0
##$NCOEF= 0
##$NC_proc= -8
##$NLEV= 6
##$NOISF1= 0
##$NOISF2= 0
##$NSP= 0
##$NTH_PI= 0
##$NZP= 0
##$OFFSET= 14.98509
##$PC= 1
##$PHC0= 102.6837
##$PHC1= 0
##$PH_mod= 1
##$PKNL= yes
##$PPARMOD= 0
##$PPDIAG= 0
##$PPIPTYP= 0
##$PPMPNUM= 2147483647
##$PPRESOL= 1
##$PSCAL= 4
##$PSIGN= 0
##$PYNMP= <proc.py>
##$REVERSE= no
##$SF= 400.02
##$SI= 32768
##$SIGF1= 0
##$SIGF2= 0
##$SINO= 400
##$SIOLD= 32768
##$SPECTYP= <>
##$SREGLST= <1H.CDCl3>
##$SSB= 0
##$STSI= 32768
##$STSR= 0
##$SW_p= 8223.68421052631
##$SYMM= 0
##$S_DEV= 0
##$TDeff= 65536
##$TDoff= 0
##$TI= <>
##$TILT= no
##$TM1= 0
##$TM2= 0
##$TOPLEV= 0
##$USERP1= <user>
##$USERP2= <user>
##$USERP3= <user>
##$USERP4= <user>
##$USERP5= <user>
##$WDW= 1
##$XDIM= 32768
##$YMAX_p= 475818968
##$YMIN_p= -688308
##$CURPLOT= <Network HP LaserJet P1505>
##$CURPRIN= <$Network HP LaserJet P1505>
##$DFORMAT= <normdp>
##$LAYOUT= <+/1D_H.xwp>
##$LFORMAT= <normlp>
##$PFORMAT= <normpl>
##$SURQMSG= 1
$$ End of Bruker specific parameters
$$ ---------------------------------
##NTUPLES= NMR SPECTRUM
##VAR_NAME=  FREQUENCY,     SPECTRUM/REAL,   SPECTRUM/IMAG
##SYMBOL=    X,             R,               I
##VAR_TYPE=  INDEPENDENT,   DEPENDENT,       DEPENDENT
##VAR_FORM=  AFFN,          ASDF,            ASDF
##VAR_DIM=   32768,         32768,           32768
##UNITS=     HZ,            ARBITRARY UNITS, ARBITRARY UNITS
##FACTOR=    0.250966925370066, 1,           1
##FIRST=     8223.43324360094, -149428,      3119
##LAST=      0,             -32262,          191637
##MIN=       0,             -688308,         0
##MAX=       8223.43324360094, 475818968,    0
$$ Real data points
##PAGE= N=1
##DATA TABLE= (X++(R..R)), XYDATA
$$ [...]
19551a98376B85676N5949l9763G4721c12566J01905i2515E1018E556e6580C6199
$$ -198376 285676 341625 301862 74721 -312566 -210661 -92515 51018 5556 -56580 36199
19539F7482J96056b19699k14112C4160g8971D0897b90158F5026o634b45770C07199
$$ 67482 263538 -219699 -433811 34160 -78971 40897 -290158 65026 58392 -245770 307199
19527i4531l1469k13109P4941J00354q6000A16803n6510J06270d3307G9174a24561
$$ -94531 -126000 -339109 -264168 -163814 -249814 116803 60293 166563 -43307 79174 -124561
19515A08965a63276A71921q4339a23483l31225a13535I2216a93188A20353G547
$$ 108965 -163276 171921 87582 -123483 -454708 -113535 92216 -193188 120353 7547
19504a95156g153m1328A42100k5749b7777j9108I8840b02283e790B0628a11282
$$ -195156 -7153 -48481 142100 116351 -27777 -46885 98840 -202283 -5790 20628 -111282
19492a237l5946C22935A52541i1491K6006r0142A53612b79669H4952m2043a56486
$$ -1237 -37183 322935 152541 -91491 -65485 -155627 153612 -279669 84952 42909 -156486
19480i7369n0090k9951a9867A15153e0957C8496L2520c7924k36945a27093J659
$$ -97369 -147459 -177410 -19867 115153 -50957 38496 71016 -37924 -274869 -127093 -125434
19469a25434B5514i6687j1817B41887B2374L11048B5610h3636O730F2538b56556
$$ -125434 25514 -96687 -108504 241887 22374 333422 25610 -83636 -76906 62538 -256556
19457A1608b32828A17191a3670o4366a2685A15502c8948o0672p8384c4970q2414
$$ 11608 -232828 117191 -13670 -78036 -12685 115502 -38948 -99620 -178004 -34970 -117384
19446a17384e6710a0512j71065M1713C01167i6550j48084e5331j61157i0002j55112
$$ -117384 -56710 -10512 -181577 -139864 301167 -96550 -244634 -55331 -216488 -90002 -245114
19435b45114Q6830c6510Q63j50223C9609b30595q5407G7848a8380F0737C159b86304
$$ -245114 -158284 -36510 -35647 -185870 39609 -230595 -316002 77848 -18380 60737 3159 -286304
19422c8505k80084J03575a05956l98525P7033j1657E9891a07736A18311J18447
$$ -38505 -318589 -215014 -105956 -504481 -427448 -439105 59891 -107736 118311 236758
19412B36758b23182C5460a94504o7103C8657K28494a93705B83732b80730a17005
$$ 236758 -223182 35460 -194504 -261607 38657 267151 -193705 283732 -280730 -117005
19401A6451O3556M8434B7466c01537B32966a22138j26849e9643F0750Q3055a97043
$$ 16451 80007 128441 27466 -301537 232966 -122138 -248987 -59643 60750 143805 -197043
19389b87527d2560a0811j15950a8585B48043g990j53912F0990b54190M729B08484
$$ -287527 -42560 -10811 -126761 -18585 248043 -7990 -161902 60990 -254190 -249461 208484
19377g9406A36516n8497b22272k2257b0541l23153B0152a69212A25777c48628
$$ -79406 136516 78019 -222272 -244529 -20541 -343694 20152 -169212 125777 -348628
19366d00511A75064G6926C5287J21135F5073a18545C0474O8251d4298J2777A40137
$$ -400511 175064 76926 35287 156422 65073 -118545 30474 98725 -44298 -31521 140137
19354e4051A5430a34779B76035D4543a19982A16614e20392B096L36023d03543
$$ -54051 15430 -134779 276035 44543 -119982 116614 -520392 2096 338119 -403543
19343D59876b63733A39490J30718A14742a28584e1378q1632j55616J05378E8055
$$ 459876 -263733 139490 270208 114742 -128584 -51378 -133010 -288626 -183248 58055
19332B48462a28916A38891b71529a03840C42954b59592J28917p3924D0489b42105
$$ 248462 -128916 138891 -271529 -103840 342954 -259592 -130675 -204599 40489 -242105
19321a85391F725k93g9603j77292a23483j06677i5360J3721J3970A0950i2400
$$ -185391 6725 6432 -79603 -256895 -123483 -230160 -95360 -81639 -67669 10950 -92400
19309A2807d23898d8681k68716E285K8279N2632J8817M8834a86878C533J62361
$$ 12807 -423898 -48681 -317397 5285 33564 86196 105013 153847 -186878 3533 165894
19298A65894M0350b23918N3511k48829A49134a25353M6748a0979l1059j22655
$$ 165894 206244 -223918 -170407 -419236 149134 -125353 -78605 -10979 -42038 -164693
19288a64693A21733K1242j5120G172a86078A41457e5532C85270a02548j88632
$$ -164693 121733 142975 127855 7172 -186078 141457 -55532 385270 -102548 -291180
19278b91180a39087G1480A4942i2906l6946J7144o4721a5632p8352a9917Q522
$$ -291180 -139087 71480 14942 -92906 -129852 -112708 -177429 -15632 -93984 -19917 -11395
19267a1395j67274a6065I4283d4203A02890b66650c5509A31163b18066d6745H9487
$$ -11395 -178669 -16065 94283 -44203 102890 -266650 -35509 131163 -218066 -46745 89487
19255F6261c11238J25301p5025a23735E9262b51509l4701A407N7306O0454J05222
$$ 66261 -311238 -185937 -260962 -123735 59262 -251509 -286210 1407 58713 119167 224389
19244B24389n1728C5429b7062o2946I7120a8001I4871N8004a08526K8015A64941
$$ 224389 172661 35429 -27062 -90008 97120 -18001 94871 152875 -108526 -80511 164941
19232c29698i0308A23440Q1637r221a20042d6971j47745A31819J01322c31202
$$ -329698 -90308 123440 205077 195856 -120042 -46971 -194716 131819 233141 -331202
19221C7048b12273g7147A05738M6707a6052m4522q9637a5619k43939j00091f4100
$$ 37048 -212273 -77147 105738 152445 -16052 -60574 -150211 -15619 -259558 -359649 -64100
19209a14904I436f5500j21455N4098A7695L2234f2565k02567A25144c02334I1751
$$ -114904 9436 -65500 -186955 -132857 17695 49929 -62565 -265132 125144 -302334 91751
19197e2891j316I6659j9383h1756j9016A48350b45759J07467B6701d84578a51077
$$ -52891 -54207 96659 77276 -81756 -100772 148350 -245759 -138292 26701 -484578 -151077
19185B7052a55966L7456A19513k5411a20832P519A19673b78602L9265A11730b58908
$$ 27052 -155966 -118510 119513 94102 -120832 -113313 119673 -278602 -239337 111730 -258908
19173a67935g959j53701C2965a06757c9937A04380d3813A80463a95442D8644a89918
$$ -167935 -7959 -161660 32965 -106757 -39937 104380 -43813 180463 -195442 48644 -189918
19161B27815B1975J11206E040a79830I515a55685J4912N3549j38685B10179b68981
$$ 227815 21975 133181 5040 -179830 9515 -155685 -140773 -87224 -225909 210179 -268981
19149B11246i1683j01928A44781a53392f0623B31793N3722j26921b88563J40443
$$ 211246 -91683 -193611 144781 -153392 -60623 231793 285515 158594 -288563 -148120
19139a48120A8563a14755j45210J11031A49570b83264a37671j87348g6912R916
$$ -148120 18563 -114755 -259965 -148934 149570 -283264 -137671 -325019 -76912 -66996
19129f6996n1687D4088J72773F3503M4096P9773F2418R0355a39852L7067l1798
$$ -66996 -118683 44088 216861 63503 107599 187372 62418 152773 -139852 -102785 -134583
19118a34583j34240J23583j7022d817o4760E5605a42505d6261C7814b78290L118
$$ -134583 -268823 -145240 -162262 -4817 -69577 55605 -142505 -46261 37814 -278290 -275172
19107b75172I7300k7837J63295a52998O9648o1482B15714b75109a1561G8438d3574
$$ -275172 97300 69463 232758 -152998 -83350 -144832 215714 -275109 -11561 78438 -43574
19095a62454N1625j03373A75622c68277a08919b1754A4883d5932A07024c39030
$$ -162454 -110829 -214202 175622 -368277 -108919 -21754 14883 -45932 107024 -339030
19084D9780G888Q6622a84275O2902r6967A38233d54010d6131B35634K5383b50725
$$ 49780 7888 94510 -184275 -121373 -218340 138233 -454010 -46131 235634 261017 -250725
19072a56653l4574G6254h9680J3595q5624D9218b49510O0751j25400j3760j63064
$$ -156653 -191227 76254 -89680 -76085 -161709 49218 -249510 -188759 -314159 -327919 -490983
19061d90983C93894A63723E9140a90703j7848k84379b24359A25180e5309j75110
$$ -490983 393894 163723 59140 -190703 -208551 -492930 -224359 125180 -55309 -230419
19051b30419Q5879j05536j7198B65706a47395f9188A88662c0553I9179J4397a59848
$$ -230419 -144540 -250076 -267274 265706 -147395 -69188 188662 -30553 99179 113576 -159848
19039A05095a35360j88848d5499A75879B5260b8823n0504A7127b9798j54702n067
$$ 105095 -135360 -324208 -45499 175879 25260 -28823 -79327 17127 -29798 -184500 -189567
19028a89567N3873j4718g0898A5226L5446a8690A03996g4592F9794R9995a18745
$$ -189567 -135694 -150412 -70898 15226 50672 -18690 103996 -74592 69794 169789 -118745
19016b37818a11607n5530j87269d7326C01953f601k45642b437D1849a27632B38270
$$ -237818 -111607 -167137 -354406 -47326 301953 -6601 -252243 -2437 41849 -127632 238270
19004C2757b28225b1077F1564a43337B30354D1965J526r296i1902B74090q9077
$$ 32757 -228225 -21077 61564 -143337 230354 41965 43491 34195 -91902 274090 185013
18993A85013a027I0110c10325A91503c52225g748k06309A29312b33315I0860a35246
$$ 185013 -1027 90110 -310325 191503 -352225 -7748 -214057 129312 -233315 90860 -135246
18981a17002c3550n4861f915l39251I0025a28595F2074a80406l5966a5274j57397
$$ -117002 -33550 -88411 -6915 -346166 90025 -128595 62074 -180406 -216372 -15274 -172671
18970a72671Q048j80780N7809d1340D6648a90182A36006K57307a6360l16778A13790
$$ -172671 -164623 -345403 -287594 -41340 46648 -190182 136006 393313 -16360 -333138 113790
18958b0665D18452A89055b222q8944B36839b7933B13835G9175K08627c9455h22
$$ -20665 418452 189055 -2222 -91166 236839 -27933 213835 79175 287802 -39455 -822
18946c86789D7507J44259q2082A1134N6373f3636C4734a28910e919A54535g6293
$$ -386789 47507 191766 109684 11134 67507 -63636 34734 -128910 -5919 154535 -76293
18934B62785C5785J81388j06914B509b9163j78598A31298a49049A21193a98644
$$ 262785 35785 217173 110259 2509 -29163 -207761 131298 -149049 121193 -198644
18923a86500A33277c0505k35534f4205P796p7543l5873D4996J75693d87753a81858
$$ -186500 133277 -30505 -266039 -64205 -56409 -133952 -169825 44996 220689 -487753 -181858
18911b54274e8633b6185C4602b31066b8933I1528O1669p6041b20148p3004G7069
$$ -254274 -58633 -26185 34602 -231066 -28933 91528 153197 77156 -220148 -293152 77069
18899b05749i062B01816a44391e6432p7496A35456N8975a16800B7366a45156I8544
$$ -205749 -9062 201816 -144391 -56432 -133928 135456 194431 -116800 27366 -145156 98544
18887h4313L5824a9388A2064c32033E2928J26259b85274B89330a79490l554n6691
$$ -84313 -48489 -19388 12064 -332033 52928 179187 -285274 289330 -179490 -183044 -239735
18876b39735d991G2564J48859h7227F5376a5534k9184K965C4357c0443l311j19261
$$ -239735 -4991 72564 221423 -87227 65376 -15534 -44718 -41753 34357 -30443 -33754 -153015
18864a53015H7400B0921J83055C5202J0786c20691O6799L8851C5194h0915A77892
$$ -153015 87400 20921 203976 35202 45988 -320691 -253892 -215041 35194 -80915 177892
18852B14487d00123a12767c9922B78155p9151b9236j81267L3778A86742M6319
$$ 214487 -400123 -112767 -39922 278155 199004 -29236 -210503 -176725 186742 233061
18842B33061m9829a3844B522a77635n1814j78712g4820A08458a16153L8707p202
$$ 233061 183232 -13844 2522 -177635 -229449 -408161 -74820 108458 -116153 -77446 -84648
18831h4648E44744a33756G3661G384O0941K633c36909A38112c6858D5272L7423
$$ -84648 544744 -133756 73661 7384 68325 70958 -336909 138112 -36858 45272 82695
18820H2695P0085a17795B88877A30772g0077A22925b31883A69440k1815J07382
$$ 82695 152780 -117795 288877 130772 -70077 122925 -231883 169440 147625 255007
18810B55007E8775L0878k33b21350C409d46890a40827F5029A72M36171D001N5941
$$ 255007 58775 89653 89420 -221350 3409 -446890 -140827 65029 172 436343 4001 59942
18798E9942b59574D3064e1442n31441B27027b82634K8504B04568a32099A32783
$$ 59942 -259574 43064 -51442 -582883 227027 -282634 -254130 204568 -132099 132783
18787b30751f5942A7283a00417K7826k60647H1289i0520o9292A68407P9459J30596
$$ -230751 -65942 17283 -100417 -72591 -333238 81289 -90520 -159812 168407 247866 378462
18776C78462o6605a9152j53715L8902p4748j69189a47151A06494a18936l07610
$$ 378462 311857 -19152 -172867 -133965 -208713 -377902 -147151 106494 -118936 -426546
18766d26546J21323R4371Q1469k88537A91053F8307f4533a6717j07765C5375g9145
$$ -426546 -305223 -210852 -129383 -417920 191053 68307 -64533 -16717 -124482 35375 -79145
18754a15001a4907q7706d7885D6050p602i7032o1683A46908b9918p873A09879
$$ -115001 -14907 -102613 -47885 46050 38448 -97032 -158715 146908 -29918 -37791 109879
18742E6142a41089B95964k3968j14065P6857N1401c86004C00502I566f1480A14495
$$ 56142 -141089 295964 271996 157931 234788 286189 -386004 300502 9566 -61480 114495
18730b25013D5303J7165j3490B2672Q2786a9952j0902q0973J7213i063C0863a3641
$$ -225013 45303 62468 48978 22672 105458 -19952 -30854 -111827 -94614 -9063 30863 -13641
18717B0345K0640g9590H4763a25086A01121a68028D1490b48409P8550j79102H1432
$$ 20345 40985 -79590 84763 -125086 101121 -168028 41490 -248409 -169859 -348961 81432
18705b20427O9693O484o1730F2930a1229m9390j83462C8150a45324C4722j0900
$$ -220427 -150734 -144250 -205980 62930 -11229 -60619 -244081 38150 -145324 34722 23822
18694B3822K24913d10695A31528J52704c24930B5080a79029j4803A42356b29681
$$ 23822 248735 -410695 131528 284232 -324930 25080 -179029 -193832 142356 -229681
18683A37949f5103j26594j88972F3607I072M8668a1955B6299J82585a19083j60440
$$ 137949 -65103 -191697 -380669 63607 9072 57740 -11955 26299 208884 -119083 -279523
18672b79523A69839c3342A52564a12903n0666J3632N2234f672j16878N859M0472
$$ -279523 169839 -33342 152564 -112903 -163569 -149937 -97703 -6672 -123550 -117691 -77219
18661g7219k24150A65288b14701h5185K5984j66457a00788E6586f7255D7838c43333
$$ -77219 -301369 165288 -214701 -85185 -59201 -225658 -100788 56586 -67255 47838 -343333
18649a54194K5645G6312D625O439J54159h5192A29279b1162l57026a75228r3414
$$ -154194 -128549 76312 4625 11064 165223 -85192 129279 -21162 -378188 -175228 -268642
18638b68642g8203j39073C4259K75602j31410c32433A00954c95327J04954N562
$$ -268642 -78203 -217276 34259 309861 178451 -332433 100954 -395327 -290373 -284811
18628b84811K2853D8644P3552d38506O8878a74939N4823B50179E0002m187c4851
$$ -284811 -261958 48644 122196 -438506 -369628 -174939 -120116 250179 50002 45815 -34851
18616d06408g2896J9868B1483c5127B97403A8981d2513I8464c10343g239B48924
$$ -406408 -72896 -53028 21483 -35127 297403 18981 -42513 98464 -310343 -7239 248924
18604a85632C71405H6374h3963j54505J16383l2908B66698c17693J44138B01391
$$ -185632 371405 86374 -83963 -238468 -122085 -154993 266698 -317693 -173555 201391
18593A75891F2957b0940k33528A56089a52104l23571P7598C1198a81790e5843
$$ 175891 62957 -20940 -254468 156089 -152104 -475675 -398077 31198 -181790 -55843
18582G6727a38580B8295b7018j03717B71414c2391B85390C5848b03588A22762
$$ 76727 -138580 28295 -27018 -130735 271414 -32391 285390 35848 -203588 122762
18571A31830e4072k30103c1101j00753b1164k82540O218c2311A20902k3948J55233
$$ 131830 -54072 -284175 -31101 -131854 -21164 -303704 -297486 -32311 120902 96954 252187
18560B52187A0282b99897J8022J04650j01611R6026A29647o0961k0334J73504
$$ 252187 10282 -299897 -281875 -177225 -278836 -182810 129647 68686 48352 221856
18550B21856f597a867E1638b79221N1103Q0889n9818e7669j34316B05834A0741
$$ 221856 -6597 -1867 51638 -279221 -228118 -147229 -207047 -57669 -191985 205834 10741
18538h7933G9001N246b01627B27561F1218g4746D3209M1535b28535O4393F9320
$$ -87933 79001 84247 -201627 227561 61218 -74746 43209 84744 -228535 -164142 69320
18526B31498a23217A04580b48902R9862d6738j00282d0755k41308o7748B3887
$$ 231498 -123217 104580 -248902 -149040 -46738 -147020 -40755 -282063 -349811 23887
18515a19726E6462a48410O5278A28714a9418B9313K00726d32790B79246a10987
$$ -119726 56462 -148410 -83132 128714 -19418 29313 230039 -432790 279246 -110987
18504B9251d2999m1952j13150C05483G4166f0089A67555a30257A81673C5416R5481
$$ 29251 -42999 -84951 -198101 305483 74166 -60089 167555 -130257 181673 35416 130897
18493A30897b23768A66986K1851c33455d678C43976a22850M6581I5730D3350a82521
$$ 130897 -223768 166986 188837 -333455 -4678 343976 -122850 -76269 95730 43350 -182521
18481A93403b02726A8420c77093h6509j55875f3723j08409A40732b29356H569
$$ 193403 -202726 18420 -377093 -86509 -242384 -63723 -172132 140732 -229356 8569
18470a40217G3339a84340K9529B29477K03813k02265a19842j08830Q4221E8446
$$ -140217 73339 -184340 -154811 229477 433290 231025 -119842 -228672 -144451 58446
18459I8218L64027g9847r4192A7957b06126P8487E9740A9340J43666m6345b31065
$$ 98218 462245 -79847 -174039 17957 -206126 -127639 59740 19340 163006 116661 -231065
18447D8742P1284a11555e1479n2629A32809E3771i2778D2217b27799i4768m7582
$$ 48742 120026 -111555 -51479 -104108 132809 53771 -92778 42217 -227799 -94768 -142350
18436a42350A99176h4679j47015c8910j07555d7472j97002j10440C08654e5079
$$ -142350 199176 -84679 -231694 -38910 -146465 -47472 -244474 -354914 308654 -55079
18425b99433R9273m703F9471c2816m9111A1318J02955J19799d9385k12348N3942
$$ -299433 -200160 -204863 69471 -32816 -81927 11318 114273 234072 -49385 -261733 -207791
18414b07791C5717i3873A28580h3191B49723g8435B25878o9690J59493a52762
$$ -207791 35717 -93873 128580 -83191 249723 -78435 225878 156188 315681 -152762
18403b94935A48374b64494O5760o218E3895K14967a88074e0181H9542a97622A2899
$$ -294935 148374 -264494 -198734 -204952 53895 268862 -188074 -50181 89542 -197622 12899
18391g6457q9146j79401j24286b09695l1685R5570j88367i2092C39411g0909D27255
$$ -76457 -165603 -345004 -469290 -209695 -241380 -145810 -334177 -92092 339411 -70909 427255
18379b84174h2658n7376M7130B32762a85522A68966q1845e858H3263M1872b9317
$$ -284174 -82658 -140034 -92904 232762 -185522 168966 87121 -5858 83263 125135 -29317
18367a66936c5971A31515f3155A12774N5574f7605o6793A46152b66219G2436O8288
$$ -166936 -35971 131515 -63155 112774 168348 -67605 -134398 146152 -266219 72436 140724
18356A40724L991a09110j79047C00747c5943A59344f3991K4504D4057L0887d13931
$$ 140724 144715 -109110 -288157 300747 -35943 159344 -63991 -39487 44057 74944 -413931
18344c28814B70195H527e8957A56148a46998D4119b66009j58358A41744A7979
$$ -328814 270195 8527 -58957 156148 -146998 44119 -266009 -424367 141744 17979
18333c7330k28059m1321i388A406b6708D54281a0914r0785A98720g3703B924g9729
$$ -37330 -265389 -306710 -9388 1406 -26708 454281 -10914 -101699 198720 -73703 2924 -79729
18320a11459I4746a16388A62167g7984K3657g34n4258a1738k3679G9075c7455
$$ -111459 94746 -116388 162167 -77984 -54327 -734 -54992 -11738 -35417 79075 -37455
18308B70482a42535q4886C453M751M2082P9161b1833j8308l51896B9030a52082
$$ 270482 -142535 -227421 3453 8204 50286 129447 -21833 -40141 -392037 29030 -152082
18296b34567e3158K2121D5103a01859m237p02j08560j83178a81706o9670e1761
$$ -234567 -53158 -31037 45103 -101859 -106096 -106798 -215358 -398536 -181706 -251376 -51761
18284i8483p0619B7982a67602C12997b3652k1638j6822k36013g2494D7113M9832
$$ -98483 -169102 27982 -167602 312997 -23652 -45290 -62112 -298125 -72494 47113 96945
18273I6945R6312m0231i3234p8562o3580b8398J2814l62549I6861d9858I7978
$$ 96945 193257 153026 -93234 -171796 -235376 -28398 -15584 -378133 96861 -49858 97978
18261a44358N8490r5717F9432J2985A4857h2464j5930j4206d801k51456D2008
$$ -144358 -85868 -181585 69432 82417 14857 -82464 -98394 -112600 -4801 -256257 42008
18249A5372b54415r1403O4909L7767d6254a1484j21405K9049p9740C58667F6283
$$ 15372 -254415 -345818 -280909 -243142 -46254 -11484 -132889 -103840 -183580 358667 66283
18237a89259P1429p8619k37351C97863a93477E1520A2714h8186H5076a49909A23881
$$ -189259 -117830 -196449 -433800 397863 -193477 51520 12714 -88186 85076 -149909 123881
18225a63412q1423R689A33290K31458c0560o430j20974l3781o9442g9595J4236
$$ -163412 -244835 -235146 133290 364748 -30560 -36990 -157964 -191745 -261187 -79595 -65359
18214f5359A02018a66039C16544F3723a52362e0957m370C33401a51327B16143
$$ -65359 102018 -166039 316544 63723 -152362 -50957 -55327 333401 -151327 216143
18203d5421B60780d5346J4620B02431a45997j49417H8079K43052A63615o3417
$$ -45421 260780 -45346 -30726 202431 -145997 -295414 88079 331131 163615 100198
18193A00198C7859J26173c12569f925B39822b33395J15455A99022a34697j24003
$$ 100198 37859 164032 -312569 -6925 239822 -233395 -117940 199022 -134697 -258700
18183b58700j73427A25308a60991a7213j83072R0101r9708A3835b60284a2290
$$ -258700 -432127 125308 -160991 -17213 -200285 -110184 -209892 13835 -260284 -12290
18172f4424D9832d11303a63796j40504C3491K63856c99952H9302b97072E4747
$$ -64424 49832 -411303 -163796 -304300 33491 297347 -399952 89302 -297072 54747
18161a69948j20770A1820b68329M1580H3626B6199a77526c244l7880I4002a43877
$$ -169948 -290718 11820 -268329 -226749 83626 26199 -177526 -3244 -41124 94002 -143877
18149A45210b06227O8283B61874b62183M0170e9511k28227J25873g9308A47970
$$ 145210 -206227 -137944 261874 -262183 -222013 -59511 -287738 -161865 -79308 147970
18138a55955F2717K00246b96528J34783H2924i438j56503l19833A66707b53188
$$ -155955 62717 262963 -296528 -161745 82924 -9438 -165941 -485774 166707 -253188
18127E344J27252J19600a16942B81844A22300B0758c5116C57771D0607b89854
$$ 5344 132596 252196 -116942 281844 122300 20758 -35116 357771 40607 -289854
18116a56685A72674a58553j8803C6304K55359Q3735a06545b8935k07145a8465
$$ -156685 172674 -158553 -177356 36304 291663 375398 -106545 -28935 -236080 -18465
18105A4394K23296E0736a75372Q3422O419j8280q5462k1459L2045A2864a1657
$$ 14394 237690 50736 -175372 -91950 -85531 -103811 -189273 -210732 -178687 12864 -11657
18093C4477a43576A78998L4057c1630C85422I1247J868C2391c5433j16481C008
$$ 34477 -143576 178998 213055 -31630 385422 91247 93115 32391 -35433 -151914 3008
18081B56439A08826N2727a36620j68608A02346b08285I8725l077b6475E08034
$$ 256439 108826 161553 -136620 -305228 102346 -208285 98725 95648 -26475 508034
18070e2114G59b38284a12292G5649b91632f4098B35754A00595L6675e6376E3457
$$ -52114 759 -238284 -112292 75649 -291632 -64098 235754 100595 137270 -56376 53457
18058a20640A48476d730n5572C41175c6574A91746q3667i3356D08580B8647a87120
$$ -120640 148476 -4730 -60302 341175 -36574 191746 108079 -93356 408580 28647 -187120
18046h7612q3822E8380O6989b16865P5888A4414N6163c76477d4263j06697d0382
$$ -87612 -171434 58380 125369 -216865 -140977 14414 70577 -376477 -44263 -150960 -40382
18034E10458f1081G3149d4010j10134B4712K0365d55932A82964c83774D3233a81802
$$ 510458 -61081 73149 -44010 -154144 24712 45077 -455932 182964 -383774 43233 -181802
18022f9998C5329b54567h8261p6612f3393j81572b6339l7079j2959A75419C7891
$$ -69998 35329 -254567 -88261 -164873 -63393 -244965 -26339 -63418 -76377 175419 37891
18010i9049A79730I597J21466N2366J06645C9456J9459b73131g1463k46428I7223
$$ -99049 179730 9597 131063 183429 290074 39456 58915 -273131 -71463 -317891 97223
17998a04728o9408A11610b298G3486a25990r2045A44847R7746r0952p3162g928
$$ -104728 -174136 111610 -2298 73486 -125990 -218035 144847 242593 151641 78479 -7928
17986A29532a5277k46066B20065I1726a03501D0839c9228d757r6462k16669F4240
$$ 129532 -15277 -261343 220065 91726 -103501 40839 -39228 -4757 -101219 -317888 64240
17974A98146p8192b3280A96634f7370j5886k1684p1638J1328J8905A1307c6886
$$ 198146 119954 -23280 196634 -67370 -83256 -104940 -176578 -165250 -146345 11307 -36886
17962A14562d44902g1901G3734J25197b8906o6752A40124a68153A11276E4363
$$ 114562 -444902 -71901 73734 198931 -28906 -95658 140124 -168153 111276 54363
17951h5045I2289L2561b12466E8227A2327L4480a48662N3439k09383n2684B7071
$$ -85045 92289 124850 -212466 58227 12327 46807 -148662 -95223 -304606 -357290 27071
17939e9570A59366c42258a15246r1813k6512N9359o9753A9900P6690h5761l2898
$$ -59570 159366 -342258 -115246 -207059 -233571 -174212 -243965 19900 96590 -85761 -118659
17928a18659B11052i9830A8396a21965A66297F7352c3427l7925j0710D6121J74478
$$ -118659 211052 -99830 18396 -121965 166297 67352 -33427 -71352 -82062 46121 220599
17917B20599c9299A04298c46644J20177C03442b37766p2640j1385J27229F6121
$$ 220599 -39299 104298 -346644 -226467 303442 -237766 -310406 -321791 -194562 66121
17906C6143O1344K4877J96413c81852P1308A55957J07267O8852m846A2380K3246
$$ 36143 97487 122364 318777 -381852 -310544 155957 263224 332076 327230 12380 35626
17895C5626K60923c47901C27937J3109e2733F7724c9148E6522b25687B5129c1195
$$ 35626 296549 -347901 327937 341046 -52733 67724 -39148 56522 -225687 25129 -31195
17883c63480F6490J8458a80108C5425c4539D7414i6777M6165D1572h1916j39874
$$ -363480 66490 84948 -180108 35425 -34539 47414 -96777 -50612 41572 -81916 -221790
17872b21790k980A21622a08380E222L00029a32106k9932P7065n1033d2926j3744
$$ -221790 -224770 121622 -108380 5222 305251 -132106 -162038 -84973 -136006 -42926 -56670
17861e6670D6968c4606C3426i6073j73145b2649C5386J27138f2041F9307d08392
$$ -56670 46968 -34606 33426 -96073 -269218 -22649 35386 162524 -62041 69307 -408392
17849b17683a9870A25177c29597B00098d3758j47699B6896M5869C516b33008f0571
$$ -217683 -19870 125177 -329597 200098 -43758 -191457 26896 72765 3516 -233008 -60571
17837C1934b7996H791M25892b22959B08574C3266b69189L7798A52986a50919A08667
$$ 31934 -27996 8791 434683 -222959 208574 33266 -269189 -231391 152986 -150919 108667
17825B1664K03480c49203J61748g5444q9049P7140B55911b20656A35061c9721
$$ 21664 225144 -349203 -187455 -75444 -164493 -87353 255911 -220656 135061 -39721
17814d3801m1824D38666c52837A55197g1158C5464Q3454a03096a955A80595b2672
$$ -43801 -85625 438666 -352837 155197 -71158 35464 118918 -103096 -1955 180595 -22672
17802B305K15012b23686a3298B92272E7809C117b35743f423j15455l00518B03307
$$ 2305 217317 -223686 -13298 292272 57809 3117 -235743 -6423 -121878 -422396 203307
17790A70545j8981C3037K54867b04160A89801g2539a5111B79700b93774b1583
$$ 170545 151564 33037 287904 -204160 189801 -72539 -15111 279700 -293774 -21583
17779a86885A82256B2599K51041a58187L8692j30087A65732g444E32361B63930
$$ -186885 182256 22599 273640 -158187 -119495 -249582 165732 -7444 532361 263930
17768A28250b40900a00374d7694q2797d5398A13594K57009b9001A59688c31400
$$ 128250 -240900 -100374 -47694 -130491 -45398 113594 370603 -29001 159688 -331400
17757f9007A06770i3396A15090P4936a65213C28881C7000J7119h8031K9247j36044
$$ -69007 106770 -93396 115090 190026 -165213 328881 37000 54119 -88031 -58784 -194828
17746a94828A07150O8035J20008h1845A09442N8608c91176a29560A60618j1941
$$ -194828 107150 175185 295193 -81845 109442 168050 -391176 -129560 160618 148677
17736A48677J74701D7204M07714i0189l0936R017A19880j1725j0739K43252J17308
$$ 148677 323378 47204 454918 -90189 -121125 -112108 119880 108155 97416 340668 457976
17725D57976k19495a33595j09721A03664a32942A57219b53386f7531F5754J6870
$$ 457976 238481 -133595 -243316 103664 -132942 157219 -253386 -67531 65754 82624
17715H2624J56061a81433E6161P9086L943b64677l9256B0077b08855R8686A44757
$$ 82624 238685 -181433 56161 135247 139190 -264677 -303933 20077 -208855 -110169 144757
17703b47904A15568b08599i3362C4150b73476G1270d3504A40960a34136B91232
$$ -247904 115568 -208599 -93362 34150 -273476 71270 -43504 140960 -134136 291232
17692a8950j64996B12658B2576L16297h488E3532L53433b88457B6873K76458J14874
$$ -18950 -183946 212658 22576 338873 -8488 53532 406965 -288457 26873 303331 418205
17681D18205b24743B20523b21279e0441l9280d4364C5634b91574G4392a98377
$$ 418205 -224743 220523 -221279 -50441 -89721 -44364 35634 -291574 74392 -198377
17670B06990b25546H9893J54424H0662f501r1011A46062i3985m8015J4407b7053
$$ 206990 -225546 89893 244317 80662 -6501 -97512 146062 -93985 -142000 -127593 -27053
17658B51660A590b07234H3706Q055M660K4146J14205k4734d55017a77361B70155
$$ 251660 1590 -207234 83706 91761 96421 120567 234772 210038 -455017 -177361 270155
17646b80849e8627D0299d9364k0396l933k14182B17564i9696B85384M3448A07698
$$ -280849 -58627 40299 -49364 -69760 -73693 -287875 217564 -99696 285384 328832 107698
17634a98964P9259A04142K03311k3799J6811j42735B9129b77954F6754b96415
$$ -198964 -119705 104142 307453 283654 300465 157730 29129 -277954 66754 -296415
17623a3965l16646A89631a44241B38257j13995m7282i991G9666O7018a21411j89843
$$ -13965 -330611 189631 -144241 238257 124262 76980 -9991 79666 146684 -121411 -311254
17612c11254e1653B78078C4287b28414J04511B68527E0064a37640N2747B25814
$$ -311254 -51653 278078 34287 -228414 -123903 268527 50064 -137640 -84893 225814
17601A66610J07900b42715P1124m524C05435e4361n5443a2103A78948i3808B10783
$$ 166610 274510 -242715 -171591 -176115 305435 -54361 -109804 -12103 178948 -93808 210783
17589b1882j04836D07375A43078h6096A12558h9619G7595A6787c0845C5808P882
$$ -21882 -126718 407375 143078 -86096 112558 -89619 77595 16787 -30845 35808 43690
17578D3690J56133o2921h834A62408a78604A19329b6276j43093G9835c23089f5966
$$ 43690 199823 136902 -8834 162408 -178604 119329 -26276 -169369 79835 -323089 -65966
17566C1395a75225B13920g3739H780a57633A66240a16956F4600a19456N228c6418
$$ 31395 -175225 213920 -73739 8780 -157633 166240 -116956 64600 -119456 -114228 -36418
17554a27196J0060B67531D7440a03706d8759j47732c2525B29788i8974k61260
$$ -127196 -117136 267531 47440 -103706 -48759 -196491 -32525 229788 -98974 -360234
17544c60234A11290R1042q6532J6667I417a47627A81589d5656A93845b3745k20470
$$ -360234 111290 202332 115800 132467 9417 -147627 181589 -45656 193845 -23745 -244215
17533b44215d5809G4836b4722r03E2812g3744I4439m4684b12214b5615B3123R0198
$$ -244215 -45809 74836 -24722 -25625 52812 -73744 94439 49755 -212214 -25615 23123 113321
17521A13321K40634A28021Q8461c9454B78907a66399e0477B35273M0479a8700
$$ 113321 353955 128021 216482 -39454 278907 -166399 -50477 235273 275752 -18700
17510a40874j01316F2324L45505I2995B2959g706A65067c14952A59606P6370E3841
$$ -140874 -242190 62324 407829 92995 22959 -7706 165067 -314952 159606 235976 53841
17498e3178l7822K304b4778k33327C65796j14104D5851d0786p4598I9363K25064
$$ -53178 -91000 -88696 -24778 -258105 365796 251692 45851 -40786 -115384 99363 324427
17487C24427j58579p7925K50075o496b18647R197O7145C5387a93642d3017n9398
$$ 324427 165848 87923 337998 331502 -218647 -209450 -142305 35387 -193642 -43017 -102415
17476a02415j65332E2365f5394A3554J52068M2778G6896b298B40277L28105a19994
$$ -102415 -267747 52365 -65394 13554 165622 208400 76896 -2298 240277 568382 -119994
17464A44214a80831o3933E2919h966A87470H1438J44267J64696j08317C1928J4959
$$ 144214 -180831 -244764 52919 -8966 187470 81438 225705 390401 282084 31928 46887
17453D6887J78869k625J61291A73251E821J94958E4716L12334M3271k03939k1481
$$ 46887 225756 223131 384422 173251 5821 200779 54716 367050 410321 206382 184901
17442A84901N6120j19366Q788N6315K6116q5473e2915A62655N1716J88172e2254
$$ 184901 241021 121655 130443 186758 212874 127401 -52915 162655 214371 402543 -52254
17430D99947B37549K03073A20143K05113D7594L71131j91898k9258a21161B14739
$$ 499947 237549 440622 120143 325256 47594 418725 226827 197569 -121161 214739
17419C38414N4446J7976q1698j54098K3651L82798k44047A44481a32172A91092
$$ 338414 392860 410836 329138 175040 198691 581489 337442 144481 -132172 191092
17408D86872B13878J00348l5133F0955K17561J79497k22065R8396a58810C39057
$$ 486872 213878 314226 279093 60955 278516 458013 235948 334344 -158810 339057
17397D15747f261k5215F7573J48317J27268o2378I7278c4306C4553J38986F569
$$ 415747 -6261 -31476 67573 215890 343158 280780 97278 -34306 34553 173539 6569
17385C99604F4033K82490k4292A10862J93407L7020A5981e6792J4904A58939J3411
$$ 399604 64033 346523 322231 110862 304269 341289 15981 -56792 -41888 158939 172350
17374A72350c36066f2871A42226G049J19174R7452q973G1189N903a90131c0158
$$ 172350 -336066 -62871 142226 7049 126223 223675 214702 71189 77092 -190131 -30158
17362a0556j20155A23815K91742A16704m0551a23624F3873J20682J70317F209
$$ -10556 -130711 123815 415557 116704 76153 -123624 63873 184555 354872 6209
17351A0301J05328l455b76882i4269D4651J28240c0596M587B1655K97852C37J37346
$$ 10301 115629 112174 -276882 -94269 44651 172891 -30596 -26009 21655 319507 337 137683
17339A37683b53634L0302A89297O2986P8253A00328a65111G8734M8273B363J90348
$$ 137683 -253634 -223332 189297 252283 330536 100328 -165111 78734 127007 2363 192711
17328A92711K9870B148b2338B46137J35933L8820a12167c6075A84286o6466n6416
$$ 192711 222581 2148 -22338 246137 382070 420890 -112167 -36075 184286 117820 61404
17317F1404L0110J69005A8082k272d690A61267K72138j19000D6939J32569n3920
$$ 61404 91514 260519 18082 15810 -4690 161267 433405 314405 46939 179508 125588
17306A25588J51895A9933c4159B83580K1884i1853j23876B38096E5983a78070
$$ 125588 277483 19933 -34159 283580 305464 -91853 -215729 238096 55983 -178070
17295f8601B58999L0420A06303a51448A2716L02908L1047r3255J0318A00925K45529
$$ -68601 258999 289419 106303 -151448 12716 315624 346671 253416 263734 100925 346454
17284C46454q6911L6227G5625a14632A46320E117b5624A65050K0222G2504j2477
$$ 346454 259543 295770 75625 -114632 146320 5117 -25624 165050 185272 72504 60027
17273F0027b47088c5343q164C65691b23576c8040p3423N2895B88409G9980j7435
$$ 60027 -247088 -35343 -43507 365691 -223576 -38040 -111463 -58568 288409 79980 62545
17262F2545k7522J30893b4958D44789j37005A37930Q9669r3263C2948L31258J09919
$$ 62545 35023 165916 -24958 444789 307784 137930 227599 134336 32948 364206 474125
17251D74125d5327n0039D00606i3963A43907i800F4170a23058r9731C18322m1192
$$ 474125 -45327 -95366 400606 -93963 143907 -9800 64170 -123058 -222789 318322 277130
17240B77130N4054a05633C14487e0942A26983O7277B7835a26183A14354P6026
$$ 277130 331184 -105633 314487 -50942 126983 194260 27835 -126183 114354 190380
17230A90380J09802R947a12814C75690j46712g1226k5585B82127J63141A99636
$$ 190380 300182 310129 -112814 375690 228978 -71226 -96811 282127 445268 199636
17219A50309J89448H3539K01223A07776A8576L48380G2207K46221J2559c8364
$$ 150309 339757 83539 284762 107776 18576 366956 72207 318428 330987 -38364
17208A21778J80152J09854a5069C57362n4497K22537j11721j57353j18372a20811
$$ 121778 301930 411784 -15069 357362 302865 525402 413681 256328 137956 -120811
17197C31571M1774j05158J94507B26504a93068B26080D5194M944L31702c2031
$$ 331571 373345 268187 462694 226504 -193068 226080 45194 50138 381840 -32031
17186B19611N6242J52306n3905A03608M11738k41962L1434j8419k5004P8392A62676
$$ 219611 275853 428159 374254 103608 515346 273384 304818 286399 261395 339787 162676
17174B05228J00967G8816M6518a11778Q31B20942H0002J33029p9440K07185A54391
$$ 205228 306195 78816 125334 -111778 -110947 220942 80002 213031 133591 340776 154391
17162B4831L30267j10956N3095J09234j6203A93401c7540D72627n8302A32622
$$ 24831 355098 244142 297237 406471 390268 193401 -37540 472627 414325 132622
17151A03966A3744J77143J29866L35575C00218P6404O8885j50202l1077l8001
$$ 103966 13744 190887 320753 656328 300218 376622 445507 295305 264228 226227
17141B26227L66071A85305K72800D5849a17288H53252A07614J16704J63840f1503
$$ 226227 592298 185305 458105 45849 -117288 853252 107614 224318 388158 -61503
17130B72767J42254K434A26492L75997L47529m11599M18447A87504k562J35418
$$ 272767 415021 417455 126492 502489 850018 438419 856866 187504 184942 320360
17120C20360K53000j54600D8735K29606k8172R9789K4077P0986Q213J44180c186
$$ 320360 573360 418760 48735 278341 250169 349958 374035 445021 453234 597414 -3186
17108A55019L74460p5058j59412J29771A81650J71558j16832j01037J85489Q9433
$$ 155019 529479 454421 295009 424780 181650 353208 236376 135339 320828 410261
17098D10261L0413j96313J74309m3632M3543E412K31056J37202K62489q6621j65435
$$ 410261 440674 244361 418670 375038 418581 5412 236468 373670 636159 549538 384103
17087C84103n5957J85031q1136l5911p5704K51771k13751q5413L35333k46187
$$ 384103 328146 513177 432041 396130 320426 572197 358446 273033 608366 362179
17077C62179L3626r2751Q9224A90288N38189C53478N3932J36595k17822I4273
$$ 362179 395805 303054 392278 190288 728477 353478 407410 544005 326183 94273
17066D95513n1887J25982k25094j03817L55144J50481j18213j89949j08835M00010
$$ 495513 443626 569608 344514 240697 595841 746322 628109 438160 329325 729335
17056G29335j01514J25312j13620l15326K6615J3285A57025L69020j464j44915
$$ 729335 627821 753133 639513 324187 350802 364087 157025 526045 524581 379666
17046C79666K52212Q6844l04444J47763B53054O21735k81157O1100o8875O6234
$$ 379666 631878 718722 414278 562041 253054 874789 593632 654732 585857 652091
17036F52091l9497j51400M4266N4133k62909P6517M23483l7900j43393J29223
$$ 652091 612594 461194 505460 559593 296684 373201 796684 758784 615391 744614
17026G44614j55304p2476J2382L19965C5582M86015P4378M4471k88217M05939
$$ 744614 589310 516834 529216 849181 35582 521597 595975 640446 352229 758168
17016G58168l70116L2800Q8522R2274l8638K11095p0510C23886L75089j29484
$$ 758168 388052 420852 509374 601648 563010 774105 703595 323886 698975 569491
17006E69491r2236M97468k59841k74679L79263l44367L07854j76406K74609l87901
$$ 569491 477255 974723 714882 440203 819466 475099 782953 606547 881156 493255
16996D93255K81914m3427O234k67214M02897j11786j98307J1988J59329l64313
$$ 493255 775169 731742 737976 470762 873659 761873 563566 575554 734883 370570
16986C70570M72763j71225J50983J27063k9765m0367D32004L28523Q9734j92366
$$ 370570 843333 672108 823091 950154 920389 880022 432004 760527 850261 657895
16976F57895p916l2712N77548n88432r2514M25919k80271N84172k01382L2875
$$ 657895 649979 617267 1194815 606383 513869 939788 659517 1243689 1042307 1075182
16966A075182l00369n4548J5553j26883N08544K6470j60047l26753j0699N85456
$$ 1075182 774813 720265 735818 608935 1117479 1143949 983902 657149 646450 1231906
16956A231906l27315J08723P3420L23112l92785K22631l98634L58515r4330k19103
$$ 1231906 904591 1013314 1086734 1409846 1017061 1239692 841058 1199573 1105243 886140
16946H86140K57065k02929L43678l26070L36680l80842J71999M03154M0468l29451
$$ 886140 1143205 940276 1283954 957884 1294564 913722 1085721 1488875 1529343 1199892
16936A199892j77090R299O246M00706l43824L51408o8976n09096N50128J240k80655
$$ 1199892 1022802 1032101 1038347 1439053 1095229 1446637 1377661 868565 1418693 1419933 1139278
16925A139278L64457R7326j92605j18242P9020P1363j59819K17177J03166j53150
$$ 1139278 1503735 1601061 1408456 1290214 1369234 1440597 1280778 1497955 1601121 1447971
16915A447971J00361k93677J72328J8158O5134N0640M02764m84142l62052N48025
$$ 1447971 1548332 1254655 1426983 1445141 1510275 1560915 1963679 1479537 1117485 1665510
16905A665510k4039j59268J93220J89164l17850L10568K10112k77594J80844o6226
$$ 1665510 1641471 1482203 1675423 1864587 1546737 1857305 2067417 1789823 1970667 1904441
16895A904441j375k14378K54461J04709j06981N0926L48930o80694M3597K85414
$$ 1904441 1903066 1688688 1943149 2047858 1940877 1991803 2340733 1660039 1703636 1989050
16885A989050J92868j92064L7399j21420N10987n46375N32240J4521r8528M2053
$$ 1989050 2181918 1989854 2027253 1905833 2416820 1870445 2402685 2417206 2318678 2360731
16875B360731m5243Q4698o4936J64102l32709P80450m35835l6435J27168J73021
$$ 2360731 2315488 2400186 2335250 2499352 2166643 2947093 2511258 2474823 2601991 2775012
16865B775012q7740R5898k68938M15143j74316L81340o35168P26816l95391K47762
$$ 2775012 2687272 2783170 2514232 2929375 2755059 3136399 2501231 3228047 2832656 3080418
16855C080418j52049L90917j29258q4422N0562J73318j14469J40692k17821N47305
$$ 3080418 2928369 3319286 3190028 3105606 3156168 3329486 3215017 3355709 3137888 3685193
16845C685193r3868J56759j96344L22975j17917k3146J08497K77464M19973m54541
$$ 3685193 3591325 3748084 3551740 3874715 3756798 3733652 3842149 4119613 4539586 4085045
16835D085045N21520l53062R0894O2206K99814l28982K41520M14323R2198J93006
$$ 4085045 4606565 4253503 4344397 4406603 4706417 4377435 4618955 5033278 5125476 5318482
16825E318482j85761l6449J27643q5049K81704J38642j65622J98391M4113L98438
$$ 5318482 5132721 5096272 5223915 5138866 5420570 5559212 5393590 5591981 5636094 6034532
16815F034532K8109K77288Q7935o2873J27339j82353M79844J9655J07067k86143
$$ 6034532 6062641 6339929 6427864 6364991 6492330 6309977 6789821 6809476 6916543 6630400
16805F630400R42048k79068O21339L6106M01637k89307N46673k43083M89776M07943
$$ 6630400 7572448 7293380 7914719 7950825 8352462 8063155 8609828 8366745 8856521 9264464
16795I264464R5267L38996J75304j12489N05385P9450M04893K84246L52309L70199
$$ 9264464 9359731 9698727 9874031 9761542 10266927 10346377 10751270 11035516 11387825 11758024
16785A1758024J72204L39910O26850L22743R3654L72637O71179K41541L97208
$$ 11758024 11930228 12270138 12896988 13219731 13313385 13686022 14357201 14598742 14995950
16776A4995950N34140P45012K0243J055657L36767Q45879L00159P56340J159320
$$ 14995950 15530090 16275102 16295345 17351002 17687769 18533648 18833807 19590147 20749467
16767B0749467M10907M94680J107109O53787Q86486R75787J174498R42349Q85594
$$ 20749467 21160374 21655054 22762163 23415950 24302436 25278223 26452721 27395070 28280664
16758B8280664J829047J018391J470643J493960J104102K028484J357517J902369
$$ 28280664 30109711 31128102 32598745 34092705 35196807 37225291 38582808 40485177
16750D0485177K019158K230838J731378K668503K371721K492150L160344L198174
$$ 40485177 42504335 44735173 46466551 49135054 51506775 53998925 57159269 60357443
16742F0357443L163030K923688L816722M279783L777530M448835M644069N279194
$$ 60357443 63520473 66444161 70260883 74540666 78318196 82767031 87411100 92690294
16734I2690294N408260N291996N679299O050118O207317O529509O640260O242304
$$ 92690294 98098554 103390550 109069849 115119967 121327284 127856793 134497053 140739357
16726A40739357O517172N919843N628479N436370M681250L947949L189369K019318
$$ 140739357 147256529 153176372 158804851 164241221 168922471 172870420 176059789 178079107
16718A78079107J137396O64846j302913j629230k786968l297758m731120n367402
$$ 178079107 179216503 179881349 178578436 176949206 174162238 170864480 166133360 160765958
16710A60765958n696404n773105o380990o287540o776540o281285o494529n959756
$$ 160765958 155069554 149296449 142915459 136627919 129851379 123570094 117075565 111115809
16702A11115809o006843n700301n297910n050058n284902m354471m126610m450807
$$ 111115809 105108966 99408665 94110755 89060697 83775795 79421324 75294714 70843907
16694G0843907l288657m115809k954551l195258l075927k483764k849017k181945
$$ 70843907 67555250 63439441 60484890 57289632 54213705 51729941 48880924 46698979
16686D6698979k241097j855732k412427j783359j359866j889557j965824j169796
$$ 46698979 44457882 42602150 40189723 38406364 37046498 35156941 33191117 32021321
16678C2021321j002430j283925j335076j408276o98925r65339j429189n34375
$$ 32021321 31018891 29734966 28399890 26991614 26292689 25327350 23898161 23363786
16670B3363786q24023j204850q64868m05718p15692r15090k89292q59440m72803
$$ 23363786 22539763 21334913 20470045 20064327 19348635 18433545 18144253 17284813 16812010
16661A6812010r52067N5703o27758m84150n16194l89752q9822o29791j72256k65180
$$ 16812010 15859943 15915646 15287888 14803738 14287544 13897792 13807970 13178179 13005923 12740743
16651A2740743p68028j65051l80440n07057j57751l15464p43132O9392r3665k59790
$$ 12740743 11972715 11807664 11427224 10920167 10762416 10446952 9703820 9773212 9679547 9419757
16641I419757o5850m54720j5100k50636k92647l5502l19754n58237K36954k27283
$$ 9419757 9353907 8899187 8884087 8633451 8340804 8305302 7985548 7427311 7664265 7436982
16631G436982j55798k96244j70951j83123m46852M99231o15043M1668m09713K23896
$$ 7436982 7281184 6984940 6813989 6630866 6184014 6683245 6068202 6109870 5700157 5924053
16621E924053k74103j28000l0121j17240N5465j71211n19744P03377r11093L80174
$$ 5924053 5649950 5521950 5491829 5374589 5430054 5258843 4739099 5442476 4531383 4911557
16611D911557l48047J12640r837q650m88298M0979k47956r4676J24608j30600
$$ 4911557 4563510 4676150 4666313 4657663 4169365 4210344 3962388 3867712 3992320 3861720
16601C861720j52312o3473o1315n6957Q081L6950l73819m950K26064j92637O9224
$$ 3861720 3709408 3645935 3584620 3527663 3535744 3572694 3198875 3193925 3419989 3227352 3296576
16590C296576o33536J90415K26782m6591j27423k45398M75702k82298j6444J24563
$$ 3296576 2663040 2853455 3080237 3033646 2906223 2660825 3136527 2854229 2837785 2962348
16580B962348k91580k17281M45917l13999j4561l8282J25346j01162k16425J40762
$$ 2962348 2670768 2453487 2899404 2585405 2570844 2532562 2657908 2556746 2340321 2481083
16570B481083j51950J41538O1442j80657m60147K51698L62386l46930O229K4349
$$ 2481083 2329133 2470671 2532113 2351456 1891309 2143007 2505393 2158463 2164692 2189041
16560B189041k18249K65204k32838q39Q2667Q3747J82994o14909Q4104L70867
$$ 2189041 1970792 2235996 2003158 2002319 2084986 2168733 2351727 1736818 1820922 2191789
16550B191789j99407l2635m4746k58342L78328k7929j71049n665K88703m5084
$$ 2191789 1992382 1959747 1915001 1656659 2034987 2007058 1836009 1830344 2119047 2073963
16540B073963n23198k8769K50799r3432K13523l33881j79420j26578M17536r1990
$$ 2073963 1550765 1521996 1772795 1679363 1892886 1559005 1379585 1253007 1670543 1578553
16530A578553J38688k64373J7206J18476K30834n52153K69512l05764J61211k69469
$$ 1578553 1717241 1452868 1470074 1588550 1819384 1267231 1536743 1230979 1392190 1122721
16520A122721L92263k14009k85048N7150k09764L82902M006N7098k48661r4352
$$ 1122721 1514984 1300975 1015927 1073077 863313 1246215 1250221 1307319 1058658 964306
16510I64306K31820J11006p4809N6238j42944K04446l19658k23013J53270N98983
$$ 964306 1196126 1307132 1232323 1288561 1145617 1350063 1030405 807392 960662 1559645
16500A559645n35609L21999k26052j67596K83021k87784J48284l25953N04438
$$ 1559645 1024036 1346035 1119983 952387 1235408 947624 1095908 769955 1274393
16491A274393j59642j69877O1197k16345K41115n6746j41127N9358N7167k31156
$$ 1274393 1114751 944874 1006071 789726 1030841 974095 832968 892326 949493 718337
16481G18337K63317l38360M54990l05075J2516l06433J61905L69291L0598j31645
$$ 718337 981654 643294 1098284 793209 805725 499292 661197 1030488 1061086 929441
16471I29441j75500l32912N83215j93773q4033K37246J6856k84428j45873N25754
$$ 929441 753941 421029 1004244 810471 726438 963684 980540 696112 550239 1075993
16461A075993l86312L30097l79518J80392j54243j43927K65965K9398Q847J58860
$$ 1075993 689681 1019778 640260 820652 666409 522482 788447 817845 826692 985552
16451I85552k27791j30227R5378J88563C64334N89411l95074J61342m310j41742
$$ 985552 757761 627534 722912 911475 364334 953745 558671 720013 715703 573961
16441E73961J34507k11127k7741L76454j04763j39335K7139K01649O8243l88132
$$ 573961 708468 497341 469600 846054 741291 601956 629095 830744 898987 510855
16431E10855Q4534J64048k16134j48869M32533l94247k9867j7015M66303m17628
$$ 510855 595389 759437 543303 394434 826967 432720 402853 385838 852141 434513
16421D34513j3753N4198A95499K06207J14456p6512p2926r2564J77111J83636
$$ 434513 420760 474958 195499 401706 516162 439650 366724 274160 451271 634907
16411F34907q9955j96666O7178A20394K26460M7651J68009O7400B18274L0558
$$ 634907 544952 348286 415464 120394 346854 394505 562514 629914 218274 248832
16401B48832L23064p479O2755j17692K74144j20509r2135G9782L75607k4093A34962
$$ 248832 571896 564417 627172 509480 783624 663115 570980 79782 455389 431296 134962
16389E11746k27722p5725K24184J03444M8945d219D33737o0131A66781m4660C5538
$$ 511746 284024 208299 432483 535927 584872 -4219 433737 373606 166781 122121 35538
16377A57573K24593J71433k40079k5977r9235K87376j61883j16475L2324K13827
$$ 157573 382166 553599 313520 287543 188308 475684 313801 197326 229650 443477
16367D43477j65167K53426K1421k41241L2039J45629K08843b3112C16745j31084
$$ 443477 278310 531736 553157 311916 343955 489584 698427 -23112 316745 185661
16357A85661K43045j14416K97260k80450A9950J95951P3728q7735J96861j87890
$$ 185661 428706 314290 611550 331100 19950 215901 289629 201894 398755 210865
16347B10865M15672F2377M6706L20053A52010K25585K5959j14380j06389L17990
$$ 210865 626537 62377 109083 429136 152010 377595 403554 289174 182785 500775
16337E00775j02470M6534J80878C3536b7440B55117j11245L69778A91468N006
$$ 500775 398305 444839 625717 33536 -27440 255117 143872 513650 191468 196474
16327A96474J61376K4654a3C67472a11847B69479F7214K15391L6374J39003j12310
$$ 196474 357850 382504 -13 367472 -111847 269479 67214 282605 318979 457982 345672
16316C45672J07293n1811A6681K14627J85696j25206J6990K20785A91510n7761
$$ 345672 452965 401154 16681 231308 417004 291798 308788 529573 191510 133749
16306A33749j8050M60649B04089J75100a52481A10131J04223g7483A32343J16799
$$ 133749 115699 576348 204089 379189 -152481 110131 214354 -77483 132343 249142
16296B49142p8485L23531k14486B6154J23739a34130A27996f6050A66833a61835
$$ 249142 170657 494188 279702 26154 149893 -134130 127996 -66050 166833 -161835
16285A67572L14294l9723j68418j15242J06433q2242j3063K48759A52252M1429
$$ 167572 481866 442143 273725 158483 264916 182674 169611 418370 152252 193681
16275A93681K4046J01392J6944j03810i6085A43969g6495A7092K91524G5171J98137
$$ 193681 217727 319119 336063 232253 -96085 143969 -76495 17092 308616 75171 273308
16264B73308J66672j65910L09354B81133E1518c7479n899C55660r8492H0613r926
$$ 273308 439980 274070 583424 281133 51518 -37479 -43378 355660 257168 80613 70687
16253G0687M7441J48668j5322G4229J34500J40577a86080B58337R8833a85806
$$ 70687 118128 266796 251474 74229 208729 349306 -186080 258337 357170 -185806
16242B25015Q4467C2423J05339K91479A84850g9033A80553K9711m4184J9535b8529
$$ 225015 309482 32423 137762 429241 184850 -79033 180553 210264 166080 185615 -28529
16230C44334O8134n9730A06823P6389b2868F3197a44056C66647G6008H306e9653
$$ 344334 412468 352738 106823 183212 -22868 63197 -144056 366647 76008 8306 -59653
16218F1721J73280a13558D94213a41407A53254i4395C88730g6158C3223M6885
$$ 61721 235001 -113558 494213 -141407 153254 -94395 388730 -76158 33223 80108
16208H0108d623o4755B94806e9826j01171d052B64157j22001n00e5113C40813
$$ 80108 -4623 -69378 294806 -59826 -160997 -4052 264157 142156 141656 -55113 340813
16196a64822G022K59139J28822A0301Q6935R0219a86602C32701e8545b3442k41694
$$ -164822 7022 266161 394983 10301 97236 187455 -186602 332701 -58545 -23442 -265136
16185b65136A10248l4380J61609A02951d5372C68858F297h8260A09043O1807g3432
$$ -265136 110248 75868 237477 102951 -45372 368858 6297 -88260 109043 170850 -73432
16173E04996H2388A7780j69M19321b46566E2249b42703A29492m5236j4600K92376
$$ 504996 82388 17780 17611 436932 -246566 52249 -242703 129492 84256 69656 362032
16162C62032J63114d4840B46249a95287G7525L4894f3052F2082c33369C9513o83
$$ 362032 525146 -44840 246249 -195287 77525 112419 -63052 62082 -333369 39513 38830
16151C8830b82265J8548A56701b75333I8007b51053A2347P187P2522f0327b5237
$$ 38830 -282265 -263717 156701 -275333 98007 -251053 12347 19534 92056 -60327 -25237
16139I6093D3790P4619A5379J06777M8905b3373q0816A9458L5414L6555i698F8201
$$ 96093 43790 118409 15379 122156 171061 -23373 -104189 19458 54872 91427 -9698 68201
16126G6521Q6110e6264J592I3616D3267A1320L38830F8057f7196A83126j6448
$$ 76521 162631 -56264 -54672 93616 43267 11320 350150 68057 -67196 183126 166678
16115A66678b38679C62236C6729b36828j03786Q3969D4235M2725a3197o1052C0026
$$ 166678 -238679 362236 36729 -236828 -340614 -256645 44235 86960 -13197 -74249 30026
16103c2705C3874a21699B14680d4781A10650b00669Q6008K8893A31733a06334
$$ -32705 33874 -121699 214680 -44781 110650 -200669 -114661 -85768 131733 -106334
16092A00977e8924q7921N3948B68190n5354n2712c64678H4051b83510i3876k3613
$$ 100977 -58924 -146845 -92897 268190 212836 160124 -364678 84051 -283510 -93876 -117489
16081a17489k3277q2932D9375J76775f4152B56183a23303a2345C03585E7752J22533
$$ -117489 -140766 -223698 49375 226150 -64152 256183 -123303 -12345 303585 57752 180285
16070A80285r304a98762j33089c0959m318j38559p571A83613D3104L7759a34587
$$ 180285 170981 -198762 -331851 -30959 -35277 -173836 -181407 183613 43104 80863 -134587
16058b97247a34510b7814A57343m7314a86336m8997j42443B48824F0557K48008
$$ -297247 -134510 -27814 157343 110029 -186336 -235333 -377776 248824 60557 308565
16048C08565e6043k24727i8441A43337a95757D62836E6096D744J65496E7159P2951
$$ 308565 -56043 -280770 -98441 143337 -195757 462836 56096 4744 170240 57159 130110
16037A30110L95915G7630Q89a77669P1036j1937d3899j11972G9257J18610A9494
$$ 130110 526025 77630 78519 -177669 -106633 -118570 -43899 -155871 79257 197867 19494
16025D928K37400H2634A81a1024D4943b15189r3140C50594o8483H2147f2078A96087
$$ 4928 242328 82634 181 -11024 44943 -215189 -308329 350594 282111 82147 -62078 196087
16012C92735r6597a01513B42311m5910c30155B9835K79484A18735e36787b55175
$$ 392735 296138 -101513 242311 196401 -330155 29835 309319 118735 -536787 -255175
16001c39725D5344R0585d9909A22724a82663I4065K48902a46170A27649g2222
$$ -339725 45344 135929 -49909 122724 -182663 94065 342967 -146170 127649 -72222
15990C8817c90777a73698H5798a91249f3694l9344r4045D2721N8672a97049B89564
$$ 38817 -390777 -173698 85798 -191249 -63694 -103038 -197083 42721 101393 -197049 289564
15978A72923J38749q7857a62097o1868a7081E34646d8055l76405d8257j09715
$$ 172923 311672 223815 -162097 -223965 -17081 534646 -48055 -424460 -48257 -157972
15968a57972H9893a50118A15376b9422A64157F7822f4408G5731c00873C12424
$$ -157972 89893 -150118 115376 -29422 164157 67822 -64408 75731 -300873 312424
15957a0448B52673f0466C98192d02578A39984D3072p877a98061m4278P0329j35511
$$ -10448 252673 -60466 398192 -402578 139984 43072 35195 -198061 -242339 -172010 -307521
15946c07521J43977B6327N8309b58m27131A7275J06847b79117G4191a87077p7126
$$ -307521 -163544 26327 84636 -258 -427389 17275 124122 -279117 74191 -187077 -264203
15935b64203I3217b01071j04463N6729A2778J00207J96286p8975A03417a8769
$$ -264203 93217 -201071 -305534 -248805 12778 112985 309271 230296 103417 -18769
15924B5493K61880B222g9746a4719A16516E5852L71927A0079a148F4232b07556
$$ 25493 287373 2222 -79746 -14719 116516 55852 427779 10079 -1148 64232 -207556
15912b13638G3920f9137j92189P7133N3430D0346a35966l3455j74817c3674q1690
$$ -213638 73920 -69137 -261326 -184193 -130763 40346 -135966 -169421 -344238 -33674 -115364
15901a15364b66B49029J32787B9855b51276B50484c86667e4091j5516J8098k40098
$$ -115364 -266 249029 381816 29855 -251276 250484 -386667 -54091 -69607 -51509 -291607
15890b91607O9252b9578l2880C29819A10068b81446C46520C9173b55755A28866
$$ -291607 -222355 -29578 -62458 329819 110068 -281446 346520 39173 -255755 128866
15879a97770B54265A0154a25608A50612a42482A20284H795d02900A66342a87701
$$ -197770 254265 10154 -125608 150612 -142482 120284 8795 -402900 166342 -187701
15868e4962k34297I263J61307c4134k49195E5814J17989c04260Q1795G3000K15698
$$ -54962 -289259 9263 170570 -34134 -283329 55814 173803 -304260 -222465 73000 288698
15857B88698a95127d5019A25269j1993J45344P2617c84149A91518I3102N436b78634
$$ 288698 -195127 -45019 125269 113276 258620 331237 -384149 191518 93102 98538 -278634
15845a8057A46623f6361o8204B31734H0305a41133B7095N1631g4989N612B71682
$$ -18057 146623 -66361 -134565 231734 80305 -141133 27095 78726 -74989 -69377 271682
15833A09039P9623g2283J5328J2269p8766c0521j61233f6299M760l8366M4962
$$ 109039 188662 -72283 -56955 -44686 -123452 -30521 -191754 -66299 -61539 -99905 -54943
15822e4943A49899c19600A13253L31152f058j59608n0909A94769c6866p7981A2394
$$ -54943 149899 -319600 113253 444405 -6058 -165666 -216575 194769 -36866 -114847 12394
15810a60920j90108f2203j28661C9954b4687m52279A8174a92030b8461k89391
$$ -160920 -351028 -62203 -190864 39954 -24687 -476966 18174 -192030 -28461 -317852
15800c17852A11617h2776p6767j60152J36797o1656A14787R7095o3660J1306R0131
$$ -317852 111617 -82776 -159543 -319695 -182898 -244554 114787 211882 148222 159528 249659
15789B49659a61160A63883c26137h7749A37295d15015k2579P3408h0739B43293
$$ 249659 -161160 163883 -326137 -87749 137295 -415015 -437594 -364186 -80739 243293
15778A26957a54394m3770i7392A70945b06491c9170G0125a71986K9377A77696
$$ 126957 -154394 -198164 -97392 170945 -206491 -39170 70125 -171986 -142609 177696
15767A81323a01248m1419A70173A4736J13779a60336b8484A13197h3807A78670
$$ 181323 -101248 -142667 170173 14736 128515 -160336 -28484 113197 -83807 178670
15756A11408i4110A13606b88905A03214a24006c9670j26375F630P1790C8184g1374
$$ 111408 -94110 113606 -288905 103214 -124006 -39670 -166045 6630 78420 38184 -71374
15744C84888A11709d3871k79581a22538N074q0058f1529E4351d9355j0581m5357
$$ 384888 111709 -43871 -323452 -122538 -117464 -197522 -61529 54351 -49355 -59936 -105293
15733a05293N0772b3746l61661E1131a47618J9637D5333Q8462E1004g9462G3081
$$ -105293 -54521 -23746 -385407 51131 -147618 -127981 45333 133795 51004 -79462 73081
15721h7300m6481A36256a83600I2681A1235i3089n0993B09512n1541B4246a22409
$$ -87300 -133781 136256 -183600 92681 11235 -93089 -144082 209512 157971 24246 -122409
15709a26915p5812A2742K2542O0226O1905M8193c6619m39414F2535k0750a31380
$$ -126915 -202727 12742 35284 95510 157415 205608 -36619 -476033 62535 41785 -131380
15697a15246k16406J24011B0581J29573a59814F9824J2041j8556a74428q84C1741
$$ -115246 -331652 -207641 20581 150154 -159814 69824 81865 63309 -174428 -175312 31741
15685a87309J5404N2064A76612N5074E7735j9081h9556B22435a73666C43701j2661
$$ -187309 -171905 -119841 176612 231686 57735 38654 -89556 222435 -173666 343701 331040
15674C31040j43300r3226a22513A08773a67276C0059L0757N43h7064l13640g3332
$$ 331040 187740 94514 -122513 108773 -167276 30059 60816 61359 -87064 -400704 -73332
15662c90096E4152k1309a16621j48106H9980h4298n0845F1590d2908B77388b66673
$$ -390096 54152 32843 -116621 -264727 89980 -84298 -135143 61590 -42908 277388 -266673
15650C8214h9929i595m81146A5335i653I1789P4460h8537l09031I0769K4167j8266
$$ 38214 -89929 -9595 -490741 15335 -9653 91789 166249 -88537 -397568 90769 114936 96670
15638I6670f5023q8194M3271k97467C18348h4193j15622h4178j90423g687B2710
$$ 96670 -65023 -153217 -109946 -407413 318348 -84193 -199815 -84178 -274601 -7687 22710
15626E0749a64312j61468a07502B27954a4531H8397b10416b7992A1699Q1257a73025
$$ 50749 -164312 -325780 -107502 227954 -14531 88397 -210416 -27992 11699 92956 -173025
15614a00730c6659B56262j09503a75433d8961m07848j4009a54711A01882e8125
$$ -100730 -36659 256262 146759 -175433 -48961 -456809 -470818 -154711 101882 -58125
15603a21388m3406B2460a24747B96175b73739C1998b09741Q3223k28023i6391
$$ -121388 -164794 22460 -124747 296175 -273739 31998 -209741 -126518 -354541 -96391
15592a51376C0941K77230J0353b3729k1048j95252C861J5723R578a78364B49947
$$ -151376 30941 308171 318524 -23729 -44777 -240029 3861 19584 29162 -178364 249947
15580B16088b17747J08279B347b21368Q2773k76102A43750K10702e6767A19149
$$ 216088 -217747 -109468 2347 -221368 -138595 -414697 143750 354452 -56767 119149
15569c38188J60161a3830j07507M6253H6520b5577B25470a23099o821q8133I0075
$$ -338188 -178027 -13830 -121337 -75084 86520 -25577 225470 -123099 -129920 -218053 90075
15557A63753O6335A02578g594A68917O1044c4770C03526b6524k2992f365n5777
$$ 163753 230088 102578 -7594 168917 229961 -34770 303526 -26524 -49516 -6365 -62142
15546f2142g223l7259A89197a3552H6849B6864J41405q1898R8966d5939B89559
$$ -62142 -7223 -44482 189197 -13552 86849 26864 168269 86371 185337 -45939 289559
15534A05691a09203l8069j03258G135a15135C59302b77214g4831I2236b82207
$$ 105691 -109203 -147272 -250530 7135 -115135 359302 -277214 -74831 92236 -282207
15523F7804b33780p5330A16722a64029B36641e270l6509q7148A67440K2535G9899
$$ 67804 -233780 -309110 116722 -164029 236641 -5270 -41779 -128927 167440 189975 79899
15511A83979p2207d9341k03j48820k22515e1296a7100j54057c8719J6614j50343
$$ 183979 111772 -49341 -49544 -198364 -420879 -51296 -17100 -171157 -38719 -22105 -172448
15500a72448A65188n1680c8857A90204q4732g4413I222N2700B6167P6186B6494
$$ -172448 165188 113508 -38857 190204 105472 -74413 9222 61922 26167 102353 26494
15488A291a95706B23533F595a50676f3156A67379C0609i0140C13983a07446G0109
$$ 1291 -195706 223533 6595 -150676 -63156 167379 30609 -90140 313983 -107446 70109
15476i8127B8282a69848a5r497D4125R3731l8769a66692a4204B93073k5559H1204
$$ -98127 28282 -169848 -15 -9512 44125 137856 99087 -166692 -14204 293073 267514 81204
15463B07863E8511b04158O2969f2331p2587f2978m7640b7047k8770l42161A11501
$$ 207863 58511 -204158 -141189 -62331 -134918 -62978 -110618 -27047 -55817 -397978 111501
15451A2306e946C27549h5421C50209a29537A46130o8163a3757A13024a7917j75710
$$ 12306 -5946 327549 -85421 350209 -129537 146130 77967 -13757 113024 -17917 -193627
15440a93627A06289J68013b01006c8748A82374J8394j8111C004a16152a223r393
$$ -193627 106289 274302 -201006 -38748 182374 200768 182657 3004 -116152 -1223 -10616
15429a0616k61984A75622e5000m67111I116b7640m0612j37849h9543r6550e7625
$$ -10616 -272600 175622 -55000 -522111 9116 -27640 -68252 -206101 -89543 -186093 -57625
15417B4755J06450o5490e8552H2761a0840A08882l2694F05b36332D5376a1664
$$ 24755 131205 65715 -58552 82761 -10840 108882 76188 605 -236332 45376 -11664
15405a33745j08839A72849B3045a62977j45164B27333m7970e5687B2576a68045
$$ -133745 -242584 172849 23045 -162977 -308141 227333 179363 -55687 22576 -168045
15394B8804a98731g156A64594b87289E0474J31848c23436A57111c3958p5866K1867
$$ 28804 -198731 -7156 164594 -287289 50474 182322 -323436 157111 -33958 -109824 -87957
15383h7957k23922A38597J01554I4572b14517C9245b8023F8662L14681a49023
$$ -87957 -311879 138597 240151 94572 -214517 39245 -28023 68662 383343 -149023
15372a00858D1873e647B49358A18477b39192A86623A2812b3187A1571Q4975B0105
$$ -100858 41873 -5647 249358 118477 -239192 186623 12812 -23187 11571 96546 20105
15360B37504g6748F3765b80198C94447f5417D4407M3291N9092a60534g1594g21
$$ 237504 -76748 63765 -280198 394447 -65417 44407 87698 146790 -160534 -71594 -721
15348b19032C8860h7986A13473e1168A51041l8255R5802b57901G7898c47863a20013
$$ -219032 38860 -87986 113473 -51168 151041 112786 208588 -257901 77898 -347863 -120013
15336a34840H9268d68040G6465l6806Q0175E0184b13847N3270k2212A35104e324
$$ -134840 89268 -468040 76465 39659 119834 50184 -213847 -160577 -182789 135104 -5324
15324i6840p6690k68053a97940A57391p6936H650J02338A9653e01338a36158f1791
$$ -96840 -173530 -441583 -197940 157391 80455 8650 110988 19653 -501338 -136158 -61791
15312c72800C1568g5639A44317R3362o134i7851B5908L02338o6366C3656b07746
$$ -372800 31568 -75639 144317 237679 231545 -97851 25908 328246 261880 33656 -207746
15300B56068c61719K3050E5127H065K0147Q5936b13145a475k19642f654A11457
$$ 256068 -361719 -338669 55127 8065 28212 114148 -213145 -1475 -221117 -6654 111457
15288A7611M7324J6165f1190A68230h5521r086j41693c4948p7021B72882b9467
$$ 17611 64935 81100 -61190 168230 -85521 -94607 -236300 -34948 -111969 272882 -29467
15276A65755E957d02944H7868p137J35256f9014A13010K1543n7725A6147J10081
$$ 165755 5957 -402944 87868 80731 215987 -69014 113010 134553 76828 16147 126228
15265A26228E0604a8876G6316a91036A74058c2306H3501K58184r6341D892L6833
$$ 126228 50604 -18876 76316 -191036 174058 -32306 83501 341685 245344 4892 41725
15254D1725K2130K31572r8903M50979j29628O20211M05542E64351N78640E47169
$$ 41725 63855 295427 196524 647503 517875 1138086 1543628 564351 1142991 547169
15243G3777J21356C5728L0460I046J17999g5227j10029a9195B57793E8113i7729
$$ 73777 195133 35728 66188 9046 127045 -75227 -185256 -19195 257793 58113 -97729
15231b48096B68876p6820K54475i216B58725j26120b3365F2444e70181I6361i2288
$$ -248096 268876 192056 446531 -9216 258725 132605 -23365 62444 -570181 96361 -92288
15219G6635O2106L2432a12219G2588e3080A19308d4214j9972C5548g0190B13828
$$ 76635 138741 171173 -112219 72588 -53080 119308 -44214 -64186 35548 -70190 213828
15207A65252a27531q3392A79641l4896K22594A31364a00123d6148C42012a09351
$$ 165252 -127531 -210923 179641 144745 367339 131364 -100123 -46148 342012 -109351
15196F957d3647j67944A06734a06772H2216J86992j5756a2171B33003a7626A70304
$$ 6957 -43647 -211591 106734 -106772 82216 269208 253452 -12171 233003 -17626 170304
15184d01353B0475L8738a32441A51736i6368F4013k3631I297c56451I8112J8350
$$ -401353 20475 59213 -132441 151736 -96368 64013 40382 9297 -356451 98112 116462
15173A16462g2895M547k768o7836A44169c8754F3479J01535R6143k120a14547
$$ 116462 -72895 -68348 -71116 -138952 144169 -38754 63479 165014 261157 259037 -114547
15161A4286N3305k4418O4316N5270C2591i2063A50024n6608M3218g4614l19220
$$ 14286 67591 43173 107489 162759 32591 -92063 150024 93416 136634 -74614 -393834
15150c93834b9911B58353m845l1435B5895a42989A64934J33282A9965M19925b43670
$$ -393834 -29911 258353 253508 222073 25895 -142989 164934 298216 19965 439890 -243670
15138B90279I1707e4067B40582q7096G6179K69400r1158n7322O514H9135K3735
$$ 290279 91707 -54067 240582 153486 76179 345579 254421 197099 203613 89135 112870
15127A12870M5913j8978c7668A81658L1668J27493p898j58054l8704K26535E1465
$$ 112870 158783 139805 -37668 181658 213326 340819 332921 174867 136163 362698 51465
15115g028j07302l0164A24648l7063g2811C9577L3915a69717F5273L11277A34465
$$ -7028 -114330 -144494 124648 87585 -72811 39577 73492 -169717 65273 376550 134465
15103B26169J42156b76470a10239A70850E5068j900i1463B34306m9894J32044
$$ 226169 368325 -276470 -110239 170850 55068 53168 -91463 234306 184412 316456
15093C16456c4468A32895J65867A16122J82546j25307j2903e4192B87119N7949
$$ 316456 -34468 132895 298762 116122 298668 173361 160458 -54192 287119 345068
15083C45068a13364b6279j84266B04985B0185a4098A39651B8966O1952b80841
$$ 345068 -113364 -26279 -210545 204985 20185 -14098 139651 28966 90918 -280841
15072D44320A46913K35688d4990C84283A32809d1066C72949j50284D6322L30442
$$ 444320 146913 382601 -44990 384283 132809 -41066 372949 222665 46322 376764
15062C76764F1623J28774B6186d3446B68875A30912C9557b40662B27638k2377
$$ 376764 61623 190397 26186 -43446 268875 130912 39557 -240662 227638 205261
15052B05261K33773E7012K33200J17119D911R8065K38409j11310H4881K89059
$$ 205261 439034 57012 290212 407331 4911 102976 341385 230075 84881 373940
15042C73940j42498G6336a5302B50578D0069J35446J17182A34224L56146a90099
$$ 373940 231442 76336 -15302 250578 40069 175515 292697 134224 490370 -190099
15031B9885N01639A51787e3013C08046a05839C08970A27030j6453D3882K55947
$$ 29885 531524 151787 -53013 308046 -105839 308970 127030 110577 43882 299829
15021B99829b62995F8942a4837B24123J47466A51885M6624r0973a52979A97399
$$ 299829 -262995 68942 -14837 224123 371589 151885 198509 107536 -152979 197399
15010B80446j15426m4516m5339L09944A31003C2502L5067K81070j62995a68812
$$ 280446 165020 120504 75165 385109 131003 32502 67569 348639 185644 -168812
14999E70133k38301e7692B63962O6482l5089r9035P1014A01864K01801m0095a62136
$$ 570133 331832 -57692 263962 330444 295355 196320 267334 101864 303665 263570 -162136
14987A98315P5460o5710p1405d5740A41427a17319B77889E0546J83533o8194J17093
$$ 198315 273775 208065 136660 -45740 141427 -117319 277889 50546 234079 165885 282978
14976B82978B4844M40701A19563N7489K69600a81530D27214A75293m6649h8790
$$ 282978 24844 465545 119563 177052 446652 -181530 427214 175293 128644 -88790
14965C66434c7833C20758l4299n4565J95093a04376F21485B10714K9565Q4989
$$ 366434 -37833 320758 286459 231894 426987 -104376 621485 210714 240279 325268
14955C25268m4472A14159J18084K96640A78841M9766J95500k08349d4858P643
$$ 325268 280796 114159 232243 528883 178841 228607 424107 215758 -44858 -37215
14945c7215A94912o6772d2386I3080l916K69925q4328J34814A80325K20661Q4893
$$ -37215 194912 128140 -42386 93080 89164 359089 274761 409575 180325 400986 485879
14934D85879e2822B93532r1327F8739o457J89899o079J2757J13017j05642G167
$$ 485879 -52822 293532 202205 68739 62282 252181 246102 258859 371876 266234 7167
14922a7732G8808L59775C3415O8400j9054L37085b19946D9767K81030J45878j18086
$$ -17732 78808 438583 33415 101815 82761 419846 -219946 49767 330797 476675 358589
14911C58589j62765k3404M2783m4875O6750r2210K28267A36572L40661G3086J52689
$$ 358589 195824 172420 215203 170328 237078 144868 373135 136572 477233 73086 225775
14900B25775M3371A1041f2330I7260J36220B5675K33303L39051k00209j46409
$$ 225775 269146 11041 -62330 97260 233480 25675 258978 598029 397820 251411
14890B51411J30099m3831j64590K55140P6966B04056Q2571J10038j27297K01549
$$ 251411 381510 337679 173089 428229 505195 204056 286627 396665 269368 470917
14880D70917e4120F00667L02730B77274J97830B06075k1798L64992n5342l8538
$$ 470917 -54120 600667 903397 277274 475104 206075 184277 549269 493927 455389
14870D55389J18498j81791p3109j29452M34297j49898j52646E9178O0279M53173
$$ 455389 573887 392096 318987 189535 623832 473934 321288 59178 119457 572630
14860E72630r7717J20603k89887r5997J90610A24521L94079j75504j43444J0972
$$ 572630 474913 595516 305629 209632 400242 124521 518600 343096 199652 210624
14850B10624L09721B21626J85254E5382O09346l11123r3652R8159K12794I3263
$$ 210624 520345 221626 406880 55382 664728 353605 259953 358112 570906 93263
14839B99783D9663L23259L4527A07264L23971r1759L3131R5932K11397j52321
$$ 299783 49663 372922 407449 107264 431235 339476 372607 468539 679936 527615
14829E27615J09400o2464j68188J11182j81346c619E72054k41647A31342M27098
$$ 527615 637015 574551 406363 517545 336199 -3619 572054 330407 131342 558440
14819E58440B43297J62239K20202a2763E05352j20406J85794k02285q6939J80195
$$ 558440 243297 405536 625738 -12763 505352 384946 570740 368455 281516 461711
14809D61711k20316L78448M5847B93072K58296J865j81890K26302E7383P72884
$$ 461711 241395 619843 665690 293072 551368 553233 371343 597645 57383 830267
14799H30267a04169G57101j81923A98136K28430K00525d534G64160k02276R5545
$$ 830267 -104169 757101 575178 198136 426566 627091 -4534 764160 561884 657429
14789F57429m018k6635k68518J25297O698P823j83273J35593J09003m5252A54294
$$ 657429 653411 626776 358258 483555 490253 498076 314803 450396 559399 514147 154294
14777E18530B12422L27750q3246o1827J91695o7598K50825j63557B79763N09132
$$ 518530 212422 540172 456926 395099 586794 519196 770021 606464 279763 788895
14767G88895l85372P7065J37723j03709n639O7417r4132K53609k47558k38904
$$ 788895 403523 480588 618311 514602 508963 576380 482248 735857 488299 249395
14757B49395K85880M83842k60755R84H0523M45165J5027L22862j59961P047j83666
$$ 249395 535275 1019117 758362 759346 80523 525688 540715 863577 703616 710663 526997
14746E26997l026O9592K01782j03306p5542M6036k26859N29356l35738R7769k32373
$$ 526997 523971 593563 795345 692039 616497 662533 435674 965030 629292 727061 494688
14735D94688P7715J43116q5156J38482K24649k50103j76674j70473K25111N6776
$$ 494688 572403 715519 630363 768845 993494 743391 566717 396244 621355 678131
14725F78131m0391K55782k46808J49348j53195K65200m0996B73465P18912j57588
$$ 678131 637740 893522 646714 796062 642867 908067 867071 273465 992377 834789
14715H34789C55980K76106K91436k26874k98196P08200l62518k24341L87418l15377
$$ 834789 355980 632086 923522 696648 398452 1106652 744134 519793 907211 591834
14705E91834L16060j27354j56279K19329k11445L20302M1101m07925L74924j6698
$$ 591834 907894 780540 624261 843590 632145 952447 993548 585623 960547 943849
14695I43849j43686P6217j9848j27371L53410M4572l80573o1899M2690K34670
$$ 943849 800163 876380 856532 729161 1082571 1127143 746570 684671 727361 962031
14685I62031L39068m11380J21919K68977K74848m70391R442l46366j18006N41804
$$ 962031 1301099 889719 1011638 1280615 1555463 1085072 1094514 748148 630142 1171946
14675A171946l18063n0321j86899J66672n6518j42344J52011K02422M88706o42045
$$ 1171946 853883 803562 616663 783335 726817 584473 736484 938906 1427612 785567
14665G85567J04940K05591J38291N4720j1463j51806R7961m10641L60201k8488
$$ 785567 890507 1096098 1234389 1289109 1277646 1125840 1223801 813160 1173361 1144873
14655A144873j37232j02246k7984J28059J1945k73971L15755N40706k19676n18544
$$ 1144873 1007641 905395 877411 1005470 1017415 743444 1059199 1599905 1380229 861685
14645H61685M12932N2054l22470r8897K51546J0872R5447j18474N69669p15180
$$ 861685 1274617 1326671 1004201 905304 1156850 1167722 1263169 1144695 1714364 999184
14635I99184K49093l16239K17929J73515O7485j30801k68066J9262J96408m699
$$ 999184 1248277 932038 1149967 1323482 1390967 1260166 992100 1011362 1207770 1203071
14625A203071L57399n65434L13154j33232K57358j13344j28172j40901O75794
$$ 1203071 1560470 995036 1308190 1174958 1432316 1318972 1190800 1049899 1725693
14616A725693j35644j2047l95038K29905n6168K925j87440K13120r6028M38174
$$ 1725693 1590049 1578002 1182964 1412869 1356701 1359626 1172186 1385306 1289278 1727452
14606A727452n4668q9418Q3382R4793j08569r2451M521L39R519m7862J37318k77945
$$ 1727452 1672784 1583366 1666748 1761541 1652972 1560521 1565042 1565381 1574900 1527038 1664356 1386411
14594A386411L30360r0731R2464K0282q3489j03890K7438K32730j29040j32997
$$ 1386411 1716771 1626040 1718504 1738786 1655297 1551407 1578845 1811575 1682535 1549538
14584A549538L96547k74545l26945M30142L60920l92904M4321J75919j44037N42432
$$ 1549538 1946085 1671540 1344595 1774737 2135657 1742753 1787074 1962993 1818956 2361388
14574B361388o19542L2337J82140k20209N29984n15414N69108m54601J80412K36110
$$ 2361388 1741846 1774183 1956323 1736114 2266098 1750684 2319792 1865191 2045603 2281713
14564B281713J6183q8767L50568O1168j96730N7001o4956N34595m11836K33240
$$ 2281713 2297896 2209129 2559697 2620865 2424135 2481136 2416180 2950775 2538939 2772179
14554B772179M93125L71826p1149R24278Q49313J960966M619155R075262J6208760
$$ 2772179 3265304 3637130 3565981 4490259 5339572 7300538 11919693 20994955 37203715
14545C7203715P927101B1691993I529493D540755j302525p26124j73320n69814
$$ 37203715 45130816 21691993 9529493 4540755 3238230 2512106 2338786 1768972
14537A768972M0218Q4788J44006q8404N1495p5937r7888M61154j33583m2258J68096
$$ 1768972 1809190 1893978 2037984 1949580 2001075 1925138 1827250 2288404 2154821 2112563 2280659
14526B280659l64146J93045l5382N3972j8018j25363K65735j50460N35401m76252
$$ 2280659 1916513 2109558 2074176 2128148 2110130 1984767 2250502 2100042 2635443 2159191
14516B159191J10383K37884l53583M35595k75120M33508p7494j03337K16553P4301
$$ 2159191 2269574 2507458 2153875 2589470 2314350 2747858 2670364 2567027 2783580 2857881
14506B857881k73233N21972k97888r3537K27926r4845J54444l00596L51931j18093
$$ 2857881 2584648 3106620 2808732 2715195 2943121 2848276 3002720 2702124 3054055 2935962
14496B935962j22018J38193L47223l64283K40134k01125K95714n67592M79175
$$ 2935962 2813944 2952137 3299360 2935077 3175211 2974086 3269800 2702208 3181383
14487C181383J46955l5388q7991J74453j45003K30336M00527j46923m5918M3557
$$ 3181383 3328338 3292950 3204959 3379412 3234409 3464745 3865272 3718349 3672431 3715988
14477C715988k48258J90966K14606j20227O07803m73203J720L43917l4416l23822
$$ 3715988 3467730 3658696 3873302 3753075 4360878 3887675 3889395 4233312 4198896 3875074
14467C875074L50529j41782L69920k65989J04627L91037k30265Q1074j37226R2221
$$ 3875074 4225603 4083821 4453741 4187752 4292379 4683416 4453151 4534225 4396999 4489220
14457D489220J13280J12712n4019J87885J61649k79195K01909L45808k21109J99049
$$ 4489220 4602500 4715212 4661193 4849078 5010727 4731532 4933441 5279249 5058140 5257189
14447E257189o7698L79049k12202q5449J93393P7735J5515J18157K41361k11377
$$ 5257189 5189491 5568540 5356338 5270889 5464282 5542017 5557532 5675689 5917050 5705673
14437E705673P10920l35941r8787N5781K41039Q1191q2986J57092J67730J68548
$$ 5705673 6416593 6080652 5981865 6037646 6278685 6359876 6276890 6433982 6601712 6770260
14427F770260j25280J78401J9483p4685K55094L90636j87525L10820L75867j20420
$$ 6770260 6644980 6823381 6842864 6768179 7023273 7413909 7226384 7537204 7913071 7792651
14417G792651m14885N69660n7983J44777M72586m62808K02864n5346M62364Q0519
$$ 7792651 7377766 7947426 7889443 8034220 8506806 8043998 8246862 8191516 8653880 8734399
14407H734399J47887l73729N37193J97080L09582J76817m06366P15324J11746
$$ 8734399 8882286 8508557 9045750 9242830 9552412 9729229 9322863 10038187 10149933
14398A0149933J07032k06335O68304n227J15164k2825j14021M57513P37234l035
$$ 10149933 10256965 10050630 10718934 10713707 10828871 10806046 10692025 11149538 11886772 11883737
14388A1883737K95117k33367L09533L96436j01389M46767L82171J14648K74837
$$ 11883737 12178854 11945487 12255020 12651456 12550067 12996834 13379005 13493653 13768490
14379A3768490K86995j78616L85430M52513j1520P91963M8204M28397K16495L23870
$$ 13768490 14055485 13876869 14262299 14714812 14703292 15495255 15543459 15971856 16188351 16512221
14369A6512221M59780K56941K71046L32597M55431O07950M4711N90152K08883
$$ 16512221 16972001 17228942 17499988 17832585 18288016 18895966 18940677 19530829 19739712
14360A9739712O37810N29765J98418O89588P7548Q04964J52465P18041P31282
$$ 19739712 20377522 20907287 21105705 21795293 21872841 22677805 22830270 23548311 24279593
14351B4279593M69067O97387J56049N97039M73700R13188J051663N99367O46482
$$ 24279593 24748660 25446047 25602096 26199135 26672835 27586023 28637686 29237053 29883535
14342B9883535P05154R31547J062693Q95899Q15265Q99949J036209J247492R68172
$$ 29883535 30588689 31520236 32582929 33478828 34294093 35194042 36230251 37477743 38445915
14333C8445915J051490J637683N09652J100581J515619J674077J569542J382262
$$ 38445915 39497405 41135088 41644740 42745321 44260940 45935017 47504559 48886821
14325D8886821J737061J780898J868112J728165J495507K750156J675160K493758
$$ 48886821 50623882 52404780 54272892 56001057 57496564 60246720 61921880 64415638
14317F4415638K100252K809146K432158L128306K704795L316559L351945L105398
$$ 64415638 66515890 69325036 71757194 74885500 77590295 80906854 84258799 87364197
14309H7364197L803702M053744M209122M267982M753171M787101N258373N624667
$$ 87364197 91167899 95221643 99430765 103698747 108451918 113239019 118497392 124122059
14301A24122059O132814O313526O477934P321867P649019P908308Q568433R342686
$$ 124122059 130254873 136568399 143046333 150368200 158017219 165925527 174493960 183836646
14293A83836646R675889J0134354J1259144J1149362J2660570J2789793J3883708
$$ 183836646 193512535 203646889 214906033 226055395 238715965 251505758 265389466
14286B65389466J4000070J5129472J5315099J6114416J6490155J6823448J6484026
$$ 265389466 279389536 294519008 309834107 325948523 342438678 359262126 375746152
14279C75746152J7001677J6131138J5405433J4317179J3180200J1082746Q066063
$$ 375746152 392747829 408878967 424284400 438601579 451781779 462864525 470930588
14272D70930588L440791j168633p959K624181o36774l689502n374704q691744
$$ 470930588 474371379 473202746 473194787 475818968 475182194 471492692 466117988 457426244
14264D57426244j0123022j1124171j3538360j5420091j6758521j6677197j7262277
$$ 457426244 447303222 436179051 422640691 407220600 390462079 373784882 356522605
14257C56522605j6625064j6197603j5805432j5550233j5101764j4148617j3646090
$$ 356522605 339897541 323699938 307894506 292344273 277242509 263093892 249447802
14250B49447802j3083872j2444578j1492722j0473377j0723982r559809q715592
$$ 249447802 236363930 223919352 212426630 201953253 191229271 181669462 172953870
14243A72953870q522064p990530p443183p293356o661126n746934n950748n662660
$$ 172953870 164431806 156441276 148998093 141704737 135043611 129296677 123345929 117683269
14235A17683269n250320n099423m178965m228486m052237l615674l944383l610911
$$ 117683269 112432949 107333526 103154561 98926075 94873838 91258164 87313781 83702870
14227H3702870l237176l089220l214882k524622k907304k155348k339417k185786
$$ 83702870 80465694 77376474 74161592 71636970 68729666 66574318 64234901 62049115
14219F2049115k120377k302173k012077j766074j409357j385064j545981j620277
$$ 62049115 59928738 57626565 55614488 53848414 52439057 51053993 49508012 47887735
14211D7887735j312273j690823j392406j210047o61669j222867j388907j254870
$$ 47887735 46575462 44884639 43492233 42282186 41620517 40397650 39008743 37753873
14203C7753873j119209r46375r94651p45617p80938j425570n16564p79969n96612
$$ 37753873 36634664 35688289 34693638 33948021 33167083 31741513 31224949 30444980 29848368
14194B9848368p48666j047438m44586j140615k07608r23143l26412j071445j13120
$$ 29848368 29099702 28052264 27607678 26467063 26259455 25336312 25009900 23938455 23825335
14185B3825335q40578o52078p80863q0629m12733l30486q78549K3192m48698j51172
$$ 23825335 22984757 22332679 21551816 21471187 21058454 20727968 19849419 19872611 19423913 19272741
14175A9272741m28059o76359l25828l39699n81451k79528k35839j50924p71594
$$ 19272741 18844682 18168323 17842495 17502796 16921345 16641817 16405978 16255054 15483460
14166A5483460j52715l42874m1521j12365m27582l96217k35164j61212k52474
$$ 15483460 15330745 14987871 14946350 14833985 14406403 14010186 13775022 13613810 13361336
14157A3361336p33785L20330k40556k51527l04080k20114K83736o96172j80971
$$ 13361336 12627551 12947881 12707325 12455798 12151718 11931604 12215340 11519168 11338197
14148A1338197m4248k30979l34305J18608k66419k3390p31186j14481J51482m57045
$$ 11338197 11293949 11062970 10728665 10847273 10580854 10557464 9826278 9711797 9863279 9406234
14138I406234P2546k67699l824L12k69571p0806r3568j87780J68972n53697K57847
$$ 9406234 9478780 9211081 9207257 9207569 8937998 8867192 8773624 8585844 8754816 8201119 8458966
14127H458966m19016p1914J65867j31938n83938O708R7004p4373j72422k6504
$$ 8458966 8039950 7968036 8133903 8001965 7418027 7424735 7521739 7447366 7274944 7248440
14117G248440n6954l19302l0776K19303K45783n56855j82375J32588K2608j17618
$$ 7248440 7191486 6872184 6841408 7060711 7306494 6749639 6567264 6699852 6722460 6604842
14107F604842l74199m669O2523j51745j43401K59854p06992N70254n60050K1238
$$ 6604842 6230643 6225974 6288497 6136752 5993351 6253205 5546213 6116467 5556417 5577655
14097E577655q8147N9767N8335k29188O4511j09100j16002Q7205l29274K15625
$$ 5577655 5489508 5549275 5607610 5378422 5442933 5333833 5217831 5305036 4975762 5191387
14087E191387k73752K39494m86531O5155l8915K37674l1668k93670r1173r8745
$$ 5191387 4917635 5157129 4670598 4735753 4696838 4934512 4902844 4609174 4518001 4419256
14077D419256J75278k75170j38955p9420K52987K14696J2832n37809j53178K6758
$$ 4419256 4594534 4319364 4180409 4100989 4353976 4568672 4581504 4043695 3890517 3917275
14067C917275O87459o19951j2907j67571k63124K55336m4763k2191O7852J87462
$$ 3917275 4604734 3984783 3971876 3804305 3541181 3796517 3751754 3729563 3797415 3984877
14057C984877l2472n8036l2502j0130l73319k23954N541K81723j01890K8389j10110
$$ 3984877 3952405 3894369 3861867 3851737 3478418 3254464 3260005 3541728 3439838 3468227 3358117
14046C358117k01285J48978l1083k59610n0390o3967K50396k15687m3485Q1857
$$ 3358117 3156832 3305810 3274727 3015117 2964727 2900760 3151156 2935469 2891984 2973841
14036B973841J73708j47676j46952N46885m41174J43943j09569m0096l77202N84316
$$ 2973841 3147549 2999873 2852921 3399806 2958632 3102575 2993006 2952910 2575708 3160024
14026C160024m20954L81337l86529J68534k8107q7655n8314k12951l53975L73639
$$ 3160024 2739070 3120407 2733878 2902412 2874305 2786650 2728336 2515385 2161410 2535049
14016B535049P6934j95484m7837K6661k57295J85143J45896n56049L63439m3022
$$ 2535049 2611983 2416499 2368662 2395323 2138028 2323171 2469067 1913018 2276457 2233435
14006B233435R8159j06335K15076m63723M80377m84910N02811l76456m2794J21904
$$ 2233435 2331594 2225259 2440335 1976612 2456989 1972079 2474890 2098434 2055640 2177544
13996B177544m73492K52514O6246j58481J80827p8686P18575N78194K960380Q282993
$$ 2177544 1704052 1956566 2022812 1864331 2045158 1966472 2685047 3263241 6223621 14506614
13986A4506614J5256049J4955253j7024079j3379860n272593l005813j007675
$$ 14506614 29762663 44717916 27693837 14313977 9041384 6035571 5027896
13979E027896j024317m81529k11612j76758n33084k98658K00645J96465m06629
$$ 5027896 4003579 3522050 3310438 3133680 2600596 2301938 2502583 2699048 2292419
13970B292419J0021J99958m04567L30524l3429l94520L27023k80017k46417K32865
$$ 2292419 2302440 2502398 2097831 2428355 2394926 2000406 2327429 2047412 1800995 2033860
13960B033860J38426j83267j7923K6999n3181J08478k19217K16134j87847k59373
$$ 2033860 2172286 1989019 1971096 1998095 1944914 2053392 1834175 2050309 1862462 1603089
13950A603089J59001L6169j92439K62240J16068k07383m84111O11095l31047L24768
$$ 1603089 1762090 1798259 1605820 1868060 1984128 1776745 1292634 1903729 1572682 1897450
13940A897450m36103L89880l91637L50805m1073k25057j01476J41628J80636k1540
$$ 1897450 1461347 1851227 1459590 1810395 1769322 1544265 1442789 1584417 1765053 1743513
13930A743513k11607J98673r9436l10356L10318k29019J44518N1615J91143m47891
$$ 1743513 1531906 1730579 1631143 1320787 1631105 1402086 1546604 1598219 1789362 1341471
13920A341471O2158J57662l20216L31253j55751o7333K99285m60796j6429J81368
$$ 1341471 1403629 1561291 1241075 1572328 1416577 1349244 1648529 1187733 1171304 1352672
13910A352672N7075q1752R6732k19361O2456K51005j96060K04829R4843o09331
$$ 1352672 1409747 1327995 1424727 1205366 1267822 1518827 1322767 1527596 1622439 1013108
13900A013108M24237m85412M53059M577l41109K88786J67746j88522j28252j87707
$$ 1013108 1437345 951933 1404992 1409569 1068460 1357246 1524992 1336470 1208218 1020511
13890A020511K14142J06301M17942l79919l02825J54128q7433l6389J38228l32728
$$ 1020511 1234653 1340954 1758896 1378977 1076152 1230280 1142847 1106458 1244686 911958
13880I11958J64256l29862O36132r9752j02347l89494L20819K0810K87292n03106
$$ 911958 1076214 746352 1382484 1282732 1180385 790891 1111710 1132520 1419812 916706
13870I16706K58090o2458J46138l47858r3914M32495l29735L80003j77903k11048
$$ 916706 1174796 1112338 1258476 910618 816704 1249199 919464 1299467 1121564 910516
13860I10516p2816R5265j47901J4362K73495o5916K163j9023K78799l32640J19263
$$ 910516 837700 932965 785064 799426 1072921 1007005 1009168 990145 1268944 936304 1055567
13849A055567R8316k56606q935r2667J47528K21382l54399L08927l75754M07773
$$ 1055567 1153883 897277 888342 795675 943203 1164585 810186 1119113 743359 1151132
13839A151132m25186J75185k69699M41356j08540j26348k1970q2313J46815n7844
$$ 1151132 725946 901131 631432 1072788 964248 837900 815930 733617 880432 822588
13829H22588J57807K1105j72227k28586J14615j29536K00698J20924j67966O4898
$$ 822588 980395 1001500 829273 600687 715302 585766 786464 907388 739422 804320
13819H04320L0645k9482j74803K21925k00097Q1607L08890m62882K19963K54439
$$ 804320 834965 805483 630680 852605 652508 734115 1043005 580123 800086 1054525
13809A054525D54908N2245K54241J37736M437l10804J47470q074p4917J14006
$$ 1054525 454908 507153 761394 899130 903567 592763 740233 732159 657242 771248
13799G71248J36873D04616N45128k34433K32818l30535j3407K88373j83707J78230
$$ 771248 908121 404616 949744 715311 948129 617594 604187 892560 708853 887083
13789H87083C77170O21127j00226j83643k50212J11414P777L07067l58434L48229
$$ 887083 377170 998297 898071 714428 464216 575630 583407 890474 532040 880269
13779H80269k15818l0270R2968A26310J96474M55860C48650J09671M9360M5769
$$ 880269 664451 634181 727149 126310 322784 778644 348650 458321 507681 553450
13769E53450K07382p7307r3283q6974K91481j29447O9570j28399N7994p7333Q908
$$ 553450 760832 683525 590242 503268 794749 665302 734872 606473 664467 587134 596042
13758E96042O5011J93486C92453j18369M00112K04220j88830j98179J78410k18824
$$ 596042 661053 854539 392453 274084 674196 878416 689586 491407 669817 450993
13748D50993M07674l73700P6830j17053N718K54347j43382q8455J27559l4469
$$ 450993 858667 484967 561797 444744 450462 704809 561427 472972 600531 566062
13738E66062j4649k36551L91003l46989J18050J95604o6882K13301A86318K42259
$$ 566062 551413 314862 705865 358876 476926 672530 605648 818949 186318 428577
13728D28577J00995j42638M3881j81800Q8677J69299J87522d0019E73297j01745
$$ 428577 529572 386934 430815 249015 337692 506991 694513 -40019 573297 471552
13718D71552k4718P0468K27984q1963k66522l9744M24496n9319M0241j09364j90501
$$ 471552 446834 517302 745286 663323 396801 357057 781553 722234 762475 653111 462610
13707D62610K31895k77040Q2405K52236k68607L26725j31326M9477j10288l6008
$$ 462610 694505 417465 499870 752106 483499 810224 678898 728375 618087 582079
13697E82079L3604J0723L4469k37102O3866j15384O90169C59242k3002J39750
$$ 582079 615683 626406 660875 423773 487639 372255 1062424 359242 336240 475990
13687D75990r9917l0436Q2638O2163K04897J81324C68280j61165P6627J76726
$$ 475990 376073 345637 428275 490438 695335 876659 368280 207115 283742 460468
13677D60468Q0757j1397k24235L50394J43196k48996m8787p2760k7024A94579
$$ 460468 541225 529828 305593 655987 799183 550187 501400 428640 401616 194579
13666C61418J27283o4363k08245N1881N3334L69906j46656q6984K3634j92658
$$ 361418 488701 424338 216093 267974 321308 691214 544558 457574 481208 288550
13656B88550P2535J76912p208k10809L3689J59506A37505J67016I1717O41959
$$ 288550 361085 537997 530789 319980 353669 513175 137505 304521 91717 733676
13646G33676k72763k04915M0163J85003K29609k91160A67627J30119J666j20234
$$ 733676 460913 255998 296161 481164 710773 419613 167627 297746 299412 179178
13636A79178L26605j31239J39257k06008C5316L65014j31867L07119k69532J11139
$$ 179178 505783 374544 513801 307793 35316 400330 268463 575582 306050 417189
13626D17189K90413I4672L07300J34525M2766M027B13909k3916k9816K90265n1670
$$ 417189 707602 94672 401972 536497 579263 583290 213909 189993 160177 450442 398772
13615C98772J5619E6471M93577j39262j0946r9349E4813M08996p2887J05723I8516
$$ 398772 414391 56471 550048 410786 399840 300491 54813 463809 390922 496645 98516
13603C30787J53310j9252J64754j46541L42629C63180L5907M81045k10293B4115
$$ 330787 484097 464845 629599 483058 825687 363180 399087 880132 669839 24115
13592E98203A93435N2904Q0528r989M9879J53883L04128A07934J74083l5982I9214
$$ 598203 193435 246339 326867 316878 366757 520640 824768 107934 282017 246035 99214
13580A65977M05282k62325P7934j66833f2909B64906D7270J19045K68377p584
$$ 165977 571259 308934 386868 220035 -62909 264906 47270 166315 434692 427108
13570D27108L9479J47733A58817P1371J01100A19093K34736q537O8398G3503L36807
$$ 427108 466587 614320 158817 230188 331288 119093 353829 345292 413690 73503 410310
13559D10310A68788K04954E0600J84546o0589b55840D91474j35819L0563A60043
$$ 410310 168788 373742 50600 235146 174557 -255840 491474 355655 386218 160043
13548B67596F7305K23198J43322d3815B32260J53698I9007K17251A56150M92122
$$ 267596 67305 290503 433825 -43815 232260 385958 99007 316258 156150 648272
13538F48272B85560A41328K063K60154A41686R0582K27139A00653O65J61575P1545
$$ 648272 285560 141328 143391 403545 141686 232268 459407 100653 101318 262893 334438
13527C34438G4556J1663N289O9102J46564N1845A27084J96663I4031K10769i1571
$$ 334438 74556 86219 91508 160610 307174 359019 127084 323747 94031 304800 -91571
13515B33851K84434j3862j80483j0947k7131H8928C5201K92130j40039k1172p3326
$$ 233851 518285 504423 323940 312993 285862 88928 35201 327331 187292 166120 92794
13504I2794b855G6216J05658B5719L52546j04396A11623D2581L34519A8490M67170
$$ 92794 -2855 76216 181874 25719 378265 273869 111623 42581 377100 18490 485660
13493D85660k03274J30315j97039J44926B7768K09397o7860P4820F4442J2348
$$ 485660 282386 412701 215662 360588 27768 237165 169305 244125 64442 76790
13483G6790J56131M53059B16517j7014a23955B79377n8086P5909J90929E786J7777
$$ 76790 232921 685980 216517 199503 -123955 279377 221291 297200 488129 5786 23563
13472B3563P4349e5095C46473A03728J35380o7540K12831A29028K6655E9334M6659
$$ 23563 97912 -55095 346473 103728 239108 171568 384399 129028 155683 59334 105993
13461A05993l1950M1665J84332j18454K2235G2645a9126E2987Q4904K75139A96003
$$ 105993 74043 115708 300040 181586 203821 72645 -19126 52987 137891 413030 196003
13449a4962A61369N218K68364A63875J27502K56840A59164n8188J2106K38692
$$ -14962 161369 166587 434951 163875 291377 548217 159164 100976 113082 351774
13439C51774j49108J37769K4879o7303b7870C75575d6634B55802Q7766p4561j27754
$$ 351774 202666 340435 365314 298011 -27870 375575 -46634 255802 343568 269007 141253
13428A41253j689C3934P4928L930J55145b00738g4652B10129N8683M8416L18869
$$ 141253 139564 33934 108862 112792 267937 -200738 -74652 210129 268812 317228 636097
13417F36097A80920l4495L5545K11298j43123a32353C53451b29012f5957C20346
$$ 636097 180920 146425 181970 393268 250145 -132353 353451 -229012 -65957 320346
13406A85524E8387L36834D6400J14996K41093j35557p0636a28713N344j03180
$$ 185524 58387 395221 46400 161396 402489 266932 196296 -128713 -123369 -226549
13396b26549A14588O1092K09287J07457j0145B14407l7531J2033r1736J0555K73190
$$ -226549 114588 175680 384967 492424 482279 214407 176876 188909 97173 107728 380918
13385C80918K3290A86920e2386B21856C8241K03534J29787F6719B3420K86217
$$ 380918 404208 186920 -52386 221856 38241 241775 371562 66719 23420 309637
13375C09637J83235k44265o8826J4118N03111B72266E5552J4706J40452J63442
$$ 309637 492872 248607 179781 193899 697010 272266 55552 70258 210710 374152
13365C74152A06381J59312r1907K4059J24914j39710e0879H6238a54967J3955
$$ 374152 106381 265693 173786 197845 322759 183049 -50879 86238 -154967 -141012
13355a41012a3696E4959L00943l9396j02400J33278m8530o0287J65588j44640
$$ -141012 -13696 54959 355902 316506 214106 347384 298854 238567 404155 259515
13345B59515F5155J47946J01067M3097j08586r1553O0666k6230J39749m1880J57640
$$ 259515 65155 213101 314168 357265 248679 157126 217792 191562 331311 289431 447071
13334D47071A0098Q9869J88898r7167J50463j4411C6139K31584j15608A427K88341
$$ 447071 10098 99967 288865 191698 342161 327750 36139 267723 152115 1427 289768
13323B89768J14081H0734P0740J15414R1189j29060q077M0101A09483j9338N5332
$$ 289768 403849 80734 151474 266888 358077 229017 220940 261041 109483 90145 145477
13312A45477g828D09460j85241b4084C59714F0198M1173J82081a25831C60534
$$ 145477 -7828 409460 224219 -24084 359714 60198 101371 283452 -125831 360534
13301C28254N4982e5217C0516J80725K63545d4047A90430m2421j9380f5787D3904
$$ 328254 383236 -55217 30516 211241 474786 -44047 190430 148009 128629 -65787 43904
13289A97542I1111m5389Q3838l05a01716I7167M16616A2408d974B29179a74869
$$ 197542 91111 45722 129560 129255 -101716 97167 513783 12408 -4974 229179 -174869
13277B04422l2446A7668O7457K47089i7188C31465j09718a9313A3568Q6648a02135
$$ 204422 171976 17668 85125 332214 -97188 331465 221747 -19313 13568 100216 -102135
13265I7535l4241n352J727J2625J6539J27841I9389a88051a1863A3396J1245K05340
$$ 97535 63294 57942 59669 72294 88833 216674 99389 -188051 -11863 13396 24641 229981
13253B29981r3420a23570A75029F2210Q5091e5332C58052d2611D8767J19335F8160
$$ 229981 136561 -123570 175029 62210 147301 -55332 358052 -42611 48767 168102 68160
13241D9974K32016j30155J53732A34405J57051E9353K2321i8610j82752C73981
$$ 49974 281990 151835 305567 134405 291456 59353 81674 -98610 -281362 373981
13230C59865i6069j91572A01241l720f2217B8248J44973e9595A20163J92743k9233
$$ 359865 -96069 -287641 101241 97521 -62217 28248 173221 -59595 120163 312906 283673
13219B83673b04503G2049J48333l8903K0358C9653K81002n3108B288a44267d3776
$$ 283673 -204503 72049 220382 181479 201837 39653 320655 267547 2288 -144267 -43776
13207E4782J58421d3059B78199j02851C8589F6K21561K65097A85289G3842a8238
$$ 54782 213203 -43059 278199 175348 38589 66 221627 486724 185289 73842 -18238
13195B77361A10004B6448N3650C9672J24613G9299a23354H1078J38131k980A1267
$$ 277361 110004 26448 80098 39672 164285 79299 -123354 81078 219209 216229 11267
13183a24924d2740m4257C77389e4646l5503B88862g1006D28385A45532n5847M31030
$$ -124924 -42740 -86997 377389 -54646 -90149 288862 -71006 428385 145532 89685 520715
13172E20715e6464B73324p8122n3661a18211B58953a34414A18644L52117c2203
$$ 520715 -56464 273324 195202 141541 -118211 258953 -134414 118644 470761 -32203
13161B15109j00172i8643j81204E78196c6490m2376D55737B17663A02292l6305
$$ 215109 114937 -98643 -279847 578196 -36490 -78866 455737 217663 102292 65987
13151F5987K610a4277E7921c7472A17405b65525J9403B43926O8793A13117A9598
$$ 65987 68597 -14277 57921 -37472 117405 -265525 -246122 243926 312719 113117 19598
13139a57628A75066h3510J12B90280n6528A8038K18330a1333j01216o0975m7343
$$ -157628 175066 -83510 -83398 290280 233752 18038 236368 -11333 -112549 -173524 -220867
13128b20867A69598a03170K8225F168b8029j22516B99132A4375J2565e6679l32485
$$ -220867 169598 -103170 -74945 6168 -28029 -150545 299132 14375 26940 -56679 -389164
13117c89164a08217C94054G2927b84656B9221J54298J8256H7493M5730c23930
$$ -389164 -108217 394054 72927 -284656 29221 183519 201775 87493 133223 -323930
13106A87187a05043B29140G8447c02378C87914r5587G5323k8600i3799B3634b858
$$ 187187 -105043 229140 78447 -302378 387914 292327 75323 46723 -93799 23634 -2858
13094A79835a59559K9745B35811i4163F0099J28151L5533p2404K93454A32302
$$ 179835 -159559 -129814 235811 -94163 60099 188250 223783 151379 444833 132302
13083b58807G2781Q6637b1825B05381c38E11318a61812P9551D02916j91938q5119
$$ -258807 72781 159418 -21825 205381 -338 511318 -161812 -82261 402916 210978 125859
13072A25859e0658j42156A15633K1872g5566G0469M3900e0137B85675E710a4062
$$ 125859 -50658 -192814 115633 137505 -75566 70469 114369 -50137 285675 5710 -14062
13060B44362P4287a1089F2965K7888K4215R8899a63365P82C52355j53720R364
$$ 244362 318649 -11089 62965 90853 115068 213967 -163365 -162583 352355 198635 207999
13049B07999B3635Q674J15714K16501d6222B18758E6834L91978A32630a10668
$$ 207999 23635 32309 148023 364524 -46222 218758 56834 448812 132630 -110668
13038a09479E41205A78894c1068A2082b4773q1626B81127a86030A17488M9119
$$ -109479 541205 178894 -31068 12082 -24773 -106399 281127 -186030 117488 166607
13028A66607c025j322H3599N29064f6191A59602a51314A23192a23488A27870L38880
$$ 166607 -3025 -4347 83599 612663 -66191 159602 -151314 123192 -123488 127870 466750
13017D66750B03831k6043f556j46152B97789A07506J08753I2309K2293l2786J16229
$$ 466750 203831 177788 -6556 -152708 297789 107506 216259 92309 114602 81816 198045
13006A98045F8741B4149a96197C28397A3553K03086B632R7163a11200A10265c51543
$$ 198045 68741 24149 -196197 328397 13553 216639 2632 99795 -111200 110265 -351543
12994A28352k4057j6600J95204a2430C15583j23597a73272B59388J0296N984a75049
$$ 128352 104295 87695 282899 -12430 315583 191986 -173272 259388 269684 275668 -175049
12982A52888a53599C41193d55781d4770A29714j0709b66261D01239C6062L25503
$$ 152888 -153599 341193 -455781 -44770 129714 119005 -266261 401239 36062 361565
12972C61565A36064D8978c85088e6122C29885c9324l8565A0987M8093O6038a24287
$$ 361565 136064 48978 -385088 -56122 329885 -39324 -77889 10987 59080 125118 -124287
12960I344a59151B7185c02966B09443c54197e0573k2636c516l12654h2570K3369
$$ 9344 -159151 27185 -302966 209443 -354197 -50573 -73209 -3516 -316170 -82570 -59201
12949e9201A0402N5615L47068g5952A33961a61437p949K7493j99906a19835A04167
$$ -59201 10402 66017 413085 -75952 133961 -161437 -169386 -141893 -341799 -119835 104167
12937I1662e0087F4416M013d8713A90567J19731d04952d7112j60912B15183d201
$$ 91662 -50087 64416 68429 -48713 190567 310298 -404952 -47112 -208024 215183 -4201
12925A5512K2167a90727H5494f7800A60738b0082A95226a57979E0821j8820K33860
$$ 15512 37679 -190727 85494 -67800 160738 -20082 195226 -157979 50821 32001 265861
12914B65861R8900j80412H075K1832J92072e510j76548A52528a86607B83612a7549
$$ 265861 364761 184349 8075 29907 221979 -5510 -182058 152528 -186607 283612 -17549
12902B00360C8288d691C3112c5379m4572A39099D9576P104O2734A9376J84712
$$ 200360 38288 -4691 33112 -35379 -79951 139099 49576 56680 119414 19376 204088
12891B04088L1697h6327A63235a17004B43840B5663J1501K16619h3815A78231
$$ 204088 235785 -86327 163235 -117004 243840 25663 37164 253783 -83815 178231
12880C48952l8581A32654c6372B88894d1427A35900d549A70955N4933j12625B5307
$$ 348952 310371 132654 -36372 288894 -41427 135900 -4549 170955 225888 113263 25307
12868b92484A3522K81691I2957c48494B06748c35397H0777d23124A31706i9199
$$ -292484 13522 295213 92957 -348494 206748 -335397 80777 -423124 131706 -99199
12857a22775D64977D9434L6956i4626K6835q1624j47461B5690I908m593b9310
$$ -122775 464977 49434 86390 -94626 -67791 -149415 -296876 25690 9908 5315 -29310
12845C01405d89076c2720G4677N3559f0668j00564d7968j61450b4721B55100d3449
$$ 301405 -489076 -32720 74677 128236 -60668 -161232 -47968 -209418 -24721 255100 -43449
12833b741A40679b60596e9391j053k0508q254k0388q3396e312k95094a34879I9808
$$ -2741 140679 -260596 -59391 -60444 -80952 -89206 -109594 -192990 -5312 -300406 -134879 99808
12820a95956A29049g5470D8147d2583j2666H4473a04047j74656C6998N7573K8268
$$ -195956 129049 -75470 48147 -42583 -55249 84473 -104047 -278703 36998 94571 122839
12809A22839a35333N8351j46601Q2147M4202A8548R4964A3114h949j54882D4619
$$ 122839 -135333 -76982 -223583 -141436 -97234 18548 113512 13114 -8949 -163831 44619
12797A48363b2228A22773k4471Q1977a30093A17243m5142L43630a78108B94909
$$ 148363 -22228 122773 98302 180279 -130093 117243 72101 415731 -178108 294909
12786G9524c43692a42058F2009C934K87719G0044R9738E4684J14629b62305f6777
$$ 79524 -343692 -142058 62009 3934 291653 70044 169782 54684 169313 -262305 -66777
12774c0423H1058b84798G5206a87738a2066m6909C11034a49288A0593J7877L06587
$$ -30423 81058 -284798 75206 -187738 -12066 -58975 311034 -149288 10593 28470 335057
12763C35057b03606I4247b44877A24192K08117b30937B57355c7562m7225o8407
$$ 335057 -203606 94247 -244877 124192 332309 -230937 257355 -37562 -84787 -153194
12753a53194b4684I6627b1883l16008a34474b0535l94256a37726C25758a80923
$$ -153194 -24684 96627 -21883 -337891 -134474 -20535 -414791 -137726 325758 -180923
12742G6071M5738e05841a15985C24994L839m0123g2264D37544A52502F5709a16
$$ 76071 121809 -505841 -115985 324994 328833 288710 -72264 437544 152502 65709 -116
12730d8531A56645a65629A27279A1982K8473a23145c6748j22880j00256Q1792
$$ -48531 156645 -165629 127279 11982 40455 -123145 -36748 -159628 -259884 -178092
12720a78092B27493C9636a96116f7182j8888A23690P9928a38678B10970J01805
$$ -178092 227493 39636 -196116 -67182 -86070 123690 203618 -138678 210970 312775
12710C12775p2585j826J28423k3224J69677A35715E7991L25524b40014B53412
$$ 312775 240190 238364 366787 343563 513240 135715 57991 383515 -240014 253412
12699B54132e0800B15807a46318a9920k43139C44007A09039d3427A2710i5296
$$ 254132 -50800 215807 -146318 -19920 -263059 344007 109039 -43427 12710 -95296
12688B5714L5641K41255b24872b0087j92826j361D67590i1982B27278e7456g227
$$ 25714 61355 302610 -224872 -20087 -212913 -214274 467590 -91982 227278 -57456 -7227
12676c17C63454G44K36774R1882K920c2061H4100j8497R8719e7521C38727H3819
$$ -317 363454 744 237518 329400 332320 -32061 84100 65603 164322 -57521 338727 83819
12663C1320f5056A29574l8790k953a49014E2729k3238J0597J94652D4063A4984
$$ 31320 -65056 129574 90784 87831 -149014 52729 29491 40088 234740 44063 14984
12651A04613a54606K9567B62796D4898J0358h2755C12555A36313M9223o9517R2464
$$ 104613 -154606 -125039 262796 44898 55256 -82755 312555 136313 185536 116019 208483
12640B08483b005B02531J06448a7299j67305B10941A2685h2380G2399Q7674k9303
$$ 208483 -2005 202531 308979 -17299 -184604 210941 12685 -82380 72399 160073 130770
12629A30770L30253J48434B92065L6005P0763i7876A95834a67484A98436J34215
$$ 130770 461023 609457 292065 328070 398833 -97876 195834 -167484 198436 332651
12619C32651G8666d2244B61285I2514D545R7084a45483I6662J07713g0343l4277
$$ 332651 78666 -42244 261285 92514 4545 101629 -145483 96662 204375 -70343 -104620
12608a04620D9059i1267j90778P4905h6956C31078C0457b16600r8231h4342B55445
$$ -104620 49059 -91267 -282045 -207140 -86956 331078 30457 -216600 -314831 -84342 255445
12596A61700j9719O5715f4028B33866E8433o682K20543a5601j32459E6981M4574
$$ 161700 141981 207696 -64028 233866 58433 51751 272294 -15601 -148060 56981 101555
12585A01555e2588l1364l8438k0847C3872J24878a09775A01787E421c1710C73611
$$ 101555 -52588 -83952 -122390 -143237 33872 158750 -109775 101787 5421 -31710 373611
12573D53246b84695c9994B47104F6733c64051a63301C2651J99819B871c4030G5278
$$ 453246 -284695 -39994 247104 66733 -364051 -163301 32651 232470 2871 -34030 75278
12561A70981A7957N2783C184O4078k5936J8038O2075a29748A88890a02527l72135
$$ 170981 17957 70740 3184 67262 41326 59364 121439 -129748 188890 -102527 -474662
12550d74662e2480j74640k9716H2918a60676A08858R076i6354k07677Q6270e873
$$ -474662 -52480 -227120 -256836 82918 -160676 108858 117934 -96354 -304031 -217761 -5873
12538c16233D2349J08963J52156j11885H021i0394L5241B61072a70838A33749
$$ -316233 42349 151312 303468 191583 8021 -90394 -55153 261072 -170838 133749
12527C55088a65835e018k6132B68487e2971j28068b9101C35090d4754q9321O6357
$$ 355088 -165835 -5018 -31150 268487 -52971 -181039 -29101 335090 -44754 -134075 -67718
12516f7718m4328l9688G1355a99782j76200J72401D97667h9370F3689g3907B04889
$$ -67718 -112046 -151734 71355 -199782 -375982 -203581 497667 -89370 63689 -73907 204889
12504B32045i1339C5158K35041F1043P4466D3124P1783A6364L3189k820a4534
$$ 232045 -91339 35158 270199 61043 135509 43124 114907 16364 49553 46733 -14534
12492A78822a9091l74273A97228h0651r5581k419A10447Q2876q0924J6016C7515
$$ 178822 -19091 -393364 197228 -80651 -176232 -178651 110447 193323 112399 128415 37515
12480h6402A79997e6063n4667C44584j46278B0887M71089k38989A19609A2450
$$ -86402 179997 -56063 -110730 344584 198306 20887 491976 252987 119609 12450
12469g395B1356a89814B06066G0153a9814j15632p062C37150H6626a9165A4667
$$ -7395 21356 -189814 206066 70153 -19814 -135446 -142508 337150 86626 -19165 14667
12457I4621a68262A55569i3182A10509g0815o9899A16886M6267c91947a53481
$$ 94621 -168262 155569 -93182 110509 -70815 -140714 116886 163153 -391947 -153481
12446a87721k767K1171A48936m5635a98551h1740a5020B9827J69661a97168C5059
$$ -187721 -190488 -169317 148936 103301 -198551 -81740 -15020 29827 199488 -197168 35059
12434E2272C537a56167O0527B09695k8756l3860J70422a25786B84914D6395P8787
$$ 52272 3537 -156167 -95640 209695 180939 147079 317501 -125786 284914 46395 125182
12423A25182a94570I4246a97192B59190A964a531q4646k9844N1052A1501b03114
$$ 125182 -194570 94246 -197192 259190 1964 -1531 -86177 -116021 -64969 11501 -203114
12411c1275j18058j6853b2768m02092A84537p4943m4532c8932C4608L0700K56492
$$ -31275 -149333 -166186 -22768 -424860 184537 109594 65062 -38932 34608 65308 321800
12400C21800b47561K9821a4742j13529n2849L2013C2390i1852p3629d8674B11743
$$ 321800 -247561 -217740 -14742 -128271 -181120 -149107 32390 -91852 -165481 -48674 211743
12388A36989c9342m9074k44273a13235D5667c1885k31641l5832B6493A3018J66965
$$ 136989 -39342 -88416 -332689 -113235 45667 -31885 -263526 -299358 26493 13018 179983
12377A79983d7282r5755j43733a5223q5249C28200G7180b75611A10442m3859c3751
$$ 179983 -47282 -143037 -286770 -15223 -100472 328200 77180 -275611 110442 66583 -33751
12365A07376a7369o9814j04095A37359J79226c7272k15881C4289f4852A11712
$$ 107376 -17369 -87183 -191278 137359 316585 -37272 -253153 34289 -64852 111712
12354c24687e706j03275k8023A04700F516b9613o961B22769j08950b1981A09141
$$ -324687 -5706 -108981 -137004 104700 6516 -29613 -36574 222769 113819 -21981 109141
12342E2935b91325a16705A92911b26399B68042j15572j4812J8952o2664R6494
$$ 52935 -291325 -116705 192911 -226399 268042 152470 137658 156610 93946 190440
12332A90440f1819r7604A41032c60683J72666f0226b4321A62473a67359B97980
$$ 190440 -61819 -159423 141032 -360683 -188017 -60226 -24321 162473 -167359 297980
12321E3078L1274K14392e7749j0086C3124b3340j01907O564M6352A697i7696A50129
$$ 53078 84352 298744 -57749 -67835 33124 -23340 -125247 -118683 -72331 1697 -97696 150129
12308D626J10217g5093j8634A92012K5958N9102b7212D3929j6556d15071f214
$$ 4626 114843 -75093 -93727 192012 217970 277072 -27212 43929 27373 -415071 -6214
12296b18599l2677A60995G9363c72044D17640a13859r3122F971A223a3115B9203
$$ -218599 -251276 160995 79363 -372044 417640 -113859 -206981 6971 1223 -13115 29203
12284A44445B4589a13877e196C36956E6214K10986J13104M6579B10793j528c426
$$ 144445 24589 -113877 -5196 336956 56214 267200 380304 426883 210793 209265 -3426
12272a00879A07317D6372c03750b2323A37517G413L11388b83517A39763K8226
$$ -100879 107317 46372 -303750 -22323 137517 7413 318801 -283517 139763 167989
12262A67989A3643a47883C03008A40804b13792b6230j94117B45287J2458J1986
$$ 167989 13643 -147883 303008 140804 -213792 -26230 -220347 245287 257745 269731
12252B69731o6830J3115J27144c7186o4724B50917a18960C90680E5187J86038
$$ 269731 202901 216016 343160 -37186 -101910 250917 -118960 390680 55187 241225
12242B41225D8734P1583d1099A77316M5016j10231O9575k3677c88960a49582L4157
$$ 241225 48734 120317 -41099 177316 222332 112101 181676 157999 -388960 -149582 -115425
12231a15425q6052b607D37754j63194J9999G1888J08803K67209J68329k27811
$$ -115425 -201477 -2607 437754 274560 294559 71888 180691 447900 616229 388418
12221C88418c1975E6217N22462G1555a0520A45032j7807K07649b02570A85228
$$ 388418 -31975 56217 578679 71555 -10520 145032 127225 334874 -202570 185228
12210B13999l6201o7261B4407K74509b86741b3140B69430a95806D12689l53k4899
$$ 213999 177798 110537 24407 298916 -286741 -23140 269430 -195806 412689 412336 387437
12199C87437K382b0598F80382l13842I8245d867C03860j03400n1516m6214N2325
$$ 387437 389819 -20598 680382 366540 98245 -4867 303860 200460 148944 102730 155055
12188A55055P7336A8424J18373j7063K98573e6343a2331j20825k7277C05104A6188
$$ 155055 232391 18424 136797 119734 418307 -56343 -12331 -133156 -160433 305104 16188
12176b88440A85005A1636K9062c2186A19868R650A4768K24649a98852A33379K8571
$$ -288440 185005 11636 40698 -32186 119868 129518 14768 239417 -198852 133379 161950
12165A61950o2846b4591B36287k1836j00246J9791j0815b1585E4155a74769B11352
$$ 161950 99104 -24591 236287 214451 114205 133996 123181 -21585 54155 -174769 211352
12153b35518k06743C71892f1059j50021H1240J99755h6309A63151a57017r100
$$ -235518 -442261 371892 -61059 -211080 81240 280995 -86309 163151 -157017 -166117
12143a66117j0994A72175F0793j842K82088j55717g5444A49236a54439B92941
$$ -166117 -177111 172175 60793 58951 341039 185322 -75444 149236 -154439 292941
12132i7454A00482l2599J26780a66017i834A24846J1901C8898N03143A28103a73734
$$ -97454 100482 67883 194663 -166017 -9834 124846 136747 38898 542041 128103 -173734
12120i7624p186K7963K8640F3927A7637L73158q2266j15691Q0577n9495b2825
$$ -97624 -104810 -76847 -48207 63927 17637 390795 308529 192838 273415 213920 -22825
12108H0165N9799F3742J3425R6697J14049b01058H3073K7385e0482A219b56368
$$ 80165 139964 63742 77167 173864 287913 -201058 83073 110458 -50482 1219 -256368
12096a95394B75449C2832f2815q9773j00893j67803A35669a4233o5766l6124C3955
$$ -195394 275449 32832 -62815 -152588 -253481 -421284 135669 -14233 -79999 -116123 33955
12084A22828h3220k79375b1422O30P206m48944D3663M0388K15065m5449O45771
$$ 122828 -83220 -362595 -21422 -20792 -13586 -462530 43663 84051 299116 253667 899438
12073H99438J112890q35170C36099E7437M9627a08849A1456M3283b51665R173
$$ 899438 2012328 1177158 336099 57437 107064 -108849 11456 54739 -251665 -242492
12063b42492B3884R5824a32956F1952P3965a34000j36690M306K2979J10545n532
$$ -242492 23884 119708 -132956 61952 135917 -134000 -270690 -266384 -243405 -132860 -138392
12052a38392k4080a2548j68850H6781M55783h8713D8629b18311h6834a8316C44917
$$ -138392 -162472 -12548 -181398 86781 542564 -88713 48629 -218311 -86834 -18316 344917
12040a24944L3988j9336L0016B36068F3057d852B47360H7219p995A9871p181e0943
$$ -124944 -90956 -110292 -80276 236068 63057 -4852 247360 87219 79224 19871 12690 -50943
12027A84981a87702A45138i9256b6190A93758a68311O9140B29702F4754R4600
$$ 184981 -187702 145138 -99256 -26190 193758 -168311 -99171 229702 64754 159354
12017A59354F3256F41L07822a08867A83229O8736k4064B8545J75196I4415a12819
$$ 159354 63256 641 308463 -108867 183229 251965 227901 28545 203741 94415 -112819
12005C1257Q4582a64288A63642d9910A24800k181b24173d0152j04767L3879a8719
$$ 31257 115839 -164288 163642 -49910 124800 122619 -224173 -40152 -144919 -111040 -18719
11993d30992J91550I0020b3866A03856a08662q914A97267a67114O5508J9743C18758
$$ -430992 -239442 90020 -23866 103856 -108662 -117576 197267 -167114 -101606 -81863 318758
11981c6824D0923J3412b36627C34548c10305B27333E4456b71419J3289j9770c0750
$$ -36824 40923 54335 -236627 334548 -310305 227333 54456 -271419 -258130 -277900 -30750
11969A98745c4874k79074j242J12462a9636l8665A88671q9586i3921j75151B7913
$$ 198745 -34874 -313948 -315190 -202728 -19636 -58301 188671 99085 -93921 -269072 27913
11957a78406A19943b20578k07812d1874A65624l8736a12727a4917j65877p0806
$$ -178406 119943 -220578 -428390 -41874 165624 126888 -112727 -14917 -180794 -251600
11947b51600C52005a12558A14969J2222l4786A2234K20402q0862M8353b84773
$$ -251600 352005 -112558 114969 127191 92405 12234 232636 151774 200127 -284773
11936a18592J1685l3607e0021a1508m4031j98670H456a29044D3377h9521E2867
$$ -118592 -106907 -140514 -50021 -11508 -55539 -254209 8456 -129044 43377 -89521 52867
11924d19401A21292f293j95437O7083C05139F7336j9808k1099b60746D65925A68332
$$ -419401 121292 -6293 -201730 -134647 305139 67336 47528 26429 -260746 465925 168332
11912f3918K5750E2855i4327J1190m0360A43274L06528a40951b8563B23902k5370
$$ -63918 -38168 52855 -94327 -83137 -123497 143274 449802 -140951 -28563 223902 198532
11901A98532C1494J99234H9737a31129A79117J91219d6139j24972a2991B57111
$$ 198532 31494 230728 89737 -131129 179117 370336 -46139 -171111 -12991 257111
11890a94815C38301A38007a09202G9709a17955K2403k4179D2526b15960m753k16460
$$ -194815 338301 138007 -109202 79709 -117955 -95552 -119731 42526 -215960 -220713 -437173
11879d37173f4950E835a33792k40859i276D0467B570J25353R5211a36417B48377
$$ -437173 -64950 5835 -133792 -374651 -9276 40467 2570 127923 223134 -136417 248377
11867A89751O1991b16326h1945G737a40525c4806a6273j67153B29582e1161j64406
$$ 189751 251742 -216326 -81945 7737 -140525 -34806 -16273 -183426 229582 -51161 -215567
11856b15567e6274B11266a45015B82281b63564e3501k29236B03466r8090a17126
$$ -215567 -56274 211266 -145015 282281 -263564 -53501 -282737 203466 105376 -117126
11845a25007N7722k10323Q2980A7624a09021K7427j86366a983k50139M3925O5342
$$ -125007 -67285 -277608 -194628 17624 -109021 -81594 -267960 -1983 -252122 -208197 -142855
11834a42855e9682q3247F1599J14303b77666B02995a43324L0233A30684d00257
$$ -142855 -59682 -142929 61599 175902 -277666 202995 -143324 -113091 130684 -400257
11823c13947b1636A45779F9958O6891D2729J31965K7042q9559j7180b29016L7863
$$ -313947 -21636 145779 69958 136849 42729 174694 201736 112177 94997 -229016 -191153
11812a91153d4536j54420B65559k2889I4510b48176B2697a37891m1295f270A65275
$$ -191153 -44536 -198956 265559 242670 94510 -248176 22697 -137891 -179186 -6270 165275
11800e785j96013N8453k07340D1533a82085D74340h6549H5049f5709A3039b11883
$$ -5785 -201798 -143345 -350685 41533 -182085 474340 -86549 85049 -65709 13039 -211883
11788c02821j03990A80003B7568c2304B33896c21813B04288N6711b15903B34727
$$ -302821 -406811 180003 27568 -32304 233896 -321813 204288 260999 -215903 234727
11777b94808i6886A35848J20813o1729p774f8113j89125M7503Q7151C73816E4877
$$ -294808 -96886 135848 256661 194932 187158 -68113 -257238 -209735 -122584 373816 54877
11765D6547O4943a81888q4995B7313K3878a54797q1568J07991C5515a5884E4546
$$ 46547 111490 -181888 -266883 27313 51191 -154797 -236365 -128374 35515 -15884 54546
11753c64283C5173b2163g482k42675A1269K8498J04588B4625a41869A89185a97809
$$ -364283 35173 -22163 -7482 -250157 11269 39767 144355 24625 -141869 189185 -197809
11741b20027L6962H7560J61869b7488j33230M7218f313n7017E2218R665a64569
$$ -220027 -183065 87560 249429 -27488 -160718 -113500 -6313 -63330 52218 61883 -164569
11729a02147A5128a37430D2763a45951o9125d3108m2481j46245C8659G476K13514
$$ -102147 15128 -137430 42763 -145951 -215076 -43108 -85589 -231834 38659 7476 220990
11718B20990o810a48900L5174n856j09921B05352h589E1467d9339a521B59131
$$ 220990 214180 -148900 -113726 -119582 -229503 205352 -8589 51467 -49339 -1521 259131
11706a57030E4385M4237J55088D6158K40532b83054Q5618g8589B95372a16079
$$ -157030 54385 98622 253710 46158 286690 -283054 -197436 -78589 295372 -116079
11695E4980c65515i5678B05473b09859C14570J15507i3695j06973B0516J44703
$$ 54980 -365515 -95678 205473 -209859 314570 430077 -93695 -200668 20516 165219
11685A65219f3448C75665a22489A69821L037d0785p2289N1929A49734J59734e6047
$$ 165219 -63448 375665 -122489 169821 172858 -40785 -113074 -61145 149734 309468 -56047
11673B11723J30197b6846A11239b62855B81632l4707f4542M763D27164a48870
$$ 211723 341920 -26846 111239 -262855 281632 246925 -64542 -59779 427164 -148870
11662E0286b00581F3029c55678C9600J31264K4339h3176c2085C3731I981A706
$$ 50286 -200581 63029 -355678 39600 170864 195203 -83176 -32085 33731 9981 1706
11650G1854c02354D2618K69061I2629a74246j15376i5183a0540j438j2989j05644
$$ 71854 -302354 42618 311679 92629 -174246 -289622 -95183 -10540 -11978 -24967 -130611
11639a30611A50608a89851L279K9431A47793i0480j89817F0240K89406D1354h8298
$$ -130611 150608 -189851 -186572 -157141 147793 -90480 -280297 60240 349646 41354 -88298
11627c38389A60949b0694I126L0272E300a58858b6947G7734e3119J2525E3453
$$ -338389 160949 -20694 9126 39398 5300 -158858 -26947 77734 -53119 -40594 53453
11615c39760A08690a5620j46032P4530A4928d7689n6186A09229e7198k02250A28458
$$ -339760 108690 -15620 -161652 -87122 14928 -47689 -103875 109229 -57198 -259448 128458
11603a57118A06625j7676b07363a8667D5184R6253K04260k3392J40435r4487A76870
$$ -157118 106625 88949 -207363 -18667 45184 141437 345697 322305 462740 368253 176870
11591A88401B913e7726p2455E4052a38713A61272B3446a71875G9819C5244f6993
$$ 188401 2913 -57726 -130181 54052 -138713 161272 23446 -171875 79819 35244 -66993
11579B49419H7059L7069d4190B06553E7499j2101M1033K2699R6301a9611I7707
$$ 249419 87059 124128 -44190 206553 57499 45398 86431 109130 205431 -19611 97707
11567A43514d19681E1906D036K65848g8714D73604A21689a773B3636b5223B41145
$$ 143514 -419681 51906 4036 269884 -78714 473604 121689 -1773 23636 -25223 241145
11555A80726H8194P4445n3507K35959o2683C993c4876H6436a6685k49185A625
$$ 180726 88194 162639 109132 345091 282408 3993 -34876 86436 -16685 -265870 1625
11543i6550C64188d3602I0336i4918k28733a13721C6916K47761q3973D9566L64393
$$ -96550 364188 -43602 90336 -94918 -323651 -113721 36916 284677 200704 49566 413959
11532D13959I3973K29465k2017A08566l4165K83732c18325B42966A06313b64036
$$ 413959 93973 323438 301421 108566 74401 358133 -318325 242966 106313 -264036
11521c41962b4755A09742K52098p1387j02132j0972m8321A9510L58247o4998M5618
$$ -341962 -24755 109742 361840 290453 188321 177349 129028 19510 377757 312759 358377
11510C58377j21995n5024K7516a13145C3513d1719b0292A50644b36977A74259
$$ 358377 236382 181358 208874 -113145 33513 -41719 -20292 150644 -236977 174259
11499B00503L5171a7510C11978A55526M6639K1031j04221P5901k9232e934C6181
$$ 200503 235674 -17510 311978 155526 202165 223196 118975 194876 165644 -5934 36181
11487A36742M10507a60908C76516f6944A57206J8463K21383G9615J64093b3370
$$ 136742 547249 -160908 376516 -66944 157206 175669 397052 79615 243708 -23370
11476F5490K39631c4996G7308L11317H8032J83716d2988C8755P8137R1122n9772
$$ 65490 305121 -34996 77308 388625 88032 271748 -42988 38755 116892 208014 148242
11465A48242n7444a11036I2101k8479A9398J03690K2195J25982m3224b6844k6206
$$ 148242 90798 -111036 92101 63622 19398 123088 145283 271265 228041 -26844 -53050
11454e3050C8041K1609K39533r6377g1656H6796d0988B8785a254A6498a03212
$$ -53050 38041 59650 299183 202806 -71656 86796 -40988 28785 -1254 16498 -103212
11442C36966d5089F7895A2313J51549l7835C4982P0442g4961n4924c8446A35254
$$ 336966 -45089 67895 12313 163862 126027 34982 105424 -74961 -129885 -38446 135254
11430F5204J51907o3679c01294E5435L0150b66676f8760r7143j39743B179K36462
$$ 65204 217111 153432 -301294 55435 85585 -266676 -68760 -165903 -305646 2179 238641
11419B38641E0387J72068a25775r9435F8180a11352A75133K68574A44069b17738
$$ 238641 50387 222455 -125775 -225210 68180 -111352 175133 443707 144069 -217738
11408C37769b01578A02447a41938F8925K40189A08357B340b1206B21930E325R3683
$$ 337769 -201578 102447 -141938 68925 309114 108357 2340 -21206 221930 5325 99008
11397I9008J10428o7132b07441O7732B99810A42074a94656i710C6849h9410p6520
$$ 99008 209436 142304 -207441 -139709 299810 142074 -194656 -9710 36849 -89410 -165930
11386a65930k87285J88942a06110G6562a78339p689C06551b25234A26017J17789
$$ -165930 -453215 -264273 -106110 76562 -178339 -186028 306551 -225234 126017 243806
11376B43806A7260i2781A25596b30230B7590h9676D4910h4752A18098a21049C7100
$$ 243806 17260 -92781 125596 -230230 27590 -89676 44910 -84752 118098 -121049 37100
11364b6859b051j87551p763A84041g3887B39025p0102c71418a05662j97640a12729
$$ -26859 -2051 -189602 -197365 184041 -73887 239025 168923 -371418 -105662 -303302 -112729
11352f4774p4114B78714K2306d59041A5372e5554j92328C72783c53708A93828
$$ -64774 -138888 278714 301020 -459041 15372 -55554 -247882 372783 -353708 193828
11341d8340j64564i3462C31988I847a60282K7075B80427H3115a21992k57363J77590
$$ -48340 -212904 -93462 331988 9847 -160282 -133207 280427 83115 -121992 -379355 -201765
11330b01765E4832N8203L6837B9775b38814C74829d6975k08605m9947K5972i6986
$$ -201765 54832 113035 149872 29775 -238814 374829 -46975 -255580 -305527 -279555 -96986
11318A00551b41914B2088h3099A03276h3387j96478R8109F2708g9816C3327R3362
$$ 100551 -241914 22088 -83099 103276 -83387 -279865 -181756 62708 -79816 33327 126689
11307A26689K44851c0810q3649j72059B1406b11182R1260c3519I5281d5231B8226
$$ 126689 371540 -30810 -114459 -286518 21406 -211182 -119922 -33519 95281 -45231 28226
11295b65223B05706i0973k45541B21396a30408o7975b4211l15561R3952M5932
$$ -265223 205706 -90973 -336514 221396 -130408 -198383 -24211 -339772 -245820 -199888
11285a99888j8053Q0914N7214r3950E8290a82757O6704G5705b07763K2214h7619
$$ -199888 -217941 -137027 -79813 -173763 58290 -182757 -116053 75705 -207763 -185549 -87619
11273B81300A6265O8339B8355f9922o3000D6534J14511N8715I4655a07840j9392
$$ 281300 16265 84604 28355 -69922 -132922 46534 161045 219760 94655 -107840 -127232
11262a27232A2002c83672g8059F2613K0223a95889A70045d11482d3595C11462
$$ -127232 12002 -383672 -78059 62613 82836 -195889 170045 -411482 -43595 311462
11251b01253G4828B7073b75666a18524o4757B09102P5872g0098k0236j07544M2147
$$ -201253 74828 27073 -275666 -118524 -183281 209102 284974 -70098 -90334 -197878 -155731
11240a55731E3878a31256h81n02487i2451k72693C0905c3346B7326b54712k5992
$$ -155731 53878 -131256 -881 -503368 -92451 -365144 30905 -33346 27326 -254712 -280704
11229b80704a7781r0757B45752c6450j30111c1781j26102g7896l4788d3873I3148
$$ -280704 -17781 -108538 245752 -36450 -166561 -31781 -157883 -77896 -112684 -43873 93148
11217h2744H7706J43285b61707O55p2639Q5918B40034a23185G3123M0458a96807
$$ -82744 87706 230991 -261707 -261052 -333691 -247773 240034 -123185 73123 113581 -196807
11205b40041J18902e0380j8551j76753B27488D2943a88332b9741j84310h9064
$$ -240041 -121139 -50380 -68931 -245684 227488 42943 -188332 -29741 -214051 -89064
11194H7220a45576p8914d7007E38648A58380B0511P1675a66684A46297a38138
$$ 87220 -145576 -224490 -47007 538648 158380 20511 92186 -166684 146297 -138138
11183A30192c081j59463e7929p9558A74283Q3738a1648G7579a33103A53824b98494
$$ 130192 -3081 -162544 -57929 -137487 174283 258021 -11648 77579 -133103 153824 -298494
11171c25232p7059a41461G7995d3185A82586a66864L7080A51632c0310A04810
$$ -325232 -402291 -141461 77995 -43185 182586 -166864 -129784 151632 -30310 104810
11160A02726e8451A82389k3027J7528q4913J9786J4452b43993F2284a30464r829
$$ 102726 -58451 182389 159362 176890 91977 111763 126215 -243993 62284 -130464 -140293
11149a40293a7233l32737J12303f5469k4503j4791A12211b2472B22290r3551b32443
$$ -140293 -17233 -349970 -237667 -65469 -89972 -104763 112211 -22472 222290 128739 -232443
11137a20172J7286D05057j93763b196k96319K1754G4883J12660b5963A54871K0832
$$ -120172 -102886 405057 211294 -2196 -298515 -276761 74883 187543 -25963 154871 175703
11126A75703b9977H0861a84683H960K47548G4313a6488A12230K6851J53668R6410
$$ 175703 -29977 80861 -184683 8960 256508 74313 -16488 112230 139081 292749 389159
11115C89159C1388K08624d038B42440a25646C01563Q72A3521K27152C4647J79423
$$ 389159 31388 240012 -4038 242440 -125646 301563 302435 13521 240673 34647 214070
11104B14070P7317L670A22920k0522K35951q0245F2658P8830K40186A33864K16457
$$ 214070 291387 295057 122920 102398 338349 258104 62658 141488 381674 133864 350321
11093C50321C0426K12579F6643M10i7867B73899g7290A91295M43198a05102B93573
$$ 350321 30426 243005 66643 67053 -97867 273899 -77290 191295 634493 -105102 293573
11081B76069j07927K3434P0799N4267r1335L0492A22859Q2318K04927p2170Q1214
$$ 276069 168142 191576 262375 316642 225307 255799 122859 205177 410104 337934 419148
11070D19148A34734m6351J18608J48681J1863A45376L39579Q10k01309L61312
$$ 419148 134734 88383 206991 355672 367535 145376 484955 485765 284456 645768
11060F45768A26069M66491B79288N21201l01522K6802J14287j68259K67471K36092
$$ 645768 126069 592560 279288 800489 498967 525769 640056 471797 739268 975360
11050I75360j72834r8177J20908l38589L2492M10808k65479k7331O3260B87821
$$ 975360 802526 704349 825257 486668 519160 929968 664489 637158 700418 287821
11039G21891O1828C17561K92040k23453M04491L5478J46212k26937C22761K68403
$$ 721891 783719 317561 609601 386148 790639 826117 972329 745392 322761 591164
11029E91164j6205P3422O4703r6841J97052r2125j51066J02864C01419L80025
$$ 591164 574959 648381 713084 616243 813295 721170 570104 672968 301419 681444
11019F81444j89050M6740j76525j67414K86312Q6575k6242J88340j67945j71304
$$ 681444 492394 539134 362609 195195 481507 568082 541840 730180 562235 390931
11009C90931K94509k85452N3642M08721R0605l05373m2786j14340K37312l03612
$$ 390931 685440 399988 453630 862351 952956 647583 604797 490457 727769 424157
10999D24157K36220J29633l37077J35471J03022N1280K3822N3563k27111m8406
$$ 424157 660377 790010 452933 588404 691426 742706 766528 820091 592980 544574
10989E44574J24277l4530j33906M09180l1170L46084j93037k8223K70290M0549
$$ 544574 668851 634321 500415 909595 878425 1224509 1031472 1003249 1273539 1314088
10979A314088j88221J22434J37079K28828M13796L31477R4428J71282J93139l07802
$$ 1314088 1125867 1248301 1385380 1614208 2028004 2359481 2453909 2625191 2818330 2510528
10969B510528J08905k77272l49283J43618j92148k79442k38668j20577M78556
$$ 2510528 2619433 2342161 1992878 2136496 1944348 1664906 1426238 1305661 1784217
10960A784217l102r8239L22751m4818l57193j53689J48157k02386k02510n8046
$$ 1784217 1781115 1682876 2005627 1960809 1603616 1449927 1598084 1395698 1193188 1135142
10950A135142m15893M8179K128k96654j47688j00900Q8125G5274J81835q7658
$$ 1135142 719249 767428 769556 472902 325214 224314 312439 75274 257109 169451
10940A69451F8437J28947h2720B44118a41384e492B97892G0544d4976D8321i898
$$ 169451 68437 197384 -82720 244118 -141384 -5492 297892 70544 -44976 48321 -9898
10928D6950k3176a28712p9868A60576C6447a30850A11865K00792b50796J13964
$$ 46950 23774 -128712 -208580 160576 36447 -130850 111865 312657 -250796 -136832
10918a36832j11964A20853P505B5019K65062A09974K73801b8556j94292A84091
$$ -136832 -248796 120853 128358 25019 290081 109974 383775 -28556 -222848 184091
10907b19593B22329a3784o1300A17411B0638i967A06703b885j36026c9708B40918
$$ -219593 222329 -13784 -75084 117411 20638 -9967 106703 -2885 -138911 -39708 240918
10895g2083k6375D15145h9430a0754k83311J28813j61926a25484B7786A951b5528
$$ -72083 -98458 415145 -89430 -10754 -294065 -165252 -327178 -125484 27786 1951 -25528
10883A60408a58860F0071J5570p679a11480m5475j1898l22209a74829B9089J10102
$$ 160408 -158860 60071 75641 67962 -111480 -156955 -168853 -491062 -174829 29089 139191
10872A39191B9235J42565P6261G7312D558e3057j4165B8747K21716b12030B113
$$ 139191 29235 171800 248061 77312 4558 -53057 -67222 28747 250463 -212030 2113
10860h129k79738A32971a74475a7116B6427a38151H9849k3772J28807E2711e3842
$$ -8129 -287867 132971 -174475 -17116 26427 -138151 89849 66077 194884 52711 -53842
10848C86087I1352g0848L1274j42558A4338d29796B15108o7497a75222e0230A13789
$$ 386087 91352 -70848 -39574 -182132 14338 -429796 215108 147611 -175222 -50230 113789
10836C853a99402F8587g4391A19304D2893K30331L6841a0627G0347a7287j0071
$$ 3853 -199402 68587 -74391 119304 42893 273224 310065 -10627 70347 -17287 -27358
10825b7358p2627n1800C5733c4837A88824l887n4627K10345H1191C5964J56505
$$ -27358 -99985 -151785 35733 -34837 188824 184937 130310 340655 81191 35964 192469
10814A92469b24276c5651H7874b53055h554l56947F3934a80230e4411A90008G1376
$$ 192469 -224276 -35651 87874 -253055 -8554 -365501 63934 -180230 -54411 190008 71376
10802d3515G8296i6115j06648R3131L3398b5041k0177G68J5127g6365A98528a64694
$$ -43515 78296 -96115 -202763 -109632 -76234 -25041 -45218 768 15895 -76365 198528 -164694
10789c6119L775l06549Q0039P1659B0254L21927p6206c01860J31609c9291j22454
$$ -36119 -32344 -338893 -258854 -187195 20254 342181 265975 -301860 -170251 -39291 -161745
10778a61745j24619P9148o369C21020a33070N8985B8456d252j17856d0679A24778
$$ -161745 -286364 -207216 -213585 321020 -133070 -74085 28456 -4252 -122108 -40679 124778
10766h9482H8714c3987B27781c92472A38016P3402J05172b11654B61864B0833
$$ -89482 88714 -33987 227781 -392472 138016 211418 316590 -211654 261864 20833
10755A6174J07112B0198J75075a79859Q8033p4183B01010a04528j43711G031J25461
$$ 16174 123286 20198 195273 -179859 -91826 -166009 201010 -104528 -248239 7031 132492
10744A32492F2658c62289O3179P6650p2104h3328C12678A02222b98121J35432
$$ 132492 62658 -362289 -299110 -222460 -294564 -83328 312678 102222 -298121 -162689
10734a62689C46455b09199c4725A98446B9338J08990i6184b3386r9814p9793P3392
$$ -162689 346455 -209199 -34725 198446 29338 138328 -96184 -23386 -123200 -202993 -129601
10723a29601c9252k19432A18474a49738k0674B91264A32879b4430A6545P1816
$$ -129601 -39252 -258684 118474 -149738 -170412 291264 132879 -24430 16545 88361
10713H8361b49541e3251j17722A20594a12588a6898p5484j00471A4274J63938
$$ 88361 -249541 -53251 -170973 120594 -112588 -16898 -92382 -192853 14274 178212
10703A78212b75741a29515A29698a77290B7440b02424f0294A28441J47428p8417
$$ 178212 -275741 -129515 129698 -177290 27440 -202424 -60294 128441 275869 197452
10693A97452G7153M4946A8794J06613d94477B11715c85048A47914a60377A07781
$$ 197452 77153 122099 18794 125407 -494477 211715 -385048 147914 -160377 107781
10682C6180b3307A12954M1215c4463k06745j84580A26984K03335a69253C42837
$$ 36180 -23307 112954 154169 -34463 -241208 -425788 126984 330319 -169253 342837
10671c5602C28524b40955f246B33707f88308K19386C59765a5196q528D72947g2351
$$ -35602 328524 -240955 -6246 233707 -688308 -468922 359765 -15196 -23724 472947 -72351
10659A2718a58542I2280D4416c10393N8769J07431b4992j15978B4772J84809a01804
$$ 12718 -158542 92280 44416 -310393 -251624 -144193 -24992 -140970 24772 209581 -101804
10647C7947J54404E7308b43151j50553f5160G2730b68669C5120J7232b38824A13031
$$ 37947 192351 57308 -243151 -393704 -65160 72730 -268669 35120 52352 -238824 113031
10635H6817d36631B23016B3058b0271A38128e5591k75813c9113p040A18671a45173
$$ 86817 -436631 223016 23058 -20271 138128 -55591 -331404 -39113 -46153 118671 -145173
10623E3648i45I5035a96355a3333c487m0548B2711b16191A78285D6976Q3638A1735
$$ 53648 -945 95035 -196355 -13333 -3487 -44035 22711 -216191 178285 46976 130614 11735
10610A17999b9349D4254J54164b10509F8719a00347n5330J67D852a2524j19147
$$ 117999 -29349 44254 198418 -210509 68719 -100347 -155677 -155510 4852 -12524 -131671
10599a31671e1235j57623j71320A47384D6876i7689E5760a13670n5530k25513
$$ -131671 -51235 -208858 -380178 147384 46876 -97689 55760 -113670 -169200 -394713
10589c94713a54208D8286N000a26213k46542a43347m7425A30669b86430a08263
$$ -394713 -154208 48286 53286 -126213 -372755 -143347 -190772 130669 -286430 -108263
10578A3184M1028a75536A81128G3751H725b6222p8647j34708O9192d2930j36297
$$ 13184 54212 -175536 181128 73751 8725 -26222 -104869 -239577 -170385 -42930 -179227
10567a79227N706A1503b61899J17624B31211A5780d08758i1741M2083q2688B02762
$$ -179227 -173521 11503 -261899 -144275 231211 15780 -408758 -91741 -49658 -132346 202762
10555b74537J23698B7943a81356k29259B2595K23021b5489C550b231j23401B14938
$$ -274537 -150839 27943 -181356 -410615 22595 245616 -25489 3550 -2231 -125632 214938
10543A60930b1531C96978a15513A0899K62705j06676a83290f2186o4674A48059
$$ 160930 -21531 396978 -115513 10899 273604 166928 -183290 -62186 -126860 148059
10532D184a23556C38067d8374l98030D6399a86917A36558a22556B42202E8665
$$ 4184 -123556 338067 -48374 -446404 46399 -186917 136558 -122556 242202 58665
10521A81311c30097J07371A70525c44625G0917Q7834k6205e5418o4109A01995
$$ 181311 -330097 -222726 170525 -344625 70917 158751 132546 -55418 -119527 101995
10510a63521L6778j3830B48157a12341F614a86342O9087c5727I2508R7524g4592
$$ -163521 -126743 -140573 248157 -112341 6614 -186342 -117255 -35727 92508 190032 -74592
10498b35398R7527f1577k09949A05039a78501I9832N1328a73916F4648a61523
$$ -235398 -137871 -61577 -271526 105039 -178501 99832 151160 -173916 64648 -161523
10487E58143A005K02626K9438c97018A21581i8436C71829P6550q2939K00636I761
$$ 558143 1005 203631 233069 -397018 121581 -98436 371829 448379 365440 566076 9761
10475B84990b7958A49065L6098C7505i5862l2116j56330g0733l2152p8177A77695
$$ 284990 -27958 149065 185163 37505 -95862 -127978 -284308 -70733 -102885 -181062 177695
10463c46202d5183r7627G7495a40012l365H3125b11532A83064A5275K986a91171
$$ -346202 -45183 -142810 77495 -140012 -143377 83125 -211532 183064 15275 18261 -191171
10451C08194q0742c4092C24650D807g0366q2493j02932J7091A27681o2511N2419
$$ 308194 227452 -34092 324650 4807 -70366 -152859 -255791 -238700 127681 65170 117589
10440A17589B1089f7399I514J64959E2716b6626C76586r3903E1854A2618K79089
$$ 117589 21089 -67399 9514 174473 52716 -26626 376586 282683 51854 12618 291707
10429B91707a28073b5514G3450R343c7695A02559J23137e507C131K9194a8781
$$ 291707 -128073 -25514 73450 82793 -37695 102559 225696 -5507 3131 32325 -18781
10417A69694c55618A21949a83105k0917M6387l0735q7058F2312C691J24695a34397
$$ 169694 -355618 121949 -183105 -204022 -157635 -188370 -275428 62312 3691 128386 -134397
10405A79946M0461I9753a14528k16385l3611c0482E9913K12499a06762M4234G6476
$$ 179946 220407 99753 -114528 -330913 -364524 -30482 59913 272412 -106762 -62528 76476
10393e2155B64630E5907J24147o6076J42392b25806H6337K69798j77935a8656
$$ -52155 264630 55907 180054 113978 256370 -225806 86337 356135 178200 -18656
10382a26322C45025o1953a72868A53008J38476p3182R0521A15473J94194I4816
$$ -126322 345025 283072 -172868 153008 291484 218302 308823 115473 309667 94816
10371B84849m1588C866L99170n7440K60279k44788Q6210j63575j07279K43511
$$ 284849 243261 3866 403036 345596 605875 361087 447297 283722 176443 419954
10361D19954H1050c2953C49823K41201k60426G0124J60035J9075K914K66762j03919
$$ 419954 81050 -32953 349823 591024 330598 70124 230159 249234 252148 518910 414991
10350D14991j32681I8829M73694j15624r6469A08427K43658l514d4371A08576
$$ 414991 282310 98829 572523 456899 360430 108427 352085 348571 -44371 108576
10339B10853K1274D4095J43770n7697k7636Q1173M8558B7749J61571m8041E781
$$ 210853 232127 44095 187865 130168 102532 183705 232263 27749 189320 141279 5781
10327c1596j8645H3460R2741a29346C63398A81198K00916a93272A2376b67849
$$ -31596 -50241 83460 176201 -129346 363398 181198 382114 -193272 12376 -267849
10316b45531a17634B74967B7725b5810A07738b03733A16282J23490i5985C23245
$$ -245531 -117634 274967 27725 -25810 107738 -203733 116282 239772 -95985 323245
10305a2021q3916j2311c5335k13218i7238q0862A58761B8857b58916J08966D50747
$$ -12021 -95937 -108248 -35335 -248553 -97238 -178100 158761 28857 -258916 -149950 450747
10293b6909j05790l8450M3149A78456a65926F2959b32925g9598j34721D5843a1660
$$ -26909 -132699 -171149 -128000 178456 -165926 62959 -232925 -79598 -214319 45843 -11660
10281E6525k7413c21979J01621J08474B91719b46203a4230j98449h8092b4726
$$ 56525 29112 -321979 -220358 -111884 291719 -246203 -14230 -212679 -88092 -24726
10270A41335F7717A4130J29781g4367L5304A47376L6799a18646H0387P4428K56101
$$ 141335 67717 14130 143911 -74367 -39063 147376 184175 -118646 80387 154815 410916
10259D10916q2755r7157p7157j2390b3912j1196A3830a86287C8952K09047D0821
$$ 410916 328161 231004 153847 141457 -23912 -35108 13830 -186287 38952 247999 40821
10247b2645n0745o9584F2808d6348A11708D0763a17207L4908A94752b89884o0206
$$ -22645 -73390 -142974 62808 -46348 111708 40763 -117207 -82299 194752 -289884 -350090
10236c50090A36758A4769e2363K5325j45406d967E581b44221a13791D1207b09391
$$ -350090 136758 14769 -52363 -27038 -172444 -4967 5581 -244221 -113791 41207 -209391
10224a3127B11491k4513a08048B88195D6720J20496a739C67456i369B36698Q0342
$$ -13127 211491 186978 -108048 288195 46720 167216 -1739 367456 -9369 236698 317040
10213C17040i1635D36455f0539J7456F1361c82732R4244a30291d9431o9373C72691
$$ 317040 -91635 436455 -60539 -43083 61361 -382732 -288488 -130291 -49431 -118804 372691
10201C10694A5455O0296h8604j99532E3344e5117l27640J0364A77348j8261L49413
$$ 310694 15455 75751 -88604 -288136 53344 -55117 -382757 -372393 177348 159087 508500
10190E08500d81624A14886c09747i0966H4525a31961M4869j22908p8536B33449
$$ 508500 -481624 114886 -309747 -90966 84525 -131961 -87092 -210000 -288536 233449
10179I3526A1945P6754h3026B76043i9268p8275A82741d53486A63699d41721j36402
$$ 93526 11945 88699 -83026 276043 -99268 -177543 182741 -453486 163699 -441721 -578123
10168e78123a8236j35123B78821E5901d26393O2611J65989d9676j6865b1314p228
$$ -578123 -18236 -153359 278821 55901 -426393 -363782 -197793 -49676 -66541 -21314 -28542
10157b8542j51965k9890R1176j03449E4253c71939a02632A33261b39317N3482
$$ -28542 -180507 -210397 -119221 -222670 54253 -371939 -102632 133261 -239317 -185835
10147a85835k6661J04297n5752P7214j10614c1949I54c4858j14321j14795a17918
$$ -185835 -212496 -108199 -163951 -86737 -197351 -31949 954 -34858 -149179 -263974 -117918
10135E7063h1120j07198B15865j06795b12891R7798q1213d0560m7474j37829R6002
$$ 57063 -81120 -188318 215865 109070 -212891 -115093 -196306 -40560 -88034 -225863 -129861
10124a29861A81864a94976q5768j84759a6101B20141b34245j38885F9445P2189
$$ -129861 181864 -194976 -280744 -465503 -16101 220141 -234245 -373130 69445 141634
10114A41634b60791B04079b60301A47320b77763j05230A07297k8096a46852B13679
$$ 141634 -260791 204079 -260301 147320 -277763 -382993 107297 79201 -146852 213679
10103a13080q5157o3359k3443A5296h3362B11631H4589J50914I2628J45809b2582
$$ -113080 -198237 -261596 -285039 15296 -83362 211631 84589 235503 92628 238437 -22582
10091c30262j02450a07718B8503a46413D7969a17317N2750a7960B5333i4336H0115
$$ -330262 -432712 -107718 28503 -146413 47969 -117317 -64567 -17960 25333 -94336 80115
10079A90624m5518c21940N8563B81233a51085c9663o0933l09690a24139D9361
$$ 190624 145106 -321940 -263377 281233 -151085 -39663 -100596 -410286 -124139 49361
10068A17902I310J10416J13203J2736o0880b17365h5722A97277g4898B65224I9917
$$ 117902 9310 119726 232929 245665 184785 -217365 -85722 197277 -74898 265224 99917
10056b03904A68458b5223F7730j948Q9176a13393k04292a10291k8524D4620a9000
$$ -203904 168458 -25223 67730 65782 154958 -113393 -317685 -110291 -138815 44620 -19000
10044c21738Q9001A6888a46618O761o0984b8739k13748R3292j07891r5727k1508
$$ -321738 -232737 16888 -146618 -139857 -200841 -28739 -242487 -149195 -257086 -352813 -374321
10033c74321J44686c4183r376N212B79789a56360j71489h692k1602g890o0819
$$ -374321 -229635 -34183 -43559 -38347 279789 -156360 -327849 -8692 -30294 -7890 -68709
10022f8709D5291i5784P225B40767a58916B3308f106G456R529g3073j14182R1101
$$ -68709 45291 -95784 -88559 240767 -158916 23308 -6106 7456 16985 -73073 -187255 -96154
10010i6154D888e4313j16608A36026c25022l8202h5271j8549j01321j33579C06960
$$ -96154 4888 -54313 -170921 136026 -325022 -363224 -85271 -103820 -205141 -338720 306960
9998A66922c55303R162a59832L2456L5197A16657b28026a6326j73634A82402a87461
$$ 166922 -355303 -346141 -159832 -127376 -92179 116657 -228026 -16326 -189960 182402 -187461
9986e1575q145o0266J298N2020k13730g8778K9739I7798m8010a45841Q920C8170
$$ -51575 -59720 -119986 -118688 -66668 -280398 -78778 -49039 97798 49788 -145841 -136921 38170
9973a82713B2838J20724Q4250b04034M7085j15630C0268e9174A90227a2757m5711
$$ -182713 22838 143562 227812 -204034 -156949 -272579 30268 -59174 190227 -12757 -58468
9962e8468j83030J02884J2541A52268a81669E1163a20199L8764r3323c140A95225
$$ -58468 -241498 -138614 -126073 152268 -181669 51163 -120199 -81435 -174758 -3140 195225
9950a1676k13562F6355a8527l58017a13180k48043a21377A08083b86672F8252
$$ -11676 -225238 66355 -18527 -376544 -113180 -361223 -121377 108083 -286672 68252
9939g852k73193m8436J4341a54342a9615E9120J65029h799C9592a96060D8526
$$ -7852 -281045 -329481 -315140 -154342 -19615 59120 224149 -8799 39592 -196060 48526
9927A37176a26864j53631j17039a09826o5131j6811K9443k5000D5639g7212E8775
$$ 137176 -126864 -280495 -397534 -109826 -174957 -191768 -162325 -187325 45639 -77212 58775
9915a01128A98847G970h4409j08053b001A4669O2914K2648a12262L7563j49943
$$ -101128 198847 7970 -84409 -192462 -2001 14669 77583 100231 -112262 -74699 -224642
9904b24642A08439j4935m2717F800P7507a17772K377A6026M0692a20182K4991
$$ -224642 108439 93504 50787 6800 84307 -117772 -115395 16026 56718 -120182 -95191
9893i5191B8416a3386k97439B12008c1068A26381F184R1804J63919A3805i8822
$$ -95191 28416 -13386 -310825 212008 -31068 126381 6184 97988 261907 13805 -98822
9881F3092J49542c79909d7530k06245m0536a20476B70119f8560p7797h561B4451
$$ 63092 212634 -379909 -47530 -253775 -294311 -120476 270119 -68560 -146357 -8561 24451
9869a29135Q924j06405a09102f905j02079C4145b12068k69467h1775F8573b61094
$$ -129135 -120211 -226616 -109102 -6905 -108984 34145 -212068 -481535 -81775 68573 -261094
9857A91827a87298B83511b26064d0237j6822f329p4366e405j29586Q015j39867
$$ 191827 -187298 283511 -226064 -40237 -57059 -6329 -80695 -5405 -134991 -126976 -266843
9846b66843O2996e2977j15945k49533K00267K8168A14097B6075d3630p7038B29171
$$ -266843 -203847 -52977 -168922 -418455 -218188 -190020 114097 26075 -43630 -120668 229171
9834A30298b94210j48916a05321I5880a68785a7628B38997a28245C7522h0710
$$ 130298 -294210 -443126 -105321 95880 -168785 -17628 238997 -128245 37522 -80710
9823G027K14753a3907j02185H8892m2670P0714e05372A64181J03277c85264c3948
$$ 7027 221780 -13907 -116092 88892 46222 116936 -505372 164181 267458 -385264 -33948
9811H3316a24716Q273F6793b10123f2529j36264j10807a19476C9427R5945o5854
$$ 83316 -124716 -116443 66793 -210123 -62529 -198793 -309600 -119476 39427 135372 69518
9800F9518d02016h5422l9192j71295A59399a37865A18577f2537C39295a30393
$$ 69518 -402016 -85422 -124614 -295909 159399 -137865 118577 -62537 339295 -130393
9789g6896p915j3150l17448c9832j56954l114L7431l2060O5417H9598h865k66447
$$ -76896 -84811 -97961 -415409 -39832 -196786 -199900 -162469 -194529 -129112 89598 -8865 -275312
9777b75312A31942J0294g7533C64761a10522J5216B8719b41127c3976B9766c2144
$$ -275312 131942 142236 -77533 364761 -110522 -95306 28719 -241127 -33976 29766 -32144
9765E9670a56681bl7236l86979c1269m17918e1279B41027i9857r4451A28707L1996
$$ 59670 -156681 -2 -37238 -424217 -31269 -449187 -51279 241027 -99857 -194308 128707 160703
9753A60703J95600a67594j03385j17233k1442a94755R7362C12190f9352c3954
$$ 160703 356303 -167594 -270979 -388212 -409654 -194755 -97393 312190 -69352 -33954
9742e2389j40099j61715J27423B59975B948J73946a19904o156c5013A99641j8786
$$ -52389 -192488 -354203 -226780 259975 2948 176894 -119904 -126060 -35013 199641 180855
9731A80855l2603j3266k7391J38898J0668G3496a32672J2707A57879Q1545c32794
$$ 180855 148252 134986 107595 246493 257161 73496 -132672 -119965 157879 239424 -332794
9719A07770C6429g4659K6899g606p9028K7846j72165D0986a8592k17742E1562
$$ 107770 36429 -74659 -47760 -7606 -86634 -58788 -230953 40986 -18592 -236334 51562
9707a16059J5033b426l84668J78300o6015A09122m4471c88864G6441c22993A55866
$$ -116059 -101026 -2426 -387094 -208794 -274809 109122 64651 -388864 76441 -322993 155866
9695C31093c30527d3771j24867b5662G3813J22611h4129j62956H0276B7811a29787
$$ 331093 -330527 -43771 -168638 -25662 73813 196424 -84129 -247085 80276 27811 -129787
9683D033i8296B36279f8066F613a97410B74197c90110a08106l17239C58862b0395
$$ 4033 -98296 236279 -68066 6613 -197410 274197 -390110 -108106 -425345 358862 -20395
9671G0193d4383G2605a1213C8735d0047a0876r2205k22243M7666A30844a49414
$$ 70193 -44383 72605 -11213 38735 -40047 -10876 -103081 -325324 -277658 130844 -149414
9659e9565l4257B71253A27754a11364B4164A1547a01437B428K51108i9532k67422
$$ -59565 -93822 271253 127754 -111364 24164 11547 -101437 2428 253536 -99532 -366954
9648c66954h4604n5575j73240A40030l2893b35278c3735j3027A17080a85898g1532
$$ -366954 -84604 -140179 -313419 140030 107137 -235278 -33735 -46762 117080 -185898 -71532
9636G1950b25304E1574a63840B428b48356n4343M5855G5813J55671a78131N5850
$$ 71950 -225304 51574 -163840 2428 -248356 -302699 -256844 75813 231484 -178131 -122281
9625a22281D8321b38242q7512A92221a69630P6105C1315L04580a96496c828A05172
$$ -122281 48321 -238242 -325754 192221 -169630 -93525 31315 335895 -196496 -3828 105172
9613F1902a85241A42154a70657A47410a53710M7382j12200a04655A60030a25295
$$ 61902 -185241 142154 -170657 147410 -153710 -106328 -218528 -104655 160030 -125295
9602b31139A55442N8339a3528c959j60981B29393b10016p4719n0980B12917c09366
$$ -231139 155442 213781 -13528 -3959 -164940 229393 -210016 -284735 -335715 212917 -309366
9590a00238M2523j76976a11114R473A44056b93810I026b92268e5838A36869P6381
$$ -100238 -57715 -234691 -111114 -101641 144056 -293810 9026 -292268 -55838 136869 213250
9579B13250d55550a65334g7402j57822a01683j0826M9656k26488B16197b18275
$$ 213250 -455550 -165334 -77402 -235224 -101683 -112509 -62853 -289341 216197 -218275
9568H5907R360b99463D2421c8998n062k06067A6703J50634C4931b73247e3180
$$ 85907 95267 -299463 42421 -38998 -44060 -250127 16703 167337 34931 -273247 -53180
9556f1802j48678O8162I6201a99737H809c32361H2193J70013C0319K58537a29796
$$ -61802 -210480 -142318 96201 -199737 8809 -332361 82193 252206 30319 288856 -129796
9544A60264d3387B66631c14553a23892c1042C6752M728b50729J23723A65053b79962
$$ 160264 -43387 266631 -314553 -123892 -31042 36752 41480 -250729 -127006 165053 -279962
9532d76j6146j19115c1574k08174A49985l5515e8314m84100D7245c38066a56939
$$ -476 -16622 -135737 -31574 -239748 149985 114470 -58314 -542414 47245 -338066 -156939
9520b38993H3807M5800f852B3815K3522A912J97184g7257C02703a0599H1761B7264
$$ -238993 83807 129607 -6852 23815 47337 1912 199096 -77257 302703 -10599 81761 27264
9507B8200a94128F9203n427a89413j3369A70807a90717f4250j10245A20714f3315
$$ 28200 -194128 69203 63776 -189413 -202782 170807 -190717 -64250 -174495 120714 -63315
9495A2265a44225n1842f5606A07088c4185B36176j12494a52675O4757k90584B7359
$$ 12265 -144225 -196067 -65606 107088 -34185 236176 123682 -152675 -87918 -378502 27359
9483c83116a39703j89097O4101A93207b84846O3123a01191d9481A41249b73232
$$ -383116 -139703 -328800 -264699 193207 -284846 -221723 -101191 -49481 141249 -273232
9472F7982a5271D9251c8395G1343L3508B3315a56042b4262C4899c91861A67166
$$ 67982 -15271 49251 -38395 71343 104851 23315 -156042 -24262 34899 -391861 167166
9460A0364a5278j8737A9566a43893B83015a84506D649b12144O2028L8149I5212
$$ 10364 -15278 -34015 19566 -143893 283015 -184506 4649 -212144 -150116 -111967 95212
9448b53680k85410K26541B90912a11317B33422i9587A20471b1470k74171f043
$$ -253680 -539090 -312549 290912 -111317 233422 -99587 120471 -21470 -295641 -6043
9437a9282A5207J86745g4455K0388j42212j3252d8735i605k86167N9065H8444
$$ -19282 15207 201952 -74455 -54067 -196279 -209531 -48735 -9605 -295772 -236707 88444
9425a92622H5748b45959C05940P4177E1281C729K6800b65363A48271D8731a99122
$$ -192622 85748 -245959 305940 380117 51281 3729 30529 -265363 148271 48731 -199122
9413g1400C98027b51894A5218K07104a46484p3798i0043B75166G0228a05196p2532
$$ -71400 398027 -251894 15218 222322 -146484 -220282 -90043 275166 70228 -105196 -177728
9402a77728J2283r1607c0108D1456a32161A49166I380a97640A26849a43573B04008
$$ -177728 -165445 -257052 -30108 41456 -132161 149166 9380 -197640 126849 -143573 204008
9390e3364j30309B21442c77018a62169K7545f1538B26881q3570a15420j1656b7341
$$ -53364 -183673 221442 -377018 -162169 -134624 -61538 226881 143311 -115420 -127076 -27341
9378D500K70851g3844B47608m9263o1414D4209d77565a10446B7307a36343K5220
$$ 4500 275351 -73844 247608 198345 136931 44209 -477565 -110446 27307 -136343 -111123
9367a11123l37764B79269b05493e8821k22802f8197j60116f6924k50896c7733
$$ -111123 -448887 279269 -205493 -58821 -281623 -68197 -228313 -66924 -317820 -37733
9356a2474G5462J47322B8048a0710A43073R6688b01985g1454m9244B00771B2581
$$ -12474 75462 222784 28048 -10710 143073 239761 -201985 -71454 -120698 200771 22581
9344b23164e6704D447J79524J71194b85387N2538r0221a35582A4215b24321E3895
$$ -223164 -56704 4447 183971 355165 -285387 -232849 -323070 -135582 14215 -224321 53895
9332h3446B1976a23286k65033d4986j16194A672O5833d1446j83101d1245l0226
$$ -83446 21976 -123286 -388319 -44986 -161180 1672 67505 -41446 -224547 -41245 -71471
9321g1471k33326g6554B89052d06220a05390o6740q9137a23898j5328D4998a22910
$$ -71471 -304797 -76554 289052 -406220 -105390 -172130 -261267 -123898 -139226 44998 -122910
9309B24616b3468A75279e0080B41630E6591e8019A42002n7688a30071B06183a23604
$$ 224616 -23468 175279 -50080 241630 56591 -58019 142002 84314 -130071 206183 -123604
9297A41380b65287F7931b4814l46210a34873p5847I6781a87283N9709A6900b1466
$$ 141380 -265287 67931 -24814 -371024 -134873 -210720 96781 -187283 -127574 16900 -21466
9285b255j79948F2968J89640I9503c39534b5451N347A1287f7441E1304J3393Q0878
$$ -2255 -182203 62968 252608 99503 -339534 -25451 -20104 11287 -67441 51304 64697 145575
9273A45575g8374j75296E6960e37627J71491J50838A75049f0835k27625f9993
$$ 145575 -78374 -253670 56960 -537627 -366136 -215298 175049 -60835 -288460 -69993
9262a34808M545A12734E5024A391J13148e7037B55555E0715e0042m21325a78840
$$ -134808 -130263 112734 55024 1391 114539 -57037 255555 50715 -50042 -471367 -178840
9250h5184j01139m7458A46697k7874a11453a5280G1219a75325k87506a9042o2536
$$ -85184 -186323 -233781 146697 118823 -111453 -15280 71219 -175325 -462831 -19042 -81578
9239h1578p6676k13511E6529J5184J79367l1979H1798f21746J77055D6652a15348
$$ -81578 -158254 -371765 56529 71713 251080 219101 81798 -621746 -444691 46652 -115348
9227e8778D580h4210R146n7842E3254A1630Q7436m2507b06154D86a8295E6779
$$ -58778 4580 -84210 -75064 -132906 53254 11630 99066 56559 -206154 486 -18295 56779
9214C411O2115b50140K3952D8147a72784a1122l30787G2339N4061l2008i1595
$$ 3411 65526 -250140 -226188 48147 -172784 -11122 -341909 72339 126400 94392 -91595
9202B00709c23056A84026G4474B7429J39337A4579c9396F4607J7704b19449A29198
$$ 200709 -323056 184026 74474 27429 166766 14579 -39396 64607 82311 -219449 129198
9190B43443B5010J1158J2656i6909D2755a30315B25413a70165j72529A30899e05640
$$ 243443 25010 36168 48824 -96909 42755 -130315 225413 -170165 -342694 130899 -505640
9178f4050J7319k1196D7916a07623j09527F2495a69301C279b51804B22801h4795
$$ -64050 -46731 -67927 47916 -107623 -217150 62495 -169301 3279 -251804 222801 -84795
9166e80706F0040J5542e2780j5829j95950O40B45521A09136l7067b34040o7883
$$ -580706 60040 75582 -52780 -68609 -264559 -263919 245521 109136 72069 -234040 -301923
9155c01923I370R7696M6919m5583M158a79809B28209a25615A60610a38470C49937
$$ -301923 9370 107066 153985 108402 112560 -179809 228209 -125615 160610 -138470 349937
9143a39503J2861H3128D0198a40721q9968R9536j84704a57835C21231g4191l07386
$$ -139503 -126642 83128 40198 -140721 -230689 -131153 -315857 -157835 321231 -74191 -381577
9132c81577a28672k01026g4472D0978b69492A38573L1832k9608O491D4186c31506
$$ -381577 -128672 -329698 -74472 40978 -269492 138573 170405 140797 147288 44186 -331506
9120c17303f617j50354a0916A29141a76136g1659k31412a8165n8076A82706b20035
$$ -317303 -6617 -156971 -10916 129141 -176136 -71659 -303071 -18165 -76241 182706 -220035
9108b2157l72436b042k93132a2295k59722A47948n5934B9017a80200qA09058K4137
$$ -22157 -394593 -2042 -295174 -12295 -272017 147948 92014 29017 -180200 -180208 109058 133195
9096A33195d12745a60632c3671A87986c8963G5299c16378A97883a85976k2529
$$ 133195 -412745 -160632 -33671 187986 -38963 75299 -316378 197883 -185976 -208505
9086b08505c4633A2866b49052j24272J65848A39456J54514D7877a37826A88419
$$ -208505 -34633 12866 -249052 -373324 -207476 139456 293970 47877 -137826 188419
9075a30372q2155a6758j98987A83270L2109L1368c17513k12791K16058g8971j29624
$$ -130372 -212527 -16758 -215745 183270 215379 246747 -317513 -530304 -314246 -78971 -208595
9064b08595B2219a07284k8724A41242b18642B86542a94478H4550a91394A46108
$$ -208595 22219 -107284 -136008 141242 -218642 286542 -194478 84550 -191394 146108
9053c0601o4025K5697b0213m5107K9240F9607o184h9869j70617J27587a6049l38155
$$ -30601 -94626 -68929 -20213 -65320 -36080 69607 63423 -89869 -260486 -132899 -16049 -354204
9041c54204C8230K41539B0303N3160d71006J79386b352j23077B39728b19349C84107
$$ -354204 38230 279769 20303 73463 -471006 -291620 -2352 -125429 239728 -219349 384107
9029c0684q35A11055i8702l4771A29802F0090a18391j73281J42635F41251D4359
$$ -30684 -31519 111055 -98702 -133473 129802 60090 -118391 -291672 -149037 641251 44359
9017f8008p7725j73497B49713B0723m627N2306a89964A72208Q0410a16018B73988
$$ -68008 -145733 -319230 249713 20723 16096 68402 -189964 172208 252618 -116018 273988
9005a98279A02449J23550p2126a23092A04412i7369A65033a84952G4405e1487
$$ -198279 102449 225999 153873 -123092 104412 -97369 165033 -184952 74405 -51487
8994a11851p5716J3628j05210a21339m2483P1162j19506d2293F8680i4669L2745
$$ -111851 -187567 -173939 -279149 -121339 -163822 -92660 -212166 -42293 68680 -94669 -61924
8983f1924n0641C72521p3263j42857a93652g1248j28160B26496b37082B9080q553
$$ -61924 -112565 372521 299258 156401 -193652 -71248 -199408 226496 -237082 29080 20527
8972B0527b0187l70250G3589M0779a80510J5851k5747P2326j24339B87263G4973
$$ 20527 -20187 -390437 73589 114368 -180510 -164659 -190406 -118080 -242419 287263 74973
8960a22748j69397F5596J75818j19724N2617G9985J01029H2353b36713A3499e4651
$$ -122748 -292145 65596 241414 121690 174307 79985 181014 82353 -236713 13499 -54651
8948a088j22347k47677J47995a11272a5949G9077K44296a31778N2723D61489D6267
$$ -1088 -123435 -371112 -223117 -111272 -15949 79077 323373 -131778 -79055 461489 46267
8936I6225a2601F1878j3223a02174r2958p4960C9631i5626E2861j5114L31155
$$ 96225 -12601 61878 48655 -102174 -195132 -270092 39631 -95626 52861 37747 368902
8925C68902j28085J027473J906704M594576K295115B212015E61973J93519B63264
$$ 368902 240817 1268290 3174994 7769570 10064685 2212015 561973 755492 263264
8915E09790a47651a1343j38151A46051a6926A15391J86126q5996I9507L5008b56727
$$ 509790 -147651 -11343 -149494 146051 -16926 115391 301517 215521 99507 134515 -256727
8903A21271m1131C7890J87974C7688a73104p5886j7105G8411a41055b0923k92324
$$ 121271 80140 37890 225864 37688 -173104 -248990 -266095 78411 -141055 -20923 -313247
8892c13247A26593b78552A6203e05733A60093p4455b34319G9585J42922a89128
$$ -313247 126593 -278552 16203 -505733 160093 85638 -234319 79585 222507 -189128
8881a31085l0353m8310a3581D0279h9922q9606r5734a33496k11385C1165c02945
$$ -131085 -161438 -209748 -13581 40279 -89922 -179528 -275262 -133496 -344881 31165 -302945
8869c37570D1494b08092C5388N8651D123b86238A5271J07760H608M6643d08610
$$ -337570 41494 -208092 35388 94039 4123 -286238 15271 123031 8608 55251 -408610
8857A81896i8037j15168l788a00421j30603M9141A20708a32384f3456A01120l5173
$$ 181896 -98037 -213205 -216993 -100421 -231024 -181883 120708 -132384 -63456 101120 65947
$$ [...]
##END NTUPLES=NMR SPECTRUM
##END=
