
##TITLE=AC1172_Tolima-ibage-TFiAH12005_7165075_biRkHNU73v
##JCAMPDX= 6.0         $$ Bruker NMR JCAMP-DX V2.0
##DATA TYPE= NMR SPECTRUM
##DATA CLASS= NTUPLES
##ORIGIN= BRUKER
##OWNER= Administrator
$$ 1.72 TOPSPIN		Version 2.1
$$ 2012-12-01 18:39:36.753 -0500  Administrator@X
$$ Compression mode = diff/dup
##.OBSERVE FREQUENCY= 400.02188249412
##.OBSERVE NUCLEUS= ^1H
##.ACQUISITION MODE= SIMULTANEOUS (DQD)
##.ACQUISITION SCHEME= undefined
##.AVERAGES= 8
##.DIGITISER RES= 22
##SPECTROMETER/DATA SYSTEM= spect
##.PULSE SEQUENCE= zg30
##.SOLVENT NAME= COFFEE_meoh
##.SHIFT REFERENCE= INTERNAL, COFFEE_meoh, 1, 14.98509
##AUDIT TRAIL= $$ (NUMBER, WHEN, WHO, WHERE, PROCESS, VERSION, WHAT)
$$ ##TITLE= Audit trail, TOPSPIN		Version 2.1
$$ ##JCAMPDX= 5.01
$$ ##ORIGIN= Bruker BioSpin GmbH
$$ ##OWNER= Administrator
$$ $$ E:\/data/COFFEE/nmr/AC1172_Tolima-ibage-TFiAH12005_7165075_biRkHNU73v/10/pdata/1/auditp.txt
$$ ##AUDIT TRAIL=  $$ (NUMBER, WHEN, WHO, WHERE, PROCESS, VERSION, WHAT)
(   1,<2012-12-01 18:39:29.029 -0500>,<Administrator>,<X>,<go>,<TOPSPIN 2.1>,
      <created by zg
	started at 2012-12-01 18:38:21.138 -0500,
	POWCHK enabled, PULCHK disabled,
       configuration hash MD5:
       86 BA 57 50 F2 9D 5C 9B 26 00 A9 28 5F 66 2E 89
       data hash MD5: 64K
       91 EB 4A A3 8F CB D0 AE 23 06 4C 01 A5 8C 7E 02>)
(   2,<2012-12-01 18:39:31.870 -0500>,<Administrator>,<X>,<proc1d>,<TOPSPIN 2.1>,
      <Start of raw data processing
       efp LB = 0 FT_mod = 6 PKNL = 1 PHC0 = 0 PHC1 = 0 SI = 32K 
       data hash MD5: 32K
       A6 05 35 80 AF BA C4 48 CB 47 7C 61 84 3E E6 03>)
(   3,<2012-12-01 18:39:32.284 -0500>,<Administrator>,<X>,<proc1d>,<TOPSPIN 2.1>,
      <pk PHC0 = 96.10291 PHC1 = 0 
       data hash MD5: 32K
       40 0B 3D AE 7C D0 CB 45 CC 53 30 57 F0 D4 20 14>)
(   4,<2012-12-01 18:39:32.484 -0500>,<Administrator>,<X>,<proc1d>,<TOPSPIN 2.1>,
      <abs ABSG = 1 
       data hash MD5: 32K
       81 C9 A0 9A 43 7E BA 8C 30 FC 41 79 43 62 AD AD>)
(   5,<2012-12-01 18:39:32.626 -0500>,<Administrator>,<X>,<proc1d>,<TOPSPIN 2.1>,
      <abs ABSG = 2 
       data hash MD5: 32K
       45 07 51 90 23 81 B5 D3 AD 1E 76 C7 96 AE AD 9D>)
(   6,<2012-12-01 18:39:32.769 -0500>,<Administrator>,<X>,<proc1d>,<TOPSPIN 2.1>,
      <abs ABSG = 3 
       data hash MD5: 32K
       5B 45 5C DB BC 41 05 3F CB 0D 52 55 5B 31 2A 3B>)
(   7,<2012-12-01 18:39:32.912 -0500>,<Administrator>,<X>,<proc1d>,<TOPSPIN 2.1>,
      <abs ABSG = 4 
       data hash MD5: 32K
       D2 D6 6B 11 B4 54 D2 4B C3 E4 96 88 B0 5B A5 B4>)
(   8,<2012-12-01 18:39:33.055 -0500>,<Administrator>,<X>,<proc1d>,<TOPSPIN 2.1>,
      <abs ABSG = 5 
       data hash MD5: 32K
       AA EA 41 65 0E B7 1A 36 EF E2 D9 38 2E E8 B3 B0>)
$$ ##END=
$$ 
$$ $$ hash MD5
$$ $$ C8 46 A9 5F FE E0 21 1A A9 C2 8B ED 49 DA 82 DA
##$RELAX= 
##$RELAX= 
##$RELAX= 
##$RELAX= 
##$RELAX= 
##$RELAX= 
##$RELAX= 
$$ Bruker specific parameters
$$ --------------------------
##$DU= <E:\>
##$EXPNO= 10
$$ [...]
150 150 150 150 150 150 150 150
##$TP07= 0
##$TPNAME0= <>
##$TPNAME1= <>
##$TPNAME2= <>
##$TPNAME3= <>
##$TPNAME4= <>
##$TPNAME5= <>
##$TPNAME6= <>
##$TPNAME7= <>
##$TPOAL= (0..7)
0.5 0.5 0.5 0.5 0.5 0.5 0.5 0.5
##$TPOFFS= (0..7)
0 0 0 0 0 0 0 0
##$TUNHIN= 0
##$TUNHOUT= 0
##$TUNXOUT= 0
##$USERA1= <user>
##$USERA2= <user>
##$USERA3= <user>
##$USERA4= <user>
##$USERA5= <user>
##$V9= 5
##$VALIST= <valist>
##$VCLIST= <CCCCCCCCCCCCCCC>
##$VD= 0
##$VDLIST= <DDDDDDDDDDDDDDD>
##$VPLIST= <PPPPPPPPPPPPPPP>
##$VTLIST= <TTTTTTTTTTTTTTT>
##$WBST= 1024
##$WBSW= 4
##$XGAIN= (0..3)
0 0 0 0
##$XL= 0
##$YL= 0
##$YMAX_a= 665129
##$YMIN_a= -561135
##$ZGOPTNS= <>
##$ZL1= 120
##$ZL2= 120
##$ZL3= 120
##$ZL4= 120
##$ABSF1= 14.98509
##$ABSF2= -5.573092
##$ABSG= 5
##$ABSL= 3
##$ALPHA= 0
##$AQORDER= 0
##$ASSFAC= 0
##$ASSFACI= 0
##$ASSFACX= 0
##$ASSWID= 0
##$AUNMP= <proc_prof1d_extract_pilot.lims>
##$AXLEFT= 0
##$AXNAME= <>
##$AXNUC= <1H>
##$AXRIGHT= 0
##$AXTYPE= 0
##$AXUNIT= <>
##$AZFE= 0.1
##$AZFW= 0.1
##$BCFW= 0
##$BC_mod= 0
##$BYTORDP= 0
##$COROFFS= 0
##$CY= 15
##$DATMOD= 1
##$DC= 0
##$DFILT= <>
##$DTYPP= 0
##$F1P= 0
##$F2P= 0
##$FCOR= 0.5
##$FTSIZE= 32768
##$FT_mod= 6
##$GAMMA= 0
##$GB= 0
##$INTBC= 1
##$INTSCL= 1
##$ISEN= 128
##$LB= 0
##$LEV0= 0
##$LPBIN= 0
##$MAXI= 10000
##$MC2= 0
##$MEAN= 0
##$ME_mod= 0
##$MI= 0
##$NCOEF= 0
##$NC_proc= -8
##$NLEV= 6
##$NOISF1= 0
##$NOISF2= 0
##$NSP= 0
##$NTH_PI= 0
##$NZP= 0
##$OFFSET= 14.98509
##$PC= 1
##$PHC0= 96.10291
##$PHC1= 0
##$PH_mod= 1
##$PKNL= yes
##$PPARMOD= 0
##$PPDIAG= 0
##$PPIPTYP= 0
##$PPMPNUM= 2147483647
##$PPRESOL= 1
##$PSCAL= 4
##$PSIGN= 0
##$PYNMP= <proc.py>
##$REVERSE= no
##$SF= 400.02
##$SI= 32768
##$SIGF1= 0
##$SIGF2= 0
##$SINO= 400
##$SIOLD= 32768
##$SPECTYP= <>
##$SREGLST= <1H.CDCl3>
##$SSB= 0
##$STSI= 32768
##$STSR= 0
##$SW_p= 8223.68421052631
##$SYMM= 0
##$S_DEV= 0
##$TDeff= 65536
##$TDoff= 0
##$TI= <>
##$TILT= no
##$TM1= 0
##$TM2= 0
##$TOPLEV= 0
##$USERP1= <user>
##$USERP2= <user>
##$USERP3= <user>
##$USERP4= <user>
##$USERP5= <user>
##$WDW= 1
##$XDIM= 32768
##$YMAX_p= 475796472
##$YMIN_p= -694687
##$CURPLOT= <Network HP LaserJet P1505>
##$CURPRIN= <$Network HP LaserJet P1505>
##$DFORMAT= <normdp>
##$LAYOUT= <+/1D_H.xwp>
##$LFORMAT= <normlp>
##$PFORMAT= <normpl>
##$SURQMSG= 1
$$ End of Bruker specific parameters
$$ ---------------------------------
##NTUPLES= NMR SPECTRUM
##VAR_NAME=  FREQUENCY,     SPECTRUM/REAL,   SPECTRUM/IMAG
##SYMBOL=    X,             R,               I
##VAR_TYPE=  INDEPENDENT,   DEPENDENT,       DEPENDENT
##VAR_FORM=  AFFN,          ASDF,            ASDF
##VAR_DIM=   32768,         32768,           32768
##UNITS=     HZ,            ARBITRARY UNITS, ARBITRARY UNITS
##FACTOR=    0.250966925370066, 1,           1
##FIRST=     8223.43324360094, -102636,      -151540
##LAST=      0,             77730,           -28991
##MIN=       0,             -694687,         0
##MAX=       8223.43324360094, 475796472,    0
$$ Real data points
##PAGE= N=1
##DATA TABLE= (X++(R..R)), XYDATA
$$ [...]
23757 -200420 35791 -302616 -265677 41213 -155204 -196393 46222 -315087 145788 -62033 126521
23745 -191398 87941 -387715 317673 -2618 113591 -78948 -329756 -245772 -97314 21384 60247
23734 60247 -383730 -17734 -124983 477300 234141 104353 299047 -108937 -154886 52128
23723 -41589 142813 -84991 -130274 257965 63782 -87524 209243 -113416 -245073 32219 -19731
23711 55331 205042 81427 -95442 229115 -35514 -188704 20719 14242 60737 230629 -163147
23699 -118404 -239647 151595 214626 151834 -116132 189060 165839 242983 -402 -238451 21877
23687 21889 121515 -12275 246345 11533 39805 289397 106193 -273474 175759 99319 -140596
23675 -399366 -318767 229655 -274383 118236 143961 -278651 112969 -87575 -58436 -320804
23665 -320804 -103558 -94850 169322 325235 -298976 67420 -68590 -166577 145073 76703 231964
23654 231964 -245264 -928 -40026 324334 -113705 -160889 -69377 -11950 -145394 68801 180226
23643 180226 28213 -66914 -16070 -20712 40192 135094 78347 -143766 -426965 26422 -52845
23631 4744 114689 -144522 21543 -69898 213344 30035 -60979 -231707 -220215 -204206 -195272
23620 -195272 135011 -83524 -84228 -240231 -299071 -132568 -61581 338010 145185 375208 -119931
23608 -136970 80564 139197 -273036 22650 -31079 239385 -278901 237930 20683 125855
23598 125855 382192 107409 234074 -253868 230787 238673 75756 234953 72148 347842
23588 347842 164772 -34471 342888 247791 34885 -55803 147986 -2823 291288 127639 101616
23577 101616 380794 122696 155764 -501497 -62333 -180210 21588 -121257 102929 13989
23566 18271 142115 52884 -159645 -269030 -130512 -89220 202358 111784 -253461 4176 42934
23555 42934 -181524 154735 181426 77704 -218399 -53096 -394668 126043 -220982 219589
23544 271020 -120041 330847 52121 288493 132438 215095 230850 45545 -84312 127052
23533 -120714 257775 -92877 48726 -124160 54930 252415 -52014 80910 263897 -158058
23522 -178779 -131390 78235 253902 62238 80112 26169 -41798 142826 -43743 -66266 30498
23510 -9234 36574 -270456 -283032 15524 -197230 66105 -256775 250451 80975 38819 -47166
23498 -92446 15359 -103781 67852 195336 69113 1717 93696 178336 -5237 -6824 33636 -311200
23485 162104 -194215 -75939 108895 -133851 426675 237410 162446 81289 75628 10555 -49928
23473 177026 88895 -50576 -321387 -113633 -68203 -252263 -265460 35009 -68879 151397 -213252
23461 -40730 -42449 -101933 -137258 127029 -260049 -214353 -117318 -57089 146882 29680 -352065
23449 -62868 -87646 -272200 -77519 41179 258368 -205882 -343097 246562 140014 -234454
23438 95171 -2838 -268321 67276 -146678 -49372 -218063 186225 355721 -157921 -292473
23428 -292473 -174967 -80343 -101084 -74924 215931 211914 177983 -23438 145142 -100407 -68817
23417 -68817 -80859 -551085 112349 61274 72822 -318129 240892 -108971 295573 -368028
23406 77310 -34070 -155520 332122 2823 191872 45374 -266299 106562 248919 300866 -80880
23394 -75910 226175 -299988 -104464 -237164 117735 -280624 -271684 -170284 -240210 30689
23383 208075 -77611 103885 127275 -29892 13469 -246114 -157426 -113677 -316388 -97010 68996
23371 -539688 86764 -234382 -70224 -352269 168657 -50412 -439531 -185279 76497 229901
23361 229901 -22625 -146412 -125497 -115711 -403212 -358014 -129463 -27070 153990 -107892 161424
23349 -85494 -211732 -154838 30517 294050 -42259 156874 250865 57550 119034 100015 225336
23338 225336 -24664 -209597 117520 -55071 105783 -150986 -64131 48766 -78664 -398502
23328 -398502 -199648 492650 -76348 45745 121263 -34708 108040 149079 304857 -36534 -208898
23317 -208898 -54342 -84423 -82890 -98943 -91507 112809 -424832 89447 98029 -105785 138622
23305 -65985 260171 -109893 -228520 39067 -152476 -171431 307428 -1947 -155507 -28891 103666
23293 -338278 141452 141728 -46490 170466 88912 -58341 -94353 -39375 50954 -183259 -192708
23282 -192708 165003 -152579 206408 124948 -34255 -98437 63044 237879 -93020 186761
23271 -180265 239042 -165809 5433 -189684 -64664 -88355 226484 39830 235607 68996 -183315
23259 -101590 17473 -108518 163241 138293 -105440 70796 265183 -91728 -67977 69055 -8458
23247 -257374 -154674 200790 -173133 -58280 81891 74456 -241759 13084 367460 89968 219193
23236 219193 76575 215823 52248 189416 -139030 -254531 -264753 -142905 104007 -310487
23225 73772 111353 53354 -81261 -171392 -179661 -91474 -313106 -50114 -94611 256626 196632
23214 196632 271034 -453767 -83605 -199608 -172191 -48277 86258 194617 -343598 -90062 -31553
23202 14479 -7608 -40010 27819 47065 179348 26756 54550 -63642 211845 -49167 -217326
23191 -217326 -4746 -53844 -142474 -442844 -111 -128633 -17932 -304473 178724 -207062 146165
23179 -69112 150885 173808 -148202 -139424 280328 85239 -226376 -67827 -425320 162487 83647
23168 83647 -237863 45382 -146435 17368 54979 -22721 97351 -164467 -227345 -297329 -102763
23156 21752 -134130 -98209 121876 -43789 -1800 9271 -131912 226308 -238252 -151406 -87305
23145 -87305 33693 -51218 24362 63179 -321420 109720 337537 199241 76022 218998 119690
23134 119690 -156918 -47587 -83175 -554462 205881 -82929 377121 27346 155935 -14110
23123 -111 -110297 375387 76257 -81783 229671 19835 -12597 150401 87487 -122961 -38896
23111 -76449 -334833 285268 -114084 37080 118359 200933 -96331 -5585 -111448 -209361 -48194
23099 145960 257979 269427 136103 90025 -233379 129618 240175 -202335 -92989 -127880
23089 -127880 -64034 16613 -240154 358582 60700 -90778 -420126 -142583 -102038 -27261 -66675
23078 -66675 177081 62307 17348 57917 -172923 55165 109207 -168551 -53430 -286170 -38119
23066 -193562 65976 62050 -34456 -358885 25485 -323052 -304621 -27826 170993 127465 320467
23055 320467 -161917 16022 -60184 236026 -73041 143317 -15735 -36995 -69665 228877 162149
23044 162149 194251 76686 296634 -13495 -16348 -49518 -386971 111242 163790 198263 -98471
23032 473436 -155479 -182941 116438 336189 -121881 188599 -72196 -14848 -125528 -24391
23021 -187071 -131342 170055 -9049 -282397 -229115 -134973 -128556 127574 236874 119497 61076
23010 61076 104646 137537 -374061 -106304 -77187 24382 -137318 142620 -26897 137860 -219303
22998 -40353 140130 189443 76100 139178 -168211 -104011 343715 67918 -396787 -284598 69857
22986 -20207 -40765 -77864 64549 150572 -120486 36217 95162 171064 -153422 -191359 143979
22974 9248 -44078 -5351 -72813 -262359 -132993 219289 -111134 216955 -165990 -84423 73233
22962 94108 -22220 -105254 58238 284589 -120793 -100664 -67357 -159017 -509875 -218961 -101922
22950 -418089 71753 -43400 -38804 261068 -46771 207486 -117702 6915 -30536 28351 184418
22939 184418 -252079 77311 -54526 192921 -5444 -91468 312456 281390 -201588 -34799 75887
22927 -20849 43082 3509 59899 26712 54764 191865 203782 45157 -4459 -121349 -9969 -3511
22914 -82119 -29544 -193302 -50732 307143 145289 -285394 90722 -124754 -276125 27917
22903 -34600 -157605 -41992 -53175 -270537 132345 -330255 10221 41938 50482 -238453 -56581
22891 -364256 28962 41952 -110069 57814 51818 -9088 163545 -165459 -91472 -137362 155790
22879 -80856 9212 -155925 19668 118442 157550 -296421 69714 253427 -39214 -21301 -61063
22868 -61063 236629 -13302 114576 259991 265888 -25735 -247521 -4525 -81359 -226031 50006
22856 -452606 -21090 62346 -112868 197107 42689 78284 -294370 -25045 -76274 170139 -9330
22844 10992 -193893 -59571 -238305 136025 -126926 -167272 -190034 -178365 888 192428 -133428
22832 204827 531929 -297570 -200437 253130 -635180 177492 219848 -63133 -76065 178325
22821 -29583 37216 199230 10043 -277365 125617 -7594 78583 59647 -33105 131045 -54558
22809 -310059 -39441 66661 -98330 -104441 61088 361226 134820 202183 300758 96255 7913
22797 151462 71673 87595 -53839 375371 249076 -193062 73844 10296 -29185 77068 30142
22785 150545 -180881 86956 -65342 695 189795 -270291 -143742 -290186 307801 -18832 -236683
22774 -236683 247061 -397787 -56793 170602 -86780 -230405 6379 302858 -183464 -40767
22763 -204894 -97123 90705 75196 -39057 -240362 -90100 -293163 -201704 -223960 -126067 -11107
22751 38108 -395188 -104694 -34253 -19013 124860 67694 280550 -88930 -410072 373356
22740 -61839 -122454 -102204 -317633 -147021 -201692 -984 -47889 -196044 20748 -30307 -77071
22729 -77071 -104595 28694 -219146 207406 -380272 -38900 -74164 -130153 -42080 85362 16347
22717 24377 -276065 -73380 -173420 52077 -34638 223268 20772 1416 -218942 -209584 139029
22705 -292158 -41547 -41658 -153791 -42420 79185 110460 119169 17494 -536846 132929 276411
22694 276411 73255 52822 -12255 -426757 -197700 4488 43314 -66561 -105706 62318 -186825
22682 6219 26047 -20552 -234991 -155601 -29302 -69981 -194793 137635 -350695 -127379 -10412
22670 -316679 -418895 -17376 -51314 93800 199178 -161173 89913 165501 55805 54907 -36888
22658 188120 -152293 26087 39811 -371510 14983 -432660 23831 22131 156874 -57304 -228662
22647 -228662 43750 23653 -194532 -35517 -255433 67582 -101667 170018 -165821 28124
22636 -120577 -10143 -78905 149825 15808 35687 -140483 -137647 37640 -159693 -109622 -24780
22624 192248 -11939 -139106 -109818 -76410 8068 132433 -196884 64150 -326445 218834 1308
22612 -32322 -5718 -71871 135259 146649 -72549 -180505 -40675 -96852 -85250 46351 182003
22601 182003 -23187 333401 245459 89708 30077 -151344 -191917 -82000 220918 -190518 19604
22589 137777 -323940 39587 -70628 27973 -343962 -272619 -8134 5014 21363 -109400 -52867
22577 -22291 -18772 22465 -348605 -152175 -62330 -195946 -24629 -181345 -184570 256796 -247515
22565 -1079 -145133 -333226 -175291 87904 43966 -245991 -16907 -153796 77553 183016 -300896
22553 291412 47650 98137 -14612 23808 26333 -211585 -64728 -4445 -249310 57566 219974
22542 219974 -145241 116009 408934 -219772 -60996 89811 283800 -38229 205586 -113870
22531 -299240 -192577 -145548 41056 139303 8154 -62828 292962 -221707 96910 -184165 -294543
22520 -294543 -121605 142183 -146190 -65020 -82802 40748 35411 78521 -170126 -15799 356808
22508 61030 -196177 -190593 -67760 -29652 -19220 -130719 163141 -484590 -67240 61678 237557
22497 237557 -38791 -249758 24678 -139113 213572 235681 -282204 -84033 207494 -277918
22486 -75887 -146994 -317471 413004 -62659 236343 -15035 -165608 330837 -133247 147710
22475 21403 -203158 -138288 -210625 163806 62885 170662 -394718 -190328 -57402 11241 133268
22464 133268 177846 -99506 163361 265630 -98921 -145475 -410921 -292027 203124 68590
22453 148206 -120275 104212 -62901 97911 -117839 -158179 -514351 200219 6807 -11819 -93575
22442 -93575 -31808 68884 98360 -39790 -558280 -398620 -70321 -102900 19988 -110890 -115073
22431 -115073 38599 -199263 20273 142693 -98703 264904 194332 -239763 -104040 -176072
22421 -176072 -279 123141 220175 -141873 131655 65402 -97475 233786 -89845 206161 110480
22410 110480 -410571 226934 50412 -52619 -422984 27860 -134057 4774 28946 113033 -205855
22398 22626 -372766 -10143 -243737 107898 -220822 -49355 153018 -334248 25726 -478202
22387 36837 -177657 -148631 130324 -202339 -27859 -293666 -324671 -118004 -150108 -77460 283755
22375 -133258 162160 -97267 254602 -169694 -22084 -39829 -371117 -326963 36479 -30539 7235
22363 68226 -64395 -114203 311051 -96265 -384094 -62215 -327668 -503825 -28277 -149766 181077
22351 158731 -130284 -49764 230445 -206772 -27204 195091 -29247 -68900 74584 247658
22341 247658 -238942 -80450 35274 -61504 83431 -88935 13198 -161723 -69111 308816 -184034
22329 -145733 -9708 -123134 28830 -6649 182529 -198522 -218084 -107774 87514 -73391 65340
22317 -188324 -218635 252891 135409 -78072 -401972 172332 -184151 189107 -480090 -27403
22306 -296187 136062 -269375 74409 -94302 -213075 -2194 -177957 22274 148512 -200588
22295 315129 -133406 84725 34777 75444 -116963 -241466 -222576 104993 -140652 60223
22284 -318365 -180052 97010 -128858 66767 289991 15838 -177504 -132275 120277 -428911
22273 30582 172096 406957 3012 179739 -55370 3018 197336 -107738 102163 -171483 -290724
22262 -290724 -90280 -289294 -393946 78032 -146473 33846 112292 -178456 9548 -264439 -110496
22250 -218411 -113582 83239 -426069 -450995 -134931 -135414 77846 -50423 -98410 74258 65311
22239 65311 -3874 -93534 -107898 80499 195944 50550 -29005 -233296 -212865 -102840 -71881
22228 -71881 32092 439346 -155961 59477 -150964 -80714 -352273 -22797 -95240 -47451 -205428
22217 -205428 18757 -29783 264276 -100142 -258470 -325162 -213016 -3546 -97466 56406 109924
22206 109924 263213 94560 -56783 -132304 -44294 -74556 -101923 10114 -133086 3746 -131234
22194 17833 515718 61526 86571 -35011 -161914 -229597 221963 -116381 -26307 56024 160660
22183 160660 119775 -98211 -26721 -134258 -164725 -200595 -105953 -38162 121626 -125324 206203
22171 -17268 110427 53794 20771 -44629 -82103 -56537 -99871 -2417 -90206 -125754 -50500 -24151
22158 -268669 14183 -59166 -306573 449086 50004 6176 298098 59216 -122351 -42047 136088
22146 -174382 -97332 -38461 198941 -14643 371275 -20865 227811 237324 254967 -46903 -57412
22135 -57412 -82426 -518422 206661 -75705 -175485 -38563 -233022 8435 -119087 189485 -112622
22123 13278 -496392 -69977 2539 116792 370485 -279704 184253 -69078 -151047 -100653 25150
22111 -21991 29149 -143330 22573 -200270 75710 -242357 181736 8328 -175128 -8982 36426
22099 -156231 -161514 -237544 -112882 -160027 -137459 60323 -42921 -165446 29492 152174 28845
22087 30043 -443214 83490 -48244 12531 -27024 157444 -247060 -56953 -393874 -53667 -39179
22076 -39179 188070 -31561 -137778 567 -68086 -96426 -222492 -137091 -19747 23154 182834
22065 182834 -37333 127058 203946 161255 -80596 -29104 325126 76798 134784 253961 -326976
22053 -146183 -132014 65499 82498 -98485 -59310 -79918 74409 59066 -332221 5746 357746
22042 357746 -147177 -108112 -245384 250116 -171714 -21510 -70391 -40766 57412 -16170 -335609
22031 -335609 198918 -52566 -212159 -169805 -104220 -47628 -223456 -152920 148158 -274306
22020 1852 -25681 -185880 149334 24261 -33658 -94520 155081 -298072 23970 -131614 -19032
22008 155996 -307755 252742 7373 -83574 327225 -253392 -32535 -160281 -3034 9358 -305416
21996 -163584 148719 -22951 29717 -144943 -53097 85484 -530390 -27717 -148742 -303193
21986 -303193 231799 -30974 59727 -16035 -232122 -259437 82004 141157 -70575 122061 106874
21975 106874 -98 -83675 -85827 -309636 55219 64654 109021 -157622 30760 33956 -388224 32509
21962 -178893 95430 -154674 -288305 -34357 -119158 -353675 153599 57663 133025 -581686
21951 -184257 -111164 -54173 198467 47556 43236 -225055 -169052 54575 218449 154316 -129032
21939 13553 -34291 103273 -164745 -306511 25584 -273783 -54489 74001 -26312 -307638 -36382
21927 -16344 33792 54765 -127166 154288 -38508 250963 -611316 -84223 -107958 63992 -116480
21915 -330376 58544 -146811 -161833 -377841 -73185 -274096 -117894 -166552 -505715 -29663
21904 -12231 68435 72556 -219054 -236167 29998 12890 -283074 -67756 -87849 -159422 -264935
21893 -264935 -102710 25518 200557 11366 -200584 133619 -34131 246165 187220 141831
21883 141831 -52614 -40697 206414 161483 163964 -192013 -129270 -271520 -483036 -234118 -123302
21872 -123302 -13651 -16665 -181644 -282486 -158254 10142 92672 -377446 -244852 -240926 165087
21860 -198860 -135257 39219 128540 -87849 -213653 96938 -48882 18241 -202825 134823 106470
21849 106470 232937 -177395 -123853 -4428 -272853 -139158 -344575 46641 -27985 57348 -52948
21837 -92271 188738 -269567 65947 194311 24780 -159941 23522 -112970 -118820 23654 166836
21826 166836 9469 126043 -373098 -179232 109917 -26221 -98293 -52224 244574 -72668 117538
21814 79406 -3742 -199580 -32686 181716 -56194 -123450 -577864 -282630 82459 -421696 120590
21802 -339721 -166472 -166308 -514495 -142453 151796 -63025 -77324 -27873 73198 -64571 280977
21790 94303 98356 287360 153226 4588 345086 61364 -97447 -32796 122559 165614 137038
21779 137038 130706 9415 118880 34773 -220250 -316334 127696 221765 417951 -109514 -373048
21768 -373048 67489 106599 -26366 166325 -109877 -72124 -201862 -63479 -62857 137925 -220255
21756 -25571 118606 19408 -289092 159118 156934 -169434 66652 -34909 -117395 89014 60087
21745 60087 -288610 28420 -94711 266362 -52612 -13142 -362996 -77839 -52789 244774 64341
21733 149052 -393104 210060 -115176 -31228 90571 -172776 -188489 -92602 -285769 17269
21722 17513 -107257 20222 194763 -274499 247449 52086 -51619 -226650 83960 -214018
21711 18364 154238 -283722 128612 75699 -240281 -179956 -72586 -89680 -251025 -92969 41679
21699 251821 -46550 8581 237829 25843 -127466 11435 180995 -10420 -324955 -66246 -204838
21688 -204838 -98358 -117599 -50284 418870 135549 8693 51378 -177993 -280109 61026 171312
21677 171312 -239799 199153 18430 213938 -11150 -25296 55023 -311205 89068 -281929
21666 90876 -284122 46179 -189053 -62934 147293 -31211 -52734 -11207 -110130 -240308 -244776
21655 -244776 -7907 113191 -32895 -155971 421195 139921 76968 -99979 -173870 60355 -54672
21643 69124 -221965 -98004 -187390 276907 -300126 134699 166317 37892 163539 -48827 -51385
21632 -51385 64774 231305 1966 226582 -69104 -153072 -266259 -179727 -178838 152924 -253324
21620 82615 -87453 -180545 118906 23585 90255 -55002 145578 230799 -175738 8299 -15156
21608 416485 -114771 -89232 -307061 -218980 -149412 1936 -264222 -202178 -193709 -69716 -97595
21597 -97595 177545 54604 56154 -139323 -63255 37708 -307160 -224959 -252827 -48361 -168102
21586 -168102 -185249 65247 -159738 -79178 -70150 -292703 -218503 -107026 8684 -42082 231095
21574 -7937 -116383 -147125 -296736 47574 -156150 224574 -28708 91763 84720 -54891 272458
21562 39425 -124617 16055 -177653 -207293 98108 -209696 155551 -149871 -342715 13910
21551 -221774 285280 -5986 -19772 -276881 -34956 -287479 45146 82340 -61017 6910 -357191
21539 -202825 -317675 -170225 44381 135123 -137800 -161400 -46812 -147631 -375653 -45051
21528 -32204 -47754 -281389 66453 121880 -251968 -58620 -273977 -188344 8613 56464 -406 -370808
21516 -370808 207267 -279321 -242679 -169679 51029 -123791 233185 -357621 -230995 130927
21505 -221285 -65543 146050 67072 -278801 -105833 -353529 -82095 237817 148925 -25636
21494 -232837 -308083 152717 -239414 -88421 -239516 -60129 133101 -191047 76385 -197852
21483 -237968 -386811 169634 -204433 36858 73500 -373618 66761 -198669 -102002 67230
21472 -227746 -27262 -114891 354854 -458104 -124651 -47396 -117532 -461332 96158 416323
21462 416323 -13381 -312032 -82725 -302998 -227076 38976 -324345 34446 -116043 -101047 -71628
21451 -71628 -217072 28944 -259537 165965 99474 -301835 80475 76003 -241467 -78326 237560
21439 238929 428168 106995 479134 -74494 446921 281851 197928 211733 399738 213305
21429 213305 9485 205420 59480 -47594 -243043 110743 -23334 298384 -20197 -461680 162461
21417 80070 5733 88308 -74977 -45243 -22910 -78332 -214279 38117 -28653 94709 -175024
21405 1272 -378800 -96449 -19539 -94876 -413431 -192834 -35714 209738 -125855 -352449 -141895
21393 125402 -51760 119991 1134 -221467 353672 39513 -25415 346385 -42494 -305991 -259377
21382 -259377 -204125 -172386 -227815 133392 -442859 -314402 -134414 74141 -155146 -179032
21372 -179032 151658 -209295 79644 218744 72193 103545 -146289 -186775 -4838 -222082 -123068
21361 -123068 -292447 -63682 -40786 -29367 186336 -168491 -250393 -78127 -91214 -160491 -207945
21350 -207945 -60419 -61963 -34367 26910 65291 45190 60890 357672 65396 75065 -259333
21338 -79426 -11865 109361 -246963 -172194 67799 176229 -21244 8533 150636 296942 -473946
21326 -194438 -182256 -158905 -47364 45509 4637 -66453 278129 -81713 -94204 22786 -1766 -229616
21314 -229616 -28613 -163887 -252947 41708 -71064 4226 218779 -194415 -76389 -35345 37496
21302 21142 -418502 -90190 -85574 136948 -12925 -67043 -223468 61013 17228 -85676 -141444
21291 -141444 -415661 -46143 82003 193192 -522849 111675 -133495 157723 66545 -254369
21280 -3433 -75612 -146758 -48672 40035 270370 32081 -332931 82377 -213024 145318 -326726
21268 -212881 140604 169233 -276275 -361061 -198410 -58166 -2557 -253030 23740 181169 -58162
21256 -112249 -58746 93657 -308509 -212274 -33866 64140 -360230 -59576 -78352 60717 -232449
21244 -210854 -243420 65531 -365024 -102832 -251108 -167522 -75014 -45807 64744 133921 17032
21232 -146602 -267452 -169873 -201693 86743 138969 154362 -127459 -193862 -121744 -267292 -181834
21221 -181834 -57273 -400878 54327 202611 -302200 -236727 -131983 293147 -61772 1202 -94779
21209 183332 -107072 309069 -254395 155709 67926 -58891 -236017 144726 32091 -123210
21198 -352039 153609 -151313 -29885 -426487 43805 -136525 -171028 -81057 84019 -154316
21187 -149239 -211561 -144886 -64142 -133985 -68780 15163 -19774 51679 -9689 -93671 90993 -204692
21174 -1420 78111 -84215 39822 154923 -150116 -87753 167442 -216020 130609 -265025 19408
21162 -13105 100933 125109 -212620 -203353 -100503 -193171 99475 155426 269396 20240 -43590
21150 -313266 -120314 -80077 76650 -271041 -142472 -11641 70513 59826 -177260 32872 162640
21139 162640 -256748 77078 -69302 63660 48370 -66988 -121712 -144429 257923 -21814 -235641
21128 -235641 -114504 -342683 -281058 222765 -363550 -227113 57856 -35796 -33369 114843
21117 8672 -186904 -267965 336013 -3781 96139 -100904 301467 199923 -384721 -215441 -65261
21105 -289865 -34200 25863 5852 -54018 -147182 264130 -319730 -81803 -216671 -333514 -545085
21094 -545085 44016 -44805 136607 -70721 -4651 109801 -128969 -113565 164684 98969 -30415
21082 -490331 137488 -4565 35645 70068 -102505 -157792 -12326 -94693 -316083 -67553 -88497
21071 -88497 -287391 -111321 88546 118875 339471 73400 -242967 -171672 -66471 -222410 183730
21059 1836 103735 -131775 -67177 -51465 -364652 -172441 267786 -19973 -100872 -23945 273374
21047 267440 -129169 -161965 83386 -171999 93620 -44324 -111271 -42455 -141696 10696 -45988
21035 11994 255654 126150 242120 130407 110333 21015 -151253 -378099 1859 -100232
21024 -132937 -20845 161000 -277354 110333 33444 -328810 -22748 -149120 -31101 -205310
21014 -205310 94694 -92622 -383369 -75822 -110680 42701 138094 515744 285242 523476 595560
21003 595560 545071 384102 278691 -52838 227040 -143277 -343695 -114017 164172 -4706
20992 -25191 -183250 228337 67832 -203619 -233335 63107 50569 175619 -254294 -289253 20512
20980 -149137 -27108 -31377 -56075 73464 -39638 12323 -129885 -67881 293018 -103239 171915
20968 65458 216226 186217 -162805 33458 70237 -119961 29592 -36461 224836 118143 -95523
20956 -344152 167926 -183872 -304919 144546 -312188 374455 164308 -71444 8003 12483
20946 12483 148914 -173305 343838 404429 208802 482085 253808 138125 166079 -71378
20935 -203828 -128499 27108 100208 -239213 75305 -226979 -109317 -396557 -32964 -3389 -246411
20924 -246411 -310328 -31482 -74157 -15960 -25008 -24529 -40325 92421 -53535 -69021 -10139 -84461
20912 -84461 179872 -28195 -126126 -190610 192285 -247884 217785 92244 -44783 -253003 -406134
20901 -406134 74984 190398 1468 115037 -73995 362633 -240317 -347496 -235893 40440
20890 -119656 -9906 -119099 -210509 -117657 -365996 71534 -125693 -102832 -254855 -146526 -6450
20878 89504 -214256 -173440 222317 -95156 -204012 -289397 -119862 -81177 -250729 -198687 -162215
20867 -162215 238827 109127 15964 -139319 -43989 -122498 187650 41573 -204311 -290176
20857 -290176 88946 127026 -56856 -10084 -98225 -102544 -218583 -339139 108679 -98047 77728
20845 -324404 12508 -143729 168986 -227173 55406 46914 83707 129394 -163504 -307847 -71669
20833 -50362 -128078 -33902 -242501 -65738 143538 -131232 -77913 88793 2199 265722 -85403
20821 -322547 -20991 98629 -120415 -71647 -132433 -138813 60187 -94167 -207922 123013 -38309
20809 -165015 106573 -489553 177576 38496 -80838 -292670 27695 -442891 18332 -40993
20798 59768 -163201 -192770 448866 -95056 -251762 -95212 -34664 -57410 120831 70340 -40061
20786 -113752 310494 -159695 -25855 -47274 83234 -420629 188354 -87781 -24624 -96198 -164287
20775 -164287 167769 -178739 -74048 -105658 -303819 -52940 -98790 -132674 169211 -407204
20764 -111668 97264 35517 -38805 -9907 99588 50987 757 -65506 114999 -41477 -234615 69195
20751 -128710 -373008 -122708 -204478 -55219 186100 -40037 -245241 -186817 216574 203983
20741 203983 36316 -3052 -179033 -78829 -309437 -228857 37016 -209049 254678 180612 297413
20730 297413 -115708 -104650 -165114 -36394 109005 67495 -125548 283736 -874 -186332 232238
20718 245588 -27316 -90868 158009 -165665 -147807 -153917 243356 125846 -138457 132714
20707 -269516 -288479 -127870 -216937 -108615 -255691 88789 80346 -56729 -221290 107154 -73738
20695 -109363 95015 -266463 -264155 21636 -209463 -50013 240767 47724 -318726 -264865 240987
20683 -260507 -127206 -56619 -125332 -262446 56666 -23283 -153757 -60640 -155481 51158 66521
20672 66521 -126405 -188009 -165366 -197127 -142399 134531 -159530 -353871 -322715 -228167 -61878
20660 -306929 -357305 74489 -46024 -26314 223227 88780 295725 163354 202879 72786 -225466
20648 30047 115646 -77837 115091 -537753 45771 -119806 55494 -232505 16600 -107152 62550
20636 -168513 14237 -83664 263620 -168241 -77652 -468559 14437 -82922 -239554 -181604 82082
20624 -189044 -68912 -63754 -71891 -291657 -77423 -21328 93881 -32308 73224 -158886 260801
20612 -412050 -349504 -69489 -337031 97232 -250101 456778 226615 33951 -86126 -202258
20602 -202258 -34122 -55886 84886 -184937 226555 -118829 -280973 -190390 -133704 122523
20591 46164 94507 -175728 224872 -78818 -14479 426933 437123 188470 71740 78478 -273066
20579 136214 467591 91098 -194158 -101670 -78060 351853 27004 340917 -368376 -243379
20569 -243379 -98041 -162308 42426 95552 -102034 -60770 -327231 197840 21368 -52605 75653
20557 -190177 22207 -340436 32020 -334733 171332 -138406 14950 -392800 -205375 -200458
20547 -200458 -270013 37642 -138979 -28748 -202105 118005 331083 -5525 37715 -137673 -359304
20536 -359304 207654 -341476 -186774 -159263 82537 76890 -35437 -466222 -19200 -216317 2108
20524 189396 -236556 -306381 -81897 -37920 -31786 116489 122828 89301 53593 134192 -315469
20512 -207384 -269757 -148680 -101115 -220233 26764 -3165 -202406 -152827 159206 241615 -504403
20500 -56240 -177579 -32365 -133747 -51643 169023 -115216 -269524 49613 -466232 74449
20489 -393753 -373029 -509312 -104198 -36476 142110 106945 193286 203627 -10374 -69832 -172796
20478 -172796 -489301 -325851 248165 -309511 -437735 -327487 -179933 28632 18355 50245
20468 50245 -205062 21244 37482 33627 134858 270008 109204 163286 6930 103443 1484
20456 -152277 -152810 192625 -15731 146985 -207943 -185344 -128212 -245612 -383154 -104537 -331075
20445 -331075 -226111 72749 -108467 -290237 72878 164787 403391 277235 -195083 -130908
20435 -130908 62663 11459 -154668 -13903 -422783 227165 107757 -148288 -212772 60139
20424 38301 -11680 40305 -307180 167713 -225905 135879 -153468 88713 -168555 -218357
20414 -218357 -96673 118741 -58910 -125893 -103746 39981 -76053 175424 -63267 -183913 65439
20402 19392 -429318 -37933 -131012 -122187 -91400 -151557 -253646 -61843 200819 -263027 -311487
20391 -311487 77644 161954 -39910 -46803 63929 -200080 -299537 -78116 -243133 31913 -130204
20379 115675 -355175 -276320 91860 -272542 -307361 -572639 -186437 13377 -192455 108905
20368 15719 -263613 -235294 -238454 -196432 -100806 74213 -128000 15294 371034 -321006 -139818
20356 -343200 265792 -173024 -165745 -254682 275034 -104935 -25375 -276901 -24446 31604 -89664
20344 -97552 -45587 -150585 -264219 -13650 40692 -76605 -384286 179492 27955 -308373 34837
20332 12178 46861 -27907 78637 -156732 -73007 110416 -171983 -108205 -69657 424293 -190918
20320 -117584 -66182 -61586 194973 -96748 -106838 -247714 -109072 -136533 -58753 -243180 -74580
20308 -97475 -57439 136165 -4230 16145 211704 36519 53194 59845 106600 231615 -24494
20296 -169880 -126749 112584 -136750 -106093 -89363 -259195 68648 -22145 128084 1436 -91654
20284 -112287 79097 -149740 -119435 19833 110318 192086 -12811 19490 19847 -80131 -191554
20273 -191554 154725 -91017 71035 -338924 -119095 146718 -36154 -94720 -344135 87022
20262 112081 -114304 -110727 -200614 -102148 95251 -52871 169727 -264057 -252928 59209 377078
20251 377078 45378 -51540 192312 -243383 -171734 86427 35413 -28091 -39548 -126372 -89374
20240 -89374 -156997 -343313 -42480 -307326 42973 -62368 -69671 96138 -304202 -495305 147677
20228 78022 77229 109351 25787 24833 77759 170507 43065 -7635 -298341 -283413 -283078 29472 -181529
20214 127128 -156947 -29912 4585 23256 203641 -34935 299938 30976 -1249 173701 -23277
20202 68510 -318590 -118423 52820 216890 58277 -292594 -14392 -60155 233056 -82222 -73340
20191 -73340 -94709 -127791 -83250 234833 -116075 -25491 -108245 -238933 -164947 -202010 -46479
20179 -321244 159053 49129 -338503 52402 -31377 119406 54242 166546 -86748 -126788 17242
20167 323860 -207379 -101216 -127415 -92077 -50711 -374151 62350 -53432 81039 -43209 -95333
20156 -95333 223860 464978 62855 -84364 95771 4379 87992 -26557 -57793 141440 475673
20145 475673 637845 251311 358454 39397 -44845 302738 67931 239570 449174 675576
20135 675576 492142 -38401 -85329 -82588 -491376 -268091 266308 -120170 -99796 51607 203822
20124 203822 -90273 92282 46655 -125436 174472 -97901 50545 48104 -7897 168475 -136752
20112 33251 -335052 237513 -392330 -290883 -122927 -110198 -247034 83657 112202 -168207
20101 287267 -110172 174259 32741 -223531 -373288 100270 -76138 154391 -4859 -378670
20091 -378670 -439357 111172 220751 -80494 -233663 147747 196842 -206955 -244062 -17873
20080 -185370 -57540 -622700 -59899 -48710 -119818 -269625 -201128 -66472 108749 6837 -225020
20068 169976 -43698 364179 17817 -113914 -270502 -213318 72175 79498 186483 -227326 -155167
20057 -155167 -232845 285810 -172746 -152206 164751 -313551 183483 -198701 41054 -37831
20046 31696 -39 -173128 -269799 9689 -205702 -315790 -257078 -177580 34758 -111553 84658 44866
20034 44866 29367 262989 -116252 99210 -188388 -332968 -40710 26672 -263539 -253303 22158
20022 -130384 81497 -33854 67647 132859 448185 240325 -34987 -340227 -287279 -25356 140097
20010 -108173 -375613 32869 -97835 -144342 -172791 -185621 55106 412906 -290859 78713 -24289
19998 149469 24104 270556 34004 159526 147439 203356 -4566 48423 379149 -41697 -189680
19987 -189680 174255 244826 54642 -25006 250098 -26527 -208281 107572 -6705 -185126 116174
19975 -88203 -177228 -140091 72034 53441 2566 182754 269428 1564 189065 -103425 -142489
19964 -142489 159645 217261 235306 231877 589724 488695 127526 73026 -1817 -345313 -76148
19952 400632 233015 162862 172184 61698 111145 -126791 -128050 -88668 -146982 -123320 255271
19940 90495 160710 -12776 -282656 -206653 75236 -182138 -216470 -54395 -131835 118211 -320913
19928 14415 -245119 -423093 -238037 -313331 -240979 93289 122072 81455 156068 153901 -203969
19916 -312079 -68478 -45657 260078 -2293 -74340 170382 -429142 -148007 -107482 -2803 -9064
19905 -9064 323518 -41907 -54719 -513017 -113685 177894 -330335 -43409 -102353 -19725 -99125
19894 -99125 -360 -34759 215422 -289458 -274429 92138 -23726 119313 151792 87564 -262355
19882 109833 -377138 -69397 101783 -780 -149036 7624 -22992 -101265 15147 119341 -63488
19870 25746 82846 128422 22821 -53171 -56102 -144665 -402754 -12465 -96367 -426251 29042
19858 -163162 -186736 -185897 -226176 29040 -186198 -214847 -10470 34882 -4712 -170205 81684 -1763
19845 1099 -203107 61170 47921 39139 259412 244339 73605 -162382 -128484 -272857 -65622
19833 -71621 -220902 -224664 -169808 -96710 -37804 -40006 57365 -164334 92887 -171035 -41524
19821 -112046 -495 -58990 -5562 -45242 -237411 -222886 -416878 19946 -301578 -167205 85859
19809 -135612 -225773 -72188 -51364 -430616 373260 11964 -394803 -167100 -32738 -390035
19799 -390035 -127705 91869 14040 -88193 -319276 191347 -263614 10118 150526 117878
19789 117878 -85086 -198701 -24647 -79189 154655 -105356 -243003 91875 101884 154191 -46488
19777 -388793 -57925 -82089 -261618 -485606 -80003 42487 -188740 127273 -2663 -215988 -191445
19766 -191445 -282760 145297 325072 -102743 39984 -87513 -198444 -69317 -17609 29443 -35134
19754 120657 -123244 -293605 -194606 109904 200688 -5973 -90682 -90940 -29701 -233827 76052
19742 26892 207881 -63694 -78335 -278842 71570 -260789 -179386 60533 401549 229008 -104446
19730 228048 259874 116108 535188 623781 386737 187635 247316 17 235893 26871 97853
19719 97853 332637 48391 -271431 -332730 -183527 -79717 -91717 -272790 -53723 -217959 176740
19707 15317 42576 232045 68081 -19847 -238212 142723 -36521 -94073 -258202 373109 218906
19696 218906 166652 436988 337608 167096 150996 236983 -62748 174872 -126159 90292 -1996
19684 8646 49445 -57006 313021 -72151 67742 -320538 -112123 236202 -331748 -146450 112068
19672 -68471 179238 -239289 37695 -149875 -138873 -96640 -25634 24520 32821 156426 -130476
19660 -282446 34407 -125237 30521 -437 51709 114811 18864 -58221 -123245 -173146 138754
19648 -248720 -431868 -243293 90932 -288405 4482 136909 -95433 -6338 -61138 108977 -104468
19636 3239 278181 -387932 -227971 -261603 24799 116712 -307744 61624 -50914 -256712 -140644
19625 -140644 192822 240658 266493 -82210 -241627 181685 -123828 -34299 383323 -256073
19614 -206328 144739 17935 -62826 -48417 135159 17418 64127 -242630 -107631 8059 -250941
19602 -15528 -294464 -260050 1532 -140880 32751 -9390 -24002 63244 -247078 -198646 -181690
19591 -181690 -51623 565 63982 -113479 -37395 -59877 18305 47694 145010 8123 -12668 -252801
19579 -252801 -147096 61129 -205620 -280975 -171432 -357917 -167725 42967 -93809 -116769
19569 -116769 45928 51949 -82688 -135155 -312010 -144607 -31383 -259581 -136851 -411571 -133875
19557 -316159 -140316 442233 335757 -159475 51581 -68895 56397 -89124 215659 418138
19547 418138 -74366 -22825 -293244 91565 194705 204659 34327 -17898 -125411 -283968 -134903
19535 41254 5922 60339 25902 121107 -186273 56792 114270 56813 124638 -129309 -296699
19524 -296699 -89460 -345359 -270134 2956 -178137 -199296 9306 30440 -92039 -125978 -105562
19513 -105562 -91615 25643 -140533 -152620 -37326 -345202 -6152 209595 11322 -75673 -105903
19502 -105903 -49004 -325742 -196318 104636 199124 -202460 -378032 114414 -13795 -193971
19492 -193971 127482 -328271 -376702 -168664 69062 29844 140606 3492 93858 -433750 105272
19480 -23262 -275966 144953 -42895 -103444 -185048 -159469 172961 -100552 -423680 -230725
19470 -230725 -65186 -320929 112540 42770 -219869 150001 64933 69782 -7041 -200303 125066
19458 -89170 6785 -152493 -336119 -264788 -46341 -134726 -147948 -308765 -263105 -92262 -184827
19447 -184827 -94973 -200346 -75174 -260605 1473 -145316 183877 -139178 46704 -336056
19436 -131254 -318426 -13399 -177407 -127123 105373 -397640 165151 -161049 -3579 93054
19425 -287238 -191640 -6095 -360567 132411 115578 38051 23885 -48917 26090 -618395 -205761
19413 -280311 -79788 -41165 -72402 142145 -157870 -266689 -160765 -113816 -106137 -312159 -175676
19402 -175676 -274371 -102113 -24030 23941 -48945 -126618 -322805 -22490 -271230 241704 -49472
19390 -57818 -289012 -115756 4288 -9377 78687 -200703 78609 298872 -79485 -152749 -97758
19379 -97758 -189875 -371354 168705 24495 -174544 -45843 -9254 16989 -332426 99232 5188
19367 -136822 -24404 51548 41425 -230758 126235 -314237 -40602 108946 -67986 285670
19356 -57330 -294268 110196 151489 -231956 10901 32016 -183332 -174532 113625 -25744 -246264
19345 -246264 -133520 279048 -170811 53087 -84211 -269357 234305 -226153 -293886 -119196
19334 -61833 123694 -41431 106545 -25875 -242343 -61094 130732 -622803 -71221 -133456 -76921
19323 -76921 51705 -36605 -389597 -29950 146529 -281219 2676 -39512 30019 -311380 28416
19311 -538 118761 -189688 -203335 253794 236305 -184727 29412 -228439 -216002 89610 48667
19300 48667 -147776 37195 -182437 -63987 -282026 29096 -43633 -282579 -34742 -109572 -109814
19289 -109814 122796 195416 148230 45175 49490 -45262 -57324 -207938 -159266 -213045 -233610
19278 -233610 -212498 -15086 -320954 -40475 27140 25855 16037 -334676 47810 -217292 389622
19266 -369199 23466 -102750 -281254 221758 -299870 -36382 -132865 -112545 -151558 -19751 -268504
19255 -268504 64998 -47669 186437 259483 -52956 66788 3980 -162324 -31428 -46349 262381
19243 368356 8411 -43787 156676 90022 -11188 -98592 -158941 345402 -181507 13679 -331937
19231 7201 52783 153698 -112870 -126677 118605 62040 -328371 87687 -425820 -223478 -122715
19220 -122715 -246383 366514 20504 238014 147539 80816 242219 -61383 -95970 -271279
19210 -271279 -408177 -312525 -319992 -219270 -83191 -91245 -389882 -473632 104013 -379366 -104417
19198 128909 -87398 -17660 -213070 -166862 -229492 109462 24590 -67203 -187964 -161664 -243502
19187 -243502 -87972 -1888 145511 -6839 -75152 98410 217299 148407 -363408 1966 -200456
19175 -140008 -254753 20913 -139734 -140470 173220 9017 -273911 -141378 -73980 68919 -236779
19163 -45342 -235050 -235867 -47245 -77856 27093 209669 50289 -283265 -72175 -183462 -61508
19151 -110458 -35559 -9608 -140144 -144173 -23253 270321 67921 16615 34909 181892 -68609
19139 72990 -157595 -140286 119968 -140670 57030 -251389 -181473 13937 68419 32593 -65204
19127 250028 -8949 -182382 84956 -202049 1812 -89008 79452 -57938 -144932 -330240 -176998
19116 -176998 -217599 37336 -267818 233965 -50107 -1495 -83221 23364 -120495 -116476 149931
19104 47187 -195994 -311962 -116717 -157528 -172950 -104768 -166983 253408 -89090 126188 198890
19093 198890 -194316 81637 27524 -273203 148475 43972 -36541 -388751 -197716 -95840
19082 -134010 59152 -1912 -486238 -128750 214704 227998 -135124 16721 -25227 -38565 -230887
19071 -230887 256084 -63849 -21847 -107833 -133455 -125882 256299 -175480 164439 60322 158892
19060 158892 -68235 -3217 -331844 -45876 -309868 -128726 16412 48924 -60989 68852 192073
19049 192073 49380 -11493 -230327 -96183 -246576 -128031 362951 -124975 -53112 25325
19038 -249046 177856 -224975 -160537 -417727 -375353 39804 74481 268266 116004 121673 -91349
19026 -173598 37004 -96341 168001 -101686 58705 207176 284897 -66882 158424 98434 134729
19015 134729 -141156 -75061 171924 -184861 154185 173741 -94611 230931 273387 -180428
19004 31149 -290727 -138859 -404980 -280841 55565 93686 -81491 69002 77580 -220227 -478904
18993 -478904 11276 292999 81311 -285139 -25101 83350 -30749 -398884 -238526 -145161 50888
18981 -71369 -95482 101650 -55695 -60372 60306 -32176 -131343 -182824 -332958 213390 207566
18970 207566 571298 110977 214114 369402 -217790 218093 -22848 -18136 -67916 -129092
18960 -129092 -295872 -220954 -111685 8185 96209 -355411 -58370 -245462 336069 2179 -223750
18948 64022 -44729 -612981 -17692 -244468 56213 -97887 15071 36779 125290 48746 35344
18937 35344 -53101 217401 -206776 1004 -92569 89008 2935 -36020 -286806 -150651 -60387
18925 -24131 -54740 -44964 55585 -331336 207787 -122752 98079 -226126 -29524 -96314 -147568
18914 -147568 -107761 -319487 -21018 -293163 184113 -47698 160296 455386 161490 492879
18904 492879 128262 189238 -56659 -143122 214215 -213244 -215113 243375 -151805 -232752 173537
18892 52407 -175456 24968 -228423 226912 -41305 -226339 35936 -82685 -205099 -12017 -158762
18881 -158762 -33232 81758 225506 85545 149690 119895 -150476 -26585 317767 199359 -79647
18869 -552091 -134888 -114329 221377 178242 -313483 47139 -200862 -94750 -31735 11796 -259828
18857 214964 201801 81006 -540106 -318901 -411423 316529 213141 117323 5915 -137741 60816
18845 -230906 -190271 -11277 59809 -5117 439479 86430 120375 66870 -39297 -8913 203348
18833 -248457 42542 225401 -247087 -279206 -163136 -20112 -165040 189127 -179953 67580
18822 91865 -271436 -58414 158876 -39883 201461 -208363 -76516 -57449 204478 -31570 -23923
18811 -23923 166581 -38175 -53997 70771 100434 14755 163756 -34926 34759 -71633 -11503
18799 -120418 -14160 216781 -260368 101636 -154897 248282 -112549 60329 20394 26618
18789 26618 -147791 -144009 -203301 275307 -113808 105120 -46908 -301904 -249325 -514837 -242918
18777 -7924 -420544 -56604 322832 -200464 -46335 -7610 129056 -93090 -136878 -135922 105913
18765 -77387 20523 185319 -214668 -232843 -1307 -5015 -195399 41170 38657 -16977 -111688 187887
18752 98552 313001 -273706 -330822 197456 -95048 117014 137009 51271 -99839 48750 89535
18741 89535 -54873 -6192 -133350 -234623 -202985 -345141 -147557 -525599 -290168 -10045 -78238
18730 -78238 -29697 -145222 52542 -74793 -343267 53795 -162189 -54568 -303371 -9836 -92254
18719 -92254 -254060 -157872 230327 191221 -182666 -74831 -27904 -235855 -162179 253779 -33232
18707 -296595 -134758 56284 -132607 -435451 -53687 -338196 33537 -5384 95048 -386637 -82391
18695 -198664 36727 -179216 -307276 -266233 -199211 -183455 93198 -118366 -257501 -275087 -79737
18683 139185 -175176 95502 72025 46837 -222998 34328 222495 247804 -64896 876 51865
18672 51865 -260197 119392 -119647 -84859 -71746 -165464 -130719 6534 133755 139109 57858
18660 -209993 -41461 -73724 -126366 39462 196557 -385587 -267163 -123155 -209990 59838 -18941
18648 -85672 145349 -65452 -419197 107561 -21459 -72169 57811 95142 239873 284544 -212251
18636 111265 19956 -60147 99770 180595 -345195 -172674 160081 55490 -277992 -38560 -345292
18625 -345292 -84997 -101554 -160308 -239456 89516 202790 -89807 195782 -202056 -280059 -175580
18614 -175580 -62610 104610 67843 -87211 43470 155523 -171812 145322 69326 123102 160686
18603 160686 -55283 -74410 -25548 328673 163539 -288646 60862 -19121 -114309 -166208 -34946
18591 7790 60307 -5994 123329 135388 -369943 132931 -129328 -169833 -122956 -229725 -267046
18580 -267046 193997 -153424 2241 -64098 -9652 391079 -84717 -17265 -84806 226024 -197615
18568 -437074 -109658 15741 -243381 -278140 -212700 9840 130181 154664 -76009 -157041 -134565
18557 -134565 -40079 -127983 -31136 -459352 -141843 -77478 -136557 202903 -160427 44072 -320925
18545 422247 -61190 -240011 84043 -38161 -253205 -102959 40972 -444 -223736 -66811 -52913
18534 -52913 -107676 -139026 -82052 -226677 -194062 -36874 -576670 99951 222616 -176735 -10627
18522 11221 -85714 -174737 -34443 -65751 -68276 -128667 -134534 -209965 -530342 -130205 41180 -30045
18509 37425 3132 238495 38599 209562 -294778 -35435 111815 -74680 121720 -10675 434565
18497 -133026 -177030 -247579 -323376 -89297 -172987 180862 26733 -124258 -198181 -38225 12708
18485 116900 -120366 -57308 -56615 -169290 -210936 101704 -152766 -284233 -148765 -456301
18475 -456301 -171148 -154158 -18154 21263 260880 -88533 -146137 1873 -53257 758 -250051
18463 -109695 -173065 110027 -157353 115536 -87655 -147648 16120 -36904 -22319 -98609 -9677
18451 -278464 -42773 -173711 -30774 -148184 -395839 92577 -208774 -37649 21887 -114979
18440 -66872 -81635 86080 -27060 -114589 -195820 40167 22704 -67676 129979 -348541 -64900
18428 37117 -6091 -40729 -341594 93639 -284662 37364 -21819 -152069 -224208 15249 100896
18417 100896 118124 -24897 83693 105357 -237139 225540 153249 -331028 186199 -9082 189029
18405 -213436 301230 -17933 -24756 5608 93637 274485 162033 294594 -231810 -18901 30052
18393 -1034 184370 -140770 415988 -136748 -34145 296292 6496 -122301 -116616 -15854 -329966
18382 -329966 62040 10602 -178346 -208069 -188794 -84776 151705 -61839 -75053 41658 -82178
18370 -69316 -124789 145594 225802 -133801 22395 -25991 -73501 -80998 -215864 145581 -35088
18358 166510 270532 -37915 -345529 19782 250669 -274452 66783 47134 -63992 -269717
18348 -269717 -45159 -301702 179044 248988 144379 -85562 -256783 -333170 302579 -226908
18337 -108747 112774 -97910 -342735 -296436 -219446 -164249 -154040 98538 -138373 -222745 73273
18325 89181 205525 177 48507 323078 56152 244327 146212 63376 -73650 114374 -74779
18313 48899 109679 -42944 -330663 -72066 -46937 175334 -290782 -60017 -176347 -199408 8900
18301 101022 -57110 -1 -3803 -145094 -24170 318420 -53524 278809 -248613 70323 175500
18290 175500 15110 -95147 -218868 -137573 -175584 157328 -112854 -88276 -27727 -244087 -200314
18279 -200314 -49005 257829 -45731 -99491 62505 -156389 -248212 -318997 -15003 38663 -92473
18267 -39496 -130596 28900 -145308 -271191 -224362 -4551 -300172 113624 50303 -23055 -64818
18256 -64818 35823 -364671 265037 -213438 140775 -194157 -210017 67764 -54742 -55782 -103975
18245 -103975 -2290 -145750 -39457 -85730 -303908 -166633 -199451 -24697 -54403 -167736 -150481
18234 -150481 -116839 47341 118236 212198 -111713 -251660 114105 116250 275116 -255511 46224
18222 -59613 -195242 198220 448281 2808 -223195 -205458 59 -219133 7807 -138711 -44565
18210 7160 -276225 -50238 -142092 -94463 -257386 -233697 -99449 113330 260592 32650 78849
18199 78849 128337 -14728 -202444 -112024 19758 -232713 235169 26607 -233121 -57773 9546
18187 30131 -234775 107327 -34312 174004 -60717 24351 102586 -149443 -134727 164232 -272711
18175 364750 -29419 142581 -61890 -308711 127017 -436923 206313 160918 -249928 3959
18164 207756 358104 -68238 264526 119204 100441 -60926 85905 -159925 104808 -441759
18153 -223071 228870 -207245 8240 120285 114597 -154853 -50120 37085 -152994 -354088 -44009
18141 -165726 8948 -203382 72791 -357027 278302 282908 431301 -100697 -57887 69602 -18474
18129 -235257 -125354 36978 -321463 50672 -20056 -40144 -148181 273943 -150235 -51550
18118 -116851 136540 23451 105906 -87821 -277703 69014 -38731 -233819 -47235 6726 181929
18107 181929 53720 -103878 468151 391353 172919 21631 18049 -223707 17016 -191847 98018
18095 59535 66071 5945 -49020 -108064 -298137 65932 -105531 -203621 -151720 70211 -108190
18083 129670 79274 -166547 296921 47430 -30399 123678 -282698 -74555 -32206 131454
18072 -197004 -87798 23646 28264 9728 -371769 -198444 82361 200736 175576 -20519 -132416
18061 -132416 -190275 137747 59207 65051 -120933 -126510 238545 9500 -43965 127544 252003
18050 252003 -190972 -101392 208859 -50378 293858 15382 -109562 -52655 340531 -108092
18039 140355 411070 -97859 1209 -37941 -41781 81816 -55249 -144752 185825 28661 -203477
18027 66671 11305 45039 -154670 -175930 -133339 281280 199665 -229300 411464 -73980 -47879
18016 -47879 47472 -163181 -314333 -29424 195942 -56472 48427 -158033 239384 -69686 34033
18004 151176 -214425 -96097 144471 -35052 -84613 -44508 -265060 -29158 -188338 359419
17993 -61685 -63183 97766 139427 -966 -75627 198102 -20293 -19971 -17826 241377 -80005 -159755
17981 -159755 -76887 -67446 -104296 -369915 98063 -412004 -10300 210145 -47177 69132 -85189
17969 -25756 -47757 138120 -133125 -152894 87932 90260 -94738 139287 282527 -232716 -74919
17957 183308 3474 -126435 486168 -199802 76350 92853 -102354 61126 -61776 -552 -404984
17946 -404984 237047 -446995 -8542 -67056 -127623 205646 -117621 179311 137858 205748 -347348
17934 -57583 -246682 -33298 9864 -37044 -51758 45861 128310 -125968 -67446 -183930 316482
17922 -161918 87689 50009 -297355 -50281 519324 19733 16460 80107 158346 284346 -558341
17910 280295 478406 153565 241657 76685 -98832 -141148 29965 51831 -158150 270212 139664
17899 139664 15806 160902 -127773 118059 -90680 -16213 373614 424860 69238 -178944
17888 -94661 246445 -43080 369913 37882 246135 -138254 1901 58119 76359 231405 76739
17876 -78182 -192895 -26451 -67471 -20480 126072 114801 76420 128972 -181279 149033 -49251
17864 -7786 151319 -347 -93100 -130966 11440 -262260 -125410 173177 -61946 168759 215589
17853 215589 47154 -88701 -96005 -149898 -272358 -248838 96016 104604 164990 178454 -260488
17841 -42732 127515 171251 -86716 83095 78136 -7658 -41638 -216483 -58309 40463 -205064
17829 -67152 97777 -69776 8519 -11627 155266 -143743 -312296 8575 82863 -145371 202685
17817 42033 207052 -129121 116409 76723 144935 9159 109162 -47334 -254890 132442 359074
17806 359074 213353 161480 45569 -209102 113341 -21027 127370 66955 -522 390488 129173
17794 215845 -143677 -598 -36950 -106021 60359 407822 365 11673 352662 -25956 -133665
17783 -133665 -40876 146883 -206554 202939 11607 -351219 -118299 -85328 65870 261197
17773 261197 400331 -206297 22251 -25619 230756 -44232 -102382 66899 120175 56132 238917
17762 238917 119044 -85543 433307 280260 292482 197725 -8020 160829 -137136 37520 16780
17750 -43851 154670 -67946 56844 14208 148261 65765 159793 132706 -115458 228072 169856
17739 169856 -261422 122037 -122999 185675 53418 -80468 89844 -192129 -34378 231055
17728 -89688 70585 266166 353938 -106133 123000 -35856 20713 -172656 187144 272393 184083
17717 184083 177537 235279 29410 -19433 -237488 191443 305337 21897 153082 -249194 341083
17705 50022 -24148 174426 102638 -125501 68394 -50993 23052 -44360 221307 176673 58735
17693 -26363 29303 128293 96342 161370 111073 233332 -38845 136559 81710 139200 221729
17682 221729 94721 175169 462305 -83877 -77170 75799 100560 -152130 191817 271973 -158258
17670 424598 -166463 185844 271356 92633 -99761 28593 -24502 -72556 78499 201295 115599
17659 115599 473162 62472 228210 -70688 75032 214480 66260 181845 -181525 18815
17648 235674 89559 45044 459128 -212007 185780 106898 65367 172004 99532 30258 -53743
17636 121642 114653 406473 24089 -372549 5249 149989 148499 326811 139554 231351 -166386
17624 480332 -124923 112597 105761 135166 -71240 213185 139286 74808 -57168 81082 101155
17613 101155 67248 281918 186539 42080 35633 54117 -26682 87151 -77143 75974 286703
17602 286703 245672 464775 342315 207581 98841 443265 46831 12079 192790 277303
17592 277303 -71388 -125448 7715 157747 222763 204412 11718 279551 73007 323842 192755
17581 192755 88541 134598 290145 128393 -3016 25436 -31869 510505 83939 175833 242639
17570 242639 135249 235772 97158 -204457 39516 126410 42222 99873 -63207 -271087 107181
17558 376283 197839 363459 182216 236028 212789 -108627 196725 33144 597263 138341
17547 299530 331196 490000 284612 154027 162167 332645 284883 261221 522425 130485
17536 342858 215260 107603 110573 153272 488621 71736 146743 185687 257583 332365 775720
17525 775720 671907 947969 867957 1192954 751899 1184999 752539 450724 450566 510629
17515 510629 341279 441639 238587 136429 410730 677889 1009511 1070513 1254428 729512
17505 729512 634239 639445 360864 601609 359882 203902 493191 272616 376198 325927
17495 325927 522410 410864 244276 285401 99975 51830 256473 -103723 -36739 220459
17484 274194 257734 186484 -41933 214030 675534 459402 461846 254889 372106 245922
17474 245922 193431 68506 409197 560594 305061 345768 363207 327889 206330 359163
17464 359163 247556 234802 34034 -104810 332141 134772 516296 275578 35717 309458
17454 309458 81941 94180 406882 401077 85740 410467 440318 659798 609650 437266 547628
17443 547628 480467 556472 316028 297976 316076 527594 282613 663657 172124 365545
17433 365545 350799 297484 495033 537917 476872 286821 594430 496356 467078 531422 490894
17422 490894 532032 154557 401089 641137 528128 569451 467265 645255 200103 677241
17412 677241 475170 628664 432529 246619 391906 339355 178150 240184 208586 340752
17402 340752 350707 238057 -27345 575144 335879 107414 71040 186278 310137 295678
17392 295678 -17280 363847 379474 321761 342508 578088 377745 446781 513751 336427 466903
17381 466903 230612 228099 246915 332814 402128 129797 182733 118874 245431 75240 124409
17370 124409 -102307 503090 235346 393675 -156441 15109 47863 67952 54939 65726
17360 65726 412061 292781 445686 435146 355459 188489 61384 174837 288100 360110
17350 360110 424505 10942 131735 539235 258688 368605 115800 377234 685007 496914
17340 496914 205383 112727 535838 377567 281409 424887 148925 235415 192240 107233
17330 107233 595041 37490 60865 421376 241674 295028 394796 319937 663802 191644
17319 271803 72837 178427 432643 369484 133601 316086 341225 339716 163436 81622 342406
17308 342406 204047 -5920 379697 297480 212063 497901 290136 534426 198170 192503 512519
17297 512519 94380 408424 218347 282880 270634 -14242 220380 -97440 -18085 290403 230713
17286 230713 538897 9061 -22850 359417 334665 261818 121037 343829 362634 191564 274844
17275 274844 230808 520579 228484 435505 291298 61702 -152260 154307 -85694 491910
17264 104955 159928 -242828 454698 413361 240036 529357 329515 373295 525738 142064
17253 336529 316084 377179 522073 496871 306088 715405 478049 138281 561576 390071
17243 390071 337714 251162 444960 342669 184409 427279 297356 48143 186082 553560
17233 553560 425974 471065 442784 358014 571584 119525 321368 369406 472245 317877
17223 317877 255902 253185 101968 239479 400680 542670 638468 393516 310251 705006
17213 705006 301904 347342 440557 366064 162567 417914 360288 290833 137790 347673
17203 347673 276442 295501 391246 471110 146050 631394 318846 430813 347732 29339 578308
17192 578308 232881 169803 623480 456740 591782 212721 361132 571471 429025 446983
17182 446983 844590 620158 235734 448188 400591 753430 372489 681748 740969 435217
17172 435217 640533 526260 506723 597321 328613 666193 326785 455764 486516 906174
17162 906174 629269 641038 654529 538259 548848 413256 545812 658932 557402 567059
17152 567059 939997 715237 607437 630781 460837 357244 645974 700446 675559 488378
17142 488378 362031 342238 525676 679728 670826 505211 397514 722290 545146 753111
17132 753111 714148 562241 769359 489839 291722 326773 551395 640882 657941 835660
17122 835660 669349 716107 539654 265060 384058 524985 457106 744443 1002677 694542
17112 694542 539630 496807 860005 549628 659971 539908 712843 377406 751385 977948
17102 977948 1062682 442686 325417 506373 657330 534454 910208 925573 589745 573176
17092 573176 688291 719043 567026 424106 606013 650876 532606 871385 595068 631560
17082 631560 349637 884070 718725 565104 820170 621275 630662 625273 794590 509973
17072 509973 936914 773420 609180 643033 1155447 635755 921389 708192 1085392 646446
17062 646446 950349 963003 902571 887695 768419 1000355 868475 771401 1002598 798333
17052 798333 784364 869513 840595 813472 587797 807570 848535 906863 931206 610732 856554
17041 856554 970412 759961 1080956 751768 1087108 1359582 644378 929908 1041739 591850
17031 591850 751618 915645 1198449 1127671 644853 1027711 1073653 446110 999209 835563
17021 835563 1145401 1181491 853571 1004590 1011726 1058760 1194221 1160741 1131398 876992 960217
17010 960217 1102059 1166029 1145040 1155605 1106651 935257 1109696 1312522 1142736 1059533
17000 1059533 1247490 1136736 1215487 1030242 888889 1382708 1499218 1782231 1433857 1404219
16990 1404219 763991 1495037 1264539 1368908 1221824 1366015 1279051 1479891 1461077 1421096
16980 1421096 1299220 1398472 1545414 1107382 1185337 1440921 1510100 1266591 1458965 1832182
16970 1832182 1780817 1575660 1283616 1478539 1181456 1343188 1653971 1749037 1281111 1193523
16960 1193523 1246514 1510675 1609539 1773134 2000558 1653656 1583765 1769920 1929103 1415796
16950 1415796 2111164 1688915 1833300 2114066 1957770 1698873 1558308 1579531 1961415 1857691
16940 1857691 2117499 2235919 1822943 1850474 2013087 1994320 2179200 2330773 2025468 2405378
16930 2405378 2516896 2221441 2123686 2294595 2081068 2099510 2081342 2355167 2360916 2172546
16920 2172546 2347952 2386815 2325992 2498305 2331727 2360349 2544550 2697118 2598991 2398421
16910 2398421 2561135 2353699 2777096 2879541 2839157 2695516 2617894 2572911 2833281 2683760
16900 2683760 2779211 2852313 2699387 2959669 2853223 2858830 2856332 3366937 2843535 3280771
16890 3280771 3079195 3034762 3385907 3302839 3467197 3430113 3796797 3647364 3198883 3465576
16880 3465576 3467947 3591661 3624676 3509505 3748955 3669147 3767168 4015322 3707232 4146357
16870 4146357 3865289 4182561 3907313 3910878 4256400 4324825 4348287 3997944 4074168 4647191
16860 4647191 4370990 4618300 4891846 4734978 4783724 4747276 4695667 4823155 5312921 5221808
16850 5221808 5284425 5396315 5706692 5438252 5365183 5575642 5844790 5856599 6087450 6206621
16840 6206621 5972936 6435928 6362227 6678833 6480015 6826921 6652961 6854321 7047526 7098338
16830 7098338 7145309 7209417 7398288 7440424 7921895 7670387 7938419 8126530 8499332 8174119
16820 8174119 9079501 8981783 9367578 9415888 9406563 9500241 9871609 10127245 10113503 10482488
16810 10482488 10447791 11070930 11124422 11068227 11525138 11827588 12195151 12259575 12639521 12696788
16800 12696788 13003665 13292768 13474258 14231034 14455780 14666863 14825396 15233286 15611382
16791 15611382 16232660 16513314 17277381 17384496 18107389 18410171 18964227 19513561 20173575
16782 20173575 20637064 21069230 21625652 22172931 23010134 23549430 24412300 25427311 25871304
16773 25871304 26675421 27585918 28277654 29295711 30470283 31303419 32128494 33456202 34553663
16764 34553663 35650068 36696814 38184896 39318362 40932955 42050717 44199815 45514868
16756 45514868 47186970 49009138 50925517 53150807 54943811 57002626 59452984 61741557
16748 61741557 63954124 66337226 69471111 71867064 74401005 77354813 80506883 83429454
16740 83429454 86499552 89862023 92918791 96221289 99518377 102939068 105703360 108777640
16732 108777640 112344194 115066447 118053643 120372628 122961752 125203091 127017304 128632717
16724 128632717 129696170 130617188 131215364 131316954 130893492 130015569 129173057 128046674 126156329
16715 126156329 124451232 121831963 119225551 116615679 113380491 110404738 107035345 103841868
16707 103841868 100636074 97331336 93883735 90362935 87324864 84376294 81017422 77998643
16699 77998643 75083220 72151784 69142117 66707942 63900167 61615584 59263422 56816851
16691 56816851 54787249 52833903 50716475 48736631 47046451 45326495 43467250 41931748
16683 41931748 40439616 38992586 37641228 36050633 35162806 33616449 32512821 31713692
16675 31713692 30451587 29839800 28321653 27986754 26743159 26056019 25430453 24459225 23428694
16666 23428694 22680163 22204840 21272685 20775957 20185778 19862289 19142038 18529862 18415298
16657 18415298 17932755 17495439 16909432 16396993 15806065 15446867 15083550 14554682 14245599
16648 14245599 14117809 13709499 13238314 12964621 12891721 12374113 12287655 11691662 11556100 10976879
16638 10976879 11001693 10726488 10283627 10413351 10012116 9942923 9541454 9230132 9003231 9428276
16628 9428276 8528842 8796668 8674792 8457522 8100238 8142257 7747553 7605164 7501975 7418855
16618 7418855 7653673 7282475 6958051 6835740 7034638 6643754 6665333 6258604 6485797 5886708
16608 5886708 6120240 6075018 5744163 5881822 5719581 5634885 5533321 5709692 5242357 5120247
16598 5120247 4983873 4861438 4691856 5275118 4744892 4562600 4445299 4740848 4830462 4425008
16588 4425008 4229397 4696490 4384974 4178474 4032149 4199209 3918582 4016255 3601618 3971813
16578 3971813 3758976 3893561 3719951 3784532 3796737 3609287 3733233 3712193 3534587 3337296
16568 3337296 3358812 3121910 3394173 3639098 3003342 3046057 3209993 3544156 2911684 2834571
16558 2834571 2923274 2923106 2922201 2894212 2572216 2857976 2577340 2594573 2555192 2617022 2582373
16547 2582373 2751279 2606266 2730665 2412165 2540573 2506216 2632437 2473931 1795016 2404456
16537 2404456 2492907 2190920 2009696 2391717 2255952 1984851 2280044 2028774 1810409 2153746
16527 2153746 2079546 1797211 1808550 1998504 2080266 1746075 1883098 1781578 1892562 1788480
16517 1788480 1755286 2197616 1722559 1849895 1971008 1720710 1641555 1535645 1875927 1753137
16507 1753137 1313824 1835944 1702333 1617583 1484071 1438799 1467110 1410214 1283677 1502735
16497 1502735 1581520 1535266 1639039 1645915 1511890 1569902 1221077 1594314 1281113 1385073
16487 1385073 1131512 1281935 1533562 1500830 1166689 1110753 1149680 1265404 1262028 1282723
16477 1282723 1171591 1025477 1794887 1185794 1216055 1428834 1516422 1059467 1366980 1427709
16467 1427709 1070298 776005 1416046 1309148 793454 1193899 813999 1241564 1088528
16458 1088528 1127361 858595 977026 770038 1319637 1034462 936636 701399 874026 874638
16448 874638 1359993 930831 1018370 892815 874089 770285 873367 769861 674379 638855
16438 638855 883447 859929 819953 787921 860534 657081 817441 783170 720944 839282 786883
16427 786883 714555 996170 999856 802652 540168 1023907 869046 841523 701751 557069
16417 557069 673743 949645 735123 968832 651796 920676 841550 413395 788696 624975
16407 624975 1015135 640046 927776 795811 695859 729373 785856 773798 263374 744850
16397 744850 465087 703926 1013009 644311 599685 597174 455641 595243 646664 514942
16387 514942 535757 584097 732122 713551 738071 600712 923046 477256 439347 712839
16377 712839 643983 434557 577966 644205 641725 435482 567541 794520 415018 545887
16367 545887 578536 515891 351161 295897 665393 497642 600559 756743 678177 498643
16357 498643 342258 454670 564082 404465 359714 509522 347309 478818 305275 484486
16347 484486 339547 629536 363523 631664 402739 544156 712683 690379 708823 383763
16337 383763 796193 705053 544544 657352 465348 387004 453325 318379 278921 467385
16327 467385 296265 518032 335936 407408 510354 169790 651837 421261 515024 423426
16317 423426 439741 195191 188820 308730 184300 283216 493592 594993 339373 356626
16307 356626 81428 138295 341724 659399 261411 525771 495816 387598 522825 448497
16297 448497 319565 686086 220335 259740 388555 459307 216597 109660 292696 324493
16287 324493 149054 105105 647924 233292 373543 299062 197062 483583 410650 116687
16276 11668 471326 54338 251247 486758 479488 171028 412122 255204 89865 126867 245346
16265 245346 375280 253024 35479 228009 320761 128063 59865 337112 255196 170674
16255 170674 290007 271570 143739 554792 149854 -26240 211732 245851 -7339 246620
16244 496022 186687 12934 528351 130781 -53634 234642 58484 288263 -98884 -192367
16234 -192367 430170 611500 153178 41855 435427 469426 219211 343102 268370 278510
16224 278510 24310 -25169 462072 268450 39892 -168757 68499 319236 874 207670 -165746
16212 105334 282871 545990 17740 -43459 612781 -34315 542686 207482 126047 148986
16202 148986 336443 241072 170439 160857 233318 252590 122044 216107 -122132 355740 268415
16191 268415 362955 49509 167896 -105214 -53352 319018 232552 265473 -249230 -57649 246462
16179 -72712 -226811 -13148 60302 72313 11461 191141 43412 -67406 166112 -78786 294414
16167 -82407 380072 -62971 257956 131263 130016 146371 58020 -46995 668616 12267 -108985
16155 120572 293912 130652 14315 132423 83818 -102724 424595 32994 -95523 210046
16144 -42566 136769 -223895 -97667 53670 -203129 220644 144421 202481 298462 -61252 209432
16132 163878 -47814 309949 186503 287557 97352 119659 85016 103555 150368 -160097 528574
16120 94048 293333 168745 -101219 59429 -203977 -8440 348065 282784 98806 203389 -26329
16108 -147747 -26035 149305 -197941 66788 -52192 38822 208158 -24808 182122 -147721
16097 218836 39288 -137086 113093 118019 70361 161810 -84843 -147708 122798 -26065 -177177
16086 -177177 433338 -110762 171753 -190231 86416 -20241 -354413 34145 -159603 -14026
16075 -200712 43062 -71080 -272874 320452 24636 -6902 93321 197434 118351 17125 -46944
16063 208403 85579 528763 108756 149471 -115464 -291820 -208428 146049 302400 304382
16053 304382 -243592 185561 27218 20650 140036 -27506 -438970 140614 -3347 92096 268584
16042 268584 149902 -191844 -78154 -6216 -239101 -243928 52673 209635 -82491 71601 33374
16030 -412657 52835 261112 -167632 -81914 -152224 -86150 -6609 -1293 67743 133170 247059
16019 247059 -302463 8927 -18230 219927 152368 240341 -81414 -232082 168625 -93022 199685
16007 -56328 22292 203280 -220707 -113902 37874 229022 -173289 268141 -16734 14286
15996 -67701 -29198 142693 -113866 274410 134677 -70665 554069 238277 49284 536441
15986 536441 718171 1023088 1214107 1176734 716357 892960 434411 70895 -144946 -122389
15976 -122389 102925 -49901 56650 69579 253529 525004 -2531 -84824 306502 500753 -172102
15964 33142 101896 -85466 246834 -11255 106329 -367680 63746 -412098 -233946 -339013
15954 -339013 464888 21720 -35115 -33760 -49675 -221265 -195796 87453 18693 22696 -112265
15942 -87418 -97269 111937 17031 22929 -67655 101715 -164261 -3005 -225961 -71693 252455
15930 134947 -104257 252156 -31671 246321 36405 63321 15435 56598 -27595 127583 110053
15919 110053 45465 -257420 -29351 -498976 -52635 -201581 109478 -80731 67345 -128345
15908 89411 396889 -60337 -211662 74932 -40838 -94675 197262 -157555 -56186 -87778 -176413
15897 -176413 -63797 94636 15424 -100150 -63993 188528 44785 -249039 -130488 -215419 -212241
15886 -212241 315579 103348 -93658 -38886 237408 9323 111916 165580 -302878 252483
15875 182530 27308 300405 107836 134680 -46715 -327102 86628 43395 -284884 -25343 26007
15863 -68276 116554 -41781 11339 32726 -418463 60131 -272872 -105612 242183 -104474
15852 -198335 142775 -225493 133671 299507 115582 -281457 -89506 156377 -203815 -163724
15842 -163724 36816 1724 188261 220503 15676 -10762 -108573 -99169 -166094 174733 -228075
15830 -25111 -90825 156020 -164320 117826 -157449 -53579 213827 -352 148161 -46320 -407620
15819 -407620 328461 -7079 136782 37415 -34162 -381652 -237500 -163128 -88095 172469 72123
15807 36289 -223634 -99367 483882 -169658 86062 279157 -247455 147855 -22672 -218288
15797 -218288 -352234 110639 82505 201806 -114547 -45988 302420 66448 -109122 74213
15786 122728 -117877 -293529 150223 251689 -75835 -283328 146610 -173201 -118891 -227008
15776 -227008 -151108 122134 -55425 -14615 85458 7092 271470 373423 -12046 65257 372
15764 70203 -116079 -119401 48967 40150 -35636 -610 324355 77044 -215972 27679 146885 273998
15752 273998 62766 234394 91930 161394 181438 225359 -313838 -136138 57021 64080 134119
15741 134119 -139266 110196 -206225 2239 -60468 -57298 -228864 -211385 -131598 -152273 -265298
15730 -265298 207021 -10116 -14996 -85899 -280097 52236 109835 -136851 -33788 -178110 119329
15718 -282872 42475 -218431 -231503 40628 -54984 -6706 36396 -242262 -4372 -20321 49275
15706 -58077 -150734 140225 -351510 104503 51367 -59224 -31368 61286 -10890 4840 -131149
15694 177469 -2776 -212160 -119302 -153685 -134554 62201 98399 167599 -57835 34646 351292
15683 351292 -20370 -89386 -204138 -393991 -153968 -70188 -210552 -179120 -174295 -45242 -179790
15672 -179790 -427863 145319 257466 -79446 299894 26660 7303 418 26556 45446 -104729
15660 -11311 -128821 -307093 -16461 185226 -57356 -70540 16928 -89789 -166792 280928 168446
15649 168446 -397953 -208046 67203 162660 131480 321461 -141443 -31847 -153044 178839
15638 -76436 46831 -33857 110347 115763 41069 -190467 -331577 -162009 -18115 160589 -125637
15626 147 -364682 -186454 -365624 -206094 -104504 -141159 -422536 -166072 -810 -84931 74937
15614 -170109 -317278 -135057 138546 98084 162508 -251952 262563 -208187 -284577 -149011
15604 -149011 -85264 -236421 110232 -41203 -194520 -403068 158295 -44935 -92548 -83138 -42981
15593 -42981 -130874 -67918 -37673 -8288 -85896 -209223 -105040 35062 41342 -24 82999 -251 149072
15579 -255294 -6618 -77331 102064 218257 132963 45287 28678 -59217 60910 76761 128230
15568 128230 -332784 210247 -156967 -248727 -39246 133927 -239773 -118536 -11687 280006
15557 385823 -80647 -175941 78811 150259 -86013 -320614 29851 -52193 -176691 67509 -272193
15545 182454 -297572 -121588 229968 -143039 132767 -257355 -73799 -349708 -84438 78195
15534 -15666 50803 306541 -11890 -260976 -60549 156085 247667 175848 97406 128651 60794
15522 -5335 165772 2262 103309 77357 181746 373938 250144 19228 213469 64199 401642
15511 401642 -96411 175849 98827 129834 -33910 177357 234074 -39461 182338 171922 199063
15500 199063 1900 270769 288630 242753 59476 165718 -178867 84455 327358 134956 170569
15489 170569 -37159 51139 132812 11214 261767 333330 318225 31847 177958 -230358 155451
15477 -104239 313731 -69047 350022 203582 774783 647424 701910 117746 118518 342932
15467 342932 -52575 85579 123479 176133 -350252 191221 10844 -2669 109703 -62448 -136273
15456 -136273 91618 112674 -236201 63263 84244 123646 145970 194349 235870 43437 -48214
15444 214856 399661 266781 497154 951053 1576324 1557616 1181650 621245 254486 202300
15434 202300 92498 193352 -20520 -140442 -285709 139800 107736 -13775 -235 -99186 488127
15422 206593 29009 20343 184884 -186821 -26889 113274 -120452 -154944 -64847 160059 -174731
15410 53119 215508 111579 -220996 -171947 -23367 39066 -6852 224781 168452 -107478 18396
15398 63891 443364 -127855 -131177 314451 44007 -154874 -128491 325962 52882 58115 -52258
15386 -85349 157727 251579 81291 245801 149049 188637 134090 27848 -61904 -169721 474021
15374 45877 149448 167006 96872 645101 372930 147948 -43573 371551 -6678 55245 474918
15363 474918 25552 -41663 342112 112994 114990 423894 564928 252673 512271 162731
15352 80818 243066 91080 203796 95322 -99347 464363 335021 245372 160173 179729 351111
15341 351111 312743 281465 200204 333325 286039 385987 80070 22637 304893 -177938 40620
15329 15120 439923 249828 -163758 252512 69045 358389 -187821 -89573 229406 -301543
15318 193343 154593 111506 26695 -51393 203443 125184 7362 261776 282675 283154 222897 140961
15306 140961 50537 65575 344593 154871 -115614 14674 146252 25244 26949 301589 -157964
15294 -67486 -96747 206311 81872 53285 260143 -217568 -64004 242164 -48051 21047 83234
15283 83234 55868 92797 -67367 -295467 135646 29260 -151664 112874 47869 -24341 -111167
15272 -111167 -161091 -60133 60869 217011 -100296 17776 85140 -74075 -295563 53602 316752
15261 316752 117647 -33076 -175806 -101308 198332 -136469 219554 224620 244303 373892
15251 373892 27132 -130800 307606 125446 187274 227613 332746 380949 851283 1491619
15241 1491619 1657788 1416277 1730678 1193033 454299 90884 -190787 119615 206319 19376
15230 -213741 -8288 192100 -13983 -95266 100198 -166125 -170801 -138312 -130107 111982 102803
15219 102803 28266 317705 234058 41207 90208 -120410 240594 277048 133854 179495 -1255
15207 147765 366828 7073 169506 48492 310424 99255 224456 297353 333616 242345 -283358
15195 174307 45445 -283527 121735 217381 318717 -169103 76186 124752 159108 100204 265775
15184 265775 28821 -190383 -137 -31701 -209932 239778 -154991 7990 195889 -61471 25861
15172 141380 -140287 322692 135477 -101407 104349 79524 281227 11466 188519 124403
15162 124403 -19125 180039 298403 -113565 47203 56696 -168958 -86828 78416 430759 132855
15150 -185181 110771 105116 -279652 260916 -19551 265341 -110981 -2612 -18623 105164 167700
15139 167700 478242 -298 -31382 245051 -54660 74444 150313 264880 72214 265787 195740
15128 195740 51019 107773 116480 124382 82922 -2546 295448 375122 403514 61470 319096 449017
15116 449017 548289 260850 475298 230265 534252 187424 -9954 -201375 148103 312626
15106 312626 149666 63974 219357 382611 -33957 327096 234039 -101737 264141 -245202
15095 253860 -252873 -79767 173403 498575 128914 292353 -93046 364706 -20907 137028
15084 209422 -60026 235050 122773 -85053 -159462 185595 -164090 662089 229214 128375
15074 128375 -35542 518606 193851 434665 126634 324069 109480 116811 -8098 80229 198477
15063 198477 207022 -256016 438117 157346 239448 258562 481902 141933 351548 439555
15053 439555 -9591 217326 90712 17351 536324 -46130 287881 710309 195807 266426 131297
15041 790415 320379 544190 521776 511367 742942 276921 621537 656210 327284 733243
15031 733243 836457 776002 758012 964924 778389 671188 606398 443920 574110 776429
15021 776429 405525 590274 602266 382132 176095 370388 562370 679589 291105 557927
15011 557927 360236 669501 463415 386598 358946 510825 435300 457730 194615 280185
15001 280185 502687 174122 390981 499740 438239 334988 344537 349065 404971 541110 561771
14990 561771 552988 44259 524411 483472 375972 554195 364678 661247 671034 1236863 1127921
14979 1127921 939578 814896 655746 378793 797566 610583 385576 576923 567057 622770
14969 622770 621905 553070 430909 623543 191435 338412 183164 71597 670098 -272218
14958 370674 252867 133370 231460 229569 271277 408828 356246 459849 272451 145585
14948 145585 453649 33588 205668 660807 505991 562246 707801 540092 735547 439239
14938 439239 253722 638441 509874 645048 311701 715898 609327 812956 1367211 1078841
14928 1078841 836583 1421234 1345798 1732482 1656301 1783549 1642919 1556020 1368874 1376205
14918 1376205 1527975 2069670 2262406 2532466 2004586 2063957 1310082 1351471 960704 1073617
14908 1073617 656771 745484 451968 214744 690993 338639 292832 399636 388095 620675
14898 620675 550697 314494 285181 714089 476086 365820 325483 50899 624386 293843
14887 543725 571733 961277 637284 717008 775939 997807 1044191 596773 1013254 751007
14877 751007 974771 766648 737518 692101 542287 339647 440136 744938 91902 533399
14867 533399 950741 713066 899121 990576 387380 378910 477008 521917 735859 260851
14856 582106 666755 500494 361331 594211 239942 85934 90305 849415 810679 293517
14845 677105 766041 660774 803367 1070116 1136797 1173213 1013073 1127961 1258883 840746
14835 840746 935227 775769 866412 537413 784820 499434 584120 520876 841326 538965
14825 538965 714287 470237 546107 783203 515716 503372 689793 559086 639402 690510
14815 690510 618290 873677 679719 532979 587687 714180 770875 573031 573336 737385 636090
14804 636090 586953 977721 871580 773005 696803 565019 648151 659871 723927 568452 274970
14792 525239 221146 794249 728511 638593 924474 793450 662182 688805 743287 742647 450659
14781 450659 771314 533964 594252 767592 483050 1121121 968134 908625 1149469 556153
14770 858402 393594 682414 875713 662115 608539 331804 1004045 364012 622773 558010
14760 558010 595491 606281 614119 891351 651643 658254 517928 638924 720931 591353 615799
14749 615799 572389 715212 471039 376218 760468 758461 565558 762210 761575 701368 878547
14738 878547 1077426 895419 709370 883728 722743 1037944 899718 913443 931644 1241286
14728 1241286 1200202 1278332 1668328 1868831 1541045 1483314 1160535 1116817 1023261 974823
14718 974823 1123109 1024976 1168092 896872 865393 969501 934988 710969 863829 948525
14708 948525 922164 1040130 1082630 657093 1212033 1333401 1216428 1939377 1925685 2209810
14698 2209810 1801978 1600967 1730631 1333984 1041702 748603 1304549 969188 1022030 775436
14688 775436 791373 1036597 746397 673143 923579 1079764 963018 988062 668713 847072
14678 847072 1252036 1091269 999817 948409 804748 930680 1073387 818345 1129238 1084338
14668 1084338 851208 967484 884481 1253214 994300 1230439 1475905 1145557 828024 960260
14658 960260 926638 902356 1000979 1028301 1230378 1300220 1475430 1368341 1284743 1635075 1349883
14647 1349883 1404459 1174786 729961 1075477 1500819 979719 1179773 891683 1087157 1292610
14637 1292610 863616 1209536 1369224 1619707 1225576 1407814 1238231 1271188 1182370 1442836
14627 1442836 1445888 1264265 885585 1422311 1175966 1548124 1306713 1377971 1649544 1271161
14617 1271161 1297118 1233045 1275806 1839634 1456969 1737627 1740106 1612535 1558022 1460534 1688869
14606 1688869 1724378 1380108 1593489 1665018 1343575 1833955 1744922 1942384 1753058 1913793
14596 1913793 1546787 1631722 1743707 1604889 1397798 1661130 1651964 1553123 1654112 1733715
14586 1733715 2037345 2012498 1666870 1868613 2064856 1867519 2004762 2228071 2183420 2018490
14576 2018490 1877021 2038483 1901503 2279391 2512127 1927194 1919376 2451755 2415122 2461322
14566 2461322 2279312 2481571 2174150 2350900 2603309 2528069 2729637 2928867 2871772 3116702
14556 3116702 2778277 3099374 3258986 3837154 4336566 4309144 5608399 7338120 12470776
14547 12470776 22667595 39339099 45439992 21951302 8174850 3943844 2728990 2848539
14539 2848539 2825502 4233049 5462298 3368497 2492271 2006770 1896097 1824621 2257002
14530 2257002 2042241 2180954 2183515 2206208 2471635 2238964 2382806 2296028 2467246 2447642
14520 2447642 2250020 2731371 2538629 2583467 2710794 2641125 2755511 2665211 2755552 2319113
14510 2319113 2848360 2991731 2837665 2535776 2836498 2766473 3005638 2844670 3034202 3274649
14500 3274649 3270179 3208845 3016197 3322698 3417466 3087904 3455156 3314118 3259188 3428167
14490 3428167 3354939 3388408 3586865 3572887 3537772 3533338 3908079 3454858 3627229 4088051
14480 4088051 3897401 4066210 3733308 4099089 4159678 4403713 4406599 4044759 3860796 4099167
14470 4099167 4509932 4410340 4159564 4183963 4813604 4532293 4423544 4676613 4679534 4628423
14460 4628423 4772202 4973519 4646868 5208902 4961616 5160242 5320072 5120450 5234608
14451 5234608 5430012 5212460 5526902 5570337 5559641 5614327 5572212 6160258 5905176 6044195
14441 6044195 6019991 6160106 6480248 6277255 6079436 6406196 6393908 6519431 6410516 6635900
14431 6635900 6641741 6978463 7130252 7234844 7623895 7196354 7044099 7735071 7598015 7668043
14421 7668043 8042749 8044120 8540700 8843031 8553174 8764215 8863125 8719120 9030971 8995279
14411 8995279 9099402 9122347 9093558 9579441 9596976 9790854 10211224 10383502 10407045 10748475
14401 10748475 10948258 10809344 10559135 11078250 11129714 11296234 11557239 11629662 11708241 12109567
14391 12109567 12366424 12682337 12822433 12911676 13759842 13569322 13750837 13907907 14049921
14382 14049921 14893977 15049606 15147337 15514655 15698245 16117246 15995497 16447734 16999470
14373 16999470 17021094 17640828 17842271 17954559 18697874 18588928 19633390 19738313 20216078
14364 20216078 20257282 21320053 21313330 21720578 22140723 22830470 23066801 23634649 24187119 24883220
14354 24883220 24850179 25929189 26786687 27264794 27684976 28486841 29132803 29976322 30727578
14345 30727578 31261026 32265780 33147776 34350909 35016481 36052627 37307572 38209726 39341272
14336 39341272 40316167 41796572 42893718 44348780 45437907 46678798 48096071 49775518
14328 49775518 51330051 53110354 54957088 56921186 58685894 61059803 63027618 65063616
14320 65063616 67574820 69712776 72675416 75278243 77780199 80767925 84075020 87186790
14312 87186790 90989502 94611344 98903765 103030501 107501598 112054564 117171978 122475663
14304 122475663 127738446 133902195 140197499 147076977 153915476 161628288 169893662 178295046
14296 178295046 187221160 196504592 206541026 217054344 228115251 240214724 252440555
14289 252440555 265586876 279391804 293425525 307747669 322730143 338117676 353868166
14282 353868166 369496277 385085131 400543061 415446142 429585414 442176833 454060537
14275 454060537 464269699 472029169 475796472 474648870 470966773 467997997 467715203 465246408
14267 465246408 460024043 451913016 442203213 430023454 416592189 401972255 386620481
14260 386620481 371238610 355771773 339891013 324001125 308152385 293198948 278495521
14253 278495521 264450553 251271307 238515400 226567272 215423365 205748778 196007222
14246 196007222 186137527 177040549 168725890 161058257 153286372 146115044 139855776 133296235
14238 133296235 127793051 122218544 116764342 111813590 107138963 102514041 98725272 95249484
14230 95249484 91062349 87408161 84197885 81001927 77668171 74911065 72278224 69405511
14222 69405511 67312862 65136016 63000170 60591687 58664540 56679955 54952033 53458663
14214 53458663 52171815 50804944 48803273 47004441 45853365 44527955 43166181 42491470
14206 42491470 41759324 40037327 38805800 37357834 36848395 35874844 35289728 34118694 33012923
14197 33012923 32380052 31218844 30553544 30076169 29298235 28642298 27767577 27294763 26337325
14188 26337325 25822595 25325404 24991613 24436458 23687623 23399123 22577640 21812744 21651606
14179 21651606 21252629 21032564 20162420 19820987 19722802 19312935 18670046 18696691 17810730 17644105
14169 17644105 17342017 17119883 16886717 16261949 15876949 15866210 15475585 15305130 14860717
14160 14860717 14706014 14332031 14230263 14037301 13663317 13693882 13391022 12860287 12704867
14151 12704867 12729381 12733209 11972775 11871244 11905922 11848117 11598332 11374752 11056808 11176059
14141 11176059 11055722 10437897 10347502 10250450 10054987 9956835 9644270 10046861 9804652 9467040
14131 9467040 9421164 9064229 8919088 9096908 9075104 8910979 8829492 8454077 8234551 8355020
14121 8355020 8161262 8276791 8058634 8068917 7617944 7897722 7457491 7472228 7259959 7221097
14111 7221097 7228253 7181691 7527183 6769413 6704013 6728779 6701473 6464652 6483430 6385824 6508474
14100 6508474 6488755 6019887 6171632 6248615 6070081 5862407 5877527 5538553 5621672 5776508
14090 5776508 5494586 5435045 5321782 5214125 5282004 5135241 5347820 5118421 5347028 5144083
14080 5144083 5037199 4813218 4853781 4632510 5026774 4679770 4865674 4659120 4587570 4357839
14070 4357839 4749639 4355494 4537616 4430291 4423011 4086375 4231880 4647176 4384495 4233684
14060 4233684 4342444 4402587 4198781 4195633 3968282 3763393 3731281 3783086 3744958 3742114 3704425
14049 3704425 3452947 3674998 3523505 3595581 3540201 3531252 3699458 3345041 3576204 3368541
14039 3368541 3502927 3338358 3302181 3275506 3058766 3012291 3111965 3068832 3256830 3143698
14029 3143698 3235436 2880270 3068715 2949996 2920374 2916195 2724583 2520417 2864974 2592120
14019 2592120 2742927 2681817 2691714 2646320 2705802 2880379 2148242 2586160 2332559 2606582
14009 2606582 2452334 2357806 2659252 2576388 2305633 2231208 2088212 2373330 2419380 2288325
13999 2288325 2151231 1885774 2296350 1886949 1978274 1921066 2015982 1857701 2411730 2605231
13989 2605231 3527032 6261201 15070743 31751281 46753019 29451678 14079051 8019613
13981 8019613 5870776 4844661 4222408 3457222 3259195 3243479 3424110 2957691 2609333
13972 2609333 2523957 2694254 2419168 2508017 2508619 2017804 2461459 2361283 2426958 2426235 2299315
13961 2299315 2222544 2064709 2204862 2302655 2245424 2367483 2076156 1963436 1872768 1641535
13951 1641535 1866537 2100796 2298416 1980537 1785071 1683894 2047895 1977681 1839586 2073028
13941 2073028 1876183 1795189 1514413 1791026 1642693 1681677 1778226 1873982 1749286 1757464
13931 1757464 1823577 1537085 1573172 1896027 1786627 1436551 1504076 1874132 1472305 1797240
13921 1797240 1790092 1424283 1522385 1522618 1816020 1603035 1457079 1146184 1554803 1100485
13911 1100485 1624223 1906308 1533823 1464417 1645336 1356416 1431282 1380453 1483713 1115716
13901 1115716 1485284 1510713 1396032 1339651 1260529 1222741 1313455 1337877 1271192 1280201 1114736
13890 1114736 1195497 1487216 1392067 1286073 1096036 1154920 1209635 1282310 1149482 1107367
13880 1107367 1709808 956444 1304304 1114807 1049767 1442315 1120366 993356 1113989 933247
13870 933247 1049700 1161543 1072207 1080544 1168311 1147649 1278486 1380451 1056999 1248240
13860 1248240 1039509 1089180 1153616 1280170 792493 1343839 819595 1133969 871021 1216438
13850 1216438 1018572 1279958 978485 776837 1048527 1140939 591997 1368201 984860 1040057
13840 1040057 767080 1109899 1037830 1221678 851476 1008731 1061250 944366 1039779 1061704
13830 1061704 1126290 1022122 1364740 996962 1208224 995123 886461 717024 1329278 767908
13820 767908 663944 762399 923148 806889 1335044 696445 955109 768169 1167668 667453
13810 667453 1271591 1063714 1117867 782476 1074895 625104 962439 840805 710262 983844
13800 983844 603281 965014 1007429 731428 853690 834500 697436 883989 791529 803401
13790 803401 770601 786220 979229 699093 818489 869968 793851 475461 860236 970765
13780 970765 661659 664789 914379 970720 1053064 1113112 804274 1059577 503443 713442
13770 713442 981463 794279 538608 828968 523646 668702 597466 654313 750116 593134
13760 593134 757181 723106 539036 646970 784090 652675 652251 681758 555953 591324 668312
13749 668312 459145 610983 514294 463020 1021726 716276 618127 563872 731928 883962
13739 883962 390581 723531 578387 790963 630301 450451 638913 612582 763897 740845
13729 740845 776140 456979 891887 938385 702340 576401 519894 648610 440226 516172
13719 516172 617062 482840 297023 443697 501153 556829 618783 247750 512862 545070
13709 545070 344879 868974 862496 584520 831930 443698 319630 530811 527065 732470
13699 732470 315355 269527 771478 648885 303514 615413 766352 623854 565471 711474
13689 711474 303483 544005 635182 404150 335919 486618 338646 583353 675298 521239
13679 521239 486655 564322 690826 172321 229113 369330 230271 434466 379668 355019
13669 355019 526043 102629 535664 182239 -7296 349674 394990 438040 586279 564619
13659 564619 729605 393447 480489 501426 580488 647054 324258 668571 414952 608690
13649 608690 337731 145717 981227 60002 573832 375033 129432 529418 574191 368299
13639 368299 565331 85001 420240 497802 367133 380038 460483 330930 202961 503478
13629 503478 579097 423343 573985 569793 632741 295645 270188 522617 475539 397629 442384
13618 442384 346980 384723 365295 648113 439569 468524 551796 332268 357347 475657 428819
13607 428819 85969 515236 340713 506350 85394 539754 642918 426111 193597 183599
13597 183599 863518 18167 283883 362486 454505 494903 126538 799055 360747 681508
13587 681508 305203 168174 96386 497990 533713 512173 220437 528566 183082 361990
13577 361990 695618 347540 548184 534482 80000 245847 393409 470284 322983 400599
13567 400599 82008 -118556 265255 206211 487245 313395 225767 455002 205428 324034
13557 324034 104767 192064 1420 432704 333145 265830 243774 311676 185916 412325 314423
13546 314423 457922 209218 214715 252197 456528 460674 572014 366726 242900 284443 387219
13535 387219 437411 82212 445363 433773 108832 314579 125154 141445 507649 222867
13524 230315 -99862 193467 19349 420969 181007 -31629 504901 324052 113738 238358
13514 238358 196512 79679 228176 245379 444371 379129 353247 302061 145705 217964 289837
13503 289837 206038 252809 182228 371834 194457 245317 549995 94444 560071 46856 358539
13492 358539 36156 444439 556020 404820 127165 343371 266578 319537 18712 46277
13482 46277 267847 534912 230695 396643 331783 234666 385289 186029 449810 101251
13471 -102584 532570 179834 112255 284273 360397 310962 527590 188138 326856 232654
13461 232654 471712 465899 333376 178855 21858 514731 302616 271710 328875 -49113 226814
13449 -127114 654141 167224 192332 255618 330598 234292 436200 183713 87209 -6599 -134352
13438 -134352 292630 132366 137598 -33910 363881 438907 -27972 339271 -68321 268222 234532
13427 234532 5345 168490 149696 635099 298761 516989 324780 515599 103434 265765
13417 265765 46824 609086 506726 -128782 2055 353690 -63615 -9254 69889 483346 162631
13405 162780 146167 182746 70175 143665 421937 277703 116568 181893 28061 -51101 108943
13393 -159400 97378 462169 429909 514918 115460 463785 474127 143890 225370 188791 202479
13382 202479 251315 -10258 352184 278058 -13459 58657 251270 351871 535200 309398
13372 309398 188905 -21197 349420 433282 158688 216518 397449 87734 21367 473256
13362 473256 59253 315681 345022 252631 260287 69300 153220 -43244 162878 223977 -17210
13350 -248286 186562 19773 238336 210016 18771 451144 -18057 -135432 101680 260284
13340 260284 74266 516578 677987 88286 677096 369903 448985 34366 335964 379564
13330 379564 -164610 143895 75793 253502 21881 69009 130840 289399 525657 -104890
13319 73864 383198 -33445 531776 289621 289881 91090 248031 107393 449818 114629 488735
13308 488735 258355 111413 80257 142881 281894 203060 312390 -65098 114008 220341
13298 220341 369904 -104303 331201 205884 627270 322305 201601 112690 159169 114008
13288 114008 231911 113939 97035 153617 -31886 195503 115930 -105530 98950 22715 134404
13277 134404 341877 284078 367080 99887 340039 196288 135390 103818 249518 243314 102343
13265 -211025 99559 404829 -74837 -9850 80807 359527 157591 180453 640914 -7395 -46092
13254 -46092 128228 153588 308427 -117429 23338 504922 168815 672685 101312 170779
13244 170779 427578 38391 483935 165171 -114252 -48282 77183 -24818 117232 145040
13234 145040 -42470 207070 8524 196879 174383 -92372 88305 165943 217130 353294 133465
13222 280997 371672 -44762 26338 412 54052 182910 254390 3 155702 129648 358426 142949
13209 155679 384877 161811 172894 -201416 200800 -77632 140773 33732 -470015 -174700
13198 241816 -5698 155158 -82345 -110410 -133094 52507 85083 82938 105686 -106859 205183
13186 -55227 -115900 17622 143783 166340 282002 106425 135110 117647 21140 129094 135363
13175 135363 -136124 -40174 201185 -179723 12370 -61962 84055 -99622 373481 151422
13164 339204 -12963 225098 -133928 362356 115225 59880 -2211 30119 41355 216664 11886
13152 -177019 -104610 54371 289807 268736 289252 143032 230162 209581 75781 56789 -231818
13140 120937 -90389 92298 329182 -4644 191169 202136 227541 -42536 248353 -291171 -302831
13129 -302831 52490 -9657 -185961 -18111 62867 -85755 187649 112609 6118 71439 -19483
13117 146413 375083 41541 301718 17459 -22622 280192 65357 -22635 -106222 267241 -71344
13105 165096 131363 254682 -138974 416183 63281 163600 -92877 -221180 126061 -90999
13094 99107 141234 -187736 130641 20762 52996 181822 -71053 91758 324497 -193195 107266
13082 40218 65397 72122 62114 569593 472665 -251067 -82414 292726 -156367 118881 81706
13071 81706 60746 137516 -96270 171903 249263 116629 513197 194474 -162012 299957
13060 -106375 370425 62052 -65424 185230 43076 82522 -72777 -107536 64552 -67635 -275982
13049 -275982 83139 -227198 -277152 348937 78405 -51652 73188 258407 173917 -33132 205111
13037 93324 59891 131935 -32604 448628 25328 -59945 -164514 103154 -29043 39893 -40135
13025 256142 -113711 -51548 10351 -37233 -65096 197747 -138212 -12230 305821 247748 72758
13013 4621 151785 58846 173708 579442 110424 -36997 184455 429161 213678 217007 -123411
13001 175307 -168621 162746 -30631 -165240 -74768 -64506 27812 -69758 -62801 -13147 -118893
12990 -118893 124181 -56128 238616 90121 320763 -47561 48695 -117605 44941 44227 231290
12979 231290 -180304 -18513 331905 120076 -218666 325547 1233 209907 184561 -153387
12968 175204 13987 163676 192501 101460 66839 -129150 -91935 -60458 67894 69911 -126785
12956 6071 133585 -103321 -70873 6319 206155 -67717 160620 67369 -148031 39498 211229
12945 211229 42515 53056 -112930 -4510 150841 -73509 5036 272782 99351 -40908 -221135
12934 -221135 -121707 54830 149683 -385172 214771 94629 -90165 242090 178197 -51362 44952
12922 222459 20851 212051 380903 105369 358533 162750 -64651 33745 120562 568630
12912 568630 -3526 -17882 202261 59876 -234495 -179838 98389 136770 -112505 -9805 67608
12900 -43010 -96901 238741 -183466 41677 9885 373892 -30600 284316 202921 60180 -121008
12888 7358 19722 315631 197670 6068 159052 164794 147506 -134914 258436 181811 141795
12877 141795 -100245 -125776 198404 -148385 -117665 146167 -76262 102849 -114932 -238762
12867 -238762 111862 265220 242458 81258 66087 -148353 -97412 169753 -91560 -87473 -78252
12856 -78252 -85410 -70671 -245245 53318 17876 22413 -90632 98867 269997 11390 -113060
12844 -69671 124379 181200 -65982 4138 -226730 -65773 303206 40787 -120573 45854 327728
12833 327728 -223806 -84976 55943 -40464 196210 24651 252998 -122858 -265729 -124630
12822 126585 -108054 -107016 87654 -112778 188574 -86405 -183314 188409 -325572 -152058
12811 184019 -211912 63738 193499 70690 -10430 122812 -165336 123649 170433 48096
12800 10490 142420 -83493 25247 167189 -186252 -109876 -40523 25832 71753 -189088 211787
12788 -173678 29507 25831 33562 -142676 -31615 130008 -149335 -74208 -335869 -158125 -208161
12777 -208161 -99727 109540 -23556 -62276 264694 97863 -321809 -10122 70195 141790 -233246
12765 -65729 -42790 -73419 64471 96843 47109 36555 40847 -101421 56518 49493 -114332 -290293
12753 -290293 -85926 -287470 -306878 229192 -8870 244368 -306736 -4416 -297774 -71135 -311101
12742 -311101 67880 180309 -188169 48692 115715 176764 46948 214950 210999 574423 7594
12730 361619 -123445 107540 -189096 265962 -195563 -162649 -34810 380456 -94587 -149669
12720 -149669 -205373 160883 -170166 356066 -41101 6859 -64353 137521 375815 238880
12710 238880 463119 125211 190743 215983 29240 -34960 -121138 243442 8401 208547 -180460
12698 72305 -165654 -41547 166917 118994 -76445 108585 113260 181816 -142699 83071 173151
12687 173151 206628 134681 38525 137369 -287081 -110301 249436 196831 25697 295118 232468
12676 232468 170189 50093 129845 -30439 71115 -245399 327100 253093 293159 -308062 285953
12664 136353 -65602 111791 15631 -55771 223802 -146261 -9228 93388 10954 41578 267088
12653 267088 135381 152742 159646 -184440 432785 27133 261293 55390 224711 5922 38826
12642 38826 240672 -170021 -226478 -234459 -125856 -28496 198081 211486 141000 87842 19079
12630 241722 299259 542820 419669 -47013 221438 224810 292776 257966 12207 203533 182277
12619 182277 105025 -138352 -90767 67415 -162472 95737 199823 74624 -296641 -37112 200849
12607 165196 -47711 102177 169322 191217 207406 251513 -110248 210079 211181 79682 32587
12595 -14289 334957 -173029 142720 3355 112368 17075 116791 -43408 -66005 274052 81248
12583 147589 60849 98031 122941 187785 -446821 -29490 103044 150126 -211606 253428 92042
12571 68168 -186103 304496 167019 -6175 248165 94605 -47251 -8207 -193610 -238271 -53079
12559 -77913 -42766 204941 -15484 -72682 220320 263675 29353 -12314 -79569 124840 14375
12547 -232890 -305282 135931 -6760 -146164 -322759 -214456 105721 402464 -258543 -248300
12537 -248300 107294 153155 -118293 39771 73436 -23633 -128763 -294110 -6876 -43664 7582
12525 160786 195692 -25919 -120920 31953 -11595 -72894 -67457 -309335 -110960 1226 55928
12514 55928 -172429 387499 -104455 158769 135531 -135989 -62825 245223 132902 211329
12504 211329 46848 -97399 3463 -1949 121468 274009 -133260 -118827 246558 -55735 -136662
12493 -136662 -62758 242075 333705 255456 99779 26107 -7188 83634 74172 -94197 32599 42757
12481 42757 400147 369302 190273 97219 -211491 81364 266070 -193809 -33042 -165759
12471 -165759 -142536 212148 -321152 -223474 -42412 71102 171313 -87842 -176023 -130760 272659
12459 74746 -205027 108960 14380 158083 39769 -249008 -149691 -98802 67654 -246803 402117
12447 126740 -243451 -101846 -126423 110496 124462 -2258 -190996 66607 90915 -375841 51171
12435 206081 -260836 108892 -393508 43677 -109326 -136442 121361 -15308 -99184 -7207 74721
12423 -266983 -17244 -186941 -184610 -59263 -153313 -4011 -247526 33487 75239 263498 178925
12412 178925 104090 61523 -132156 172454 27030 -99782 -8404 290024 -133819 -9343 -45339
12401 -45339 -88590 -76404 -96799 -157425 -356532 69543 -58741 -5987 33476 46449 325002
12390 325002 150806 -104871 237497 325863 32368 -218140 -91744 253427 172817 -270084
12379 -211920 -120413 -242168 357557 167201 74318 -117021 204432 -76906 29421 185671
12369 185671 -267110 41365 -51102 102674 205754 95629 -332427 336790 349108 -250292
12358 -96774 111310 286611 49841 233460 -252904 272196 103783 45539 419741 -119044
12347 255326 -138574 58049 3804 53153 96003 -33241 79308 75812 -105903 77741 -189236
12335 60908 138909 489925 3586 222179 -15508 -19543 -21179 299784 375026 72824 -276106
12323 247931 169878 -166569 169429 274483 -235731 -159216 96850 -125111 25082 206244
12313 206244 125204 496390 5839 290155 434117 78447 68995 -10778 281346 290576 89588
12301 79850 597983 220114 -39614 -163571 127810 -6360 341362 199117 -162563 154834
12290 27148 297442 130245 143754 -28937 28467 363529 -2658 376501 -83123 404791 116451
12278 449043 79269 249060 55694 -2407 -42220 133154 -145483 293335 188161 500736
12268 500736 143347 89791 -101532 38233 163790 34862 269970 -120731 148737 117746
12258 117746 256653 -2275 146039 364855 -86452 149220 340862 -47371 271215 9583 -77672
12246 -214324 223531 372471 329780 -78262 359447 -39705 -130116 247540 91929 -10414 258568
12234 191801 66282 36306 56677 472950 -23329 373435 255222 292265 381262 127932 270801
12223 270801 -56894 307561 1333 350131 236401 456050 66343 202465 227574 306083 71966
12211 203049 128843 66506 281078 -17569 326194 144542 226673 235792 203499 261532 138951
12200 138951 109141 383369 275559 101234 125473 195343 221663 174175 455621 394960 68944
12188 412144 112222 83113 155055 261379 142987 45062 -127572 346994 -105581 378700
12177 437406 190894 418581 49753 77899 79134 371895 192388 321471 153444 196583
12167 196583 210464 212431 155342 1403 245550 327007 248432 -7937 195633 218679 21934 134394
12155 134394 110160 177790 42686 188923 188888 308200 41777 -48931 -43096 -101593 -121109 -109340
12143 -109340 35907 248047 84257 38772 -298162 196191 -209031 182442 188808 290285
12133 290285 -211823 6224 -165051 239937 155073 -14852 40992 41496 273922 253815 78169
12121 -79502 65803 85601 163629 431672 -186251 287133 -90186 -48345 -241104 448082 95192
12109 -309879 286209 117482 -97727 222565 80465 439571 265863 -291433 117334 85294
12099 85294 277940 353486 64521 -263804 69300 349780 121353 143151 20574 305685 12955
12087 -81864 -89041 126313 -147925 105377 121728 450449 397299 267960 -6798 111630 -246415
12075 141152 -20773 -116062 251117 40185 335794 -163738 -24941 -188802 -29991 154113
12064 180400 23949 106866 34764 34495 -25167 -199459 -272105 95030 -169703 176883 -85254
12052 -118186 -53989 -119141 100171 -158277 188184 -182240 100411 -217175 -193636 84161
12041 45871 148713 211141 8066 -20600 35886 26274 -55531 126271 293777 -137640 262237
12029 282198 407896 -18547 42847 126533 -223494 231082 76487 108931 114147 -14535 -116522
12018 -116522 237194 324746 369492 221506 37427 87925 -45380 -141290 -14625 55286 -101438
12006 176737 240158 49213 -30532 167584 74335 361831 368783 -60341 -35140 -383518 23412
11994 -277073 -73917 -122910 -206665 73146 -37228 -28776 -31648 -234027 204466 -94567 -98219 -107890
11982 -107890 -63500 105652 124278 -51553 91584 -171360 89384 43421 199948 -326973 -256807
11971 -256807 -40956 132241 -40702 -161285 172850 98483 115297 4460 188582 50071 -118581
11959 -194698 34415 166865 181717 -84902 148793 -16056 50312 -195990 302785 63347 116124
11948 116124 1847 240640 -35186 139299 85835 81819 117992 178056 172982 -124442 -72687
11937 -72687 -137006 57169 251005 109554 98068 164998 -173892 -140059 -437070 184634 18984
11925 -49071 164790 145313 1682 -218376 164098 -196164 103400 362218 -225024 111120
11914 -71942 -85888 74790 67158 163658 -102756 -97464 -164527 95199 -16606 81063 235948 132006
11902 132006 65638 -100035 -58149 69311 -61865 104518 361756 -198928 -154784 -85621 27237
11890 382267 382251 8091 -266368 24910 54491 -200924 -5189 -8092 -53797 207231 159743 -100419
11877 -485839 -101551 125658 -26557 -87284 -13084 135355 -252056 -132835 -89902 -294301
11867 -294301 144665 -108132 -141761 -10474 39387 -131192 -277200 -257299 202481 78733
11856 351903 -52091 -284858 -40744 -295054 -352718 -250875 -199246 95515 -379481 -278370
11846 -278370 7353 -84994 7143 188633 -48400 58082 -97605 276722 -195419 35800 39810
11835 39810 -39894 248729 -137451 -135769 -178994 23115 -55080 109259 -117716 249939 -123321
11823 64866 -69155 -382747 -374855 151545 -136234 73115 282084 184944 -198859 -291552 144579
11811 262894 -64889 -205115 -298916 -172399 -59790 -45242 230186 219325 200384 89007 -176171
11799 137013 -10111 91817 -27844 -200345 80600 89099 217482 -268047 85372 146080 -51320
11787 -104938 -303112 -224847 138195 67473 42278 97237 -80426 -21644 -29382 -380555 -135291
11775 -57585 -41857 156971 -132296 41485 78822 -89228 -122072 -108305 -41107 25377 -229255
11763 25049 214381 201938 -296481 248469 13428 -18477 -374640 417785 -60494 51867 67707
11752 67707 7499 18718 242556 104899 -57193 -43082 31483 78023 -107122 -44057 -195015
11741 -195015 93969 171510 129214 -71532 26277 32774 -110337 171426 -9873 -275441 -237613
11730 -237613 459399 348335 183787 -146631 325487 26525 -213152 -69938 116098 54276
11719 -104167 -132780 28320 -26507 -47886 13152 74319 -101421 380444 -579360 1650 118510
11708 118510 155596 -111932 -107040 229454 137705 139963 -26204 -240636 380189 -155273 56223
11696 5644 -30234 182723 77984 20954 -693 -6556 -141592 55301 26284 119905 -41344 -36742
11684 -36742 -129673 -147973 278248 175740 311857 176474 314818 243444 -1866 190179 -166227
11672 476887 110765 -102031 188977 170215 -17260 154351 139612 -160490 -116099 -244533
11662 -244533 125811 -159620 -55702 190907 126351 -294618 -91123 119950 114044 -7473 -92892
11651 -92892 -281264 145923 -96991 140144 125295 -382533 287783 270292 42444 -133480
11640 -28729 405200 -174627 76934 -109 -146024 -254291 -254954 145971 144688 -28045 5317 -194730
11627 76791 2660 -57156 315190 146736 34429 -89137 -200203 -225577 225084 -119369 125830
11615 -42200 -268359 -348877 72274 -235763 -130934 264901 139665 -13428 137591 13592
11604 75733 -112491 220665 -78015 -57753 72047 -90257 2409 160238 -229022 53778 250788
11593 250788 -108645 479827 479031 73577 394298 333698 -144910 55564 -196512 122055 100217
11582 100217 132961 -244293 -55695 -71845 215766 362405 166646 280135 244222 327495
11572 327495 -232511 66359 29013 -88631 181773 238833 57492 146405 80695 177333 -154211
11560 128432 87652 215643 -44915 139657 132819 106371 -75420 156347 80412 349030 343581
11549 343581 292415 86203 -33338 23047 -285921 6315 -13597 140768 -170502 309448 109428
11537 303439 120076 181098 -93915 378567 -118247 -210797 141197 264977 16691 411241
11527 411241 -32309 198770 254177 337507 -165651 59159 48370 138487 85818 63193 -60208
11515 -175036 99943 -11290 183271 171450 -216600 -41807 128858 36154 -97560 187418 311161
11504 311161 72484 -75907 279736 99684 99786 137640 296059 44225 -11732 241144 65251
11492 230677 -92874 -233160 277502 283341 95037 1335 88075 183352 214671 111419 -119060
11480 379145 41627 106457 164145 396087 162514 18253 343488 97689 -85012 598677 160954
11468 87752 160765 282545 288527 -27424 261159 384408 461995 135468 64931 101452 311428
11457 311428 149013 160255 -238653 197190 -332068 103782 -83315 234691 51399 169647
11447 169647 61490 -150050 58772 -195980 -87081 -165556 -131101 -88922 -306586 279404 66006
11435 334838 59257 282199 153138 -43509 376995 62854 -10580 277802 -50301 -189450
11425 -189450 -75190 -63292 -123525 181264 175558 83573 -55347 -40180 -15591 -31891 19087
11413 -182296 -25040 -123106 -109 5412 -343314 53920 -23856 176087 113464 -52200 -162029
11402 -162029 -251478 149603 -65437 -149138 214082 -22173 571831 8665 440515 291751 -11283
11390 212557 298752 66725 -3906 263921 208746 -214242 213892 26091 -5332 -97799 -129256
11379 -129256 44168 24346 -117726 104697 67839 124441 199414 53330 28914 -195382 120928
11367 -27295 -114421 -40439 -164239 2011 -138064 323502 79700 -172466 225246 -284825 147088
11355 -82118 122843 27969 3864 -22930 26909 -131281 20358 29030 18703 31697 110144 211573
11343 211573 -113603 175401 75509 -307299 254625 249104 107745 205902 -179947 114148
11332 216919 63525 -481823 59986 222578 -331196 273274 132222 -128663 218106 -206591
11321 -336468 -99769 -102462 59701 -193574 127625 -181636 -239722 -118389 258629 -250468
11310 -43798 -55548 267300 -8059 47617 -307125 -103748 -82468 -175074 113164 139881 -189892
11298 20031 -2012 -135747 -213304 -297112 -128521 146080 -92850 -230794 -269390 399023 -120156
11286 -51468 -78732 174278 -370021 -165369 224879 -262541 271485 21858 -73218 -51049
11276 -51049 -4228 -127828 -340733 4623 -390194 -470606 75983 101358 27642 64624 92224
11265 92224 147951 39549 -222680 -45419 -4752 -186138 -14277 -296019 -39682 -138260 -101770
11254 -101770 191464 -379765 -89503 -161054 -127561 -10069 5078 48564 -30232 -106728 -85192
11243 -85192 -240911 -22312 36224 -141534 -109170 158857 -56175 194378 301832 -39207 -359868
11232 -359868 -32505 -204376 216466 -200923 138433 -148105 14805 -218357 -37839 -39447
11222 -39447 -62391 131454 -197796 -428813 -134963 -1793 102546 -76442 -34883 -151529 146185
11210 -130932 -255885 -71787 -4606 40273 -49766 112446 22300 -168402 14889 -87389 311933
11198 -50637 371628 -51417 -242962 -17146 125266 397946 -127289 -99610 -119922 16599 109894
11187 109894 -96306 -259152 -90432 -176762 -315999 -143375 -329625 1437 -156356 8355 -21782
11175 -308942 401178 92611 -37496 -46025 114574 -54786 76556 -190109 -241184 -141922 247461
11163 -241372 -97109 101217 -281593 -72985 -137432 -52011 -22131 -95119 856 142511 -76815
11151 -148549 114650 -119620 -116901 -130206 -103329 167219 14388 -237207 116711 89590 -306930
11139 -103763 -205053 -421400 -111748 -61250 199420 -47022 -314577 -43408 -35993 -166375
11129 -166375 -274210 56294 168051 -153696 414440 237357 -97404 221436 199140 -220685
11118 -64499 304337 -33561 113126 -32386 107999 42082 -89024 265562 28704 194854 -89562
11106 503793 -189388 -106676 -1297 153990 274949 469642 272935 201076 -41403 386481
11095 165802 137056 -20645 414631 95403 244440 280690 116061 14683 366915 75497 613736
11084 613736 233081 97160 227690 377290 367185 472806 119667 321655 304826 307428
11074 307428 -128410 320746 641921 191980 273787 192727 258455 390867 338585 417126
11064 417126 433595 383208 669618 491345 189624 753274 457324 838682 879338 350130
11053 901253 1085432 505156 867762 757116 1173058 1090993 1055328 1020225 970062 1155235
11043 1155235 813440 1113534 1145714 1267126 960614 1041394 957164 912234 1156522 999180
11033 999180 950068 1211791 640139 1146974 614074 814272 1138230 943491 582833 906103
11023 906103 747335 885413 838017 1050300 1013919 693020 842070 1065615 818134 927648
11013 927648 888977 463423 857241 490610 723583 788832 864792 781395 642708 739292
11003 739292 538734 787186 991756 1151397 720892 616043 755230 952521 735060 632255
10993 632255 920046 950052 1107528 961865 661939 976581 1056840 720771 954848 1364537
10983 1364537 973065 1197570 1363253 1043906 1361749 1205014 1504173 1627887 1701216 2098661
10973 2098661 2016043 2705993 3070978 2908831 3176617 3364598 3673584 3738599 3630520 3429901
10963 3429901 3569398 2974726 2680980 2208413 1988817 2136347 1877478 1334258 1815066
10954 1815066 1664925 2040745 2033755 1473424 1259510 1350472 1329942 1041815 882443 482140
10944 482140 456309 335505 214610 258762 595429 92030 -8778 154781 -171020 452772
10933 351089 99711 -74995 -223127 220980 96452 70286 -116022 -240541 22056 -28033 315837
10921 78985 -177881 88305 76268 -136067 62904 129262 128304 -92167 -196040 -57619 235378
10909 -147054 -203561 -144630 -115601 -344203 765 -280017 5886 -237054 162731 -178545 -185741
10898 -185741 65641 130057 115361 -253828 -164278 -36575 61423 9742 197916 9131 160127
10887 160127 -328034 -205962 -119497 -240460 17259 -68861 76443 -68383 -109840 -81272 -260901
10876 -260901 -214664 -124553 202410 -88543 -169916 67078 9217 -265891 -221534 -163993 -20878
10864 119843 -23214 90470 17314 101430 -301947 -27231 -62167 137710 -66292 -18791 164836
10852 -41737 97305 -241830 308627 -102355 191678 -14196 28134 -17699 -314117 -316223 33461
10840 35594 -13017 222581 267644 -367405 249256 -105801 -126103 -228565 -182412 -6978 103876
10828 103520 -72423 -209175 -67767 -333969 32946 -176024 -41160 -19137 -58654 388891 132031
10816 70435 -641017 -264558 247330 -396281 -310456 82106 126373 53385 -405251 -193792
10805 20076 -169941 -214906 157334 -277708 -148244 154834 -156880 42 -219543 -122750 164119
10793 139599 -212481 -15671 -174038 -160677 24535 31081 142795 -8062 84461 -63694 -26924
10781 -385 -4166 8210 -242846 -167172 -161921 14157 203483 -120356 -96025 -170436 184839 -34457
10768 -233096 104853 150003 -67950 54971 85069 85504 -133184 -571976 -281530 2271 -77447
10756 114203 -24356 -302742 -17 -57610 -498300 -246761 -72199 16448 137190 -130360 293488
10744 -26804 -196703 -91438 -185881 113824 -13918 -320747 -256454 -151143 -135364 -41145 194719
10732 -39232 -89218 -39668 -33647 -309287 194153 -214459 -22215 -153588 131927 -18751 -247361
10721 -247361 -27639 -146830 333901 -232866 198096 -30056 367265 11309 -61475 -54003 -10386
10709 74158 -124384 -63412 -158418 9291 -168792 199402 37482 -222033 102981 106846 388453
10698 388453 -106713 -153795 -27966 156046 89007 141389 55800 -368075 -11601 -11546 185439
10686 -65179 -60436 -113047 87979 4652 174058 49743 -168321 195151 10365 98277 -182277
10674 -245803 125692 341859 -92484 228391 -148628 75140 -148269 110800 163474 135980
10664 135980 99326 123077 -174159 104925 -549374 -140526 -331343 -213861 -134308 71685
10653 -65006 51718 111849 110995 -13917 -214634 -357506 -208068 -160259 -27986 -114540 -316795
10642 -316795 -263449 -131087 -148541 -385871 -471948 -131922 139386 -197085 10107 117537
10632 117537 -338871 -197893 122121 -128671 -332646 23852 11601 5473 -6960 67526 -479218
10620 -50697 -198914 48794 -255324 -24309 221503 -144276 66892 115225 -35426 -192425 -393330
10609 -393330 -388993 -224594 -3787 221901 -254529 17491 5021 -211642 -138777 -232250 236188
10597 173684 3003 -186943 -37937 173816 -126325 -163231 96464 -163598 -151807 -465 75684
10585 17910 -98461 -289229 10565 82586 -98327 -144525 75833 -562816 -262792 175357 -68031
10573 85586 -143744 -74286 -148591 -43522 -199227 -173183 -176574 -91417 141073 -259134 63963
10561 31289 161664 -38931 -83229 -43480 -38097 170583 100207 59318 70438 -181312 272769
10549 78140 212977 -5000 43788 -160137 -35317 -52729 -100569 -129594 232967 155058 -284653
10537 -8835 63042 55232 -129513 67554 -233133 -139964 -327822 257984 -316357 401588 47528
10525 -110991 -55296 39736 95749 155314 -306015 176541 -22723 144396 -97580 241152 -276079
10513 -68583 -247467 -199230 132683 233877 -9257 248356 -129581 -100860 -31624 192081 158525
10502 158525 -169675 13692 -241418 -131592 -289403 145392 -56144 -47324 197306 173222
10492 173222 -144005 64470 -89206 -143918 -77185 198807 -171728 -69798 196741 -6770 81186
10480 68753 23725 311743 265487 282433 605381 220926 449510 501153 249605 145203
10470 145203 234687 373370 -88399 319464 -86897 76869 -118935 110014 -299672 -135750
10459 -109402 -6872 -286012 20084 218304 222327 462980 -18113 -291214 -101170 -252352 -115788
10447 93994 -62247 -36207 -236843 192023 -112956 -39051 439728 -272217 -239141 200327
10436 -324135 4228 -232295 -41369 -90691 130605 -255498 -14517 -35374 -84324 -184781 -222083
10425 -222083 78925 -89283 -128343 -182866 -306617 -349191 -192969 204139 54658 -108654 -21394
10413 -104717 -134490 -240230 -186157 220508 214078 -102133 171063 125804 211435 6994 -99590
10401 -416160 111723 213096 -100122 241443 -275116 22572 -54271 -83680 -163410 322681
10390 54089 154063 293142 -120371 388529 288071 241784 541209 -139662 127729 -348326
10379 221738 -38583 452889 286072 253480 553877 541516 431282 -95662 537306 342928
10369 342928 264812 363369 544184 480582 441772 424706 590583 940555 235795 653319
10359 653319 174571 704814 241224 265540 313795 248170 390513 102313 425566 506849
10349 506849 536841 682516 919369 640152 566117 601336 468528 39816 515663 300323
10339 300323 501687 213487 274824 113643 396557 186147 -24562 309852 417966 167501
10328 439984 41921 168991 334926 102272 119865 512562 417454 115599 282441 343544
10318 343544 275107 186491 209099 296313 166779 257541 28890 386384 15158 -237762 10746
10306 -21756 -143514 -169986 77187 -256178 -6287 156196 74240 -41631 -421588 -373487 -39006
10294 -206670 -57920 8133 -178130 -8429 163629 -195567 -45300 -116026 -103974 48594 272779
10283 272779 -13100 149051 97888 35216 -143276 -25621 -80183 -21874 4402 -228337 156584
10271 66111 -115294 40882 -293685 -255907 -147132 -16761 -222272 -40584 -65388 -16368 125902
10259 203609 -106952 116651 238893 -26830 227949 284902 314982 602939 256642 -23392
10248 197834 263008 136297 25030 -120522 -327551 -347608 -125994 78866 -111630 62612
10237 -131387 -197025 217009 -23913 -626361 -221778 -74517 -212851 -258092 73179 -19607 -42926
10226 -42926 -269817 79632 -244797 -201659 1383 -41927 58259 109750 -162808 -281083 45078
10214 87962 -147956 -80279 -24619 282797 18920 -93865 177702 -257089 -36192 -131297 302352
10202 -84960 -325904 -41529 -134147 -143710 -423985 -60676 -153294 -206522 -183883 129699 181603
10191 181603 -114544 -114490 -255732 26117 -229112 359418 -161627 -112336 -119033 -188472 58468
10179 -187830 231848 -48964 236964 17173 326 56882 -189530 -170767 -333820 151299 15987
10167 20232 95341 -109885 -175652 347372 -516805 -187263 -114822 3753 -189116 -106466 -252383
10156 -252383 -24501 66255 -40227 -499801 229318 -346937 -48215 135344 214274 -110212
10145 -193689 -63841 15678 -33352 -80058 -395902 278314 -82116 -394254 -103659 -43143 -22756
10134 -22756 -280331 -95978 167025 -88789 -116758 -206398 -394930 115326 -330252 8135 -171452
10122 49068 -152081 -136450 -112653 -284444 -231220 -286474 -136456 263604 -149387 -133400 240870
10110 -871 -220172 -189572 165592 17393 -246185 44885 -244516 14895 -240837 -408901 -204073
10098 -14261 223504 26138 -195259 -266793 -159871 -198140 -35780 100614 -133384 -95494 -306623
10087 -306623 -55637 -127881 88751 223364 -137441 -23314 -352694 182018 -206264 -124263
10077 -124263 -56261 -84757 152816 -277565 73837 17310 160305 149898 48079 -31863 173051
10065 141363 -120956 -110512 -71133 -299462 -44439 -111745 65321 96205 120115 -158335 -81250
10054 -81250 -482607 -275911 -200912 -179024 77017 -175296 -200095 -166825 -163478 -10766 -38627
10043 -38627 -129141 -13754 -168847 82775 150686 -98571 -12407 -283725 -48588 -94305 -50236
10032 -50236 -151273 235794 -31206 76820 90222 -82908 -25106 21046 85524 -365829 169708
10020 -64176 41958 -47353 -54157 -33338 72803 107545 106007 199689 -24426 -330168 219877 -24607
10007 -162016 -249189 -353807 -146560 -15911 -285690 -180256 51682 -65666 -197357 -245342
9997 -245342 43558 -6576 1472 24637 -114348 -36145 -110029 150661 -25510 -200954 -150332
9986 -150332 -269359 22541 132672 161017 -172711 132070 31845 55925 -173699 -207430 -271637
9975 -271637 -180668 -111526 -188091 76275 -225916 -340293 -410549 -382218 210023 539249 -30664
9963 -103124 -53610 62097 -143931 -207182 261199 -22324 -200954 -37416 46719 152957 71243
9951 -250224 142455 54202 -329652 -298350 103624 -99498 -107884 -97575 -72287 -42726 -84967
9940 -84967 38095 9724 -176747 -197334 -56291 -47619 270643 62623 125329 -170506 31164 -116763
9927 -176508 -162772 787 90113 -69345 -195864 24789 321580 108531 216051 -81635 -164131
9916 -164131 178227 -124100 -332122 40424 -367404 -199958 -58787 -357839 -393739 266094
9905 -154071 235036 84400 -219072 150229 36975 63764 -23364 -80730 -116785 -121091 -400997
9894 -400997 -78863 -403816 -117311 -222521 -76814 -617 -193429 -427221 297003 -151624 -264268
9883 -264268 297318 63841 -112564 -624275 -360342 79159 -128512 24050 -106122 3439 -82535
9871 -182904 262224 -101008 -152050 51482 -152884 26833 43164 -305471 178898 61622 -244138
9859 -158747 -102461 64449 -48536 4684 191522 185043 -156340 -53860 -72987 -165454 -327483
9848 -327483 -142411 10393 -208134 -34844 -347934 152807 -125604 -223225 -116132 -367877
9838 -367877 68005 127438 162650 56150 68322 -71037 -119066 -154700 -141026 -286872 -180712
9827 -180712 -115353 127393 4912 -358736 -104792 181330 -109976 -121391 -148796 50440 -142814
9815 -107358 -61360 23118 173907 56692 -182704 -152415 -251818 -274999 -5621 -272729 -268348
9804 -268348 98067 -29706 -79877 -8884 -48168 111852 77152 -120730 -366335 -262149 42054
9792 26689 7806 103963 -64005 15931 60026 28695 -73564 -257336 -353083 -310255 -206331 -144048
9780 -144048 -47145 -23778 136642 -259030 -242197 -20636 2196 -370297 -168823 11138 -42273
9768 -66413 -211600 -77937 -185468 195798 78949 65453 -283331 -216876 -279799 -252456 -90912
9756 182235 -451039 -13191 24640 75502 -16965 19194 -110787 304536 -61000 -120050 52621
9744 -56022 -276567 -402571 17446 -409246 95253 19233 -91603 47133 103756 123842 116794
9733 116794 -302098 169148 18002 -66737 -221646 70555 -341971 -2595 -313778 -389597 261424
9721 45264 -63612 -597839 144864 -213141 -72022 -159413 440574 -181551 -173716 84572 -141268
9709 -418822 -182312 -12930 41572 -67898 -224424 -349880 -231356 -115077 -34552 -228315
9699 -228315 8693 151567 -289432 -317362 119244 -207555 71477 -173615 28212 -189659 -246664
9688 -246664 -34441 154450 -97276 -5460 20941 -381710 95097 -248745 -201763 -216399 -41051
9676 -240098 -153432 -41795 -41235 94980 -250632 321462 -355496 226345 -247590 -236948 104903
9664 -96004 160464 29359 -14051 96609 43602 -198417 -630 137832 -218519 -192146 114109
9652 -95720 -12794 -158502 92743 -281492 -70156 -173341 93051 -73170 -145186 -213213 -213056 -323922
9640 -323922 -311936 -74752 62656 25133 -210744 55439 51389 -125749 -39242 -198697 91018
9628 -255664 322869 -331356 -232500 172935 -76404 158298 -211992 -147088 -135949 28932 -248796
9616 3362 -155954 183387 -260747 -17942 44205 -353695 221840 -297201 -33471 -44873 43272
9604 -79343 70054 144952 -58621 111330 28169 87443 5438 -149661 30665 -37773 203509
9592 -16545 120158 -79967 -211106 -275997 -152490 -44402 -94336 -127710 -27923 -117214 -5937
9580 101424 -130230 -165155 -130675 -13565 -377365 111058 -232663 279294 -208369 -169629
9570 -169629 -146097 149472 159928 348158 -131699 -85201 -64384 63085 -5937 -103393 -12421
9558 54186 -120207 90513 -215673 224117 -257187 -357245 9075 -142230 -137462 23815 -268790
9546 -137081 123092 -306356 -65828 -59028 112795 144817 224138 166855 71660 -213078 53308
9534 70225 -172991 -167298 -51792 -64479 -9552 38907 -104821 -118241 -83698 -302254 296253
9522 -167405 -221210 -199246 -176509 375034 -163932 263698 -24493 104165 15296 -156384 21268
9510 278747 -246715 -7940 74616 -118640 -60595 -97856 -85629 221344 -228051 -104827 -160603
9499 -160603 -30896 25678 158453 172760 -103463 -12491 -117805 105420 -16072 -50568 -77206
9488 -77206 -2916 -336264 -60575 -49966 -87822 -204616 -287524 -37242 26923 -192556 -4263 -72596
9476 -72596 10249 -19951 -291580 -346965 2618 -184726 -4448 -223843 -304104 -160404 44756
9464 -74539 -259761 -432261 -263470 -249448 118485 -171803 49351 59861 83647 -5384 -214756
9453 -214756 184735 168476 151426 -403106 -26577 779 -337824 14650 -8415 -104388 -259419
9442 -259419 8498 -121212 21225 -193130 -194152 -104764 -91321 -134983 -85335 -200979 115639
9430 76966 -145792 -66341 27669 -186016 -27296 166247 77144 78562 -112200 -138688 -76191
9419 -76191 -233799 126632 -196483 -148547 -58970 3763 30547 226065 -233362 -336646 -243697
9408 -243697 -116961 -218643 -155998 -129944 421185 -443662 -333494 -15731 -146722 138187
9397 182654 -174151 -224994 279954 70377 -184857 -33025 151168 202509 -282178 -352630 74770
9385 184610 -24101 195508 279733 116291 22785 -402897 -199042 165176 -104146 26814
9374 -37291 -221675 -205685 66495 78744 -26207 -1260 -439316 33893 388566 -23685 -91344
9363 -91344 40083 307473 -132380 -288903 -210557 -109088 -199191 -192940 65780 228 147861
9352 147861 320420 44769 28793 -123544 -64448 -382294 224398 -206808 181658 -58071
9341 74231 75485 27364 71165 35381 -202121 16055 -338282 283451 16828 -71476 -168613
9330 -168613 42739 -81599 -196176 -43475 69226 10619 -11737 -212967 -4082 466 74654 -12487
9317 175808 211113 -279166 133041 -144931 35191 -99463 -81161 -298425 -30186 -276176 114457
9305 14291 -274366 -215550 -97372 61134 239509 -391622 216533 -216500 -28572 -195483 -70258
9293 111956 -406830 151620 -54545 -173196 -122876 -318538 -135348 -80154 134278 -137123
9282 -27186 2245 93599 -250663 -156270 175575 89225 -249309 161575 171453 -306283 121638
9270 65806 113145 -64878 -190851 -119977 -336026 -106220 -5708 -72363 -216523 -90929 -182985
9259 -182985 16956 -401447 -316535 -436186 -286586 -283907 -536609 -223666 -149353 117229 -194720
9247 -211041 -218483 283546 -67858 138994 -28554 55021 25316 -132169 -372782 22277 -277973
9235 219307 -68892 141207 39316 234836 -141709 -267242 -182281 -174748 94865 15404 47793
9224 47793 -293642 159720 -25998 -64804 -229198 5899 8644 -59048 -317645 -27914 -323735
9213 -323735 30973 93631 -8352 153218 -193345 -20098 -111517 -136002 83528 -25062 -219803
9202 -219803 -340656 9975 198764 -256807 -162888 -113331 30097 -258276 72696 329343 6486
9190 15358 82574 92312 -267019 251057 -81994 28797 102619 149903 146370 -170839 -102537 -142254
9178 -142254 59700 -44087 25636 -25099 378257 216526 -49438 46140 76264 -126276 -51249
9166 -62388 -253865 28574 -90603 -141174 112391 180691 -330849 191714 -252568 143444 -274547
9154 -212570 -299843 -143965 -91057 -215501 37671 114398 -249843 -27630 42000 -85845 -64130
9143 -64130 97577 -119320 -537850 -125767 -95924 46969 -321584 -58497 -141581 1401 -105744
9131 -180113 -245642 -125285 -277531 -380829 -178583 -40058 -173561 -37855 -303304 -239564
9121 -239564 -415042 -27545 -72863 -75114 -294946 -94110 61108 -393678 -79148 69286 66553
9110 66553 -62898 15738 -68349 198860 -73673 -319597 25810 -36939 98425 -208490 118383
9098 -81166 528641 -69122 -190138 -100505 156815 176294 -39903 3476 -151201 159581 257171
9087 257171 -14066 -236704 91040 43425 -216720 258638 -104277 33982 -478629 -187326
9076 -147569 -33240 -80343 397452 -263328 -187349 -320277 -60261 11238 63004 -209864 -329909
9065 -329909 321645 -53526 33 67784 -51480 224876 -288857 -281220 -184554 -72769 -79882 -487087
9053 -487087 153432 -67414 192595 60251 -133940 -54297 42305 -288339 71022 -164634 217344
9041 -50666 -173479 -178727 -198811 -222179 97881 -42779 64536 -141016 -149758 -94269 -191089 65721
9028 301198 -299081 252445 221228 -7592 110181 -285182 150745 -301516 -155319 85918
9017 11871 -449260 -185929 102301 -119969 -39958 -20279 80254 28487 150913 -257794 39984
9005 -407620 -238069 108422 -347096 21552 78677 138095 -312027 -151936 238659 -226566
8994 64018 -109582 -448337 -442050 -134098 -88332 85467 140107 -123758 201556 -143317 -83277
8983 -83277 -59389 132212 34615 -53118 20644 -34705 -153257 -363136 -33740 -9677 -282640
8972 -282640 294147 -94374 15371 -368727 70325 -345253 -10743 154903 203353 100844 -228695
8960 -122949 -144674 -98303 27314 -230042 31378 31621 -47819 -198646 27153 307758 179846
8949 179846 -201910 -220364 17456 47955 -56933 108186 -196042 26860 78862 85379 -44858
8937 -56260 -179543 -230116 -92243 305789 181486 213045 115008 340337 -240216 -68917 30439
8925 341851 -7363 394992 230087 1164881 2741461 7293613 10962788 3541550 1132175
8915 560997 419046 -29030 -131695 -102920 -100134 55558 11890 111446 134073 136399 128180 -206527
8902 -31449 -155534 14514 139864 183448 -433084 7189 50520 -248380 -100434 -34172 105430
8890 -233615 -233422 -201087 -55821 -194067 -317275 -138328 -694687 -213524 41171 134696 -203553
8878 170624 -171745 17769 -258581 121479 -155101 -253521 -2648 -188990 80269 177352 -2633
8866 76804 256061 -53725 -243494 -7434 103123 -37273 -56154 -36546 -133609 178187 235133
8855 235133 -51368 56905 36952 107710 231824 -61727 -168150 -163075 154957 -39505 82132
8843 44825 -90070 -121327 131029 -28166 -298884 -219939 -8223 135704 43349 -131278 82071
8831 -315101 115069 -333821 -150623 50284 272667 -169107 78140 -90672 104672 -238075
8820 -88941 60759 80988 15035 179949 -75027 100550 25904 -168103 17985 -91344 -35850
8808 235497 216770 204904 -129201 218354 37157 -63990 104214 168117 247046 -327353 -124631
8796 64331 -273336 -102579 58789 156076 -165487 108389 133323 -67590 -113644 154388 -14769
8784 -57974 114252 418729 -346581 -187205 -188901 -52752 -393542 -480739 156077 -51070 -60614
8773 -60614 -24312 -406413 111779 89255 269696 242634 66434 -88665 -239494 137047 -401449
8761 33689 -1728 153636 -91695 -66550 -183792 -38060 -310154 -179463 30535 3931 -403701
8749 62450 -79756 99447 -19115 73297 -60384 -9087 -190023 50335 281546 -258534 -130783
8738 -130783 158926 -13010 -157826 91382 -372169 -310456 -182568 111819 -300795 121771
8727 -432542 -45514 288670 272548 -360660 -202688 -40619 138486 45292 79395 -14165 -308909
8716 -308909 227890 -99212 229401 -384379 37520 159524 -135434 135227 -90895 -113266
8706 -113266 -64442 -82507 -184545 -189430 -44603 103135 -230014 -22506 -79878 259367 134508
8695 134508 -353959 -242902 -153189 -301186 -70420 27517 36270 -6618 -32829 25276 -109147
8683 189229 -40504 -229071 151031 -151676 -27927 -147707 -118223 -237862 119059 -126409
8672 223536 -242134 -53436 -70204 41621 -354329 -167308 97013 11483 56002 235178 -553125
8660 -61355 -112314 -81701 -19548 214443 -227398 -78365 -70432 317146 -114975 19464 65817
8649 65817 -26576 -201859 -36749 193765 16875 -332494 -49744 -113109 -316772 -327940 -40973
8637 -114023 -22369 171344 90568 -24440 -80655 -44150 28200 -136777 -113872 13452 215673
8626 215673 150809 50107 236960 -21356 -330377 -192949 111117 -373682 -34572 227295
8615 608967 44249 249085 -102034 -135957 -187453 -144821 -382670 -20431 -347717 17266 106723
8604 106723 179978 212003 -192852 77177 -141036 74323 -128020 -251333 446870 -244933
8593 144434 -520 21391 50129 -74218 -49209 -264685 -417709 30302 3905 -36823 -298771 64981
8580 -486 68087 -263103 110772 -97525 9923 91486 -254521 -350606 112626 -129920 11857
8568 -224449 -55584 117111 88789 -205323 103923 -77152 -258292 55379 68746 -133386 -45324
8556 -76004 -95955 -115742 -86814 -173490 145457 -324314 -124170 -109224 69907 -324874 -91954
8544 129020 -87908 -43025 98430 181935 175422 31460 227357 -215939 240265 -30927 41130
8532 200037 105187 274798 -149876 -311850 -245640 8673 -46133 91250 -208599 113044 -20979
8520 230466 22456 -30352 -102682 -71566 99190 -98199 -112714 -257824 195205 -12714 131301
8508 91349 -297877 -116215 -169240 137834 392610 209756 -38885 -96863 -61251 -57154 -358106
8497 -358106 -46665 -206148 -72017 -171462 -186105 186933 -62626 -185763 -36227 -253474 -178772
8486 -178772 -129975 121573 155653 -128461 70497 -99069 106515 -56129 -187378 192383 -126097
8474 -80254 -226767 -245159 -186086 -187251 7979 -70951 -70266 53866 -246977 -62620 121429 -4568
8461 329608 63350 -397862 29944 -130269 -219617 -197584 8003 -218153 56405 122936 -70671
8449 5456 121486 -82004 8675 -170537 198940 -134358 171086 -176149 -75596 87717 -4295
8437 -123281 -2904 -48266 -121951 37234 -271337 256010 38872 323436 49855 5160 127246
8426 127246 58719 -363280 218649 -41550 -48203 125856 38294 37553 -168678 -44806 393212
8414 -275632 -32562 95390 -39139 -91095 -88131 -98771 142308 -176587 51975 12047 -35877
8402 -161786 -46256 -37396 -51397 -173408 -275374 -32092 185140 126405 -185774 -16644 -35642
8391 -35642 329613 217265 17424 -65277 -146466 -296169 -61422 -186995 -40091 110023 20031
8379 -64476 -196120 -125545 -160471 -87237 1776 -276768 10456 -171666 43930 168521 -33324
8367 51463 -55869 262498 -246842 -244089 -105933 -165742 108141 67090 124698 -349544 -214613
8356 -214613 196230 86297 -133010 -85594 -1556 -286748 -314711 -48546 244613 -31813 171451
8344 -185941 170454 -59303 -381760 -227544 -157795 -82168 -44905 -136884 -121171 -157223 -144014
8333 -144014 -66218 -56974 -24220 31191 -186571 -125525 -168355 -117813 -16188 -71791 -195756
8322 -195756 -279708 -237141 42000 -25375 -28737 -220683 36112 -30989 117431 -52602 -5729 -162776
8310 -162776 -65243 -202185 14524 227936 -172266 104589 -95305 197944 -21280 -174851
8300 -174851 -77816 -187221 28662 199287 -277559 -80584 -53526 -228411 -18211 -9166 -267766
8289 -267766 90105 -129101 -47510 231729 15673 192712 9029 -228526 78310 20832 56740
8278 56740 -416350 3209 198526 -134416 178160 153434 -17248 -9104 -96890 -155532 -228052
8267 -228052 -111400 44500 -104263 117025 -87831 -9555 -39683 96264 -407648 74012 -11670
8255 -52622 4056 -147576 75797 -123058 -140035 -69635 220598 -89451 40594 194555 159934
8244 159934 -14652 206939 -396119 -361307 39468 -300326 -471028 -193574 93152 30360 -9603
8232 -26809 486157 -336187 157322 -470614 -19557 -140882 -28436 291500 177125 -134082
8221 99092 -161348 68622 258743 -18419 -275078 -333446 -633 -285022 167640 147170 8543
8209 81048 252237 33228 -42371 236855 62242 -111994 124146 641 37946 -31063 103403
8197 -83216 138437 -74178 110454 -24141 -264860 -77236 -95603 59718 -60119 -202792 -382840
8186 -382840 91356 -52248 -132022 -76322 -251973 -87065 -207194 -301025 -143504 7598 -280135
8174 -48379 156032 235328 136 -95444 -130987 26231 -367888 -127999 -29234 74202 231568
8163 231568 -156091 -454990 -162502 -290429 -6532 9333 -81758 26668 105741 73600 -177172
8151 -337802 -133247 -106788 47905 150505 10264 200538 -41211 -232860 6019 -417883 -103854
8139 114664 -121209 -303083 -390226 130476 -80530 154680 -34915 -238757 22820 104382 22681
8127 -104400 -323102 -126367 -225400 46605 -33901 200697 195910 -106284 -178920 -147419 90730
8115 -138450 1138 -466952 -147129 192720 11122 -59329 -71911 -128913 -190507 -127497 -50117
8103 -23493 -133123 104753 124471 -96381 130887 241787 -188725 112110 422325 49036
8092 -336926 -56077 167176 73356 -61608 231719 -121836 4984 -21486 -78907 -240296 -113155
8080 20993 -470007 23303 -18714 -245819 -248829 -81167 -305701 50467 -259913 164301 -173864
8068 -270895 149676 145507 69037 96184 -124515 135792 -42145 228017 -200115 3193 230507
8057 230507 -134302 36358 -187064 -36332 -230740 173919 -22187 46164 46560 -164208 -102487
8046 -102487 -68434 45791 -377737 158853 -90745 21248 83351 214079 -309970 -19207 -128849
8035 -128849 2523 35280 -170934 -181654 226361 -129569 -372703 -158687 -45449 112667 -218475
8023 -166645 -104319 -272656 -441349 -359584 -29941 95762 -185317 -23657 176619 -268949 -327020
8012 -327020 -15893 52011 -53607 -173427 -89148 -87500 37354 -37233 139236 -398781 -13458
8000 -60779 -16071 157081 64742 197951 103412 371928 11284 -294577 -244085 135591 -40301
7988 -313912 -154245 -70028 -90493 -86181 46397 110760 45547 -175070 17745 -450165 -61654
7976 -303236 421291 -120276 -12429 5251 -50416 -32650 -126948 215374 -50694 169695 213522
7965 213522 90430 76280 -59098 2798 201612 -137687 20707 -397919 64371 -26437 -67896
7954 -67896 -40723 -139830 -401065 31971 166609 106258 -57473 -27758 -138734 -114566 -156979
7943 -156979 142029 -284867 -188549 -369925 258768 21459 17981 110854 -54289 -283702 -10000
7931 81603 -128397 -129190 -69410 -286685 -39074 -27505 -73917 215250 -153154 197247 -32322
7919 -31842 -211366 -198715 -174916 108168 -422302 5097 -289619 -140890 -362860 -28762 -298292
7908 -298292 -66896 197798 -141260 74926 -83053 -51763 -105934 4924 -97923 -103198 187450
7896 -43598 105455 -46366 -130321 222826 67517 -181927 -288016 -49355 -257241 -136355 -108862
7885 -108862 220217 -115528 245177 122523 -221760 513 -115846 -99362 59148 -66351 -18046
7873 147647 -112170 -369237 -145254 -72569 28524 241622 42112 -2344 -267591 -274574 114452
7861 -93026 -402893 -137379 40827 23724 186799 -125335 -119514 408275 -18357 43463 -177133
7849 175703 255260 -228618 291784 233284 43422 35196 -99798 -86726 -192015 104285 -72794
7837 -7115 -263485 19672 -321038 -64975 53443 96080 -27614 96451 238027 261581 200055
7826 200055 211548 -281575 43453 208118 4634 46305 -372468 109013 -124819 344017 164657
7814 -133469 -94697 -429858 5307 -30747 260911 -41763 -151570 -295712 125352 -444950 253432
7802 -395253 -2737 283378 -89825 -62443 320118 -203607 57550 -119969 129754 -157723 219914
7790 89001 147434 -188199 -163709 14521 -193041 -128239 301457 -86948 93343 -319204 -172334
7779 -172334 59208 -84100 -132388 18733 -200784 -146957 196309 -136086 307152 -44776 -11296
7767 -123778 76817 -260842 94866 -87303 -131125 205386 -104393 135982 37614 -221824 -264970
7756 -264970 -142665 237265 -25638 -195467 -206406 -27497 61469 101245 -25826 -18717 -17307
7745 -17307 -17275 8753 -311086 225858 116902 -135600 -288197 -63741 163689 53684 -44035
7733 40667 -370758 -74461 -107512 -412611 -32051 -232797 -63743 -318337 281214 33826 -201984
7721 -8004 1876 -112660 -102662 -315928 -203280 66814 160936 -389601 -79896 -216481 -190243
7710 -190243 -66791 214577 -63284 -44985 74150 -54495 -170915 242061 -101032 -127168 76800
7698 200111 21638 76437 314025 160598 46421 62723 -40446 -198824 43126 -162527 226912
7686 -381604 25139 -88637 225747 41724 -95797 -410166 32105 7278 -178149 -210072 19208
7674 123365 86135 -229162 -100823 254936 107378 -355185 -12241 -208057 176334 66488
7663 -180129 52904 41060 272900 -66790 -119655 -3075 -178608 74333 74244 125296 165475 -38692
7650 281016 -198138 -100515 104835 -93928 145535 -89863 -240174 484 162969 8064 -114206
7638 -120812 1365 -459216 -3296 113846 -101919 -103589 -441702 -143195 -214117 -31833 4561
7626 168799 -158726 217246 -248769 -276488 -266745 -151426 -48634 -343019 -227722 -44014 72847
7614 159877 154047 -41997 -177589 -57303 119062 -21536 99672 -293265 -301002 -343464 82772
7602 36283 26730 -288167 47444 306588 116775 -47451 -505052 -63185 -117805 272656 92822
7590 -30753 168409 8818 -69854 352890 -128395 -128110 -4731 -222741 -319529 71578 46409 -109778
7577 227554 -252851 131707 302314 81175 149836 51094 121354 -15660 -299547 171658 -251125
7565 121856 -222022 -17495 -43328 -69786 -52694 -62907 15768 -35486 76832 -25392 -46492
7554 -46492 -233777 -69493 16885 133282 -269255 -103984 -76703 -81661 133912 162055 -264288
7542 131663 -51483 48543 13756 -198875 -133808 62776 -32313 105009 -20354 -30198 -117440
7531 -117440 -105447 35056 -164793 -99632 120571 -64842 -29234 122976 81315 -124488 209234
7519 -291172 -49960 174260 191563 -93424 78086 -349726 -170597 264948 132656 210416 -176831
7507 -26265 -284817 -343565 -153690 156574 343668 315314 50865 -74918 -242479 -134063 -124541
7496 -124541 253722 73922 -54741 -151899 256414 185166 107823 -244453 56060 -250484 -133012
7485 -133012 -166316 107327 -159921 39636 362842 -88068 -16997 52034 -189723 -21179 17288
7473 207243 -141683 -386872 103841 -374512 -71182 -18087 100980 -322055 -212606 129339
7462 -124015 -120101 77323 363327 -253900 -4452 -91109 20206 -327560 -201342 -505167 182480
7450 62989 -263739 368383 29450 86798 -158724 197626 -257844 -143140 40175 264672
7440 264672 -143000 -58183 -87666 27895 21109 39798 -54365 -67111 83193 -165692 -84800
7429 -84800 -61977 187257 21986 -119147 18977 67772 -55789 -142677 21162 -143173 440278
7417 219743 -92733 5446 -167694 -134671 -56085 -287894 39179 14651 -174779 -46149 -90700
7406 -90700 13961 -132047 52148 -94126 197789 -66541 -145289 79101 -61337 -102816 314002
7394 131193 132215 22358 -164747 11519 -191143 -61696 113979 53408 -263247 323766 -70420
7382 -355902 -111322 223766 -192034 140684 -5036 -399024 155719 170416 -3253 -279372 154308
7370 -129221 -173073 18307 -24366 171827 -273625 -4669 -137321 -127953 -53750 -108114 133037
7358 -154058 -169977 -34866 -395625 194290 70016 -154674 368675 -74249 -19675 53719 -102013
7346 -192930 -75920 -9103 -31418 108022 -242400 -67618 143564 181661 117580 66795 85021
7335 85021 -40831 93445 320980 -159240 -138928 223455 215688 -340049 333378 -67274 180677
7323 154238 -52528 -90384 201052 -322025 -174450 -76290 152839 438716 -226731 -52915
7312 -177635 -38678 -17001 127339 -62207 -217326 28824 143720 42534 230853 33315 -146176
7300 81687 164451 43420 -194170 79785 226991 244573 233947 -57693 236568 -8126 156083
7288 85564 250443 471145 -67196 -75139 -5180 107127 -364509 100120 -283584 -59677 -46145
7277 -46145 -2295 -161466 -81728 -7415 -193450 -345253 -214547 -101474 -55528 -182444 -314140
7266 -314140 7893 -41557 -153647 68739 228703 -71303 -170855 -164153 -77656 -172 158662 -1111
7253 -243143 305233 -402905 -131065 -316414 -74308 -206825 -239401 205434 -187844 -7611
7242 -118526 78787 382831 54962 63835 -97203 -13057 350831 124386 -77861 284256 -328608
7230 48864 84295 -145994 -128970 240315 -34896 439829 119998 -39824 -4258 39983 201950
7219 201950 -182211 -163512 -7999 -175221 2394 89556 -67161 -56440 -414884 -42328 -331775
7208 -331775 85196 98636 59101 -71652 -219838 114310 233938 149048 51783 129165 -180278
7196 183944 -186431 283306 -10165 -172721 -381507 -154455 -177632 64441 -120473 -202912
7186 -202912 13014 -20311 -147633 -89939 5207 97688 73495 32820 16224 40583 -56222 -404359
7174 -404359 -463524 -164891 83044 -182877 -33238 166969 -245459 -32503 206649 260344 31670
7162 -40408 -20685 -172254 -4748 -136444 108170 63295 -56254 -373428 -248659 -106837 -133593
7151 -133593 -261679 -165441 -170861 -154547 201356 -54348 -27472 -377145 -109973 -144644 -246545
7140 -246545 39105 -6059 -111299 -202918 -178676 -90068 120395 122097 -114331 160247 -129549
7128 -44551 -23324 -159081 651664 -77784 -240048 -187886 -220730 -325465 -4426 -35177 -8241
7116 -135732 18267 240779 392649 -201276 -129637 -116189 24274 -202843 -140639 89948 194448
7105 194448 -58999 129139 211452 174459 -84214 339925 188346 299177 1064 215014 -45382
7093 138517 137907 -215134 -277338 186471 343711 -31733 118404 233958 72234 -12600 -117400
7082 -117400 -35655 61681 -237351 -45126 -147167 -29266 7672 -208522 60675 270521 51359
7070 -203592 -88545 169673 59002 63695 -25068 -26231 309683 -92558 -37722 -20520 189374
7058 -73614 -8528 -199008 -138370 128839 -250417 -204056 65259 -261024 -216518 192019 -8120
7046 247594 -111078 -107851 64078 -135614 -347192 -31928 -134568 144608 -3757 148407 80737
7035 80737 49767 94298 87642 -41778 -129210 26698 -155695 162770 47471 159416 -183768
7023 104244 231205 -85519 156698 -145172 -47464 119652 -41544 290687 38726 48450 120644
7012 120644 48947 -31358 97893 -302075 -39328 -267993 -130573 113005 -108206 -133369 -69338
7001 -69338 90985 -83148 54762 -8608 -103570 94240 -95959 139915 -92646 -88094 -54763 -91364
6989 -91364 -123069 -8478 79556 -167661 -207741 -9306 164460 -158504 -17111 -219215 -64545
6977 -125240 67174 123577 -196544 -186509 -302568 298496 59185 36554 -3148 -104771 269437
6965 8419 -473868 -26837 -211892 123230 41525 79814 -29665 -304684 20413 49666 38574
6954 38574 -124710 -14276 -161020 -93204 -304346 217154 -4547 -135610 -269165 -199141 17263
6942 222652 263830 -3390 -153418 246501 -164374 -181329 12724 303291 73535 245393 103773
6930 -159823 30789 -133847 406655 -127239 -146776 -22520 -186094 -353529 -1711 109615 -180382
6918 290987 -98491 126069 191490 30940 90649 -4914 -87464 129983 30709 92544 133087
6907 133087 101347 -29702 -225506 -93610 -44673 105192 -127064 189280 -61136 340700 -243682
6895 169695 -50202 18897 75207 79303 53080 296057 -157025 383862 47141 -153448 -167279
6884 -167279 -54180 -14671 -46397 -296355 -319488 382614 97270 65292 -65010 5070 175477
6873 175477 71916 -131090 99537 50767 -192749 -70296 -41452 -136086 104528 -62865 103238
6861 185931 -362524 -237526 -531462 -300161 34822 -181527 -307209 -148459 170298 -59211
6850 45669 -332415 78215 11655 145170 -227169 -216708 160401 -70152 211585 -173840 -11527
6838 -321320 -128172 -142836 -30240 72639 -21093 -111037 33773 123057 -94818 74426 153665
6827 153665 275423 -27581 26883 144195 -165935 233146 -308525 -197433 -126223 -77134
6817 -77134 58043 -68263 79337 107286 -385697 66081 -66448 30507 -398442 -403468 11857 34570
6805 34570 -99911 -126037 19777 66779 -70526 -157531 7158 -166918 320431 184680 67493
6793 -15322 -235780 34405 93306 25425 -44976 128305 -219039 155165 158973 92945 156243
6782 156243 66500 -224360 105075 52272 258207 126049 -71533 -227224 -18657 -179850
6772 -179850 -140384 -124072 -442594 -94431 -146399 31549 -62447 -127869 -13192 -277366 69457
6760 148795 -66661 243203 -189155 98112 176116 -19602 -15329 -175142 -183203 274776 -166181
6748 -92144 -176033 -65292 -179419 -103764 -30321 77184 -33958 270901 336732 -75110 -133767
6737 -133767 93594 -118931 -70859 7053 156261 205729 -75911 27445 117510 95126 -154382
6725 -226978 83910 -307154 -57658 -115143 -26410 -113213 125252 -125920 -425449 38659 -63681
6713 272219 -149847 200764 25387 -1611 -122232 -200022 -5379 203657 -226071 -76544 -67749
6702 -67749 168971 -148498 -321638 116310 38751 4184 -294734 -17043 330427 56809 51883
6691 51883 -163456 189746 -269247 36834 -66294 -324169 207883 185800 161364 129144 -50193
6679 -125260 -225828 -120468 -168504 7090 -67584 177915 58059 106626 -72218 -91896 35135
6667 17573 -83591 -149508 182427 105852 -133221 22232 248451 74118 -56875 -205681 -219393
6656 -219393 264493 -216623 126312 191408 -390940 82202 -206864 7677 -72392 18800 -19695
6644 34258 129061 222404 -77504 155137 124966 -252346 22852 -24099 -164231 -56835 -4047
6632 -220356 -168387 -387858 -235198 -126867 241607 -69096 22465 23715 -144056 -35025 -99547
6621 -99547 -84648 422109 -56566 84480 14027 12381 78613 285752 38457 -12984 -46077 185811
6608 -319295 -179606 -86922 -284226 -180716 -112790 -63414 67887 115690 122926 313221 -120603
6596 -23081 -293312 -33501 172856 199332 -227320 226079 -229159 284761 -234308 100193
6585 -193283 137919 -27963 418700 372669 134861 147577 220097 -8466 101454 43998 80135
6574 80135 104461 -225675 20970 37901 105985 110557 -140218 -52056 -217315 -219944 -76708 163678
6561 -74337 -77193 196338 -173110 219723 -4456 -82261 368017 122705 65155 -239178 -206757
6550 -206757 163262 -82684 -189871 95063 127186 -364499 -142578 -37991 29905 -101327 -287046
6539 -287046 179086 1397 -28535 84712 -208293 8601 169420 -54112 153688 216530 32240
6527 -90679 -321436 -71732 361525 -278868 353303 -60448 96248 215644 -309544 40677 75011
6516 75011 -58826 -119030 -132832 248241 -388678 125102 -78940 -60630 -16746 -31217 478319
6504 19775 -7923 -235254 -64722 115449 -198914 -89226 -148165 280340 305252 -123075 251000
6492 -69827 -26499 -350747 260255 -87673 286263 -122449 -38172 -52025 136485 -126959 -362168
6481 -362168 81892 168689 -219025 103712 11934 88425 190180 28943 -60624 -353448 -198306
6470 -198306 293383 12025 156056 33572 -267060 -70565 440904 -121842 123582 -175351
6459 262486 -136558 37951 127138 -78651 -42191 -40782 -105507 1868 269528 -2600 -189036 -217262
6447 -217262 133228 10979 101745 -20319 -101507 -104263 -360677 177777 -287691 -1659 -46732
6436 -46732 141065 74826 24154 -354556 299961 -306434 -104058 277945 20701 390781
6426 390781 -289655 26148 -255881 -38838 118923 -139282 -111838 29596 -41074 83872 56910
6415 56910 107193 130052 -126588 48134 -211035 -297977 -163069 -155216 -128465 7687 68300 -287881
6402 98831 -114426 28070 156720 8658 -280563 103270 -158632 223052 -304714 -73347 69231
6390 -197296 -31791 -110970 208883 -289846 -199665 -88779 945 -132885 -27074 173794 146413
6379 146413 133401 -170689 -21377 330831 -383069 239231 -267100 -237246 166077 7067 -224911
6367 123199 -161459 133091 244778 16063 208677 21156 76834 -104639 -278864 62962
6356 78869 -233415 -44062 -22789 -45501 37493 277872 -103994 -20077 -393562 -7450 86819
6344 154665 164529 75038 22656 7291 163314 26532 -89984 -168121 -126254 130672 322415
6333 322415 337167 -162643 -319186 -71719 215981 -19836 209379 -591206 509170 -186243
6322 -135498 -45921 -97202 1562 55321 108256 -33865 -231496 143606 334808 -38364 174785
6310 -47544 -79184 364543 67078 -141611 -119961 -57619 -200674 131250 -84196 160604 160393
6299 160393 -158730 112729 119240 29806 -432588 -294499 -200270 -155129 -558108 305601 -161041
6287 -163211 83510 126517 -275856 138219 -4761 -21352 -18029 -224285 -210290 -122579 -101496
6276 -101496 40328 26920 -121303 244933 -42108 147859 68019 122034 -799 113284 -290346
6264 113489 121198 28053 -42110 25036 -94222 -173587 -172501 -15097 90966 -161035 100355 -96577
6251 146990 43958 380127 49332 387468 57346 -303597 17495 -32702 139407 8211 -88587
6239 216938 -260590 54617 -273618 -194556 -85020 -44331 13758 165343 -132326 -142559 -101843
6228 -101843 -13013 -136450 111748 -97410 -106802 -104320 204497 -4099 154396 51120 41289 -208843
6215 270684 -350613 122035 154549 40130 -72459 202605 165962 -41360 -318217 144385 158997
6204 158997 -181547 -173459 48586 113164 185953 14100 -45884 283844 9267 93899 50836 16490
6191 -95945 132548 -2507 80582 249284 -131621 -333955 -23061 -131863 177019 -39296 -118466
6180 -118466 -328346 361000 264857 -229063 45213 -124114 -102441 152160 -161354 -181923
6170 -181923 163243 -206098 21605 225759 357308 -170552 -228682 -288983 -388869 -2116 178759
6158 -90364 102077 168732 -76943 -124031 -26083 -9095 -169884 60160 -263473 96936 -73352
6146 -112394 -123980 -77339 -248920 68871 -80719 64513 -81113 -53729 326162 -373135 -43552
6134 -37853 -283334 -143330 -268846 -162769 -242655 188735 -66121 67474 -190450 -134163 65219
6122 -112500 -23327 -99932 117337 82755 -3478 -147620 -110931 -27942 74072 -133097 97167
6110 -17346 217121 -86024 -37400 254479 -108377 41890 89511 92501 -198245 -70254 -429305
6099 -429305 10610 -29439 41542 -158689 -196796 -105634 103908 119076 37477 504465 197837
6087 127624 333511 -12203 -175516 -58058 -177102 -206037 36356 96912 -198095 146578 -232279
6075 210840 -260119 46570 376687 -44917 -115140 -227377 66301 216183 133193 123460 159024
6064 159024 -301948 142890 208061 -304004 -352369 -33527 -29069 44638 305757 -190769 -120842
6053 -120842 -334957 -80630 198361 -103299 -112905 -165923 99314 -373209 41531 97122 -278064
6041 -196597 -143243 -329458 366156 -88344 -86026 189157 151393 38185 41234 -117163 -108500
6030 -108500 35186 -85439 106050 205379 -503284 -122864 258013 110132 370407 143362
6019 -7851 14866 -322704 164036 -73292 -88354 -175870 97248 -91931 -95655 47946 -50268 -144017
6007 -144017 -11366 235145 -50050 277281 111083 3423 -547016 63217 -330062 160232 -81921
5995 64910 8609 -63057 -171984 89582 77231 136951 57750 387959 -280548 -170376 187124
5983 -76828 73066 14692 8824 31996 149593 230728 84576 189569 -183023 -50646 1537 176075
5971 176075 -1580 102291 -95888 -120828 97830 -39959 311869 10213 -87146 -106085 241426
5959 -41042 -92536 -100491 79400 329227 6635 93044 -199173 499894 85740 200814 -170703
5947 118517 -220189 -20514 22387 314523 -118576 127510 -29668 -190690 291425 111257
5936 243632 -129004 -276616 138387 -189146 -6917 -125920 87103 173951 93850 -20745 -73241
5925 -73241 -506132 292150 4367 -160570 84615 119854 -94191 -8497 -256462 -272161 219102
5913 159538 -83113 182592 -219015 -61193 -20564 149989 20383 -46169 -125917 461590 229416
5901 78622 -362641 218340 -134123 -31400 -565528 -41217 92209 -64382 123249 -62504 86463
5889 331930 -313206 112121 25971 369747 -44180 141296 -37572 -120252 -184559 -55126 -137749
5878 -137749 -230381 -120904 -67090 124832 514513 -82420 -207478 91093 -102349 325718
5867 -116323 200489 147584 -103415 -394805 54054 -52160 223389 53598 -163086 -55242 -159603
5856 -159603 446072 157328 46600 6544 -278181 -210082 -139013 -304993 -31437 212319 -38272
5844 68946 -210631 44391 96678 -28735 90372 -11323 200911 126888 292289 84262 -161973
5832 115208 -95072 68508 -149851 -349605 -154718 -135887 167753 -520289 240058 -188524
5821 -162141 4085 -406033 -18948 -13936 -80601 -21338 17358 234620 206771 66553 -134098
5809 7625 -11050 -95970 -423239 259286 -26430 -82774 -170701 146932 -370841 -55619 -95347
5798 -95347 -23838 177122 -178397 -52062 -226260 61372 27559 -334212 73652 -51038 -160393
5787 -160393 -176465 -172680 266289 95500 311394 46120 -80831 127844 -240784 -362869 -157717
5775 42911 -312030 -88891 -93644 -88992 34105 250332 -116569 -70646 247806 -123496 -54603
5763 53080 368808 -200038 -22311 -144135 -218723 -41574 -6366 78829 -230751 -108992 41581
5751 -56576 -24846 -52125 -200448 51376 85742 -191896 177517 85530 -248816 139915 -147817
5739 246576 -414722 -99669 -326280 212735 205298 39517 271082 196927 102518 6235 -34282
5727 -57877 28966 -49922 -162055 296882 -158507 -195079 -193639 3997 245739 97029 -174024
5715 -199748 23916 -164575 58481 60477 355215 133332 -230253 101705 -414534 -85123 -185911
5704 -185911 -121260 365136 416444 80621 -202143 -227787 13698 277734 -33671 -54909 239372
5692 -54543 -112250 140385 -69948 297541 -101276 368394 97948 -21911 120166 -51201 97395
5680 198503 65998 221153 -94560 201013 149688 -139245 -28993 103285 -112236 -141530 329874
5668 -259467 -11779 -209201 -144561 -17237 110253 -47325 148332 -198145 -296638 311918 212501
5657 212501 -210086 -21889 -79374 5314 28507 -141124 -55776 69241 27296 26267 3872 -165169
5644 -95956 49763 125766 -253962 -87204 -137217 72366 8929 16176 19361 -111211 -187461 -320564
5632 -320564 -87046 85270 -65639 252232 60352 -24509 -60040 -241483 -71152 25709 89337
5621 89337 -132396 90021 13167 309396 -70312 24063 242035 121643 2052 189969 217465
5610 217465 -177127 30038 -31376 277036 96993 -6735 83436 -103385 -115352 -203988 9727
5598 -207044 122430 201429 107527 -139322 -1816 -43411 -49847 273551 -181917 62404 92401
5587 92401 -51719 199682 37128 57147 131256 125121 187294 -75978 -122835 11516 -99760 34867
5574 -177166 110850 -219835 86978 263931 -168905 9887 306594 -38774 70441 13230 -267
5562 38390 -279383 130698 40993 18757 22950 32088 50019 -58980 -193682 351767 462288
5551 462288 -124996 -74628 42106 124000 -121581 -71272 -73469 -172689 -189018 311975 -140475
5539 -1194 -203808 57124 72164 -169203 178002 -136037 173309 -99375 -70498 -190036 261472
5527 45930 212376 -112468 83819 -148011 -206452 -468625 139567 -61549 -55282 41150 -55846
5515 -172020 -208376 -142107 252093 90476 18411 -309487 84831 121187 -245151 -75080 -27676
5503 74342 -25473 150322 -73008 -299938 61438 -5956 127083 -132601 -137165 62955 -151081
5491 175612 326981 20511 131841 -12353 2416 -326463 165965 56303 -204878 199985 40701
5479 108994 16678 36877 164773 254010 225399 164388 99299 16049 -57209 -227188 -357034
5468 -357034 249040 117801 -36065 261675 58101 183228 -115812 -215024 -9451 18358 116252
5457 116252 -117780 -64298 -294409 -180008 -201527 1561 126 40422 -113085 -92843 31638
5445 -72833 348045 132668 -131494 -161672 -8020 13615 122174 -123368 -113265 -20194 257889
5433 -12841 190418 169273 -221157 18673 -258287 -45279 66211 115635 -242645 241405 16200
5421 169766 -144576 -190317 -140788 -247551 81132 -39733 116906 -16468 103522 82004 47
5409 117154 12063 42869 131341 -237323 7179 286432 153861 264840 -147340 -176575 -29914
5397 -115746 396461 189538 -104013 -192837 137172 52420 142313 -226329 92102 -341129
5386 26643 105907 -16740 -101763 192239 -113980 1404 -13007 -374689 91372 15194 188474
5375 188474 -167821 -144640 -188129 29633 47287 -236216 148978 297993 -61702 -40731 -54452
5364 -54452 -160094 83557 -116751 294510 -35793 12253 441186 -91156 -46414 425863 422460
5353 422460 -31323 -110293 96029 -46059 -295315 -208892 -39744 -157880 -115405 -94194 79724
5341 21031 109361 -18223 50134 -168726 170549 248401 -249852 11849 -267791 147248 23679
5329 -151542 -27918 75419 -51302 -117630 -36818 91373 137156 361805 33687 -255999 149369
5317 303485 266048 -117008 54084 -53951 -241687 -108481 -102485 -84444 61552 199913 -208453
5305 -141987 394894 -388804 -209573 -127521 225751 280622 -34514 -10308 381470 55012 268393
5294 268393 102295 85149 -43278 -246627 -39578 -231915 -288838 -80256 -42182 -231639 -96002
5282 -81677 -285945 -188624 184531 115240 103250 -73675 10571 184903 -32492 -283124 219789
5270 33702 85870 327637 -101454 -310076 272964 -88267 232500 390226 113320 -88145
5259 -86966 -148887 -108697 -183522 -94354 -73231 109428 -328519 158883 207694 177491 77846
5247 -32294 191198 -12153 -54790 -36294 -20772 -135907 336282 -49935 -349255 109875 12827
5235 15011 -229623 394534 195821 152502 129442 28269 143862 -83902 165157 201448 104892
5224 104892 46540 -144799 -86961 157953 -102141 -103367 149830 -76166 -23615 -124582 50203
5212 -59578 -152691 -65768 27852 24208 25791 -205529 50660 235063 45767 199129 170089 299864
5200 299864 -140955 135113 77986 -133182 -151990 44357 44958 174972 74169 -241889 -100328
5188 43141 43970 -17026 -87361 -58143 -39876 -119220 375 -320495 61204 268507 -126035 245873
5175 126268 3859 -248286 -151808 62229 -51754 -98132 81720 -144597 5476 52402 183197
5164 183197 -244856 43501 -250158 -83991 -428266 1323 -59380 33878 214831 57866 -45142
5152 -239429 296810 -161482 -318800 315481 63694 -67375 502999 5629 -68509 297042 127460
5140 -91865 -152036 -21612 25008 -41892 -28616 -144767 -126221 355980 -107333 231878 -267409
5128 -171784 245181 268438 -60090 -4059 17247 163614 35595 -82458 -1349 -39520 20071 -430055
5115 25423 259972 38668 315320 135589 298079 -311495 -71926 9325 123868 -61074 222043
5103 -126841 99473 8328 -164009 7231 59993 -86008 112916 97983 -182713 66891 -77850
5091 14267 21425 -98507 364925 -10401 317107 233669 60275 -98 -230028 -156788 272178 326167
5079 326167 -179630 15094 -128496 188698 156592 238629 -187616 -17925 173222 279621
5069 279621 210137 -138304 -31375 -200865 57316 259715 448028 237530 153280 -185689
5058 62878 83693 -151713 -356175 24368 -46425 247471 81466 -269920 217491 -240339 -315109
5047 -315109 163095 -17419 139174 87387 64979 -363437 -37575 70178 -88947 21314 253620
5036 253620 -175253 -327143 -207568 223170 367151 321320 145169 -7558 91703 362831
5026 362831 -185288 220668 -45769 -48148 316796 104352 -194615 171388 45129 -15834 -247724
5015 -247724 109135 -41389 -340353 -162757 -165107 181643 373095 60966 7121 232024 -88987
5003 257597 -38637 -37038 -79594 134732 -91749 -182641 93876 -420112 186710 141553 81880
4992 81880 -139095 -60564 -64538 -214473 -105656 -409988 141422 19304 28857 -117696 131605
4980 170951 -36950 -161991 255301 -301106 21094 -50811 113734 -81378 47770 -66848 -72058
4969 -72058 -94512 -109947 -13890 -56757 -31534 178044 91944 83662 -284527 -185140 60244 -219810
4956 -19919 -164962 -408500 -69059 -172828 -120848 13188 -205352 -18768 -270976 -1025 7694
4944 -136966 161754 -138404 109587 -221983 169439 -329566 -231182 -240690 95739 346142
4934 346142 -9008 -67561 523176 194076 245362 21573 -73741 120679 -265372 -175290 141924
4922 -95533 -151556 37798 -111408 148140 12042 -196122 505814 -21288 -37120 25610 90669
4911 90669 398629 181059 -97173 31950 -271445 382612 235198 210966 295160 204552 -136763
4899 90653 74705 -182815 254930 60933 -48882 -166212 22799 212867 -38243 -87779 242395
4887 -156992 67624 128042 -14614 -11855 -352108 -31143 48207 -156875 373398 92100 -78342
4875 -162495 218888 21105 20213 315234 91999 -513813 26750 62194 68290 265395 96049
4863 75491 150986 -133896 -184611 -19810 281387 151207 -183895 -64212 -169416 38133 141130
4852 141130 -98406 -187338 -264674 173228 -186189 -389191 -252257 47290 184195 4281 240276
4841 240276 -93731 24852 141044 11304 261437 -186592 91268 34008 179671 -18746 -11730
4830 -11730 -14873 -263551 -393969 111652 195730 -171921 -95338 35280 43940 59348 335271
4819 335271 -268543 131157 -252296 -251909 -136293 18423 46731 -77327 -65474 -13803 -168059
4808 -168059 108875 -100511 -51146 81289 94448 -183566 -129511 63760 43579 19291 148496
4797 148496 -139720 -372862 -28696 -226765 128630 138174 -241610 -280600 446995 19955 -70791
4785 333179 357145 251993 215648 -242504 199362 -19753 -281503 119782 114812 -162652 168467
4773 322609 70199 -136207 -40565 147193 -298816 68389 77645 134665 100858 44570 -300635
4761 -23521 214375 276967 201296 -14686 84816 285186 -87384 -17197 -177360 -257642 -41983
4749 267167 160710 -212576 15274 41890 -53154 153770 53742 393243 65879 -63429 21905
4737 -98173 -191957 -263117 147456 226596 66020 -61466 -83419 -849 444612 249199 -24057 37724
4724 -90867 76198 -138904 213922 159577 66483 165012 -126671 284820 -170975 132815 -254591
4712 235733 185473 266662 12140 -76743 16249 -55012 225695 194344 -579 198058 102160 -73446
4699 -107189 238231 -226714 -234029 -63628 100478 248813 -367960 132926 -5886 -183074 -54480
4687 -1904 83362 -69459 387051 281648 183152 117570 168670 -302775 239271 -82588 -140911
4676 -140911 52418 -67519 26726 -6226 34067 -316795 231884 -63334 -8312 -148434 153643
4664 -93813 158164 75934 -192473 -156406 42017 156609 236888 131259 -1700 240483 -117343
4652 -157341 10021 -59090 97596 228829 -70560 -105466 -59857 77902 -127910 -114987 246260
4640 94200 242140 -31744 -89483 129381 104727 313833 128047 15940 -30379 -42249 -130199
4629 -130199 -12357 -293218 1784 36146 -151721 176419 28705 -54928 153802 181129 -48625
4617 191965 -193607 -153761 -82223 165547 56443 -114706 5546 4739 150018 405394 -120357
4605 -394082 -33750 -31311 36077 -280305 -130614 -63498 78580 -157295 -84809 -142922 136268
4593 -1198 -98957 148431 138147 305018 -242705 -55337 -177296 38128 -18540 244912 43535
4581 -145574 -378345 -29363 2613 174495 195122 -245696 45644 -101139 228603 -388846 -283072
4570 -283072 323045 -3284 257476 45631 98452 -7461 -55389 290781 -62048 -137807 57692
4558 95141 -63725 -130142 -198227 56130 2851 159361 136110 -7552 -52332 227393 -182138 281469
4545 -38670 -59211 188443 79138 1421 -97146 -97656 -116563 -131758 130063 -267277 197831 54515
4532 -180983 -243079 -68508 7909 223819 63149 -86167 -576983 50019 -3770 -54190 156874
4520 -267347 121836 189021 163343 229270 -172809 3698 -193223 -78577 -125060 301846 47423
$$ [...]
##END NTUPLES=NMR SPECTRUM
##END=
