
##TITLE=AC1172_Tolima-ibage-TFiAH12005_5858481_cE55nQ55Vn
##JCAMPDX= 6.0         $$ Bruker NMR JCAMP-DX V2.0
##DATA TYPE= NMR SPECTRUM
##DATA CLASS= NTUPLES
##ORIGIN= BRUKER
##OWNER= Administrator
$$ 1.72 TOPSPIN		Version 2.1
$$ 2012-03-29 18:21:51.593 -0500  Administrator@TOPSPIN
$$ Compression mode = diff/dup
##.OBSERVE FREQUENCY= 400.13188235
##.OBSERVE NUCLEUS= ^1H
##.ACQUISITION MODE= SIMULTANEOUS (DQD)
##.ACQUISITION SCHEME= undefined
##.AVERAGES= 8
##.DIGITISER RES= 22
##SPECTROMETER/DATA SYSTEM= spect
##.PULSE SEQUENCE= zg30
##.SOLVENT NAME= COFFEE_meoh
##.SHIFT REFERENCE= INTERNAL, COFFEE_meoh, 1, 14.98061
##AUDIT TRAIL= $$ (NUMBER, WHEN, WHO, WHERE, PROCESS, VERSION, WHAT)
$$ ##TITLE= Audit trail, TOPSPIN		Version 2.1
$$ ##JCAMPDX= 5.01
$$ ##ORIGIN= Bruker BioSpin GmbH
$$ ##OWNER= Administrator
$$ $$ C:\Bruker\TOPSPIN/data/COFFEE/nmr/AC1172_Tolima-ibage-TFiAH12005_5858481_cE55nQ55Vn/10/pdata/1/auditp.txt
$$ ##AUDIT TRAIL=  $$ (NUMBER, WHEN, WHO, WHERE, PROCESS, VERSION, WHAT)
(   1,<2012-03-29 18:21:35.250 -0500>,<Administrator>,<TOPSPIN>,<go>,<TOPSPIN 2.1>,
      <created by zg
	started at 2012-03-29 18:20:27.687 -0500,
	POWCHK enabled, PULCHK disabled,
       configuration hash MD5:
       1A 1E CE 29 27 FD 77 03 67 4E F0 E3 C4 B2 CB 90
       data hash MD5: 64K
       CC FD A8 4C 6B 08 19 56 FD FB 97 54 61 D4 6B 16>)
(   2,<2012-03-29 18:21:45.343 -0500>,<Administrator>,<TOPSPIN>,<proc1d>,<TOPSPIN 2.1>,
      <Start of raw data processing
       efp LB = 0 FT_mod = 6 PKNL = 1 PHC0 = 0 PHC1 = 0 SI = 32K 
       data hash MD5: 32K
       D4 83 6C 26 70 85 AA DA F4 4B E1 7F A8 D7 79 5F>)
(   3,<2012-03-29 18:21:45.656 -0500>,<Administrator>,<TOPSPIN>,<proc1d>,<TOPSPIN 2.1>,
      <pk PHC0 = 215.2277 PHC1 = 0 
       data hash MD5: 32K
       33 11 45 30 78 7C 0F 9A DE 3C 94 49 A8 87 AA 9B>)
(   4,<2012-03-29 18:21:45.750 -0500>,<Administrator>,<TOPSPIN>,<proc1d>,<TOPSPIN 2.1>,
      <abs ABSG = 1 
       data hash MD5: 32K
       18 CB 95 A8 FE BC C2 AC 85 2A AD 48 82 24 E6 F6>)
(   5,<2012-03-29 18:21:45.781 -0500>,<Administrator>,<TOPSPIN>,<proc1d>,<TOPSPIN 2.1>,
      <abs ABSG = 2 
       data hash MD5: 32K
       26 DF 91 AD 6B 58 2E 36 A7 6A B9 90 8B 48 4B 39>)
(   6,<2012-03-29 18:21:45.812 -0500>,<Administrator>,<TOPSPIN>,<proc1d>,<TOPSPIN 2.1>,
      <abs ABSG = 3 
       data hash MD5: 32K
       35 49 B7 67 EA 16 9D F9 B4 86 39 89 DA 41 15 D2>)
(   7,<2012-03-29 18:21:45.843 -0500>,<Administrator>,<TOPSPIN>,<proc1d>,<TOPSPIN 2.1>,
      <abs ABSG = 4 
       data hash MD5: 32K
       56 8E 24 4D 0D EC 90 F6 8B 0A 7D 9A D2 37 34 50>)
(   8,<2012-03-29 18:21:45.875 -0500>,<Administrator>,<TOPSPIN>,<proc1d>,<TOPSPIN 2.1>,
      <abs ABSG = 5 
       data hash MD5: 32K
       F0 4D B3 27 6B D2 C2 A4 0C 4F A2 DF F4 1F 44 B6>)
$$ ##END=
$$ 
$$ $$ hash MD5
$$ $$ 9B 0A 69 EA 02 B7 19 D6 F3 27 A3 7B D7 8F E5 30
##$RELAX= 
##$RELAX= 
##$RELAX= 
##$RELAX= 
##$RELAX= 
##$RELAX= 
##$RELAX= 
$$ Bruker specific parameters
$$ [...]
##$TP= (0..7)
150 150 150 150 150 150 150 150
##$TP07= 0
##$TPNAME0= <>
##$TPNAME1= <>
##$TPNAME2= <>
##$TPNAME3= <>
##$TPNAME4= <>
##$TPNAME5= <>
##$TPNAME6= <>
##$TPNAME7= <>
##$TPOAL= (0..7)
0.5 0.5 0.5 0.5 0.5 0.5 0.5 0.5
##$TPOFFS= (0..7)
0 0 0 0 0 0 0 0
##$TUNHIN= 0
##$TUNHOUT= 0
##$TUNXOUT= 0
##$USERA1= <user>
##$USERA2= <user>
##$USERA3= <user>
##$USERA4= <user>
##$USERA5= <user>
##$V9= 5
##$VALIST= <valist>
##$VCLIST= <CCCCCCCCCCCCCCC>
##$VD= 0
##$VDLIST= <DDDDDDDDDDDDDDD>
##$VPLIST= <PPPPPPPPPPPPPPP>
##$VTLIST= <TTTTTTTTTTTTTTT>
##$WBST= 1024
##$WBSW= 4
##$XGAIN= (0..3)
0 0 0 0
##$XL= 0
##$YL= 0
##$YMAX_a= 542058
##$YMIN_a= -633599
##$ZGOPTNS= <>
##$ZL1= 120
##$ZL2= 120
##$ZL3= 120
##$ZL4= 120
##$ABSF1= 14.98061
##$ABSF2= -5.57192
##$ABSG= 5
##$ABSL= 3
##$ALPHA= 0
##$AQORDER= 0
##$ASSFAC= 0
##$ASSFACI= 0
##$ASSFACX= 0
##$ASSWID= 0
##$AUNMP= <proc_prof1d_extract_pilot.lims>
##$AXLEFT= 0
##$AXNAME= <>
##$AXNUC= <1H>
##$AXRIGHT= 0
##$AXTYPE= 0
##$AXUNIT= <>
##$AZFE= 0.1
##$AZFW= 0.1
##$BCFW= 0
##$BC_mod= 0
##$BYTORDP= 0
##$COROFFS= 0
##$CY= 15
##$DATMOD= 1
##$DC= 0
##$DFILT= <>
##$DTYPP= 0
##$F1P= 0
##$F2P= 0
##$FCOR= 0.5
##$FTSIZE= 32768
##$FT_mod= 6
##$GAMMA= 0
##$GB= 0
##$INTBC= 1
##$INTSCL= 1
##$ISEN= 128
##$LB= 0
##$LEV0= 0
##$LPBIN= 0
##$MAXI= 10000
##$MC2= 0
##$MEAN= 0
##$ME_mod= 0
##$MI= 0
##$NCOEF= 0
##$NC_proc= -8
##$NLEV= 6
##$NOISF1= 0
##$NOISF2= 0
##$NSP= 0
##$NTH_PI= 0
##$NZP= 0
##$OFFSET= 14.98061
##$PC= 1
##$PHC0= 215.2277
##$PHC1= 0
##$PH_mod= 1
##$PKNL= yes
##$PPARMOD= 0
##$PPDIAG= 0
##$PPIPTYP= 0
##$PPMPNUM= 2147483647
##$PPRESOL= 1
##$PSCAL= 4
##$PSIGN= 0
##$PYNMP= <proc.py>
##$REVERSE= no
##$SF= 400.13
##$SI= 32768
##$SIGF1= 0
##$SIGF2= 0
##$SINO= 400
##$SIOLD= 32768
##$SPECTYP= <>
##$SREGLST= <1H.CDCl3>
##$SSB= 0
##$STSI= 32768
##$STSR= 0
##$SW_p= 8223.68421052632
##$SYMM= 0
##$S_DEV= 0
##$TDeff= 65536
##$TDoff= 0
##$TI= <>
##$TILT= no
##$TM1= 0
##$TM2= 0
##$TOPLEV= 0
##$USERP1= <user>
##$USERP2= <user>
##$USERP3= <user>
##$USERP4= <user>
##$USERP5= <user>
##$WDW= 1
##$XDIM= 32768
##$YMAX_p= 462236100
##$YMIN_p= -717307
##$CURPLOT= <Network HP LaserJet P1505>
##$CURPRIN= <$Network HP LaserJet P1505>
##$DFORMAT= <normdp>
##$LAYOUT= <+/1D_H.xwp>
##$LFORMAT= <normlp>
##$PFORMAT= <normpl>
##$SURQMSG= 1
$$ End of Bruker specific parameters
$$ ---------------------------------
##NTUPLES= NMR SPECTRUM
##VAR_NAME=  FREQUENCY,     SPECTRUM/REAL,   SPECTRUM/IMAG
##SYMBOL=    X,             R,               I
##VAR_TYPE=  INDEPENDENT,   DEPENDENT,       DEPENDENT
##VAR_FORM=  AFFN,          ASDF,            ASDF
##VAR_DIM=   32768,         32768,           32768
##UNITS=     HZ,            ARBITRARY UNITS, ARBITRARY UNITS
##FACTOR=    0.250966925370066, 1,           1
##FIRST=     8223.43324360095, 18611,        -170116
##LAST=      0,             32964,           28115
##MIN=       0,             -717307,         0
##MAX=       8223.43324360095, 462236100,    0
$$ Real data points
##PAGE= N=1
##DATA TABLE= (X++(R..R)), XYDATA
$$ [...]
23828 345163 -24468 33512 -7817 65584 -296621 -87168 412348 -156234 -392845 -110624 -142087
23817 -142087 80369 -11938 -136222 -111267 -165147 105429 -60675 52177 -50620 -379978 -28846
23805 -69303 36794 179179 -82990 171975 -458 -32686 253803 -124507 91171 107104 -95936
23793 39595 24299 214256 75757 -249706 -136153 11091 -47599 275136 -224057 187518
23782 -37003 67821 145635 -40759 -73373 299481 64298 -55843 462488 38933 7970 -51636
23770 284946 23545 -109374 -95527 37766 -101078 -156047 -213893 -54081 -142938 -52562 217097
23758 -117423 26803 105161 76453 75529 -117450 -47913 297242 131981 -119197 30638 -152671
23746 184109 -270227 -43020 -397103 -201398 43151 144307 12256 230194 -98796 24843
23735 -134266 -68033 189187 -26800 -56052 -17349 -56852 40773 -133088 -80771 -129301 24543
23723 163404 -26570 67647 -209529 -246160 -131246 69025 -237506 -371471 -14969 47542 72101
23712 72101 -184097 -264955 159295 123733 258693 -189807 43685 -18135 -106633 62129 -257747
23700 177864 -315088 -153500 -217938 -194619 -242215 229882 -154802 -238695 -269087 -98713 83193
23688 -45395 231888 -200631 -11684 -132097 11296 308739 -184499 129995 -373157 -6355
23677 61045 -299091 101147 -15092 292370 28798 -48952 -211508 4188 -39364 -134206 -316454
23666 -316454 19873 170062 68282 -46284 86040 -286454 -34127 13879 -66210 -26508 60983
23654 -78202 -88297 10683 -3279 197958 143762 125832 125515 144335 -94762 -38682 -30671 -377551
23642 -377551 40652 -330997 205112 -56035 -106391 20530 -141229 -35463 193298 150919 -225607
23630 -22694 71543 -445491 -145 35917 53391 -273409 -181317 -168298 209641 237365 278111
23619 278111 -6577 63694 243248 273652 -211313 302613 60095 -46594 -169799 -75163 124224
23607 -26065 327168 -450523 404465 -1408 -66665 -151137 -448686 289547 106679 -58009 65103
23595 46777 147882 174968 -167001 72781 -114446 -149158 169869 142760 -104087 -220015
23585 -220015 23689 -116783 167860 -97924 -263540 164603 373676 -22160 -56399 -319555
23575 -319555 -87945 -233722 101840 150018 -34176 98858 148628 -262751 163309 -16686 -203653
23564 -203653 -280131 -175163 276943 64910 -206486 -35879 -29477 -251433 84384 -219608 217424
23552 -52192 -280572 -134195 -27740 -57809 27981 -239668 50842 95914 -4276 84221 146470
23541 146470 74361 34779 145801 -313693 34995 219435 340465 177126 252697 280187
23531 280187 -48221 74121 217657 -232678 1465 -444753 14944 25022 -128324 276257 113950
23519 29551 -154225 36535 104345 -32489 105895 -420519 66315 -44504 117539 251438 216545
23508 216545 -253119 275688 -171835 -262259 62763 74945 -233606 14334 370947 -262796
23497 -203864 -54722 15690 94258 212386 69863 -104826 -37316 -159134 -123950 -67779 246221
23485 160625 30600 273007 39494 98487 -16109 163916 173364 -144629 89018 155900 260520
23474 260520 -54671 69626 -63996 -206991 156049 -36192 -124670 -93264 -308568 -142415 -190218
23463 -190218 -58963 -54690 457157 -15958 -107640 -412666 410899 -257838 63732 -100545 -74702
23452 -74702 -28463 9858 107674 70651 -61122 10022 -328047 47901 60516 -14944 209670
23440 -347087 243271 206254 -173864 -39119 -131772 -18599 -250898 59455 -18035 -49501 270181
23428 -244205 157325 -429185 162284 -245097 5956 165398 209402 40550 -71791 4513 -356139
23416 181332 496728 -45111 10928 18495 267366 38152 -338631 -62891 -218806 -31349 -199855
23405 -199855 -175753 -241635 -177905 85295 -199381 -14726 71176 -49857 -59793 262946 -289782
23393 122116 191298 -48647 51069 148369 -164735 -61308 217480 256784 35216 -138869 -81845
23382 -81845 -175558 224205 65062 87416 -231960 -11948 -25372 -7129 7129 311810 45709
23370 73365 251287 -367883 36822 28986 201997 51731 413037 -17569 194913 -19666 -196533
23359 -196533 214188 -26351 232382 -146666 -156968 -17601 272449 3076 -125873 118150
23348 -116988 -166523 -27919 93989 32311 -285321 -227119 19400 230224 24720 184391 -260637
23336 163821 174815 -216204 -490465 34652 -208741 -114373 -53942 7012 154657 295925 65300
23324 -95416 -70467 -33572 102330 -3016 151896 -334471 134006 -220682 -13608 -200976 -30535
23312 -252050 36902 -324062 -290213 126624 -61663 -146414 221060 312364 513669 137730
23301 43343 -263880 166272 90067 -258439 38045 -253331 -59115 -361678 -32393 -153106
23291 -153106 -297928 15942 -53587 88987 39180 -170647 77375 -10047 34301 -155576 -132234
23280 -132234 -345549 7167 -192996 -213199 -192429 -314255 -315345 -286817 168064 -54377 103991
23268 142454 106025 -240595 -162189 95012 -65556 148063 22886 -36448 25762 176081 -120601
23256 -200824 113086 -209346 -162061 112540 202634 -68446 137545 -143688 28081 107221
23246 107221 -250828 -76169 175743 136247 -225197 20501 -101612 -36316 212992 -176912
23235 -49235 -29713 -339753 -363419 88345 119143 56737 70436 -7655 45740 120178 85066 -198175
23222 -167824 69045 -30398 -65535 -54939 133683 46760 53806 26489 28737 -278937 -184760
23211 -184760 109178 23835 75213 161507 -31758 -154338 109724 35275 -102230 -18799 125972
23199 42063 38843 -201035 -342520 -31700 -59352 157878 8089 -196751 -98253 -164489 265635
23187 33795 108883 140467 320603 24329 -253796 -88987 -242934 -317158 -12488 -4371 158542
23175 51567 274347 -142533 133975 70137 4393 226519 41905 -172963 -7826 -251643 28024
23163 66211 116017 154280 5163 4012 100870 140387 -176811 -83581 -221699 -231544 140132 -75512
23150 35462 -68191 -105088 -254337 -172036 20772 71897 -90181 240822 25245 62289 261733
23139 261733 32596 148319 149607 13872 63966 -41974 110455 175774 -116642 -324721 -167620
23128 -167620 -41575 316823 15999 -136073 -147907 -83294 -37296 -113639 -10158 -48562 230491
23116 18594 -51865 345999 211647 -16736 144627 -10878 -504001 -189031 70541 -465453
23105 82511 94257 258244 255536 -219956 200729 129671 419790 -29709 -214654 -20010 81028
23093 -283383 191568 201105 96110 -194612 170550 -85248 -68904 242299 101432 235841
23083 235841 47242 139796 186979 144299 -101772 48271 -281867 -78953 163851 -120463 -155615
23072 -155615 -34056 -330249 124390 141527 -4017 7056 -53239 -65885 19302 161689 21969
23060 63518 -24607 42611 -208187 116273 -76983 -97590 207255 143373 92567 -426817 115692
23048 -70480 -104662 -36479 -36390 -52807 84130 -382233 -72963 -54582 -243176 -357298 169975
23036 -152905 -250459 -321105 2482 152499 -122727 124923 -256325 72811 132784 -45637 314160
23024 -138917 -27084 -10119 -204773 184202 17544 -172451 -120488 295933 380820 93480 -180298
23012 -65063 -116344 -79717 91256 -25444 -19412 -144143 -127775 -14687 -124931 429960 -270725
23000 -371943 -2945 -75728 -229487 -30551 -141069 170138 -175230 -61154 -63631 -107736 24685
22988 -207711 -205094 -129890 -217908 28838 -90030 -149016 -108801 -147607 -157757 -11515 -109436 -230348
22976 -230348 -10693 -81171 -3131 8310 -135627 165920 -38641 -196300 -105091 74367 125128
22965 125128 33550 133604 -113298 -51775 -180946 -127888 184575 45392 -228370 -20018
22954 126347 194800 145929 36899 49874 -36572 151863 -154568 -141762 86059 -172056 -104134
22943 -104134 -82845 -53566 -196517 84319 33672 226472 -281284 -12304 -22591 -299423 98142
22931 185715 235049 -86829 131441 -26442 -40259 -409044 -185009 99117 -68951 -214298 -251045
22920 -251045 -12227 327176 79369 93568 210996 -262353 -40090 -253 225124 207231 17598
22908 180364 235817 -121136 289668 -79824 -86947 117300 -67863 17366 -59772 10374 152067
22897 152067 57108 24094 -78309 10495 -72498 183637 79088 11931 -9530 197267 -144882
22885 205795 -51071 -57487 119974 14042 -4794 82403 -96294 19270 135553 256267 334491
22874 334491 -167876 52713 -330031 -134815 -9972 -324030 64522 137683 -38531 -262539 -80351
22862 63976 -257821 -169304 86232 142080 -262902 176644 -198447 -59224 -65910 164298 -105446
22850 72369 -249994 131825 -231024 110091 5346 -125988 -296767 149055 -72234 -35967
22839 -155409 -82123 81298 -169620 -81216 63640 -37841 184061 209727 -151303 80008 -84970
22827 -170257 14327 -38869 -133521 41017 -105502 271440 -320639 -116314 21609 -220571
22816 405112 -39891 -360673 112779 -177865 10401 24372 236762 88651 -356292 113859
22805 -115983 221867 150781 -201362 70937 46308 306631 197719 -21435 75179 -216975
22794 -187853 -216194 -57518 81153 -60073 -272376 235220 -134345 102802 -139384 137372
22783 -388686 -99557 38901 -82020 262719 347197 -1050 50297 -56483 -245271 316208 -138058
22771 327948 21751 289123 -137837 -53537 220315 101960 17237 -260275 -26623 44570
22760 257556 -119962 54988 -299795 -202901 -37827 -104130 -54634 -59288 -229006 291159 144126
22748 -14305 -91286 -46161 -41319 48577 -178898 95179 -157471 94182 -84179 125743 -284264
22736 45884 185945 -68836 190901 86569 53899 -217472 -224872 181541 -224117 -103756 -144759
22725 -144759 69084 -249577 -8938 60277 14340 -91398 85171 -60989 135602 -153945 360432
22713 -187310 -75816 -63553 254846 82756 -146917 -52892 -328808 114835 133057 74656 -162162
22701 -156870 -19953 -15279 -227002 -109634 -173683 -60430 -149336 29077 -85250 112687 -19277
22689 -183668 -265966 -152 126123 -33067 -68266 83576 11253 -43200 240880 -55073 30298
22677 -201615 -59037 -43812 -31585 111963 28826 31435 -29029 -4171 -249858 43015 -45276
22665 72512 -29430 -373561 -63992 10150 -165785 76976 -199153 147131 -170170 -156805 -278822
22654 -278822 -382188 105242 -273070 -18976 -47139 148382 -272182 123079 223645 -81644
22643 -26139 173396 300813 333321 -50761 -57888 -216120 259107 -108734 -108756 -132721 109113
22631 -207697 -86955 277141 -19786 271673 20852 17327 -22843 314478 145191 58282 -156344
22619 -269424 -38354 28026 56056 -111233 11699 -127834 152402 -112566 55872 166312
22609 166312 -1514 -172598 -33112 242554 166287 136229 141807 -155443 -118628 -239537 -14315
22597 82561 -385050 177741 -331139 -24289 -268594 -53136 -210646 42702 90815 36949 -109257
22585 202827 -97267 164581 -150982 -225371 -137476 85364 12068 -128235 36801 -40763 -63576
22574 -63576 129015 153640 -51991 92343 -117889 -106978 166142 197695 -98800 -107456 -25000
22562 252020 79230 -319024 -146873 -46021 -58427 -135087 304250 -135772 78779 -183423
22551 -234017 -65469 -164617 -10363 46230 -139865 -61997 160795 234051 -142223 -52684 -222757
22540 -222757 -311605 -32737 -264343 -421881 -14094 64405 74807 201420 -107928 195651
22529 -520991 -44404 55879 384318 -172909 -593220 -165996 -109114 23582 181015 108224
22519 108224 171011 -431892 153554 110070 -237429 367394 -233953 -530094 -151492 126663
22508 45015 84491 208222 -10334 -102667 166933 109962 -368468 387033 88508 91998 25672
22496 164500 -80754 -166939 71282 16705 -1668 49727 -17704 271151 191041 -140599 152180
22484 -213679 -66618 -83233 -191090 -82347 -367410 -23133 8321 -123593 -213127 166744 -8164
22472 -29301 16164 -158611 61840 -198569 77283 389788 157780 49094 73055 -82882 22447
22460 -399240 -72285 190899 -149874 159436 -17312 -426365 227689 -145121 154322 18481
22449 -156224 -243069 -23831 108127 -122731 -74088 -278233 -22110 217510 -117517 153278
22438 -330643 -129770 -215808 -101483 163795 -487952 285573 432347 182945 -342370 122262
22427 970 -411693 -26600 -28781 -54539 -174465 -25397 -100876 289907 120674 -223153 -296448
22416 -296448 -44688 -249814 -105392 -72186 31131 -25242 797 184275 -222966 -168528 -21722
22404 -239806 268029 509990 34285 -104941 268755 -25149 -470812 165115 -108101 398041
22393 119603 89109 -162373 273892 78088 19494 -97318 -32064 139393 61137 92741 232142
22382 232142 -219002 -98221 -101687 46604 -31344 85046 254960 -279396 -261558 -60434 -14126
22370 -395621 -151913 -92026 -92536 27818 184374 130004 143200 63063 -89504 -160082 -222870
22359 -222870 -180140 193570 -200532 -336664 185568 12017 161746 -499541 182224 200380
22349 200380 64699 -27087 -208734 -118150 113646 227643 -170244 67925 100834 51389 -23917
22337 -55561 266466 -148155 -98354 201306 3218 -242844 -211748 22208 -409984 -185750 -16095
22325 -9162 -61445 -103776 123764 14743 -62051 235499 96612 -52440 86198 -133200 -46172
22313 -85451 -89995 107603 13302 89173 52013 34884 -271626 13321 -159345 52298 -40204
22301 13994 -51929 -183548 -21779 -202841 -106834 -95639 76925 -246499 -244514 -153303 96016
22289 -54712 -288479 93275 86425 82462 -162162 -37727 60467 215927 -246180 121590 204503
22278 204503 44931 13795 -151357 -121075 74246 179604 93234 169930 -303637 163349 64091
22266 83463 -78032 -16942 158131 -136365 -105177 190329 -257597 205773 40354 131397 -123001
22254 171843 148545 -90526 -32875 70666 -178036 267065 7801 -106097 -105845 -10423 -195319
22243 -195319 -234231 80884 34684 -34716 -83156 283579 103782 -229128 12773 -16149 139529
22231 -204858 313828 -55978 -273365 292528 -42497 -52605 201690 42767 2146 165528 -206564
22219 -151186 -288348 -44815 -149791 258830 -110056 42798 82678 207716 64285 208973
22209 208973 -92726 -371117 128828 -27224 -55149 -16208 157094 176170 199498 20717 209990
22198 209990 -292298 -70065 -498708 -322627 -6560 164912 180447 -98413 15803 -19235 -240108
22187 -240108 -295822 16151 29180 -205988 150968 -75356 -295406 -52630 95416 110725 -158275
22175 -333440 91241 76118 65572 -188035 8336 1733 -320522 102526 197950 48362 -130471
22163 -298925 -212310 -10217 14547 1747 -78112 -71170 -48658 54842 -96455 -204667 396082
22151 -205043 -76370 -111631 -82723 -18815 52165 174722 -228166 151389 -19282 -180021 -50037
22139 -41469 -111592 -204539 -188186 135313 94351 96754 121345 63151 -170317 5779 -323085
22127 -149380 34840 29061 -127990 -94886 155861 -220799 40403 -125745 -339910 -121263
22116 149594 238487 126037 114759 77533 -88943 -287627 22624 88816 101380 -189650 -126855
22105 -126855 -98487 97925 -30074 215639 -293349 -164714 -218913 -393042 117457 -190002
22094 -166995 -24593 54076 -225551 74280 -61326 -141484 -13356 -55468 -200052 119094 -248769
22082 -77881 155895 79818 -121428 -39983 -142568 126960 -373505 -22398 -68900 185320
22071 -167756 -43114 -109050 124757 240790 -349623 195644 -209564 76344 -388540 154147
22060 97836 20870 -35595 83029 -9659 -241299 -310926 -128843 -21947 -119625 -54643 -85415
22049 -85415 72987 -25512 24278 143190 -190544 -230004 -177189 146495 90582 -41115 86451
22037 133924 113559 -33537 -187877 -39337 -147085 -23155 202404 -130936 141638 -199453
22026 -441588 -79533 43363 194542 -75597 70056 58141 -134351 173540 -33612 13544 36902
22015 36902 -224304 180182 55826 -132447 -45927 -127669 -290210 -73287 -135275 -97904 -97741
22004 -97741 50839 -61311 87009 -89017 249360 -180216 -192375 -128051 156884 36108 -276469
21992 -278070 123944 99023 50599 -123552 -219710 -51223 -222531 -7508 -179258 -332311 -74499
21980 -297105 36505 -36002 -65957 -71714 -243880 -46516 5684 -312318 -310865 101049 142440
21969 142440 -132022 125978 -131303 -63281 -70369 41922 -71857 -248058 -49293 32935 -55641
21957 -177205 -107791 -312732 172644 -41057 214099 8778 -190295 -173949 -117138 -62649 -43461
21946 -43461 -208917 -97249 -354010 -266215 -149772 -18089 -26489 163268 2067 93205 349757
21935 349757 -115611 243826 108769 -13206 48244 -9316 -73226 79549 170451 -162514 -185530
21924 -185530 -17827 -321335 -241609 -52379 141592 211191 232609 4720 94177 140472 -45922
21912 -44741 77401 24876 55204 -77385 53288 134401 -23266 -231494 -125832 -266456 -235057
21901 -235057 -62622 -439357 -231346 84082 -365878 -116264 -18787 -68396 -121609 -43370 -32638
21890 -32638 391090 -20354 259649 -352684 46216 47014 -393191 178595 -404748 141741 -107559
21878 38094 -51400 43869 110977 -257551 -152672 -233057 41306 -218249 45094 156118 -249515
21866 74632 23681 438871 -291370 116297 -67813 -105150 -125051 -192713 -85111 -5546 23461
21854 98524 190292 -22232 56462 270974 -226818 -124895 -102287 -109041 430502 -52206 -87488
21843 -87488 251083 7612 115346 -160080 25668 -222491 -32205 93850 -194423 -317233 -106485
21831 -78786 -25136 -55578 96526 -264624 -95950 179427 33350 220817 -201598 -105270 198425
21819 152607 -147907 -149688 -70582 -162219 -57915 -199996 -105753 3122 5393 -103518 99117
21807 70924 -268834 -159363 73798 199938 82234 -153263 56812 -303391 252146 -18667
21796 -210276 182873 -141143 118801 -118083 42917 -73948 105766 -93388 135297 -147929
21785 41649 79 -255896 -319008 -170713 -55087 -68842 -133343 -22459 73917 83143 -216290 30129
21772 -127831 -16728 225957 55237 16458 -224694 159323 -379809 301087 -124597 -45746
21761 -222850 -161795 -103280 -179497 73053 167329 60409 -231396 -108948 -442363 20370 218975
21750 218975 79519 188867 56530 -181882 -220923 69113 -9689 163124 -87781 57633 -109065
21738 -311937 -8743 -190583 37463 -282255 118042 99280 296774 97852 85955 -97606 79112
21726 -210445 129339 -253244 -59666 46116 29310 -229536 -280304 21142 67361 -66033 61071
21714 11321 -253079 -188972 130676 -73751 148785 139304 99896 -57330 -28422 47749 -60725
21702 28383 -92486 136786 -261230 -9691 25238 56715 52703 -74458 -146120 102737 -256592
21690 172485 -151509 -22566 133476 80772 -351974 82398 3717 -213683 125531 -440046
21679 -184494 233410 -59037 -123471 -149462 -48166 112481 333874 195280 123718 -135066
21668 -202289 -109314 -37290 90793 -23595 232003 477649 -29316 -147299 -21473 -60997 -16197
21656 -175790 411374 -41916 242489 -33709 -214532 -290063 3566 95449 -315 -250079 -224083
21645 -224083 -476601 -148950 44761 42108 100021 21643 -22880 56129 -138764 -81347 68138
21633 -61351 -205638 221791 -217834 -47921 41955 -240291 -160565 73617 173937 -179698
21622 127465 -314986 126662 -297498 -19329 5811 -78339 -102687 196619 11692 8112 76160
21611 76160 133806 -264624 -99179 392427 -230904 -196479 100991 -208112 -58352 -26417 10408
21599 -162837 78067 203923 39417 -92638 32495 365887 -247798 373924 -57727 -253752
21589 -253752 74578 -189600 -27808 87869 1945 -271685 -96128 -350194 -370995 292585 209868
21578 209868 -98818 43731 -186818 101604 -141792 92871 155963 -152397 250325 -76737
21567 -451031 113980 91591 -83929 -25161 -222681 256017 -88061 -122219 112355 -95026 -134764
21556 -134764 -76427 103852 165774 235587 83999 -57770 -239792 -30779 -122412 -202183 -343117
21545 -343117 -17110 61053 -55081 138550 -110132 -93768 143684 -187694 93594 47110 -280196
21533 -107104 118634 334932 290456 -141437 -29141 143552 -126682 -166006 -178718 229998
21522 -84236 -142103 104167 52132 -72267 -214409 101878 116596 -294246 -205761 -6885 161138
21510 -143417 153166 189416 -39454 -78195 292002 -129927 255919 161621 -60451 -160151 -125664
21499 -125664 131744 -6581 -199378 -66319 264732 -75853 -327267 -396910 -16163 124378 -138850
21487 21956 194955 -19021 -127345 15667 -193083 -274637 114778 -86095 68110 119221 -233444
21475 3922 -20622 -62785 -246183 -157467 -46644 13144 -176482 -168279 211931 -207102 -33889
21463 331334 165376 425771 -252869 77801 -36208 -34868 371772 -136963 354274 185834
21453 185834 -65731 94410 -197165 -112203 -303410 48858 -254636 139499 -52928 111527
21442 -235853 35136 207230 -229641 -132806 -182997 170405 -8143 -127522 194673 -77536 -81539
21431 -81539 -217513 150756 -274710 121787 83235 122691 197255 36977 73047 139960 267390
21420 267390 -335187 -173278 -248849 -67924 -319030 10913 -19479 62960 92346 65284 69902
21409 69902 -45269 -506 18392 -163674 58532 -251569 -223519 -157329 -73563 -23695 -340646
21398 -340646 -76937 -255706 -30085 -55462 -148498 91462 -123784 195111 -104181 65395 -168305
21386 -321188 -182624 -71003 -39031 -17472 -37737 -123826 49983 240970 -167769 189202 7336
21374 -112023 179549 -70504 74495 113783 131259 -165158 -153831 -20828 -390788 -121299 31670
21362 -163371 -71058 -129468 -98421 -74360 -120037 194268 219762 -76235 -46746 -311107 45573
21350 16280 135321 -196854 -13286 223015 -319327 -368612 27266 158682 -224507 55326
21339 -22363 -84124 -86362 149960 -96176 -88434 235147 10095 253489 126869 -91375 -225021
21328 -225021 -69605 149576 67435 -111548 -84285 14322 -115846 -126203 -117411 -384092 -159765
21316 -340542 -66048 -134319 173214 -150539 -39834 -297989 -33956 -37922 42434 17575 61860
21305 61860 165054 -75414 288015 88013 -259491 -113263 215413 -1220 -158054 -249446 -165923
21294 -165923 -55461 -383405 122406 -235038 112387 10196 -220498 152800 -59850 -251942
21284 -251942 76708 -348412 -66732 -589173 -94787 161242 81410 179166 -102349 -179149 -272107
21273 -272107 -239923 -85715 21551 8257 186573 146362 -63101 -156721 -173500 176474 -4039
21261 -78737 -106339 118404 -150815 -353888 -231682 -117430 80978 -35109 -58249 95007 -141201
21249 66218 190519 310800 -6251 -158362 -322100 82435 -82871 431805 64343 224118 -13501
21237 -319743 -99836 -98088 -152154 146318 -90011 -147341 93353 -414869 -151928 113263 -303223
21225 216364 145345 -74511 -256111 -135724 -258380 -163201 291813 -28881 296161 -181680
21214 -120650 -222758 84874 -345015 -60846 -327198 -33764 1404 -152185 -88901 -87278 -258177
21203 -258177 -83463 -40748 -45010 102159 -30598 -341768 -114213 -118734 -67453 186894 53802
21191 90111 -4525 -149699 58867 -11445 -234926 -141901 -182384 198117 57499 69938 -122384
21179 -128275 -59400 -68369 -181075 -42378 51594 54497 -126869 -232777 -266038 -31347 96433
21167 -286858 -10584 234101 260802 231331 -114970 73004 215357 -274318 274308 182815
21157 182815 -103983 -178051 167183 -156684 -55710 -112137 -205665 -356975 165951 -190718
21146 -239064 -26469 38827 104833 -232980 13150 86927 -33412 99895 -306060 -256413 -41710
21134 -98339 134605 240268 -13640 -197704 -47105 59473 138825 -169242 159500 204689 326317
21123 326317 207238 -40449 -213882 -275368 -116194 210818 -99940 112506 16499 107374
21113 107374 166080 31592 -85283 10762 63400 -348600 246061 -25336 -174863 -255734 -179489
21102 -179489 -36116 -126658 -194577 111647 85171 2515 -106714 -39766 -144301 95313 100218
21091 100218 265147 -181912 -83460 -416693 -12920 15985 -8675 107051 206160 117248 -19119
21079 71098 75021 -39911 -98785 600032 15377 -49686 -169911 -374541 46155 -532127 -261754
21067 -256664 -344777 -2522 55431 -64413 167656 164822 -335365 22046 207306 -275589 240876
21055 -2407 -162845 -122878 102041 -302708 -114604 -46861 -125173 -457863 -26923 -208612 193048
21043 50084 -147235 -209492 5793 218726 110719 -151618 542973 175496 177295 211302 -182869
21031 -233368 -32376 301617 -262 259238 261271 -281947 -68855 -218446 238127 -143962 -350923
21020 -350923 57629 -288694 22387 187671 -178053 -125764 -38866 -171460 -108465 191420
21009 -151908 -21803 105701 126346 232881 -334204 -223390 74696 -46443 81508 99871 -136703
20997 -137590 -301068 -427765 14244 278187 -99134 15771 -248924 190461 -479029 265179
20986 -185876 52871 -186057 -495316 -49899 -505895 -264356 -49443 -153483 -14082 -33288
20976 -33288 -83547 -16168 48044 -156412 -206637 -49151 -48820 -210438 35768 -319139 -188069
20965 -188069 21254 49071 106420 49110 -160463 87824 -96396 103981 291827 -20684 131532
20953 204298 194829 -40368 -399990 176293 93094 43396 93904 45340 -301736 104215 -385347
20941 267361 -200501 79321 -99321 -21509 -216919 -43516 -450518 -174251 -286364 113936
20930 -114175 246964 -28696 44092 -156682 -198623 -91456 -409593 -278394 -118350 -92253
20920 -92253 -110543 103367 116863 116113 -75830 -211637 41209 187086 -266222 61318 -23703
20908 -253445 -87127 -72928 -99850 164050 -23506 -30763 120456 57755 -96387 14588 -300209
20896 183107 -104076 180347 57317 -515997 -62044 -6259 -199847 -419436 -24045 120187
20885 -141424 -89591 -269480 -5714 151483 -110964 92552 5173 -98825 -17865 -125697 -126061
20874 -126061 -44020 -181397 -278566 -89816 -75002 -67637 -470017 -41398 118805 -26125 -290389
20863 -290389 10611 -415709 328977 3655 -163030 334236 157060 -44420 6553 344109 6570
20851 -372157 177342 6463 -740 -111753 212154 -216162 110411 -252319 102975 -19945 77890
20839 -34388 -150000 -129993 301531 -276503 -269823 121600 135226 25684 -171931 289 92099
20828 92099 -87210 55749 28693 -44858 74201 -119146 -82295 -222929 -71467 -344165 -164431
20816 189017 -199349 -86995 -3295 327555 -72694 -291781 114927 -118282 -198832 -415370
20806 -415370 -159522 -115209 102074 -49789 -128963 171063 128794 -61517 61642 76344 6096
20794 -222195 161340 -162088 -120249 93769 -329800 -44973 1683 106890 9754 -227683 -101578
20782 73397 205310 21946 -242164 26099 -261132 108045 -50664 39736 32034 113956 -169535
20770 228041 74241 -162883 -3037 -42469 85435 97958 151816 174073 -228759 44570 -208125
20758 -78703 -192294 165234 -4242 162183 -35072 62182 -96446 -6926 132166 -79182 -296549
20747 -296549 -150418 172458 47573 -4448 197174 78339 -58533 347 -441781 -112668 -211337
20736 -211337 -82025 -443619 -155740 146327 16058 -195810 -270835 122626 -254006 319692
20725 -17690 -149851 -4543 -391135 303849 -34712 -162237 -175500 -31020 187758 -308812 1599
20713 49109 68638 154507 -120791 -177535 -97370 -103571 -204579 -161426 171159 47973 -28493
20701 -15473 -62652 -48185 233750 55651 -139337 -110918 -227958 156143 -149602 -63238 370036
20689 -255626 -18557 -59007 5153 57407 87891 64488 -272681 -115329 139618 -282896 11179
20677 -174011 -191937 -109287 -155743 -80804 -167406 434105 -26206 84796 -186161 -112448 -171518
20666 -171518 -281940 225842 -199823 -76303 183686 -5523 103233 -68679 -300373 69926
20655 178440 58713 -175501 74354 48090 -307943 -282368 121550 -89853 94667 -466608 -362233
20644 -362233 93410 -188902 68841 57314 -183684 102631 240388 -37877 -123503 -178805 -141847
20633 -141847 58324 309450 -36147 -53879 -95378 -158286 -77122 63950 36544 71452 -212493
20621 -36166 -303349 126235 -140432 73338 -65884 -218064 -103809 -326555 -11977 -27688
20611 -27688 -234053 837 13728 -44968 45170 -84953 -18936 -62097 -217429 -84475 -220747
20600 -220747 -288955 -32642 -294745 121683 86598 217673 -152508 -260215 -224899 194730
20589 -46263 17508 53453 162400 61784 -125691 -215874 -143680 34351 7750 -118937 -257388
20578 -257388 -180373 -62611 91204 -88538 154504 63192 -112644 -44680 -293682 -175276 153049
20566 -190142 7870 -142490 113523 -33252 -85844 119177 70387 -150382 130508 -135044
20555 -13179 -68478 -74541 -169750 60402 -76430 -147548 -33546 31336 151724 -331881 -3417 124908
20542 -83668 49092 -164261 130381 -151015 -95987 159428 -306902 -234793 -3226 81400 -132152
20530 209075 -175420 -164630 197316 9333 -210843 23270 -329823 -94772 11182 -189718 242576
20518 35339 -98059 -83382 -227516 -179687 -337187 29627 20426 -80857 -95618 357710 -218990
20506 201784 -182170 -276209 -423565 44045 239092 219242 42784 -185891 378618 -259911
20495 -219927 -396991 -103232 143931 119420 310462 99538 218608 -103017 -49020 101675
20484 113343 -76274 -193635 -200453 -172086 194535 115051 11673 51192 -180902 193494 -180716
20472 -238227 179343 -41219 -59106 -245387 136654 201260 144446 85297 10551 -60848 57323
20460 239543 -9273 -249701 -132716 134822 20129 -65130 307690 -61280 -152399 330052 -37816
20448 249859 418391 -272313 -207430 -28360 -95742 -104325 -82043 135096 -12398 -175548 -132655
20437 -132655 -35997 -205127 -131469 -11621 -339440 -126008 80975 -150523 141753 109371
20427 109371 -87370 -47611 146189 272 -516142 164572 -92995 -140339 -318198 -7713 -258206
20416 -258206 30390 60032 186108 -149884 117996 -33912 -22980 101194 -213713 -126253
20406 -126253 -11131 -189419 3798 104983 -222896 -45354 -237436 -64936 82996 -106224 228661
20394 -20929 -340877 148662 -124246 -63679 192866 -143668 -92490 -34545 101908 -310286
20383 45283 87683 117877 -357444 -59686 -14134 337035 235522 67718 -229992 59607 192903
20372 192903 95146 113672 86942 -70370 -80100 45970 -150631 -27675 -161695 -332578 276503
20360 52581 243318 98100 -306034 -572127 138003 -97750 -150425 -48663 167671 -189305
20349 133203 69922 -53629 -245310 -439762 272445 237426 146829 -53062 -369318 187538
20338 -33551 106123 -112354 -350228 -300592 -171743 15309 -177316 176028 138644 -145463
20327 -74785 -228604 224431 132114 -48669 5417 -112363 40796 -108326 -125245 41527 184713
20316 184713 -76763 -60004 -31571 47137 70077 -421630 -99432 40566 -206069 -7004 62381
20304 -328509 -203348 27110 34586 365590 269971 -26564 57695 55199 -73129 -179346 141410
20292 169067 253719 -88220 80435 -203504 13012 -242792 -233036 -173216 181844 -57521 -132489
20281 -132489 -69540 -273219 307791 -188265 79609 -34250 -23847 -79818 58941 -223988 128479
20269 99259 148072 -99891 -144644 -29854 -261498 -7860 -67243 -57039 -229561 1779 184903
20258 184903 -64351 29457 2854 -259664 146782 19446 40539 -132730 88887 -309597 -141656
20246 -15657 -470375 -159445 -2856 77067 -140094 -2730 27808 -103010 -71762 -234683 -106294
20234 93240 -118624 52081 252758 55061 -250435 126950 41321 82215 9666 11020 207639
20223 207639 362075 93052 -343370 -11699 -22463 36172 -132953 28025 -127086 -457321
20213 -457321 50308 140685 -121458 195975 135191 34563 71246 -109537 -365147 -24563 -71435
20202 -71435 -314527 559246 -87578 -288309 -193188 -74796 -21661 25659 162448 -302319 -336227
20191 -336227 82585 -98264 -64907 320433 -304906 246869 -124143 152203 -356621 -46712
20180 -73808 -10789 -3771 51341 -368698 -198149 -187930 -317340 111502 -46213 -391748 -196779
20169 -196779 4484 -41164 -52434 -82971 -79513 -159084 20650 95963 8332 31683 -196221 -83892
20156 -2981 -159736 203637 36768 242295 137093 -64224 -163121 151612 -208527 106257
20145 -58617 -656676 -75074 308458 -438318 -260862 125576 115696 -71597 185987 -245887
20134 -138756 -51277 -148109 92419 -230928 19086 -90181 93073 337969 -166046 -311241 31161
20122 -104159 29845 -210655 27248 186038 167276 -105546 178505 -154134 191671 -120470
20111 191930 -58279 -111560 -133071 62654 -41316 219394 -69765 -6986 -150378 -36986 -360630
20100 -360630 -39381 -44036 -238658 -167994 158331 -150821 -56077 -55103 -135112 294717 -408385
20088 -4757 6986 -142911 -64308 187140 -174862 -527544 -41336 -221099 -169929 -230899 215179
20076 81357 -20332 133390 -159325 -57904 -254731 -129429 -43673 74760 32209 -467595 -88440
20064 -262828 -105068 241445 -142925 102831 184015 1794 -26837 -194063 -25269 -274733
20054 -274733 70798 85098 120308 2296 113781 -191274 -203658 134659 36168 -7509 339774
20042 -115960 -188298 -248064 -55132 140715 21302 -91094 -83378 -327703 -84081 -44917 118219
20030 134049 -60752 49398 -225154 164155 203395 -156193 -397035 -313336 15894 -258132
20019 194542 -217503 402091 -149352 -349908 207170 -224209 44541 -44084 -78241 -83713
20009 -83713 -164435 -184519 3744 164513 92173 -25774 69939 25082 103206 51121 37629 -80688
19996 -228134 145133 74288 -50655 -189437 -72582 -30726 -141306 -157133 -246969 -379259 -124395
19984 -9131 -38121 -180175 -209352 69175 180084 31248 -58805 -142219 -167280 17933 -48338
19972 74567 -173527 69317 -249739 -144378 -106044 -135875 290588 19074 -18827 104778 -101643
19960 -143109 -304839 -76024 -142067 116425 -128692 -184230 25992 -90291 -85670 128135 -118863
19948 -102855 168552 -86630 -348415 -430927 16006 109874 -127474 197817 246297 -96089 151244
19936 -281799 -263222 -411991 -291498 -160188 129367 8764 -58292 81209 -303974 -192027
19926 -192027 101311 21567 442355 -249982 -181325 35068 -149347 -365256 -3452 -90300 108574
19914 -13029 -60592 262078 -117706 -46391 163744 46451 -82538 -77818 216274 183392 -160702
19902 5972 -49115 -266204 -116049 -160204 -369258 -10099 78900 64998 -185919 -100902 -215816
19891 -215816 47767 -124818 -20643 -156422 141685 -101162 -95898 -281711 39291 62958 76962
19880 76962 -131875 139719 256502 144313 143531 -269376 -115468 -41506 -124995 95174 -179840
19868 -207613 -1392 -196039 35972 -55895 -118477 167104 -53404 -144503 -144178 -94143 -256281
19857 -256281 -180215 -235753 163503 -125104 -246557 38862 -173316 829 121525 57150 122808
19846 122808 -174068 -305240 100931 75674 -146196 -357531 -221183 108790 93522 -105734
19835 -105723 -113427 -123865 -125670 220326 16271 -510586 117504 -88104 -24868 -336814 183909
19823 -167505 -188093 -260649 194134 -101689 -75260 -160552 128073 122092 -263914 27561 -158096
19811 -252334 118374 -410856 77134 -302284 272988 -82737 -155188 119956 -3832 -66210 -155639
19800 -155639 136523 -313301 71462 -177781 131355 -254496 45880 -110288 -142332 801 -283941
19788 185363 -203367 12701 -234414 -191104 -14623 -79678 -99051 -385601 -143591 -6713 16506
19776 -43423 -51328 256530 -45447 -20097 -148180 91919 163422 -209744 -164357 44737 257654
19765 257654 112643 -779 -107716 -109429 77941 -399804 89427 -87079 -2726 17530 -439131
19753 62685 33548 -3762 -247016 -94325 -110657 -115439 -91451 80665 -80678 -85790 -431217 250465
19740 79739 -138931 20133 151152 193099 -222752 -34749 -270418 -191280 26651 -92711 -41143
19728 -235532 44836 8307 436337 -74020 180987 77261 -126477 67816 219094 254994 380048
19717 380048 -55240 282486 1231 -128871 104558 -143511 -251674 -272056 19032 -5372 110866
19705 159156 -203827 -132708 69986 -128085 -30191 60676 -293506 183937 45165 14764 -241345
19693 -174964 -237102 96412 -317395 -362778 -188352 95402 -85355 -1030 -71111 -234744 -324673
19682 -324673 -225924 -102011 -120764 335980 -302669 -190379 168334 22070 29399 48717 245594
19671 245594 -70052 90715 151793 -142852 -211757 -305748 -114032 -13784 -115245 43875 -84300
19659 -16599 -192523 -259583 -284667 5912 -13926 165679 -277978 -56154 -355952 -101368 84862
19647 64877 46208 6112 -539055 -131239 -18874 174437 -120669 -61678 -197357 142056 -39101
19635 10875 201586 -4777 -337074 227850 102521 -113148 -160608 153008 -179690 -123618
19625 -123618 110051 152165 -12877 -55750 -108207 -14674 144299 -213503 -77765 -80172 -49903
19614 -49903 -270761 -66130 10042 73455 -34657 -56436 110398 -181564 -90018 330403 -59842
19602 -22963 -33455 -320057 7792 -151113 95302 162725 -6077 -164788 162679 89107 -241397
19590 46051 -16088 39394 -275201 11645 -194500 -149852 357299 -251491 42574 -132631 -150813
19579 -150813 -168518 -293831 -75056 -80370 218523 20107 -11189 -8864 -406238 -83529 -68428
19568 -68428 -211346 -240868 121342 -263177 201492 224119 54315 -256586 -183137 -185494 19894
19556 -12657 -486778 -182353 25336 -361553 -88762 -41208 -74255 -129894 -150141 113211 -39753
19544 -92802 234250 -73439 -232960 -111604 -125676 277421 -188379 85900 215321 -118828
19533 138216 -52739 198115 4193 -274669 214377 378229 -475686 -396251 -9960 41756 136155
19522 136155 -215200 131105 -86636 101572 39260 -98109 -289997 -16154 69519 -82224 -321554
19511 -321554 -326905 -50617 -28764 -55345 292076 -10911 127534 -21716 105910 -42596 183085
19499 7167 -150801 -201778 134080 -232390 37815 -170594 -77506 -277084 -415941 -25582 -69845
19488 -69845 -68548 222125 250276 91585 -43655 -245697 126828 -42126 -557294 235479 -40492
19476 -44439 -254473 -20677 -198032 -149850 133720 -170386 78833 -241949 17223 89458 -268090
19464 91 -55426 -49508 96112 -123163 -590 -195786 -281360 -27278 58054 -152852 -83189 29773
19451 -58749 -172016 337713 -383540 -45432 128044 49242 -353035 -14734 -185217 73966
19440 124841 88014 -282275 -117253 -197612 -7219 -43595 47283 245118 -103178 38956 146890
19429 146890 -210519 -105176 107634 -149774 22110 -195889 813 -33601 -241269 -152192 53069
19417 -123301 -70833 -101350 94668 -186712 -43407 -147231 -44419 -111571 -260919 -42391 140141
19405 61464 31673 147872 -179285 -212422 -173633 90084 100480 4710 -276757 120997 -43860
19393 74104 58124 -107623 -46978 235353 133492 92447 248858 151763 9597 -219162 11189
19381 -249712 -149013 -340965 -23372 98938 -626270 122729 -260831 64987 212600 325818
19371 325818 119144 -73340 -152183 -388658 -398735 5142 58504 -294895 134310 30795 70277
19360 70277 -133335 24182 6182 -90080 213512 -286723 51056 -97852 75284 49573 -18926
19348 186723 -276693 -33915 46167 38998 -136323 -210936 -332616 -326169 -229642 68384 -128754
19336 406120 -273962 62205 7975 23657 291852 -133710 296122 -150487 -298044 57691
19325 -287490 -207216 -71297 -75318 -328575 -128431 -139192 99333 -125106 -34039 -482771 23811
19313 -63766 -284694 156155 111592 120744 16776 185912 1949 -47229 8451 -96074 94519 -56344
19300 87559 46474 -314027 19892 -311509 -8927 86242 124260 -208491 -246821 -199798 -188900
19289 -188900 -94399 224065 -88622 73705 211623 -293230 72077 201565 -73162 -56353 -178230
19278 -178230 -184217 -241073 -62029 259452 -388264 -27903 -69293 -289149 -81347 90227 -77595
19266 118550 -144623 -44908 62558 -171539 -97890 516151 -159734 212322 159347 -39894
19255 -102549 -359211 -191856 191425 -178733 -152689 -65451 -100908 -476148 -134358 -132033
19245 -132033 -130829 -51682 -336380 -308168 30748 -38107 -81659 -256634 -117849 140406 415513
19234 415513 -12531 60737 -235645 -111637 -175647 -26600 -225247 -131179 -108563 34003 -156406
19222 186760 9772 -420603 156885 -111504 -103104 38190 -161641 -270582 -215632 -382947 -157018
19210 -193851 -123633 199878 107070 59635 -240887 -211726 -251563 38712 -51078 170497 -2436
19198 110664 -84011 215886 -80059 33000 176286 14563 -124042 25815 -2550 -172848 -220962
19187 -220962 360044 -288480 -93350 202688 -92894 -255128 -49859 -23894 434201 -288984
19176 118741 -69685 -135785 40820 -95891 339858 -55000 -55991 -342843 269599 -39778 -13819
19164 -71141 83302 -86744 140990 -214026 -97108 -268924 -182139 -94843 -39001 65595 254137
19153 254137 20074 5873 7789 -130112 106169 -152844 352204 209750 -95672 -523878 -168454
19141 -131073 -85350 -103968 -350842 90132 -51982 -129223 99982 -38654 -129847 287386 42197
19129 -143699 -142554 -1736 -156981 274224 -96672 228348 78379 -120586 -315565 -224922 -75147
19117 -297073 -284484 72313 131950 147560 -38389 -35696 103936 73556 -34297 -110879 110776
19105 8576 40543 -418090 -58192 326845 191041 161514 177543 -251782 -139672 8402 -29881
19093 -237703 191050 35886 -505116 -243470 187315 -60992 -339365 -141549 -139044 -185062
19083 -185062 -203470 -131330 -79219 -103635 -117226 10218 46861 68709 -383747 117305 -37358
19071 -255253 -113472 110451 -120002 -56416 169152 -21574 -229170 -10440 115977 -241122
19060 71957 -89836 276485 116189 -314175 -351059 247636 -459634 -52655 312552 -268536
19049 -69945 119216 -103312 9988 -38682 99527 -306428 -84233 168541 -246066 -26575 243599
19037 -8720 105787 -91789 28146 -69720 -219564 -85173 -10357 -112091 -183996 249350 335104
19026 335104 217115 383545 278230 282511 -157308 -65610 177189 97558 107448 -28056 -84062
19015 -84062 320905 1308 65902 80083 -164432 85705 6296 -87929 126965 -130816 -203440
19004 -203440 -88125 -163729 -267602 -210495 -312080 323146 -223178 71575 -68651 15307 -109169
18992 -330043 -116910 -35461 -86103 254055 36678 134373 11447 -142481 212163 343141
18982 343141 163284 90672 366039 -132280 66014 63844 -313226 -14886 14432 -155305 38062
18970 365324 19372 -335621 -287490 -221203 12254 217334 -161711 -65905 185271 -105426
18959 -155954 127656 -63302 75044 39760 83623 -76043 60743 23404 -169225 11174 42059
18948 42059 140416 19918 -151465 -145732 -104020 49052 -318022 122359 -142395 -148222 -79212
18937 -79212 -228150 -96095 -30401 1927 -236620 -59110 -94975 -81058 -179775 -238346 -327749
18926 -327749 -282290 144663 96745 -39729 38183 -30036 -156233 -121294 -177457 109092 120504
18915 120504 -236648 191493 -221246 -19557 69632 -156488 -176268 4396 -340776 -269620 189540
18903 52695 -120136 -309932 231656 -494947 515451 9963 90472 -88536 -320499 -96348 -10168
18891 -398492 -19006 17301 -290508 -255808 170703 170999 16422 -67678 -1862 5990 -19521 -103490
18879 -103490 -101061 232138 137779 -531259 -90144 -82265 256636 -111226 101389 80593 -296538
18867 -60182 -58734 -24110 -140198 -188280 74556 -368351 -195041 203768 -103448 245357 45020
18855 -3355 -53397 -2824 -190573 -102821 -143772 -43143 328185 -107827 492757 -100661 -74983
18844 -74983 55742 79750 161945 61458 73100 120135 96216 -358277 146348 -191275 -156338
18833 -156338 -278549 -7934 -1851 -178396 -112631 -272327 -59855 -90816 39882 -4058 -82896
18822 -82896 -116225 -105888 -33767 -71773 -96916 -49544 -273092 -57631 -178812 56645 56397 54987
18810 54987 39337 90203 -339943 317409 141402 -113342 35658 59233 143251 -496960 38163
18798 82600 -5403 439237 112414 -92665 100617 8711 -118607 -159815 -48260 -201464 126712
18786 -122727 -91457 100402 -19662 18986 -193107 -53975 4402 -91139 -230555 40925 -205777
18774 -126766 -30806 -78295 245313 -28251 167778 62586 2878 154921 254397 -27755 -120869
18763 -120869 -47910 -141136 263303 47629 86239 -165393 -447229 24323 -108078 -180332 -219619
18752 -219619 149559 146866 193113 86994 108575 341071 -210188 49188 -378577 -144126 -124380
18741 -124380 -7131 75854 -205979 -141589 -51940 -389292 -432037 141265 -33378 82800 -28081
18729 207054 161703 -73650 123498 -16550 -154578 -97946 -243871 70912 -168710 -147861 -143865
18718 -143865 -258006 -99720 11927 -199826 -215955 -168386 234908 -154468 -161118 -84733 -32387
18706 15384 -233015 -150804 188424 -35228 -198452 -158835 92943 211326 -216197 -291073 -192982
18695 -192982 -290980 114011 -234380 97016 79020 -148936 -74023 -121385 220615 269544 71242
18683 -294412 173054 -248597 -131261 89936 -125612 -259657 -72763 244721 60458 25248
18672 -115686 -38830 -96793 -156569 -381742 73334 212449 209152 -102256 -402693 200836 -2239
18660 -60006 -164966 309621 90714 154869 -224521 56987 -172260 -312617 -78082 117288
18649 168862 -115794 -94754 -214050 -318737 -133332 -329328 -82026 -187979 -13900 -150538
18639 -150538 177607 -121517 106794 214248 126084 28329 -188769 24669 158223 171768
18629 171768 25364 213363 -304403 -178916 166816 -198850 -262871 30016 7325 108360
18619 108360 -103293 -501663 186930 -158568 145118 -305075 -223691 199567 -61678 -71172
18609 -71172 -991 -240835 -52920 66000 21482 79656 -76848 -153524 -32938 -109971 252400 13694
18596 200512 397975 -90294 -160239 74216 -258015 49704 -27872 -225730 -371047 8523 -421197
18584 -48633 -456108 -88646 94059 290870 -312394 20406 -308691 -179178 -74684 -333233
18574 -333233 221868 172389 7877 -303685 -79703 -142241 -192084 23582 109104 133849 301348
18563 301348 -79845 252928 -152726 -70798 -134188 -8435 -215999 364054 -71540 -91709 -216426
18552 -216426 4461 7523 119343 23830 -244992 -25848 -303296 188339 -12035 -54584 99076
18540 -91435 -113434 -145192 -64764 -220272 294998 -980 -54716 -70563 167401 -117725 -244093
18529 -244093 66513 12315 -250888 -92156 -118271 43437 -61498 -159917 226712 107278 158947
18518 158947 69108 385195 125721 -192241 -242609 -35919 -202163 -197258 189668 55439 115172
18507 115172 37030 30705 35074 -286463 -185352 5322 -15910 -331596 132516 168051 -20770
18495 49413 167454 22568 -204368 -18396 -205741 -39624 -121507 119976 -17881 -162642 53609
18483 123210 -268287 -301984 -27320 -189382 170822 -127704 -458195 169602 278440 -7116
18472 -157736 48165 19405 -307584 -151003 -143601 165854 -422749 118687 -149757 38691
18461 -172254 226608 -294594 90693 -77361 77218 115865 48105 115353 114492 -220111 253417
18449 -118097 -63498 -250149 -156664 20359 120190 162533 -131093 -346269 -34282 -135361 98006
18437 16433 342299 73609 -255183 -19030 47645 179223 -149183 146843 103800 -69552 -323767
18426 -323767 -219291 26868 317629 65063 -393579 243060 99941 162052 -224054 -220649 -162107
18415 -162107 -302275 -78462 45217 -79941 -425667 3787 -221453 -102592 284347 -158757
18404 -138537 444821 -60524 335674 35739 -8651 220036 60212 -132644 125487 -185307
18393 146954 48041 83762 -82453 -209868 212340 1928 370271 71178 -56985 -147296 68811
18381 -54124 71517 27969 135186 38964 -369825 -148110 -197336 -46547 -283203 160941 -29998
18369 -160674 -190058 58958 -15431 -375591 253740 65036 117317 -86733 -167467 69415 -137224
18357 207994 88943 -30705 50971 -93632 356525 2823 -212271 263927 -99234 -41940 257429
18345 168653 -4410 52122 10709 -99595 -238084 -252688 -81815 -30247 58953 26011 119625
18334 119625 -195944 -162543 -243736 -178270 34846 88274 -256441 -93340 -385506 66743 -109883
18322 -236292 -1263 -59959 -62115 -14972 -263182 -27279 260261 -32552 24663 164917 -27329
18310 155086 75680 -180167 -256229 -319527 10276 -285734 -12974 180207 -52811 -29028 -69381
18299 -69381 151567 -127199 -244853 -228305 -6508 -279677 -156447 -66245 120758 65981 61584
18288 61584 -231387 119093 -114946 4369 -52763 -159781 249360 -237721 194487 -202745
18277 -358312 54001 111404 214713 363012 -504719 155941 -42131 -294164 -331930 168433
18266 65929 54707 -144658 51165 -334166 -122948 147478 -166722 54273 -241647 -98357
18255 139646 109198 -28918 64843 -143247 -176749 65288 12695 -150256 -285129 -113865 396561
18243 -154775 144679 -142984 -120074 -341355 61084 85268 96689 -226680 -24171 -582044
18233 -582044 26208 44258 -16459 116242 -197730 71877 227703 141189 -208454 374 -202809
18221 307841 360649 94233 211489 -169652 -34357 56156 -64533 -92696 52145 31239 133779
18210 133779 280099 25612 -279699 -223148 81957 127958 106427 -37943 -7615 97183 -199726
18198 388290 95388 -35044 -292524 -77914 41998 -314121 7045 -282088 76367 -81867 -45574
18187 -45574 87930 -131684 -62028 182216 125501 -281131 -146623 -122064 -447061 -295911
18177 -295911 -70682 128687 10637 -10012 232270 63627 -21497 -216081 -157338 25800 -14528
18165 141541 -297994 -194259 26545 212115 -167312 299741 18960 -33561 45912 -48869
18154 334024 233461 176138 -68588 8889 -121336 -136796 88307 -106815 -16090 250283 -173834
18142 170524 241865 -71936 -71767 -92428 269706 46092 -74778 57546 145099 -131065 97867
18130 200922 24381 47803 -266695 181906 -291917 341202 -84595 -179493 -224363 -6171 -370287
18119 -370287 -188239 101651 50856 2304 -270587 -46187 12207 -87970 77865 -112505 -31473
18107 38807 -233739 -289375 235718 120646 69860 -157048 -102756 155384 -175939 268705
18096 -157085 -90153 81337 85541 21511 44317 131503 33240 -121725 55169 -173848 -17982
18084 -231251 -127044 63776 32817 -9438 -80822 66352 -91215 -126456 -101196 186334 189675
18073 189675 128303 -20461 -183142 -174876 123868 188339 -89770 87964 -274831 262316 -101765
18061 291783 24229 -84724 226782 -65122 -61182 -178785 -172965 86003 -251076 -69491 -37808
18050 -37808 116720 40768 47333 -199394 -257287 -134928 -6764 -129723 183179 46598 14714
18038 1648 -236378 -99452 -274904 -290754 -132402 51405 165350 -152214 -60152 -350340 -22450
18026 198598 -140228 -280622 15248 334827 46180 -78366 -182770 56297 -240985 -365867
18016 -365867 24679 130097 -101390 -352282 -89981 283616 -133235 127388 289559 259059
18006 259059 -5931 -111257 -331140 -114011 -1268 -118264 25791 83711 114147 212031 115855
17995 115855 -267121 12196 -9909 67393 84226 -43101 -268313 -45292 101739 -41451 70445
17983 108056 106070 -371539 -147767 -173411 -151870 -225417 -374227 -108157 -322346 135008
17972 -128548 -427246 -114532 -16752 -272091 99738 -97869 109831 173046 -60023 51220 -18164
17960 141156 390124 49280 37243 -201283 4080 59233 -47245 -48030 -31649 -234858 -298336
17949 -298336 -335283 -90365 -194099 -360990 318717 18008 335959 -12031 -259 103099 -157314
17937 131919 120697 416773 147089 250376 -45880 -51841 50081 -21833 -245874 114007 115425
17926 115425 152866 256805 225454 -74402 99834 -137341 -25881 125086 188076 -106764 -25754
17914 32754 -14060 84370 2843 -260858 109920 -240534 233040 -70691 85466 76664 -534665
17902 3821 -283919 -119837 154666 -77123 -144507 -227645 111189 -222324 -107909 -7709 -59739
17891 -59739 4010 -111905 87098 239029 -21154 -101814 6051 10903 26055 130894 94263 -53533
17878 -50152 -53307 -213570 -189947 66589 -21151 -249248 -165274 115473 194463 30190 -155586
17866 107210 -173048 1718 227239 69585 71166 62320 270908 -215333 33599 -50820 -193243
17855 -193243 178787 -157216 -159576 28038 -82110 141662 73062 101767 -178508 137792 -12817
17843 -112178 17512 466708 147803 -269452 -87957 -117148 -3967 91462 48788 -133719 195332
17831 -74437 -162571 -80576 -367502 -25966 149303 -246986 -205028 -80017 -292359 223334 -72722
17819 168040 133433 32250 75606 -68797 205946 -102438 -132402 -96958 134991 -60298 196836
17807 223333 -160104 -52785 227453 -219047 2010 -352231 -93134 -255093 -157617 73136 16646
17795 58391 278414 163124 86026 -205304 157059 351683 283369 96374 -8231 320761 -144614
17783 -72517 -295091 81208 -390021 221740 -15476 -26062 -91893 209144 -252177 -142323
17773 -142323 -64996 15567 -220682 255298 91277 -77472 -30352 -37928 -207019 -201964 24591
17761 132546 22098 8695 17835 -58627 167670 -123184 -367057 -25998 218398 -300930 85107
17749 -66223 -9761 258896 90182 46996 18698 26305 87837 35410 -58501 -18372 -24486 64972
17736 360333 -230568 -208026 -207532 -156072 -28237 93454 -137553 219204 58191 40698 280172
17725 280172 -288344 93013 -277228 222867 98193 86725 92104 -129318 -31091 -292457 314934
17713 -48708 -134208 199097 -49141 272337 -300108 180693 533807 -156794 19038 205142
17703 205142 -63365 157559 -158514 97376 270349 13719 156039 162521 -71884 -9002 -255115
17692 -255115 80987 166519 -261134 -182414 -20036 77875 221192 189855 -69315 12330 -77690
17680 86883 -101980 78581 46373 133982 38407 -79847 108867 12933 -201812 -65504 32770
17668 154828 109761 107527 -8300 188438 158158 -41111 -10371 -62743 33115 202352 -225260
17656 277168 -163861 26472 19573 112878 -50701 224874 66196 200387 -279048 -42153 115298
17644 178503 -67615 -53712 -403381 62717 -80827 -37188 22923 194111 -332053 -181633 78191
17632 133453 105755 -136886 24632 307775 290488 69804 -183919 26413 -376465 -284826 121382
17620 103632 164347 295769 -226449 -90807 245316 -75773 174079 -28222 111522 -106820
17609 -288461 68656 -37814 273745 -169097 293125 75924 288673 -68872 268090 92771
17598 196580 -51945 237157 52698 -23621 156133 24111 -39044 129137 40349 -85545 -88648
17587 -88648 -161329 62379 229129 153770 140697 171494 -31918 135806 -60799 -55539 80236
17575 -162079 -181800 63555 134849 102820 -271466 -23381 202111 125799 177303 -263578 198332
17563 -157099 -3628 -932 197936 49512 -139579 209053 -130626 -128153 -120204 -16562 4453 48771
17551 48771 -78456 112067 3861 238369 141121 -87455 -86587 195581 232445 -263633 -186110
17540 -186110 -956 -16153 -161864 -80155 206220 134611 -68127 -75666 -15997 -149576 -225271
17529 -225271 -209896 -8378 133225 -42121 -48064 58953 -27192 -98144 275860 53055 115498
17518 115498 151078 97079 297622 -291198 -16339 489026 -59154 139141 -12007 66050 109242
17507 109242 148584 263403 350353 59327 289662 -221224 83902 181239 -22055 -116021 282223
17495 236357 390968 -19467 -42771 455970 61355 -38216 292197 -179220 4995 38193 50100
17484 50100 353346 -24052 192539 167639 10031 -42874 180374 390309 239114 -360324
17473 -8914 253254 57431 154699 171507 249635 -60009 116854 122247 232479 158513 367352
17462 367352 -69587 12300 480084 -200830 113774 230871 -18955 151916 459209 113295
17451 216703 218661 -116996 251223 -151592 -56092 227051 76640 119092 304294 123324
17440 46953 434555 215782 348066 232266 200107 99457 -99630 527010 509325 306276
17430 306276 55005 269323 371837 158281 28068 180616 -233506 339535 160970 -320932
17419 255952 263325 315024 -20522 254555 342458 143006 69412 519827 329380 21671 243645
17408 243645 -31559 -163564 172197 -36460 -73612 287617 287615 623529 79014 -169356 384103
17396 245683 -166689 175929 309830 -242581 -178749 -106474 280068 129422 498108 117797
17385 140131 117914 -107123 179420 220769 56962 429361 94248 80614 122066 475678 22777
17373 213628 -105825 164381 -38679 -9760 4803 714178 276698 231639 277358 252470 -172153
17361 -93690 119184 210700 536108 -74831 -40237 266857 113714 39252 252800 51121 306539
17350 306539 -81426 165109 213612 452817 63814 -98007 267400 277314 -172928 66898 321603
17339 321603 -24415 122863 73091 -119759 137554 167961 -71004 110236 87937 234717
17329 234717 -62300 22514 226835 -106667 -49264 329232 117881 33083 -116712 89766
17318 48083 171851 3894 67174 358168 171496 69346 97331 166427 118080 281546 360778
17307 360778 -162673 162138 80055 62664 85669 151133 49486 276906 264537 -290109 -118970
17295 279145 271455 -28266 26631 151202 152365 -128401 4052 234285 327942 103099 -186674
17283 84432 -16150 -240218 229055 101151 298156 332623 210930 180834 35069 138029
17273 138029 137668 -102557 -221279 145123 231925 266574 -75408 66604 -88227 183561 390961
17262 390961 -237913 442234 -181175 164755 287990 308972 33364 289796 533191 117171
17251 313819 270109 363908 -149730 -24212 -122425 133602 410786 -6634 134942 179209 248693
17240 248693 112793 -5463 101677 285415 148985 107682 234896 254210 16444 240230
17230 240230 533070 445644 209381 169322 118512 173089 306846 74168 384509 617704
17220 617704 47817 149157 -8519 302911 107072 -23919 36698 21191 -133136 235661 360846
17209 360846 10537 411212 126931 114343 194999 186501 -83417 121051 534093 99944 274034
17198 274034 33209 -6574 52576 66964 361695 -77753 -2407 139931 359180 244112 386112
17187 386112 17588 -124899 191955 217945 235167 155964 370875 -78800 231983 332077
17177 332077 259408 278948 358143 304923 319206 214713 72181 119945 207440 476038 114440
17165 399826 261296 270619 120259 -218461 10099 274394 340632 -66590 308188 222671 136048
17154 136048 184891 235983 268710 285991 221409 284189 -124238 162579 13808 109154 108024
17143 108024 156606 373052 129577 218154 -41085 89003 345272 76052 -94129 27983 322901
17132 322901 466292 88665 294654 -69010 452539 -40680 249455 575386 609297 233859
17121 220195 271908 540314 94603 542382 141683 157256 767476 390539 144606 460829
17111 460829 377068 400254 51587 187520 231504 449579 175506 393390 167049 619740
17101 619740 243223 203055 702124 272595 163823 238652 369028 -3197 392929 340566
17091 340566 125186 454050 334089 394455 400538 370679 -94763 217070 449093 377003 193329
17080 193329 536079 231528 285207 420319 553178 451101 448947 373584 490923 315428
17070 315428 498449 478600 505697 274213 346131 452469 177192 388353 268761 155487
17060 155487 357978 443794 632587 441133 340747 150602 359967 565442 333217 432686
17050 432686 283165 219679 536498 275753 327490 572680 627377 349550 427145 586740
17040 586740 487006 506652 229868 357456 427024 324874 721172 695123 577166 435999
17030 435999 741286 644268 467291 412420 313336 404641 620458 709803 651064 704434 674579
17019 674579 858336 341709 816378 602325 430230 353798 366622 713988 632317 446856
17009 446856 548224 477206 516752 893347 584798 394655 560311 552812 849846 712904
16999 712904 246456 331260 709881 668734 589817 718410 474440 371283 755139 523814
16989 523814 532687 683522 771125 720474 617185 385944 499680 411289 689524 698399 541402
16978 541402 591820 994068 854859 557595 640946 479184 603430 646729 764149 842007
16968 842007 557193 569924 1075417 546592 313624 921551 616135 978492 830317 790339
16958 790339 532156 877556 663857 788468 618727 552430 757179 709752 683406 752410
16948 752410 582119 543532 1168929 344254 556673 749512 903005 757621 890213 760337
16938 760337 748807 643582 604070 919327 910235 1102097 912255 927432 967064 849215 1142501
16927 1142501 1013327 795523 1070889 1129075 890287 1228644 1253089 1227030 922478 1179774
16917 1179774 1672574 1188740 695845 1003594 871854 1087709 1164688 1128619 1393263 1319156
16907 1319156 1336212 1350815 1201687 1385006 1516943 1545591 1298131 1051047 992513 1489784
16897 1489784 1391649 1230648 1782714 1381121 1497093 1401686 1471337 1267818 1440364 1601578
16887 1601578 1398535 1731502 1763614 1707664 1527214 1776292 2061198 1427501 1818901 1825995
16877 1825995 1744587 1622530 1560854 1841576 1637681 1838017 1723189 2209234 1664370 1911776
16867 1911776 2215698 2070184 2183101 1874781 2160933 1947507 1814204 2289590 2126232
16858 2126232 2451634 1976193 2355715 2338888 2098463 2370278 2438431 2476680 2613435 2270172
16848 2270172 2427195 2224801 2809098 2360249 2747089 2789681 2728563 3204467 2991537 3070028
16838 3070028 3148352 3261486 3150923 2930980 3175149 3163375 3335941 3415252 3480623 3843314
16828 3843314 3469309 3872168 3695490 3657339 3797750 3879379 3994877 4071326 4096075 4288930
16818 4288930 4418939 4384731 4290151 4437186 4419802 4320577 4702835 4695692 4967753 5106433
16808 5106433 5129881 5371878 5177868 5197665 5362446 5669288 6162037 6190419 6355543 6204936
16798 6204936 6358485 6201327 6701880 6880793 7104356 7156937 7374122 7663174 7488777 7806517
16788 7806517 8092078 8132944 8458949 9057755 8766216 8823386 9286599 9767376 9575150 9918164
16778 9918164 10385668 10572182 11052318 11289918 11879008 11908050 12245221 12942777 13448211 13802227
16768 13802227 14002120 14387658 15177442 15616109 15975475 16749981 17037173 17903187 18949026
16759 18949026 19167859 19659242 20614548 21234218 22182173 23093219 24213024 25147490 26067428
16750 26067428 27425281 28206953 29607099 30853525 32477632 34009006 35490360 37213319
16742 37213319 38948133 40928174 43147945 45181993 47263033 50044721 52553937 55357364
16734 55357364 58494552 61745573 65360919 68416753 72971170 77020910 81714876 86603627
16726 86603627 91906986 97283716 103010977 109325316 115065849 121943754 128541500 135675263
16718 135675263 143049842 150269001 157719400 164557295 171479990 177581553 183403653 188538007
16710 188538007 192712427 195398556 197290109 198016736 197357118 195639616 192651278 188478805
16702 188478805 183620475 177936874 171683714 164885961 157615134 150412826 142722234 135486530
16694 135486530 128394089 121253734 114441703 107855876 101817668 96039610 90576841 85164964
16686 85164964 80258487 75828058 71678980 67433317 63764033 60185609 57368419 53771661
16678 53771661 51108019 48613130 46045091 43520240 41637768 39604669 37651382 36051553
16670 36051553 34271961 32794278 31222284 29903920 28635860 27484755 26317620 25084677
16662 25084677 24204354 23201367 22247400 21642876 20561416 20283043 19175155 18358819 18118749
16653 18118749 17412948 16644586 16123974 15517139 14995387 14682997 14156983 13676739 13395041
16644 13395041 12549809 12392470 12019101 11339469 11393828 10676455 10985456 10737361 10347095
16635 10347095 9971165 9277399 9235006 9143219 8971721 8550990 8077726 8131401 7562057 8080789
16625 8080789 7461044 7671928 7142829 7106281 6946197 6473700 6293115 6288125 6159865 6327230
16615 6327230 5936732 5713587 5476788 5597617 5204852 5200038 5210955 5147959 5149711 4724390
16605 4724390 4486819 4297674 4689032 4406445 4354690 4451038 3862023 4015263 4060188 3754956
16595 3754956 3801725 3531179 3731870 3776741 3594449 3527711 3309987 3363065 3368545 2889134
16585 2889134 3154484 3381388 3112476 2925898 3142607 2862238 2761001 2943343 2575416
16576 2575416 2499168 2716383 2435556 2683615 2519747 2668833 2823117 2321314 2458522 2528994
16566 2528994 2133772 2125720 2117956 2217458 2100229 2169533 2280930 2055695 1965830 2145182 2136116
16555 2136116 1818437 1747735 2100223 1589421 1680606 1718382 1644463 1911004 1657345 1526600
16545 1526600 1516159 1383131 1724105 1701865 1636096 1357458 1516950 1625090 1354259 1669614
16535 1669614 1590597 1164697 1432842 1507352 1340722 1332342 1144516 1214535 1266560 1682955
16525 1682955 1171123 1126124 1301150 1247900 1146623 1249466 770382 1045416 1108922 1397606
16515 1397606 1413756 1252118 1355413 1165302 1161395 1173597 971159 929192 1360319 949172
16505 949172 1529521 1210436 814125 750256 931075 966985 745745 1307295 806100 1004889
16495 1004889 1052962 808688 944708 747539 712349 744382 935131 674238 619769 707630
16485 707630 864092 758026 781300 545026 818124 841848 875573 859047 979226 1024772
16475 1024772 713102 866685 792243 420320 551694 814314 735815 700630 698142 678853
16465 678853 428064 876576 884263 659952 564913 490587 969894 602125 542872 531715 525664
16454 525664 577402 379097 745004 375104 619757 577939 353757 435058 350228 304412
16444 304412 454824 292662 542683 330268 900797 642340 581795 435063 700677 163145
16433 556338 376793 406576 717677 425081 869331 566433 481331 614830 497900 478009
16423 478009 523548 647098 757042 678094 475523 453791 692330 134021 528208 305256
16413 305256 164103 615090 641680 394654 264152 533869 394928 560708 367877 503379
16403 503379 449511 426109 321636 257192 744441 730137 435377 627486 409133 458834
16393 458834 320772 270036 489435 309694 614539 959374 216760 163099 505740 625631
16383 625631 466384 345574 234076 585173 565832 304477 610448 469617 427552 546095
16373 546095 356116 135941 261427 167209 72663 584349 141516 206788 628409 338059
16363 338059 659012 505753 370068 279852 128297 231539 249652 503046 323936 459744
16353 459744 392526 237248 211947 396216 25650 487915 255035 589727 84420 440821
16343 440821 445934 28040 306421 663002 544987 339765 226075 678023 207103 618281
16333 618281 217029 357677 223995 370584 481934 354678 439265 415838 286991 416198
16323 416198 -14773 464164 504107 507950 150406 288260 212838 587107 581925 211261 249601
16312 249601 414153 -10078 730278 270588 373956 230427 257080 423911 343429 239004
16302 239004 515580 151779 220818 297748 329518 90143 105337 -1669 248082 340553 302619
16291 302619 292003 111129 68061 150979 234260 262810 205435 325483 473725 297601 165579
16280 165579 520263 313031 193403 240239 463699 268207 89338 169565 260661 188162
16270 188162 178657 507433 215799 255517 279702 256681 386563 79739 247720 279770 394995
16259 394995 246532 255926 312258 349846 32742 180192 170655 179009 8970 484663 76948 445137
16247 445137 188768 135351 187250 314842 212899 235263 447445 300461 -53558 190870
16236 371338 -75866 -98479 116718 450481 134344 68918 90279 68566 135985 196527 37703
16224 47255 350887 431007 230480 70117 143481 212110 198363 55574 232098 142640 147135
16213 147135 4703 307169 149568 83876 -313758 174273 427928 84122 94947 378841
16203 378841 166353 123751 388608 39764 191436 58203 64483 12202 74126 277682 522906
16192 522906 2810 -172986 158912 352587 -244406 235090 -62513 309527 281889 263888
16182 263888 -114538 343279 144910 109481 359596 187191 210109 -48783 218794 46435
16171 399943 27203 148179 354911 258978 -35953 434278 -18422 95615 297719 340546 85831
16159 271702 8934 -128492 155199 -167165 -11464 118142 158462 371164 -52751 60029 -150935
16147 331370 -215928 -148901 271772 185632 178571 105793 353791 161958 338769 129195
16136 249749 149564 134608 24586 82083 -214776 -192462 118960 185443 -93398 116372 -48936
16124 182381 270943 -40007 -122239 471 150093 345056 -198682 -72796 -210387 119009 150665
16113 150665 -157478 14333 264061 191922 67424 19841 -286138 211877 -55683 86198 -124390
16101 -61276 32306 298538 58949 73319 79944 221813 238708 220271 -91422 -45844 182205
16089 264401 111821 65113 132997 218099 -53417 -245175 -47592 127566 26767 -64276 205887
16077 14811 17925 176239 48032 21910 -39247 84774 -115339 -204114 99386 -286149 106971
16065 38074 11765 149506 -130656 -6917 339451 247809 171097 66735 397045 -132002 -39200
16053 137183 -7934 -297842 180381 200691 152257 -67345 62286 -47192 177365 -124023 28859
16041 -42842 198810 227946 -63509 -114622 -107292 174679 -200977 -23560 33301 112325 55780
16029 -52024 5279 -136518 257279 -114035 3596 -120437 42027 -80084 -120957 -129783 -247728
16018 -247728 -177979 74712 -193855 404930 -21668 203163 -422286 130950 -138032 80876
16007 207302 197138 -105806 -1952 -63850 -322586 294276 52950 17279 196020 -231031 -50085
15995 -3733 -59313 -464585 -138402 73604 -121220 -110643 -226382 -315858 4972 -48668 -131408
15984 -131408 -61788 -129616 18170 -335579 80241 139713 -147520 152440 -21917 187427 -167092
15972 206723 -95984 -101937 125731 52737 322547 -96172 -129225 105266 57953 157490 -137328
15960 -49580 -146789 -211713 -178242 -37182 -191963 -227178 -292654 -235850 123161 -346944 -36324
15948 -68179 -108077 -52544 -49443 -2676 -168939 -11501 -16537 -105000 106725 290936 96595 -233705
15935 184885 -291542 -165785 -355717 -97556 -58947 178223 205186 -52930 5286 -116511 -61703
15924 -61703 -188678 139051 279732 -3740 -216626 -72659 -27372 -116715 -190819 -224872 5980
15912 -60940 -261632 189764 -207557 -49024 -44781 77531 -234235 76046 46285 -150272 -201137
15901 -201137 323848 99243 59306 -346174 -265332 -331803 122106 -38250 89987 70946 -341042
15889 -97758 -210669 -31421 98421 124604 -44291 -29383 -253153 -169208 15995 -107382 -11075
15877 -206613 185534 -8856 48580 -93845 -137476 -161472 -91664 -133646 -27825 -25337 25091 -24781
15864 -134559 253543 -214811 25125 -186174 180862 70857 -423581 -198606 44699 -56057
15853 20530 77864 194762 108228 -136379 18405 191382 -206733 -209395 -164262 -228649 -33684
15841 -375725 -204926 221039 -161709 -202830 137424 -166637 103094 -253026 82158 201547
15831 201547 32921 -153174 -161976 -241745 50561 -195478 -213811 -37299 -250780 237623 156437
15820 156437 78547 110443 119756 -128080 -18648 -238766 -14331 -42290 -296220 294164 -188277
15808 -80126 -331266 144843 -299708 -1599 164751 38741 65809 -79084 283209 -145368 -455543
15797 -455543 -192211 -147802 -113251 -128260 139479 -4164 235315 164021 -173836 -77104 -128088
15786 -128088 184850 -69972 -76084 2928 -75033 145146 178888 178266 -81652 -128927 -89048 46038
15773 143230 -165109 161230 -35195 -230529 -50570 217477 -281748 -146971 177091 143682
15763 143682 34827 -78115 35936 -107688 193406 -134355 -62713 -290110 16963 -251812
15752 -272305 -123076 144041 -143854 313072 147100 -37887 80601 207449 -117797 133544
15741 26681 161563 -41599 219982 74403 -220850 143961 23617 -227798 -48515 156663
15730 -157859 -115543 99248 56253 255420 31451 -334423 -3781 37468 -119129 39317 -126050
15718 425289 -77803 -78932 -27397 87604 5362 -43856 -83642 -204687 -226551 154467 -153435
15706 -374649 -10100 159238 121061 -119777 -222823 190541 -126726 118167 -187850 16772
15695 -240325 195373 -5794 55469 -15564 358990 206198 72231 278015 -143138 -215408 -72354
15683 -148562 -163130 116589 89482 4264 151304 56692 350101 -18149 -179779 -244986 -47815
15671 104132 -88193 -243895 93836 -3442 123566 -244279 280804 6993 -222877 118904 33781
15659 59159 59283 137801 68257 -17442 47357 405872 174737 -277205 -218196 146903 -189308
15647 107544 972 -156826 -107737 185362 -131863 -11462 -98927 36689 -88271 267150 -352200
15635 -246845 -67951 -336439 -83380 -79527 209 120169 -59071 -89550 -151310 145791 -186420
15623 -235084 -216859 -310462 -317940 42424 -196561 -264572 56604 163342 -236366 250436 -173304
15611 -9057 -80693 -43232 460312 2208 -9527 -101971 -262048 -7678 100193 13173 -117750 -216519
15599 -216519 -91743 -302088 314917 -308699 -272115 303682 -100268 -71501 -3666 -156299
15589 -156299 5128 71907 51879 2257 -75275 189449 -185548 97501 46607 40964 -84827 -273272
15577 -273272 -8738 37142 6735 3442 36150 201501 156605 -172068 -63880 -361008 -42317
15565 256973 -45855 33176 -328366 -108681 172491 156787 85973 -70763 10939 -113805 255108
15553 -132921 -71862 -165012 217186 43702 -344730 96181 -45778 82714 17210 -70779 -51103
15542 -51103 -168814 44849 34663 -213596 -295727 157307 33773 -233716 125167 78639 93361
15531 93361 -91563 -288470 -73888 77419 -67192 -397369 -245391 -162215 99295 -70158 -152262
15520 -152262 -130636 -87095 189707 -94213 159946 192510 -158041 71189 120658 -303538 -99249
15508 -244657 -76704 44644 -385928 -65691 -241624 -404120 53440 347305 204353 -353528
15497 89324 211462 -185719 -111978 217234 29392 29436 -218160 88154 5154 -265463 65049
15485 247778 46418 -164809 148075 68907 224391 -89293 196986 -32115 31772 407504
15475 407504 -211002 29616 -190133 -93165 -104712 74413 40507 97502 -63934 3784 -205715
15463 -5399 -152996 -423067 57518 -281012 -323455 94596 -106174 109026 144763 -137871 31893
15451 -45420 32144 -173439 -31395 74458 104632 39856 -45679 -86033 176161 454476 38186
15439 -9375 -13639 57256 213682 10135 -271343 -18057 343236 323830 101357 -329368 63795
15427 202494 -115389 49484 -280679 -197950 243474 -151126 -70544 20781 -81670 85222 387742
15416 387742 135081 -192050 -195146 -78797 -80090 -36524 4626 218126 -3249 -136485 285537
15404 42581 195326 -265118 245705 -364738 6158 -156664 -105679 -494108 -189605 364866
15393 -50503 -326613 145368 191294 -70737 25221 120924 -77628 -56997 177745 -312747 116218
15381 -294364 100275 -146359 113278 -242264 64574 166778 9880 82641 -58930 -189278
15371 -189278 -158467 -253200 -125238 244447 -222767 152223 51039 -107365 53439 -271870
15360 274561 -267098 207264 307462 -69626 -306580 -144991 272191 -37195 19772 89899
15350 89899 -109455 -52305 89527 182769 128242 -115401 -365736 380865 -75708 103317 94273
15339 94273 -116919 -118695 -60414 -26970 291700 48874 -173154 126743 -157036 -67140 -274228
15328 -274228 123851 115187 -165963 17096 14700 -39976 108413 -207858 -142379 26428 84425
15317 84425 47798 113097 123934 163093 -257215 220605 326308 121001 -122032 -245445
15307 -245445 -213281 79600 -38955 -132762 -203946 21976 162314 -76450 -226002 133254 61401
15295 219532 -22168 26593 197526 -160167 77323 75110 229 160492 158753 74874 283776
15284 283776 37473 -345403 214902 -26338 1233 -146373 308457 169543 195411 259572 -44539
15272 204350 493703 76706 317478 21870 77090 113711 -303701 481549 47492 310372
15262 310372 52495 17390 8043 -140974 -326281 -107777 238552 151789 -112061 53038 148469
15251 148469 114505 -98660 -175577 85150 74471 140308 85416 -269591 36447 -109413 27571
15239 51825 123714 496088 384116 856652 775519 903844 881378 419293 -174210 42225
15228 120324 43042 13073 -161802 94024 -107496 -143776 -121502 157089 -63319 77793 117610
15217 117610 132221 51090 26771 395823 39024 27774 200318 113879 -2746 153388 137313
15206 137313 -20046 49197 44918 223027 -33035 -161163 -87376 268804 -101610 185952 -19475
15194 -129877 -36158 317531 -107949 109845 390161 180459 -83368 275903 66796 301618
15184 301618 181121 -93714 35424 233776 339770 421788 312755 590845 -8795 172864
15173 53700 -31196 -36467 95271 -211085 10492 -115183 18494 -482 -111580 19569 -74254 8454
15160 291752 134706 452712 79767 145027 -390181 412406 453483 72399 -10340 112322
15149 -8854 -59050 103921 21621 -235302 507224 221555 -98702 177865 -89286 124619 88686
15138 88686 34099 -114660 110955 467700 70895 50645 327195 262101 278836 -8019 544969
15126 -79705 257270 -39633 91458 130534 182264 156420 -38327 97744 -35766 172932 161595
15115 161595 -18363 160308 239565 547947 54369 397230 -60309 229016 -119175 150532
15104 55072 104253 65426 180801 -19983 225660 311214 143276 26925 30016 173049 5512
15092 94466 40177 324143 76807 -3326 -70016 252471 174460 123989 325060 212465 165852
15081 165852 62585 95224 267307 -116292 74263 -26387 -32418 159525 226104 281005 151181
15070 151181 128682 84470 166055 251016 102806 -13995 377418 320900 229785 417910 140484
15058 244366 277656 225819 13336 58652 -13735 -86260 167846 35276 98596 67893 76144
15047 76144 -61057 272122 330055 328195 243282 389450 558434 289959 192837 121245 230802
15036 230802 133933 -114082 67676 319140 332123 89125 -95283 -159280 154086 -60792 196582
15024 270997 61460 110571 13856 196470 -67502 184238 222972 121924 123136 -129775 53028
15012 -165703 -21221 -88069 134779 14011 -137671 8053 170488 161870 561126 429211 341178
15001 341178 306409 404712 381603 242750 408928 81053 237976 283141 42016 217628 120114
14990 120114 206115 257921 156825 316850 121710 317237 138845 285150 253955 196879
14980 196879 485618 432710 99105 209152 181568 243191 172682 130114 283029 496228 364985
14969 364985 370628 511003 -6574 154251 76394 276273 349101 282829 262221 288151 67555
14957 175794 268381 131363 357651 183253 288522 324281 287234 378846 191520 -133114
14946 364201 254948 160788 603256 371941 221509 109580 99619 446608 178487 206860
14936 206860 275690 141262 201498 225161 353146 607844 134997 312205 549042 381215
14926 381215 412935 459463 207101 -104637 482014 263579 -60977 732690 3069 17381 486504
14915 486504 215987 484127 138719 359824 206057 -29658 22620 501690 285637 463795
14905 463795 220549 277986 222492 242511 306496 116484 613313 228832 219813 283203 359930
14894 359930 602617 184829 347601 444859 203251 303863 284589 134410 208976 347389
14884 347389 325140 138771 659417 371993 401242 163841 604807 317978 321606 328938 355515
14873 355515 640584 165643 424340 294534 21004 271156 254435 374705 242602 307910
14863 307910 663284 395964 482905 322959 168512 637990 434284 207146 272579 337641
14853 337641 495173 399574 645300 281544 580745 298623 470608 175806 721008 738091
14843 738091 253680 389303 129946 589046 474783 590212 606846 171723 426529 327454
14833 327454 432745 378047 376736 458593 288648 240849 350740 677148 385854 766279
14823 766279 487036 329715 261282 348735 607530 685769 115633 560732 351841 606817
14813 606817 584272 318971 813939 684278 581382 369975 676009 396004 388011 266628
14803 266628 173150 493823 841710 280356 356633 497120 518170 611129 733462 466928
14793 466928 462734 566882 692172 440801 446813 504408 365732 291678 428779 726065 595115
14782 595115 654353 774281 671879 523731 410350 302028 580619 588439 751792 497750
14772 497750 819578 563819 633312 823402 400754 401821 766962 446091 579916 809163
14762 809163 473261 766035 786303 852616 419287 616075 407718 630982 638066 533475
14752 533475 752038 757003 678221 567773 896540 795381 724058 840873 839837 829888 541448
14741 541448 386540 1185274 733426 652161 868972 678594 996761 728900 720011 616721
14731 616721 277463 811130 759971 555172 591928 651978 264129 566584 705609 788916
14721 788916 706873 641251 890793 868755 654601 633851 515398 751859 852967 604524
14711 604524 858186 647364 600651 651149 743738 937106 566945 799619 645662 761713
14701 761713 954087 722061 1055809 925656 970924 804826 946375 815255 768797 1030417
14691 1030417 1255975 920413 523006 740996 1090630 771499 529873 870202 963143 1255116
14681 1255116 1167556 1122692 956488 824157 609222 1057234 860794 982375 840705 985531
14671 985531 761590 891725 961388 760053 869654 1117949 1045170 900856 599876 1167526
14661 1167526 1019655 829570 1557778 880917 1108299 1099213 1344680 1176997 1164385 1030128
14651 1030128 1326974 1394231 1307859 937700 1020514 1025208 1018028 1247745 1049991 1315739 1288857
14640 1288857 933500 1067992 1390306 1283310 1153166 1295669 1032518 1061324 1149746 1098126
14630 1098126 1186995 1334736 1287634 1218738 1404984 1200696 1152809 1701622 1341168 1451950
14620 1451950 1417811 1585247 1437706 1477340 1458852 1395219 1061577 1235118 1410851 1708904
14610 1708904 1415558 1413208 1550792 1443888 1372263 1593189 1492212 1558895 1780285 1763091
14600 1763091 1627238 1665441 1407274 1621665 1433674 1776955 1464278 1626153 1289239 1428809
14590 1428809 2157819 1844006 1599873 1669967 1850426 1893353 1962426 1737111 1530474 1825112
14580 1825112 1954611 1960478 2039101 1760217 1770816 1629603 1941483 1690570 1729199 1883499
14570 1883499 2004184 1986454 1906529 1623795 2050124 2148299 1948563 1940128 2141068 2012794
14560 2012794 2172720 2312192 2554201 2340543 2217941 2304049 2273658 2316236 2691911 2712389
14550 2712389 2539768 2745136 2684075 2858709 3007522 3172916 3207221 3733714 3613122 3629807
14540 3629807 3855974 4565152 5118972 5923786 6833038 8477537 11371980 15968272 21229332
14531 21229332 26955622 25671820 18382532 12062251 7857301 5389667 4133199 3304514
14523 3304514 2907663 2859249 2792475 2776611 2684616 2083639 2423868 2185273 2448362 2582112
14513 2582112 2606887 2254894 2548136 2836447 2588315 2609812 2538200 2176448 2515490 2815468
14503 2815468 2501218 2648389 2935205 3039725 2728975 2841523 3051822 2721780 2936514
14494 2936514 2899872 3253389 3022252 3020626 3336061 3276680 2670705 2868881 3490668 3347845
14484 3347845 3394469 3427656 3143749 3456031 3633368 3725904 3042490 3593053 3830040 3896452
14474 3896452 3690868 3670828 3892013 3836067 3725339 3799151 3868720 3783030 4261875 3759460
14464 3759460 4416887 3823717 4158706 4506562 4377104 3914340 4391670 4295310 4410239 4607750
14454 4607750 4651367 4580138 4831485 4642161 4849632 4846525 4699954 4648302 4811930 5087243
14444 5087243 4971366 5151174 4858180 5461540 5488721 5234202 5409923 5726134 5668468 5559444
14434 5559444 5550782 5760268 5959951 5671997 5884009 6135000 6358775 6354799 6270149 6210743
14424 6210743 6395081 6342536 7124929 6643187 6997353 6919549 6853216 7202706 7177787 7193710
14414 7193710 7362739 7514162 7244937 7462176 7793534 7838401 7953816 8171428 8212967 8685511
14404 8685511 8274741 8452212 8604835 8590101 8945033 9274069 8932444 9602707 9461445 9417593
14394 9417593 9480525 9895544 10079750 10365833 10580231 10423770 10721844 10385574 11344454 10970587
14384 10970587 11169922 11394633 11305698 11792471 11976204 12231141 12455659 12362870 13001153 12967018
14374 12967018 13272543 13544185 13915773 13983775 14391962 14629564 14984748 15062907 15454672 16085727
14364 16085727 15914952 16536291 16964934 16995412 17315966 17541388 17865576 18027488 18763272
14355 18763272 18743517 19308907 19880113 20237908 20759213 20970254 21340074 21897845 22844720
14346 22844720 22861880 23295376 23722567 24439427 25145636 25541497 26183926 26606947 27522854
14337 27522854 28422469 28553828 29370375 30174762 31005261 31823369 32493562 33377018 34031676
14328 34031676 35110052 35997883 37090999 37988191 39118442 40327888 41670675 42596446
14320 42596446 44052121 45494439 46590631 48104758 49302123 51139489 52835355 54469478
14312 54469478 56311393 58058847 60088793 62420541 64276884 66771496 68930446 71375200
14304 71375200 73832507 76748818 79711737 82780756 85663755 89397060 92810949 96784410
14296 96784410 100978543 104882075 109174257 114545614 119505119 124440646 129999856 136041703
14288 136041703 142626657 149021941 156116111 163536538 171566182 179789631 188791548 198121300
14280 198121300 207503363 218015226 228692199 239986927 251918803 264597798 277317907
14273 277317907 290975481 304339792 318165600 332059673 345954041 359324546 372836327
14266 372836327 385202695 397012012 408339522 419601172 429984228 439968830 448550123
14259 448550123 455416950 459276217 461483513 462236100 461695800 458729723 454542821 449577683
14251 449577683 443692953 435499548 424337553 411775315 398860182 385183563 371173386
14244 371173386 357060213 343067480 328737890 314738678 301480565 287909014 275220291
14237 275220291 262651593 250085669 237707349 225751264 214231086 203559691 193685276
14230 193685276 184245802 175623646 167106454 159273498 151652804 144746740 138444760 132085763
14222 132085763 126383174 120755141 116071773 110723597 106466562 101947340 97988177 94249199
14214 94249199 90304540 86887672 83416817 80000985 77474274 74638911 72144537 69238457
14206 69238457 67096055 64715379 62793863 60999627 58814037 56478215 55136327 53462183
14198 53462183 51821327 50053927 48487681 46898867 45823534 44766654 43655000 42157449
14190 42157449 40965762 39803190 38925582 37722687 36870301 35681904 34884718 33972085 32943416
14181 32943416 32437391 31345740 30417290 30243590 29117880 28464990 27544545 26895157 26402618
14172 26402618 25716679 25039198 24618257 24172733 23627645 23049201 22393973 21750753 21558784
14163 21558784 21385937 20598787 20397504 20018081 19448341 18842147 18487780 18364792 18121923
14154 18121923 17504007 17148968 16873056 16225068 16127427 15854747 15732820 15520376 14949428
14145 14949428 15050293 14728566 14246920 13995566 13505930 13495947 13209615 13222974 12603225 12701696
14135 12701696 12638294 12309628 12307468 11828979 11712765 11420205 11275990 11112077 11115993 11011727
14125 11011727 10711223 10432077 10718476 10271345 10130627 9883265 9962885 9453574 9625321
14116 9625321 9269181 9090741 9050069 8915075 8404694 8746015 8568979 8292087 8195038 7984439
14106 7984439 8217650 8098096 7801400 7536981 7524724 7564909 7732846 7622975 7417322 7166966
14096 7166966 6999377 7081512 7017434 6935296 6679400 7058727 6637962 6660007 6635415 6445759
14086 6445759 6629258 6552763 5920643 6082839 6099154 5697964 5593481 5480363 5902360 5445857
14076 5445857 5820871 5758101 5288558 5281954 5454407 5042864 5017237 4877816 5224663 5400251
14066 5400251 4964843 5158940 4991713 5043378 4599594 4816039 4856584 4662829 4368395 4439704
14056 4439704 4606947 4579571 4343728 4206866 4043698 4216373 4276432 3981944 3837000 3884491
14046 3884491 4159249 3976550 4186281 3865116 4039964 4180616 4038271 3827061 3628452
14037 3628452 3803213 3860742 3731860 3962191 3821355 3470644 3580133 3567250 3473674 3310301
14027 3310301 3389148 3584891 3185790 3371245 3075582 3114449 3234413 3343867 3231244 3150203
14017 3150203 3196296 3294770 2882838 2980263 2990813 2621596 2938093 2900131 3039847 3105167
14007 3105167 3008766 2686554 2775708 2894782 2585823 2716367 2270360 2856305 2528238 2502478
13997 2502478 2358856 2545925 2872998 2582633 2652828 2522911 2379244 2578979 2292356 2436200
13987 2436200 2513475 2276034 2450439 2316570 2572982 3130099 2556428 2624022 3211648 3484574
13977 3484574 3765380 4344692 5754907 7328289 11079143 16722141 24136645 26238806
13969 26238806 20656316 14696891 10713587 8096343 6367652 5256610 4674386 4112861
13961 4112861 3873911 3587559 3308504 3510385 2887996 2985831 2903521 2695454 2195532 2762634
13951 2762634 2404857 2433501 2298011 2120748 2125283 2114215 2254510 1809877 2100909 2404418
13941 2404418 1965265 2014290 2164774 2233845 1900121 1984907 2056053 1715038 2015592 1882818
13931 1882818 1800770 2084642 2151721 1898888 1782392 1670446 1614969 1728301 1710840 1861852
13921 1861852 1718380 1560459 1719958 1944484 1627821 1593185 1323173 2243181 1659425 1465247
13911 1465247 1694183 1819392 1747250 1313432 1570533 1493133 1732787 1289959 1421995 1131147
13901 1131147 1525035 1639381 1119433 1695079 1421793 1426021 1380857 1167886 1767572 1634209
13891 1634209 1698335 1091345 1383333 1465547 1505627 1379214 1540986 1512492 1416871 1562289
13881 1562289 1265919 1517199 1367977 1093120 1166968 1395271 1451056 1544504 1214428 1074955
13871 1074955 1495019 1177656 1162430 990706 1311712 1184232 1451903 1356665 1437468 1178661
13861 1178661 953565 1264138 973120 1008061 1123025 1099959 1089113 1167419 1086105 1255238
13851 1255238 1199461 1085320 1456960 1045795 945626 1115174 695721 1066556 1039796 1122292
13841 1122292 1251526 1170353 1068653 785923 1210127 1250667 842346 1001787 986857 1071434
13831 1071434 1149393 752587 1423146 848650 1231362 1233736 778627 890785 792348 1090668
13821 1090668 1014984 1073756 852676 966252 716202 1037304 744477 813933 856787 967140
13811 967140 847075 829940 918254 993503 854910 948314 1241742 914974 961778 991795 864666
13800 864666 1154737 761047 748217 895464 988326 592220 766237 729347 850336 1009840
13790 1009840 864369 893007 932109 885867 811320 714179 711076 943128 911280 681344 662134
13779 662134 517181 829037 780831 820091 1073663 537868 698372 803130 1051847 726441
13769 726441 861442 812080 804145 672997 760758 648684 827746 691073 661155 782462
13759 782462 813943 1027248 794848 889450 681428 571966 769179 477420 846709 866569
13749 866569 1178357 615254 931744 505195 557751 569237 515888 566199 473536 358185
13739 358185 629550 660207 669731 739712 446829 686391 918830 352082 686478 782726
13729 782726 792899 348043 617499 736359 450116 700787 645457 749991 291983 389573
13719 389573 722953 662864 590411 629493 464051 449418 800539 28699 729391 494336
13709 494336 519699 200743 717623 555675 156566 255834 648935 425445 573177 342550
13699 342550 788334 454515 795861 408444 571296 523551 928173 645352 679168 668019
13689 668019 257840 772103 583824 380125 628627 621594 400617 480898 104680 301361
13679 301361 411230 832177 416143 83940 651332 352196 440525 743892 486480 479400
13669 479400 183850 861069 428062 515131 368756 281851 463435 373701 486377 296269
13659 296269 521657 634575 646471 545764 833003 517714 593757 496063 485926 373174
13649 373174 531906 67694 416856 123280 430037 453988 485646 429446 220393 361594
13639 361594 623717 353130 41167 223154 337689 429716 329098 371571 543455 520423
13629 520423 163278 357070 567601 651228 433351 370162 634314 507109 312826 484729
13619 484729 337202 531472 435457 474673 116554 623605 256219 252465 391871 360948
13609 360948 207822 491902 292264 150973 407798 175498 434242 437863 244994 114725
13598 337390 463708 162878 485672 569194 290620 366078 350558 166894 214618 537225
13588 537225 570360 321722 297239 155875 -47921 648827 118746 370280 -22689 325528
13577 -85485 310405 456018 486663 485830 359023 183141 228591 622914 147317 304530 215047
13566 215047 656465 -12867 463039 262457 91583 535877 614517 218089 563117 448859
13556 448859 118634 58123 279807 228713 556750 397390 321744 487782 393160 212803
13546 212803 475610 209671 83842 247891 90327 117372 216350 330174 433367 496522
13536 496522 352716 287846 270294 422291 12555 229668 377431 110852 153002 381484
13526 381484 153934 321570 333004 359978 288631 324822 171377 278496 -8139 -52731 430855
13514 362193 276945 223415 462859 44275 523899 290640 371601 366381 251488 320646 439133
13503 439133 309614 328161 558360 301302 -101032 167618 419005 93964 249619 50374
13492 146515 331917 128615 418174 382304 299464 49113 308276 198603 221285 276142
13482 276142 87978 201661 445786 403275 689562 294431 476264 -68316 172939 514350
13472 514350 252270 -5004 102140 442411 -13047 248670 262186 123816 387232 124583
13461 270674 338019 597032 320207 435605 318310 390022 185891 -204730 221623 134901
13451 134901 215851 233895 541357 272260 131191 532199 186909 359279 373834 163894
13440 -81843 -71982 129356 242192 94654 66400 163385 337524 71735 5637 310659 301754
13429 301754 203131 178561 167798 41544 302563 153004 293055 280104 -5673 83831 158433
13418 158433 153584 34527 376064 351465 320056 271845 297856 575652 168666 66231 118855
13407 118855 384322 162835 269349 108159 182568 239869 -27387 47802 -138578 88380
13396 418016 18755 129501 374058 243757 204925 95262 360322 89465 317490 335256
13386 335256 219416 261666 -129612 486684 -71524 79495 394813 159023 270753 360444
13376 360444 475487 65609 163104 117479 -1676 93018 -202391 47344 -214174 361319 -71248
13364 79881 -213387 107205 352469 -150196 128755 481442 314987 229437 2353 359938
13354 359938 156010 488761 338152 400755 31769 -48508 47169 343632 -211563 512234
13343 230937 163230 436854 -77455 -40565 -10147 10716 307831 242781 -418 500269 443572
13332 443572 2372 52623 256691 347767 414620 495270 358395 -140330 324946 231528 -1519
13320 21328 334889 480090 -3690 -97140 288705 125222 114864 213597 -42499 290906 177824
13309 177824 361399 177306 190959 121007 244644 397715 -152963 429251 92618 -104177
13298 251960 432238 448936 -22367 153505 469305 551778 320324 215951 409436 423050
13288 423050 173992 -34481 81825 272080 231396 154525 -88950 377637 226355 -71890 84469
13276 175467 237034 248915 143423 -128877 -30255 131272 137808 104666 147375 216158 226961
13265 226961 198890 118773 234393 465216 375848 -56690 -40876 -230189 234825 147255 -93617
13253 77909 679145 39538 38193 176399 -53612 127378 116922 169776 123032 218634 83203
13241 307533 65506 14410 168782 28102 290401 207362 221131 197407 5323 122011 52280
13229 474840 203543 35897 411561 -203480 -225034 223767 264635 95018 146318 255448
13219 255448 115459 20441 -225475 105647 179974 55883 36035 -88747 -132842 110953 170939
13208 170939 -112407 173127 -100657 166002 -4757 223402 203979 173771 -168810 334704
13197 -67818 -156860 -1770 -76633 239847 -39509 225425 259270 402635 239954 171369 221952
13186 221952 2668 110755 197069 76940 233949 -163767 158887 412133 201456 -29314
13175 -582 5723 166542 120252 218471 -246744 -102426 253242 97522 107654 16483 148953
13164 148953 -142120 -98778 -167714 467041 181128 -67614 100080 -778 -191994 130376 142712
13153 142712 -50722 -51203 172085 276002 -132442 -105238 407317 286395 -193003 20431 36627
13142 36627 415385 104857 247188 -457642 -163706 -171419 108839 -9798 138954 121168 -109133
13130 -105941 173834 -14011 -39404 107256 118802 146225 124262 -125872 330407 -65681 -113137
13119 -113137 110607 -264966 279549 -22496 320705 -107214 -135426 244434 -55668 66453
13108 206159 -89776 128976 273845 -162900 286602 272701 -97224 69706 -144750 -91813
13098 -91813 -121834 259510 185057 -93284 17035 25790 53035 -167087 341125 221216 88976
13086 -104771 -12643 -192476 -346458 10575 126508 -105184 76635 -19826 225685 335167
13076 335167 -12861 29315 -586 -233999 60245 44832 -131023 265863 317106 44294 -181779
13064 163992 268891 394462 -181811 -60376 327220 -42602 -104834 39414 -10440 157365
13053 9159 23859 234324 -76189 113786 -141849 266062 195833 77818 403758 286423 208819
13042 208819 -21718 200614 244753 -68211 -34462 -44142 162288 -376585 8237 -15203 -131307
13031 -131307 -246807 330834 157419 234462 42507 326122 267053 39024 301253 -7166 272043
13019 -214992 192871 289266 62956 297189 14268 195661 246833 321510 189005 156918 400757
13008 400757 248485 367535 236741 154770 185618 241327 249749 100632 190580 273417 125804
12996 25916 416857 141245 -53740 45854 379560 358695 -144691 -88935 241068 167112 99415
12985 99415 -25762 -318905 -172180 -126787 -465330 -202551 96392 -154330 -153974 129187 4418
12973 81188 101276 -281758 -174806 -204448 212429 136415 -346327 -102110 163622 184858
12963 184858 -183669 245582 120743 -158288 239175 54747 -328812 -80750 -156364 103120
12952 -42483 -185428 23549 139694 -227065 208373 196910 97448 -24748 115040 -142312
12941 75550 247591 139799 -82258 69937 61753 -73708 331690 36048 -294764 83584 -231282
12929 155254 397495 -198811 -164498 -290391 76955 87020 -48365 -268319 222133 -3540 239016
12917 309646 1107 215867 -34760 -12741 -70709 89563 57103 22044 33183 82653 -83148
12905 56237 -291501 140148 104911 3758 -218560 346355 37255 -100988 -78054 -291033 45133
12893 -13690 -172296 -79793 71850 -61164 308534 394588 -93205 439552 -68594 419176 -126944
12881 36091 -68740 -103277 41690 275276 8963 -204034 33204 -136592 128798 175673 118457
12870 118457 35089 22256 -101163 187084 55306 -63987 41406 98045 14076 24932 19515
12859 19515 295965 -203302 21147 318988 -22446 483439 -85357 -44186 -233889 188853
12848 -130429 -15904 279039 163789 136529 -17826 358132 -146663 88879 16857 45801 180991
12837 180991 226634 28544 -116173 304079 -56549 -337952 -37416 224384 -251714 138475
12826 -240294 119343 79153 -178687 236971 86155 96035 63215 143717 326449 232550 176655
12815 176655 -14144 -152667 -247958 1367 -115253 -129605 -81200 -3694 356726 -117538 -352575
12804 -352575 244334 -109498 -243617 219687 32533 -310759 -90734 55451 91407 -356466
12793 -21726 -114985 -147964 -310531 224376 415958 -193073 -129061 102211 -119828 -59159
12782 313900 8618 -78452 208704 -167286 33328 146593 -123436 152498 -79175 -67996 -177622
12771 -177622 -202101 -110596 445542 239484 304692 -16478 -77934 -244401 51648 -203647 223310
12759 -76241 -46506 -278450 -284453 -176003 -99321 -122504 -34532 64147 37175 153741 265360
12748 265360 -86397 -94683 -331813 159349 110355 5743 21443 137852 217207 -40048 73400
12736 175008 64249 -64159 120362 -42117 -119329 -123003 -181878 -98281 213422 243138 268753
12725 268753 126419 61991 -254761 215593 246405 315319 252457 107336 -110459 185941
12714 310353 192306 8670 37072 -371529 17749 208181 241073 -56971 -68687 -224859 80381
12702 -27226 -20659 2430 38393 -190323 -141762 -199534 -7044 -409878 69847 160989 252784 285074
12690 285074 96643 -82740 141914 -11342 245554 72967 -142911 5872 418502 486943 59554
12678 102425 117150 -12378 234715 -21561 226718 56364 37041 -55276 -230161 185753 -92548
12666 -90959 259032 96399 158597 316928 -16738 222826 229714 85279 210399 249390 72914
12654 489099 102694 121614 -29250 415920 -394065 -180025 60651 238396 -279179 63469
12643 325517 -81181 114053 149433 176023 27155 188627 -27378 31982 181450 -39212 -257961
12632 -257961 23946 43607 211519 -256700 11810 -60968 -9290 -20666 -19269 -132823 -63871
12620 -54429 -162694 -18044 283510 431710 187610 87316 286693 -78214 243906 177333
12610 177333 221482 472195 -68619 255353 219463 -57884 16108 91593 -126120 -176785 143442
12598 -341615 290999 160688 -51135 88624 99089 92162 137996 118275 118685 36544 329751
12587 329751 268757 91508 209855 414915 151655 138816 -4678 -76289 -162833 -166393 101312
12575 -226794 -164159 93918 -323180 83011 -37498 -22094 61081 86536 21877 111052 -129223
12563 239566 -165559 88104 266928 282860 136253 308786 -173450 178670 117860 -43481
12552 37348 -429171 -161608 -50655 257509 93505 -291580 224147 -29725 836 123089 182373
12541 182373 102326 154315 -86504 -130339 -150280 176594 59103 -54573 -165347 173913 259753
12530 259753 -331161 -275316 132201 2194 360817 121231 298128 -170032 278222 60867
12519 54368 -12413 45344 16997 -50039 9547 -164855 166586 58305 -104370 124393 144798
12508 144798 175396 172115 107436 2646 177493 -146260 158559 -35308 -17867 156224 -241470
12496 -42267 38326 -259128 -1234 -89075 125820 296060 -141713 -126669 -177840 -114337 -8805
12484 122721 197877 41452 70528 -188368 -71172 -138729 103108 -96909 155507 74564 -129665
12472 127961 92518 41551 123754 80126 -179548 90659 -207867 386474 249568 -213550
12461 -169234 -211549 -143870 208468 121372 131109 -325804 -403601 12154 84967 -151472 53007
12449 240985 -223333 -147350 -466981 -187096 34512 -228418 -512 -10208 -168388 -101911 218503
12437 -101936 -64350 185880 88887 -50528 -193421 -107060 -92391 -294693 98863 232797 -5179
12425 -232753 -112325 38990 -121263 -132446 -139560 -91357 130462 -163029 289604 76219 104477
12414 104477 -219242 132709 94017 131700 -352749 406838 -381212 -49125 13983 64028
12404 64028 103462 8139 -281383 158306 -82461 72890 -34803 49078 -168900 -16625 -98248
12393 -98248 135843 -84573 152407 -4905 -134579 -83879 -213601 99545 -150692 382309 -88828
12381 61021 12667 -18486 -55416 65457 -306296 -46448 206358 -38885 27369 -254107 -213273
12370 -213273 213697 68939 -2497 214983 -252508 -14043 20256 221453 -199788 44920 -214087
12358 -15039 52751 -26388 -371438 -197461 -212200 55448 -60250 -41727 -51462 -147525 118586
12346 250018 -22803 -298722 -151779 -214652 266975 -130510 114950 23912 587320 174579
12335 -185527 -342834 72205 -50760 15051 -163812 -86018 -171233 -160446 153377 149547 -140580
12323 212870 -161136 -71030 -132814 -33493 -90225 -358000 59080 56385 -103776 -605632 -43930
12311 162317 213321 -120027 127777 63884 22842 -248691 -151495 -26975 9984 288250 27362
12299 146053 152207 19806 140828 193647 11465 -35938 32143 -136947 -286601 -512253 549143
12287 24343 -23424 106517 -148698 34358 171712 47224 283978 27311 -36796 -211830 -26107
12275 336616 242946 -64255 55928 -141227 -113699 -207671 1425 70197 145917 -219794 -52160
12263 -240153 53597 314810 -98589 195153 337101 25435 168835 -96613 -73085 -105117 54326
12251 133948 278465 -137301 268860 134126 187537 -45182 154583 245655 -100823 378266
12240 78003 124479 1697 100190 84698 -260332 138398 154088 -41387 -14245 -97001 -103933 157638
12227 188323 37179 124571 382769 -138847 -3303 136527 169446 -113286 128239 191784 -7040
12215 -35781 6953 83931 230136 -72199 75442 -133775 159590 -75732 176242 158079 117398
12204 117398 -24510 206348 302757 341001 275225 179217 -57538 504532 488855 -118772 18956
12192 3690 86196 243435 -217465 88150 58232 -261189 -76803 -100131 267347 118436 87179
12181 87179 36904 -189524 -19052 116675 203468 175467 231274 166996 367798 1102 39451
12170 39451 -69361 -18 -33279 118504 -112307 47353 -156424 62317 23102 182752 397983
12159 397983 102736 133110 15054 340879 -87672 111431 123496 -61749 245014 295611 154381
12148 154381 122970 339037 2420 -132630 -85163 -89254 59364 48082 -23633 -71815 -9330 322816
12135 -291304 114984 -193434 -31688 380880 199720 94624 97552 -347350 199430 157743
12125 157743 -155559 215895 390015 -321812 154624 -336053 246847 245074 83578 138229
12115 138229 42544 124568 19039 27802 -3018 66360 32935 -294869 249071 56062 -10420
12103 -187668 -151571 146156 49029 321333 -183946 -162517 93911 -77889 8504 -267173 -48639
12091 -33329 337786 -81930 -255314 -174825 -131041 116894 -220288 -73061 42749 92784 -93238
12079 -81457 -111933 -143811 -252909 57559 -6387 -161258 -26553 -135880 259139 224237 -69562
12067 -145749 -290765 84654 137296 40546 -226334 -82607 212034 122265 24631 -237213 -144912
12056 -144912 8435 -24671 18769 -68899 597742 397036 851007 825045 514782 -99006 288559
12044 -242702 -2043 56335 -297468 188532 281274 97982 152251 76299 87418 22405 151516
12033 151516 -43951 139760 14414 -187304 -175056 -27972 -273565 -143293 -99875 -108301 -120074
12022 -120074 29642 -35888 -51603 94280 251833 63541 -233939 -151390 -99168 -139726 26866
12010 48878 26776 11576 99883 -252136 -191224 -12225 318819 194532 -13935 -7303 166250
11998 -266649 148457 -347335 -45533 109948 -18461 -123044 107371 102603 62491 130452 -150686
11986 164064 -124969 -87607 39209 -77416 79352 -49123 139711 -176598 -4184 24063 127923
11975 127923 48176 -177017 175117 117560 48882 119089 -128608 12227 -266985 -47530 -111185
11964 -111185 108775 257784 57588 166961 -227838 -334709 -288171 -29494 -773 -46105 -156106
11953 -156106 -228227 533756 140216 -85704 -219361 72685 155843 -382015 107206 377436
11943 377436 -142606 -200825 154137 242249 120634 -105003 -257425 101502 233746 -321802
11932 142012 -288338 49964 -30620 -202115 -63985 -98371 -153402 284670 -151588 -141977 -17347
11920 200850 -114562 -4841 72438 -9058 95474 -7930 -75948 9825 15385 270122 -155110 85809
11907 84363 -146795 -65630 -226072 102415 -341907 76376 -286152 -282635 311349 -367938
11896 21663 -167732 -206470 118370 -295136 104702 -134925 -284785 122975 71369 -82877
11885 59775 34920 127556 -91002 -61592 -382729 -249924 -50115 -16300 67233 -32909 233090
11873 -13817 -279992 3330 -58922 -209623 -107505 -46299 -167572 -153210 122844 -238535 -320787
11862 -320787 -194263 -246219 151512 24632 154343 -185384 -67805 -195347 -128508 -189876
11852 -189876 187953 -121902 33733 -175826 6060 37711 23774 59337 157079 -8873 -253695
11841 -253695 148936 -190458 -115924 -2351 -281938 -147222 77996 153423 -125815 151136
11830 278910 19219 -44533 240 97913 52570 321346 -158256 -117518 122266 -157438 173654
11818 258708 181651 314085 -232488 -165230 -325831 -234806 -170109 34253 -188871 -213122 109399
11806 -176792 -83319 43585 84867 -330589 -339892 -59679 -278254 -1356 -138683 389119 -169712
11794 -75591 -131725 221 13691 131614 58974 -240752 -24020 -274134 37104 137076 156786
11783 156786 349034 115004 -252186 46052 180195 -403910 -16948 37285 82997 122460
11773 122460 -288122 -23356 113621 55905 -10569 -170729 -14188 -3753 -263878 -178733 70529
11761 57377 -122352 -260714 127579 -125285 163300 -23714 60697 408015 -63506 3220 93250
11750 93250 21423 -29339 -29620 -139617 19271 54556 -2918 106036 -300432 -226495 -57768 -23240
11737 -201812 54360 -155198 155164 114523 -126505 -26483 226993 286352 194332 82949 -111271
11725 4598 446755 -115978 -205757 -235107 -1168 -139267 138693 -219751 -198961 -170172 41295
11713 162657 458157 -149993 115469 -31204 -40349 129255 134988 -83437 16487 -432636 -167683
11701 173237 82050 136695 86339 85462 -26512 53330 -73446 168744 364553 -53268 124672
11689 -169449 -159892 -273442 131924 -51370 -29479 -162241 -90121 84686 60084 263898 -244872
11677 -83115 192239 49117 44605 -26800 60205 -60922 -280331 -38000 59549 75356 28040
11665 284381 129521 -3911 -110753 -165650 39368 310350 -331019 -183559 5261 223448 -123900
11653 -111192 -19156 -103004 24218 -242785 7480 -86675 -182777 136794 -4106 -55708 129293
11641 231169 149649 -138029 -35782 261456 -33869 47822 139952 66888 -27006 -10641 85828
11629 -145858 -457237 366319 101302 -64177 137825 92193 116166 -205715 -237674 -27029
11618 -64805 50841 -13097 234201 -193041 -123539 -72333 36640 -173715 -66945 -195989 112534
11606 -82697 2485 305006 152576 89821 489670 162050 44072 196565 -104485 8402 339476
11595 339476 249859 -232678 35702 -404100 5121 -189765 88297 -215868 170890 -412213
11584 157343 300229 304684 84216 -175194 -219909 56203 193997 21470 -52775 -301093 201548
11572 -77930 203529 14924 318772 -123691 -390027 117282 14320 237908 136678 11155
11561 333161 181805 -28035 158176 16612 -19472 110118 -58513 19809 110309 3767 91913
11550 91913 -10244 343110 -97767 476077 9556 188098 -25579 143227 182676 -323295 307226
11538 -267507 -95397 -15492 60499 192957 101300 -35417 104571 -85575 -193183 -173885 -247386
11527 -247386 62439 199338 430659 121387 419053 250460 -154495 160179 59326 115449
11517 115449 154270 198565 217958 -295771 290291 447657 84547 85506 68060 114433 280492
11506 280492 100612 22946 -5375 -7490 82569 91492 -345616 266283 12836 239774 156419
11495 156419 114250 280959 422204 336159 263137 42191 93587 221013 97275 32561 -110443
11483 104097 -217647 189578 59109 26813 540551 215566 116623 -8436 7982 190251 285556
11472 285556 51894 43428 36382 -115382 95106 47008 -98291 -235531 191456 -38025 511356
11460 -241142 272806 -15234 182461 47766 342499 79172 -244223 28667 180318 56670
11449 -57273 -33247 158250 154211 -16498 -36154 -22744 -83330 -20746 -14459 64889 -17363 -124305
11437 -124305 104279 38609 111763 278136 -320235 475689 -78923 -230061 85095 188681
11427 188681 31264 -101736 104107 107622 269702 -82283 -55104 78575 -31694 -71887 64791
11415 141133 125609 -91525 14585 84012 59812 121768 -246130 -166480 -127500 166884 163608
11404 163608 -65891 -5095 483399 45693 -157904 314683 178645 -146323 25970 -268740
11393 245951 -151718 -9373 130143 271925 -135134 30328 365847 -288181 -174682 199080
11382 34336 -75147 204784 191034 -281 28637 -196914 37679 58620 52091 358621 95503 -41339
11369 207349 12820 153986 -288049 -174736 283227 195916 169940 172710 103742 263245 -60443
11357 27151 -155681 125027 125655 -36083 -69420 -215558 27431 183757 -106812 -106426 195307
11345 -153425 -199226 170201 -126102 -130589 249284 42258 148661 144298 -136301 -103948 -58578
11334 -58578 -76967 71198 -111224 143176 13600 -117903 -129346 43207 -51247 -103549 31964
11322 18268 58530 -144740 54404 -52096 -136213 -132428 86210 -25661 -255760 -260076 305607
11310 -114634 92843 156340 -152004 -112129 -75317 68456 -18779 11000 43150 -215058 61885
11298 -219213 -695301 86503 172433 -76379 118553 39472 -188644 94145 -4319 -205616 153584
11286 181382 304033 -114351 -96307 -142765 94863 -130645 -214276 -311274 -185744 -52398 -62934
11275 -62934 4566 -113268 -439021 -195903 -246996 52783 -15227 164160 -226885 -139966 -124421
11264 -124421 -221557 -101396 59686 94791 -346615 136583 -61182 -38456 -185753 175863
11253 -73873 -18899 68183 -38216 -169993 -8732 -86592 73199 -164747 -202661 20417 83095
11242 83095 35057 55640 -77498 -82640 -225109 51455 56810 -371427 -52250 -193332 -77196
11230 122295 -151932 17559 -102903 -173819 -65089 29814 -265349 -377917 112535 -86828
11219 -27325 80922 -135023 -128532 103177 285910 -338681 270050 -213534 -287263 123758
11208 130740 -24773 95807 44063 -109756 205726 235994 24287 -120324 107210 -281886
11197 124869 -172617 -161816 93855 196819 -248884 -3071 -159645 -240191 266571 79599 208702
11186 208702 -183115 49204 -46540 7396 -153911 -162592 -392451 167652 -31781 -1990 74427
11174 -127629 -136261 -14325 101306 -333152 27731 206186 -215030 -241999 56034 -10343 131649
11162 -262824 -183490 -138151 208924 36084 -20777 22670 -95306 295052 198135 143645 -147057
11150 -229837 -51205 -72325 -94299 198314 -8783 75418 -223605 289198 42187 11684 68352
11139 68352 -242054 158488 204773 -173477 -275575 -25781 -121475 12453 -213955 -416026
11129 -416026 38162 -256688 -187459 206307 -31290 51299 -10082 -330004 35258 -163737 -313223
11118 -313223 94812 97458 74793 -215960 -98952 166602 52881 14407 114560 82098 -13589
11106 -130246 -172738 -135108 233625 28080 38949 -138092 -69387 345759 426569 -2351 51181
11094 244263 29586 -85502 129782 187756 -43091 72115 56410 -14253 21791 -449844 -28812
11082 -26243 393505 48267 -231174 344381 181996 492889 15693 278011 418737 169147
11071 145284 14691 -41521 151485 471539 -12343 245031 202404 -117736 61405 543716
11061 543716 273702 174858 133021 345848 189651 646790 407085 803427 133502 282372
11051 282372 -110049 191520 481919 663044 679068 483238 743242 218604 224303 334229
11041 334229 675898 571834 521649 642080 489793 707236 889394 564398 706383 683773
11031 683773 645879 723531 914726 515811 393474 258594 743145 793889 801861 380869
11020 847458 606694 471657 752333 616683 529754 560419 540278 612978 471713 415615
11010 415615 539163 681435 594833 729875 622794 553574 691445 224161 434950 460888
11000 460888 185428 322040 415596 479685 802007 286061 513057 631058 492907 611859
10990 611859 678434 583299 372974 433926 562911 407949 791721 397672 679928 722170
10980 722170 352654 661994 464132 801935 728374 804706 724035 607449 777453 1014147
10970 1014147 656786 495714 1024581 797281 1281920 963896 1266929 1528758 1709373
10961 1709373 1862493 1961787 2127857 2589054 2558733 2315589 2008628 2422823 2122986 1953166
10951 1953166 2173676 1729661 1570150 1900983 1482888 1464436 1649715 1516947 1492567 1516447
10941 1516447 1500432 1415762 1069171 1153534 1136768 587764 687395 751297 615873 605844 581700
10930 581700 218274 274991 -90135 146594 227953 -173290 246353 -106806 227955 243939
10920 243939 162678 33619 216731 -107142 15025 -188366 39347 4732 -4566 265129 261837
10909 261837 73349 185872 40195 -57454 51769 5175 32387 -177082 -148576 102994 42335
10897 -192638 92652 -214710 7554 -166788 45595 -275658 -92157 65516 -51169 87653 7215
10885 248826 -1921 -39515 -3234 35700 180592 -145339 232075 7733 290732 133611 -116395
10873 -83517 144349 -280013 -104348 -256335 6458 159717 -57080 -100675 142803 -78788 185054
10861 -107999 -94253 -97787 -33075 155434 -250696 220277 205957 211376 -63042 -90076 85596
10849 -254366 75412 183248 -57909 -156391 237173 10061 95810 65319 2315 -57417 12814
10837 -229844 83459 123027 -33197 -349780 117127 -28188 -207119 -51417 -231428 -58112 63538
10825 -331433 -222738 -209356 -220283 236938 -56881 -236139 -19509 -247370 391312 -6446 -122053
10814 -122053 -136213 -94535 -75718 -212794 -199504 -156354 -359823 -57807 -136524 -88564 -14049
10802 -105153 -22670 -162898 -254229 90606 144446 166720 100206 77254 40164 -189206 164370
10790 225840 -19112 133039 -288372 -466464 -264288 -65207 -186116 -19425 109145 -80884
10779 32280 -122993 -50507 -148149 97484 -63311 -82484 -330901 198092 -241012 -373685 -237284
10768 -237284 89671 -29243 -260512 358150 174753 -77877 -408688 -172648 29769 -250264
10757 -240954 -139189 -88010 29036 -198444 38889 -247456 -315513 -140994 114785 -10277
10746 264623 -164711 60476 -129448 -312627 -83338 -34482 16601 223371 66644 -12311 17194
10734 -99398 13461 -144171 206737 -194187 184744 66852 -280205 -90913 106300 -91728
10723 -3751 -34548 -17603 -45911 183901 129577 -169679 -246915 59837 -93829 54260 51063 32127
10711 32127 -68917 115722 -174056 -268643 -126586 155907 79157 -308393 85362 -95758 -13388
10699 -76232 -112684 27258 105511 41950 -85030 161768 -1279 51957 41037 181418 -23536
10687 255660 -122146 -178729 -60691 328506 280359 -90432 101078 -141343 -400967 -368948
10677 -368948 -232840 -209275 41803 303910 -78922 143144 -320706 28460 -319053 143355
10666 -106504 213112 -352858 -20733 -158285 -177895 83148 -102121 123088 79526 -261376
10655 8007 -118090 -236792 76896 -1742 -182146 -255758 31077 452440 80431 -227418 -43487
10643 83416 44856 -453806 206742 -62090 -182490 -11605 -30343 -215451 -119742 16815 83347
10632 83347 192525 57217 140578 -20705 -283425 129490 219730 -124103 -318680 340927
10621 -64024 62167 -11604 -4525 189410 -118192 -227924 82109 24820 -331417 -122043 -67428
10610 -67428 -75497 143444 5519 -106726 73759 -111497 35286 -365917 35571 -276602 -197151
10599 -197151 -301112 12176 -101266 -232664 -119719 -93699 -76821 -80581 46140 -92444 -256121
10588 -256121 53334 289649 -172569 221561 7013 115170 -103530 -203739 -22509 -50812
10578 -50812 118103 -138025 -20600 47830 -263717 180476 -231114 -51527 -36984 -301326
10568 -301326 -180863 -140895 12590 42144 134652 -206918 -171721 -123874 27157 -31022 64468
10556 -210104 -73864 -140049 200112 -115534 198977 -152179 -183745 -210898 -158640 3461 -118418
10544 -3350 155619 -185093 -97535 -50176 -142011 -169782 46659 -156723 -118850 -132494 -159910
10533 -159910 -9006 -14016 -142394 266153 -269576 -178457 145157 -27636 25765 -113763 -69199
10522 -69199 -54201 -253043 133374 9064 58946 -81039 -166955 104074 205478 51148 -32930
10510 -315121 -22159 -283867 168411 -82264 169771 244346 -94371 -51258 -113601 -126358 150485
10498 208248 -72756 26231 -330953 -112982 -116871 -170965 138783 -345004 -318253 50811 -10313
10486 4676 -317362 275119 -132593 262093 -127619 -175662 103933 -147976 -301426 -195815
10476 -195815 163018 115281 -119242 196724 188594 89415 322660 389749 228755 588257
10466 588257 173538 389556 77343 -82197 -177581 244099 21720 -243553 119791 -137653
10455 -16467 -45312 60754 83375 -42107 157124 -71281 188875 -3126 -91418 -95246 -18308 5306
10442 -117965 -146388 -477156 248270 206981 242774 -110102 -57437 -317562 147338 24547
10431 -141488 272739 52661 30708 -113855 -75377 148507 100662 -10933 -108020 -230816 160392
10419 -63603 -233494 -172300 114642 186750 -237804 -315667 -3512 -138083 152977 33866 -190273
10407 231516 -153398 -93129 -10785 -70769 409299 126316 55045 -152771 103772 8811 -361768
10395 -303812 -146775 -128222 -114784 -139621 64341 10643 -208727 -223187 155046 -106144 33079
10383 -97576 15553 42677 -239629 -240159 107418 183887 -10853 197980 170580 -263616 -104727
10371 120908 -7011 26681 205530 160743 -17801 155844 123710 126832 354633 238709 269389
10360 269389 129269 279944 1925 577438 519259 546911 245049 575927 151073 346950
10350 346950 381993 119327 90894 279939 98838 120566 314972 110006 -41440 424701
10339 287571 252824 56804 99133 488259 318887 562788 514085 320731 59349 189486
10329 189486 423223 99540 507421 -86342 337230 72551 158996 -44159 -202428 58338 -117772
10317 89112 -113588 69915 -2200 533759 -26633 122787 -159450 163998 -52443 227590 -103714
10305 -118360 385016 283039 152442 191920 53251 69858 76972 215691 54580 -294749 -112784
10293 -171610 98393 159736 48360 31515 -131710 108622 -149421 -50485 -43931 51359 149387
10282 149387 44807 941 -122281 -145196 293016 -337611 30227 -372003 -90103 -50715 163395
10270 289955 -112429 162269 252015 90283 -113990 -189955 -207849 33555 220696 -150603
10259 199079 -130221 -64567 419899 28570 285645 124852 -202907 124626 -64122 -26687
10248 149372 451895 169246 445474 150060 241325 148415 -231514 97045 140146 171659
10238 171659 -187913 131727 -121609 -66610 -304108 -213545 256373 -47635 275415 -196953
10227 58938 2276 -338181 81735 90084 -184008 337516 -39492 -52765 -70040 130312 158128
10216 158128 -43062 -12337 -61044 173195 48238 332566 55438 -85157 -64361 28254 65434
10205 65434 -60114 19865 -33627 -155793 44476 83639 85957 168697 -25045 144230 26021
10193 182173 7376 199434 -103040 -236926 36429 -22074 -54106 -34417 -68586 134663 -78212
10181 285963 151140 -189023 189726 84824 -204377 131383 -121852 -74365 11959 70958
10171 70958 62591 -104754 -141449 -242020 -106080 74163 -252992 70497 8660 -490162 238194
10159 -86983 -398555 1009 -223704 -8151 -270663 -184905 54838 147370 171309 -103888 -142867
10148 -142867 79540 -236774 -266619 -217934 -139879 60381 -27503 187366 -280594 -79349 -136283
10137 -136283 147008 158920 310451 -177486 -134977 75262 83284 358170 280670 -139535 -81608
10126 -81608 151895 248935 171857 -42540 -352112 -234542 -642564 -237664 -193903 124769
10115 -292702 89932 -178840 -41097 -372021 -133745 -107879 21051 -23661 -425291 94761 -402413
10103 -256277 -114090 -256113 -217052 -188623 -33659 -115300 -284195 -109538 171943 -27741
10092 -148111 72139 57911 -15981 103885 -244495 139945 96987 56445 -320291 -23294 27645
10080 186875 -20724 -176867 194091 60048 -256408 155835 174175 112612 206613 75160 -40165
10068 -268158 232016 -150516 -63347 -98247 232485 28002 -366183 67516 -231285 284215
10057 -302766 2180 85695 -12799 85825 76794 -256113 327113 -202434 -258621 60856 -5272
10045 -119129 -71945 134596 -295574 -35228 23910 -237309 164293 22034 225864 88392
10034 -73475 -86642 81632 71598 -89310 -104005 -181223 -78286 114138 52122 -158592 -395014
10023 -395014 -133738 -148958 193390 -259847 116753 -31747 35008 220533 235227 97211
10012 56916 -23803 -109423 49908 -76829 66713 101665 -52826 -92969 -28097 -186244 -211123
10001 -211123 200612 220922 -86945 122123 92768 11186 -109922 -149999 -48157 169602 6105
9989 -54047 -190178 -49845 -24744 171035 64065 -177039 -137429 -101022 -197414 -61919 -61556 -210855
9977 -210855 -476377 125779 95618 -106868 211893 375339 -87007 -155361 -78318 209180
9966 -125972 91098 241091 -184760 -152461 -81216 -172865 172557 100159 -279480 -46308 -191649
9955 -191649 -160154 2404 -214698 -54473 -66940 -66897 -526070 -108951 9215 -130087 -415657 35516
9942 -18601 127048 -30841 61823 114161 34175 -16095 -557872 -95920 -135652 -211310 226517
9930 120116 59543 4989 309006 -62896 -95632 -232723 -67374 113897 -183612 139679 -94167
9918 248544 -85317 -156852 -225224 -80188 -82546 77558 14351 -53236 -62672 123884 -41658 95321
9905 162254 -404348 20269 -95775 -307690 -112122 30214 122249 64910 -339733 107253 -280661
9893 98177 286230 -134068 -246933 -264106 143507 -383054 -20081 82792 -25721 132865 -20715
9881 -65469 84880 59681 9046 -36462 -326953 -281316 -59146 6731 -246734 112130 -306560
9869 -239125 -108604 -100657 21889 -113803 -71032 27667 -340284 -125609 -284275 -40855 -233052
9858 -233052 93992 60596 33513 96000 -189449 -37574 -51499 322253 -250033 -14639 18926
9846 39503 152917 151395 -311686 -216810 237403 -142768 118700 76541 -154232 111079 97133
9835 97133 -56180 173381 -179192 339133 -88489 -110869 -69145 61477 -101618 -436548 -387330
9824 -387330 125542 79150 -7280 -39181 -25924 93200 -52073 -218369 -145263 -82967 168208
9812 27871 -110241 269724 -162928 169312 -161614 -240322 -502358 -130086 62956 -355365
9801 242191 -142337 62687 62876 -37116 -62522 -91138 7827 -151510 -315105 -115559 -22480
9789 338066 64319 -93664 -914 119888 56859 -118616 141842 -102660 190100 -108240 -53308
9777 40827 28128 -380058 226968 -26903 -211069 -59769 -155702 100173 83580 195145 10189
9765 20627 -164427 -181787 -66379 -142166 -34834 170832 -146809 -26083 -265068 -274719 -143298
9754 -143298 -104362 -4569 -169418 -218416 -85891 60273 -56882 -154781 -91903 -37768 -202927
9743 -202927 36281 -416672 -166986 -71806 87371 51675 -492 136941 -117636 -214463 209578
9731 -134031 -407471 240048 -250624 202767 207279 -113002 -359428 -162320 -49720 124298
9720 -82062 134994 -107654 66434 -248601 -336244 -420013 -10008 34747 169051 -207361 -381702
9709 -381702 -238447 -33950 -82986 63442 84968 -314245 -187914 -396344 -127437 -187646 -285572
9698 -285572 19915 191403 -97633 119689 -228338 302122 -208424 299611 93485 -40985
9687 94130 -216752 -25225 188218 -74832 -319422 -150841 -340366 -90360 160822 -234941
9676 181818 112630 -73421 -16317 -134326 -36290 -106934 34546 -2573 -41304 -88242 119161
9664 58097 -376482 -221211 -215159 -289496 -245122 -66066 120220 -158113 -48337 85855 -10320
9652 212773 -265327 167652 -18510 85832 -235150 -80666 215484 148659 114401 -116982 -32858
9640 27619 44813 -201198 127050 25600 -19587 -290935 -150492 -195678 -70652 -74759 145861
9628 -254344 -244322 -20581 424517 300264 51439 281308 134874 181673 -85251 68938 -75192
9616 125027 244973 246697 -221365 -39245 37350 -75777 211573 72783 -83620 -285025 -32178
9604 158854 -31188 -43133 35168 -114806 -17124 -95698 -10484 142631 -48537 -313605 -8225
9592 271483 -117136 -196151 -309303 390908 -156733 -87239 -85313 -223136 208649 -482824
9581 5161 -218994 -252676 -80002 23767 -260489 104547 -223503 -36584 -123232 123614 161276
9570 161276 -221652 -57781 237745 -124363 117085 -184022 -219062 -261559 -13603 -127481
9560 -127481 -208142 105289 -144691 30220 41001 82776 103277 83709 -287238 -95723 -298156
9549 -298156 -1152 -87006 -83090 -118316 -257238 9399 -284924 -74453 49433 -162390 -161057 154679
9536 328440 -99646 -278303 33787 49953 -222073 -100204 -203709 -161955 -210799 -717307 49031
9524 -185331 -240682 913 -313147 -50060 83428 65595 149153 -139683 -270156 -345749 -97184
9512 -163843 -127549 152999 -123884 250883 -306736 -280432 -151062 -242455 222176 -43241
9501 -4711 -24449 221414 170734 -189602 -344853 62302 35186 11198 103854 -38988 -115293
9490 -115293 415253 120788 -42580 -125137 -153378 -43852 58531 -80810 -16921 129781 45868
9478 329265 67764 160026 -275167 -32408 14937 -16287 95890 -239795 -36231 -311101 -279002
9467 -279002 -2412 -239075 -61222 111007 -47397 -227896 -60157 -14835 -87265 180747 16305
9455 49763 -73519 207458 -100304 -138104 -92617 107192 -86984 -37248 -313246 -149094 -46801
9443 106394 -8018 -297656 129851 141497 -212708 125825 62321 -424524 -189621 -148437 306321
9431 -56653 70243 -65653 -91599 146498 -126289 97954 64122 -132347 -65559 29923 -204937
9419 -150138 185064 -136243 -220787 -99265 254282 -306507 -431362 64614 -201911 138722
9408 -97429 -87812 -95553 8175 -52704 -298896 395297 -53946 57436 27302 -340882 273339 -31308
9395 345342 -55143 -222630 -174291 -35192 -140349 -145667 19983 252741 151699 -30382 118215
9383 74894 -191249 -132176 -136094 -143080 -254341 4912 -34260 -227793 -197130 -40678 -270910 78062
9370 -21052 250429 -209029 -145071 -293311 -212570 -190441 23363 -33565 -316889 362586 463
9358 93402 -10531 -114828 40090 -99452 159144 -139942 -12175 -138631 -66179 142252 -144295
9346 -25113 52249 83979 81958 -246653 -80919 286845 -64457 -46593 205450 -368115 341635
9334 -255285 -226974 -51499 199537 -18869 -138410 8120 -111027 -65161 -346418 -40435 -180704
9323 -180704 184398 16001 -89766 -206034 89548 155451 83224 -31441 -217159 -90810 -156583
9312 -156583 96201 -415733 118944 -3660 -374626 -56742 -22626 78024 -43213 117236 -98600
9300 -73450 198449 -226359 -255317 -122102 58079 -121433 -216713 44469 -350756 67866 -145753
9288 -50890 34524 -345148 94634 -16828 20085 191108 -226007 34613 123756 -79240 378443
9276 -167341 48633 289495 -168134 -61774 177234 -153052 -235674 4512 -69242 -513428 -316774
9265 -316774 156838 -157538 79883 -197800 -107911 -79534 75844 276407 -265351 56412 -16380
9253 -65968 -49729 -135150 -100596 -273231 -44013 -192002 -437201 105844 -68906 -398903 -21560
9241 -43937 130450 -314414 53094 13158 50211 -384411 50397 67190 91830 -11088 44308
9229 -201792 -6487 -249555 -166474 175543 163619 70460 -212764 -92301 -198482 -73120 -238866
9218 -238866 -84207 -108310 -34978 -116188 -209805 -246817 59531 203869 -210831 156144 -63568
9206 72910 82598 -96026 95097 -156154 -182150 -344804 79792 -223970 75520 -93981 -156424
9195 -156424 -133675 14840 -113272 268203 -19700 -208399 -111656 -31858 -273491 59552 -102716
9183 -36084 -82842 -53164 -87771 -112612 7547 -199820 -16081 48857 -16705 197495 -55598 -144601
9171 -144601 47327 -194970 -98651 -26151 112914 -104978 -112358 184632 -40819 -194655 -383037
9160 -383037 -175311 66367 201315 -102003 -147077 -148639 53847 -132004 -227985 32792 -277077
9148 295945 -82462 -199645 -245886 -84563 -307931 190155 296286 193244 87332 55172 54978
9137 54978 20235 -118561 10954 -208819 -151297 -106855 3858 158510 -105351 92100 18998
9125 6566 159051 -350528 -82206 100364 333271 -11944 -39954 -24364 118822 -72610 -114062
9114 -114062 -236352 -137783 -147082 -15542 -475927 -261298 21832 -189835 134420 -168979 -66616
9102 -7756 -275378 -130467 -124099 -38055 73329 -111568 335974 -278150 354590 -112710 -415039
9091 -415039 33063 158786 90035 -162435 172054 -7974 92714 -36044 -42460 118028 61460
9080 61460 -51380 -47676 -45416 103084 85781 210083 -48619 232846 -46584 -307309 -333983
9069 -333983 -1701 61268 87883 -87434 -114763 -131527 153553 181702 -222345 -37217 -154519
9058 -154519 344099 154311 -78740 88884 15718 61856 -212038 -272615 429986 -310330 203680
9046 -238382 -134434 92580 226237 152559 -169938 -206622 -256786 -63571 131037 -99619 326763
9034 22844 136350 -181417 -12502 -61490 -367782 -236329 -84706 -321443 128236 -45595 -333569
9023 -333569 185518 -294563 -38542 -259563 110885 -179620 811 -48225 -56193 -131702 83258
9011 -120210 -77678 -116852 116748 -106910 126838 16324 -260565 -384784 275510 35779
9000 -219358 5280 31632 -417307 172832 7267 5051 -199410 26639 -99660 260529 185257
8989 185257 -93340 -79379 -159331 -83506 -292529 -84223 139474 71536 -30580 -339007 -104732
8977 -19053 -318906 16963 80861 378677 -173810 178888 -78454 -73606 -270184 -164203 38680
8965 232524 -309491 -18511 -60648 -34708 45851 -42366 236 -43586 -79639 -130292 -161909 108912
8952 -69852 -41546 200570 101944 377357 -206857 1566 101041 -223324 397800 -552870 -249095
8940 81842 35551 -329026 -196320 68400 52121 -18975 140896 49241 -85798 114128 -84411
8928 27278 -113681 -335116 194788 225672 -126737 85578 -148434 217306 7929 230187 372393
8917 372393 329702 271637 99161 295901 83271 190483 289474 876022 1636026 2548451 5478758
8906 5478758 9674151 5205743 3105669 1502222 1013916 518749 509731 -24290 166810
8896 76038 224525 193877 151991 519833 42873 148897 149535 104066 12986 -111766 -102987 211705
8883 -150184 249633 373331 70549 290 -118353 14557 142048 133093 -37507 28326 -431280
8871 238036 -141028 52046 147645 164514 52345 -287052 -256203 -278335 -134259 81563 -140819
8859 60130 -105181 -140477 233780 -111533 -215769 171505 -85737 112791 -74938 -272044
8849 -272044 98377 -88818 -95625 -204598 -169253 110463 93018 -36293 -100798 -375607 -121988
8837 56707 312369 -178730 -190037 6054 -55770 -61942 162862 -140207 -17442 -150648 136772
8825 -53492 -35427 -201579 -197574 14123 -339441 -93687 -11148 -484884 2888 -106724 -145257
8814 -145257 43970 12405 41943 43376 6990 73933 -138890 -8710 -194951 -171558 -171860 -240820
8802 -240820 -26221 -78684 60152 -130735 -42968 -112252 -136316 5076 -45377 -141060 91134 64605
8790 64605 183992 -392896 69619 -265473 158915 -220721 -248976 3845 -399080 -223436 106100
8778 -551648 50299 -28263 223467 -124188 102275 55163 -104701 -699 188747 199460 163357
8767 163357 231080 137473 -11908 -273545 -142572 -115309 -247990 266936 -188741 15374 54226
8756 54226 -271248 -72107 -71741 131358 44 -169318 241837 -218170 274738 18910 -201763
8744 -214967 -120272 -96277 144536 -148625 -52071 -331665 -27265 -295897 -123068 64514 -159638
8732 -247599 -276141 -43460 -172143 -165882 189870 -97389 -318895 -22025 -175205 174579 137585
8721 137585 20389 -95937 -205927 -74660 -53511 76509 200186 -15461 -111900 -2503 204102
8709 -250711 3183 -268055 -207484 91169 -267796 -336505 -121762 -130759 -183073 -78422 -21920
8697 -199165 -161498 187405 -142548 1786 7718 9540 -155761 118764 -177429 400903 -43544
8685 78040 195828 -17343 -199683 -308401 -8096 202054 12921 -88331 -288958 94906 -281987
8673 44753 11342 -4654 140729 -41752 428796 124026 102063 15651 -59596 276133 -260687
8661 127563 99273 -115194 219967 -138610 -85467 259039 18544 242985 133381 -148338
8650 -69111 -162387 41971 -162165 83739 50288 26476 -91176 -276475 -149706 -5668 -85596
8639 -85596 16123 -105358 12116 -153603 20763 -98592 -108432 9557 -163910 -35446 -30132 -144185
8627 -144185 -288016 456063 111071 500459 -154205 51475 -49591 -125321 43232 291881
8617 291881 66900 75850 -199019 -273049 329486 -223754 -161011 -149478 71187 -142427 -132743
8606 -132743 -160590 393870 81621 206086 276690 130544 -39216 -67157 90767 -51834 -280106
8595 -280106 151667 -174450 -153791 110433 -156258 174446 -217567 50151 -165128 90200
8584 -302189 23336 -98460 -4467 190524 -137905 28783 -194037 -28457 -13884 -128683 -69208
8573 -69208 54360 -282262 -240916 17465 -202547 -229983 53909 414276 -179935 -162836 -99447
8562 -99447 54320 -69923 -166724 -279184 -26072 -8214 -275097 -16050 -140006 19182 180434
8551 180434 95922 103352 -128171 220351 -50094 -63253 -225137 138623 51237 219830 72346
8539 17465 -273652 59614 27262 -226105 -342482 -13952 -35449 -250486 -17368 -222477 -242009
8528 -242009 -65396 216000 -26576 88948 -143533 -135480 -215716 74595 -251079 55659 -129419
8516 175699 -28799 -36478 -101688 -24626 -11961 -70494 7652 -61335 -288414 -2462 -310370 177863
8503 -144039 30902 33595 -126808 -96700 -215379 -73976 -176736 -188778 104736 80573 -28642
8491 -95552 37425 57557 -118661 -159380 49373 -6378 -231694 -88247 -239797 -141344 -43892
8479 -16488 83019 -97283 -126730 -111208 -197739 -153496 104049 110626 107118 193117 -140394 111208
8466 -352298 -201745 -56103 318281 -187555 88391 -67153 -162567 231111 -76170 262636 46123
8454 230070 61820 -12764 -432939 -401269 151195 -3918 -47193 -21207 -154623 -341299 155794
8442 254885 189141 -77218 -98565 31109 -181963 57080 -302834 -75509 -29053 180648 -130409
8430 164971 64052 -342118 120390 32309 -310216 159131 97207 -74992 176256 44987 -39657
8418 50254 99967 102654 -416356 -294301 149558 -167664 178807 262292 -278724 42585 -151498
8406 -88955 -191054 75263 -4190 148333 110886 -221537 -116669 -174096 62440 18704 -116520
8394 -129355 -473939 -357067 253975 -84762 36377 3022 13770 -470110 -27418 -201003 -138834
8383 -138834 48950 -22221 -70257 -36892 -67878 102466 -195090 -205685 -117988 -91625 -51330
8372 -51330 -293210 33940 -296935 40413 18220 126974 191844 -40407 142817 -5042 -16277
8361 -16277 -7288 33883 -38838 -315544 -147339 -48870 -201515 -274068 234504 -82773 176650
8349 -231830 265074 -158727 -86370 262567 -442236 -309355 -106796 -34355 14100 -239975
8338 88955 -62832 -79398 -266043 -119360 7346 -229143 54458 39661 124933 -179597 -61065
8326 98026 -58917 -91344 2635 -146222 -144941 -291008 -188407 -110664 122978 98853 66918
8315 66918 155739 -80809 -97316 39646 78897 -68347 -207406 -170598 -16005 -111606 -23419 139114
8302 -155775 -267164 -170670 136645 -177682 -155557 -172981 31461 -218982 608756 -101720
8291 3020 93982 -53476 209162 72547 -164196 -10329 -518430 4077 117872 78880 116574
8280 116574 -131649 -306972 9358 90254 96060 -164322 192733 -99783 -230661 9401 115549
8269 115549 -130308 152767 -265454 -100443 -4987 98022 244 89890 -121653 11386 249167
8258 249167 -119604 -291371 131836 -316849 -46293 48847 -273550 -112282 -332307 -97768
8247 -57364 -86943 100891 28279 94253 -80938 -111290 -44989 -299130 41503 173055 -439098
8235 -125111 -29077 -375065 165621 41321 -6058 -414430 175130 -120734 -127309 -73246 15620
8223 181033 95406 300843 -42183 71708 -89435 187087 -89705 87445 84058 -344830 -100046
8211 -27914 126246 158486 -50888 154074 111489 -261074 -8935 -225350 -273465 -114857 -8101
8199 -19398 -176667 77100 -164800 63304 -183434 249364 223362 -329893 207956 211504 142367
8188 142367 -249799 152268 -153327 -215059 172304 169926 4256 -90119 -21718 -99558 32859
8176 249134 -103344 101003 123547 -160505 -239545 -341898 281029 -288634 -35263 -134878
8166 -134878 80151 -53818 267346 135621 -37934 -67663 157453 -19748 96547 -178196 102231
8154 -118889 206515 53103 121510 -378645 -48894 -388347 -253041 -313912 153919 -509901
8143 -118726 224964 61097 -85959 168457 87524 4777 -423624 -47069 224556 -67493 262422
8131 -50019 79221 104902 8168 -98883 11860 -308819 -71222 -424837 -241578 -51056 105979
8119 -229786 -342799 -243873 -169891 98509 190920 -55499 120787 -415605 -265734 233459 -37670
8107 -73372 -219324 237420 156444 -125044 -208296 -70994 11800 72180 -37030 72860 34421
8095 49664 -303723 -32751 269713 -290234 -426084 -45161 115896 -146093 -153750 255780 177594
8084 177594 -85608 -4987 -280483 -60456 -105044 -341958 -78038 21422 -109137 -125904 -64280
8073 -64280 -220222 -48243 -121917 -57063 271816 -98928 -138842 -30400 -53968 -158573 -355475
8062 -355475 -58191 127807 212287 94729 -107783 -155683 74328 -209054 -37415 -278393 -58876
8050 314868 256272 -156397 -45253 334352 44105 91737 -288095 -180362 -84450 -131437 98673
8038 75869 160235 -30 169766 -76477 -53813 -49225 -271324 -71682 -7479 -212630 -175386 -250176
8026 -250176 -3016 43712 -206279 -1302 -209843 167172 -518361 124807 35891 -233028 -207819
8015 -207819 186047 249152 15701 86126 -60136 -304779 -143377 285253 -159732 -106288 10318
8003 -116440 142454 17809 71341 -177692 -304619 -390161 -36398 -97449 293967 -64200 -126042
7992 -126042 90741 -317423 -32110 -355326 77587 55122 175047 31498 -179422 -92459 137005
7980 -149976 -178139 -86735 52520 63219 179616 89181 -105220 -94965 251423 -231567 -68878
7968 -67874 -387169 167200 20409 216775 177375 30714 -35143 -7317 -82062 25358 -103838
7956 -96763 118809 -126950 -61491 -133198 -44597 -152890 -210697 54017 181807 -179119 67272
7944 -38752 191640 188883 150391 -172852 3714 14532 -211618 -231919 -71119 -243484 -212877
7933 -212877 -102411 -132788 -106403 -5966 17200 -292177 -56711 -201234 38440 34482 5975 -140826
7920 -226127 -255680 -92361 -198290 103071 -253172 314432 352770 216435 22857 17943 243613
7909 243613 196888 260300 9223 -126042 -25180 78971 114681 -68349 -54506 79182 -45115 -239794
7897 -239794 -224005 -258265 137353 -25028 -50376 -108223 -244423 -175097 -59324 -91098 77551
7885 336218 -173327 -44888 72242 57428 -161478 249 -72211 -171821 -90728 -48811 -205821
7874 -205821 -115099 -251019 203833 -291788 -2042 -185066 -269876 -12235 137834 122860 -7919
7862 -3280 -134780 149243 -382561 -290830 58116 -120925 347722 86751 -95642 -101920 18838
7850 16307 -56008 87127 3762 147370 -28264 -47090 -323426 -110061 362513 -116883 -170727
7839 -170727 76556 -153897 -295570 -14919 120019 109561 -47967 -79892 -156324 -102451 11098
7827 -15840 -39923 -90005 -197915 154202 -56885 -30504 -292807 -8384 103475 120730 165879
7816 165879 -47771 -135815 314802 -321037 100324 43482 -248044 58584 -93900 17681 92424
7805 92424 -35991 53496 -190836 3266 -263322 -53474 -56069 333587 -136025 -25887 -117557
7794 -117557 -9120 -349780 133406 -21602 135442 -210049 -258064 150075 -184564 -99141 -245395
7783 -245395 25750 -67094 -31418 210345 -300298 -115851 -20467 -41555 -24383 242289 67840
7771 -11915 -125601 110050 -96462 113301 -13442 253148 109879 -332861 89099 34766 -17842
7759 77775 -199999 95483 -141495 319988 -152298 7889 120026 -133442 179265 -169487
7748 136136 56119 17826 -22649 -51465 -37462 38613 30748 -229676 -9425 614054 -182957
7736 -40752 106713 139652 -1681 -266023 -225410 -45999 -118163 -117594 -215668 -157798 -186482 -147641
7724 -147641 151113 205360 18663 -251012 57528 12256 -407127 39717 -22953 -170216 -177203
7713 -177203 -85270 297764 -49881 58257 -158385 43751 84985 -30841 65616 -37689 82283
7701 -303182 239517 50660 -89996 -37857 -101618 104294 -115308 1049 -102767 159081 97578
7690 97578 160972 -374334 532851 -112916 -22894 -73475 -15502 -191838 138580 -3854 -102106
7679 -102106 94951 -138720 -67860 -150151 -140056 121020 248899 -5086 -131556 -271779 -87230
7667 -67492 -8203 -79372 -65697 -301527 -62570 -42984 -141581 -1892 -282381 -124484 144453
7655 218059 65130 -187008 -459560 235735 -309622 117672 110838 -12529 363049 -65995 53355
7643 232166 -285431 61951 -233896 -366749 -179012 -103461 -90317 -134825 -10041 65018 27965
7631 -21474 -127167 8592 -55911 -102571 465070 242227 78820 171872 150931 192682 -80710
7619 -5782 -124151 -8385 75204 -206547 -129406 151308 293091 -361941 54389 -131488 -325586
7608 -325586 125168 81498 -143140 -142765 237054 -231366 -84523 -192181 165684 -147466 -396753
7597 -396753 -23811 102984 128699 -345256 36226 13525 65642 -126831 58314 12312 51013
7586 51013 79805 -77594 52939 -23470 -101832 126328 -15312 -17807 53032 -258085 133855
7574 -47662 -237872 161379 -29347 94803 96218 -49123 -243152 263895 176231 4993 -105147
7562 10806 193279 -45545 115212 21594 -13245 12289 92107 -142283 -594351 119874 318343
7551 318343 -258338 -95368 -139921 53746 -28064 -144735 -243662 323003 191705 57550 -131154
7539 -112395 -25473 -25552 -349305 -45958 -162945 154130 -230050 -156036 144090 72510 114362
7528 114362 -239419 -84459 10448 -44694 -161903 -27026 -305860 6299 -52001 305426 7942
7516 161259 -2640 -105359 1420 -40862 -127567 156358 -75885 -461209 176575 -602 -166538
7505 -166538 -144581 240289 162732 78434 -149415 64997 118888 245811 -126710 235563 -26998
7493 156747 65928 112693 31734 -202104 263145 83815 -173020 -91357 -144522 -324329 70512
7481 -27039 -134204 -81526 146557 -47428 -128734 -145386 219652 153310 -144448 -341252 -95876
7469 42877 234816 -308928 -141149 -33989 -423805 289457 836 -74364 -26861 192488 183724
7458 183724 112460 157264 -169707 -2050 -304236 -21585 116050 -186850 140014 -165563 387050
7446 -126142 39582 -111045 -75600 116192 255468 -85917 301045 84818 -328833 7257 207579
7435 207579 -215108 -165402 -61787 -157575 -100998 -46663 28887 180752 85255 -192619 -155663
7424 -155663 -258830 185606 126977 -7606 114992 115630 -426566 -238309 80148 129601 -241199
7412 201948 229 111146 -75103 -477894 97090 -137971 -83250 -68580 -32421 237094 -19802
7400 -328841 35227 -127244 90808 261253 101804 9889 178325 -293045 247985 -77000 -32946
7388 -130218 -104700 1191 -108511 -332874 -329037 187261 243844 -48770 -192327 -500354 -91487
7376 327960 -136142 -61295 -11547 -66174 -38752 -88179 -21382 -257423 -169406 -1791 -93677
7365 -93677 -267208 112908 70940 178549 481875 216414 -105566 -111168 114980 152302 -153828
7353 26248 -11142 3349 -35155 -204018 -428360 279827 -128257 -7147 94549 276030 -225663
7341 -252155 -68335 -289325 -281641 63288 90765 -44434 45032 108323 -78354 -114316 111659
7329 229184 247457 108514 -442594 -193464 -270835 -97336 101883 65516 -360236 63432 93576
7318 93576 -97396 72204 -147885 7250 -128024 295494 270571 484826 -49935 -50148 -91895 336663
7305 35757 -29670 -35627 -228322 28481 -201842 -101610 -12155 145933 -75646 104384 10393
7293 -318526 224711 -103944 -65028 -217394 -353029 7424 124411 13962 178072 -15516 -160806
7282 -160806 -51369 -220585 -113860 22420 -257252 -110919 -198790 -60859 -150664 -46751 -175872
7271 -175872 -75954 54151 42210 155547 -311339 104292 141939 -161010 -182059 -232882 -138658
7260 -138658 -35361 9854 -274148 -154918 147464 23667 233704 32747 273964 204446 -292969
7248 -29693 -13561 213566 -101103 -319317 -110463 -221250 -153240 214680 34581 -286718
7237 189692 -161734 105112 3157 -71208 80022 20275 214747 399189 -95509 -293753 -238819
7226 -238819 -11462 8316 -192623 -105757 -22096 -11739 10678 68001 53848 -152096 178030
7214 -183614 41595 -126960 -53621 116932 -47148 4928 -282612 -492998 -33529 -180382 -182126
7203 -182126 139599 -118358 355820 -52586 101699 226049 58900 54294 41197 -211629 -211835
7192 -211835 -120554 -134813 -59157 -210917 -17238 78335 -103614 30766 115534 -157085 -5181
7180 -152432 -145984 26029 -78679 214179 -83934 22296 -258296 -262938 261368 -108859 42799
7168 166579 -19808 -245855 108122 -107243 -337524 119225 -31345 -99943 4062 109661 -36655
7156 -153274 278055 -319294 -211883 -170204 39422 209622 311472 -323417 -281104 84634
7145 -128576 131198 74068 54670 -55353 261854 -10529 89295 -21198 -34736 26854 73771
7134 73771 128209 227907 303142 388949 86530 -111969 173982 -141333 -78840 -38204 165487
7122 28092 97857 -268958 122156 -56348 35087 55246 -54288 -82522 -14061 7531 -31549 -145182
7110 -145182 63343 -99914 -402067 -59872 44110 -259328 -99031 -194894 -43712 105482 -279551
7098 76914 -97789 151781 126941 148707 -81837 -323886 306078 98031 -160203 -7474 -201841
7087 -201841 14372 -399991 -167679 209440 -94987 187784 -161698 52524 -13035 -23755 247257
7075 -227018 -177871 -68521 -10246 257042 167775 -86666 -81051 1365 134569 82748 -26312 -166762
7063 -166762 -162786 -23192 29969 -36756 6985 -18955 77879 -121289 -158813 -142993 57746 62217
7051 62217 30739 -308092 180880 -9227 -12622 -111674 -191200 -139202 -8159 -54811 -368082 -54952
7038 305833 8273 -65123 -133856 -354653 223027 99243 -88764 -123798 -126177 -131736 50187 -142090
7025 -143259 -100533 132816 -62276 272001 121142 109913 -69679 -61265 -263907 107261 -41706
7013 -85659 -122802 -144922 91113 -124991 -51013 107676 342135 -231674 -141237 -85394 -15158
7001 226751 -165944 13595 -203149 -88797 -69113 -62262 15258 200448 84270 -53433 -24082
6989 70301 -128234 57051 81209 -276955 223602 -201024 167461 308028 -63252 -73597 53269
6977 -142186 11153 -32178 -15907 -571099 -126324 -89060 -120723 -339043 -284398 41718 67128
6966 67128 -114359 255259 256508 135464 58249 -265214 -85715 309679 333372 -8543 -31847
6955 -31847 -66208 -31471 53189 -48929 -209873 80882 3745 -97506 257726 166991 215837 -249643
6942 -121660 108507 -331691 111794 -342720 -106822 -150941 63904 -23767 18023 158237
6932 158237 302442 -256688 15446 -148734 86170 118109 198912 -251439 -44950 84794 86459
6921 86459 184642 -132376 41353 -8509 313372 -250762 -129546 26359 23805 -186959 -66077
6909 164865 153608 150319 -318600 271422 -169085 266907 145873 63780 -108140 -277827
6899 -277827 -93125 -331937 -33949 -41835 14520 17343 286429 -196018 11207 270019 -56876
6887 60650 71583 -65429 -48383 36058 -154365 -574820 -229728 -315835 44929 -26483 14852
6875 -63483 34602 204267 106194 -311890 -167267 -202733 201493 119625 -103323 -222206 -54574
6863 201222 48046 13227 -232914 -27410 52302 -247107 -43993 6605 -292368 84947 -136937
6851 -172528 -54459 153277 -8319 -158025 119031 7199 -256491 -122775 -19026 88619 -113042
6839 -69114 -2637 -167557 289534 44701 179547 209000 -17788 20072 -446885 -173520 -420825
6828 -420825 -174424 -163718 27702 -55021 83810 253629 493476 -444783 -95231 159491 -51355
6816 218472 -209629 -32662 182387 -240965 44597 27595 -165361 31574 10413 35400 -105190
6804 -75406 -7164 -317289 -96589 -185421 -315757 19023 -103412 -86022 -25187 -226148 43314
6792 -102521 349094 228835 270379 -123146 107363 -86916 -138451 -41030 72820 143658 273139
6781 273139 90055 -89163 102405 -62581 207903 101423 -32118 -138532 -132398 20403 105418
6770 105418 -136918 -9734 316172 60356 -11833 273146 -45011 16731 -19860 29744 -118905
6758 172995 537140 -18460 -23977 -639091 -269278 -20196 -175251 -408962 -42422 46766 -18145
6746 -231240 -230093 -49137 303949 20213 -75607 -129653 139778 169887 -32912 -94644 82850
6734 318020 225256 -75386 361259 -17584 -280586 -55999 -175056 33078 46728 -149634 269090
6722 -139559 176859 81161 -174521 -14517 -102183 320908 -174148 353106 -41666 324616
6711 -36737 122963 -19277 -210036 103803 -19847 59935 24308 -2899 -162695 119266 -53437
6699 -385170 -51193 11374 -72268 40005 87376 -7228 92588 -154842 196114 -80482 5956 -24189
6686 8036 -105403 59297 195953 -419099 -136095 -273073 -80281 29882 389005 192687 -121284
6674 8653 -15155 -283444 -80324 97589 -120964 -8770 -114727 3004 143980 194329 239674 -171036
6661 -121250 -177770 93997 -27678 -331001 -4638 44741 98700 127517 -119481 -258767 -166666
6650 -166666 -130706 54966 -167486 -52074 -287819 -127540 1799 -273 160490 65189 38697
6639 38697 -221366 35472 -28251 -182637 135876 -233311 -128264 -94612 -148035 -56399 -88906
6628 -88906 55172 283323 -27854 -202833 -170226 -105407 268182 35999 -129172 53606 126356
6617 126356 161075 -350629 267226 -69878 212215 -289182 75482 106234 293340 -194490
6606 -171843 9055 -130449 44161 -159770 -269806 -319615 42056 -71338 239698 -252223 37960
6594 -102504 -13890 -523174 -3350 22611 -208432 148246 48249 -24972 8564 131064 97096
6583 97096 -28669 144570 -127757 -50621 60342 161092 39939 -386688 -50156 -83806 134909
6571 166727 -187509 -149023 -50856 -128245 -28326 40488 334680 -43827 -26868 211126 112072
6560 112072 -130565 130841 92568 47734 83562 52633 -153468 9539 320429 -56298 10873
6548 102730 -105189 88263 12396 64024 44014 -181928 -27268 336602 23961 21257 -49255
6536 -262154 -71728 -70093 185641 83583 163700 6757 -284216 -69381 1781 -332811 -158034
6524 -45267 -157462 -350692 37684 -160745 6405 -279851 -65415 279307 -17637 -70254 -107032
6513 -107032 169503 180390 126086 -134615 41272 -177340 -296921 -233747 64935 -61277 -261829
6502 -261829 418602 -120104 101934 35344 101729 41285 59459 27089 132003 -65481 -172296
6491 -172296 -71825 -53341 -77458 260288 -135009 64116 -129566 -384548 217725 -167625
6480 64426 287873 -255285 63858 -258945 -285358 -70412 2095 183483 -343005 -259888 378517
6468 -72948 163515 -35137 -2344 185968 24127 -87839 20096 58303 157056 169225 49401 -51997
6455 -18572 142327 -35760 146871 73802 183588 -10631 35886 -54779 210210 247323 -60922
6443 -54073 -157098 264348 -315772 193727 -27760 33340 -160943 246827 -53724 -113574 47111
6431 -160118 -145960 77727 -183094 231635 80961 -79318 122778 238081 -131833 171826
6420 113456 -49824 109599 378654 43310 44855 -22200 -103082 -91415 -70464 -18484 -154067
6409 -154067 216907 -83704 99943 197817 133343 -252825 -88469 -445916 -131810 146585 132598
6398 132598 205682 -232308 -157928 221143 143053 -31528 -95080 -51357 86011 40074 -88838
6386 -481389 -159037 -13255 106302 31940 -47972 -297808 -131722 -236227 228376 -108661
6375 -398662 -403936 -30628 19010 -56053 -364457 -86024 83289 354134 5888 -187216 122289
6363 46737 -135364 -37849 -227209 -30136 159064 -251635 -75492 -41965 365046 -47813 -137744
6352 -137744 115186 141280 -344997 185782 131330 32193 2317 -431196 306250 79900 -123283
6340 98378 -90776 -18126 -278197 149381 -309457 319471 -98071 27833 250028 187223 78505
6328 -75420 -8692 366945 91434 -108094 21189 -178377 131878 1028 -247173 -179496 96609
6316 -287630 -225668 257414 232791 -116007 -227460 61254 220276 -239199 -70565 235817
6305 -93771 -144218 214436 -39867 155206 19084 126586 167642 287483 -23813 -34198 56729
6293 106907 242720 -16645 -381676 148477 -123152 24667 -242875 64263 -100362 -209690
6283 -209690 -118622 210844 172563 126151 -310263 -113879 -112482 62679 234350 5028 87859
6272 87859 141149 137953 -160126 -170092 -59451 -125089 -5535 55303 -250385 226132 268117 -77531
6259 -80053 173011 -5199 -60409 5154 -20460 -51177 -67260 -47590 -349548 209537 282467 -77903
6246 224750 74757 -54148 17473 -10288 -163184 -48061 131018 -11209 -41290 -419713 -18871
6234 385873 -302530 82289 104517 226273 60021 -296107 317344 -280539 -159302 450344
6223 6123 -260 79696 316474 8628 -162153 -10918 278173 -6864 75489 -59969 -425747 124553
6210 -163567 -86311 -16838 89058 119760 -267754 452901 200378 248567 -130173 88271 36885
6198 -487117 -160422 -219627 28277 55106 -165155 -227965 150873 -307947 -368161 235739 171947
6187 171947 -193778 -118213 -164829 -132207 -49473 -68469 203224 43501 -47262 -323668 82551
6175 -38281 233441 68472 -94778 -284843 121907 -177507 109196 266633 66655 10064 54366
6164 54366 -62029 -271670 -67022 193125 273050 103312 180796 91441 -100817 481107 139681
6152 443887 -12227 195441 253661 -122415 -56036 28312 -39899 43449 -36604 174147 -59006
6140 -299916 131361 210852 -2923 -379483 -123335 -210146 -71890 -141431 -147898 203207 97202
6128 319730 -52534 264289 -18073 56232 77945 -99632 11481 -14422 67774 -164306 -172613
6117 -172613 -54401 -92356 191505 -97356 394048 -52659 54230 123556 115782 23592 -78079
6105 -141991 134323 99831 -35126 -26591 -31778 18009 93898 248805 198328 121543 -102294
6093 -157311 -66394 -314794 -195274 -102552 248441 377843 -95867 156634 -85318 68475 -41235
6081 -74581 106987 56929 139880 -51376 2250 -106951 -240434 -168382 209688 23255 -68528
6069 97707 -27229 -20270 150523 118015 71182 -199302 -15645 -57887 -135394 -105023 207857
6057 -323311 198311 48909 7762 10763 151820 -51078 -249883 35847 -96956 -6011 273696
6045 175003 191772 81917 93287 92497 154212 -63867 55705 32889 -50872 91746 -141580 -277443
6033 -277443 -242171 338498 -105966 -205614 -70366 -46090 194189 4745 213083 -227207 -27766
6021 -125012 128600 -174363 274360 -206823 -9809 8424 61002 63224 -93244 206386 -16507
6009 -177907 -80033 80357 5145 -61759 27124 -318143 -134530 -194246 185723 -152471 -182109
5998 -182109 58976 140622 -2503 -199552 81959 -130434 191818 -18610 -31942 102869 357130
5987 357130 -355610 94375 -258760 182130 268631 178778 29451 -126109 -230859 121455
5976 172879 -4430 247859 16934 -279928 -7531 -137350 158896 -172936 431253 -147070 9264
5964 222736 140139 -193427 -36118 231319 -121821 3515 -152752 -130707 -57987 417327 -12658
5952 74451 365667 131871 103501 -81108 19640 54794 -206769 -63550 137692 142717 344853
5941 344853 -3356 -3703 -167685 104073 52513 130035 -61619 -343686 -190113 -143217 95114
5929 -153102 -45480 -231051 -357629 151981 184776 -223615 154886 -180027 188380 4237
5918 -94558 -100940 -149401 -218683 290534 -78782 -199848 32128 174919 -127565 157224 110023
5907 110023 118006 71062 -123978 -34578 -49561 -95302 188535 239693 28595 -201848 -275560
5896 -275560 -140524 -165313 107661 269736 -22858 -258529 115739 423955 252850 -12788
5885 -154584 219978 154805 -323173 -69227 -199760 -264577 270901 -32657 -100511 98300 -158492
5873 83762 -19355 -139399 -146291 9822 123051 -21746 -70134 382069 121659 262704 130017
5861 -163003 -30074 250618 -155982 11573 -380161 -182795 -346280 -165678 -85221 -65524
5851 -65524 35353 20695 87955 10021 -177931 -150389 108352 -397800 -67031 221862 -52882
5839 -248679 -81439 -25777 -221100 133606 -228831 334117 95628 29198 -101525 226163
5828 183475 312739 325856 19559 172066 211007 -99456 -38592 -250099 -15271 442427 213020
5816 124886 137189 -122401 92337 5152 377656 26798 -140006 157153 40984 116515 363005
5805 363005 166129 -323289 290149 -376502 -69987 2333 -168506 -206679 -111481 7165 160804
5794 160804 8774 -108733 -134355 337765 35983 -246768 -96600 -304632 -153652 -117673 -87080
5783 -87080 -108179 -22636 219346 21156 274715 149331 -172406 -62561 64737 -8529 -120790
5772 -120790 -28294 90513 -8271 -59126 229997 51621 -66485 64480 248924 -235557 -230078
5761 -230078 367160 -93604 11216 -139107 -53058 206584 -286416 122342 58052 -296757
5750 43848 -258420 -244946 -171507 562538 17321 156686 -312467 98148 -188868 -436733 -251243
5739 -251243 101222 -6206 -9378 -36980 -324139 302082 -126678 400815 215986 14665 251025
5728 251025 49981 -337559 -14411 -178119 -30609 108554 -46308 45093 -16394 117510 -16768
5716 -85186 -182477 -203126 110589 -261263 -111308 105899 -156256 191374 -296370 -178110
5706 -178110 242882 104170 -41001 -223733 166123 -308541 225589 -173055 115920 -3861
5695 -239566 -93721 35399 101638 113651 103307 -162288 40206 -117483 -148276 31747 -173309
5683 258512 -179093 126217 -57627 44615 290195 107591 -243621 26466 -164515 88989
5672 19243 58490 -61344 -118951 96466 -96879 243625 185638 -350976 -149844 -291390 347606
5660 -110991 -114408 -158826 -180975 259507 -99355 197602 -52361 -113201 63244 -220433 150068
5648 -101174 -243723 139788 153287 25730 16823 -126884 -30956 46023 76858 517112 -42163
5636 -24432 200942 -319125 -183965 -133376 109502 -213652 96280 -119687 68423 81246 -88378
5624 4367 115262 82536 -18273 -8163 69106 -185154 79268 -150776 192662 3966 -312771
5612 37891 -211460 55716 52193 -87337 168549 -193726 291560 217207 -6629 273829 278673
5601 278673 252875 -94170 5647 211433 209408 -157015 101962 301988 -332620 239386 346665
5590 346665 -9882 -75737 -207315 87698 311051 282964 157388 125193 36218 71718 261877
5579 261877 -172773 -11150 -84942 148985 -52335 9994 302494 -288331 183870 102516 196323
5568 196323 -16247 -129024 -205719 219950 -113634 -158006 -27669 -255677 -422502 -64497 -77198
5557 -77198 -142244 123035 275118 85398 -233762 -91349 -8122 40851 -138471 85288 126329
5546 126329 113003 -34326 -85083 253767 -423374 120497 209996 -20838 -41726 -20548 -358288
5535 -358288 25421 -247166 34339 54744 92010 -230493 145432 274691 139179 -27739 243597
5523 -67831 -134402 76364 -83260 49340 15552 308156 126073 166478 -7168 251217 -82258
5511 -180560 38967 -37388 307943 -95208 -216162 -13639 -225086 205581 119183 150577 -157348
5499 -284217 70959 216116 -51098 156448 -214049 -3381 -151874 -122962 113004 267003 17686
5487 -56202 112241 -238943 -35925 263025 174081 169116 44941 256127 12479 -13538 263202
5475 -92973 -119057 -182904 82627 68532 57685 6931 -151308 27754 50907 33132 -163064 -77752
5462 -69796 -5078 6674 -6162 -12758 -233063 -107273 79750 -71752 53675 128014 87496 -175493
5449 -368053 27792 89483 220867 -30401 145969 13690 -298374 48608 -64062 -13972 -135276
5438 -135276 35828 -273918 -198721 -211545 -3084 -37539 62073 -154401 82903 -275491 -213227
5427 -213227 178033 107590 -189517 -135049 86448 -161014 154294 150166 111074 -78749 50608
5415 80888 18216 -189749 65308 -14502 -6277 56929 207928 175037 412338 -282331 127061
5403 -149880 -199983 165360 -220422 180282 156187 -162701 97281 -80678 50229 62523 -69425
5391 272989 -88049 -193513 241471 -265881 65598 -118548 275569 157332 382832 -145683
5380 -208496 211188 -191272 -56611 -41593 -71929 -47508 19915 141136 163617 231541 -58562
5368 112836 437428 281691 -143326 133196 -18965 318417 82345 326208 -166033 -22579
5357 -266769 21814 200169 -103908 -64876 -118702 -154278 13579 -250458 4415 84801 -66134
5345 -34313 82959 51180 214277 207141 109842 134493 40994 185389 -167068 198521 223985
5334 223985 91772 -34951 -126438 340055 42645 -203569 -23862 178806 -25690 -383719 60515
5322 232780 -53795 211319 -272983 -80998 -369 104031 -50480 -33087 -216948 -154850 108942
5310 234509 -27803 151392 -75559 315581 -163558 -4784 -174508 101255 -260050 -25631 -62554
5299 -62554 60472 178731 -296662 40766 232469 -216846 324215 109393 98879 -138566
5288 -309636 75545 223618 -104129 -175357 -48846 38375 -103951 -32681 13556 26536 81079
5277 81079 156969 230724 -103564 164123 -125948 464755 3274 139486 198316 -48997 178359
5265 -416209 -11264 -7878 -84290 -55807 82829 231800 -129594 -80619 233251 -153886 -164195
5254 -164195 -136756 -171994 -214861 -84636 -50178 -213293 12742 300754 168338 34724 99498
5243 99498 -145479 -69722 -150793 -108080 137057 -183958 -13100 222712 240364 208967 -97840
5231 241624 -104416 -94664 295208 81262 114140 -369515 -151172 -194910 -100321 -109623 -270702
5220 -270702 119429 -61886 122208 -65741 -89044 117278 -49820 160819 54900 -132743 11730
5208 44559 133053 214674 372493 -173783 29384 127440 -51956 83333 -288274 71950 -82792
5196 -5865 -163768 -260527 -157251 -106535 267085 30415 173396 391607 -24631 -10923 -156512
5185 -156512 -134722 161187 -92024 49141 55233 147241 -355104 -338967 320638 70299 -86605
5173 24962 192182 382637 138497 -88793 87121 -122817 -158414 128598 -394139 -393589 43135
5161 82424 111170 23819 -1498 -341270 -16478 220969 -98525 -173676 13585 6902 -616490 -90199
5148 4955 332925 -17784 -19372 -332574 198067 -113679 263011 36860 166564 -9036 96692
5136 231291 -90492 -410869 -47932 -220034 67951 72074 40078 121175 79503 -85750 269677
5124 199741 18160 -38799 128526 -11237 -171150 201521 45610 -107022 -201016 11666 -150780
5112 62401 62670 17066 100155 97389 315866 451586 -23033 329945 269926 -176973 29440 250556
5100 250556 -40449 96963 354535 -153509 175643 37571 17121 -41492 210324 5339 -127441
5088 327220 267125 -97977 48726 -44594 -278863 101838 7051 65316 -322361 -84892 49080
5076 109211 -162272 54389 151765 -111325 -220291 115719 -199238 -13191 -160708 170071
5065 -271405 -81316 141128 32979 86070 -148388 -45309 -6027 -249885 185422 -76372 145254
5053 133687 200389 57427 -131019 -78141 28714 -191379 27814 -105426 -67002 227022 -9933
5041 -59457 128185 -78471 -265473 -206933 354391 -183214 -183804 -205021 -71763 128153 -134110
5029 52453 129952 -477072 158188 112186 169702 61532 249087 7859 3375 -240487 247517
5017 177301 125978 -97703 -107787 -101851 85456 141784 34695 79212 7058 -62941 58427 -144506
5004 -78859 -108558 -178519 -175572 -147865 284485 54585 17867 -117329 72808 -37184 -95194 33567
4991 6046 -100120 406101 -35936 -174869 326226 148304 -202601 -222898 -237847 38158 32839
4980 32839 40380 -276162 -35036 -258384 -134629 204210 -50080 127961 3909 9752 -330525
4968 103674 146694 53034 -205687 -226665 -459533 -177965 -133559 -187199 110998 -46730 137708
4956 -199463 24923 -193600 201267 -48299 -28577 132990 337143 410095 260720 251041 -134657
4944 -450133 -66190 -234255 163170 180356 -157697 83162 5137 174334 -420363 46837 1673
4932 23049 4053 120415 88321 73326 47067 58193 -226369 32683 273819 174964 -202041
4920 30475 -183110 93537 -233189 -86398 150822 96685 259373 155731 145932 138764 162259
4909 162259 40648 -108283 -275381 25309 -71634 88946 -106954 -31790 -60801 239600 52661
4897 -243120 -159004 -39091 -214038 102076 137788 153776 -42435 24157 -51287 -127224 16186
4885 292383 -131389 239086 -19630 -81354 332808 257997 133692 -202723 -216904 -41479 -42837
4874 -42837 80595 102961 217088 -163381 143687 3896 -209954 145637 -224212 221100 -208052
4862 -124177 -253610 111186 296236 181937 31942 76730 100452 198955 172373 160333 -41663
4850 124727 -89359 -149105 62569 58019 248859 139234 -3065 341254 76881 426681 -85617
4838 -3343 209494 -844 -84976 67293 105528 -207217 -32998 169265 -110023 -177182 355467
4826 112198 -91895 99089 236582 100342 -8841 -62757 65882 -423465 64878 -17858 32067
4814 31694 -78299 128486 12245 -276646 81450 8541 -134230 -130559 179795 -222743 -194715
4803 -194715 -23585 -124452 -138983 79491 -43580 -178838 287733 204205 173818 384913 -211521
4791 -97950 -4595 -196665 -114770 -49215 -111712 163798 -187794 4764 -8150 180137 -36772 139959
4778 381636 17506 -108500 -110071 143586 141787 -19503 -34014 117875 419444 137150 63593
4766 81522 246069 19229 -66356 -3451 -73169 -67040 69193 -81041 80058 22272 239941 52947
4753 159910 -73138 -362934 -10085 100854 42880 207831 57272 -228166 50947 88625 -41536
4741 -286797 46133 61862 305220 -140041 -172099 -108907 115262 280009 -71836 309958 107684
4729 11450 -97188 93341 140780 299419 -136156 189293 68645 -72734 -13296 -91245 197753
4717 -13838 119596 -71339 73816 -273145 161204 57018 -22086 65470 -241519 21065 22321
4706 22321 390087 295290 -111807 50849 -113253 -129537 14500 111819 66031 -347749 131361
4694 192901 186344 143986 -275108 -16257 -118455 334245 -63293 420275 88004 -8490 -7058
4683 -7058 138364 -188288 57832 -275219 137710 -95334 281949 29717 20673 254827 -147815
4671 134831 172653 -44021 48751 -30256 61141 208821 -217783 -66597 -218983 -59897 104455
4659 -262958 -263620 -20908 -245331 -42213 -141912 -269385 -68680 137519 148204 175492 295573
4648 295573 -386290 -52315 13399 -28021 -110990 182566 87261 -98841 84787 94155 270886
4637 270886 -191655 -67114 337477 -82426 -48405 39814 -262477 15105 -30472 125699 257076
4626 257076 3775 47910 142682 -171524 353744 -15189 51773 152241 -118505 48032 -262507
4614 -83139 -50103 98583 -113682 -80501 -151010 90789 -168651 -19171 223702 110243 -48431
4602 -64676 128002 -18012 -232862 -108073 105606 104377 259097 -7557 -216412 -159683 -202582
4591 -202582 261124 184681 129546 82369 -78816 133777 -136228 182012 -46346 127642 -275366
4579 -29639 -36276 -93786 -122495 -270015 230793 -162682 -456306 173942 92547 11158 -169275
4567 -79505 -25142 -80491 211236 -121930 273101 47113 7813 2275 224207 30163 394162
4556 394162 -424972 94000 77770 139070 -87728 202738 -146435 33306 -22988 -74534 89958
4544 -262900 -58581 -50513 -93757 320137 -92601 -157742 32738 -256464 -198628 181123 -393072
4532 -161999 212453 172917 62640 -217538 112686 -117394 131068 176640 328869 -255366
4521 359114 67980 -151900 24842 65681 246203 -58785 55784 9100 -52778 91328 -68941
4509 80075 -101161 -257328 -23360 30339 38614 -83411 333879 -13453 201315 89529 340731
4498 340731 187813 10924 83997 -8073 117334 -265288 135327 -39361 10904 37495 221697
4487 221697 -43342 163918 162045 -59415 34758 289966 167300 -103954 236793 -133838 164836
4475 119052 -143164 -27391 -2756 202138 224688 -47587 -193645 -165079 126064 -169016 -47532
$$ [...]
##END NTUPLES=NMR SPECTRUM
##END=
